##TITLE=1H_bzl
 200.13MHz,CDCl3,
 8 sc
 
 27.6.2025
##JCAMPDX= 6.0         $$ Bruker NMR JCAMP-DX V2.0
##DATA TYPE= NMR FID
##DATA CLASS= NTUPLES
##ORIGIN= UXNMR, Bruker Analytische Messtechnik GmbH
##OWNER= pz
$$ XWIN-NMR		Version 3.5
$$ Fri Jun 27 16:35:12 2025 Russian Standard Time (UT+4h)  she@DPX200
##.OBSERVE FREQUENCY= 200.1313
##.OBSERVE NUCLEUS= ^1H
##.DELAY= (6, 6)
##.ACQUISITION MODE= SIMULTANEOUS
##.ACQUISITION SCHEME= undefined
##.AVERAGES= 8
##.DIGITISER RES= 18
##SPECTROMETER/DATA SYSTEM= spect
##.PULSE SEQUENCE= zg30
##.SOLVENT NAME= CDCl3
##.SHIFT REFERENCE= (INTERNAL, CDCl3, 0, 14.3821)
##AUDIT TRAIL= $$ (NUMBER, WHEN, WHO, WHERE, WHAT)
$$ ##TITLE= Audit trail, XWIN-NMR		Version 3.5
$$ ##JCAMPDX= 5.01
$$ ##ORIGIN= Bruker BioSpin GmbH
$$ ##OWNER= she
$$ F:/spectra/data/she/nmr/H-C/1/audita.txt
$$ ##AUDIT TRAIL=  $$ (NUMBER, WHEN, WHO, WHERE, WHAT)
(   1,<2025-06-27 16:33:59.96 +0400>,<she>,<DPX200>,
      <created by zg, POWCHK disabled, PULCHK disabled
       configuration hash MD5:
       00 E9 B6 7A A2 85 ED C7 34 08 36 98 17 FE 4E 26
       data hash MD5: 16K
       B1 A7 F6 E3 7A B5 66 6A 8B 3D 1D BF 78 57 DE 5E>)
$$ ##END=
$$ 
$$ hash MD5
$$ 3E 51 6C D4 2A 1E 77 93 9F 9D D2 E7 40 95 51 C2
##$RELAX= 
##$RELAX= 
##$RELAX= 
##$RELAX= 
##$RELAX= 
##$RELAX= 
$$ Bruker specific parameters
$$ --------------------------
##$DU= <F:/spectra>
##$EXPNO= 1
##$NAME= <H-C>
##$PROCNO= 1
##$TYPE= <nmr>
##$USER= <she>
##$AMP= (0..31)
100 100 100 100 100 100 100 100 100 100 100 100 100 100 100 100 100 100 
100 100 100 100 100 100 100 100 100 100 100 100 100 100 
##$AQSEQ= 0
##$AQ_mod= 1
##$AUNM= <au_zg>
##$AUTOPOS= <>
##$BF1= 200.13
##$BF2= 200.13
##$BF3= 200.13
##$BF4= 200.13
##$BF5= 200.13
##$BF6= 200.13
##$BF7= 200.13
##$BF8= 200.13
##$BYTORDA= 1
##$CFDGTYP= 0
##$CFRGTYP= 5
##$CHEMSTR= <none>
##$CNST= (0..31)
1 1 145 1 1 1 1 1 1 1 1 1 1 1 1 1 1 1 1 1 1 1 1 1 1 1 1 1 1 1 1 1 
##$CPDPRG= <>
##$CPDPRG1= <>
##$CPDPRG2= <>
##$CPDPRG3= <>
##$CPDPRG4= <mlev>
##$CPDPRG5= <mlev>
##$CPDPRG6= <mlev>
##$CPDPRG7= <mlev>
##$CPDPRG8= <mlev>
##$CPDPRGB= <>
##$CPDPRGT= <>
##$D= (0..31)
0 0.7 0 0 0 0 0 0 0 0 0 0.03 0 0 0 0 0 0 0 0 0 0 0 0 0 0 0 0 0 0 0 0 
##$DATE= 1751027639
##$DBL= (0..7)
120 120 120 120 120 120 120 120 
##$DBP= (0..7)
150 150 150 150 150 150 150 150 
##$DBP07= 0
##$DBPNAM0= <>
##$DBPNAM1= <>
##$DBPNAM2= <>
##$DBPNAM3= <>
##$DBPNAM4= <>
##$DBPNAM5= <>
##$DBPNAM6= <>
##$DBPNAM7= <>
##$DBPOAL= (0..7)
0.5 0.5 0.5 0.5 0.5 0.5 0.5 0.5 
##$DBPOFFS= (0..7)
0 0 0 0 0 0 0 0 
##$DE= 6
##$DECBNUC= <off>
##$DECIM= 32
##$DECNUC= <off>
##$DECSTAT= 4
##$DIGMOD= 1
##$DIGTYP= 9
##$DL= (0..7)
0 120 120 120 120 120 120 120 
##$DP= (0..7)
150 150 150 150 150 150 150 150 
##$DP07= 0
##$DPNAME0= <>
##$DPNAME1= <>
##$DPNAME2= <>
##$DPNAME3= <>
##$DPNAME4= <>
##$DPNAME5= <>
##$DPNAME6= <>
##$DPNAME7= <>
##$DPOAL= (0..7)
0.5 0.5 0.5 0.5 0.5 0.5 0.5 0.5 
##$DPOFFS= (0..7)
0 0 0 0 0 0 0 0 
##$DQDMODE= 0
##$DR= 18
##$DS= 0
##$DSLIST= <SSSSSSSSSSSSSSS>
##$DSPFIRM= 0
$$ [...]
##$SUBNAM0= <"">
##$SUBNAM1= <"">
##$SUBNAM2= <"">
##$SUBNAM3= <"">
##$SUBNAM4= <"">
##$SUBNAM5= <"">
##$SUBNAM6= <"">
##$SUBNAM7= <"">
##$SUBNAM8= <"">
##$SUBNAM9= <"">
##$SW= 18.0517328524113
##$SWIBOX= (0..15)
0 0 2 0 0 0 0 0 0 0 0 0 0 0 0 0 
##$SW_h= 3612.71676300578
##$TD= 16384
##$TD0= 1
##$TE= 0
##$TE2= 300
##$TE3= 300
##$TEG= 300
##$TL= (0..7)
0 120 120 120 120 120 120 120 
##$TP= (0..7)
150 150 150 150 150 150 150 150 
##$TP07= 0
##$TPNAME0= <>
##$TPNAME1= <>
##$TPNAME2= <>
##$TPNAME3= <>
##$TPNAME4= <>
##$TPNAME5= <>
##$TPNAME6= <>
##$TPNAME7= <>
##$TPOAL= (0..7)
0.5 0.5 0.5 0.5 0.5 0.5 0.5 0.5 
##$TPOFFS= (0..7)
0 0 0 0 0 0 0 0 
##$TUNHIN= 0
##$TUNHOUT= 0
##$TUNXOUT= 0
##$USERA1= <user>
##$USERA2= <user>
##$USERA3= <user>
##$USERA4= <user>
##$USERA5= <user>
##$V9= 5
##$VALIST= <valist>
##$VCLIST= <CCCCCCCCCCCCCCC>
##$VD= 0
##$VDLIST= <DDDDDDDDDDDDDDD>
##$VPLIST= <PPPPPPPPPPPPPPP>
##$VTLIST= <TTTTTTTTTTTTTTT>
##$WBST= 1024
##$WBSW= 4
##$XGAIN= (0..3)
0 0 0 0 
##$XL= 0
##$YL= 0
##$YMAX_a= 168987
##$YMIN_a= -182408
##$ZGOPTNS= <>
##$ZL1= 120
##$ZL2= 120
##$ZL3= 120
##$ZL4= 120
##$ABSF1= 10
##$ABSF2= 0
##$ABSG= 5
##$ABSL= 3
##$ALPHA= 0
##$AQORDER= 0
##$ASSFAC= 0
##$ASSFACI= 0
##$ASSFACX= 0
##$ASSWID= 0
##$AUNMP= <proc_1d>
##$AZFE= 0.1
##$AZFW= 0.1
##$BCFW= 1
##$BC_mod= 2
##$BYTORDP= 1
##$COROFFS= 0
##$CY= -3
##$DATMOD= 1
##$DC= 2
##$DFILT= <>
##$DTYPP= 0
##$F1P= 0
##$F2P= 0
##$FCOR= 0.5
##$FTSIZE= 0
##$FT_mod= 4
##$GAMMA= 1
##$GB= 0.15
##$INTBC= 1
##$INTSCL= 1
##$ISEN= 128
##$LB= 0.25
##$LEV0= 0
##$LPBIN= 0
##$MAXI= 10000
##$MC2= 0
##$MEAN= 0
##$ME_mod= 0
##$MI= 1.114404
##$NCOEF= 0
##$NC_proc= 0
##$NLEV= 6
##$NOISF1= 3.799351
##$NOISF2= 2.8
##$NSP= 1
##$NTH_PI= 0
##$NZP= 0
##$OFFSET= 14.38212
##$PC= 1
##$PHC0= -1199.56
##$PHC1= 10.39222
##$PH_mod= 1
##$PKNL= yes
##$PPARMOD= 0
##$PSCAL= 0
##$PSIGN= 0
##$REVERSE= no
##$SF= 200.129724274929
##$SI= 16384
##$SIGF1= 3
##$SIGF2= 2
##$SINO= 400
##$SIOLD= 16384
##$SREGLST= <1H.CDCl3>
##$SSB= 0
##$STSI= 0
##$STSR= 0
##$SW_p= 3205.1282051282
##$SYMM= 0
##$S_DEV= 0
##$TDeff= 0
##$TDoff= 0
##$TI= <>
##$TILT= no
##$TM1= 0
##$TM2= 0
##$TOPLEV= 0
##$USERP1= <user>
##$USERP2= <user>
##$USERP3= <user>
##$USERP4= <user>
##$USERP5= <user>
##$WDW= 1
##$XDIM= 8192
##$YMAX_p= 0
##$YMIN_p= 0
$$ End of Bruker specific parameters
$$ ---------------------------------
##NTUPLES= NMR FID
##VAR_NAME=  TIME,          FID/REAL,        FID/IMAG
##SYMBOL=    X,             R,               I
##VAR_TYPE=  INDEPENDENT,   DEPENDENT,       DEPENDENT
##VAR_FORM=  AFFN,          ASDF,            ASDF
##VAR_DIM=   8192,          8192,            8192
##UNITS=     SECONDS,       ARBITRARY UNITS, ARBITRARY UNITS
##FACTOR=    0.0002768,     1,               1
##FIRST=     0,             0,               0
##LAST=      2.2672688,     0,               0
##MIN=       0,             -182408,         0
##MAX=       2.2672688,     168987,          0
$$ Real data points
##PAGE= N=1
##DATA TABLE= (X++(R..R)), XYDATA
0 0 0 0 0 0 0 0 0 0 0 0 0 0 0 0 0 0 8 -8 8 -8 8 -8 16 -16 16 -22 24 -28 32 -37 40 -48 53 -61 69 -77 85 -97
38 -97 108 -119 134 -149 165 -183 202 -221 243 -269 297 -327 361 -398 439 -484 535 -595 659 -739
58 -739 829 -936 1066 -1231 1444 -1725 2124 -2726 3744 -5772 11393 -62901 -182408 -11370
72 -11370 134998 88010 -33682 -45403 15031 26888 25430 63998 18750 -74369 -60075 31953
84 31953 56869 -18913 -82648 -30799 15224 -10939 -4508 24621 -2309 -26113 2080 52262
96 52262 42497 -12196 -1358 34332 -4738 -21679 29543 28397 -45358 -72703 6698 58242 -28144
109 -28144 -87263 -688 61094 3401 -49240 -3829 66347 35550 -31422 -1592 43506 11454
121 11454 -11644 11975 12218 -34541 -46678 19637 40960 -40808 -71145 -1547 40729 11791
133 11791 -22230 -9675 16901 13494 17580 31754 2235 -21116 13173 34037 -2743 -40395
145 -40395 -13481 31681 -3830 -60462 -25624 34951 17120 -33422 -25762 21724 24741 -2839
157 -2839 14839 30758 -8796 -24428 24170 49119 -1685 -51721 -21764 26701 8192 -27295
169 -27295 -17533 -1941 -13214 -15974 13832 30772 -2050 -26741 4001 33698 21796 4446
181 4446 1375 -8948 -17844 7075 34959 1551 -55412 -40502 24066 34625 -14409 -37324 -8267
194 -8267 15282 14148 15252 13258 -6946 -14848 16106 40105 8040 -33561 -18870 18945 12805
207 12805 -21464 -23574 723 -49 -15985 -3609 12865 797 -8486 7484 20780 8391 -3163
220 -3163 10379 16002 -4479 -9284 7328 6630 -14803 -23213 -3321 9657 -11251 -22571 -1822
233 -1822 10411 2740 -1030 6378 11618 4504 6066 20780 10350 -13483 -4199 14072 5479 -17565
247 -17565 -21706 -1879 2443 -15111 -12640 838 -1859 -3491 3274 11244 11198 1526 6599 19435
261 19435 7188 -3175 5826 7377 -3607 -15466 -10106 5139 -6698 -23269 -10304 967 -1892
274 -1892 -2016 156 4935 5345 4767 17757 16152 -2320 876 11910 9556 -1693 -13159 -8090 1464
289 1464 -9936 -14995 -6081 -7555 -7757 -3537 1597 7130 1063 1266 16538 12645 2246 8760 10178
304 10178 4591 -1931 -5514 1939 -2554 -16652 -10675 -4551 -8393 -6682 -6740 -3216 3643 313 6218
319 6218 13428 4332 4168 11633 10722 7013 -2257 -3539 4695 -3855 -11710 -5487 -7869 -10529 -7193 -6100
335 -6100 -1589 -1472 -3406 7277 8853 3043 8598 9437 7676 6793 1256 3035 4094 -6213 -7653
350 -7653 -3257 -7249 -8000 -8841 -7639 -1161 -3716 -2788 5632 2566 3216 10540 8785 6521 3854 2283
366 2283 7656 3247 -5520 -3748 -5288 -6192 -3750 -7496 -7590 -5105 -5953 733 4766 510 1674 5188
382 5188 7178 9245 4594 3343 5573 -6 -1986 607 -3168 -5172 -6159 -8542 -4930 -3674 -3500 -416
398 -416 -1771 -1399 4123 5538 7205 6875 1920 2340 4689 3719 3378 -1221 -7451 -6479 -3106 -764 -2600
415 -2600 -8998 -7886 -1179 1610 4215 4179 448 435 3767 9201 10093 2361 -4767 -2960 2404 4201
431 4201 -2101 -10013 -9159 -3345 -795 -1159 -2485 -2972 -1425 1703 5929 7254 3859 1515 2110 4612
447 4612 5256 725 -3383 -2839 -1262 -3771 -7680 -5397 152 -977 -5583 -5094 1179 8007 6221 1005
463 1005 273 4157 7296 6728 3040 160 -3782 -6662 -1134 3892 -1797 -11242 -13094 -3396 7687
478 7687 4371 -4904 -6125 1577 10259 10615 4061 2128 1159 -333 3943 6518 1096 -8092 -13246 -4893
494 -4893 5358 -658 -9919 -10518 -2826 6849 4463 -2076 2512 7194 4759 3516 4548 7661 4817
509 4817 -4288 -4485 852 -1242 -4329 -7336 -6971 -2974 -6437 -6552 3318 5841 -708 -4408 734 13840
525 13840 14952 818 -4473 1543 6988 7530 -1379 -8348 -5768 -6499 -5160 -41 -1997 -6425 -10305
540 -10305 -5816 9771 12314 -745 -4882 2057 12130 14254 1917 -3618 1470 940 -617 -1398
554 -1398 -4066 -4917 -9838 -10000 1264 2691 -5532 -5700 -676 7376 8531 305 2189 9421 6703 2590
570 2590 -810 549 5713 -922 -9633 -6582 -3539 -2338 -2649 -7312 -4894 -1383 -1632 3708 6745 3725
586 3725 876 -324 6220 14122 5178 -6654 -4823 1114 5210 -783 -10339 -7840 -3555 -4200 -723
601 -723 -475 -2250 -2345 -2525 4695 11861 4884 -1203 942 4945 7973 2925 -4305 -2623 -2292 -2922 -1912
618 -1912 -5147 -5455 -3070 -4002 -1658 1831 1055 1787 1668 2590 6589 4512 1328 3337 2879 542 -1667
635 -1667 -3786 -353 233 -6344 -7726 -3220 527 872 -3181 -2785 2302 2804 3647 5426 2848 807
651 807 1671 2741 3843 224 -4435 -3957 -1693 -1770 -1881 -4360 -4442 -1836 -743 1870 1922 249 2026 4177
669 4177 3174 3367 2543 1961 636 -1418 -657 0 -3457 -4649 -2801 -1854 -2342 -3092 -1616 1217 1454
686 1454 1129 2504 3306 3661 3029 2375 2406 462 -843 -237 -347 -3175 -4992 -3262 -1117 -1987 -3005 -1774
704 -1774 176 1066 2520 3288 2590 1595 3103 4713 3087 -118 -638 -520 -1078 -2600 -3802 -3165 -3254 -3687
722 -3687 -2344 -766 -329 114 1319 3286 4067 2475 3492 4062 2178 885 831 292 -1086 -3932 -3502
739 -3502 -2259 -4016 -4290 -2397 -1990 -826 426 951 3273 3006 2525 4791 4446 2455 2178 827 978
756 978 -444 -3616 -2709 -2678 -5491 -3778 -2954 -2907 -1735 -1171 434 3072 2288 3174 5077 3133 3622 3734
774 3734 1933 1560 -869 -2753 -1019 -2926 -5146 -3555 -4175 -3143 -1967 -2309 610 1616 719 4111
790 4111 4889 2847 4206 3545 3091 3024 -589 -1022 -389 -4071 -3496 -3285 -5002 -3588 -3257 -3038 448 -308
808 -308 97 3775 3266 3402 4553 3167 4089 2784 -213 1480 -515 -3460 -2400 -3772 -4392 -3043 -4195
825 -4195 -2917 -914 -2416 912 3055 1440 3259 3413 3338 4919 2314 1037 2335 -965 -1847 -1207
841 -1207 -3348 -3371 -4028 -4617 -1570 -1960 -2757 868 644 1069 3401 3254 3808 3643 1296 2959 3125 -292
859 -292 -65 -1418 -3259 -2410 -3540 -3487 -1826 -3594 -2495 429 212 1165 2355 2064 3718 2875 2142 4352
877 4352 1815 -397 -354 -1018 -1355 -1292 -3618 -3476 -2993 -3065 -326 -105 -1177 369 1256 2801 3927 1742
895 1742 2192 2720 627 1173 1753 -568 -2210 -3556 -2211 -396 -2848 -4006 -1081 -731 -390 815 1302
912 1302 2634 2084 1108 3065 3374 1615 220 -460 -391 -848 -2312 -2206 -1956 -2823 -2495 -1486 -876 391
930 391 875 845 643 1420 3921 3957 965 127 1357 1217 -121 -1717 -1791 -2142 -3326 -3108 -296 296 -3091
949 -3091 -3399 426 4345 2850 -54 969 3251 3435 1463 988 1039 -973 -2380 -1770 -852 -1685 -3949
966 -3949 -3934 -1908 -343 74 245 -107 1315 3202 3154 2058 1890 2351 2389 103 -1325 1011 -36 -3513
984 -3513 -4539 -2815 -608 -1901 -4345 -1045 2162 -279 -561 2975 5378 3213 -243 1281 5446
999 5446 2907 -1463 -2145 -1436 -773 -2127 -3903 -2321 -2754 -4126 -1415 426 475 848 501 1897 4420
1016 4420 3672 3265 1887 -330 2283 2335 -1609 -3034 -2764 -1707 -2478 -5193 -2840 217 -2210 -2916 931
1033 931 3193 3086 527 1170 6102 4005 -135 1482 2536 453 -2470 -3867 -593 -756 -4972 -4229
1049 -4229 -1712 -1933 -860 -192 453 2095 1058 2418 4773 2797 2059 2660 229 692 455 -1257 -1653
1066 -1653 -4573 -4023 -113 -2171 -4596 -2261 -470 1118 558 29 4087 3747 164 2806 4650 2714
1082 2714 -104 -1407 858 992 -4142 -3895 -1125 -2796 -3003 -2496 -1157 1054 -739 -192 3494 2526
1098 2526 1246 3339 2616 2147 686 -70 1356 -1132 -3151 -1163 -1589 -3765 -2693 -1344 -790 -1120
1114 -1120 -2157 1927 3566 250 1192 3440 2644 1751 914 1529 1756 -1966 -2388 574 -1145 -3386 -2867
1131 -2867 -1679 297 -1472 -1898 1684 1427 141 2279 3077 2424 1333 411 2109 1245 -1872 -1075 -81
1148 -81 -2228 -2463 -2241 -1063 -869 -2278 -271 1792 218 15 2371 2726 1890 404 1405 2785 -192
1165 -192 -1921 199 -277 -2440 -2635 -1558 -527 -2010 -2120 799 1322 -284 800 2405 2524 1171
1181 1171 823 2456 2050 -763 -676 299 -788 -2583 -2448 -1138 -1176 -2643 -1604 662 255 -535 949
1198 949 2660 2210 1076 1701 3061 1237 -354 127 252 -1576 -2577 -1794 -993 -2022 -2909 -691 33
1215 33 -722 -404 1857 2406 1448 1113 2562 2395 796 103 760 398 -1523 -2523 -1092 -1431 -2851 -2411
1233 -2411 -1098 -589 -649 -416 1531 2272 1044 2132 2948 2219 1144 785 1373 598 -1494 -1198 -746 -2582
1251 -2582 -2873 -1766 -1596 -1300 -1556 -285 1746 933 725 2746 2677 2421 1673 1494 1938 480 -1498 -408
1269 -408 -926 -2553 -2893 -2255 -1799 -1816 -2320 -415 1330 -206 894 2866 2440 2047 1791 1953 2365 267
1287 267 -679 750 -1416 -2175 -1941 -2362 -1772 -2058 -2346 -190 7 -800 1372 1882 1565 2385 1825 2599 2366
1306 2366 7 1088 1061 -1515 -1329 -1777 -2199 -1909 -2748 -1987 -307 -1402 -866 1341 1039 1541 1814 1585
1324 1585 2875 1934 446 1803 921 -914 -654 -1573 -1509 -1791 -2847 -1272 -949 -2003 -539 378 277
1341 277 1310 1210 1945 2546 1216 1498 1983 358 99 -8 -1033 -1106 -1906 -2443 -894 -1706 -2074 -562
1359 -562 -439 357 928 556 2072 1683 623 1934 1808 337 505 -235 -707 -717 -1674 -1371 -1002 -2035 -1394
1378 -1394 -509 -517 37 169 600 1992 1078 1211 2196 1100 532 610 -41 202 -1006 -1807 -841 -889 -2122 -1022
1398 -1022 -616 -592 192 -270 912 1778 506 1301 1240 879 792 378 -226 9 -1080 -908 -657 -1808 -1291
1417 -1291 -820 -1015 -495 109 317 971 355 876 1839 1688 756 757 568 253 -656 -1291 -720 -857 -1777 -1516
1437 -1516 -1077 -309 -639 -888 261 1343 1323 907 1316 1666 1469 502 384 606 -261 -830 -1326 -1334 -974 -1140
1457 -1140 -1476 -1355 -720 -81 488 57 890 1744 1694 1196 1105 1322 1217 -255 -577 -34 -415 -1387 -2125 -1531
1477 -1531 -693 -1277 -1642 -198 678 231 484 1183 2035 1868 1146 1539 1354 708 21 -651 -568 -802 -1597 -1488
1497 -1488 -1402 -1520 -981 -973 -534 351 825 1114 1306 1177 1729 2098 905 730 1074 344 -804 -1344 -1251 -779
1517 -779 -2161 -2391 -1096 -844 -870 -487 273 1459 1438 663 1951 2243 1424 1269 726 691 407 -1216 -1436
1536 -1436 -682 -1467 -1974 -1354 -1647 -802 -719 -285 510 662 948 2117 1229 1231 1885 1168 706 227 -529 -147
1556 -147 -1111 -2090 -1198 -1228 -1690 -1562 -1137 -15 286 -305 921 2152 1095 1115 1884 1140 1377 -134 -190
1575 -190 525 -903 -1283 -1006 -1334 -1362 -1285 -1329 66 -261 -413 1197 1080 728 1400 1259 1315 1109 53 504
1595 504 71 -1327 -705 -677 -1655 -1033 -1536 -904 -282 -1009 -427 1149 412 641 1204 1126 1457 870 210 1189
1615 1189 291 -1083 -291 -549 -1001 -1343 -1460 -509 -318 -1341 46 773 168 660 1104 1178 1326 595 945
1634 945 1165 -535 -518 -180 -707 -1001 -1284 -1068 -482 -1111 -1022 274 252 220 972 1004 1341 737 540 1295 517
1655 517 -436 -62 -154 -563 -1267 -1104 -454 -436 -1453 -376 -50 17 94 750 1163 1469 639 682 1439 424 -161
1676 -161 188 -325 -641 -1197 -955 -287 -1107 -1068 -169 -16 -121 171 588 1251 899 547 1146 1304 304 175
1696 175 179 -405 -790 -1192 -604 -895 -1494 -1284 -324 -66 -130 62 1072 1446 953 942 1633 1221 586 358 541
1717 541 92 -893 -756 -765 -1126 -1964 -1231 -791 -606 -678 -16 948 739 588 1533 1391 1224 926 638 970 -299
1738 -299 -858 -496 -546 -1353 -1364 -1342 -488 -759 -900 148 313 -46 1035 1382 1304 1169 740 1185 883 3 -202
1759 -202 69 -696 -1416 -1330 -1015 -962 -1357 -1003 13 -266 -111 514 1202 1459 1156 869 1646 808 -102 273
1779 273 -302 -571 -660 -1215 -906 -1172 -1681 -753 -392 -745 -15 710 817 964 908 1141 1805 583 520 398 109
1800 109 -284 -824 -671 -807 -1622 -1621 -563 -745 -850 -14 146 828 783 684 1476 1431 543 1129 524 342 65
1821 65 -610 -589 -655 -1435 -1044 -508 -1118 -511 -389 37 266 483 573 1696 866 624 1543 686 436 199 -287
1842 -287 -167 -686 -1397 -718 -849 -1212 -773 -493 -156 265 -242 833 1279 451 944 929 437 751 60 -140
1862 -140 55 -846 -1022 -627 -921 -1007 -245 -481 -78 -118 144 1006 324 190 960 995 624 362 97 115 -280
1883 -280 -1114 -401 -549 -839 -885 -893 -371 -175 -201 102 837 391 682 825 727 769 345 282 372 -419 -536 -275 -515
1906 -515 -686 -502 -623 -423 -200 -275 466 783 194 929 1127 669 718 296 476 405 -873 -101 -292 -718 -524
1927 -524 -859 -733 -232 -561 -445 490 398 358 611 896 777 689 527 417 101 -311 -68 -890 -1063 -802 -804 -977
1949 -977 -709 -522 230 101 -104 654 759 1025 694 789 698 793 -319 -341 -142 -367 -820 -741 -937 -725 -1137
1970 -1137 -995 -192 39 12 234 703 1102 1028 1009 769 998 557 259 -355 -450 -651 -1317 -777 -943 -960 -593
1991 -593 -433 -268 205 443 733 815 838 1310 1338 696 662 524 50 -166 -640 -804 -827 -1426 -1023 -781 -686 -598
2013 -598 -590 151 602 388 473 1224 1093 1152 890 563 511 203 -347 -289 -994 -953 -838 -957 -913 -516 -427 69 249
2036 249 100 831 737 867 818 486 733 382 -49 -18 -221 -1021 -585 -713 -948 -939 -840 -398 -123 -298 -33 841
2058 841 598 680 756 711 955 454 12 368 -92 -460 -459 -922 -853 -744 -1071 -592 -167 -342 214 397 310 678
2080 678 469 441 932 349 430 1013 -264 -110 -240 -549 -617 -1009 -777 15 -507 -583 227 283 316 572 509 992
2102 992 646 328 593 577 -249 -69 -313 -565 -731 -903 -715 -306 -617 -670 119 -238 277 181 258 998 419
2123 419 565 869 269 3 -97 -307 -276 -506 -865 -162 -535 -602 33 166 161 335 113 691 455 152 549
2144 549 862 253 136 22 -263 -250 -677 -355 -504 -691 -745 110 -211 -122 20 506 720 281 468 929 382
2165 382 194 73 104 -23 -569 -857 -475 -744 -982 -407 -126 -232 -184 -62 570 473 412 691 907 450 276
2186 276 87 78 69 -577 -710 -274 -773 -712 -300 -416 -223 -125 291 379 631 326 1016 796 456 311 537 285
2208 285 -6 -307 -418 -681 -712 -886 -524 -383 -424 -338 203 220 672 444 532 612 376 244 733 298 -40 -37 -256
2231 -256 -531 -688 -799 -815 -829 -517 -485 186 98 120 683 817 576 492 670 778 309 -24 105 -64 -694 -676
2253 -676 -515 -813 -506 -810 -457 -206 -223 -92 369 624 598 530 1056 984 327 284 37 67 -205 -346 -384 -488
2275 -488 -862 -702 -309 -365 -310 79 158 299 468 297 1123 784 508 427 314 126 -136 -384 -185 -367 -1006
2296 -1006 -608 -627 -516 -268 84 74 265 211 277 703 498 605 767 545 132 64 -264 -4 -898 -903 -284 -569
2318 -569 -658 -477 -227 241 58 97 702 390 358 597 629 492 553 -174 -27 23 -539 -413 -472 -782 -353 -656
2340 -656 -306 -5 -161 27 470 333 404 471 509 789 205 44 97 -367 -355 -3 -530 -571 -382 -540 -358 38
2362 38 -381 236 690 -55 392 761 621 563 211 47 159 -288 -231 3 -442 -352 -328 -510 -159 9 -192 166
2384 166 79 285 480 444 370 297 303 528 -63 -398 22 -511 -565 -289 -226 -170 -323 -83 -33 263 261 180 409 281
2408 281 306 319 340 450 -94 -189 -2 -536 -308 -414 -518 -362 -372 -437 65 7 309 514 245 185 510 482 478 219
2432 219 -110 -77 -242 -451 -546 -437 -332 -417 -876 -339 -330 -34 -13 366 247 426 357 471 560 91 -54 60 29
2455 29 -252 -580 -376 -489 -567 -694 -252 -353 -411 62 177 367 504 652 538 684 620 282 141 20 -90
2476 -90 -404 -410 -368 -774 -407 -602 -130 -53 93 121 176 490 647 607 374 689 372 641 203 -405 -384 -77 -837
2499 -837 -644 -693 -513 -294 -304 -325 48 269 358 460 582 720 346 343 187 354 141 -167 -162 -321 -494 -505 -676
2522 -676 -688 -415 -234 -267 -135 225 395 491 379 625 571 515 188 275 154 -204 -493 -335 -392 -490 -445 -829 -157
2545 -157 -87 -273 33 128 263 465 373 587 280 361 162 282 -145 -274 -251 -286 -442 -753 -381 -314 -378 -153 136
2568 136 1 541 356 150 553 148 334 376 11 5 118 -269 -293 -244 -552 -634 -414 -635 -316 -188 -42 389
2590 389 -235 182 648 314 546 379 -6 438 -98 -174 67 -321 -338 -171 -339 -368 120 -299 -28 161 98
2611 98 305 272 26 319 224 -26 372 37 -35 -390 -310 -283 -328 -752 -164 -58 11 96 47 494 323 110 503
2634 503 489 347 20 -7 -57 97 -187 -384 -184 -317 -330 -181 -239 109 -236 -190 338 166 6 416 204 238
2656 238 193 49 80 121 -161 -42 -221 -408 -145 -530 -168 9 -115 -26 113 -58 147 351 477 267 249 203
2678 203 92 -27 -498 -99 -565 -292 -721 -264 -529 -25 -148 147 169 29 336 356 138 355 335 103 279
2699 279 -163 -112 -358 -529 -393 -339 -571 -214 -147 -115 37 54 181 207 659 396 403 311 467 255 -33 -59 -200
2722 -200 -497 -262 -824 -502 -282 -221 64 -42 -6 -165 497 231 207 294 716 439 481 191 84 14 -91 -497
2744 -497 -353 -148 -399 -638 -267 -351 -205 -184 10 376 139 165 474 390 311 31 188 159 -191 -302 -190 -294
2766 -294 -340 -136 -382 -184 -178 57 129 213 99 466 574 327 386 200 274 332 -78 -164 -287 -566 -485 -374 -581
2789 -581 -187 -329 69 32 204 99 492 131 267 331 338 362 10 141 90 -306 -533 -541 -339 -301 -284 -515 -46
2812 -46 -332 -288 465 544 287 304 478 318 430 73 67 -217 -318 -164 -226 -436 -399 -110 0 69 -396 37 292
2835 292 284 450 317 308 542 310 90 390 9 -415 64 20 -232 -407 -366 -361 -16 -360 -49 210 184 395 103
2858 103 331 474 146 -189 396 36 -189 91 40 -328 -20 -158 -33 -81 -217 -112 126 215 251 156 587 290
2880 290 133 318 259 163 -90 -149 -275 -428 -408 -164 -161 -332 23 -14 -210 259 81 159 252 134 241 451 134
2903 134 -38 90 -111 -216 -260 -302 -293 -176 -90 -212 48 151 -140 388 225 -44 355 -32 225 95 161 86
2925 86 -120 -78 -335 -273 -388 -468 -477 -325 -152 -273 -87 196 336 116 -59 353 366 222 95 30 25 -200 -174 -353
2949 -353 -198 -359 -466 -163 -210 -45 -129 -134 30 390 393 209 94 321 64 -241 -168 -238 -83 -535 -357 -298 -101
2972 -101 -403 -102 -141 222 173 8 87 367 158 213 567 299 -24 91 -33 -205 -458 -399 50 -400 -361 -680
2994 -680 11 -8 90 113 74 554 484 253 161 223 205 105 143 23 40 -126 -304 -414 -122 -427 -453 18 -68 -119
3018 -119 183 -98 342 99 177 241 1 157 114 -94 63 -172 -210 -447 -273 -565 -240 25 -38 118 -138 216
3040 216 199 167 364 290 244 378 126 44 128 -118 -340 -291 -393 -266 -265 -260 -74 -366 -64 238 8 179 236 361
3064 361 424 390 23 -25 158 -44 -222 -7 -376 -294 -372 -105 -151 -58 -345 38 91 42 431 110 -36 454 -38
3087 -38 408 51 -181 6 -255 -342 -326 -309 -264 -220 -276 52 -58 10 358 192 133 420 323 107 216 437 -191
3110 -191 -225 -125 21 -221 -379 59 -318 -248 190 -17 141 340 277 194 173 292 140 184 29 96 -111 -457
3132 -457 21 -316 -302 -418 -20 -325 -11 -113 148 -20 9 9 288 446 203 226 214 136 -128 -67 -210 -509 -461
3155 -461 -252 54 -4 73 71 64 93 171 369 78 520 336 61 162 29 91 -23 -106 -539 -251 -344 -392 -77 -284
3179 -284 -26 61 -118 154 402 513 277 35 163 116 -243 -104 -170 -327 -317 -75 -228 -335 -302 -339 -174 -260
3201 -260 75 520 167 629 481 232 450 404 288 128 -5 -72 -140 -438 -342 -248 -138 -17 -108 85 1 221
3223 221 258 407 346 179 260 16 51 155 7 33 -341 -479 -558 -254 -250 -253 -79 -134 -173 90 178 250 342 220 362
3248 362 211 233 438 67 -102 -19 -146 -167 -112 -142 -315 -524 59 -8 53 -132 -82 382 572 152 223 413 181
3271 181 231 23 119 -16 -258 -135 -248 -503 -401 -116 19 -73 171 -174 209 -24 170 638 282 256 219 108
3293 108 157 -138 -105 -122 -253 -216 -210 -272 -67 -359 -287 -1 138 35 250 271 42 274 162 -125 250 -216 -36
3316 -36 -70 -76 -277 -61 -180 -39 -34 -12 128 -173 79 190 635 239 179 244 162 -72 -15 86 109 78 -94 -147 -237
3341 -237 2 -172 -220 -44 -211 241 4 205 124 177 450 377 166 229 15 -244 -155 -322 -111 -183 -136 -165 76
3364 76 73 -129 208 119 464 229 223 107 100 -166 -141 92 -277 -44 -18 -268 132 -368 -173 -27 -169 25 55 125
3388 125 358 147 214 336 182 148 61 -232 -34 -201 -334 52 -143 -309 -138 -286 -138 -69 -213 -80 217
3409 217 246 161 109 269 20 92 -158 -261 132 -38 -232 -141 -510 3 -143 -264 -79 -308 119 135 -53 88
3431 88 -62 94 203 231 248 -146 -85 -502 -233 -182 -201 -329 -275 -48 3 43 213 19 156 459 102 112 263
3454 263 46 290 123 80 -121 -275 -230 -196 -223 -175 -141 -169 -161 -75 18 281 327 299 43 65 26 135 131 13 26 -9
3480 -9 -425 -253 -246 -421 -89 -293 -70 77 36 187 242 482 473 332 367 323 145 147 66 -110 -183 -106 -297 -366 -191
3505 -191 72 -403 -34 -61 66 122 396 335 158 112 -96 402 106 -15 -48 -126 -290 -165 -236 -15 -339 -7
3527 -7 106 40 165 157 380 145 -48 269 90 94 -134 94 -133 -133 -194 -260 -413 -50 -231 -30 -97 -269 -162 -5
3551 -5 4 -67 132 70 304 29 -43 14 -64 -162 -53 -64 76 60 -267 -213 -112 -94 -54 340 367 170 121 23 91 -113
3577 -113 194 153 21 38 57 -306 -110 245 -184 -182 -61 -356 72 -95 54 36 249 79 19 -28 -121 182 56
3600 56 74 -145 -21 52 -132 120 -49 -236 -206 -109 -89 78 80 433 226 221 -11 -126 -5 -307 226 116 -73
3623 -73 -180 37 -105 -293 -195 28 47 -90 119 -283 148 226 -48 445 36 306 206 -212 -197 -22 -283 -301
3645 -301 -214 -136 -233 -22 -83 -332 187 -153 246 223 253 -25 -110 213 164 9 8 -185 -165 162 -234 -213 -173 -116 -60
3670 -60 70 49 -139 210 416 18 158 205 221 140 65 166 -278 -130 -340 -234 -131 -187 -74 -187 -235 -24 125
3693 125 245 87 79 183 189 152 119 343 72 -320 -294 -151 19 -268 -14 -87 0 -126 -182 45 28 11 562 337
3717 337 313 146 101 212 8 131 123 -21 59 -424 -106 -40 -288 -223 -89 85 387 -39 323 343 166 228 -6
3740 -6 233 171 226 -23 -99 -8 -355 -215 -191 -229 -193 108 86 24 -7 157 478 90 146 574 366 -23 35 259 285
3765 285 180 -101 -245 -318 -227 -126 -171 41 -86 67 -13 2 266 63 -162 95 338 23 -167 -45 -93 -145
3787 -145 -50 -66 -154 -188 -436 25 -169 -98 -93 2 178 -113 252 75 253 -150 225 -162 -149 -203 -66 -35 92 -93
3811 -93 -280 -168 83 64 99 126 104 -9 294 215 278 339 13 9 242 -246 -288 -140 -274 -262 -111 -183 20 -12 -31
3836 -31 -9 120 399 81 268 236 -103 -30 49 -57 -394 81 40 -65 -247 -252 1 -40 -47 -154 -216 8 19 267
3860 267 281 -118 207 105 84 -20 -30 261 166 -377 42 -208 -48 -153 91 39 107 -33 185 -141 27 235
3882 235 57 -12 108 108 220 179 -176 23 -268 -110 96 -376 152 44 33 37 49 35 252 179 16 103 213 188
3906 188 -33 17 -134 36 -96 -156 -207 50 113 104 81 11 -20 233 176 228 234 422 -73 119 -59 69 -158 -144 -448
3931 -448 -82 -76 -291 -337 -118 120 49 45 3 166 36 58 246 89 161 60 95 96 -141 -484 19 -30 -309 -291 255
3956 255 306 -100 48 -67 -25 -71 357 55 414 159 41 54 109 63 -231 67 -3 -185 -99 3 -52 3 160
3979 160 161 -77 36 152 178 94 306 142 42 105 152 -272 -1 -290 -37 -289 -206 78 -133 -223 -105 97 193
4002 193 184 309 87 98 313 126 72 88 -123 38 57 132 88 196 -154 10 41 -2 163 282 265 28 179 50
4026 50 254 110 82 152 -116 -96 -170 68 -53 21 -387 -204 -119 165 -97 54 -40 195 154 351 53 5 86 -167
4050 -167 156 -200 -224 -119 -301 -41 45 -113 390 89 -206 -28 -145 69 -130 -122 65 106 22 -11 -116 35
4072 35 -110 132 42 -75 -299 6 -87 101 -135 196 246 -46 300 363 119 215 114 -165 85 -209 -305 6
4094 6 39 -271 -125 -311 7 65 14 -169 47 224 517 -67 353 328 280 99 84 -175 -212 63 88 -164 -115 -138
4118 -138 -54 -208 -166 -64 24 201 218 223 215 -59 70 186 -164 -144 98 -160 6 -130 -237 -306 -46 -277 -37
4141 -37 35 32 -74 86 225 391 222 64 202 6 252 -91 -273 -203 -208 144 -1 -257 69 131 -145 -75 175
4164 175 290 -58 328 284 191 173 124 32 -153 -94 91 -141 -417 -256 85 0 17 -211 45 134 155 301 -107
4187 -107 137 -165 104 34 225 17 -151 -207 -287 -192 -249 -221 160 -54 -326 -121 41 316 136 64 116 479 176
4210 176 95 124 -69 469 33 117 158 -163 -50 85 -373 -80 -128 39 63 28 -40 175 -64 319 10 -140 259
4233 259 -73 -90 -32 -13 -226 38 -230 -238 -137 6 -16 179 179 78 85 165 110 273 70 98 32 57 62 -144 -278 -87
4259 -87 -69 -63 -16 -82 -348 -132 -23 123 115 244 199 46 193 76 69 138 351 -54 17 -370 -142 -71 -114 -229 -35
4284 -35 10 7 161 -41 -34 101 10 -110 243 -90 152 -124 -295 77 -36 -208 -70 -47 60 61 95 29 153 -213
4308 -213 117 -78 57 245 47 21 -192 37 123 -317 -101 -118 -253 -466 -246 158 -102 -108 73 -260 121 200
4330 200 73 246 297 -309 -115 216 145 -55 -67 -107 -233 318 -231 -119 31 57 33 -158 -89 329 129 115 74
4353 74 -73 -41 263 99 -40 -36 -275 56 -276 -375 -2 109 29 174 95 -288 177 -122 252 122 182 -13 -40
4376 -40 -29 -46 112 18 -131 -123 -397 115 -95 72 55 -1 100 38 60 -106 142 -204 -245 217 27 -62 -264 -15
4400 -15 11 17 -203 -101 -271 -122 284 -185 66 -49 12 347 174 191 -161 62 253 41 -97 63 -124 -72
4422 -72 -118 -126 -119 82 327 72 -178 35 104 34 -193 196 97 -52 -6 11 54 -20 -231 -253 -265 -321 -140 -20 29 -112
4448 -112 -188 -56 219 264 38 61 270 -58 122 138 134 179 -443 135 259 -115 -74 -33 14 -132 -19 131 -172
4471 -172 57 52 79 228 -22 96 -77 147 154 -34 -87 135 49 238 88 -132 -201 32 125 304 86 155 5
4494 5 -11 204 65 412 -64 -54 -40 -143 -132 -201 -295 66 173 -116 144 -104 93 -60 6 101 74 107 -112 340
4518 340 49 121 -136 -12 -71 -277 -78 35 -216 -44 -7 -19 44 48 190 37 -7 -241 361 -92 117 -15 -103
4541 -103 -51 129 78 -98 -279 -56 -128 77 80 -192 -48 29 13 -146 122 67 49 147 -142 4 171 150 -285 -348
4565 -348 -205 -321 -102 -96 -46 -346 -110 -1 217 126 98 -129 -11 31 189 155 103 -209 -133 -124 -85 140 -87 -179
4589 -179 9 -3 29 -65 -31 -41 6 76 181 218 60 -81 12 -248 -8 -194 32 -157 -150 6 -81 -1 -362 224
4613 224 81 94 194 16 -150 191 221 58 -60 -40 -161 27 179 -96 45 -24 -67 171 10 -221 129 231
4635 231 121 -38 -18 -57 42 -130 65 -10 -263 -108 293 -160 -93 -72 -171 203 -207 -144 -131 -221 69 -86 -100 240
4659 240 90 -8 260 -178 42 -218 180 258 -144 58 28 298 -140 43 98 80 15 93 58 -69 -188 -58 -53
4682 -53 -55 133 -170 -241 78 76 -177 54 -20 -225 -155 124 -131 231 5 -205 252 -8 118 54 -28 -22 6 19 -86
4707 -86 -39 109 151 -307 -263 -124 54 -22 148 46 -65 -204 95 214 204 132 110 119 153 104 -186 -122 -46 -76 35
4732 35 -55 -151 25 -51 -102 212 156 -33 109 -38 58 144 -68 -12 60 6 -19 -305 18 -163 60 -211 53 0
4756 0 290 89 129 213 118 202 171 -64 31 94 -217 -182 -137 -60 -373 -144 112 83 71 -103 -87 244 -85 22 -24
4781 -24 41 123 -43 52 122 -38 -129 -5 91 -184 50 -57 -251 125 -147 -112 -60 -134 84 54 -68 118 43 249
4805 249 -110 89 -64 30 -62 -79 -21 -214 -104 -109 -62 153 -28 65 -32 -84 205 228 98 -112 89 -111 -140 -109
4829 -109 137 50 -48 -57 -39 95 -107 -84 150 101 264 2 -34 65 -203 135 6 105 -57 -186 -168 -8 -141 -136
4853 -136 -11 16 21 -1 -55 406 185 -5 -47 199 -131 65 120 -106 475 215 -63 -10 -118 -98 -211 -43 102
4876 102 167 146 109 138 58 83 243 234 -33 161 16 -34 48 54 -134 -229 31 107 -1 84 80 33 77 201 -8 -30 130
4903 130 127 -307 305 -203 -120 -154 -36 23 190 -309 116 -154 109 76 -92 -259 8 325 -92 203 200 11 -36
4926 -36 323 -129 36 -3 -121 0 -106 -8 -121 104 -86 177 214 14 -61 31 156 142 184 -25 -46 186 -115
4949 -115 122 258 -122 -245 -86 -125 -45 -66 85 358 -206 -122 -13 221 -16 51 246 282 163 -84 49 -86
4971 -86 28 -52 -229 78 13 -103 -234 53 -342 -256 206 128 58 -16 0 -78 -92 -73 -46 115 118 45 -88 -47 -423
4996 -423 167 -20 -148 84 257 45 -110 -79 73 -69 295 58 168 -129 142 110 43 86 172 -7 168 -317
5018 -317 -30 171 5 0 127 -19 -101 -207 -222 -72 149 239 13 203 95 -164 159 -11 -189 -34 -53 -72
5040 -72 -140 -42 -204 -149 -158 146 190 53 144 -217 -71 262 -121 241 -92 118 -102 25 11 49 -38 -76 -134 -173 224
5065 224 108 -84 342 2 -132 56 61 123 86 146 1 -189 -191 -74 -221 157 27 189 16 1 352 289 150
5088 150 36 65 105 -164 -113 -60 170 -157 57 -133 -537 -91 -171 22 -112 -344 -55 27 -209 -190 99 143 -120
5111 -120 104 -173 -72 -328 -176 47 -102 146 -94 37 -320 174 105 119 27 263 -18 -146 -193 -77 30
5132 30 -62 -66 -105 28 -240 -9 34 174 7 233 10 186 -11 -107 404 184 -247 354 39 -7 -74 -66 -227 107
5156 107 135 88 69 -83 51 110 -165 155 -157 11 18 215 174 190 393 84 -70 -50 22 184 -77 -72 -177 -185 121
5181 121 98 129 230 -180 -166 6 145 23 -2 224 -92 38 -1 93 396 -298 -154 -146 -146 -34 -148 -13 -164
5204 -164 -18 234 44 -13 -112 -173 114 41 231 141 -36 -135 -56 -114 -300 -23 65 -46 159 -111 -333 -277 -30
5227 -30 238 70 159 97 25 205 175 115 88 -52 -139 -12 34 295 68 -94 -14 -281 -156 -280 179 -14 -195
5250 -195 12 80 -56 225 251 24 248 -204 -87 -212 -213 344 28 64 43 -43 157 31 18 -32 101 140 162 17
5274 17 -1 68 -188 -35 -356 13 -57 -212 -20 96 10 -51 17 330 -160 284 23 49 -27 128 -226 -135 199
5297 199 -68 8 -51 159 63 -30 -4 -85 -106 198 428 0 -123 32 19 -38 -248 -47 -25 148 -188 -6 87 69
5321 69 -193 88 -15 -122 -118 68 350 228 -173 -62 143 112 110 58 29 -211 -172 -22 -79 -53 -23 -9 -226 233
5345 233 -5 274 67 -141 119 11 -26 -44 63 -28 -60 38 19 107 -77 -156 -118 -44 87 -38 -80 244 9 -78
5369 -78 218 -140 -100 175 -162 -40 85 -33 -251 270 31 -78 -82 -96 -105 91 -69 -48 167 -3 62 126 -36
5392 -36 -36 228 17 139 -166 -138 134 -110 -19 48 -228 -36 -90 -90 -39 -68 -86 66 -42 146 81 -5 -134 -213 152
5417 152 -37 6 -129 -88 -150 220 -108 -86 -144 20 -284 -6 -218 43 -30 10 176 26 -20 -33 113 0 68
5440 68 -140 29 -26 -26 -108 62 -94 84 -72 144 -52 -109 -271 59 16 -48 -20 122 -162 -170 189 -108 -214 52
5464 52 142 -99 150 -94 13 -80 50 -15 7 -26 423 84 157 23 217 -9 58 136 35 -77 -371 -168 -20
5487 -20 71 75 -163 59 227 -96 -47 25 -158 -50 -135 60 236 164 -165 -330 -153 31 14 109 99 0 55 -101
5511 -101 174 -201 -265 -151 -375 34 252 -8 176 153 19 -66 255 -208 148 41 23 -241 -167 -10 -180 -206
5533 -206 -117 -196 60 190 43 283 264 100 -179 137 57 71 -355 275 -16 78 179 6 -95 53 51 134 -26
5556 -26 159 36 141 68 -183 16 96 -150 117 34 -92 39 -108 -117 -129 -111 -2 268 -2 34 -255 -47 77
5579 77 266 4 108 -30 137 -74 -122 2 137 -170 50 57 -40 -210 -2 28 261 247 -171 -28 -72 -201 -7
5602 -7 7 129 275 -34 -132 215 -137 -64 -90 -211 -154 -13 62 -4 100 61 99 248 242 66 106 135 173 17 -10 -20
5628 -20 101 -9 -91 -168 95 39 133 -159 159 129 67 41 27 -127 -143 -12 209 -1 111 126 -306 70 -26 232
5652 232 119 -333 27 102 -263 -53 -79 -103 -237 -15 17 94 -152 -105 75 -42 95 -14 208 138 65 -162 -93
5675 -93 -60 147 -112 119 109 19 -126 -141 -23 60 304 50 9 45 32 95 -212 -97 71 -116 -88 -242 4 21
5699 21 286 -19 -118 -233 74 -53 -44 102 28 117 -149 25 234 40 -34 421 -204 19 214 -13 -14 89 -42
5722 -42 -171 -89 60 413 -69 67 132 113 -164 111 21 76 32 -185 211 24 169 52 -12 -93 66 89 122 -214
5746 -214 -120 55 -144 16 38 106 139 121 102 100 -211 -19 -174 -131 -74 144 -124 30 -22 251 24 44 60 -108
5770 -108 116 -58 -96 -114 -197 -221 126 68 -8 213 -118 -30 -114 16 -64 58 53 219 26 -197 -69 -114 -96 -72 36
5795 36 -107 -130 49 -28 176 58 7 69 -23 -198 142 -16 -216 -146 63 130 -257 -108 -20 -343 65 -158 -159 -120
5819 -120 -200 -57 -62 44 -17 46 -132 76 241 397 -163 91 -19 -136 -6 221 19 100 -278 -146 80 -235
5841 -235 -143 -185 76 -280 -79 24 -20 140 -169 157 -34 -108 19 58 -26 71 12 -256 -5 -243 174 -250 30
5864 30 43 -257 101 25 -28 -62 72 3 -336 -147 53 97 -20 -88 22 46 -35 161 153 221 105 54 -172 126 -61
5889 -61 13 96 14 28 115 165 -132 -71 208 -202 -181 -94 -191 6 -86 -66 146 33 -182 -137 206 -76 -100 4 -105
5914 -105 188 46 176 167 -15 -183 127 -210 109 -60 -215 -7 -156 105 93 -9 227 -24 -147 -111 -179 -37
5936 -37 79 68 -168 38 61 -210 95 -52 -250 117 -25 -109 -18 -155 -191 280 358 -137 -191 -123 40 22 -103
5959 -103 -156 301 -14 -393 -55 -88 -294 -123 -34 24 -32 357 70 -86 193 284 285 -139 -5 93 174 -88 12
5982 12 -85 22 -96 453 -69 -54 -106 -44 -158 -104 107 36 144 -187 121 -69 89 -132 193 -98 -130 -153 169
6005 169 -129 310 -380 -294 35 152 -220 89 15 0 103 208 -223 117 -207 250 149 126 -97 -55 -142 108
6027 108 110 -150 7 -74 125 32 -93 -189 221 50 -56 -55 -144 -112 35 103 -186 57 96 29 -158 33 168 -109
6051 -109 64 85 62 4 -41 -25 232 -14 83 314 -75 -53 -173 -175 141 226 -128 155 14 44 19 33 -167 63
6075 63 -129 75 -209 165 270 45 -201 -109 44 7 -40 54 -133 -15 -8 76 61 -200 159 36 -102 -107 -92 224
6099 224 237 -42 -58 -13 90 -353 -75 65 207 131 54 0 186 -177 -89 -70 -21 -193 169 -181 -81 18 118
6122 118 -62 21 7 -134 -188 131 -113 -78 408 -128 -261 94 -8 96 -207 45 49 70 62 -260 -8 -243 243
6145 243 180 -71 204 27 -286 222 -14 162 171 27 84 349 -21 -286 48 -129 63 -27 -125 -268 -3 4 70
6168 70 76 -153 253 -47 -168 10 -100 118 -60 -50 -80 -111 82 -278 -35 -198 111 126 115 -203 179 -158 255
6191 255 91 -90 -94 2 -185 71 -34 166 251 -76 -83 -90 -136 -108 4 235 62 60 -82 -168 160 6 52 -47 288
6216 288 -238 -17 -19 148 -20 225 19 -171 -123 7 310 301 23 42 -86 -346 19 180 84 -81 -47 10 -7
6239 -7 -162 107 -108 -152 -63 -67 -164 -123 -28 98 -98 -104 148 -24 -382 114 -33 82 94 -217 -238 328 28 236
6263 236 -363 -36 51 -107 -169 164 67 -67 -46 26 231 -36 43 -146 73 -110 160 -157 -86 -95 110 89 328
6286 328 -59 -81 -37 240 -55 -6 226 -248 -326 -66 -7 67 56 194 -27 130 -87 17 53 36 142 -235 69
6309 69 -49 62 0 90 -56 -51 133 -100 150 144 -278 7 -140 -96 300 -93 -132 258 -68 -53 -122 -125 28 -186
6333 -186 29 -236 113 -175 -234 -23 -94 41 240 75 72 -16 -6 -117 39 -134 -22 49 -75 -224 90 87 -78
6356 -78 165 -28 -126 216 -135 -83 106 -104 166 79 74 -113 -350 -145 153 -16 174 -215 31 19 7 -150 66
6379 66 -171 56 -67 277 -198 -54 413 -38 93 -182 -121 169 -70 307 147 -376 136 166 -182 143 -157
6400 -157 -108 40 -7 19 200 -97 -84 175 -161 -258 -101 79 -191 57 87 -4 -5 -272 170 -137 -14 76 54 327
6424 327 -84 -141 -68 -13 -111 -53 -17 -193 -109 64 61 -194 -87 -3 65 -146 137 -32 11 163 -202 -82 -104 -88 11
6449 11 -97 -33 235 157 221 -175 -47 74 240 -182 51 -34 -171 94 16 348 -175 86 -3 267 34 49 -313
6472 -313 -161 -142 -7 -81 -41 12 -41 265 149 26 128 -118 313 46 107 176 29 -104 -293 350 -69 31
6494 31 31 -150 -19 -245 192 56 -20 6 269 -71 46 -258 -95 49 -24 -33 -321 -24 4 40 -15 -50 76 94
6518 94 22 37 -165 23 -98 -167 151 -31 -19 175 -51 -42 28 54 -193 75 -254 257 -106 -134 61 155 -147 140
6542 140 -118 -97 79 -44 -116 -95 -130 -85 -185 200 -106 273 210 -108 -39 149 132 24 -153 -112 -47 118 -210
6565 -210 47 -286 62 40 -98 330 -207 -41 -91 191 3 -3 132 -89 150 82 227 65 108 101 -126 4 -71
6588 -71 18 53 39 -128 7 44 -160 82 -24 56 -17 -3 -177 -35 75 189 -79 11 -45 -120 -160 -204 -98 -90 17
6613 17 -3 -15 305 -79 10 149 -221 23 -57 -304 -1 158 218 -246 20 50 -308 51 36 67 66 -118 -83 -139
6637 -139 297 113 -29 -213 324 -129 104 -151 -192 15 -13 63 -75 156 -224 77 -95 -81 117 103 98 -190
6659 -190 -2 159 -400 -108 -148 -183 157 65 -27 -229 72 -17 -26 -136 -29 255 -220 64 55 70 -116 -176 115 56
6683 56 -110 -89 41 -282 -204 -45 -12 321 -38 -87 -129 38 -255 23 -23 -60 82 -102 -117 -442 236 18 -41
6706 -41 -25 59 29 64 197 16 2 -37 12 -222 185 -83 47 28 176 -3 -17 66 -73 102 -235 25 128 88
6730 88 -13 -45 210 93 -82 -113 -148 -18 -132 -8 9 13 88 55 -424 -82 -126 -243 150 -35 132 30 38 191
6754 191 32 9 -221 -49 180 26 17 -101 303 74 183 178 153 152 74 316 -125 105 152 264 141 -86 125
6777 125 84 84 6 181 -254 -158 -301 -26 -171 10 -149 108 -23 221 -141 33 120 55 200 266 71 -19 370
6800 370 -146 57 -108 50 318 -87 -82 76 -115 -69 115 -2 44 -292 19 214 -87 116 -62 204 -182
6821 -182 470 -85 -309 40 136 113 -34 178 -48 67 -112 115 -104 -71 -304 -7 -25 3 -26 103 107 -24 -216
6844 -216 -141 -98 95 97 114 54 -11 -115 -137 -96 -54 104 -64 55 -171 25 -148 -279 48 288 30 -157 -23
6867 -23 -83 -43 206 127 111 -28 6 -28 30 39 221 136 -146 227 -115 -73 95 -130 54 112 44 106 -38 59 -151
6892 -151 -42 -177 -113 85 23 -157 164 -19 -134 46 43 -307 40 293 -12 -69 154 -165 196 -271 7 -46
6914 -46 74 -191 -64 60 90 218 -170 -330 -31 47 47 56 45 -61 -13 270 143 -188 9 -2 -149 4 -58 -167
6938 -167 57 -44 71 -58 -10 30 19 -79 251 -89 -284 -281 -144 238 -138 -42 1 -245 61 14 -31 181 -80
6961 -80 142 38 29 -206 264 113 10 -328 80 -295 -60 -122 -63 164 150 18 -389 -121 -186 63 100 -94 -71
6984 -71 -166 -70 67 45 177 -125 -14 90 -264 -22 -206 -321 -113 -5 -76 -57 -7 -203 30 124 27 126 85 -239
7008 -239 184 151 252 -14 -152 53 -215 -133 -15 144 128 -205 -196 -23 120 -19 -354 79 -245 -48 -182 250
7030 250 -150 8 44 -309 -44 -48 -412 -124 66 9 121 -252 -92 -246 -70 147 -333 42 44 273 166 -158
7052 -158 -77 -83 66 -27 -47 8 14 -152 -62 86 -19 -50 130 347 28 219 145 -14 -37 32 153 -32 -106 -34 68
7077 68 66 2 14 -112 56 -58 -46 333 -205 -141 -71 -77 11 -186 6 -78 200 79 -304 -114 51 -245 207 -191
7101 -191 -29 -125 -175 42 -89 50 -156 166 -303 86 89 -224 178 70 163 -93 -29 -86 198 141 126 196 69
7124 69 82 -153 -37 -56 153 -130 -131 -183 187 234 135 194 -180 -105 -103 168 185 216 27 -48 -74 95 194 236 31 -209
7150 -209 -73 -168 -127 7 -86 -51 -73 -21 -58 63 48 112 36 59 159 -157 -40 -212 -187 93 27 65 -130 -39 50
7175 50 -227 103 95 59 232 -15 227 -100 83 77 -12 60 82 -60 191 -175 -87 216 -59 -52 16 80 172 -244 80
7200 80 -42 -54 416 -19 100 278 -20 117 4 136 -77 148 205 196 -23 -56 -80 200 20 -97 112 -46
7222 -46 -78 155 541 -47 -62 279 111 143 -117 -34 276 34 142 125 -160 0 43 -147 -13 69 -48 -15 201
7245 201 210 41 -53 -157 142 28 -285 -302 40 122 -160 -26 -66 -159 181 143 222 63 260 -184 170 13 6 -47
7269 -47 134 -142 -55 173 87 -82 -26 -16 -2 -9 108 78 -27 -231 -219 138 -175 49 194 -2 -31 52 -226 -256
7293 -256 119 232 -118 71 127 -28 -186 280 -1 -208 -57 114 115 149 45 69 361 116 47 -82 77 -61
7315 -61 100 151 -52 85 73 72 -210 1 -353 13 -71 -21 58 64 -111 -24 194 121 -128 143 64 6 -26 -158 122
7340 122 -47 -124 36 -23 102 107 12 -181 12 11 -52 -145 44 169 -78 -82 -71 -207 76 84 58 -26 -176 131 -257
7365 -257 13 99 96 -91 282 -119 -160 74 -195 198 115 136 -20 65 -95 109 118 -127 202 156 12 88 81 198
7389 198 -81 -157 225 78 168 103 4 38 61 -130 -81 -259 -117 205 -66 -147 99 -200 -48 227 23 -13 -117
7412 -117 -124 207 -309 217 73 -68 -77 -152 -56 300 -242 -194 102 222 118 -275 248 37 56 -128 259 -65 -105
7435 -105 113 3 14 -19 147 220 112 -52 -218 -145 18 -110 -23 -55 -223 -52 124 -6 305 -244 44 218
7457 218 -44 -60 211 -24 -166 12 -185 76 79 -100 204 36 -104 -64 121 297 397 -62 69 -156 118
7478 118 203 86 -16 289 -68 -255 18 -53 129 -95 272 -227 90 88 53 -106 -81 362 -6 -92 -49 -19 -31
7501 -31 87 -138 131 28 35 19 -147 -153 47 -88 82 107 -36 39 91 166 101 153 -26 -113 -241 146 -123 -62 -169
7526 -169 115 -183 -88 -5 -228 -51 180 -91 -1 11 16 2 -28 -190 94 126 142 -23 -277 131 87 -10 -170 16
7550 16 316 84 186 142 307 262 114 102 -215 156 48 -211 62 79 -349 297 361 -18 -19 168 96 -244 -61
7573 -61 -64 -44 -59 222 -137 32 -194 -114 140 58 150 -132 198 166 190 -27 -22 -204 145 -184 -5 81 258 152
7597 152 -156 186 -14 156 -100 -152 98 211 47 -196 -67 0 -214 -269 99 -99 -43 -83 41 8 213 212 10
7620 10 -181 -271 -68 -140 -109 -102 -40 16 -76 -130 32 59 -64 78 60 55 -48 -121 -174 107 -103 -53 -191 -80 -40 113
7646 113 -64 -26 27 -82 -29 -109 -121 -264 195 92 170 145 19 -28 172 296 -197 7 219 -27 -219 -148 182
7669 182 -125 55 41 -64 33 267 -77 259 262 -24 158 30 -33 199 47 130 480 40 -191 -101 35 169
7691 169 -20 -75 -107 137 -43 -154 155 -18 46 36 -24 77 -44 250 22 -127 -54 -161 -147 -95 -148 -145 -94 152
7715 152 135 -31 -290 157 16 242 -13 -260 -355 -10 -114 -196 -90 -295 -201 141 0 -188 285 113 -10
7736 -10 154 -41 -111 77 -33 176 -131 235 192 -1 -322 201 -155 -7 73 46 -136 -242 -197 32 -151 34
7758 34 69 76 108 -142 -203 3 52 -41 170 146 64 20 245 -163 -83 103 59 32 103 -10 180 -21 221 110 122
7783 122 167 24 99 -69 31 164 73 -374 212 -92 75 -135 -119 55 -17 -132 -250 92 -5 -58 125 10
7805 10 -74 154 180 36 205 76 -128 -46 -90 28 21 -116 -16 -79 200 -28 -115 7 258 -285 234 253 15
7828 15 43 31 34 -226 -217 -160 -71 42 -269 -33 188 -40 -105 59 198 27 -160 183 4 177 -115 135 -205
7851 -205 -20 -78 -41 60 -56 -162 -124 -104 204 59 153 69 26 -32 -115 -125 -27 116 -146 243 81 -14 -186 98
7875 98 -88 117 -82 -182 -22 174 17 147 119 110 -5 138 82 25 -60 13 -84 130 -257 190 121 32 -39 20
7899 20 -58 60 -70 88 170 -134 99 532 169 -158 -77 266 -151 -132 -190 -104 -171 -12 -247 20 46 103 198 -17
7923 -17 -47 172 155 -30 -129 48 -83 101 14 -74 50 -23 11 -78 -147 -270 -47 17 15 274 93 35 186 -52 25
7948 25 90 -70 -77 166 -123 -108 232 100 -203 -68 -208 94 80 -57 -3 138 75 140 -86 145 55 109 -3 -44
7972 -44 -339 -63 16 185 -390 -1 71 -63 91 223 48 22 -140 -164 -131 -211 25 55 179 -358 -140 -27 -169
7995 -169 -178 119 -53 -17 -81 156 -64 65 361 5 -96 -77 5 159 -137 69 37 136 136 -152 -100 -92 -21 146 61
8020 61 -12 -30 -164 249 238 -38 45 -64 167 31 156 33 -28 -62 295 -254 134 -26 200 -275 142 276
8042 276 146 64 -153 214 -41 -66 48 -217 60 66 -256 138 13 -95 7 62 -103 -230 -52 192 -110 113
8064 113 -5 -63 83 -16 -38 75 -164 -127 -91 119 -149 165 -229 -11 38 0 -160 -167 -23 -118 -119 105 37 89 143
8089 143 0 -159 290 -171 157 107 191 173 246 117 -135 -155 -201 168 -49 342 138 46 -156 -42 175 -135
8111 -135 -127 189 -202 12 76 71 34 -107 -176 -26 -113 411 -116 149 -60 -59 -180 225 178 63 176 -26 8 -263
8135 -263 179 -106 -83 128 78 -265 34 63 257 49 139 93 -25 97 32 81 -116 59 234 -88 105 155 75
8158 75 -121 313 113 129 -194 -181 -7 18 -86 121 -69 76 37 23 -118 -32 130 -89 -257 149 272 41
8180 41 131 138 58 150 -4 202 123 293 -6 -233 -12
8191a2
$$ Imaginary data points
##PAGE= N=2
##DATA TABLE= (X++(I..I)), XYDATA
0 0 0 0 0 0 0 0 0 0 0 0 0 0 8 -8 8 -8 8 -16 16 -24 24 -32 33 -40 48 -56 65 -78 88 -102 116 -133 150 -172
34 -172 192 -217 244 -274 306 -342 379 -422 467 -519 575 -634 700 -772 853 -938 1034 -1138
52 -1138 1256 -1383 1532 -1693 1880 -2093 2339 -2632 2980 -3407 3943 -4641 5591 -6965 9129
67 9129 -13095 22721 -100502 -30377 168987 19761 -104330 -86675 23348 37513 26227
78 26227 38972 19375 -54388 -11490 79239 82694 -12388 -65642 -13370 43437 -3092 -26721
90 -26721 -5395 -25772 -51045 -15695 25442 14299 -34810 -20283 34123 16151 -6433 41849
102 41849 45606 -19713 -34155 37172 71405 -19112 -83651 -29 56364 -18997 -75300 -22779
114 -22779 41072 9332 -55923 -19439 44765 18656 -10881 18879 28479 -5374 -11947 39940
126 39940 51896 -30724 -62749 11618 44424 -8579 -49184 -30060 4097 1747 -6238 7054
138 7054 -5950 -20301 17719 42288 7965 -20653 8333 46774 12488 -43952 -12101 43195
150 43195 11196 -47659 -37696 12481 13947 -21843 -13193 12176 -12406 -22030 28246 49469 -593
163 -593 -38332 1961 51326 24381 -23365 -14637 6410 -6349 -16653 2247 10485 -21253 -40452
176 -40452 -3922 28733 10493 -10685 -4667 1667 3281 22894 39198 5660 -40936 -18017 41911
189 41911 35719 -26995 -48185 -10188 14936 2034 -8668 -8684 -16998 -14515 16839 35845 5354
202 5354 -26958 -2584 38329 26472 -12586 -15008 10817 8596 -14631 -10382 3126 -10107 -22406
215 -22406 -6609 7466 -3101 -12777 3236 15925 1658 -1630 17948 19308 -1504 -6773 10693
228 10693 17961 -6159 -22500 -3862 6410 -9613 -17179 -9351 -2252 -5304 -4336 10208 7638 -9461
242 -9461 3835 26636 16691 -4728 -5343 13178 15522 -7820 -12742 -39 -5684 -13998 -8688 -4791
256 -4791 -5801 -11420 -6368 9087 4365 -4241 10046 16706 7331 882 6753 18085 6695 -14566
270 -14566 -4972 6412 -5594 -12427 -11767 -9630 -7700 -8182 536 3833 -8779 -2074 16619 15179
284 15179 5684 1188 7565 17443 5842 -5613 1685 -1203 -8901 -7573 -7475 -7613 -11619 -13709 330
299 330 1438 -8257 1635 10280 6663 5794 6976 13646 13125 -1294 1308 8546 -1191 -6100 -7380 -9734
315 -9734 -6247 -10199 -10149 -2447 -7770 -8181 4590 7202 4489 3250 5271 15609 11551 977 7283
330 7283 6014 -2140 -1267 -3487 -6054 -7372 -12412 -6775 -3559 -10375 -5319 1629 -94 3242 4071 6793
346 6793 12128 5932 3682 10500 5692 572 -610 -3176 -1276 -5873 -10553 -5483 -7370 -9893 -1540
361 -1540 -1063 -3177 226 2755 9426 9713 2461 5337 8558 4948 5482 1112 -3723 -2362 -5163 -5085
377 -5085 -2516 -9707 -9681 -3814 -1748 35 -769 -469 5859 5022 3655 8952 6992 3083 3029 280 663
394 663 484 -4204 -4632 -6585 -8428 -4067 -2491 -3094 -1644 -3119 -631 5715 6261 5921 4587 909 3497
411 3497 7046 5483 804 -5978 -6397 -852 -1185 -3866 -5154 -8050 -6587 -442 4109 5110 -536 -3271
427 -3271 3422 10621 10297 3464 -3627 -1263 3980 3255 -1653 -5715 -7106 -6021 -3428 -1516 -1651 -3786
443 -3786 -3837 88 4935 6257 3579 1644 4154 6317 4175 -563 206 2653 -1117 -7878 -7816 -2375
459 -2375 605 -2909 -8374 -6432 537 4696 4354 2004 1783 2600 2755 7671 10543 2586 -6926 -6620
475 -6620 1582 6739 -1616 -13661 -12544 -3125 3699 1785 -5061 -4691 710 2674 7666 10583 4886
490 4886 -1479 -1805 6045 12041 2604 -9635 -9174 -1628 2621 -2934 -11221 -7113 -480 -2061 -2106 1503
506 1503 5074 5250 211 2278 9977 8146 2464 837 -299 1135 -2115 -6225 -1131 -1018 -10061 -11974
522 -11974 -4878 5203 5608 -7315 -8294 4955 11746 10579 3138 -1839 3945 5908 3999 4788 83
537 83 -7722 -9545 -5921 3331 2585 -12894 -14763 -2180 7251 7383 -2266 -5156 5849 9221 6540
552 6540 6655 3907 2217 -434 -2398 4092 2653 -9210 -10820 -4658 -490 -1142 -8686 -6474 3642
567 3642 3133 -615 1335 5163 10511 6574 -1599 2430 6892 4271 398 -5149 -5961 -2230 -4845 -3930
583 -3930 -1974 -6246 -7430 -4090 2420 9543 2629 -6098 842 10570 11712 5025 -3961 -1267 4678
598 4678 1272 -912 -2368 -6948 -7046 -6206 -1942 3070 -3645 -8388 -1375 5142 7696 4148 -998 2803
614 2803 6943 4689 4406 547 -2018 -304 -2340 -3362 -1700 -4378 -5629 -4435 -3501 189 547 -1633
630 -1633 2014 4496 2933 2944 2911 5408 5817 -1005 -3355 1150 2093 -1064 -5754 -6932 -2166 -1429 -3065
647 -3065 -976 -1679 -2502 1429 4024 5178 3342 -292 2028 4834 3498 1241 -2018 -3319 -1242 -1564
663 -1564 -2485 -3320 -4890 -3529 -358 -71 -64 907 1442 2383 2809 3597 4561 1860 -424 1937 1513 -1132
681 -1132 -3030 -3238 -1629 -3083 -4191 -2906 -1283 -770 48 663 1954 2550 2514 3721 4232 1915 362
698 362 1503 2181 -759 -3688 -3379 -2497 -2798 -2323 -2597 -2531 -2357 -68 2614 2574 1059 2345 3931 4030 2944
717 2944 1309 1395 589 -1604 -1773 -1787 -3173 -4322 -3969 -2327 -1531 -2709 -1023 1599 1227 1632 3994 4153
735 4153 3595 2596 2308 3360 631 -1323 -930 -2215 -3424 -3344 -4288 -3478 -2839 -3433 -196 1278 143 1770
753 1770 3361 4300 4297 2687 3179 4073 405 -102 308 -2339 -3005 -3402 -4151 -2944 -4122 -3624 -374 -1099
771 -1099 -459 2704 2560 3483 3957 2981 5171 4135 811 1320 277 -1548 -1850 -3926 -4101 -3418 -5321
788 -5321 -3240 -1205 -2984 -1027 1940 2172 3637 3087 3404 5738 3088 2325 3145 182 -283 -967 -3693
805 -3693 -2636 -3685 -5429 -2743 -2636 -3503 -734 -427 985 3199 1985 4568 5390 2509 3563 3250
821 3250 732 1206 -658 -2614 -1794 -4326 -4200 -1971 -4644 -3952 -1380 -1548 1161 1565 1021 4158 3684
838 3684 2461 4937 2920 1217 1663 -676 29 -792 -4494 -3024 -2806 -4431 -2419 -2072 -2055 234 -550
855 -550 1916 4030 2062 3080 4082 2250 2609 1825 214 675 -1902 -3415 -1263 -2891 -3892 -2683
871 -2683 -3049 -1564 -179 -810 2313 2621 741 2840 3435 3340 3210 880 -9 571 -1122 -716 -1417 -4159
889 -4159 -3560 -2374 -1965 -387 -1699 -1289 1519 1197 1804 3690 2513 1279 1568 2043 3012 241 -2838
906 -2838 -887 -819 -2755 -2493 -2587 -1869 -1658 -2586 295 2222 861 994 2019 2459 3104 2058 1129 1742
924 1742 -111 -871 -1106 -1610 -1849 -2157 -3116 -2784 -1628 86 784 -552 -891 2637 3694 2756 1493 1847
942 1847 2262 800 15 1147 -218 -3439 -4428 -1716 715 -1801 -4455 -2591 1257 1764 247 1281
958 1281 2620 2443 1737 2914 3542 1718 -767 -1599 -105 -667 -2324 -3317 -3730 -2680 -662 -1077 -1428
975 -1428 -132 1177 2043 1952 1686 3879 4064 810 -179 1686 2283 -508 -3828 -2803 -448 -3233 -4908
992 -4908 -1531 83 -1378 -3161 -514 4823 3953 176 1282 4099 4223 2889 479 734 122 -2514
1008 -2514 -1510 -866 -3167 -4157 -3742 -2478 -249 -181 -618 80 369 3720 5523 2142 1298 2809 3267
1025 3267 1871 -1209 -1054 977 -2917 -5135 -2262 -1016 -2319 -4260 -3175 1911 1726 -1638 1593
1040 1593 4544 3291 1816 1641 4152 4629 -1257 -1592 753 -1273 -2665 -3060 -3459 -2702 -3176 -2731 448
1057 448 -464 -590 2191 1728 2909 4252 2831 2698 1013 741 3336 695 -3856 -2574 -1170 -1853 -3398
1074 -3398 -4457 -1580 -565 -3631 -279 3064 1746 378 1625 3967 4829 745 -93 3197 830
1089 830 -1519 -1507 -1785 -1623 -3220 -4217 -941 -1027 -3035 -290 703 406 1543 1759 3450 3187 911 2661
1107 2661 2873 -896 -173 325 -1329 -2272 -3707 -1685 -346 -3632 -3018 694 608 -45 766 2008 3287
1124 3287 1297 495 3997 2836 -1120 -345 129 165 -1987 -3567 -1250 -924 -3653 -1449 751 -351
1140 -351 -230 304 2426 3018 425 1268 3211 1117 -40 539 390 -472 -2400 -2172 74 -2053 -3119
1157 -3119 -899 18 -870 -585 1126 2690 1572 58 2662 2902 174 -11 821 458 -1111 -2538 -726
1174 -726 -768 -3324 -2539 -379 -85 -988 -537 1370 2033 625 746 2990 2379 633 638 1474 631 -1839 -1840
1193 -1840 -625 -1651 -3009 -1791 -477 -674 -1518 -101 1818 1296 755 1919 3168 1861 545 935
1209 935 1544 22 -1699 -706 -804 -2289 -3044 -1609 -636 -1923 -1847 571 1492 586 920 2476 2633 1564
1227 1564 1029 2064 1676 -492 -1016 -284 -1242 -2162 -2663 -1749 -1196 -2711 -1439 541 150 -24 1411 2389
1245 2389 2674 1434 1655 3075 1491 -500 514 -297 -1447 -2689 -2354 -1058 -2307 -3098 -1232 -124
1261 -124 -826 78 1256 2140 2217 1437 2710 3387 1027 701 1146 -105 -997 -2110 -1902 -1325 -3057 -2934
1279 -2934 -683 -1440 -1344 -205 609 2241 1718 1063 3267 2297 985 1692 1224 240 -291 -1807 -1097 -1359
1297 -1359 -3198 -2223 -1427 -2287 -1126 -556 242 1504 599 1796 3419 1818 1521 2307 1166 1112 -432
1314 -432 -786 -183 -2050 -2935 -1483 -2009 -2044 -1518 -1231 289 626 -374 1840 2283 1124 1969 1976 1753 1466
1333 1466 -92 165 227 -1923 -1854 -906 -2219 -2083 -1558 -1355 13 -457 -70 1835 1471 1182 2386 1746
1351 1746 1449 1356 -163 1058 -15 -2026 -1103 -1113 -1912 -1514 -1846 -1260 -453 -1320 364 1532 487 1234
1369 1234 1785 1211 1842 789 943 1139 -503 -890 -341 -1443 -1623 -1630 -1831 -666 -1318 -1345 756 975 251
1388 251 1299 1434 1592 1163 617 1160 1042 -709 -571 -147 -1331 -1182 -1703 -1267 -527 -1158 -983 341 280
1407 280 668 1181 876 1531 1473 656 1042 485 -114 -263 -816 -949 -930 -1186 -1126 -1198 -1321 31 320 -129 643
1428 643 1434 1503 1008 1115 1222 1457 33 -337 17 -392 -986 -1578 -1287 -759 -1172 -1522 -713 -50 324 338
1448 338 871 1717 1635 1383 1105 770 795 490 -590 -937 -1042 -949 -1371 -1825 -1347 -793 -549 -671 -89 985
1468 985 1412 627 1146 1982 1883 825 268 711 894 -503 -1722 -1082 -1264 -1777 -2002 -1356 -571 -471 -727
1487 -727 200 1310 1496 1111 1435 1507 1668 663 307 440 -221 -954 -975 -1698 -1476 -1257 -1932 -1562 -779 -212
1507 -212 517 162 511 1901 2055 1446 1164 1492 1656 529 -744 264 -352 -1851 -1968 -1851 -1275 -932
1525 -932 -1794 -1014 363 56 408 1282 1675 1639 1348 1286 1952 1008 126 53 -626 -897 -1091 -1960 -1347 -1278 -1644
1546 -1644 -934 -796 -611 949 681 950 1548 1405 1949 1900 261 607 1112 -368 -705 -1010 -1033 -1213 -2174
1565 -2174 -1746 -326 -999 -957 153 536 1100 957 946 2133 1735 677 1293 558 102 -329 -684 -485 -986
1584 -986 -1868 -1169 -994 -1599 -489 140 18 734 713 1284 1790 867 918 1724 438 176 174 -319 -233 -1334 -1653
1605 -1653 -435 -1393 -1472 -595 -67 147 231 62 1558 1572 201 1369 1425 682 276 75 117 -313 -1701 -907
1625 -907 -622 -1306 -1199 -554 -549 129 185 632 1580 798 577 1456 940 512 203 171 221 -686 -1054 -574 -906 -1513
1647 -1513 -1139 -506 -286 -450 -215 875 938 57 1177 1358 749 620 416 237 169 -1022 -763 -247 -1075
1666 -1075 -1279 -998 -591 -621 -688 -103 911 697 340 980 1767 799 466 414 675 -249 -736 -469 -485 -1306 -1421
1687 -1421 -662 -591 -465 -547 402 811 464 727 1608 1041 1074 694 754 697 -508 -570 -456 -765 -1391 -1427 -583 -721
1709 -721 -1143 -751 319 301 241 680 1233 1310 766 967 1369 420 -151 -192 -137 -707 -1458 -1321 -628 -1284 -1277 -761
1731 -761 46 235 257 656 1252 959 968 1638 1564 461 294 202 -78 -586 -1411 -763 -927 -1502 -1260 -551 -352
1752 -352 -200 140 831 1184 812 930 1614 1194 501 467 411 303 -762 -1385 -703 -1091 -1718 -1235 -902 -1007
1772 -1007 -842 -395 529 980 262 1101 1536 1048 1075 743 547 305 -617 -433 -388 -1295 -1454 -1092 -1279 -1039
1792 -1039 -768 -394 368 116 87 1487 1305 923 1182 894 1036 439 -381 72 -440 -1545 -908 -932 -1075 -917
1812 -917 -1048 -330 101 -436 535 964 827 1112 1298 985 1002 293 -5 417 -466 -873 -481 -806 -1153 -862
1832 -862 -1203 -269 -398 -593 636 568 415 760 760 1164 920 150 564 586 -572 -701 -702 -846 -791 -1371 -1030 -420
1854 -420 -755 -364 457 123 637 679 1005 1278 788 744 762 315 -345 147 -337 -773 -539 -1168 -586 -577 -1106 155
1876 155 285 -66 424 436 713 1042 457 402 1066 5 237 -80 -233 -236 -1118 -947 -622 -794 -808 -182 34
1897 34 -35 684 428 667 1077 496 793 637 158 223 -83 -574 -738 -856 -627 -528 -1055 -562 149 -233 -125
1918 -125 346 394 882 537 381 1038 655 254 -225 -265 -261 -755 -1073 -592 -623 -734 -358 -319 -38 111 350 600
1940 600 672 629 846 516 507 546 196 -255 -412 -629 -743 -598 -1132 -1174 -563 -201 -575 -13 183 559 264 859
1962 859 1136 963 394 495 511 498 -536 -591 -538 -893 -896 -1180 -778 -545 -521 -229 356 395 450 668 966 1105 761
1985 761 569 505 158 -74 -97 -453 -779 -780 -1102 -928 -1019 -908 -176 22 45 325 943 1205 1169 696 841 1084
2007 1084 106 153 55 -414 -652 -1126 -931 -592 -858 -1001 -374 -114 -60 337 325 939 817 1028 891 997 403
2028 403 729 58 -360 -253 -505 -985 -695 -971 -614 -360 -551 -69 197 586 479 403 800 1457 450 600
2048 600 1050 366 -278 -547 -523 -403 -631 -1285 -624 -930 -674 -264 -71 389 331 496 902 882 747 1183 545
2069 545 93 355 -149 -461 -373 -736 -681 -538 -752 -528 -594 -476 349 182 450 1041 613 613 905 743 151 187
2091 187 -160 18 -116 -753 -311 -601 -742 -602 -360 -404 157 -524 269 694 258 464 538 340 716 95 -81
2112 -81 265 -792 -797 -373 -428 -616 -511 -527 23 -166 -289 662 588 337 745 404 484 662 119 393 226 -417
2134 -417 -165 -91 -739 -455 -495 -321 25 -397 -62 354 544 439 680 317 424 285 -121 438 -75 -490 -132
2155 -132 -459 -766 -400 -640 -209 -230 -307 562 187 178 763 271 621 600 385 421 220 -307 -119 -579 -568 -495 -641
2178 -641 -494 -572 -415 -158 174 6 54 585 515 487 420 363 435 487 -32 -122 -313 -443 -565 -597 -599 -413 -699 -312
2202 -312 -38 -105 484 413 713 712 613 518 444 288 328 108 -119 -535 -955 -786 -455 -710 -952 -198 -243 -297 368
2225 368 484 648 478 543 849 467 282 499 62 142 -732 -339 -382 -884 -955 -353 -435 -143 -295 -121 452 538
2247 538 318 792 820 623 89 341 630 -51 -580 -222 -417 -975 -594 -625 -833 -592 -560 -52 188 43 368
2268 368 892 850 566 599 500 614 -163 -141 -120 -193 -647 -739 -535 -686 -722 -560 8 -167 -247 594 785 419 618
2291 618 395 717 732 99 21 125 -419 -398 -657 -606 -506 -620 -596 -135 -422 -176 412 264 476 679 530 810
2313 810 530 190 325 278 -101 -89 -160 -410 -667 -811 -334 -234 -405 -192 112 299 564 431 758 887 253
2334 253 517 816 2 -202 -149 -423 -171 -723 -541 -178 -705 -370 -88 -116 9 48 419 832 555 340 677
2355 677 702 87 -50 -129 -204 -196 -708 -146 -179 -498 -327 -221 174 179 250 278 578 236 338 893 10 -6 108 -213
2379 -213 -179 -174 -752 -334 -643 -402 -207 -231 -69 -184 60 555 648 399 463 342 50 221 -41 -385 -223 -657
2401 -657 -578 -546 -500 -542 44 -247 -120 -230 -28 712 432 372 690 467 219 78 76 -43 -51 -421 -319 -319 -487 -531
2425 -531 -268 -399 70 -112 183 568 52 518 644 511 590 454 -27 -87 -62 -141 -336 -157 -543 -405 -439 -245
2447 -245 -212 -94 86 368 440 674 597 415 401 557 320 188 -138 -175 -222 -571 -606 -647 -377 -335 -206 -288 191
2470 191 -12 280 504 564 629 251 228 319 374 -203 -218 -243 -547 -487 -559 -593 -833 -268 -222 -127 -133 331 529 718 326
2495 326 701 766 439 159 -28 156 -298 -82 -667 -521 -708 -533 -226 -193 -114 -218 126 114 322 490 467 763
2517 763 362 485 321 -241 150 -376 -666 -599 -688 -597 -314 -347 -241 -275 -3 279 324 285 568 794 439 260
2539 260 268 212 153 -98 -344 -379 -665 -484 -522 -574 -246 -243 41 44 -55 -39 595 424 269 124 459 336 -17 -52 137
2564 137 -421 -850 -527 -536 -302 -387 -194 -209 16 -102 848 439 115 347 365 463 203 332 184 143 -518 -357
2586 -357 -295 -697 -345 -716 -119 -107 -518 -67 323 455 260 353 325 599 329 -110 338 -369 -298 -329 -627 -513
2608 -513 -357 -213 -326 -203 -286 -132 205 322 69 373 346 444 198 360 305 -74 144 105 -301 -431 -295 -451
2630 -451 -13 -328 -168 -16 -114 261 180 125 557 232 270 529 214 -59 -58 -63 -153 -263 -353 -111 -110 -680 -118 -21
2654 -21 -96 215 293 450 507 195 34 361 162 -156 -86 -144 -324 -228 -125 -402 -246 -157 9 -133 32 224 122
2677 122 284 457 258 617 391 126 271 278 -380 -432 -172 -409 -377 -551 -321 -225 -226 166 252 302 596 267 331
2700 331 737 341 164 33 204 -198 -346 -252 -197 -275 -386 -505 -336 -239 -180 300 69 150 244 401 390 292 306
2723 306 351 113 -326 -147 -316 -487 -566 -423 -535 -247 -232 -199 81 306 183 234 654 539 538 338 301 491 -277
2746 -277 138 -216 -207 -210 -370 -436 -300 -75 -499 -46 -36 160 436 324 325 228 345 204 52 107 53 101 -162 -484
2770 -484 -542 -296 -529 -368 -107 -190 -42 30 108 337 403 285 442 862 193 156 66 -18 -48 -138 -403 -399 -437 -515 59
2795 59 -396 -157 -29 331 243 199 258 435 131 -2 252 333 -47 -56 -509 -296 -80 -335 -161 -348 -473 -331
2817 -331 111 310 120 287 217 497 421 235 395 371 22 -293 -433 -440 -237 -532 -140 -351 -406 117 -100 203
2839 203 78 41 137 391 -120 156 360 186 131 110 -6 143 -317 87 -264 -345 -234 -140 -159 -185 -78 139 146
2862 146 211 386 661 28 -326 -102 14 66 -87 -302 -222 -14 -353 -89 33 83 181 36 -142 174 293 248
2884 248 451 107 284 -64 97 280 -247 -552 99 -375 -578 48 -217 -162 236 119 300 52 128 429 346
2905 346 294 290 32 -392 111 -132 -133 -12 -570 -369 -345 -452 -98 -215 -315 -153 82 211 141 168 80 262 155
2928 155 406 92 -312 -166 -274 -532 -328 -244 -453 -181 -206 82 241 -77 27 455 89 59 534 459 123
2949 123 -113 -322 -79 -343 -269 -366 -222 -338 -195 -308 56 -57 -94 214 40 319 329 263 505 62 92 -89
2971 -89 59 -33 -266 -484 -668 -445 -606 -397 -238 90 271 -2 62 181 299 441 327 504 222 -96 -82
2992 -82 -204 -265 -170 -153 -646 -435 -296 -447 -156 132 94 123 202 27 504 241 277 308 180 -81 164 -274 -114
3015 -114 -201 -134 -410 -122 -132 -288 -227 40 240 81 135 381 592 228 270 529 185 -30 -267 -87 -331 45
3037 45 -392 -466 -113 -377 -112 -91 73 3 459 281 604 298 354 301 92 72 93 -340 -514 -285 -268 -154 -557
3060 -557 -269 -297 -228 -185 -36 220 44 235 148 268 498 -215 323 0 -119 -195 148 -445 -215 -292 -320 -50
3082 -50 -37 -218 -109 -119 -46 207 364 373 446 180 88 -126 -77 -220 -203 -313 -123 -235 -153 45 -77 -188 37 -168
3106 -168 175 147 127 465 -97 236 113 -287 -255 -154 -132 71 -383 -466 -366 127 -115 -71 47 -312 184 393
3128 393 171 116 80 188 170 396 181 -94 -253 -265 -273 -329 -408 -253 -360 1 30 157 2 -120 293 394 54
3151 54 460 290 -57 -25 76 -363 -135 -224 -201 -415 -330 -154 -239 -31 249 23 193 294 219 235 403 110 82
3174 82 184 -134 -186 -216 -388 -140 -372 -530 -291 -379 -173 201 26 85 83 236 439 215 242 463 46 -96 22
3197 22 -132 -414 -156 -544 -285 -266 -455 -80 -135 76 124 325 114 351 341 209 25 322 -44 -63 -264 -75
3219 -75 -131 -730 -388 -591 54 -302 55 -89 -27 195 340 -155 404 358 316 -31 -14 -201 -399 -364 -285 -336 -305
3242 -305 -204 -528 -281 -21 42 -328 200 -73 157 410 172 171 294 88 200 16 -268 -208 -472 -32 -266
3263 -266 -212 -311 -98 -96 -168 178 -16 257 149 303 456 260 210 124 64 36 53 -390 -313 -165 -340 -196 -380 -301
3287 -301 -96 -19 126 1 228 141 266 168 317 192 129 -37 -114 -442 -252 -304 -368 -143 -260 -152 -183 -100 183
3310 183 61 114 112 333 91 374 2 12 94 46 149 8 -329 -105 -59 -544 -79 -425 -80 -101 -49 95 261
3333 261 16 4 196 227 27 13 250 131 -34 -324 -228 -402 -228 -55 -17 -263 -111 -113 389 -90 -109 247 234
3356 234 101 196 -179 -76 -311 -304 -48 -353 -69 -218 -297 -393 -172 -100 93 297 -218 111 356 5 108 45
3378 45 -146 81 -39 -275 -163 -140 -242 -132 -86 11 -239 -140 185 -106 178 236 398 214 26 295 -10 191
3400 191 182 -23 -2 -8 -294 -14 -181 -327 -350 -162 73 -43 282 156 71 399 502 270 273 -25 -229 -352 95
3423 95 -265 156 -132 -240 -337 -330 -81 -45 62 329 104 192 223 254 395 244 99 4 -21 -248 126 -207 -162 -254
3447 -254 -134 -189 -47 -235 -171 299 226 285 292 168 367 142 117 153 8 -23 -330 -221 -431 -339 -394 -189 -150 -416
3471 -416 -180 13 57 -10 -144 263 358 279 232 82 52 -245 24 -286 -202 -340 -338 -77 -221 38 -83 -119 217
3494 217 48 170 160 183 125 286 -32 241 98 -71 -237 -211 -228 -217 -474 -22 -290 -92 -263 -134 103 167
3516 167 301 236 257 168 116 337 106 -130 82 -266 -160 -276 -285 -291 -120 -247 -24 -115 -1 253 118 283 529
3539 529 169 176 262 173 98 127 -214 -234 -243 -295 -292 -298 -251 -181 -232 62 59 287 304 29 81 188 175 -68 155 -21 -76 -13
3567 -13 -31 -29 -47 -143 -32 8 -69 -172 36 100 244 148 234 83 44 124 142 48 121 -44 -280 -98 -544 -11 -167
3592 -167 -305 79 -177 -137 74 -199 139 471 304 179 192 165 117 -66 -46 -14 -272 -241 -235 63 -378 -323 -52
3615 -52 -118 172 248 117 60 193 181 223 279 254 108 -91 123 -141 -213 -381 -81 -206 -160 108 -36 -81 53 -14
3639 -14 221 154 89 370 163 73 122 23 -29 -47 -371 -97 -309 -139 -4 -181 99 274 228 -65 154 354 169
3662 169 174 337 -93 31 184 -83 -390 -263 -136 -197 -20 -126 -236 -143 -33 85 158 419 44 97 158 304
3684 304 33 295 8 -77 221 -105 -180 -247 -30 -167 -134 -468 -153 203 150 242 267 -32 112 420 205 79
3706 79 112 -138 190 -3 49 -204 -68 -105 -243 -444 -232 46 146 -17 170 -46 337 45 353 123 -220
3727 -220 90 -168 4 -56 -285 -700 -273 -309 -273 -111 -228 -11 271 27 207 144 90 269 194 142 273 40
3749 40 -144 73 -93 -240 -397 -217 -186 -224 -30 -106 -37 179 157 -6 2 209 230 94 147 -4 124 -317 112
3772 112 -326 -259 -259 -106 -34 -141 55 241 99 -21 144 435 40 166 -85 218 -87 71 40 -158 49 -206
3794 -206 11 -139 -130 -194 -51 -165 158 -95 224 37 108 63 -56 80 29 163 58 -391 -119 -36 27 -210 -187
3817 -187 49 -24 -133 40 109 -1 -27 34 -47 -83 30 148 235 163 69 -35 -253 -5 -186 -45 -93 118 147 276
3841 276 -202 35 117 440 60 -22 25 61 237 138 -178 190 -309 -96 -276 -333 -208 -232 -312 -172 29 83 -127
3864 -127 104 116 243 63 -51 234 9 156 -301 -217 -154 -127 -285 45 122 -296 117 -57 17 226 100 92 107
3887 107 247 -87 -5 -28 145 -61 -91 -208 -414 -39 12 -278 -147 92 171 195 4 182 62 265 268 -115 22
3910 22 -176 -97 -18 -162 88 -148 -224 -297 -398 -9 -203 9 -73 -90 53 224 371 317 85 154 226 189 34 -320
3934 -320 -452 -263 -311 -84 -92 -285 -83 -186 87 50 3 15 -117 134 250 -89 350 203 170 -201 -207 68 -71
3957 -71 -155 -200 -197 -322 -194 -14 35 116 309 -58 52 9 219 -102 50 -7 -93 -118 -130 16 -287 -287 47 -153 -64
3982 -64 -185 -81 -187 -35 332 217 162 71 141 92 22 69 71 162 -37 -222 -198 -104 -182 -28 -263 -246 132 91 99 128
4008 128 24 112 25 85 107 283 -39 -34 55 -382 47 -221 0 -376 -107 -159 -134 -121 7 93 252 32 -26 38
4032 38 -88 111 23 -258 -177 63 -71 -31 -159 136 -276 27 -194 -37 -52 -103 -38 -7 26 -18 43 322 92 7
4056 7 -90 -8 -219 62 34 154 -41 -72 -132 -99 -53 -103 109 -9 104 103 133 223 -86 107 3 -43 -149 -8 -170
4081 -170 -291 -136 -301 231 -160 -24 -43 -331 220 63 251 151 -142 63 71 114 -150 9 -106 -320 108
4102 108 -84 113 -139 -158 -35 80 109 149 -8 275 574 11 93 -96 -215 -54 -45 -133 -306 -257 -183 68 -142
4125 -142 -278 193 -123 31 -14 263 120 43 11 259 109 2 204 -202 -251 -336 -219 73 -135 -132 60 -108
4147 -108 43 76 -27 -236 422 -22 85 -47 330 -37 314 -87 -165 -1 -189 126 -99 -177 -53 144 148 -245
4169 -245 221 128 -182 -114 293 10 194 275 -308 -198 224 4 -104 -299 -214 -96 -304 -355 253 102 299 -86
4191 -86 398 273 -94 -186 -58 -280 30 -128 104 9 -330 56 -128 -97 -67 -73 -64 -66 212 131 167 82 50 -55 18
4216 18 -135 151 132 19 -69 -18 -22 -154 -119 -362 -117 -259 -30 211 73 -84 -10 221 -28 79 14 -93 105
4239 105 141 -3 -247 -31 -316 74 24 -15 -19 49 73 39 112 1 72 384 -212 275 56 154 111 -110 62 58 18
4264 18 -78 -128 -138 -158 -117 -112 -165 66 324 587 102 112 76 159 -62 223 38 19 -84 77 144 -241 -137 -104 66
4289 66 -65 -183 80 281 -110 89 -19 180 264 144 -46 53 191 -243 51 -89 44 -53 -69 51 95 -31
4311 -31 -181 -97 -142 66 120 273 160 260 -110 -178 116 -235 175 118 10 -158 -48 131 -18 134 -265 -107
4333 -107 240 -237 56 -30 -107 182 36 285 99 -37 -11 -34 -154 -121 -35 102 -147 152 240 46 89 105 143
4356 143 107 -10 104 97 -45 344 -86 186 -50 -229 10 -32 121 -79 -25 -176 -109 28 -51 193 224 -127 18
4379 18 -130 -128 -208 85 -140 -57 -96 -141 -97 72 44 33 76 -86 66 70 133 -139 -19 -44 270 -97 229 -141 -37
4404 -37 -47 -69 -180 -141 -248 11 124 29 89 -1 -16 35 -45 148 90 -167 75 109 33 -248 73 -11 116 -185 262
4429 262 -129 -16 42 -27 -26 -82 173 188 155 314 -63 64 98 -68 -62 -188 -170 141 -384 -73 -266 -120 -92 -20
4453 -20 -111 41 152 -8 60 78 109 463 328 182 -179 42 29 -68 -106 -248 -194 -161 -75 -298 -25 102 -38 186
4477 186 92 38 66 195 136 284 208 -150 -2 167 -336 142 -197 62 -107 -94 -111 -106 197 -394 -63 32 33 -6
4501 -6 -151 116 136 292 -130 -63 -263 -129 147 -291 -394 -202 -84 -207 -24 192 -53 -53 -39 67 -48 -72 74
4524 74 119 29 82 122 62 -120 -59 -363 59 -222 -233 282 -153 109 46 98 155 -58 38 136 242 168 14 -18 -94
4549 -94 -29 -173 -165 27 -80 77 143 133 206 46 17 90 -89 28 34 201 71 228 -164 -141 -119 -19 195 -11
4573 -11 60 55 -49 -95 93 135 60 23 240 200 -15 -49 -163 142 123 82 -139 -349 89 -83 108 -42 3 136
4597 136 -50 -62 10 175 45 228 1 102 151 -321 -19 -243 74 -7 -185 -69 -98 -87 -10 84 -294 106 87
4620 87 148 95 103 209 124 61 -32 170 -48 -228 172 -134 -23 143 -204 96 89 153 71 -24 243 71 189 -38
4644 -38 57 144 33 -252 -80 -79 -154 46 -31 -117 64 -29 88 59 -103 20 -27 203 -58 38 -3 38 -75 -180 -40
4669 -40 211 -124 -83 -107 -34 29 58 -121 -18 -26 118 -57 170 -23 -236 71 35 11 23 -140 -63 -179 -184 -174 39
4694 39 -26 100 109 -34 110 107 -127 130 166 -54 74 19 -110 -28 129 126 -115 -437 -232 99 -148 115 8 -143
4718 -143 212 83 4 115 65 95 116 35 16 299 -200 -60 126 -137 95 68 -154 -152 -9 55 14 -126 -101 48
4742 48 -2 112 360 -173 55 -226 -160 202 -39 -26 -121 182 -97 23 -49 141 -40 -113 -240 -49 56 222
4764 222 102 132 -140 -127 175 -9 -178 -28 162 -67 -171 -178 45 5 -159 -192 -207 -28 237 -84 112 225
4786 225 26 -128 -69 116 278 -149 -95 268 59 -2 177 93 -48 -93 -396 -259 169 150 -11 154 -1 184
4808 184 67 209 109 -17 -215 178 -37 -81 -63 -330 -181 251 -65 -409 -153 43 98 50 62 133 94 74 184
4831 184 288 132 -27 -197 -11 86 -222 -159 86 -82 -128 -200 -223 -232 186 104 44 169 33 85 -160 123 8
4854 8 -120 236 -31 46 48 -53 -52 -97 145 -46 201 103 -185 -30 79 146 165 -47 41 -272 24 -240 84 -58
4878 -58 31 -120 148 -61 -12 11 -70 46 71 -10 -60 -118 90 44 -146 77 -84 -27 -79 -51 196 -241 46 -182
4902 -182 -275 60 200 192 3 15 1 263 -188 31 -252 -142 -3 153 -8 -250 -62 387 151 -201 217 -77
4924 -77 -343 188 252 56 393 196 451 46 -193 -437 109 59 -93 -14 233 -14 154 138 -118 52 -111 57
4946 57 -151 69 8 -8 163 210 -117 -26 -65 -140 277 58 -78 -54 -248 115 -35 179 -258 85 453 -171 313
4969 313 -185 -102 -36 -16 42 13 -123 -29 79 4 84 -5 135 -195 21 -143 168 21 -47 414 35 143 142 383
4993 383 23 -6 177 -168 124 -35 -95 56 -111 -185 -40 -126 48 25 -106 246 -58 86 174 118 -57 -71 25
5016 25 316 -7 -285 -68 -13 -4 -123 -4 315 -11 206 87 -87 -43 41 222 162 44 39 151 -27 -3 57 -27
5040 -27 44 -97 163 62 -79 92 -95 206 -239 112 -93 -10 315 9 43 -55 92 -63 90 -51 -296 115
5062 115 259 -65 -41 -158 -77 4 358 154 -46 116 137 38 195 -37 149 72 2 -48 208 115 -16 28 -47 -93
5086 -93 -1 -287 -193 368 219 -59 -26 -13 299 3 15 -228 62 185 70 -121 -44 40 -232 -233 13 120 9
5109 9 449 42 264 90 -9 69 28 -220 46 -176 -218 -41 -56 258 -90 77 -126 149 -217 -111 -70 90 191
5132 191 -149 333 75 -144 -187 26 -48 -156 -144 143 18 -30 77 -164 -97 -91 -27 119 2 99 -57 58 102
5155 102 179 -15 -89 75 146 191 -183 82 -111 59 24 -31 -65 -258 -146 -164 -277 9 90 -202 -78 12 -45 -54
5179 -54 227 -15 -64 100 74 71 3 83 -195 -55 -21 -3 148 -170 -199 18 -165 3 -141 41 270 173 -87 -210
5203 -210 17 14 86 29 -29 111 -130 191 140 -36 44 267 116 -210 302 -10 144 295 -194 36 -192 -122 153
5226 153 -59 22 239 -42 -104 -26 -173 -6 373 -138 -60 -28 -43 -57 -16 450 128 -100 -198 -197 -74 43 -12 255
5250 255 -232 -64 176 -38 158 223 279 -125 -108 -86 155 -229 51 31 -162 -200 -31 -156 25 -181 66 -42
5272 -42 -36 -90 -459 -108 42 149 -169 -42 -155 -287 166 -45 116 142 201 -151 -209 161 149 142 -354 -101 -78 -208
5296 -208 148 94 72 95 -97 2 -76 -117 68 -140 41 102 -83 -188 153 -153 -156 -32 -26 202 -23 -169 -70 -169
5320 -169 -84 -124 214 138 -77 -54 -47 147 45 -121 70 24 -28 91 -241 3 4 -34 26 52 75 19 215 -30 29
5345 29 -57 2 216 9 -164 -190 188 15 178 379 187 -151 137 62 93 255 53 66 -203 -31 39 170 -147
5368 -147 49 232 -246 77 -191 129 55 0 -25 -18 146 -44 75 135 -126 113 -41 -85 -39 44 -127 76 -93
5391 -93 45 -147 -104 6 -172 -177 -155 67 -232 -47 -67 149 47 62 76 214 -159 65 -170 176 305 171 -79
5414 -79 -22 46 1 -109 196 89 -191 -137 -103 84 -134 -23 62 -140 92 -97 152 176 43 52 4 -1 -50 161 -282
5439 -282 -180 -193 200 -100 -106 -11 -34 103 -48 -261 31 16 -109 100 323 63 -68 95 64 15 243 33 162
5462 162 160 44 38 107 -77 -89 -29 262 -260 108 127 -203 243 291 -184 205 123 106 69 76 42 -137 0 -314 -12
5487 -12 -55 -272 35 -56 -210 -151 -344 -17 -255 47 -117 -52 24 24 16 -224 155 -88 96 143 -70 -67 344 115
5511 115 -217 222 -301 -187 38 -3 61 -211 131 -123 -21 -283 -26 31 228 89 15 -152 78 100 8 -274
5533 -274 47 5 -128 -51 -108 106 316 218 -238 114 56 137 -21 19 -95 27 104 18 -146 -121 -221 18 2 -105
5557 -105 -165 -197 -174 13 43 -43 207 132 104 119 -195 -70 -3 255 -35 51 -407 63 15 -60 -75 177 12 -109
5581 -109 100 -68 -185 177 16 -100 -128 -72 -17 -110 -79 -198 263 -298 -251 27 -49 17 108 -204 -7 -38 92
5604 92 220 -102 88 42 -114 2 -120 -152 -360 -7 189 -62 223 149 125 -10 133 -101 105 149 -81 -216
5626 -216 392 218 -10 52 -23 -214 -205 290 -66 21 10 -128 151 -162 113 -129 -55 -133 -245 26 55 294 -73
5649 -73 92 -2 -82 -17 -34 -198 -27 -146 -70 -14 216 -63 197 90 43 221 -128 12 -92 46 170 112 -48
5672 -48 105 153 39 -55 110 144 179 -282 -188 -74 -42 -62 -34 38 -26 -148 -112 -85 -131 225 -242 -74 -1 -143 -22
5697 -22 220 108 -23 38 78 151 -285 -52 -182 -177 177 46 91 108 36 -8 204 -39 -101 -174 -151 54 -124 174
5721 174 -93 -40 170 68 55 -134 171 125 41 -266 62 152 -203 66 -76 1 -128 -71 -187 -143 26 -2 -61
5744 -61 -78 25 73 10 183 -65 -20 -233 -115 123 -197 -168 4 156 145 23 266 -135 -275 -48 -115 28 -125
5767 -125 224 242 -164 -255 36 -102 185 88 122 -49 131 -138 -140 12 -40 -106 61 133 136 79 -16 153 72 86 -133
5792 -133 -150 -82 -82 97 -92 -274 210 381 273 -19 -59 39 233 -85 43 59 -71 61 36 -96 49 -24 47
5815 47 208 20 -7 -81 113 193 -212 14 42 -94 -38 323 39 166 94 55 -42 -199 -55 -87 -108 115 174 -157
5839 -157 72 381 -65 170 194 -90 -61 -54 122 152 305 94 -157 220 -404 -47 271 -230 88 121 -207 20
5861 20 230 -68 22 -291 -203 222 145 51 -43 169 57 -120 175 112 -64 8 -183 331 -126 180 -35 -165 -18
5884 -18 -122 -258 -180 -138 -37 -37 -72 -93 23 12 -73 -139 -115 21 76 110 -1 -206 -97 -119 37 147 110 -130 -197
5909 -197 -209 -77 97 -95 -46 -147 -4 -135 -87 5 34 62 -46 30 -190 -47 -14 31 187 259 -162 123 63 233
5933 233 -247 -181 31 12 -117 101 76 7 69 -73 -223 -82 71 99 -120 302 -6 60 61 -43 153 -165 272
5956 272 277 192 221 145 223 -209 188 91 99 246 -60 36 25 -51 -157 -254 -6 130 87 -88 -91 -152 -59 233 -98 79
5982 79 -230 153 178 -89 111 -179 50 -135 -277 -100 -22 -109 64 -92 -180 211 -18 314 -21 -24 -198 -207 85
6005 85 -58 -141 -42 75 23 -42 141 2 -308 -142 -92 -90 -139 -149 33 19 19 -84 -125 21 111 98 -120 -78 63 -247
6031 -247 -85 6 -213 -82 -144 -1 166 28 -19 282 6 336 112 -123 -163 -39 51 333 -65 -69 45 333
6053 333 263 -155 233 40 74 -10 -52 -211 -9 45 -4 62 -35 182 209 -141 161 -66 -81 -38 -92 -7 -16 -170 51
6078 51 40 -21 244 130 -184 150 -47 82 11 -138 19 147 -25 29 61 -63 -14 -37 -39 -47 8 -6 -83 -100 -40 -22
6104 -22 -78 -12 66 -60 171 6 -217 262 54 231 279 203 40 22 -48 -107 3 74 -153 43 -28 -114 -171 -220 -139
6129 -139 -66 -248 175 -114 -106 44 77 78 205 56 18 32 60 117 -21 -15 143 -37 -69 -289 -60 -396 -15 9 -57
6154 -57 248 -108 102 56 -32 -30 -151 19 91 -62 69 100 -53 -167 35 129 287 -118 -240 -56 -90 42 -191
6177 -191 84 -412 -78 -75 16 -81 -85 -146 4 177 62 217 -28 146 126 -171 -159 -270 454 188 -35 181 -113
6200 -113 -48 -227 -202 -76 134 -294 -52 84 -160 48 109 -15 -28 -66 -347 -37 -91 194 143 -244 -447 -88
6222 -88 -159 -132 -89 9 18 60 56 19 -148 -45 -131 -14 179 -6 224 -188 -452 94 -196 33 -134 79 -74 -74 -66
6247 -66 66 -185 -180 95 -339 -211 -36 -47 -377 211 -145 204 108 37 -56 156 106 31 70 -173 -106 159 -169 -87
6271 -87 260 -69 -5 85 -59 66 54 97 45 -50 -57 -180 1 279 -63 -99 212 -188 -11 269 134 -190 61
6294 61 43 -190 277 -7 -38 -149 275 111 53 -17 -61 -329 -103 -140 -4 282 154 153 -33 2 71 -25 74 136 -84
6319 -84 98 181 81 -49 159 -77 169 -195 -85 297 -275 204 140 26 318 157 2 315 -259 -20 -145
6340 -145 220 -11 -46 -134 4 18 -40 390 -251 16 -100 93 -210 150 120 15 14 -133 142 -265 -91 -39 -426
6363 -426 225 -272 321 131 51 16 -74 -125 45 -164 -257 -306 -152 147 108 -67 179 -5 28 16 166 167 51 272
6387 272 -17 -84 -193 -56 -13 93 -124 217 -116 -40 -130 124 -164 -202 96 -119 75 -59 -33 -226 -20 -78
6409 -78 77 -175 125 142 140 -79 -135 -22 -43 -60 -72 62 66 5 -146 219 -16 192 103 177 206 45 175 -24 199
6434 199 97 -164 255 15 -69 -12 -63 -80 58 -66 -126 53 365 -363 -100 -48 17 -52 33 -139 -20 52 53 129
6458 129 -171 9 201 -36 427 168 126 122 152 -76 -61 -142 -7 -112 -115 -35 -29 -17 131 -133 -170 -130 -165 45 -22
6483 -22 -3 45 26 -262 173 -82 97 427 -110 47 285 -46 21 113 139 -46 -164 -44 3 -134 58 80 51
6506 51 -57 -56 -26 -25 58 -42 -62 196 220 -17 -29 27 184 -150 130 -2 -15 -142 -46 -74 -103 -152 -91 -204 136 177
6532 177 181 221 -212 -130 28 -55 -329 222 -97 -29 92 191 150 -49 -223 -288 -50 -203 107 -164 -28 63 -179
6555 -179 -114 7 180 -149 29 168 -75 -70 138 230 -70 105 -151 -139 -27 191 -106 -149 -144 -63 101 440 -193
6578 -193 -104 -159 -278 -67 118 -82 -164 191 177 -304 62 140 -63 -53 -6 33 153 132 283 304 -82 169 63
6601 63 -278 -229 -243 74 7 -64 -23 -51 -73 -204 -38 172 149 107 -35 45 61 9 -156 140 56 -64 -167 72 141
6626 141 -65 -145 34 -45 109 75 342 -173 133 4 162 132 115 97 -47 -72 24 183 34 100 -121 206 -256
6649 -256 100 167 205 46 191 19 201 -174 37 -15 -121 160 19 302 142 -240 64 -8 41 -49 58 261
6671 261 68 -33 -15 -41 72 204 219 307 -7 -16 186 -185 -159 -144 -242 -204 -206 -17 -240 190 -19 -22 -62 -618 129
6696 129 226 -11 88 144 250 -23 47 51 -34 54 0 99 -93 180 166 19 -38 155 -108 141 8 -174 28 -201
6720 -201 174 -95 97 -20 36 -56 -3 116 12 136 137 -23 -214 169 -49 208 -66 -32 -32 237 339 198 -88
6743 -88 38 -160 -15 8 72 -80 132 113 26 -343 -134 -39 -35 -122 204 -35 -15 144 -3 75 -97 91 -42 -182
6767 -182 -90 335 99 75 84 15 -74 122 -5 243 -68 -91 82 7 -85 250 -120 204 69 -82 12 -165 124
6790 124 -12 -23 -19 -98 106 -300 40 153 237 -180 -46 113 332 157 248 70 -49 242 43 65 172 93 273
6813 273 -185 407 121 103 70 -195 -30 202 44 -53 75 132 -68 112 -45 54 -72 -114 200 -141 -159 -56
6835 -56 57 -65 152 -46 -191 29 -26 107 54 105 250 13 -124 -22 -8 -19 -141 205 114 82 -128 -104 23
6858 23 210 -210 46 -239 204 -48 -166 58 -185 95 -30 -60 98 111 -247 -23 -9 -84 20 37 100 -114
6880 -114 54 -49 127 -218 82 -128 -67 -5 -64 -188 87 -167 -156 12 -146 -115 320 -66 -38 -63 377 105
6902 105 -35 -73 -60 -157 -31 -9 -100 -153 254 219 61 -121 -184 -141 81 -212 49 244 -20 37 136 201 107 -43
6926 -43 2 77 -55 42 -132 78 -199 -298 110 -136 -204 151 -51 -92 -58 -128 60 46 99 198 32 -146 -57 -65 -101
6951 -101 -81 5 154 -152 7 132 90 121 -145 -5 -85 46 208 30 22 218 -120 -44 -77 -274 -103 -10 61 -159
6975 -159 185 -23 17 -183 -194 150 64 43 20 22 -74 -208 -114 -36 -8 -57 196 -23 145 80 -94 -142 -233 -115 -48
7000 -48 -75 -11 20 88 -164 132 76 47 205 -224 70 -177 -3 -169 103 -63 -185 -88 -211 -6 -69 -252 26
7023 26 -138 295 -89 -94 -76 101 -75 27 -200 -217 -178 99 -5 -79 -64 -67 -84 70 -10 310 164 -28 318 -81
7047 -81 -5 -20 -82 45 42 -172 9 53 -68 263 -29 0 45 81 -142 -15 -89 169 -95 -254 208 -168 274 -118
7071 -118 64 26 17 -224 213 150 48 -22 31 -140 199 111 149 -206 -44 86 14 -32 96 109 -9 -149 -63 -89
7095 -89 -137 -151 1 -69 -242 -75 28 135 90 111 -352 -209 -134 165 -53 -51 -72 12 39 148 154 -82 -159 -63 229
7120 229 12 19 138 -73 51 -111 172 138 -2 -59 -64 -110 0 142 64 330 166 -177 -37 105 -42 167 73
7143 73 98 -74 19 292 -50 -278 57 -99 33 54 -33 8 -188 -127 -138 -137 81 59 -104 27 -60 -135 -22 309
7167 309 -165 -145 8 -84 82 309 245 12 292 257 -214 -164 -61 -173 206 -168 33 148 313 313 -107 346
7189 346 107 187 -34 18 -164 100 2 -59 81 46 72 -122 87 -20 13 -205 -127 -75 -74 117 -14 -131 -116 38
7213 38 -15 -35 179 24 55 23 -105 -83 114 -115 86 -88 -49 82 -7 -185 -79 28 242 194 196 -247 255 -13
7237 -13 44 51 -16 -278 37 74 -90 -136 130 19 -153 164 126 -5 157 -29 43 259 154 59 -114 98 227
7260 227 -149 -262 -24 -44 34 214 -47 -67 192 -235 91 -64 41 7 128 173 149 -349 -25 -123 10 133
7282 133 -220 2 -211 -23 117 -127 -23 -253 149 -61 -14 92 -33 -315 -336 98 -93 11 267 -94 2
7303 2 11 -47 -161 14 108 -136 -59 27 -108 -55 1 218 -10 181 209 359 -4 82 -102 -93 -50 -78 -57 9 -9 -90 -29
7330 -29 -64 105 -25 14 113 78 -98 -41 -46 8 -141 70 -73 -460 9 51 258 -43 251 26 -131 -83 128 179
7354 179 42 -172 -155 -25 38 -189 -25 -151 -35 162 19 -246 163 -144 -45 -102 -16 67 158 -47 -70 92 -18
7377 -18 180 11 145 69 1 137 249 99 -49 -29 131 56 -18 221 269 122 78 -85 -133 78 -6 8 -23 -81
7401 -81 64 -19 -28 36 8 153 -23 -70 250 -12 -93 -9 65 2 -20 119 107 -28 -159 -43 193 7 125 -25
7425 -25 117 352 110 124 -214 -378 -43 -83 -143 -102 164 -53 112 -43 16 -96 36 -56 -15 166 61 -157 90
7448 90 -210 -269 144 -32 -107 50 -270 163 -234 38 334 193 -55 -65 326 83 48 92 -58 -188 -5 39
7470 39 -123 0 192 21 -363 -393 -263 49 8 -101 123 47 -21 108 -163 128 130 -50 128 -9 -71 -19 19
7493 19 -30 -163 -107 -24 -203 -5 40 107 240 -12 96 24 -21 -153 -188 250 52 -127 -184 -40 87 -81 -76 -173
7517 -173 -51 261 -131 95 -56 121 -89 21 -75 -45 -106 213 148 -3 13 75 -120 180 100 -51 26 -83 -206
7540 -206 -55 -176 -40 113 -368 25 -173 17 -30 155 -137 2 -146 78 -28 -13 -86 104 103 -162 52 61
7562 61 -12 -116 -242 -40 176 0 -158 -41 102 131 132 -136 -161 153 -145 120 -139 302 175 -5 -10 231 -338
7585 -338 58 33 -199 58 -57 -296 -18 138 -113 -12 -180 -78 175 -6 52 -11 -26 -260 -253 31 60 -74
7607 -74 34 262 24 -3 -95 -61 -55 -42 139 -52 -246 -120 -95 167 157 -175 -60 -22 -2 -143 101 -80 -109 -16
7631 -16 -99 218 -91 185 -26 66 -206 -118 -183 -201 83 -210 -8 23 261 95 99 -54 -101 -18 21 26 255 109 192
7656 192 -301 21 -1 -344 188 -86 218 345 296 -10 66 189 14 210 -97 84 214 76 -66 198 262
7677 262 -67 199 46 151 -162 -127 229 0 -139 -192 -131 9 128 -103 -56 8 -127 -224 -126 -200 -112 -73 43
7700 43 67 85 -70 66 49 -197 -69 181 2 24 79 78 171 -4 -76 2 39 161 174 15 -166 17 -43 -57 -58 70
7726 70 248 65 48 -87 -77 -178 -319 -116 -136 119 -124 160 85 -194 152 -176 206 33 6 -148 -170 -67
7748 -67 -42 -120 65 -44 292 -222 -118 -106 65 -73 79 138 44 163 152 -184 58 -5 69 -163 247 81 62
7771 62 6 -235 -197 49 162 118 -19 83 16 214 -26 -119 139 38 -1 9 -344 -168 -245 -79 42 52 141 164
7795 164 -92 62 -93 -63 219 141 199 42 -251 -235 368 -98 278 0 195 32 245 0 305 90 10 -178
7817 -178 -14 73 -119 -8 173 171 171 -49 87 -239 -248 188 -75 13 -144 -18 -124 131 23 -148 257 -98 -138
7840 -138 295 181 44 -26 89 6 6 -29 166 -252 -155 -136 -156 -136 -48 -4 -79 -348 133 154 80 -118 -152 157 -148
7865 -148 -17 -108 -174 -142 326 -152 55 16 -118 16 81 79 -46 1 261 -98 -46 -290 12 302 148 -142 -162
7888 -162 -2 306 57 -68 211 92 -23 -90 25 -115 -184 0 93 -206 -77 -148 -167 -123 3 197 77 -48
7910 -48 -58 -88 234 2 -345 -173 -191 268 -95 -159 -71 153 26 253 -202 -82 -252 -99 -73 -20 77 173 -155
7933 -155 -126 81 128 -271 4 164 232 109 -103 -260 152 -242 139 3 9 62 -87 12 -224 31 -146 -157 147
7956 147 117 -294 -30 -21 -38 39 -190 39 33 -62 152 270 -40 102 -6 73 218 -156 79 -71 31 -21 -251
7979 -251 28 90 -35 -3 141 -68 -39 51 -109 4 110 -188 7 -91 5 -20 181 50 -13 64 -85 -207 15
8002 15 289 -12 6 -392 28 29 -67 8 -66 -243 -56 -9 -107 110 -97 171 173 33 128 34 154 181 -88 82 44
8027 44 -362 2 98 148 152 52 -56 -64 -146 -102 -136 -131 -133 332 87 -42 36 -255 74 205 -201 19 109 52 14 -180
8053 -180 86 122 -290 40 -148 -298 -60 263 21 249 241 -48 2 -94 -115 93 -80 -97 -52 -120 -159 -132 -170 157
8077 157 -49 125 -42 78 -136 114 -173 -52 -93 -181 -84 -4 -38 78 53 -171 -362 3 0 -202 0 -15 -30
8100 -30 116 -46 21 -40 -114 195 122 32 226 24 -134 34 -235 -129 -160 256 -231 -77 42 72 -75 187 26
8123 26 -127 126 -64 1 34 -77 -6 -321 159 -207 -146 -48 -197 42 70 -113 187 -48 161 194 42 -57 -221
8146 -221 -202 72 292 29 -148 -78 -2 -32 76 -31 -181 -25 12 72 93 44 134 -27 -157 112 -182 101 -270
8169 -270 84 54 69 5 68 337 -204 -252 42 106 -21 -84 -158 -146 -46 -70 -55 22 66 131 -95 71
8191G1
##END NTUPLES=NMR FID
##END=
