##TITLE=1H_Pr bzl-332
 200.13MHz,CDCl3,
 8 sc
 
 30.6.2025
##JCAMPDX= 6.0         $$ Bruker NMR JCAMP-DX V2.0
##DATA TYPE= NMR FID
##DATA CLASS= NTUPLES
##ORIGIN= UXNMR, Bruker Analytische Messtechnik GmbH
##OWNER= pz
$$ XWIN-NMR		Version 3.5
$$ Mon Jun 30 16:03:35 2025 Russian Standard Time (UT+4h)  she@DPX200
##.OBSERVE FREQUENCY= 200.1313
##.OBSERVE NUCLEUS= ^1H
##.DELAY= (6, 6)
##.ACQUISITION MODE= SIMULTANEOUS
##.ACQUISITION SCHEME= undefined
##.AVERAGES= 8
##.DIGITISER RES= 18
##SPECTROMETER/DATA SYSTEM= spect
##.PULSE SEQUENCE= zg30
##.SOLVENT NAME= CDCl3
##.SHIFT REFERENCE= (INTERNAL, CDCl3, 0, 14.3821)
##AUDIT TRAIL= $$ (NUMBER, WHEN, WHO, WHERE, WHAT)
$$ ##TITLE= Audit trail, XWIN-NMR		Version 3.5
$$ ##JCAMPDX= 5.01
$$ ##ORIGIN= Bruker BioSpin GmbH
$$ ##OWNER= she
$$ F:/spectra/data/she/nmr/H-C/1/audita.txt
$$ ##AUDIT TRAIL=  $$ (NUMBER, WHEN, WHO, WHERE, WHAT)
(   1,<2025-06-30 16:02:02.09 +0400>,<she>,<DPX200>,
      <created by zg, POWCHK disabled, PULCHK disabled
       configuration hash MD5:
       00 E9 B6 7A A2 85 ED C7 34 08 36 98 17 FE 4E 26
       data hash MD5: 16K
       FE E0 78 65 2C 24 D4 FD 1E A1 6D AD B3 A4 85 62>)
$$ ##END=
$$ 
$$ hash MD5
$$ 13 2E DD 93 F4 FF A7 22 DE 10 DC F2 9C C9 4E E7
##$RELAX= 
##$RELAX= 
##$RELAX= 
##$RELAX= 
##$RELAX= 
##$RELAX= 
$$ Bruker specific parameters
$$ --------------------------
##$DU= <F:/spectra>
##$EXPNO= 1
##$NAME= <H-C>
##$PROCNO= 1
##$TYPE= <nmr>
##$USER= <she>
##$AMP= (0..31)
100 100 100 100 100 100 100 100 100 100 100 100 100 100 100 100 100 100 
100 100 100 100 100 100 100 100 100 100 100 100 100 100 
##$AQSEQ= 0
##$AQ_mod= 1
##$AUNM= <au_zg>
##$AUTOPOS= <>
##$BF1= 200.13
##$BF2= 200.13
##$BF3= 200.13
##$BF4= 200.13
##$BF5= 200.13
##$BF6= 200.13
##$BF7= 200.13
##$BF8= 200.13
##$BYTORDA= 1
##$CFDGTYP= 0
##$CFRGTYP= 5
##$CHEMSTR= <none>
##$CNST= (0..31)
1 1 145 1 1 1 1 1 1 1 1 1 1 1 1 1 1 1 1 1 1 1 1 1 1 1 1 1 1 1 1 1 
##$CPDPRG= <>
##$CPDPRG1= <>
##$CPDPRG2= <>
##$CPDPRG3= <>
##$CPDPRG4= <mlev>
##$CPDPRG5= <mlev>
##$CPDPRG6= <mlev>
##$CPDPRG7= <mlev>
##$CPDPRG8= <mlev>
##$CPDPRGB= <>
##$CPDPRGT= <>
##$D= (0..31)
0 0.7 0 0 0 0 0 0 0 0 0 0.03 0 0 0 0 0 0 0 0 0 0 0 0 0 0 0 0 0 0 0 0 
##$DATE= 1751284921
##$DBL= (0..7)
120 120 120 120 120 120 120 120 
##$DBP= (0..7)
150 150 150 150 150 150 150 150 
##$DBP07= 0
##$DBPNAM0= <>
##$DBPNAM1= <>
##$DBPNAM2= <>
##$DBPNAM3= <>
##$DBPNAM4= <>
##$DBPNAM5= <>
##$DBPNAM6= <>
##$DBPNAM7= <>
##$DBPOAL= (0..7)
0.5 0.5 0.5 0.5 0.5 0.5 0.5 0.5 
##$DBPOFFS= (0..7)
0 0 0 0 0 0 0 0 
##$DE= 6
##$DECBNUC= <off>
##$DECIM= 32
##$DECNUC= <off>
##$DECSTAT= 4
##$DIGMOD= 1
##$DIGTYP= 9
##$DL= (0..7)
0 120 120 120 120 120 120 120 
##$DP= (0..7)
150 150 150 150 150 150 150 150 
##$DP07= 0
##$DPNAME0= <>
##$DPNAME1= <>
##$DPNAME2= <>
##$DPNAME3= <>
##$DPNAME4= <>
##$DPNAME5= <>
##$DPNAME6= <>
##$DPNAME7= <>
##$DPOAL= (0..7)
0.5 0.5 0.5 0.5 0.5 0.5 0.5 0.5 
##$DPOFFS= (0..7)
0 0 0 0 0 0 0 0 
##$DQDMODE= 0
##$DR= 18
##$DS= 0
##$DSLIST= <SSSSSSSSSSSSSSS>
$$ [...]
##$SUBNAM0= <"">
##$SUBNAM1= <"">
##$SUBNAM2= <"">
##$SUBNAM3= <"">
##$SUBNAM4= <"">
##$SUBNAM5= <"">
##$SUBNAM6= <"">
##$SUBNAM7= <"">
##$SUBNAM8= <"">
##$SUBNAM9= <"">
##$SW= 18.0517328524113
##$SWIBOX= (0..15)
0 0 2 0 0 0 0 0 0 0 0 0 0 0 0 0 
##$SW_h= 3612.71676300578
##$TD= 16384
##$TD0= 1
##$TE= 0
##$TE2= 300
##$TE3= 300
##$TEG= 300
##$TL= (0..7)
0 120 120 120 120 120 120 120 
##$TP= (0..7)
150 150 150 150 150 150 150 150 
##$TP07= 0
##$TPNAME0= <>
##$TPNAME1= <>
##$TPNAME2= <>
##$TPNAME3= <>
##$TPNAME4= <>
##$TPNAME5= <>
##$TPNAME6= <>
##$TPNAME7= <>
##$TPOAL= (0..7)
0.5 0.5 0.5 0.5 0.5 0.5 0.5 0.5 
##$TPOFFS= (0..7)
0 0 0 0 0 0 0 0 
##$TUNHIN= 0
##$TUNHOUT= 0
##$TUNXOUT= 0
##$USERA1= <user>
##$USERA2= <user>
##$USERA3= <user>
##$USERA4= <user>
##$USERA5= <user>
##$V9= 5
##$VALIST= <valist>
##$VCLIST= <CCCCCCCCCCCCCCC>
##$VD= 0
##$VDLIST= <DDDDDDDDDDDDDDD>
##$VPLIST= <PPPPPPPPPPPPPPP>
##$VTLIST= <TTTTTTTTTTTTTTT>
##$WBST= 1024
##$WBSW= 4
##$XGAIN= (0..3)
0 0 0 0 
##$XL= 0
##$YL= 0
##$YMAX_a= 217895
##$YMIN_a= -250083
##$ZGOPTNS= <>
##$ZL1= 120
##$ZL2= 120
##$ZL3= 120
##$ZL4= 120
##$ABSF1= 10
##$ABSF2= 0
##$ABSG= 5
##$ABSL= 3
##$ALPHA= 0
##$AQORDER= 0
##$ASSFAC= 0
##$ASSFACI= 0
##$ASSFACX= 0
##$ASSWID= 0
##$AUNMP= <proc_1d>
##$AZFE= 0.1
##$AZFW= 0.1
##$BCFW= 1
##$BC_mod= 2
##$BYTORDP= 1
##$COROFFS= 0
##$CY= -3
##$DATMOD= 1
##$DC= 2
##$DFILT= <>
##$DTYPP= 0
##$F1P= 0
##$F2P= 0
##$FCOR= 0.5
##$FTSIZE= 0
##$FT_mod= 4
##$GAMMA= 1
##$GB= 0.15
##$INTBC= 1
##$INTSCL= 1
##$ISEN= 128
##$LB= 0.25
##$LEV0= 0
##$LPBIN= 0
##$MAXI= 10000
##$MC2= 0
##$MEAN= 0
##$ME_mod= 0
##$MI= 1.114404
##$NCOEF= 0
##$NC_proc= 0
##$NLEV= 6
##$NOISF1= 3.799351
##$NOISF2= 2.8
##$NSP= 1
##$NTH_PI= 0
##$NZP= 0
##$OFFSET= 14.38212
##$PC= 1
##$PHC0= -1202.259
##$PHC1= 12.39222
##$PH_mod= 1
##$PKNL= yes
##$PPARMOD= 0
##$PSCAL= 0
##$PSIGN= 0
##$REVERSE= no
##$SF= 200.129724274929
##$SI= 16384
##$SIGF1= 3
##$SIGF2= 2
##$SINO= 400
##$SIOLD= 16384
##$SREGLST= <1H.CDCl3>
##$SSB= 0
##$STSI= 0
##$STSR= 0
##$SW_p= 3205.1282051282
##$SYMM= 0
##$S_DEV= 0
##$TDeff= 0
##$TDoff= 0
##$TI= <>
##$TILT= no
##$TM1= 0
##$TM2= 0
##$TOPLEV= 0
##$USERP1= <user>
##$USERP2= <user>
##$USERP3= <user>
##$USERP4= <user>
##$USERP5= <user>
##$WDW= 1
##$XDIM= 8192
##$YMAX_p= 0
##$YMIN_p= 0
$$ End of Bruker specific parameters
$$ ---------------------------------
##NTUPLES= NMR FID
##VAR_NAME=  TIME,          FID/REAL,        FID/IMAG
##SYMBOL=    X,             R,               I
##VAR_TYPE=  INDEPENDENT,   DEPENDENT,       DEPENDENT
##VAR_FORM=  AFFN,          ASDF,            ASDF
##VAR_DIM=   8192,          8192,            8192
##UNITS=     SECONDS,       ARBITRARY UNITS, ARBITRARY UNITS
##FACTOR=    0.0002768,     1,               1
##FIRST=     0,             0,               0
##LAST=      2.2672688,     0,               0
##MIN=       0,             -250083,         0
##MAX=       2.2672688,     217895,          0
$$ Real data points
##PAGE= N=1
##DATA TABLE= (X++(R..R)), XYDATA
0@%%%%%%%%%%%%%%%qJ6j6J6j6J6k4L2l2M0m8N6o5P3q8J00j12J28j44J63j85K07
37A09k33K62k91L25l60L97m41M89n39N95o57P24p99Q80r69J068j179J302j442
56g59J603j785J995k243K543k913L376l983M817o039Q016j1747K1228r2744j71448
71b50083K24776K07065j24578j60179L3468Q4000J7483l4038M6620n1769o5181
82g2416M0046Q8597Q988j16072j5256P6122K8280m4904j5049M0222l6512q17L8612
95A9841J8276n0324m1423Q6718K1367p5391k9556P1961L3628q2628j3550N6085
107A5004K2346o4091j1051O7709j7560l4123N338L8012j0566m2985L9346L5520
119D2899m1437o1716N9458P8562o0146q2613K2323J02184j8438q3994J3212M3546
$$ plain form
0 0 0 0 0 0 0 0 0 0 0 0 0 0 0 0 0 -8 8 -8 8 -8 8 -16 16 -16 24 -24 32 -33 40 -48 52 -60 68 -76 87 -98 109
37 109 -124 138 -153 172 -188 209 -232 257 -282 313 -344 380 -419 461 -508 560 -619 683 -759
56 -759 844 -941 1054 -1189 1354 -1559 1817 -2166 2651 -3388 4628 -7119 14109 -78635 -250083
71 -250083 -25307 181758 57180 -102999 -69531 14469 31952 -2086 44534 -7235 -72416
82 -72416 -32370 56227 65215 -50857 -66113 10009 38289 -6615 -21664 18558 -17954 -18771 19841
95 19841 38117 -12207 -53630 33088 54455 -20936 -50492 21469 55097 -27531 -41081 15004
107 15004 37350 -26741 -37792 29917 12357 -21766 -16428 21584 11018 -31967 7379 42899
119 42899 1462 -60254 -796 77766 17620 -64993 -42670 59514 41076 -42918 -29706 13840
131A3840J200l4216J6887K0135k4456j3965K1376K5992l1528m710K1378o890j2488
144g445l202L4147o995l6817O72K7295J1561k7406k074R223J111r464N266K7572
158B3444k4820k0470J7092K2576k855k5122M860P237K263N50J71j0032j0906K5902
172I890N453k1072j9758J5726M1564j6734m2516k969M4662K3057l4737l0318J0435
185a7317L6573J33j7542r285n010J3738N274L712p796j4911K861Q671J0952k094
199G959j1397j3706R957K2800n005j3790j1962J2198J5962n802p630r003N570
212c849J1580M78j0887o461P544N179L923j2465m388J1714J638k709p512N758
226d57O720q825k178Q315L242j0473J09N653K292k508o385O495j824j964N639
$$ plain form
131 13840 15040 -19176 -2289 17846 -6610 -20575 801 26793 -4735 -9445 11933 5043 -7445
144 -7445 -10647 23500 16505 -20312 -19640 7655 19216 -8190 -10264 -1041 70 -9394 -4128 23444
158 23444 -1376 -21846 -4754 17822 14967 -10155 -5295 1942 4205 4755 4926 -5106 -16012 9890
172 9890 15343 -5729 -25487 -9761 31803 15069 -27447 -30416 14246 37303 2566 -27752 -17317
185 -17317 19256 19389 1847 -7438 -12448 1290 6564 10276 2480 -12431 -9570 -899 10053 7959
199 7959 -3438 -17144 -7187 15613 10608 -3182 -15144 -2946 13016 7214 -416 -9419 -3849
212 -3849 7731 8209 -2678 -9139 -1595 3584 7507 -4958 -9346 2368 4006 1297 -6215 -457
226 -457 6263 -2562 -4740 3575 6817 -3656 -3547 2106 4398 1890 -4495 2000 176 -1788 3851
241C851m877l011K546O125k845p915p48J1882N680j6808m164J0501J0533l593
255G157j7136N078J0980k773l458K269k856m942N006O570q41j2955m37J3898l281
270B279m211R16l86J52q11N529L515q455p657J1858Q080q589q336O23J2862j584
286E785j3104M968N465m238k662L685J307l270k001N880K919r866L626Q578n208
301A864m090N95O210Q43r244P7P840k202o501K601K603P12n373j609J0289l032
317A583o988M764L528j497j846J681K815l756l418P662R59r666J295M101N21k741
333a003m557M403K348m527J097L999j582j688L77L297L706p077j617P742j656
348C262l119m4J1N9j754O67K415m665k478P163r3m401O49J485M122j252m198L320
$$ plain form
241 3851 -1026 -4037 -1491 4634 1789 -6126 -6874 5008 10688 -6120 -10284 217 10750 7157
255 7157 -9979 -4901 6079 3306 -152 2117 -739 -5681 -675 5895 5054 -7901 -8338 5560 2279
270 2279 -1932 -1016 -1402 -1250 -2061 3468 6983 -1472 -9129 2729 10809 2220 -6116 -5493 7369 5785
286 5785 -7319 -2351 3114 -1124 -3786 -101 1206 -2064 -4065 1815 4734 -5132 -1506 7072 1864
301 1864 -2226 -1631 4579 5422 -3822 -3745 4095 1893 -4608 -2007 596 1308 -4065 -5674 4615 1583
317 1583 -5405 -641 2887 1390 -456 1225 4040 284 -3134 4528 5487 -4179 -2884 1217 1738 -1003
333 -1003 -5560 -1157 1191 -3336 -2239 1760 178 -1510 -1133 2164 5870 -1207 -2824 4918 3262
348 3262 143 99 110 169 -1585 -918 1497 -3168 -5646 1517 1424 -2977 -2328 -843 3279 2027 -2171 1149
366A149K229q97k76k216Q0J749j650P82j40o182K366M743j422k582k611L341L428
383A891j743Q63R55m037J262N233k93j763l722q27M757o70j703j037k387P40J416
400a065j57J739j379l622K897L449J86J33k892J78K447J152J377l954l776L853
416E66K363k713j962j391R23K613j093o76j092q17M969J734l281k179J88N205
432C357M040n631n984K085M580K510m064m888R55Q69J963K576k803l386j79K228
448a772N014J287m777k922J792M572K285m606j803J943j573n85K468J050j536
463H37n630j916P498M996m573o969j243Q839N166o196l363J436K265K290j347
478B090j834L8j398J007K319k675j489n38J146L867k655n062K858N004R98l752
$$ plain form
366 1149 3378 2481 2205 -11 69 1818 168 950 810 -5372 -3006 1737 315 -2267 -4878 -1537 1891
383 1891 148 1011 1966 -2071 -809 4424 4131 2368 -1354 -2181 2576 1906 203 -834 -3221 -2481 -1065
400 -1065 -1222 517 -862 -4484 -1587 1862 2048 2181 -711 -533 1914 3066 4443 489 -3287 566
416 566 2929 216 -1746 -3137 -2214 399 -694 -1370 -2462 -3279 1690 3424 143 -2036 -1848 3357
432 3357 7397 1766 -4218 -2133 2447 4957 893 -3995 -3040 -2171 -208 2368 -435 -3821 -4000 -1772
448 -1772 3242 4529 -248 -3170 -1378 3194 5479 873 -930 1013 -560 -1145 1323 2373 837
463 837 -4793 -6709 789 5785 1212 -5757 -7000 1839 7005 809 -2554 -1118 1147 3437 2090
478 2090 256 294 -1104 -97 2222 -453 -1942 -2480 -1334 2533 -122 -5184 -2326 2678 3676 -76
494g6m773L211N886O3k645m125j496O454K545l552l354k569K756M399j639k155
510a070r86k0K275p65N6L545j910l819J592K169K909j096m828l52J864J362K156
527C082k276l031k17n24L950M255n107n260J237N517M265n015n545L441M008p97
543A983j579j748K876O93n097J502M478j703k764r14K362J849l845J1M660k134
559F30l487O30L199L321m049n117M684M107k238l572o34N500J016p213r51O006
575A832K505k716o339m59P942J533m501k587j84L077J342n74K178k727o423L751
591b350Q273R92p668p543N027J0217j302p530m238K977O811l74n112p07Q07J371
607c49K644j858j305L41J52K137l06j680M35l79L85K270k901j953K160O87p0r29
$$ plain form
494 -76 -4849 -1638 4248 4311 1666 -2459 -3955 2499 5044 1492 -1862 -4431 -1675 2724 1085 -1070
510 -1070 -2056 -2076 199 -566 -510 3035 1125 -2694 -1102 1067 3976 2880 -1948 -2300 -436 926 3082
527 3082 806 -2225 -2442 -2966 984 5239 132 -5128 -3891 1626 5891 876 -4669 -1228 2780 1983
543 1983 404 -1344 1532 2225 -2872 -1370 3108 1405 -1359 -2273 89 1938 -1907 -1896 2764 630
559 630 -2857 -2227 972 4293 244 -4873 -189 3918 1680 -1892 -2526 2974 3990 -3223 -4174 1832
575 1832 4337 1621 -4718 -5177 2765 4298 -203 -2790 -2974 103 1445 871 3049 322 -6101 -2350
591 -2350 5923 6915 -753 -8296 -3269 6948 5646 -1884 -6122 -3145 3666 3292 -1820 -2527 -1720 -349
607 -349 2295 437 -868 -527 -375 1762 1456 -224 211 -168 217 2487 -414 -2367 -207 480 410 -519
625e19j992J788O68k47J560j392j644J770J150P82p43k136J299Q29q86O51J90
642A128j362j271j322L067K803m098k967K006K803J444j467k325L85J145K539
657B508R62l574j375K047J079P2j660j481J042m25n28J805r34j278K30J022J470
674I82m60j572J672P30j195J216J65q80p80Q6J521p89l019J771J672k494q18J492
692g00O32o81j305J994K041k159r44J692J900M4k888o14K666l2j237o18j151J61
710a199J208M6p36k083O82L560p88k357J208J396K19n21r3J195p31j413J905m1
728A457k040l02j98J572k87k500Q30J231n61M56K44m11L37K54J826J8l264J431
746I3K597j110j981k37R53R20j802j333K053j126o76J230l12O09l09n09K035P1
$$ plain form
625 -519 -2511 -723 -55 -302 1258 -134 -1778 -8 1142 1924 1181 -955 344 1173 287 938 1128
642 1128 -234 -1505 -2827 240 3043 -1055 -4022 -2016 787 2231 764 -1561 -1176 -31 2508
657 2508 3470 -104 -1479 568 1647 1719 59 -1422 -380 -805 -1333 472 -462 -1740 -1510 -488 982
674 982 522 -1050 622 1352 157 1373 1538 658 -122 -36 1485 696 -2323 -552 1120 -1374 -2192 -700
692 -700 -68 -749 -2054 -60 1981 -178 -1122 570 2470 2514 -374 -988 1678 1646 409 -209 -1360 -1199
710 -1199 9 55 -681 -2764 -2082 1478 690 -1667 -459 937 1156 635 542 1737 1006 -407 1498 1457
728 1457 -583 -885 -1083 489 202 -2298 -1468 -237 -798 -342 -98 -509 -172 82 1908 1926 -1338 93
746 93 2690 1580 -401 -638 315 1235 -567 -1900 153 -973 -1649 -419 -731 -122 -431 -940 1095 1166
764A166j455J136Q4j83N97m89k65o30q68J639j9k807P13J284m20J4j355J385J265
783G92j352P40O56q33J063K5p52R01j336k62J876j684q78Q42p38O12m84n41J433
802H0j170j33K009m77o50M49K53J080p2k056J410L66r67M12j025l39J434j156
820e52l2K03r93Q74R62r82M58l8j92J491j000l67J686j427J36P15p77K09k68j072
840i66R63k50m57P13r21J85J030q24N40M62r72P28K01l39Q00o73k07N36q16M75
860B08O82j635K91N67p57Q74m43m98P87l39j16R88j031O10M56j148J499j65j214
879c84O77n4l13O27o88k9L63n63L69j39p35J110Q9p21k9n36R45J173j078p80M81
900b15R3J226m94r88N83m80r2J424o51q36j90m53J709Q0j038j12n24K15J707l96
$$ plain form
764 1166 -289 847 931 748 1345 856 591 -39 -907 732 713 -2094 -1381 -97 -517 -503 -1858 -473 792
783 792 -560 180 836 3 1066 1091 339 1240 -96 -358 1518 -166 -1044 -202 -940 -328 -812 -1353 80
802 80 -1090 -1223 786 309 -341 108 361 1441 1369 -687 723 1089 122 534 -491 -830 604 -552
820 -552 -584 -381 -1374 -500 462 -520 -62 -100 -292 1199 199 -168 1518 91 227 942 165 374 106 -966
840 -966 -3 -253 -710 3 -918 -733 297 -527 13 475 -497 231 432 93 893 220 13 549 -267 208
860 208 890 -745 -454 113 -644 230 -213 -711 76 -263 -379 609 -422 188 644 -504 995 830 -384
879 -384 293 239 -74 553 -135 -164 199 -364 5 -134 -869 241 330 -391 -420 -956 -11 1162 84 -696 -215
900 -215 -122 1104 610 -378 205 -275 -367 1057 406 -430 -620 -1073 636 716 -322 -434 -958 -743 964 568
920E68r10J28k02R89J52r18R71o25p55P12M23K18q59j653J534J479j509j005M04
939h58R02N05j434J76J245k84j67K28m31L26J40n7R46p22j252J53O79O92m58k439
959b110P13J639L13J70j794p10K275P09n98j80n22L33K45k69J363n16k228J93
977i74J443J48l71k142M83J810q57M2K26j66K55m84P66J715j079j490R76M14N39
996A254o81j292L33N69o98M33q49o85J422J86k62l18n78J786R64j607N0M26L00
1015G53P03o87o64L86j366O89J291j469q21m42N77J881j003j313O97O24P81M42
1033A059j103L17O58p16Q82l06o25O91j224n07J285k82n07o89r16K163L54j823
1051a289Q52O70J64p2o15J364O93k401K73K057o71r62j141O04J773j662j783J796
$$ plain form
920 568 -342 -214 -416 573 725 -193 778 153 -602 110 533 751 -108 -1761 -227 1252 -257 -1262 -858
939 -858 44 549 -885 -709 536 252 85 313 -118 208 348 291 1237 515 -737 -584 95 787 329 -2110
959 -2110 -1397 242 555 725 -1069 -1779 496 1205 607 427 -95 238 483 214 1577 1061 -1167 -974
977 -974 469 617 246 -1896 -1413 397 -460 -418 -192 -358 -103 -587 179 1894 815 -675 301 715 1254
996 1254 573 -719 -386 183 -515 -82 -931 -1616 -194 -8 -270 -588 -1166 620 1584 -23 27 453 753
1015 753 1456 769 105 491 -875 -186 1105 -364 -1185 -1627 -1050 831 -172 -1485 -788 -164 617 1059
1033 1059 -44 273 931 215 1097 791 166 857 -367 -874 411 129 -378 -1067 -1983 180 534 -1289
1051 -1289 -437 233 397 325 -290 1074 1767 -634 -361 1696 1025 63 -1078 -474 1299 -363 -2146 -350
1069c50M47l47o77j68J587J53j097J279j11q73Q46K80m2k06j302N75O52j139K99
1088a94l23o19N66L75l93M63j009J151J182j520J78J135P2l02p34L46J226j435
1106A65j075J282m61m86K2j79N88o45p24J902k02j065P33O92N29l55q70J147L2
1125A030j422P02N47r79k23j47M54qj438P98J163j063l30O82O08J77j153N37J309
1144A244p77m42P48j22m93k43k76J012q18r44J220q7o19n2J85N64o1q34J281L07
1164G93j142N18M81m21J31k76N87r4j447O86M22m51j47j55M58J33j027N74J152
1183G75j123j99Q55M8K10m30k08J069j041n20J291l65o74l31M35O29o85q75J057
1202h2K84o94J50P5J65K27n11P77Q2p81L89K41op1n42N00K00j073N51N20o47k9
$$ plain form
1069 -350 97 -250 -927 -1095 492 645 -452 827 716 -157 689 969 927 721 -581 -6 646 -493 -194
1088 -194 -517 -1136 -570 -195 -588 -125 -1134 17 1199 -321 -143 992 1064 762 28 374 1600 165
1106 165 -910 372 -89 -575 -553 -732 -144 -789 -1513 389 187 -878 -145 547 1076 721 -149 998 1030
1125 1030 -392 310 857 -122 -345 -492 -38 -46 -1484 -686 477 -586 -916 -234 374 551 -602 -65 1244
1144 1244 467 25 773 651 158 -85 -361 651 -167 -1111 109 22 -597 -649 -464 100 39 -795 486 793
1164 793 -349 169 650 229 360 84 671 577 -870 -184 238 -213 -360 -515 -57 76 -951 -377 775
1183 775 -348 -547 308 356 566 136 -72 997 -44 -564 727 362 -312 -643 -208 421 -264 -1139 -82
1202 -82 202 -492 -342 -267 -102 125 -386 391 473 -308 81 322 316 245 -297 203 403 -670 -119 401 -246 -275
1224b75J38l9N57o36k20Q21n41k4O04n60L85k05j51Q47m72o10R52n61k65N59p37
1245d33N09K4q00P84O5q50O71J0l0J72m99L72O62q09K15J84l17N18m32j99Q99
1266G16j082j05Q58m30k45m0p4M44k55n52J191l08m55O05k41N31L0p44P90J13
1286G47j131O84K7n24L89o42J0O78j092K81Q75p16N1J91k6R78p02j5O58l49j58
1307B14L10o76L76l0n78O93n72p09P44n5k65M49l35J72N36r01J073L78q61M87
1327D50J28j4Qo52K41M92j172K3O94p60J63j03N0M78p17K11R91k59j90K77o8O60
1349I31l93n67P71j58o66M68j13m11j77n36O44j45o25R19j6n12Q48j68L73P0n97
1370f0P75n9m52R2J41n99L59m98R0K12r09K03R38o67n5M66N3J13O5N9N71k87m18
$$ plain form
1224 -275 -137 -176 381 -255 -475 346 -195 -219 385 -175 210 5 -146 701 229 -381 571 10 -255 304 -433
1245 -433 76 100 -700 84 149 -701 -30 -20 -50 122 -377 -5 657 -152 63 247 -70 448 16 -183 716
1266 716 -366 -471 387 -43 -288 -328 -402 42 -213 -765 426 118 -337 268 27 558 588 -156 634 747
1286 747 -384 300 327 -197 192 -450 -440 238 -854 -573 302 -414 -363 -172 -198 780 78 63 721 372 214
1307 214 524 -152 224 194 -384 309 -263 -972 -228 -283 -548 -99 -434 -262 274 -627 446 824 -37 450
1327 450 578 564 572 -80 161 653 -519 -496 198 -562 -399 -502 -452 26 -691 -480 511 252 62 339 271 931
1349 931 538 -29 742 584 -82 386 273 -138 -315 -851 -207 -352 -977 -58 -74 -586 262 94 467 537 -60
1370 -60 715 656 204 296 437 -162 197 -301 -211 1 -908 -705 233 -434 -489 -23 30 143 208 267 838 551 133
1393A33N74l44K3j92n70N94l54m65L59j35L7K8m36M06L71p72P33M21l41K81J80
1414E31k53L93m67qr1o7L1J73q12N8K19l3L40o02j2P72k02L9L12k83O29p8o13
1437b4O27J3p87O03k94q2k25l94L29J96m44L54l0q7J41J03l8L54k3N3J55l30J72
1460C42K49o29q7J17j27J39p65J53R17n63j74l8K07M53k75l43Q68k57q7M49l70
1481A79L42j82o18N38N3p33K78o5L2J62o47M35m8p7M50J64l48J42k0kM46l11K47
1504D17P8n70K2K46l39J78l17j90N91m01m22Q31k59rP1k42P55k63m94P56o2m21
1526d4J50n6r9J06m57K02M71o04K76K78o53M71j06k59M48k23N9L44n61K36M00
1547C79n06N01k61l04Q61p95m02O61lk64P0j44N40j64o92N93j26j48K61k50L42
$$ plain form
1393 133 707 363 386 194 -376 218 -136 -601 -242 -377 -340 -312 -748 -342 29 -743 -10 411 70 351 531
1414 531 278 671 204 196 105 38 69 242 -570 -512 -293 -326 14 -588 -600 172 -30 9 321 38 667 589 -24
1437 -24 603 616 -171 432 138 56 -169 -563 -234 -38 -482 -128 -158 -245 -104 -1 -39 315 292 345 500 170 342
1460 342 591 -38 -125 -8 -135 4 -761 -608 309 -254 -428 -466 -259 194 -81 -424 444 187 100 549 179
1481 179 521 339 -279 259 312 -421 -143 -208 -176 -14 -661 -226 -274 -351 99 263 -85 57 37 35 481 170 417
1504 417 495 -75 -53 193 -146 32 -285 -475 116 -285 -707 124 -135 -144 -73 -315 440 177 -317 439 377 -44
1526 -44 106 50 -49 57 -400 -198 273 -331 -55 223 -430 41 -65 -324 124 -99 -40 304 -257 -21 379
1547 379 -127 374 113 -191 670 -125 -527 134 131 -133 -63 -207 333 169 -523 70 -56 -204 57 -193 149
1568A49J43n99L46K32l69J00R8l05M49k63n7L03o13K50L32o67K47J98k55K94k30
1589b17o8Q23m95l97P35j59J44M5p06Q31k70o41O16j45m20L53l60J00K80q28P83
1610DK12o88N89K3j37K11j69O2L32j87j25N5j08J7k6l18J20k51m3M30m32J30K40
1633e9m04P26r8j17K35n0j85N33l48J4Jm02L18J55p10K18r3j16K68k69O7J46l45
1656e15N65K76k44o2M74j06J0l94M27Q1m39j45K11m95r1R6j25L43k77j30N44r9
1678i5j24L99k3J05K02l16L08J69p23K75O2k01N8n30R6J86k81R4K46j87J20J51
1700ij23N91k52J48K36l69L8J09K1m3k65l11M72o09k24L95l1k35J56j29M96lr6
1723c7M31L9o31O05o0j1O6l50L91q2p90O3L14k1l67j05L0O29n26o9P09j64K5L17
$$ plain form
1568 149 292 -307 39 271 -98 2 100 -205 244 -19 -76 227 -386 -136 196 -471 -224 -26 -281 13 -217
1589 -217 -285 538 43 -354 381 222 366 411 -295 536 266 -375 241 96 -324 29 -331 -231 49 -779 4
1610 4 216 -472 117 140 3 214 45 107 439 252 127 182 74 91 65 -253 -133 -384 -427 3 -429 -299 -59
1633 -59 -463 263 165 48 283 233 48 581 233 247 248 -154 164 319 -391 -173 -266 -382 -114 -383 -316 -170 -515
1656 -515 50 326 82 20 494 388 398 4 431 512 73 -72 139 -356 -447 -351 -476 -133 -410 -540 4 -95
1678 -95 -219 180 157 262 464 148 456 625 -98 177 239 38 96 -434 -338 -152 -433 -339 -93 -280 -160 -9
1700 -9 -132 459 207 355 591 222 260 369 390 347 82 -229 243 -366 -590 -195 -226 -461 -305 -434 62 59 -37
1723 -37 394 433 -198 407 347 336 402 52 443 361 -429 -366 -52 -73 -440 -545 -515 114 -412 -481 228 64 89 406
1747D06l51N89j67l78N68n71n4o8k18J66o4o06O24k4n58O82q0j95M27l34L98J55
1769C47n78Q28k3o17K76K7m9o5l87J07O2m56K86L10k89J60k78L7P35n43lN41r7
1792C31k85J55r3K11k12l05K55om67M17j77M0j20k55L22K32m62M88K91m60L76
1813B76k98L27J06k83q3K86k65k27J53k84J89k05j78O73n86L6N13k44K7K96k81
1834e2L29j75k23M01k13j85L89n3m6j44k56K36J2n35M72k00O3K13l46L57J91l12
1856g7J44L29l56j6J26J22j71l09K57M0k56k5L58m05K8J37j63N64n08k53M59q8
1878f3k01L63j26J04n7l26N84j82k92M35j06k02J19k90M01q5l59K03J15k48P1
1899a42J74k47J99J92l59K64o1j10J17j94K56J63l94M04k84j17K29k81l2K02M4
$$ plain form
1747 406 55 644 477 99 667 96 42 -26 -244 -78 -142 -748 -124 -148 -706 -24 -104 -299 128 -206 192 347
1769 347 -231 597 574 -43 233 260 211 146 -241 -134 -72 -528 -242 68 -221 -61 -339 -302 433 -110 -113 428 331
1792 331 46 201 108 319 107 -198 57 51 -416 1 -176 -136 -256 -511 -189 43 -419 69 360 -100 276
1813 276 -22 305 411 128 45 331 66 -161 -8 -292 -103 -308 -486 187 -399 -363 150 -94 -67 229 -52
1834 -52 277 102 -121 280 67 -118 271 218 172 28 -228 8 20 -515 -43 -243 -180 33 -313 44 235 -77
1856 -77 67 396 40 24 150 272 101 -208 49 89 -167 -192 166 -239 -211 -74 -237 327 -181 -434 25 -63
1878 -63 -264 99 -27 77 20 -306 278 96 -196 239 133 -69 50 -240 161 76 -283 -80 35 -213 -142
1899 -142 32 -215 -16 176 -183 81 20 -90 27 -167 89 252 -142 262 -22 -139 90 -191 -223 -21 23
1920B3q7J20k42K93J03l59K31O3l3ml09M30N9k65N7mJ07k94j16Q7J13m0k10N5
1944b22QJ0J51j28P17m23p9K24p7J78k13j06L7j7k51L43l06k53J86J46m74O18
1966F9l27J79J42k16J87J67j14J31K3K7k7k02J17K34m90Q7k5l77K91k22m1L92
1988Em10K77K35p7O2K42k65L32k26j86N52k60l28K18k52K4J81n41K47N7l70K88
2010a95J91j59J53O8l3J95k28L64J60k43L4Rl48K73j55m77L74k08k21M15n54M59
2032a26M6l53M60J0J5R0q9Q1M45n03J73J17n98L39K8m86M25k28j57K47j68n0L00
2055A8m15M24M0M5K3K27m37M74l36j26M72o36J08L44m74L07k02l29L30k95J2M75
2077D9m38N28J26m22M14j1k77M24k40l72N37m65J82j70n0j47M81n12K09%l36O15
$$ plain form
1920 23 -64 56 -186 107 210 -149 82 145 112 108 -201 229 288 23 80 76 183 -111 -227 -140 -27 -67 -277 -222
1944 -222 -214 -204 -53 -181 536 113 34 258 181 359 146 40 77 60 -191 152 -154 -407 -221 -75 -549 69
1966 69 -258 -79 63 -153 34 201 87 218 241 268 241 39 156 390 -100 -13 -38 -415 -124 -346 -387 5
1988 5 -405 -128 107 30 92 334 69 401 175 -11 541 281 -47 171 -81 -57 124 -417 -170 -113 -483 -195
2010 -195 -4 -163 -10 58 25 220 -8 356 516 273 307 316 -32 241 86 -391 -17 -225 -446 -31 -585 -126
2032 -126 -80 -433 27 37 52 142 53 134 579 76 249 366 -232 107 135 -351 74 -154 -311 -64 -232 -282 18
2055 18 -397 27 67 112 135 362 -75 399 63 -63 409 -227 -119 225 -249 58 -144 -473 -143 -438 -426 49
2077 49 -389 139 265 -157 257 246 -31 393 153 -219 318 -147 35 -135 -185 -332 149 -363 -154 -154 -490 125
2099A25j88k32M75k33J02L64k93K00r1k73L18k82n8J95l54k12N34n52K03L27l67
2120b92K01J26l14N48j67o5M15l93M9J20r2npl65K66p4j87K47j69j18L94l40J96
2143b6N3j61M14j42j22L16k83J21P6j45j79J89l00qJ57l23M12J15l23K96k34k62
2165c59L61k33K52R0k96J79L68k30K4p3JR8n26M38k9j76m6J40j15K87k88p2L34
2188A29l24L3L47j15M1k06j62O08n29J42J63j62j23K18k62J66k3o0J99K7k66J25
2210c4j41L8K54ll54P00o53L22K33l07J38o8J33j47k79R1K63k56p0K01k21L5K92
2233A67l17K91k57k3J65k7J67k44m0L48P2m07L61j41j23J08k24j8J65p1j58L50
2255A44k61R1J5l69N39j94J02Q0j45K25j24k00p9L18k53J30o3j08N71m86l00K32
$$ plain form
2099 125 -63 -295 180 -53 49 413 120 320 229 -44 274 -8 -66 129 -225 -437 97 -455 -252 75 -292
2120 -292 -91 35 -279 269 102 37 452 59 108 228 136 131 124 -241 25 -49 -236 11 -158 -276 118 -222 -26
2143 -26 27 -134 280 138 16 332 49 170 246 101 -78 111 -189 -197 -40 -363 49 164 -159 137 -97 -359
2165 -359 2 -231 21 111 -185 -6 362 132 156 83 84 182 -344 94 65 -111 -157 -17 -132 155 -133 -205 129
2188 129 -195 -162 185 70 111 -95 -257 351 -178 -36 127 -35 -158 60 -202 -36 -59 -119 80 107 -159 -34
2210 -34 -175 -137 117 114 -240 460 -193 129 362 55 193 125 258 111 -168 -77 186 -70 -140 61 -160 -125 167
2233 167 -150 141 -116 -139 26 -1 166 -78 -118 230 302 -105 256 115 -8 100 -124 -142 23 -48 -206 144
2255 144 -117 -26 -11 -380 159 -35 67 147 2 227 103 -97 -176 142 -111 19 -44 -152 419 -67 -367 -135
2277a35pK26k4l69L24L58o07M07n8j75J02N0R1p3k79K88J00l00J32p7o9n8o4R1
2301a26J27L6k53N85l87l0L29j27J27k73Q5K20m28R3P5l24K03J24m92N00j02m63
2323e01M28j83K05J79j52KK45k84K21p9j46J90l6l4Qj40l1J35k82n7J41q7K11
2346d7LKJ06k10K9L42K76n76K44J01k05k5k39K11P6l51K23l79J46L28k87R0k4
2369a66j19M38L2j11K47j48j91K72k49K57k46j65Q5L2j79O9k06L17p6J1J0J30
2391D4j55K11J20k42K61J5j75J26j89J00J6n9Oj86k45J58K29j18r4K4OK11o0j94
2415a90M88j12q7K22k15K77l80o8K17l59l3K28l08J35K65k14N4J09k24M16k4j76
2437B1J48j73J36J31j50j48Q2l56M43j04r5j44J61j91J49p5j47M41k31M5J64j39
$$ plain form
2277 -135 -142 84 60 -309 15 373 -234 173 115 -60 42 92 183 110 -169 119 219 -81 51 -26 -95 -153 -217 -126
2301 -126 1 37 -216 369 -18 -48 281 154 281 8 93 313 -115 -22 53 -271 -68 56 -436 64 -38 -501
2323 -501 -73 -256 -51 128 -24 -22 223 -61 160 81 -65 125 89 55 63 -77 -108 27 -255 -312 -171 -258 -47
2346 -47 -44 -42 64 -146 -117 225 501 -75 169 270 65 40 -199 12 88 -263 -40 -419 -273 55 -232 -142 -166
2369 -166 -285 153 185 74 321 173 -18 254 5 262 16 -149 -64 -32 -211 -142 -348 -31 -107 -96 -86 44
2391 44 -111 100 220 -22 239 254 79 205 16 116 132 73 79 -107 -352 -194 35 -83 -177 -153 -147 64 4 -190
2415 -190 298 186 99 321 106 383 3 -65 152 -207 -240 -12 -320 -185 80 -134 -80 29 -195 221 197 21
2437 21 169 -4 132 263 113 -35 47 -309 134 30 -65 -209 -48 -239 -90 -165 -312 129 -102 -57 107 -32
2459c2K00n6P6J53m24J76P1j65q5j12J90j5Jo7J21%j37J24k77M5M41k54j5Q4k63
2484b20L33O8k29K42k55k0J10p4j0k8L5Q6j61Q6j49M7K01J14j84KK24j31J0p4
2508B3n5J11m6lK52l96O3J80l56ON5p3J53L4j35N3J15l7N33m47J9J07k34K15J03
2533B40k07k7J92n07M52l66J83K14k72R2M3k55M69n18L49J04l15o4L04m7l2j7
2555A5Nj4L81n49K29R0q3nk36L32N0l23J4K12n21L21O0Q9M5l35J72J53j44K36
2579A94nj52J82n1k89K21j28j98K63k01l8J61J9J08j26m1J24K17m05K76j23J91
2601A99R4l27L23l53kJ91j5j62k0J87l76J0%L91J54l19p6J31o0J17J19q6Nk23
2625i8M4K54k17N5L7j70Q2p2L8J52j14k04K87j59J58J5j97J18l5j63L09J8k13
$$ plain form
2459 -32 168 112 188 341 -83 93 164 -1 -86 -198 -8 -23 -22 -89 32 32 -105 19 -258 -213 228 -26 -41 43 -220
2484 -220 113 181 -48 194 -61 -81 29 -45 -55 -83 -48 38 -123 -37 -186 -139 62 176 -8 -6 218 87 97 23
2508 23 -32 79 33 30 282 -114 -51 129 -227 -221 -166 -239 -86 -52 -187 -134 -19 -56 477 30 49 156 -78 137 240
2533 240 33 6 198 -309 143 -223 -40 174 -98 -6 37 -218 251 -267 82 186 -129 -193 111 64 32 15
2555 15 20 6 387 -162 67 157 74 69 -167 165 215 -108 -94 118 -403 -82 -22 67 112 -223 -51 102 -42 194
2579 194 189 37 219 168 -121 100 -28 -226 37 -164 -202 -41 -22 86 -40 -81 43 260 -145 131 8 199
2601 199 293 -34 289 -64 -66 125 110 -52 -72 115 -261 -251 -251 140 294 -25 -101 30 -30 87 206 120 125 -98
2625 -98 -54 200 -17 38 75 -95 -13 -85 -47 105 -9 -213 74 -85 73 88 -109 9 -26 -189 120 138 -75
2648g5q8J88r6k8j88k5K90j27J63k75J01L7M7p9M27k87Q9M40k92m5j4p9R3j5j95
2673c3J1j02j01J38Jo3J16k73K62q8Q9J3L06j50j9J65j79n4p3oJ86k47O7l6j66
2698b36J53j57J41J02l79K73K31j51L01o9q3p5n6%K94k79J32j17N4k8l94J66K51
2721G4q3j5j79P1J81J45j2j75J54q6K19k17Lo0rJ84k38j54K13q2N6j45K02k13
2745a66J38m8j72L72k38J64R4k5O2k30K9K92l36n5K15j04k55L16k48J27j04q0
2767b52K22J15m29K83r2J97J85pMq0l29L25j72r9K51k69j9Q2j85j4K83j83K37
2790E4p0No1K86j86L1K76l62J70q8K4O8k71nK03j79K07j92j98P5J98k5J68j20
2814Hk3J34k75K86K9l21K84j33m3M00l84R0j34j12K60l50J10J64j69J54J29l76
$$ plain form
2648 -75 -163 25 -71 -99 -287 -312 -22 -149 14 -261 -160 -123 -76 -155 272 -15 74 514 222 177 163 84 177 162 -33
2673 -33 -22 -124 -225 -87 -86 -149 -33 -306 -44 -132 -43 -30 276 126 107 272 93 39 -34 -40 146 -101 -34 -70 -236
2698 -236 -83 -240 -99 3 -376 -103 128 -23 278 209 126 51 -5 -5 289 10 142 25 79 51 -343 -177 74
2721 74 -9 -24 -203 -132 49 194 182 7 161 75 294 77 80 20 11 195 -43 -197 16 -66 -10 -155 47 -166
2745 -166 -28 -76 -248 124 -114 50 144 119 181 -49 -20 272 -64 -119 96 -8 -263 53 -195 -68 -172 -252
2767 -252 -30 85 -344 -61 -153 44 229 222 226 146 -183 142 -30 -129 122 -147 -166 -84 -269 -283 0 -183 54
2790 54 -16 -11 -72 214 28 59 335 -27 143 55 79 147 -124 -129 74 -105 102 -90 -288 -213 -15 -40 128 8
2814 8 -15 119 -156 130 159 -162 122 -11 -54 346 -38 52 -82 -194 66 -284 -174 -10 -179 -25 104 -272
2836b72K13N2l9R1P7j6R6j48k66K49j98N5N7J09j67N5R0j19jj28J29l8J38J13
2860A32j83J97p8k15K7J25P5N4O8k51J46l1r7Q6l5l04M36l15L10n4j52K36j11
2883F6j0n1M0Q4J15l22N1j7k04J88L05l05J01j72L62k95Q3j59K72l11J27j02N9
2906i5J24K78l33Q4j06j19L31k76J85p7q5L06Mj73J22l33J5K13j93k3M81l51J4
2929gl4k25O20k70j9k20J58L1J49j27p2J11j53P9j90J17k8Q0k54K48j4k10J91
2952c9Rj9J84l15L42OrJ56l25K3J80k99J48k09L7J38k38j62L00j47J36K23o1j28
2976f9J74j92O3K27k02J87r9j55L41j22j84J17j97j64K17kJ52Jn2j46K07k22J38
2999A8O1J67j93J20j22Q8n5J83k57k57J35J5j58K18l70L66k5j25R5J09j51J43
$$ plain form
2836 -272 -59 -7 -46 45 122 106 202 54 -212 37 -161 -106 -49 60 -107 -52 38 -81 -82 -210 -81 -119 19 132
2860 132 -51 146 68 -147 -120 5 80 134 202 -49 97 66 -31 55 20 -284 152 -163 147 93 -59 177 66
2883 66 56 5 45 129 244 -78 -27 -44 -248 -60 245 -60 41 -131 231 -64 19 -140 132 -179 -52 -154 -95
2906 -95 29 307 -26 58 -48 -167 164 -112 73 -4 -89 217 221 48 170 -163 -148 65 -128 -151 330 -21 -7
2929 -7 -41 -266 354 84 65 -155 3 34 183 56 -16 95 -58 21 -169 -52 -80 0 -254 -6 -20 -230 -39
2952 -39 -30 -49 135 -180 162 168 159 315 -10 13 193 -106 42 -167 -130 8 -230 -392 -92 -239 -103 120 59 -69
2976 -69 105 -87 -24 203 1 188 89 -66 275 153 -31 86 -111 -275 -58 -60 92 93 41 -105 102 -120 18
2999 18 79 246 53 173 51 139 84 267 10 -247 -112 -97 -255 -37 -407 -41 -66 -191 -96 13 -138 5
3021EJ5J82Q8l65J11J49k31J55j73q9J82j73J2J19j08j20L18j87k9K37l07J67
3043d2K69j05J19q5j03J18l18RM4m2L5L2j62k8O2O3J03l5J3K25k53J5L38j19q5
3068F8j13J03M7j13j53L16l65J52O7k09M5K27r0j60J58k55N26q7r0M2j82K45j85
3091fQJ87j95J5l2l12J64L25p8k5j21p5K12q4m1J47j05oP6n6j6J51p4j28K31j39
3117B3Q5m10R4J84j63J67oj08K04q0j59L37j4j71J48o4j42J21j91L21l38J32p
3140c7p9JJ88m22M36L2j71j26K01n1J60n3m8J39k8j67P6N9j70r3J13J05k68K29
3164B6Qj2j12J90j3q3k5n1R8M3R1j83J96o3k06J26n4J3rJ07J04j58k5L4P9O9k68
3191g8l7Q3mQ2k6P9j03P0j8j60J41j6R0P9k31O5K0k00K71q1k37L97m02K77J18
$$ plain form
3021 5 20 202 290 -75 36 185 -46 109 -64 -153 29 -144 -132 -13 -121 -241 77 -110 -139 98 -209 -42
3043 -42 227 122 241 156 53 171 -147 -138 -94 -136 -101 -69 -231 -259 -197 -134 -31 -66 -53 172 -81 -66 272 153 68
3068 68 -45 58 105 -8 -161 155 -210 -58 9 -200 -155 72 -18 -178 -20 -275 251 164 74 116 -66 179 -6
3091 -6 2 189 -6 9 -23 -335 -171 154 76 51 -70 -145 67 -17 -58 89 -16 -22 54 -2 -18 133 59 -69 162 23
3117 23 108 -302 -208 -24 -187 -20 -26 -134 70 -10 -169 168 154 -17 131 67 -75 46 -145 176 -162 -30 -37
3140 -37 -116 -115 73 -349 87 119 -52 -178 23 -28 132 79 31 170 142 -25 51 110 -60 -153 -40 65 -203 26
3164 26 34 22 -90 100 87 4 -21 -72 26 69 160 -23 173 110 -96 30 -24 -11 -20 87 191 33 8 42 121 190 -78
3191 -78 -115 -32 -36 46 20 99 -4 66 48 -112 29 13 103 182 -49 16 36 -164 107 26 -211 186 -216 61 179
3216A79l16K04p8j02Q8j89K09J05k28l8J31N4J80k79p2K34N2K4q1q7p0k61K85
3239e6K05l72L16J43k69K03k4j65J36j34O6o0N2j32O4n6r7N6J11J7m1K9j57J79
3263A4j1O6K2j22J09j75L56k3j13p8kk7M0J17j37Q9l3m4j64K9M2J66k91J72l3
3288c1J17m4R1j02L0n6J99j94J58j87J59l66K99j23K7M2j16J96nk03J48N9j01
3311cJ25q0L5J19k1k0k13k9J45R8k77n2J17pJ29j2j73L7J38n3k5N1j65L93k64
3336gK09r3J4K4j20n1J6Q5j84K6r2R6K1q2o9K23j34N7J27j24N1J18J2nK7N8j36
3363F7r3L6m1l3P7o8l14L16l2L7M2J27l58L54K4m9m5r9L17j61n0l6j28j60L72
3388A02k68J92r0P2j28p7m1M98l42J84k17j63K49J73q5k5J4j82K09j16J05o3k74
$$ plain form
3216 179 -137 67 -11 -113 -25 -214 -5 100 -128 -166 -35 19 199 -80 -152 82 134 158 77 -10 -80 -341 -56
3239 -56 149 -223 93 236 -33 170 146 -19 117 -17 49 -11 41 -91 -27 -83 -180 -124 -13 4 -37 -8 -165 14
3263 14 3 69 91 -31 78 -97 259 236 123 45 43 16 56 173 36 125 92 48 -116 -87 -45 121 -170 2 -31
3288 -31 86 42 133 31 61 5 204 10 168 -19 140 -226 73 -50 -23 19 -97 99 94 -109 39 98 -3
3311 -3 122 42 77 196 175 155 -58 -87 58 156 -121 -173 -56 -63 66 54 -119 -82 56 3 -22 29 -136 257 -7
3336 -7 202 109 123 147 27 -24 -8 77 -107 -81 -173 -77 -56 -138 -207 16 -118 -61 66 -58 -7 111 123 118 145 203 67
3363 67 -26 10 -31 -64 13 -55 -369 -53 -85 -48 -6 121 -237 117 141 92 47 -52 265 104 54 18 -110 -270 102
3388 102 -166 26 -64 8 -120 -197 -238 260 -82 102 -115 -278 -29 144 59 34 48 -134 75 -41 64 1 -273
3411b73j1J82K67j65j40O7R2l2N4L1rq1M30l45L9n3N8j37K59j26q9j37J78r3j99
3436b33J33j10K24P5m0m03L59J21r3P5p7j01J49M7N6k64J52pj73K3m5j17J54K
3460i3J5J75j47P8K17k4m13M39k81n5K70j70j43M14l47M8pR3J07j54O7j14j01
3483a26rJ99j8J16j54m9O9J21l1q0j83J40Qj80p5M04k99J42q1K26j62M3j83L05
3507A43k88P3K30j20rM3m1l6J19r3J25j72k22K09Q7j85Q2J57qj63O7J8J01j51
3531c4M6m0J13j56J65L4J0k76K24j99j00O4J86J20L0j30l7J19k48J46j33N4Q9
3554D7J73k37LQ3j14o6N1N2J26j23K41l09j60K26M4k21J83j04O2L5L0M2j53j13
3578b02J20mK20J7j66J00k17M4J04RrK74l83J10l7L5k13K02k6L6rp9q8l8J40J33
$$ plain form
3411 -273 -284 -102 165 0 -140 -73 19 -13 41 72 63 -18 412 67 106 53 111 -26 233 107 18 -119 59 -34 -233
3436 -233 -100 -210 14 89 49 -354 5 126 33 108 31 -70 79 126 182 -82 70 63 -110 -87 -132 -249 -95 -93
3460 -93 -78 97 -50 28 245 221 -192 247 -34 -89 181 11 -132 282 -65 -17 -24 69 176 22 89 -25 -126
3483 -126 -135 64 46 162 8 -41 28 149 118 38 -145 -5 3 -177 -252 152 -147 -5 -86 140 -22 21 -162 143
3507 143 -145 -72 158 38 29 72 31 -5 114 21 146 -26 -248 -39 48 -137 -55 102 94 -69 -2 16 117 -34
3531 -34 12 -28 85 -71 94 128 138 -138 86 -113 -213 -149 37 157 187 57 20 139 -109 37 -96 -42 47
3554 47 220 -17 -14 69 -45 -111 -60 -8 118 -5 236 -73 -233 -7 37 -184 -1 -105 -43 -8 22 64 -89 -202
3578 -202 -82 -86 134 151 -15 85 -132 -88 16 25 16 290 -93 17 -20 15 -198 4 -22 14 5 -74 -162 -200 -60 73
3604G3p2J2K01J7l02L30k87K18j85k36K60o0Rr1J78j47l2Q2oJKK6J18P6l9j83
3630c7Q8R3R9L2l18K0j09J85k65J37m2j31L60p0o8K5Q9p8J67k10L09nj57q1n2
3655a9j2q0O7k1p8kK05k54m0K66j44K34j97J31N1n0j99K83j19k02J10J49j15j51
3679a87K66k82J49J6N9N1n2o9J80j22J42Q1k07jQJ04j32j74M29j39j00m2k70m3
3703c35K79O0l34J69q7O5L77m20M18l95K32J65K0k15O8m0k08J87P2O5k02q3K98
3726A56k16n7J91k36k8J18q6J91m5O6OR8P9n4k83N9J24j00m8K79l53J83K7m22
3750c51M40k37jJ11J03P9m4r4J41j19j36L06k93J1L46l58L9K14n30L46p4J23K4
3773D6K22k82K04j59Q3Q6k01j32K61k10R0K15j76J29k03o8K28o1j17L3O9n4m2
$$ plain form
3604 73 1 13 214 231 -71 259 -28 190 5 -231 29 -31 -22 -113 65 -82 -114 -32 -38 -37 -35 -9 109 185 146 -37
3630 -37 51 144 243 275 -43 -23 -132 53 -212 -75 -117 -248 112 42 -26 -1 88 10 177 -33 276 271 114 33 -19
3655 -19 -31 -111 -44 -65 -143 -145 60 -194 -234 32 -112 122 -75 56 107 57 -142 141 22 -180 -70 79 -36 -187
3679 -187 79 -203 -54 -38 21 72 20 -49 131 9 151 232 25 24 32 136 4 -170 259 120 20 -22 -292 -335
3703 -335 -56 4 -330 -161 -248 -183 194 -226 192 -203 29 194 214 -1 67 27 -181 6 78 143 -59 -142 156
3726 156 -60 -117 74 -162 -190 -72 -158 33 -12 54 60 158 237 183 -100 -41 83 -17 -65 214 -139 44 71 -351
3750 -351 89 -148 -149 -38 65 144 100 6 147 28 -108 198 -95 -84 262 -96 -57 157 -373 -27 -101 22 46
3773 46 268 -14 190 31 114 200 -1 -133 128 -82 8 223 47 176 -27 -95 133 72 -45 -12 57 3 -39
3796c9m2J73o2J22P6j32O3j29j41m0J98r9k4J04k1n1N3n4O2J40l05L05k40J54
3820G1n1j40K03p7j81L56j64M5J4Q8j88L9l7l4Q9n9n6M4j42J6L16n2k8j12Q4J5
3846E9n4J70l28J56J70j16j6L9j81ON0j1J9L9qq2K00j96K67n2j56J73Rj56J59
3871A60Mj33K46q1l02L98m15L35j17k96K90k29J93k58J57L1P0k27L08j69L0L2
3893B7k18K03J08j50j27K55k24L4K9q0J63m1M2rOJ2j51R4o7K03n3J09N8k62J20
3918H1j15K04k55J94j07Q3j43L9p5l0J3N8j30K92o0j38Q9M6j20L7P6M8K3J32l14
3943g2k21L92N3k34L5J24j60J89l23J4J54K37l44M19j58kJ12k35j33K91j22O7
3965H3l0k75K49j82R5K01k71NJ29k55N7L02j69K2k1N0P8j50Q9L3R5p8M1j98J41
$$ plain form
3796 -39 -81 92 30 152 228 96 159 30 -111 -151 47 -52 -76 28 7 -44 9 -45 17 157 -148 157 -83 71
3820 71 20 -120 83 6 -175 181 17 62 76 164 -24 15 -22 -56 33 -26 -82 -38 -180 -164 152 100 72 -40 44 59
3846 59 5 175 -153 3 173 57 41 80 -101 -95 -45 -56 -37 2 -6 -88 112 -84 183 131 -25 148 157 1 160
3871 160 164 31 277 196 -106 292 -123 212 95 -201 89 -140 53 -205 -48 -17 53 -174 134 -35 -5 27
3893 27 -191 12 120 -30 -157 98 -126 -92 -63 -143 20 -21 21 12 18 30 -121 -27 -94 109 56 165 223 -39 81
3918 81 -34 170 -85 109 2 85 -58 -19 -94 -124 -111 -53 -183 109 49 -89 0 46 -74 -37 39 87 110 242 -72
3943 -72 -293 99 152 -82 -47 77 -83 106 -217 -203 -49 188 -156 263 105 103 215 -20 -153 138 16 83
3965 83 53 -222 27 -155 -60 141 -130 -125 4 -251 -194 108 -61 -39 -60 -10 68 -82 7 40 135 57 98 -100 41
3990D1n7j03P3O5j43J9j27J99k36K39m0R9p2R8J6j54J10k16K43J77k87L34k27
4013E1k42L50j22j48K16j86N0J31l57P0J07m3K49M7k39K18k41O9J19p8J9n1l4
4036d5O6k1k65j5K32J31j20N8o8J1J22k02Q2N1R0r9K6K07j58k87K5L27j4k79J56
4061A1j5J5n9o1J19J8r8j69m6L80j75K16j6j01k7J90l01J67k09J59l05K90J12
4084I5k3j08J76j94J88j27oK0n1N9J86N0l92J72R1p7k1M1k61K11j14LJ57p9J47
4109A43j11k7j77L29j84N9K46l26J31o8J34j03j84J98j08Q6qn1j12J42j21J46
4131C4K53k94K1R2j1K37l07j70J71j42J55J2K9J7k0k79J07J52j36L7m1Mj16J98
4155CJ32m9j20L38j25l05J0J20j98Q3K33j61n4J12j08J00M7J46j36q9o7J25L3
$$ plain form
3990 41 -16 -119 -46 19 -124 -105 -232 -33 -269 -30 -70 29 -43 55 71 -83 27 -189 54 231 -56 278 51
4013 51 -191 159 37 -111 105 -81 -31 100 -257 -187 -80 -123 126 173 -66 152 -89 -20 99 21 40 -11 -45
4036 -45 21 0 -265 -280 -48 83 -37 21 -47 -36 86 -116 -34 17 107 8 34 241 83 -204 -179 148 134 -145 11
4061 11 -4 11 -48 -109 10 28 -70 -239 -285 95 -80 136 120 19 -8 182 -119 48 -161 -2 -307 -17 95
4084 95 72 -36 140 -54 134 7 1 21 -30 29 215 265 -127 45 136 59 38 79 -182 29 -85 -82 75 -4 143
4109 143 32 5 -172 157 -27 32 278 -48 83 15 149 46 -138 60 -48 38 30 -21 -133 9 -112 34
4131 34 287 -7 14 106 95 332 25 -145 26 -116 39 51 80 97 77 -202 -95 57 -79 -42 -83 -79 -195 3
4155 3 135 86 -34 304 179 -126 -116 4 -194 -111 122 -39 -93 19 -89 11 58 204 68 -21 -88 37 70
4178G0j80k36L31K54l47O6J0P6jqN2q2o6j2J21m4m9K76k35m4J4J9j36L1l2K00
4204D8q9L0o9l3%Q1j12J60R9p3j75m4J44K55k71J65n9j21r8O3n6K2M3J18lm6J17
4231I6J18l01n3k3K30pRj06L2J01j90r6K53l4jJ08j52L0k32N05l43o7L4L72j20
4256A63k02k54K73P3j35o2P6k8O8P6r6O2o6L8j23J02j15J18J5Q2k0j19J97k09
4280h6R3K2p9J95j16j44L8N9p3j03Q4j3K44p3p2J91r6L7j12o9L43m2j38j62J32
4305F0k06o5J32p6J73k58M7J44M9K32j49%j5m5R1r8M3J69k41l02J89J38k61K46
4329ck12J05o4K18j59K29n0L9k90N0J98p3M6l3J57o6Kj42K2n0J83k03NJ45j15
4354f1J40j26j87J01J37k80J43K61j87M8qJ41j98J68k05L09k76L5q6J20m4R2J27
$$ plain form
4178 70 -110 -346 -15 239 -108 -42 -32 44 43 35 87 5 -61 -73 48 4 -45 231 -4 -48 -34 -15 -151 -120 -152 48
4204 48 -41 -11 -80 -113 -113 -32 -144 16 115 42 -133 -177 -33 222 -49 116 57 -64 -162 -99 -155 -133 -90 28 25 -21 96
4231 96 214 -87 -140 -163 67 60 69 -37 -5 96 -94 -190 63 29 28 136 -16 14 -218 287 -56 -123 -89 283 163
4256 163 -39 -293 -20 53 -82 -144 -68 -96 -28 48 -48 14 -52 -14 -137 -35 -150 -32 -17 65 45 -74 123 -86
4280 -86 7 29 -50 145 29 -115 -77 -18 -91 -194 -110 -123 121 48 -24 167 71 108 -4 -73 270 228 90 -72 60
4305 60 -146 -211 -79 -155 18 -240 -193 -49 0 232 83 83 68 23 114 16 59 228 -13 -315 -126 12 -249 -3
4329 -3 -215 -110 -174 44 -115 114 64 103 -187 -137 61 -12 34 1 158 92 94 -48 -26 -76 107 -96 -91 54 -61
4354 -61 79 -47 -234 -133 4 -276 -133 128 -59 -11 -19 122 -76 92 -113 196 -80 -45 -131 -11 -55 37 164
4377A64k17J2M5R1j31m4M8k8M9J09l2n1k43J66J10J49l57K92l57O9J74k27J54
4400e5J49l5k98O0k3K51k4Q0K2k59J97J51k51j0q8J35j44K03J9j03j06J78J25
4423A74k46l1K08k88J02M3L8J11q0m3J89j51L5j0j84K9K46j34M9P0m21L96n2r7
4447d7K59j48m2%l7k21L66j41m0O7j02K3k7N8j08n3K28j9J1l03L38j95j32K23
4471d2LN9r1K4K58K9j07l3r7J1p3J95m1j26n0J9j35K71l3j56J82o7M2J15j43J4
4497B8j32K08k18K84l18J64k12pK98j92J01j15K12j45J12j36J66L4J6k00r4M43
4519B97k54j58J06L07K0m23K82j8o9p0j0l0lN2j3J6j80K30k79L78k33m8J62k2
4543D0q5n9R4p5J08K0n3l4j1J5K6j61J59pl7J78Nj83J67r2n4nl7n5K20R5K5l11
$$ plain form
4377 164 -53 -41 4 95 -36 -80 -32 -60 -11 98 66 15 -228 -62 48 197 -160 132 -225 -156 18 -209 -55
4400 -55 94 59 -239 -179 -202 49 25 105 127 -132 65 216 -35 -45 -133 2 -142 61 80 -23 -129 49 174
4423 174 -72 -103 105 -183 -81 -38 0 111 31 -12 177 26 61 51 -133 -104 142 8 57 127 -294 102 50 -47
4447 -47 212 64 22 22 -15 -236 130 -11 -51 16 -86 -63 -90 -32 -140 -193 35 16 27 -276 62 -133 -265 -42
4471 -42 -39 20 -71 -47 211 240 133 100 3 14 -59 136 95 -31 -81 -62 -197 74 41 -115 67 0 42 157 14 28
4497 28 -104 104 -114 170 -148 16 -196 -203 95 -97 4 -111 101 -44 68 -68 98 132 148 -52 -146 297
4519 297 43 -115 -9 298 318 -105 177 159 90 20 10 -20 -23 29 16 32 -148 82 -197 181 -52 -100 62 40
4543 40 -45 -104 -10 -85 23 43 -10 -44 -55 -40 -14 -175 -16 -23 -60 118 123 -60 107 15 -39 -44 -81 -136 84 179 204 -107
4571a07k8K00k79L01J2k53K0r2K20J5J60l05J81n9P8r9K17p5k17J55k1J7o8j11
4595a38Q1M9P1j34rP1j67J37P9r8R8m6o8L8J65k17K04o0L2R1k22R4L6j04L9K33
4621B55l34L2j42O0J48Q5l2j4J32k76L6J00j35P6K26l33K7J07k8J60j16K0j4p5
4645c5o1K12n4m9K33k67Q8p1R0M9k87J78k2J46p8j26J49j81J68k07Q7J13p8Q8
4669H5r7K3m5O9l2R5l1p6J00jj74J87r8K14l67N5n8L43j52j33K2J67r7k7K0j12
4695a20J96j63J30j6j60L54j07r2j14M0Q6k84L66o9J47k86K21j48J64j09j04K08
4717A40k78J0J40M8k0N0M8j97J94JM0l95K77j85L7M8L8j21j22n1L07j50R0K43
4741A92r7q5Ln8L3Q4L9J27m44K32qk1m4Q9j89J58o1J15j5J59j45n0M0P9l5p0J03
$$ plain form
4571 -107 -135 65 -214 87 99 -154 -134 -226 -6 9 169 -136 45 -14 64 -35 182 107 -110 45 24 41 -27 -138
4595 -138 -57 -8 63 -71 -80 -9 -176 -39 40 -58 40 -6 -74 -36 129 -88 116 56 88 179 -43 51 87 -17 22 255
4621 255 -79 -47 -189 -129 19 104 72 58 190 -86 -50 50 -85 -9 217 -116 -89 18 -10 150 34 54 40 -35
4645 -35 -96 116 62 13 246 -21 67 -4 86 135 -152 26 4 150 72 -54 95 -86 82 -125 -38 75 -3 85
4669 85 -12 11 -34 35 3 98 67 -9 91 90 -84 103 5 219 -148 -93 -151 192 40 -93 -71 96 -1 -28 -8 -120
4695 -120 76 -87 43 27 -133 221 114 22 -92 -52 34 -250 116 47 194 -92 129 -19 145 36 -68 140
4717 140 -138 -128 12 60 40 90 138 -59 135 136 176 -219 58 -127 -90 -42 -4 -125 -247 -298 9 -141 -51 192
4741 192 95 10 13 -45 -12 72 111 238 -206 26 18 -3 -47 42 -147 11 -50 65 50 209 64 14 54 133 98 28 131
4768A31j48o3J16l32L42J2m3R5j92O4j65j03K91K8k8M6L5j12q3J31J30n46M37
4791D3M2O6k10J2P7k29K30l07J95K18l28m3K33M3j26J6J77J91k86k22K35j99K39
4814F7j73K51j47m2K05j29k0o5lj67J51K40j18r9P6n9j2q3J51po1j62J02O6k48
4839b86L07J7O8P0l31J40r8R5m0J75R2j52J2j88J43j01O6n5L8k0J07P9L4k22J70
4864A20k61K47k90K2O7KQ4n3J13Q7p5j96J60j21k8J73J4j24m8L39j23m7j31L63
4888B94k47j0j42m8m1J36J44k70K02m5Km0j11K13K7r9N4p0J11j34P1r3J14l7o4
4913h3J39Q2j15j23J59l3P2k7j72J1j22J95J87r8J3J05m28K10n3o5L45l24K34
4936A09j45O0j63J99J4k14J05j41K97k5P5q9m5K3o3j4Qj23K76j81J31k04J56O2
$$ plain form
4768 131 -17 -80 36 -296 46 58 15 110 -82 -18 -183 -286 5 33 5 51 86 -26 -109 22 152 -394 43
4791 43 85 151 -59 -47 30 -199 31 -276 -81 137 -191 -234 -1 42 -84 -68 109 300 14 -208 27 -172 67
4814 67 -106 145 -2 -44 161 32 12 -53 -56 -223 -72 168 50 -49 27 -32 -44 -127 24 17 -44 -206 -104 -38 -286
4839 -286 21 38 106 176 -155 -15 -113 -18 -58 117 209 57 69 -119 24 -77 -11 -66 -28 -48 59 138 172 -50 120
4864 120 -141 106 -184 -162 -95 -93 -9 -62 51 138 63 -133 27 -94 -122 51 65 -59 -107 232 109 62 -69 294
4888 294 47 37 -105 -153 -194 -58 86 -184 18 -27 -25 -65 -176 37 64 -35 19 -51 60 -74 -3 -96 18 -19 -83
4913 -83 56 138 23 -100 59 26 98 71 -101 -90 -212 -17 170 72 85 190 -238 -28 -81 -146 199 -125 109
4936 109 -36 24 -139 60 74 -140 -35 -176 121 96 171 82 37 60 -3 -17 -9 -132 144 -37 94 -110 46 108
4960A08k73J22P3J15n3j79M0J05p6J38k66J57k2R2P2j96k50L76O6m5r6R7p2ok57
4985b30J57J56n8k56K69J66j26k44K37J12k91P3J03Q2j95o4J88j24r3m9J56k9
5007f0J16N8J96l29P1pop3k0k5P4o1k2l7P7j54K45j38J20N5j14l2J61j26M9o4
5033d6om0R0J25r2k21L18k37P8j04k6K56j85rL79l02k6J37k47R2j8K6p1J79l2
5058A8nK50q6j44P7j59M5k58K19k9j99J76J0K13j01M3j61R7j02J27N2j39P0J21
5082A35j24k4P4j70J80j16j08K01k39K60n0j35M1J11j40J55j01KQ8J18j41K1K57
5105B95m04J64j38K42k33o4R2j22P4K14r3N3oj82K09m9j27J8j41P0M43k50j67
5128a02m9N4NJ0P6k50J89J06l70L83L4j1j01M9n8J71j85J37J08j91o7r5K04j42
$$ plain form
4960 108 -165 -43 30 145 92 -87 -47 58 -18 120 -146 11 -11 81 153 -43 -293 83 149 104 8 105 33 27 -230
4985 -230 -73 83 25 -231 38 204 78 -166 71 183 -108 -35 68 150 -45 -109 79 -45 -138 -187 -31 -60
5007 -60 56 114 310 -19 52 45 39 -34 -54 -79 -5 -66 -88 -125 -48 -202 43 -95 25 80 -34 -66 95 -31 18 -46
5033 -46 -52 -92 -2 123 31 -190 128 -109 -31 -135 -161 95 -90 -99 280 -22 -48 89 -158 -66 -84 -58 -129 50 18
5058 18 13 263 177 33 110 -49 -4 -262 -43 -72 -271 -95 -85 128 27 70 -91 6 -96 31 83 -56 14 135
5082 135 11 -13 61 -109 71 -45 -153 48 -191 69 19 -116 -75 36 -104 51 -50 -48 40 158 17 38 295
5105 295 -109 55 -83 159 -74 -138 -46 -168 -94 120 27 80 74 -108 101 52 -75 -57 -198 -128 315 65 -102
5128 -102 -151 -97 -92 -82 -6 -256 -67 39 -331 52 86 75 -26 23 -35 136 -49 88 196 5 -62 -157 47 -95
5152i5l0K27j45LK02j75n3J08R6j24O2q7Jm2J1J63j24k9K1j01K40j27j01J25j78
5177a52K57O4k28j45J48J28j91R5k1J7R9m9Kj41k2Q7j21L87k30R0j18NJ45O3j00
5202F9M7O7p4j08J25k52k7K53O3l63O3K43j11k9o3J34j05J11J96l06l1K30n2q8
5226hp1K08n3n7o8Q5j06K10J9j06rl1J00l14L49l51J59K4mJ47M1k13J4l1r7K63
5252A00q8J20j78J9k6P3j34R6l0J66r8j36L82k49P8q5J24k18J8O9L3j53J25k07
5276a99J45J35n4L9L8j91J59LP7j08r9Q6j52J99J08l1k11J6O2m1J56k90Q0L9l5
5301f9q8n3K52j56m7M14j12l72M17L6r9j80J69k09J70k24J62Q9j88K56k45l6K
5324a11J25j1k51M08j23j25J02J26j60j07K67j30r6n7K32K9p2O2j44J50j61J15
$$ plain form
5152 -95 -125 102 -43 -40 162 -13 -66 42 138 14 76 -11 -10 -52 -41 122 -2 -31 -10 -111 129 2 -99 26 -152
5177 -152 105 169 -59 -204 -56 72 -119 -24 -45 -28 71 22 24 -117 -139 -52 -173 214 -16 74 -44 -39 106 169 69
5202 69 116 183 109 1 126 -126 -153 100 163 -200 -137 106 -5 -34 -97 37 -68 43 239 -67 -98 132 80 -8
5226 -8 -79 129 76 19 -49 36 -70 140 159 53 44 13 113 -201 148 -203 -44 -20 -24 123 164 -49 -35 -66 -163 100
5252 100 12 132 -46 -27 -53 20 -114 -18 -48 118 20 -116 266 17 95 10 134 -84 -66 3 36 -117 8 -199
5276 -199 -54 81 27 66 104 -87 72 75 152 44 -55 31 -121 78 186 155 -56 -40 22 -19 137 -153 -73 -34 -69
5301 -69 -157 -210 42 -114 -161 253 141 -231 186 222 123 -57 112 -97 73 -151 11 100 -88 168 -77 -113 -111
5324 -111 14 3 -248 160 37 -88 14 140 -20 -127 140 10 -86 -143 89 118 46 108 -36 114 -47 68
5346F8j33k3KR3O8M0l2l7r4N5k6o4J24k59J40N8n5rJ22o5j15J34j03NK40j65o4
5373i5J17j97J97p7M7l4k57Q9j4K62L06m24N4M7N8L9j49K70j98njr5j19L14j39
5398dJ37j63O5l2M5j64mOL2K4K18j58M7J34l56J37J52J24qj28j2l0k27L23m18
5423b60R2J85M6j61O6k6P6o3M8P2l4j55K33l5k18J74k92L06j78K19j15K33k10
5446CMm2j5M8N4M1q7j35J45K63k43n7N6j00K02k79N8K0N2Nj61K44o8nj34P1j28
5473a88K46j82l0Q3l4J13K3j11R3p9Nj7Q5n3P2n8j10m4J67j58J2L60n7p4o8j26
5499a30j64J54Q4P4k4j24P5L1J32j61J12J29j1j88JJ46j34K5n7jJ64k94P2K61
5523A72k93K81k47M1k8J42j02j5K6j28Q8N1j18O3J03m7q9L1j7J61j93M3j2Q5K22
$$ plain form
5346 68 -65 -88 -86 7 75 115 83 46 -48 7 -19 -83 41 -218 -78 -20 -75 -84 38 -27 -142 -8 -111 -106 134 -31 -95
5373 -95 22 -175 22 -55 -8 -42 -299 -210 -224 38 344 -80 -26 21 79 118 -31 239 41 36 35 -60 -179 135 -4
5398 -4 133 -30 35 3 48 -116 -120 -114 -82 -58 160 2 49 183 -173 -36 116 240 232 104 92 62 -165 158 -260
5423 -260 -168 17 63 -98 -32 -58 18 -45 3 75 41 -114 119 84 -134 40 -252 54 -124 95 -20 213 3
5446 3 7 -35 -50 -2 52 93 6 -129 16 279 36 -21 35 -65 137 -142 -84 -64 -12 -7 -168 76 8 3 -131 -60 -188
5473 -188 58 -124 -154 -71 -105 8 31 -80 13 -66 -61 -78 7 -46 26 -32 -142 -186 -19 -177 -165 195 138 64 -4 -130
5499 -130 -294 -140 -56 18 -6 -130 -55 -24 108 -53 59 188 177 -11 -10 136 2 27 -30 -31 133 -161 -89 172
5523 172 -121 160 -87 -46 -74 68 -34 -49 -23 -151 -63 -12 -130 -67 36 -11 -100 -69 -86 75 -118 -75 -87 -2 220
5548B20k20j37L50o7k06Qk8R7N2m5J26ko0k34J32n6J12k4l6J25j86K3R4j07J44
5573G5r9J52r8j43Q0k9m4R5L2J42j68%j45J66j73J04J27%L3k43Q7L1J65j73J17
5598I1k13J75J39j38p5J64r4j14p3J34L0J08p5lj96M1K33Q6k36Q1m3J5J1n9K25
5623B14j89J29k19J2J55j01p8J4L5n2K03j31J34k6m0p6J45k90P8J51j00M5J18
5646A31l0k32J09j30j1L26j29k35K47k28L36j95O4J02j86J47q7j68M5K59j02J76
5668B09r4L0r3l8j22P1J00k55J14J45k0k43L00r6O7L5P3j36J18j14o7m3j47J79
5692b7N2q6p0J57O7J05l25Mk0Q8j66J47J58j91J74k74J15M5j7J22l03J53J60j80
5716a12O1K5o0J99n1n2O2n4k03J06M0q5p3N4kqM5N9n0l8L08m04K13k3J29r8o4
$$ plain form
5548 220 0 -137 213 146 -60 -52 -80 17 69 24 150 148 88 -146 -14 -70 42 18 -18 107 -79 -56 38 -69 75
5573 75 -24 128 30 -113 -33 -62 -106 -11 21 163 -5 -5 -150 16 -157 -53 74 74 107 -136 -49 -18 147 -26 91
5598 91 -122 53 192 54 -21 143 49 -65 -138 -4 26 134 59 56 -140 -99 134 220 -16 65 22 37 48 -11 214
5623 214 25 154 -65 -53 102 1 -77 -63 -28 -80 123 -8 126 100 60 -16 129 -161 -83 68 -32 13 131
5646 131 101 -131 -22 -152 -163 163 34 -201 46 -182 154 -41 23 125 -61 86 -1 -169 -124 135 33 209
5668 209 115 145 52 14 -108 -37 63 -192 -78 67 47 -196 104 8 75 110 183 47 165 51 -16 -59 -206 -27
5692 -27 25 -61 -131 26 93 198 -127 -123 -143 -55 -221 -74 84 -107 67 -207 -92 -47 -64 58 -245 -92 68 -112
5716 -112 -51 -26 -86 113 62 10 72 18 -185 -79 -39 -124 -197 -143 -145 -153 -108 -49 -99 -137 171 -233 -20 -43 86 -12 -76
5743g6j3K60j03J69k19m1l0K28k1n0k30R3J85l44J78q7J00j59L1O2J15M5j35Q
5767c4j35R9K15k43O6J19j62J64K2K0j35o3P8J88j05K8o3r0K2nO1J85l89J54L0
5792B7J59j73j21NP8mK01j56J03j53J88J52m56K39J5k23K61q8j01n5R3J1N2p2
5816a8K01K4j84M1O6k77o9K26R9j08r5J79j17j56K17J00j97J74k16mQ2J09j60
5839h3J74r3P6l07J19K75j20p1J66o6q9O8j45Q2l9J09k00L65l20J69j27r8K60
5862A05n6J16l99L78k15O5k13J35K10k52L3P5l3J29N6k3l6q8N3O7o9Q5j9l0j35
5887f1q3J13J75k11M8nJ00o5j14PJ42K6k49K06J38k00O5k00J73Q4J5P4l61L9M59
5912C15k92m6o6J39j06R1N1k57J83j39J62j38j1R3J64j93L3l5J56n8r0N8R2l47
$$ plain form
5743 -76 -89 171 68 237 18 -23 -53 175 154 104 -126 -33 152 -192 -14 -101 -1 -160 -129 -67 48 93 -42 -34
5767 -34 -169 -70 145 -98 -32 87 -75 89 111 131 -4 -67 11 199 94 122 59 -31 -9 -14 47 232 -157 -3 27
5792 27 186 13 -108 -103 -25 -29 172 16 119 -34 154 306 -150 89 104 -119 142 54 -47 -102 -9 2 54 -18
5816 -18 183 207 23 64 130 -147 -216 10 109 1 -94 85 -32 -188 29 129 -68 106 -110 -114 -32 77 -83
5839 -83 91 -2 74 -233 -114 161 41 -30 136 70 -19 49 -96 -14 -53 56 -144 221 -99 70 -57 -155 105
5862 105 49 165 -234 144 -71 -6 -219 -84 126 -126 -93 -18 -51 78 134 111 75 -13 40 107 38 123 104 74 -61
5887 -61 -144 -31 144 -67 -19 -24 76 11 -103 -96 46 72 -177 29 167 -33 32 -168 5 89 104 178 -183 -144 315
5912 315 23 -23 -89 50 -56 35 86 -171 12 -127 35 -103 -114 -21 143 -50 -17 -52 104 46 -44 14 106 -241
5936b41J52p8Q6J5J25n7K59k72j0K29k52J33j96J71j5j5k27K73M4k3q2R6k26J05
5960fq6J8q3J33R0j87Q4Q1J7q0J2J00P7k38Q0O9m2r2J98k90K58r4M9j19P4j43
5986a20o1J85j01J64j37L6P1O2J4o5l4n1k50L49n9k34J55OJ54o7n9J81Q3k97L
6011g2rJ07o3N5r8PK06j80K13k8l92M25j04k2j00J87j04r7mK44Nj80QKl3l0J35
6038G8k0J02j21q4L1J24O2m37K79K3k50K10k1o3K71k35K8P2r8j18K66L2j70J7
6062b2rJ70j30r4j85L13N9j48O1j61q3L24r4r4J13r3k3J01J20j4o7j05K19j79
6086b1L5J4j64R0L5j94L76o7j69K22l38J09P1n0R5r5K29k83M9J4J11MK7K4l1j20
6112b7Q6j86J60k15J98K09m33N5J80Q5k35L6R3k07J03Q4R3j50R3J14j53O7j50
$$ plain form
5936 -241 -89 -167 -81 -66 59 2 261 -11 -21 208 -44 89 -107 64 49 34 -193 80 124 101 19 115 -111 -6
5960 -6 -92 -74 -157 -24 66 -121 -37 44 61 -19 -7 93 170 -68 12 81 39 -53 145 -145 113 19 68 -51 23 -120
5986 -120 -181 4 -97 67 -70 -34 37 99 113 48 14 -37 -287 62 3 -231 -76 -70 84 17 -42 139 222 -75 -72
6011 -72 -81 26 -37 18 -80 -73 133 -47 166 138 -254 171 67 45 -55 132 28 -69 -73 171 176 -4 4 6 -27 -57 78
6038 78 58 160 39 -45 -14 110 172 -265 14 37 -213 -3 -24 -87 184 -51 -23 49 -49 -167 99 131 -39 -22
6062 -22 -31 139 9 -85 -270 43 102 -46 15 -146 -229 95 1 -93 20 -73 -96 5 125 111 44 -61 158 -21
6086 -21 14 28 -136 -46 -11 -205 171 104 -65 157 -181 -72 -1 -51 44 -51 178 -105 -56 -42 69 73 100 124 93 -27
6112 -27 59 -127 33 -182 16 225 -208 -153 27 112 -123 -87 6 -201 -98 -14 79 -71 22 136 -17 50 -100
6135a00M3K14j24O6Or1N2O7j83j1O7J38j73J0M2L3N0N3j48L2p6J41l2n5j48P8
6161d9J72k15j5P7n0K28k10rjK14m6m1j18K71j60j02J20J34k06j11j7L25j77m6
6185c2M0Q0NK8k11M7L2j81K63M7N9k24j69J38QK21k03J98l21p6K89J7r5o1L0j62
6211b33K34L3op2j06M08k30r4MKj24K04l6K31l90J91J84o8j18l6j47J71O3r7K
6236c0N9j10J62j40j02L86k13j04J80j35L5K81j57j90J20O4j24n9J6j73j2L79
6258A33k62P9k1K21j61n1L18o3j41m3J72l55J68M3j48p7K79p7m4J48j82K31r1
6281G6j55J58j38n1J93R0l18Q8M7n9R3l2q1L7j24L3K94p6l2m8J96j94j07J24J24
6306A38k45Q7O7Q8j53Q2o8K75m4k14p1J53n6K7j30Q6J91m01M16k43J11j77J33
$$ plain form
6135 -100 -57 157 33 99 105 14 66 133 -50 -61 6 144 -29 -19 23 56 106 159 11 43 -33 108 76 21 -127 -49
6161 -49 123 -92 -107 -30 -80 148 -62 -71 -72 142 96 55 -63 208 48 -54 66 200 -6 -117 -134 191 14 -32
6185 -32 8 88 93 121 -90 -43 -11 -192 71 118 177 -47 -216 -78 -70 151 -52 146 -175 -251 38 55 -40 -101 -71 -233
6211 -233 1 34 28 -44 -150 258 28 -66 -62 -60 -184 20 -16 215 -175 16 200 132 14 -22 -169 2 65 -32 -30
6236 -30 29 -81 81 -59 -161 225 12 -92 88 -47 -12 269 112 -78 42 106 -18 -77 -61 -234 -246 133
6258 133 -129 -50 -71 150 -11 -62 256 193 52 9 181 -174 -6 37 -111 -188 91 14 -30 118 -64 167 76
6281 76 -79 79 -59 -110 83 173 -145 -57 -10 -69 24 -8 -89 -52 -176 -143 151 75 43 -5 191 -3 -110 14 138
6306 138 -107 -20 47 135 -18 64 -4 271 227 13 -58 95 39 66 -64 22 213 -188 228 -15 96 -81 52
6329E2K1k9j3%Nk18K49k08R1l6m6O1K11k16K91k99Q7L10k85j39J26m5n1M5N1Q8
6355A03j47P5j2M8j26J11J27k23J41j17M7n8m5J06p6j20J41Jj10P2q9J58q4P5
6379bJ42k25M8J41j9k16m0Q4K39o0k44J17j58J77K81m78L06j93j4J79j20P1k64
6402b48J25k1J42j18K6l9J62k1m3O8j00n4L5K0J1J46p7l3K4k1J63l4Q9n3m0j95
6428h6Q0J8r0J35j6K35j96mj64N4j2K04j39o7J67j00P3o2l6P6j37J71j48q3K23
6453I6k04j2m1K62o8j75L0J01K7M1k46M0Q3r9L4M7J68n5P5j41J36j72J41r8j0
6478d0j3J26r9J7Nj13J40Q6j11J14p1m9k0k37L52pm6j96J41N1lL9L2j66j49K40
6504B3N9jk7K4j02J2o2K5j93K70k3j31K34l81K75J0J52k88n0k0K12p7J18q1j22
$$ plain form
6329 52 73 44 31 31 36 -182 67 -141 -50 -86 -132 -71 140 -76 215 -84 3 313 28 -111 15 -30 -81 -36 15 103
6355 103 -44 31 19 67 -59 52 179 -44 97 -20 27 -31 -76 30 -46 -166 -25 -24 -134 -62 -151 7 -77 -2
6379 -2 140 -85 -37 104 85 -131 -171 -87 152 92 -152 -35 -193 -16 265 -213 93 -100 -114 65 -55 16 -248
6402 -248 -123 -144 -2 -120 -94 -133 29 8 -35 33 -67 -121 -86 -66 -55 91 14 -19 5 -16 147 113 202 149 109 -86
6428 -86 -6 12 -78 57 41 276 80 76 -88 -34 -46 158 19 -48 119 19 92 30 -6 70 -67 104 -44 -127 96
6453 96 -108 -120 -161 101 33 -142 -112 -11 16 57 -189 -149 -66 -165 -131 -84 84 29 104 -37 99 -73 68 -30 -40
6478 -40 -53 73 -26 -9 -4 -117 23 109 -2 112 41 -8 -28 -265 87 80 34 -162 -21 30 27 66 98 -68 -217 23
6504 23 82 81 54 78 -24 -12 -74 -49 -242 28 5 -126 108 -273 2 12 164 -124 -174 -194 18 -59 59 -22 -144
6529a44l1J86J30j68l6o6J70j8L6m2M7k07J66q6J1Q6j00j2K7N9q6N6j04K65j75
6554c6J1J96n8j68r2L99l71k3K20K5l6m6j06J7jm0n3K13p7R5l4l1M5p7Pj02K97
6581A74r3M3jM8l19j51M11L4j06J09k87P7J36J6j73J83l1n5p2M9K2O5k81J26K06
6606A30o4q3K6l7j5l4K64k6j76m6O8n0O3R0K1q7J1q3Mn4K93j36m4l0p6L7L2p4
6634g6P5Q1j56j0R3L9K0j42r3K17J4l7N8k85K6N4J52k66J51J7M3P7j40K21Qj06
6660C5j71K05q4J32O1j89Q5Q9k56j7Q6K03o5j97K00Q5p8r5o9k30K84K1J31j15
6684E1L3m6Q5j39r2M0K55k45J32n8j06q7K70k28K59k50J40k4J33j92J21m0K5J02
6708A39k30R3K02k85J76k28Q5M7L2k60K47Q1k47J84Q9k74J05N9J0p9j1QJ4P3k6
$$ plain form
6529 -144 -175 11 141 -27 -63 -129 41 23 59 17 64 -143 23 -63 -52 34 -66 -78 -51 8 -78 -22 -126 139 -36
6554 -36 -25 171 113 -55 -147 252 -119 -142 78 103 67 21 -85 -68 -69 -109 -162 51 -26 69 35 4 49 -28 -21 -123 174
6581 174 81 124 123 171 -148 -299 112 146 40 149 -138 -61 75 91 -82 101 70 15 -57 -8 14 79 -202 -76 130
6606 130 66 -17 9 -28 -43 -77 187 161 -15 -61 7 -43 20 110 131 44 55 -28 -24 -78 215 79 35 5 -71 -34 -2 -76
6634 -76 -1 80 -76 -86 7 46 66 -76 -169 48 62 25 83 -202 -176 -122 30 -236 -85 -68 -25 52 -88 133 141 35
6660 35 -136 69 -15 117 178 -11 74 163 -93 -110 -24 179 114 -83 117 202 124 29 -40 -270 14 35 166 51
6684 51 84 38 123 -16 -108 -68 187 -58 74 16 -90 -177 93 -135 124 -126 14 -10 123 -69 52 12 37 139
6708 139 -91 2 204 -81 95 -133 -48 -1 31 -229 18 99 -148 36 125 -149 -44 15 25 -54 -65 -57 -43 30 4
6733Dj1J76k48O4J01k0k67M41m44J54M5n3n9K40j77q1K02m4L1P6j18J08op8J62
6758A98j61q9jk7J32q3n5Nj74K87k39K52j50K13j65J96r2K3j4n3j21J75J7l6j78
6783a40L1P4k17K50N2k09K89j72J9m9L39l12j20N6K5L11k43j06k3J62j71J49j52
6806a57P5m7rJ40p0J33J3J0m0mK1j51J17j38K21j45j46K05k4n4L2K51k83Q3M4
6831G7m2j58o7K87j16k9JJ46j78J05M0l6rN0Pl4J14j54q0J29j13l6J01M3o7J02
6857H3J58p9j92J46q1j88J80j51K08R6j49O6j24K0J59j08j64J01J57L2k52j52
6879b34K92m7k24J57n0jJ51K06k99r7J31J02P8q4r8k5K40j41Q0n8m3k6q2R7J50
6904A75j82R2Oo0J0j36J2m7K17J77n20K04j76K56Qj20l9K5K16k70Q0P5j49k11
$$ plain form
6733 4 -7 169 -79 -15 86 66 -201 240 -204 -50 -5 -58 -117 123 -54 -135 67 23 54 130 12 120 114 36 198
6758 198 37 -52 -53 -80 52 -31 -86 -81 -255 32 -207 45 -105 108 -57 139 47 70 56 3 -118 57 74 38 -140
6783 -140 -109 -35 -252 -2 50 -159 130 -42 -23 -72 267 -45 -165 -109 -84 227 -16 -122 -145 17 -154 -5 -157
6806 -157 -82 -129 -138 2 -68 65 78 88 48 44 65 -86 31 -107 114 -31 -177 28 4 -50 -18 233 -50 33 77
6831 77 35 -123 -190 97 -19 -48 -47 99 -79 26 66 30 21 71 78 44 158 4 -76 53 -60 -96 5 48 -19 83
6857 83 241 162 -30 116 35 -153 27 -124 84 180 31 97 -27 -7 152 44 -120 -19 138 170 -82 -234
6879 -234 58 11 -213 -56 -106 -107 44 250 -49 -146 -15 87 165 81 -17 -42 198 57 137 79 36 10 -72 25 175
6904 175 -7 85 91 31 41 -95 -83 -130 87 264 -256 -52 -228 28 36 -84 -123 -98 118 -152 -72 3 -146 -357
6928c57M13o5P1r1J9K28j84L8l39L65m8o4j05J04J13q6K0q1j40M52l06J7K1j58
6952a63J29o7K46k45M2pK63k60P5l3J7o7R6k1k7j1J65j96J6j64M66k63j0J83K6
6977A90p1O7j59Jj39j5J67k26K83M5q8j43m9J10j27J32k33K42k21J97j53K86O0
7000A56j91M6n6nL38k51j88K67k18N9j20L19k40P4q0R6j01o6K71k10K60k8j15
7023A7k1k5J7m7L7R0L0rj97J23j14L6J02l84M24m4j7j08K17j07j95J15J35J03
7047A78j79n1K15m1j99P8m1j48L02k31K13o4Q1j4k16K09k09K10j67P6N1j18J16
7070E1j12N6j96K88J9l64L50L7p8J5p3LJ62r8j13kQ7l7j01L10k22j2O0j03J80
7095A07j84R8N4j86K07j39k1J14J0k99M12k12J04m2O0j35l5J40r7K05m1j17j44
$$ plain form
6928 -357 56 -9 62 -29 -10 218 34 72 -267 98 50 -14 -119 -15 98 12 32 -49 -189 263 -43 -26 -5 -163
6952 -163 -34 -101 145 -100 -58 -65 198 -62 13 -20 -3 -70 26 5 -22 -33 132 -64 -48 -212 254 -9 -19 164 190
6977 190 119 186 27 28 -111 -126 41 -185 98 143 55 -88 -137 -27 -154 -22 -255 -13 -234 -37 -190 96 156
7000 156 -35 11 -45 -50 288 37 -151 116 -102 -43 -163 156 -84 -10 -90 6 -95 -161 110 -100 160 132 17
7023 17 -4 -29 -12 -59 -22 68 98 89 -108 15 -99 -63 39 -345 79 35 18 -90 127 20 -175 -60 75 178
7047 178 -1 -52 163 122 -77 1 -40 -188 114 -117 96 32 113 99 -117 92 -117 93 -74 2 53 -65 51
7070 51 -61 -5 -201 87 106 -258 92 129 51 66 -7 -4 158 60 -53 -55 32 -5 -106 204 -18 -30 30 -73 107
7095 107 -77 21 75 -111 96 -43 -64 50 60 -239 173 -39 65 23 83 -52 -87 53 -44 161 120 3 -141
7118a41J96Rj00K27k07J34r3L0J4j71k2K31l16J78J15j12j03J54K34k07p8n4Q6
7141DL3J81j03k68K67j70l5j6J15p0J78p6p8m1J04K7qk2K13j26Q5l97K08p3M9
7166a9N3r3J65j31M3j83J18J4j45K17J17k64jJ10J94j07k23J44L4j19jk2J73k75
7190b01K67q0N2j11M6J4J06j66J94k5l5K5J30l17N5O7k1k4PQ9o3M8P7k6k51J23
7216b0j61r3L17j83P1J58j66P6J33j5n8k08K46j56J1q2N6K6K61q3m8L9j8m5j35
7241g7J26J97k53j09N4J8M1q4R4RQ8r8j65Q9N6j6Q9j80J96k2MM3j88Q3M5J69k11
7268bM9k24J63kL6r2o%n8%Q0O6%J08k67JR1k6J90j76K82K81l91m0J6N9j31j30
7296a23N8L23m5k54L18k07l29K81o6J15k43L15L8j79J02q2J78k15j6J21k58K87
$$ plain form
7118 -141 55 64 -36 191 -16 118 25 55 69 -102 -124 107 -209 -31 84 -28 -131 23 257 50 -28 -82 4
7141 4 37 218 115 -153 114 -56 -91 -107 8 -62 116 40 -38 -79 25 52 44 22 235 109 194 -203 5 -68 -19
7166 -19 34 -59 106 -25 18 -165 -47 -33 -178 39 156 -108 -109 1 195 88 -135 9 43 -76 -77 -99 74 -201
7190 -201 66 -14 38 -73 -27 -13 93 -73 121 96 61 86 216 -101 -46 21 0 -24 -17 72 9 57 134 108 -143 -20
7216 -20 -181 -274 43 -140 -69 89 -77 -1 132 117 59 -149 97 -59 -48 -130 -74 -48 213 130 82 121 103 58 -77
7241 -77 49 246 -7 -116 -62 -44 -3 -87 7 16 104 6 -159 -70 -14 -30 59 -121 75 53 57 100 -88 -5 40 209 -2
7268 -2 47 -177 -14 -16 20 -72 -78 -78 -136 -136 -56 10 10 118 -149 -148 -57 -83 107 -69 213 494 103 63 79 138 7 -123
7296 -123 -65 258 213 -41 277 70 -259 22 -44 71 -172 143 181 2 104 22 200 -15 -31 90 -168 119
7318A19O1k23J63j12j15O5j87K93k3q0K08k09n4J97n7j9J6O9j59l5k5o8J28K35
7342A88j89l0l3N4P6n5N6j55j8K60k60J31m1J14J98j55Q6k50j87K34q5K04j96
7365e3j10J17r6N3Q2j96j47L50l1L16n41K20M5mq0N4J06Q4j98k6l8k08L49L9j8
7390F9L1k58Q8n1KJ67q1O0K7Mj43R5j08J8K03J9j65PoP9J82k69k0m5r2K99k33
7417a21Q9N2j17KJ31K8k0P2n1q2p7KJ90k18k9J63p2q0R2L1J68j80o1J5J49r3J41
7444A24k75N8L04j16%j98j10R2J48J45j57K10k60J20K6j83J20M2j09L5j00P2J81
7467A69j77Lj03j17J21K02p5P1q6l9k0P4j3j27MJ63n1l3L02k91L4j35P5O2M7O8
7493A28k63Q5J67j44J24p0J05j87j54K18J31k47J8J44l5k26R2O5k0J86J15r7n4
$$ plain form
7318 119 180 -43 120 8 -107 -42 -229 64 41 -39 169 -40 -94 103 46 27 43 112 -47 -82 -107 -175 -47 188
7342 188 -1 -31 -64 -10 66 11 67 -88 -106 154 -106 25 -16 98 296 141 227 -23 -210 24 -61 143 -53
7365 -53 -163 -46 -142 -89 -7 -203 -350 0 -31 285 -256 -36 9 5 -75 -21 85 169 -29 -55 -93 -301 48 87 69
7390 69 100 -158 -70 -121 -119 48 -33 27 54 58 -85 10 -98 -80 123 142 -23 -16 -22 57 239 -30 -50 -95 -187 112 -121
7417 -121 -32 20 -97 -95 36 64 44 116 65 -17 -94 -92 98 -120 -149 14 -58 -138 -46 -15 153 -27 -88 -73 76 -17 124
7444 124 -151 -93 211 95 95 -103 -213 -121 27 172 15 225 -35 85 111 -72 48 90 -19 16 -84 -12 169
7467 169 -8 -5 -108 -225 -104 98 23 94 8 -31 -51 23 10 -117 -113 50 -1 -34 268 -23 11 -124 -49 13 60 128
7493 128 -135 -50 117 -27 97 27 132 -55 -209 9 140 -107 -89 55 20 -206 -114 -49 -69 117 232 135 81
7516H1k04K03r6J1p8OJ26P5j50m3O0J5K8K01k30m3J9N2m2Q7k81n6J15J18P2m8
7542bP5j28J33k37K24M1j26kJ48l4q0k25J31M4j5j00J09M21m08J27j87K38K19
7565C66m13J8j6o5J05R8k01j27L75q6n2l6J22j86K7p9o0K23R0o0j67j0L2J7l0
7590a15j5m0J59R6k30j24L41o7q5j31J37P6k04K45k6P4m4j81J39l7L0n2J08K32
7614B86k48m8J37o4j03n8L02k30kL4J00o8j48J09j39K10j81Q0J32j37j35L74j06
7637I7j31m2j24M5O5J54Oq8O0m6o3nn8k8J38j1K20n9p5j42L55l07j40J84r6M6
7663d5m7K53k5l04J21J83r4Jo0p4J76j10r6K4K30j77J1R5j12J11j42R7j15K23
7687A24m0O9k16K7J2r6K9J71j3k4r3j0n3J94j08M5Rn9m9l8K92j01j83J01O8k47
$$ plain form
7516 81 -123 80 -16 -5 -83 -77 49 124 -26 -69 -9 6 34 235 5 -38 -19 33 -9 78 -203 -259 -144 -26 46 -2
7542 -2 73 -55 78 -159 65 106 -20 -22 126 92 12 -213 -82 -38 -53 -153 -44 377 -31 96 -91 147 366
7565 366 -47 -29 -45 -110 -5 93 -108 -235 140 54 2 -34 88 -98 -71 -150 -210 13 103 43 -124 -134 -102 -85 -115
7590 -115 -130 -170 -11 85 -145 -269 72 5 -80 -211 -74 2 -202 43 17 91 47 -134 5 -32 -2 -54 54 286
7614 286 38 -10 127 63 -40 -98 204 -26 -28 6 106 38 -110 -1 -140 70 -111 -31 101 -36 -171 203 97
7637 97 -34 -76 -200 -155 -90 64 70 -18 42 -4 -67 -72 -130 -158 -20 -31 189 130 55 -87 268 -39 -179 5 -91 -45
7663 -45 -92 161 136 -168 -47 136 42 43 -17 -91 85 -25 -121 -97 133 -44 -33 62 -50 61 -81 16 -99 124
7687 124 84 153 -63 -36 -24 -120 -91 80 67 43 -50 -60 -113 81 -27 18 27 -32 -81 -119 173 72 -111 -10 58 -189
7713a89J73n9OJ26j8N5j63J50k19K41j86J43l01J11L9j10K65j38M5K58k72l9N3
7736b9K17l07L40q3K6n0kr8j9J72l20J8J46K3j87Q7q9K8J9K86j62k17J57O6j40
7761a18J95J7L6J10m2k39J47n0j55K92j95q5R2k1n2JPq1J55Oo6q0K85j56K06j20
7787H9j24J25j73N0J03J7j54p2O7J18K5n6M0N7L9l22J53k30L93j06k6K09k57K16
7811A81q7j99J27k42K73o2j15L98k77Q9k70K70k6j5jLK4j10J12j91J89m5j06l
7835h3P1J2m2j43K64R2Q1j54L0Ql8j24J44k52Q5o1R3k1n5p5J53J8N0q0o8L92m80
7862a83K35j46j24L01j05r0q6N6J01j35r1K44k7R6j78J55n5LK9L0j87L7J16K28
7886B24k77PJ5j12K77k57J51j51K91k25M6k0M3J68j19R2j40l4Q2l51M43p5j30
$$ plain form
7713 -189 -16 -75 -69 57 39 94 -69 81 -138 103 -83 60 -241 -130 -91 -201 64 -74 -29 229 -43 -82 -29
7736 -29 188 -119 221 138 164 114 112 14 -5 167 -153 -135 11 34 -153 -66 -155 -127 -108 178 16 -201 -44 22 -118
7761 -118 77 94 130 240 198 -41 106 56 -99 193 -2 -87 5 -16 -68 -67 -60 -141 14 20 -46 -126 159 3 209 89
7787 89 -35 90 -83 -33 70 87 -67 -139 -72 46 71 15 55 112 151 -171 -18 -248 145 39 13 222 -35 181
7811 181 94 -105 22 -220 53 -9 -124 274 -3 86 -184 86 60 45 44 47 71 -39 73 -118 71 26 -80 -83
7835 -83 -12 0 -42 -185 79 171 252 98 128 136 98 -26 118 -134 -49 -110 -17 -38 -93 -168 -15 3 53 -27 -95 297 -183
7862 -183 52 -94 -218 83 -22 -112 -198 -142 -41 -176 -267 -23 -50 46 -132 23 -32 -29 0 30 -157 -120 -4 224
7886 224 -53 -46 -31 -143 134 -123 28 -123 168 -57 -11 -31 12 180 61 153 13 -21 61 -290 153 78 -52
7909e2pJ67j41K40k52L4o1o7R2N5J49k56K0K40k95j2J28L5j9J2J20j33j0Q6j57
7934h4J63p6p9P4j14K02m8N0j23J53j08k6K09k92K6Oj22O3J80r2n1J27k42J67
7958c7NJ28K1N7j19j48K0nJ28j96J68L0o7j98K29J91r6j09Q7j06j58J09n3j6R0
7983d5r0N4j31N3K09N8m5k8j63J76L9o3nk11q4K28Oj11K05nl0r8K06k7K5k42p9
8010a98O2J74n6J36j45p6Nn9K10L1O0m7l8r5K12q0k27K01Q2j10Q6j43K1k8j64
8035a86L73k70J48r6k95M17q5n3m8L10l02Q2J38k48n8K51k42K08k16J45L3j10
8057a04J83K6J78m23J08QJ5l4PlO9Q8n1j50j71K35M1m1K80k64R2o3J17r8k8q5
8083f8P4lj58M9L62k19n8J68j25j07O4n9k1J62r1N8pK9q7J12k16L20k40l0J14
$$ plain form
7909 -52 -59 108 -33 207 -45 -11 -72 -139 -47 8 157 -99 -79 161 -134 -146 -18 17 -2 10 130 -3 -13 73 -84
7934 -84 79 3 -76 -2 -116 86 38 88 -35 118 10 -16 193 -99 -73 -67 -189 -126 54 -38 -89 38 -204 -37
7958 -37 -32 96 117 174 55 -93 -73 -78 50 -146 22 52 -15 -213 16 207 111 2 89 -17 -175 -66 -119 -135 -45
7983 -45 -135 -81 -212 -159 50 108 63 35 -128 48 87 24 19 -192 -276 -48 -42 -153 52 47 17 -81 125 98 123 -119 -198
8010 -198 -136 38 -18 118 -27 -103 -98 -157 53 84 144 97 59 -36 176 96 -131 70 152 42 128 -15 6 -22 -186
8035 -186 187 -83 65 -31 -326 91 6 -47 -95 215 -87 -5 133 -115 -173 78 -164 44 -172 -27 6 -104
8057 -104 79 105 283 -140 -32 -24 -9 -43 -36 -39 30 118 67 -83 -254 -19 22 -19 261 -3 89 26 143 45 17 -68
8083 -68 6 3 -155 -106 256 37 -21 147 22 -85 -21 -80 -101 61 -30 28 21 50 -37 75 -141 179 -61 -91 23
8108B3N4qk7j42Q4m2k30O6K61o9o2K35j98J09j79L04k00K00k28R5o3RP5k67J96
8133dj54N9k5J48j41lP3J83K07k77ll38K70K6J49j51n9l5N5J67j38L3Q7M1k74
8158a04O5j8N4R4o6o9j12J3J29j5p6J2J53l6j27J43m8M9p9m0P2j30N1J68q5j14
8184a16O8P7J5qO9M1j70
$$ plain form
8108 23 77 69 42 -100 -16 -58 -288 -222 39 -30 -92 143 -55 54 -125 179 -21 179 -49 46 -17 -8 67 -200 -4
8133 -4 -158 -99 -124 24 -117 -120 -47 136 343 66 63 -275 -5 21 170 19 -40 -75 -20 147 9 42 129 170 -104
8158 -104 -39 -57 -3 91 25 -44 -156 -143 -14 -29 -105 -93 60 24 -103 40 -8 41 -38 -78 -6 -136 -85 83 -2 -116
8184 -116 -48 29 44 36 105 146 -24
8191b4
$$ Imaginary data points
##PAGE= N=2
##DATA TABLE= (X++(I..I)), XYDATA
0@%%%%%%%%%%%qJ6j6J6j6K4l2M0m8N6o5P3q8J04j26J50j74J99k25K61l01L42l88
34b06M37m93N56o22O94p75Q64r62J068j183J310j447J597j763J944k142K359k597
52a361K861l156L487l856M274m753N304n950O720p652Q810j0295J2275j5064J9316
67A0960k6659M2818j44118J05568K29326k01107j53683L8081J67249l0519l2477
78E439K005j5608m2664L4488R9131l2903j00736j0228Q1215M6939q6653k409K4551
91B567o687j3359K5546K6148o2100j4459O2605L1829p0725m1072R4514J4394o4568
104a5367k8687O4289K9699p7486j962N2565K580n2923M139M7717k2668k4923J3645
117i382M4171l7389n6127O7163N6399m8956q7909M3408J00091k9876q3289J340
$$ plain form
0 0 0 0 0 0 0 0 0 0 0 0 0 -8 8 -8 8 -8 16 -16 24 -24 32 -33 40 -48 56 -70 80 -94 105 -120 141 -160 182 -206
34 -206 231 -262 294 -328 366 -409 455 -507 561 -622 688 -759 838 -925 1019 -1123 1236 -1361
52 -1361 1500 -1656 1831 -2025 2249 -2504 2800 -3150 3570 -4082 4728 -5567 6708 -8356 10960
67 10960 -15699 27119 -116999 -11431 217895 16788 -136895 -98814 68435 37916 5439
78 5439 7444 -8164 -50828 -16340 82791 49888 -50848 -61076 20139 67078 -19575 -21984 2567
91 2567 -4120 -17479 8067 34215 -27885 -42344 20261 52090 -18635 -59707 34807 49201 -15367
104 -15367 -44054 20235 49934 -27552 -29514 23051 25631 -27292 -23153 24564 1896 -23027 -9382
117 -9382 34789 -2600 -58727 8436 64835 15879 -72030 -28622 71469 41593 -41696 -40356
129d0356P3129j0816l9337J3012J3353q363k8132L0221J9483l0424p335J6309
141G44J0275k2915P397K3685o528k7378o505M3201j725k5904n888R985J0552j8555
155i559R244J3645j6172k1166J6202L0748j8433j7347J519J6034M845j0267P140
168F433j2412j184J8142M063j8819j9243K4999K4623j4873m3031L785N0995O246
181B9724l4409l2403K4599L8177q884k1862j1209J0763J0636O582k798j2481m821
194h386J83J7030K046p621q807j1706J6621J5074n581j9549n676J7528J0577m562
208G171j5557N76P370Q536J739j6482O0P145O607k86j2702m94Q373N373q705m515
224e791M958M175k950q176J1108K118j0540J484M533M790n941l764M988J391k354
$$ plain form
129 -40356 32773 21957 -17380 -4368 8985 622 -27510 2711 22194 -8230 -15565 744
141 744 11019 -11896 -4499 19186 12658 -14720 -21225 21976 20251 -5653 -11541 -1556 8996 -9559
155 -9559 -315 13330 -2842 -24008 -7806 22942 4509 -12838 -11319 4715 9560 -707 6433
168 6433 -5979 -7163 10979 15042 -3777 -23020 1979 26602 11729 -31302 -27517 23478 29724
181 29724 -4685 -37088 -12489 25688 16804 -5058 -16267 -5504 5132 11714 8916 -3565 -8386
194 -8386 -8203 8827 10873 3252 -5555 -17261 -640 14434 8853 -10696 -16372 1156 11733 7171
208 7171 -8386 -7810 -440 8096 9835 -6647 -6587 558 7165 6879 -5823 -6317 2056 7429 -1276 -5791
224 -5791 -833 3342 392 -7784 3324 5442 -5098 -3614 919 5709 -232 -3996 992 2383 29
239B9R35J676p154M763N057n347l885k105J2147K026j5404l539J2194R691r234
254A850j2111L203J5046k429r384N397k700j781M778M494j576j2057J681J2158
268F569n00r789Q78K845k519K396N70K676o116p128J3116O358q843q416M583J1693
284H373j718j1892J653J0521n899l922M450m74j918l476N087K521r300J884Q811
299D701l934o716M523N308K4o139j917J0579k357p067L251K931k70n637j172P367
315C475q54r540L344O646m348j477J323K529r09m161P725K119r101J191O698q7
331D573m198k479K219L664n503j550N015l329j591M37K351K422n287j715Q038
346C067N65n021J544J784o8j31q05K561l547l397O412j97o155l01K892J709j693
$$ plain form
239 29 964 2640 -4514 249 5306 -41 -3926 -6031 6116 8142 -7262 -10801 1393 11084 1850
254 1850 -10261 -7058 7988 5559 -3825 1572 -1128 -2909 1869 6363 4787 -7270 -5589 6569
268 6569 6069 -3720 -2842 3 -2516 -120 450 3126 -2990 -10118 2998 9356 513 -7903 -3320 8373
284 8373 6655 -5237 -3584 6937 1038 -2884 1566 1092 -826 -4302 785 3306 -5994 -4110 4701
299 4701 767 -5949 -1426 3882 3906 -2233 -4150 6429 4072 -2995 256 3187 2917 -2720 -3892 3475
315 3475 2621 -6919 -3575 3071 -1277 -2754 -1431 1098 189 -3972 3753 5872 -3229 -2038 4660 4573
331 4573 375 -2104 115 3779 -1724 -3274 1741 -1588 -3179 -2742 -391 2031 -3256 -4971 3067
346 3067 3632 -1389 155 1939 1871 1740 935 3496 -51 -3448 2964 2767 -3388 -3689 -797 912 -781
363g81m114K828M345k692K21j88J72L310j149n5N82l846J318M856k557n015p50
380c515K122L010k333k413J763k540J161N400q95k498j343J253M547O18l171n40
396F26n09j26K760j851o04j090l704K486L187j492j371j637K18L344J749m06j703
413a23k863M503M011l569j925k3Q02J743j630k129q82m14L016J353n066j647K575
430b268L922K736n275m898M861N728J011m648m466K778L105k44O37k917m294J468
446b764K537K547n28n782j659L919M290J092m707k173L924Q38j018K724M15k841
462H14l432o25O881K906p173o176J040Q041L749p859m822M162L453J163j293k157
478a328J045M48P30K588k396k253J211J003J673k205m957K640N209j592m409l112
$$ plain form
363 -781 -4895 -2067 2278 -414 -193 -381 -209 3101 1952 1897 2479 -1367 -49 4807 2250 -2765 -3515
380 -3515 -1393 1617 -716 -3129 -1366 -3906 -2745 2655 1760 -738 -2081 -828 3719 4337 1166 626
396 626 117 -9 2751 900 296 -794 -4498 -2012 1175 -317 -1688 -3325 -3107 237 1986 1580 -123
413 -123 -2986 1517 5528 1959 34 11 813 2556 926 -1203 -2085 -2499 517 1870 -3196 -4843 -2268
430 -2268 1654 4390 -885 -5783 -922 4806 5817 1169 -3297 -519 2586 2342 2979 62 -4232 -2764
446 -2764 -227 2320 1792 -3990 -5649 -1730 2560 3652 -1055 -3228 696 1534 516 3240 3655 814
462 814 -2618 -3243 3638 6544 -629 -6805 -5765 2276 6025 -1834 -6656 -2494 959 2122 829 -1328
478 -1328 -283 165 895 3483 1087 -1166 45 1048 2721 516 -4441 -1801 3408 1816 -2593 -5705
494e705L647O493j849m203j958Q56O166K380n547k692L97K960L739k862l779M39
510a518M20J641oj764K113j261l490K019L451P78j102m289M33M078J111J01j625
527A090l564J409J147J808K599n281n065L396N459J655n110n964M819M881k185
542A094j972q02K087J947l963K66M963j924l193K9K180J766l262j215M362j586
558G77m315K075L002J315l386m785M612N195l823l465Q17M305J209o421p64P106
574C454J346m671m554J174P414J046o768k369K115K570J641k245L5j237m349M099
590a299P827j763q090m319O415J0009l603r132j449M724O129j460p076k59K897
605d49R60J338j944k671J457O30J414M29k431N12J522k66J442j663k099K696J496
$$ plain form
494 -5705 -2058 4435 2586 -1617 -3575 -2719 3447 5827 280 -2412 -2015 945 4684 1822 -1957 -1518
510 -1518 -1098 543 537 -1227 886 -375 -3865 -1846 1605 2383 1281 -3008 -2575 1503 2614 2715 1090
527 1090 -2474 -1065 82 1890 4489 -792 -5857 -2461 2998 4653 -457 -6421 -1602 3279 1094
542 1094 -878 -1680 407 2354 -1609 -1343 3620 1696 -1497 -1468 712 2478 -784 -1999 2363 777
558 777 -3538 -1463 1539 2854 -532 -5317 -705 4490 667 -2798 -1981 2324 3533 -2888 -3652 3454
574 3454 4800 129 -4425 -3251 4163 5209 -1559 -3928 -1813 757 2398 153 188 -1049 -5398 -1299
590 -1299 6528 4765 -3325 -7644 -1229 8780 5177 -3955 -5404 -680 5449 3989 -3087 -3346 -449
605 -449 511 1849 -95 -2766 -1309 -679 735 1164 -1267 -755 767 501 1943 280 -1819 877 2373
622B373j374j068j389J508R85j523K21l99j961J976J439m58o90j561J178K512
638A769j184P5N90j214r6RJ830J756m265l362L184K721n61k050k458J237J819
655b00J288L12l226q19L390J642p99j017j118J318O98r30O39p97j890P67O39M00
673B97r28j614J160J434j519P05J088r95J70P64J119M9k581J505K224k657j144
690i23J176M67j169j640R80J968k407j367K193J657l91k034j58L398O06k113Q8
707C31J63N2J475p70j487j058K93K372r76l212J149J530m59l85j57J330K14j491
725a086K227Q60j989J51J086N58j81k481K1K008j195q37K50o71k6N17M71O64k561
744b214P04L995j395j989Q60J272J211j651j428K038m90j555R43l88o39K45j310
$$ plain form
622 2373 999 -69 -1458 50 1035 -488 -267 -666 -2627 -651 788 330 -360 -1921 -743 1769
638 1769 585 660 1250 36 -60 -51 1779 3535 -730 -4092 -908 1813 1252 -798 -3256 -2019 -200
655 -200 1088 1400 -1826 -2645 745 2387 1588 571 -547 771 1469 539 1178 381 -1509 -742 -103 297
673 297 -631 -2245 -1085 349 -1170 -465 623 -372 -202 562 1681 1730 -851 654 2878 221 -923
690 -923 253 720 -449 -2089 -1109 859 -1548 -2915 -722 935 544 -1490 -1648 1750 2356 243 331
707 331 494 546 2021 1251 -236 -1294 -1001 1371 395 -2817 -1668 -138 -597 -982 -1139 191 405 -1086
725 -1086 1141 2001 12 163 1249 1807 1626 -855 -834 1174 -21 -858 -608 -1279 -1305 -788 -317 347 -2214
744 -2214 -1510 2485 1090 -899 -39 1233 2444 793 -635 1403 913 -642 301 -87 -726 -481 -1791
761a791J475K39j645Q08Q57m03J120o8j49M62o98J311N95k646P5J895p57j150
779d70m21mJ718j887n96J365q52N39Q38n68N02K01m64J714m86j215R43m8k12J68
799G65j362Q57k76j420J616r8j665Q25M04L50L17j679J161J714j463M11K70o96
817C1J403o32j196J079j163J81J058j410j87M46o14R92m36o38J584n46o69J537
835H20l76l14O79j115J219N1j224Q03o69m05Q63q13j82P51r97K63P80o88O97l64
855b21n28J079J8j65O88j077J75J063j148M47N6j075O99Q9o90Q74p50j11O50p39
875f66N61O76j404O34Q65j019Q99m53j91R42o95j67N00j094R56L76j116j26l5
894e57M06J230j173j156R20K40Q17k05j372Q52j1q4J221n01j168K45J28R81J24
$$ plain form
761 -1791 -316 -77 -1722 -914 -57 -460 660 592 443 905 207 1518 2113 -533 -458 1437 680 -470
779 -470 -891 -895 823 -1064 -1660 -295 -1147 -608 230 -338 164 365 -99 1615 1129 -86 857 809 597 765
799 765 -597 260 -16 -1436 180 82 -1583 -758 -354 -4 313 -1366 -205 1509 46 457 727 31
817 31 1434 802 -394 685 -478 -297 761 -649 -836 -390 -1004 -12 -448 -1086 498 -48 -717 820
835 820 444 130 809 -306 913 964 -260 543 -126 -531 332 -481 -663 88 -909 -646 134 -554 143 -221
855 -221 -749 330 348 183 871 -206 -31 1032 -116 331 387 -688 11 100 -590 284 -466 -577 73 -666
875 -666 -105 571 -833 -199 666 -353 546 93 -98 844 149 -18 482 -612 344 720 -396 -522 -557
894 -557 -151 1079 -94 -1250 -330 -90 727 522 -850 2 -9 -93 1128 627 -541 -296 -168 813 937
913I37j424k4J97L1J187p66j317N38M75P8N20q68jP51q60Q68Q43p38k56r21R05
934A55J831j826j365R26Q51Jj076p83J602k81o73O03n03J80N54j55P16q0j464
953g87R25J102P0n68j823K68K182n13q46j263n41J953N61j202l11j00M02P72r0
972A91P34K9k091P55K135j09q35j742J61K138j062q40Q3k57j46P8j35J625q34
991a22j540J543J004j47k71r16O44J089q32K61n37q88J313j64p23m47n79Q43J222
1010G53j716m77J187J54R00m90n07J076m43J4J469j125j360L74N71Q94j009k372
1028b107J147Q08p9J83j066k51J499l85L86O21p13Q55l22o10J130J87j088o8r74
1047h47J101Q56k485K45J061n32p4m00O53R34j784O6K705m36j132q4P40J628j383
$$ plain form
913 937 -487 -511 -314 -283 904 138 -1179 -641 -166 -88 432 -436 -437 314 -546 322 1165 427 171 -750 155
934 155 1986 160 -1205 -279 572 573 -503 -1286 316 35 -638 -35 -538 -358 196 41 757 677 -787
953 -787 138 1240 1310 742 -1081 -813 1369 856 10 -1253 -1794 159 720 -482 -793 -893 -491 281 191
972 191 925 954 -1137 -382 1753 1644 809 -933 -772 1366 304 -536 -453 -710 -856 -778 -913 712 -122
991 -122 -1662 -119 885 738 467 -449 195 1284 452 713 176 -712 601 437 -286 -733 -1312 -469 753
1010 753 -963 -1440 -253 -99 801 311 -196 880 437 451 1920 795 -565 -191 380 1274 265 -2107
1028 -2107 -960 -152 -231 -48 -1114 -1365 134 -251 135 756 43 898 576 -34 1096 1283 195 127 -847
1047 -847 254 1110 -1375 -1130 -69 -601 -675 -1075 -422 512 -1272 -1206 1499 1063 -69 -153 587 2215 832
1066H32k183J884P15j613k96m96J226m8j552R30M96j251J035R22l18R1m78L18
1084B14J205r77k39M10r35N56M83j080j7o85L10J247j720j94J495l33l61K28L10
1103h3J391r05r75J616k0q99M01j88l8l39j023J470j91j689M86Q88p8r6q48J018
1123a02R82j477O21R17m69l74J77L70K06j137K0J457j312r04P27K95j83q73J26
1142i33J338m18r41J134K39k49m4R8P56k92j102J017M07j247q9K72J28l07q18
1161a051N64P09q86R4Q48k86k37N0P39K2p86K44R48q84m5K85n9K56q68r7R81q23
1183b82p39P59K38j2l87Q3Q00l52o64J236K05r67J66J48L52k24r93R27K37j015
1203d84K87J27k53K08n72O74L00p86K44N99l16m1J5J39M37q20J35Q06r02j18O05
$$ plain form
1066 832 -1351 533 1248 -365 -661 -1157 69 21 -1531 -601 -105 -1356 -321 601 283 374 -104 214
1084 214 1419 442 203 613 -322 234 717 -363 -380 -1065 -755 492 -1228 -1422 73 -260 -621 -393 -83
1103 -83 1308 403 -572 1044 1024 125 526 338 300 -39 -1062 408 217 -1472 -986 -98 -176 -272 -1120 -102
1123 -102 880 -597 24 941 472 98 275 645 851 -286 -266 1191 -121 -1025 -298 -3 -186 -1059 -933
1142 -933 405 -13 -954 180 419 170 126 224 980 688 -414 603 1010 -237 -326 -54 74 -233 -1051
1161 -1051 -487 222 -664 -570 278 -8 -245 -195 544 566 -220 24 972 88 43 328 269 525 -343 -440 541 -282
1183 -282 -1021 -262 -24 -36 -423 -340 460 108 -556 680 885 -82 84 232 584 360 -633 294 531 -484
1203 -484 -197 -70 -323 -115 -687 -13 287 -499 -255 344 28 -13 2 141 578 -242 -107 699 -203 -321 284
1224B84m76L87k64m64O24j87l60O50n01PM69m66N15J6o09N68J71m67N53l13q3
1245E4M81o96R2O03j105M89K18m37K81m78j8J015r48J77M54l24K07R6l28R43l59
1266D17o39R36n22l92L68k67N22k96o99M16L21q14L86n0J57%l86N28M58n31J18
1287C1P38n01L01k07k47O11o75n28Q29o81j16J43l98N85j81o36J296l29l55Q23
1307E03m13M4M90m36N22M5r26N41J00o76L11m63J16K38j009M98O05p84J93Q11
1327C10n23L78j30R2R65p54n08O98j2m18R8j26J84n94n59J062o40n96P07k06K48
1348c24J91m71Q64L23n56O39l8n07L57j41k1J53j115M76L08r06M30M9n52N55l09
1369e95J81Q06n16J34L55j92L90J32m30L61l16m16P40o83o62P70l46l73K80l87
$$ plain form
1224 284 -192 195 -69 -533 91 -96 -456 194 -307 -300 169 -297 218 234 -375 193 364 -103 450 137 54
1245 54 535 -161 -69 534 -571 -82 136 -301 -20 -498 -516 499 -449 -272 182 -142 65 161 -167 776 417
1266 417 -222 714 192 -200 168 -99 423 127 -572 -156 165 -649 -263 -313 -156 -156 -542 -14 444 -87 31
1287 31 769 268 569 362 115 726 51 -477 352 -329 -445 -302 -700 -115 -296 -932 364 35 -320 503
1307 503 90 134 624 188 710 755 -171 370 470 -206 105 -358 -242 -4 -1013 -515 90 -694 -501 310
1327 310 -213 165 35 127 1092 338 -170 528 516 98 196 70 254 -340 -899 163 -477 -1073 -366 -572 -324
1348 -324 -133 -604 260 583 27 666 628 121 478 337 316 469 -646 -170 138 -768 -338 -289 -841 -286 -595
1369 -595 -414 392 -124 10 365 173 563 695 265 626 310 -106 634 -49 -711 59 -287 -660 -380 -767
1389g67O37J60p97J067rk50K55J38K28J23p42K67O66j166P6j47j28L95p86M1P78
1410C9q36L24M76k86L36J44j85N08J7k97M24m08l7L82o13L4j85m56N90j63m56
1431f48K62r5k2M77l96P37M5m88O27J69l53L41m59Q6L13p55O7j07j53L59k79k97
1453e69L26M1k88N49k01J9N95o52M01J69k96M48l40j35O42n71p12N20k49K45k16
1474b74m30P69k44l96L27L99j84K37m52O63M85q68mL85k96J66k82j55L10o25J22
1495c47L17n23J88K94m20L76J60l07N43k51k50O35j49j67Q7l24N97l43n46M70
1515D0J08p31M17m6K0L53q46N89N98j015O01L1L8M54o22k36Q61o24qL91p12K73
1537f6J47l48L28j56l77R44n54k92P63m46j81M10l32N20l62l21O20J30m13J59
$$ plain form
1389 -767 -130 30 -767 300 291 41 296 434 662 785 43 310 976 -190 -114 -261 -389 6 -780 -739 39
1410 39 -797 -473 3 -283 53 197 12 520 537 240 664 256 219 601 -12 22 -163 -619 -29 -192 -648
1431 -648 -386 -481 -503 -26 -422 315 360 -128 499 668 315 656 197 283 596 -159 -92 -199 -352 7 -272 -569
1453 -569 -243 -202 -490 59 -142 -123 472 -180 221 390 94 542 202 67 709 138 -574 -54 -303 -58 -274
1474 -274 -704 65 -179 -575 -248 151 -33 204 -248 415 900 32 28 413 117 283 1 -154 156 -469 -347
1495 -347 -30 -553 -365 -71 -491 -115 45 -262 281 30 -220 415 266 99 186 -138 459 116 -430 40
1515 40 148 -583 -166 -212 -192 161 -685 -96 502 -513 88 119 157 611 -11 -247 614 -10 -18 373 -339 -66
1537 -66 81 -267 61 -95 -472 472 -82 -374 389 -57 -238 172 -160 360 -2 -323 297 427 14 173
1557A73j56J31J94p20L25K94q70M62M2O6K67n21j10P63m57k1N16l58J19O0l22
1578a23N08j57m78P89o83k88P98k05k02j51k41O33l36o02P35K5k29K01j27K70
1598A37K20p23M90O78o96J05kr8J36n03J94J33m03j6K75k82L25k43lO91k16n43
1620c44P86p9r9p7l65M72k5n34M66p4m90M46k88k2N0l00M06J08m72O10j03j99
1642a27L11O2k7J91k07r3L81l98j41K02l71J04k01k05P43n20p1K32J2P7m1j28
1664b15O31k5m60Q20k57l82J31k80J65J27q09O26k64m21L36j68Q8L37l57L61M07
1685C91l70m6M46j88J53k94K63J62o15j88M63l30k36Nl9L97m26K3M50j04k02N25
1707B40K8l5K27l48L40j08k86L96k72k65j86mJ48J1l83J80K57m89N48j81J44J28
$$ plain form
1557 173 17 148 342 -378 -53 241 -629 -167 -125 -59 208 -313 -423 340 -117 -138 378 20 139 199 -123
1578 -123 385 228 -250 539 -144 -432 366 161 -41 -192 -433 200 -136 -738 -3 22 -207 -6 -133 137
1598 137 357 -366 124 802 106 211 209 111 247 -256 -62 71 -332 -348 -73 -355 -30 -273 -276 415 199 -344
1620 -344 442 363 264 187 -178 294 269 -265 201 127 -363 83 -205 -227 -177 -477 -71 37 -435 175 72 -127
1642 -127 184 246 219 410 203 110 491 93 -48 154 -217 -113 -314 -519 224 -296 -367 -135 -123 -46 -87 -215
1664 -215 416 391 -69 751 494 112 243 -37 128 255 -554 72 -192 -613 -277 -445 -357 -20 -377 -16 391
1685 391 21 -25 421 233 386 92 355 517 -98 -286 177 -153 -389 -384 -423 -26 -452 -429 21 -83 -285 240
1707 240 268 233 460 112 452 344 58 454 182 -83 -269 -273 -125 -114 -497 -317 -60 -549 -1 -182 -38 90
1729I0j4J76M02m94J49M85n20k9j97k34L35o66j10L79Q9l77K93j31K07J72l27
1750c22R09k52k57K96j29M8J23m36mL42p88J81K50m75K10L9q3K30n01N52N17o47
1772a97K05K69l7J34K1l91M77n23j09P17q86K46j52j50J49p1k54O37L8j63K23
1793A83j25j01L21j42P6K91o52N70R0n86J46k16J07J61n43J10N02n57J67K5j19
1814b92N00l89K82K48k65j06L10qM9k88j53N32m57k23M88j89l30J1J74j41J05
1835a42n03O66M9l61L96Q9j21J17k62J77K44m84P6K66k61l3L5r3M05o89P0L64
1857Ek65J71L80k80n8L24k66L15k30l08M58l67m2J88k02L22K0m13K62q8k05K88
1879IQ1j97J96l03J76K89o12M58Q1o9O0m2j57L39l18r3K29l0k77K05j27J10j28
$$ plain form
1729 90 76 252 654 160 309 794 274 245 48 -186 149 -517 -627 -248 -159 -536 -243 -374 -167 5 -322
1750 -322 587 335 78 374 245 293 416 -20 -24 318 -470 -289 -39 -514 -304 -265 -348 -118 -619 -67 450 -197
1772 -197 8 277 240 374 395 4 481 -42 -151 566 -320 -74 -226 -376 -227 -298 -552 85 123 -40 183
1793 183 58 -43 278 136 212 503 -149 421 511 -75 71 -145 -38 123 -420 -310 192 -365 -198 -173 -292
1814 -292 208 -181 101 349 84 -22 288 280 329 41 -112 420 -37 -260 228 39 -291 -280 -106 -247 -142
1835 -142 -645 21 70 -291 105 194 73 190 -72 105 349 -135 -59 207 -54 -87 -52 -145 260 -429 -359 5
1857 5 -260 -89 291 11 -47 277 11 326 96 -212 246 -121 -163 25 -177 145 165 -248 14 -74 -279 9
1879 9 90 -107 89 -214 -38 251 -361 97 178 109 169 127 -30 309 -9 -102 127 97 -180 25 -102 8 -120
1902a20o5j26J70o7J00N2R4K61l06K74k0n57N72p6q7j19m5l7J40n5J5m9k09J70
1926i0o8J27N7j81mM02j27K9J5q7K31k3k98L54j01k81K56j19k03m3j88J29J40
1949g3l75L98r5N9J98p5p4L14j74N4K19n15M12k15k87L34k80q8J27k78K15K0k14
1972c93K84l2o0L83r2O2K25j37j15K44k74J62O6m80P3J17m55J83PQJ62m3k2J61
1996C4k38M75m9l18L75j39M3J53j35r7J60m26J05M6k85K4l7Q1J78k49n9M55j74
2019g7J39J90k69J81O7j87L01j09k88J64k07m7L13o35L13N9l79M00j51j64M64
2040G8m7Q0J44o2j3J47k38K06K06o14L55j21j47rj66l45L51j65J16J49q1L36J70
2063C30j42K57p9l51M46k67K63q2m77J87N9l92J94r0k52J00n3o8M44m7k61N21
$$ plain form
1902 -120 -185 -311 -141 -208 -108 -56 38 299 -7 267 247 -310 262 186 99 -20 -65 -102 38 -17 -2 -51 -260 -90
1926 -90 -158 -31 26 -155 -159 243 116 145 160 73 304 281 -17 337 236 -45 211 92 -111 -154 -342 -213 -73
1949 -73 -448 -50 -145 -86 112 37 -37 277 103 157 376 -139 273 58 -229 105 -175 -263 -136 -414 -199 -179 -393
1972 -393 -109 -141 -201 182 90 152 377 240 125 369 95 257 323 -157 -84 33 -422 -239 -232 -224 -62 -105 -127 34
1996 34 -204 271 222 -96 279 140 183 336 201 104 264 -162 -57 -11 -296 -272 -309 -228 -50 -299 -358 97 -77
2019 -77 62 252 -17 164 231 44 345 236 -52 112 -95 -142 171 -464 -151 -92 -471 -71 -222 -386 78
2040 78 31 111 255 193 180 327 89 295 501 -113 242 121 -26 -35 -201 -546 -195 -360 -244 -95 -176 160 330
2063 330 188 445 366 15 461 194 457 375 -102 85 144 -248 -54 -144 -396 -296 -349 -417 27 -20 -281 240
2085B40m25J88J43j53K75Q8l07J64j92J59k6j92j82N1k65L96j14j62N64l06k06
2106b62M20pp1L32m41L01J23l22K26k59r9k6k14mL50m63K48J30j13K7L57j93J37
2129A77j30J09L14k10j09N1l11K13R8j87j5k22R0L04m82J70J5j56L29j3j96K77
2151A16j03mK19j40L7Q9k29j0L75o14K28N5k39K49r9n1o5K8J91J66m18K39K56
2174B76j95R1N9j4Kj46j05m9J75j88j35J35J10j48j92K95L2k2m9jJ78K3j10R0
2198A12J12k55J21%J44q7k88J00K30l98M5L26l62Q9qJ06J68k13L7K91k86j75N73
2221C82l09J54k18j40M21k67j32J41J7q9J99l39L27j87l31K64K77k83L1j09K01
2242A0L50m76J62P8j91Q0K12n1N0j34m4J81k83j08K46k94K65r9j54K52k67kL24
$$ plain form
2085 240 -185 3 146 -7 268 356 49 213 21 180 154 -38 -220 -169 -434 -38 -152 -314 250 -56 -262
2106 -262 158 151 80 412 -29 272 395 73 299 40 -59 -85 -299 -303 47 -416 -168 -38 -151 -124 233 40 177
2129 177 47 156 470 260 151 202 -109 104 202 15 0 -222 -132 172 -310 -140 -125 -281 48 35 -161 116
2151 116 13 9 228 88 125 214 -15 -25 350 -264 -36 19 -220 29 -70 -121 -186 -158 33 199 -219 20 276
2174 276 81 172 231 217 219 73 -32 -81 94 -94 -229 -94 16 -132 -324 -29 3 -19 -68 -69 109 132 22 112
2198 112 224 -31 90 90 234 147 -141 -41 189 -209 -164 162 -200 -111 -119 -13 155 -58 -21 270 -16 -191 382
2221 382 73 227 9 -131 290 23 -109 32 49 -40 159 -180 147 -40 -371 -107 170 -113 -82 -191 10
2242 10 360 -116 46 124 -67 13 225 174 224 90 46 227 -56 -164 82 -212 53 -46 -200 52 -215 -217 107
2265A07j03n0Q7R2l0J24l84L26l00j36K86k58jR3J50r4L16n88J29J78j57J21J75
2288H3K0J18j00k62M61l10j10M18l84M78m85k75L51k04J34M7l15J19M05k84J37
2309D2J19k77L56j35k17K53P7j48J08k24J13J86n19J49n5j87M23p1j15K23l24
2330b23k8M70m63M23JJ39q0J62m29K47k53j09K47j07j51K8k32L17j51k11M39k72
2352b36p9L80K8j71L07j7L3O2j38O2r6l07K12r3l13K64m3j15O6j36K54K6j23K20
2376D7p8NJ98q1K4pM6j48k7K0J2J03m11K30k44p1M42m27M67Nk28K3K95j78J64
2401A81P7J1P1j69j33L06l62p0K53m76N2J74k13K00J44R3l3o2j58K03p3K10l11
2424h5J61L08k13k97J32j77K27J76k28M4k7k67K31k19o5L90l95K33J01k04J16
$$ plain form
2265 107 4 -46 41 133 103 227 -157 169 -131 -267 19 -239 -240 -147 3 -91 225 -363 -234 -56 -213 -92 83
2288 83 103 221 121 -141 320 10 -100 318 -66 412 -73 -348 3 -201 -67 -20 -335 -216 189 -95 42
2309 42 161 -116 240 105 -112 141 218 70 178 -46 67 253 -266 -117 -172 -359 64 -7 -122 101 -223
2330 -223 -251 219 -244 179 180 319 239 401 -28 219 -34 -143 104 -3 -154 -126 -358 -41 -192 -403 36 -236
2352 -236 -315 65 93 -78 229 212 245 307 169 231 135 -172 40 -53 -366 -102 -145 -260 -194 -330 -76 -50 -173 47
2376 47 -31 -26 172 91 115 108 154 6 -21 -1 11 114 -297 -67 -311 -382 60 -367 100 105 -123 -100 195 17 181
2401 181 258 269 340 171 38 344 -18 -88 165 -311 -259 -85 -298 -98 46 139 106 44 -114 89 16 226 -85
2424 -85 76 384 171 -126 6 -171 56 232 4 48 21 -246 -15 -234 -299 91 -304 -71 30 -174 -58
2445e8P20o21Q2N5l6O4k38J40ql40l2L19k76J80j50K63J63l12K0N00l49j37J32
2468H1J89o1m8l32K26Lk00J70j10L4J31k73R0O7k12J81J95l0J24q5j78J31j0o7
2492A6L64n86K52J25m09K31k33K50p2Q5j88M01l22k4N2p2L46p1j07L7j62J60K38
2515C11m16J91m3k05K53j43j03J62mk13J85J33k50R5j07J07J41l32M11p8j44J92
2537A43k64m9L18q8j59J69m10L50Q8k06J9O1k32L46k12j03K33j90K53J93m00L4
2559a06K90k71K76k26l9L55k56M1j8j69J58J4m74K07J32m5J52J47Oj14q6j08L22
2582A88k87J39K51m23K87j04k99K12J21k34J72K1j07J21k99K26q1J2J49j03J20
2603H2M8j9m4O3l98J33K88j10K49k63Q2q3k64J41K1n9l6R2o1R9K17k51L07P8k07
$$ plain form
2445 -58 662 41 123 178 142 206 -32 108 100 -240 -272 47 -229 -49 -199 64 227 -85 -65 435 86 -51 81
2468 81 270 209 161 -171 55 58 -142 28 -82 -48 83 -190 -100 -33 -245 -64 131 101 225 140 -38 93 83 16
2492 16 380 -206 46 171 -238 -7 -240 10 -62 23 -165 236 -86 -110 -58 -130 216 145 38 75 -87 73 311
2515 311 -105 86 43 -162 91 -52 -155 7 3 -210 -25 108 -142 -47 -154 -47 94 -238 173 95 -49 143
2537 143 -121 -170 148 60 -99 70 -340 10 98 -108 -89 -28 -260 86 -126 -229 4 -186 67 260 -140 -106
2559 -106 184 -87 189 -37 -76 279 23 64 46 -123 35 49 -425 -218 -86 -131 21 168 174 60 -26 -134 188
2582 188 -99 40 291 -132 155 51 -248 -36 85 -149 23 44 -63 58 -241 -15 -96 -84 65 -38 82
2603 82 130 111 67 130 -268 -135 153 43 292 29 111 28 -236 -95 -74 -133 -169 -77 -138 -39 178 -73 234 312 105
2628A05K04k67J48n1q3M4q6k35K79o3j92J49P8j0k54p3M29J18l21K70j98R2j3
2651G0K1q7K03j54K09k38j28K1k6p9J35k05K03J74k12N6J65r6R8J00j92K69L6
2674C43l27J88q6j38O9j15j17N3j90N8L34l73J31J74M1J22j78N8K89l13L15P8
2696D16j89p4n7o4n6j5l0Lj00J64M1k03P8l8j27L66jp9R8j54J90r3k47K61J00
2721A90l11K32k9k81N2Rn7K09m10L79J15k15K42J1L3L8j69P9L2j65J43j54j27
2744a54J14r5r0J54K11m36K71L1J9M6j59J78m0j17K79%n3r2j79J98R1j60M6o5
2768bl1M0N6l03K40k18J29o7P5J48J07o2k38J02K70k3K5m55L08m8k35J81k34Q5
2792a50K38j28r7N2j93J80M4qJ41j36R2ql3m5J18K8J1L8k38N9O4rk61L14k17J94
$$ plain form
2628 105 309 42 190 139 56 100 14 -221 58 -5 -197 -48 30 20 -234 -307 122 240 -81 189 -9 83 70
2651 70 91 4 207 53 262 24 -104 -83 -109 -188 -53 -258 -55 119 -93 -37 128 32 130 230 38 307 343
2674 343 16 204 118 -20 49 -66 -183 -130 -320 -262 72 -301 -170 4 45 167 -11 47 336 23 338 416
2696 416 227 153 96 32 -24 -39 -69 -66 -166 -2 39 -164 -86 -124 -251 115 114 35 133 -21 169 76 -171 90 190
2721 190 -121 111 82 -199 -147 -138 -195 14 -396 -17 98 -117 125 136 169 207 38 117 149 -16 127 -27 -154
2744 -154 -40 -135 -225 -71 140 -296 -25 6 25 71 -88 90 50 -67 212 212 159 67 -112 86 177 17 63 -2
2768 -2 -33 7 63 -240 0 -218 -89 -156 -81 67 174 112 -126 -24 246 223 248 -207 101 53 -182 -1 -235 -150
2792 -150 88 -40 -137 -85 -278 -98 -54 -62 79 -57 35 27 -6 -51 67 95 106 144 -94 -35 29 20 -241 73 -144 50
2818E0k77L08j73L26k23pK3K01j66j20L73n14K76j35k07J93J04j85K90k19j7J11
2840A2L3k1J66l42J57Q5q1J84L4l98J24j45K53K68o87K66J9l5K46p5k62K9K41
2863G1k76J92Pj31J35J28j94l9qK95j86n8M4M3No5K1r5J44j09K06M9k09Q6j91
2888a35J77KJ4N7J68j59J29k33K4p7J94l20L26j12r1L6Q7j64K69k62R4j19K6L18
2912B49k91j02M35m29K71m7j41L32j44l5q5K0k18K60j23Oj33K27R0r7j56J88l5
2935D2l30K95O2m0O5M0j11M11m31R6n5o1K12p7j90N8j08J61pl63M10k09k8l7K88
2960I3j42K41p3j65N17n05l1K82l10J3j58J00J15%j5L1j5j08J81O9K4n3M2n3r1
2985a1J06J3l0L9k1k19J11j80J04J58k91J32L4o7o2K65k1J48J00l82O6K03k57
$$ plain form
2818 50 -227 81 -92 234 11 4 27 228 62 -58 315 -199 77 -58 -265 -72 32 -153 137 -82 -99 12
2840 12 45 24 190 -152 5 90 9 193 227 -171 -47 -192 61 329 -358 -92 -73 -108 138 63 -199 -170 71
2863 71 -205 -13 -6 -137 -2 126 -68 -107 -115 180 -6 -64 -20 23 28 -37 -16 -111 33 -76 130 179 -30 56 -135
2888 -135 42 44 58 115 283 124 253 20 44 -33 161 -159 167 55 -36 0 87 -77 192 -70 24 -95 -69 249
2912 249 -42 -144 291 -138 133 86 -55 277 133 98 13 33 -185 75 -48 -42 -175 52 142 45 -111 77 42
2935 42 -288 7 69 29 94 134 23 434 3 99 44 -17 195 118 -72 -14 -122 39 32 -331 79 -130 -158 -195 93
2960 93 -49 192 119 -46 471 -34 -65 217 -93 -80 -238 -138 -23 -23 -38 -7 -22 -130 51 120 144 91 133 80 -11
2985 -11 95 108 78 117 96 -123 -12 -192 -88 70 -221 -89 -55 -122 -184 81 60 208 308 -74 -8 195 -62
3008f2J12K37j76p3j90J20Q1o5j14j7j50K62j72q5N85l72j08L52l62J80J11r7
3030cJ59r1k71J05L47k62n3J93m09L92k02N9KJ49q2j44n3J6M25j44o0k21K7NM9
3055f7M2k6j08J95j36j25J03M2k23L91l00J5M79m04J05Q3M4j41O8k5pmQJ14j00
3080B3j74J71k18n4J84j94K24j22P7J63j18J51Q3j38J49r9n1M3j13k48L39k88
3102b10Q7P7k68K50K5lk57K57k06K59O7k25K24N3k60K49q2j74M6O8N4k13L50j63
3126Ej97Q6J2M4Q3kj76P6J71K3J0l79J57K14q9o2L01k82J04J94l68K30k88K5M37
3151C29l34M2r8r0O2J26J28jj39L8j37N3J12j56j62O9L18k73P8J8j52L10k11o9
3175a39J19L1j35L20k95j26Q9R7K74k32J13J21k07nJ35l79J91r1K36j85K41k06
$$ plain form
3008 -62 50 287 111 38 -152 -32 49 -16 -130 -147 -297 -35 -207 -292 293 -79 -187 165 -197 -17 94 -3
3030 -3 156 65 -206 -101 246 -16 -69 124 -285 107 -95 -36 -34 115 33 -111 -164 -148 277 133 73 -148 -121 -116 -67
3055 -67 -25 -51 -159 36 -100 -225 -122 -80 -303 88 -212 -197 282 -122 -17 66 110 -31 37 12 5 1 9 123 23
3080 23 -151 20 -198 -252 -68 -262 -38 -160 -83 80 -38 113 196 58 207 108 57 100 -13 -261 78 -210
3102 -210 -123 -46 -314 -64 -39 -42 -299 -42 -248 11 78 -147 77 130 -130 119 37 -137 -91 -23 31 -182 168 5
3126 5 -192 -106 -94 -50 33 31 -145 -69 102 125 135 -244 -87 127 38 -24 277 -5 99 293 -75 155 -133 -108 329
3151 329 -5 37 -61 -151 -89 37 165 164 25 63 -74 -21 91 -65 -227 -158 160 -113 -35 -17 -169 141 -70 -139
3175 -139 -20 11 -124 196 -99 -225 -136 -39 235 3 116 237 30 25 160 -219 -28 -119 117 -68 173 -33
3197c3O5j6o9K36m01K25o2K7q6J98k62L58k7k03K34k77K4j50M7Q2Om4Q3L7j22
3222a30J42j40L6L35j86j31J81j44N4k0m9J41j96J86j40J48nJ11o3j50l7m5O9
3245c3l2j24K29j04J06rj80K82k68pJ98L0j44K70j08j21j65l1K41j98J17J90J41
3268B80l29K98m41M3K18m3R8j62Mm0L29k69J66j12rJ6k67N4K28k1k5j80J28j23
3292a59J46Mj09O2j56M41k37J39l1j32q4K94k33N7o8j26J71k7j82K21j56Q4Q3
3315BK1R2K76m75L32j6k47J26j05k00K20jO4j1k07moJ9K46j96J9L5j41J3J13m0
3341g1o3L02j15m7K92k70N7r0j38J89n5J75k28m5J03J4m2L3mk9J05J2J02p0j23
3366fK16J37k64lj96r4L13k27p4O3L3k02K20L5p1L0K9K65l24L01j71mqp3O7Lr2
$$ plain form
3197 -33 32 16 -53 183 -218 7 -55 -28 -114 84 -178 180 153 -50 184 -93 -69 -219 -172 -90 -84 -128 -45 -8 -130
3222 -130 12 -128 -92 243 57 -74 107 -37 17 -3 -52 89 -107 79 -61 87 82 193 130 -20 -57 -102 -33
3245 -33 -65 -189 40 -64 42 33 -147 135 -133 -140 58 88 -56 214 106 -15 -180 -211 30 -168 -51 139 280
3268 280 -49 249 -192 -149 69 26 124 -38 -34 -74 255 -14 152 40 31 47 -220 -166 62 41 16 -164 -36 -159
3292 -159 -13 -9 -118 -56 -212 229 -8 131 100 -32 -116 178 -55 2 -66 -192 -21 -48 -230 -9 -165 -81 2
3315 2 23 115 391 -84 248 232 -15 111 6 -194 26 25 89 78 -129 -133 -139 -120 126 -70 -51 -16 -157 -144 -31 -71
3341 -71 -134 168 53 6 298 28 85 -5 -143 46 -9 166 -62 -107 -4 10 -32 1 -3 -32 73 85 187 117 -6
3366 -6 210 347 83 80 -116 -210 103 -124 -198 -135 -102 -304 -84 -49 -120 -90 -61 204 -120 181 10 6 -2 -75 -8 -5 -97
3393i7km4l3K4Nj13M9J31L5j96J46j08K96J0p9J16rk43K10m4l17M13j67J80j90
3418b7j14J02nJ42j00j00K49j70J61j98O6k19K62n5M7o7K8K35j66j71M6L5l5K3
3442c1k45J52L27m91Q1J36J68j67K78k49Q7p3j28K51P5k09j05K19l10L20m33L98
3464E1k13p7J30P7j3PmLM0O6J23j12q0M3J37j80J35j78J61k59K06k77M92k29n5
3489fj51K04O5k30K5K2k48K51L2L3M4k07P5lK00j29M2R9j10l42L09qK01j5K2k95
3515a20J59L8R0k03K23j89K5J02j54K23l06J90j64nK42r7M1n6J40j18q7RL7P8
3539I8ql02K77L2k48J43J96m5j8r7j32J91k86K68j19k05K72l1j1R6j08P6j71m
3563a36J73O5j1o6k21R1J09K4j01K80m06J85J9j46K2O5J7K09l51LK23j09J03P9
$$ plain form
3393 -97 -99 -143 -176 -152 -147 -260 -211 -80 -45 -241 -95 -203 93 103 24 140 131 -112 98 54 -263 150 -17 163 -27
3418 -27 -141 -39 -44 98 -2 -102 147 -23 138 -60 6 -213 49 -6 41 -26 2 237 71 -100 -54 -19 -54 -31
3442 -31 -276 -124 203 -288 -207 -71 97 -70 208 -41 46 -27 -155 96 171 -38 -143 76 -234 86 -347 51
3464 51 -162 -239 -109 -32 -45 -38 -42 -39 1 67 190 78 -2 41 178 -2 133 -45 116 -143 63 -214 278 49 -6
3489 -6 -157 47 112 -118 -93 -71 -319 -68 -36 -3 41 -166 -91 -94 106 -23 19 118 8 -334 -25 -33 168 153 175 -120
3515 -120 39 77 167 -36 187 -2 23 125 -29 194 -112 78 -86 -91 151 54 95 39 179 61 -26 -17 20 98
3539 98 90 -212 65 97 -151 -8 188 143 125 28 -104 87 -199 69 -50 -255 17 -14 -25 71 -37 39 -132 -136
3563 -136 37 102 91 25 -196 -105 4 28 -73 207 -199 -14 5 -141 -119 -54 -37 172 -179 -176 47 -62 41 120
3587A20p7o6N0K0j9J86k15q1J42r2q1p6J74k37j64M87j27J17L9R3k08J12M9r3
3611E3P3j10K7J06k71K32j20o1j02N4k1K65k02k5j48K19j11M75j97N1j00j68L03
3634B22m00O7M18k83m3J51o8l1m8k35K06q0k0r2K36n2O1LP1p6j4K61n9j48o1j06
3660a20J41K08l17n6L83r5k86m8J76J9l3kP9P6R8k82o2L44o3M4k36J95k34Q0m0
3685c1m7K11pk86J74l5j56J87o4J68j52J07O7k75l0K74O6K4m5j37l3O6k10K55
3709I1k96Q1l6R9L8m4OK71j25j18K17j84M0j38J3R8p9n9J92j24q3J9J59k81J39
3734a04m9J28L00l02K8L6R7j2m5J64k25O4L4j59J97j61p0L6p0oK00J7p1q1j54
3759b08K90k42K26M0M6j8k86K17m3j23K72k32J15j81K60k97K62J7k06o5J30O9
$$ plain form
3587 120 43 -23 27 47 28 214 -1 -82 60 -32 -113 -189 -15 -252 -416 71 -56 61 100 193 -15 97 146 53
3611 53 126 16 43 149 -122 110 -10 -71 -173 -119 -140 125 -77 -102 -250 -31 -142 333 136 187 87 -81 222
3634 222 -178 -111 307 24 -19 132 64 33 -15 -250 -44 -124 -144 -236 0 -52 9 12 83 7 -7 254 195 47 -14 -120
3660 -120 21 229 -88 -144 239 144 -142 -190 -14 5 -28 -30 49 125 223 -59 -121 223 160 204 -32 163 -71 9 -31
3685 -31 -78 133 126 -160 14 -21 -177 10 -54 114 -38 69 136 -139 -169 105 171 195 150 13 -20 46 -164 91
3709 91 -205 -124 -160 -61 -23 -67 -61 210 85 -33 184 0 40 -98 -85 13 -66 -125 67 -57 -140 -121 38 -243 -104
3734 -104 -153 -25 275 -27 1 37 134 122 77 241 16 80 114 -45 152 -9 -79 -43 -113 -119 81 98 27 -54 -208
3759 -208 82 -160 66 106 152 134 -152 65 22 -101 171 -61 54 -127 133 -164 98 115 -91 -156 -26 43
3781D3P7p6j03l9M43l22J58j34j46N8J22ml31L17k92N4J94j90J63m8P5r6j12K35
3805D6p2n5R3R0k64J96Q1j77PJ53J0L0j08J0o6n1r6J89J6q3p3R5j93J74K2J03
3831G7j47p2K66r5l8K57k62k63K70l2J24r6K8J10j92j22L56k21Q7j08J21Q3j85
3854e4J61O5j19j75K60k20%M6j17J10J08J5k20P5J0J05j20%J0K60j62j40L09j97
3878A0J50l77L70j17n3J16o5k44J64j25K9K47j93P9O1j12l06K05K66J4k20J92
3900I1q2l8%M8j80M50k57m4J1J5LJ9k13N9rQ0J79l73J81J54lM0o3j40J47L9jr8
3928A5j47K35K0k47nM4j33P6K42q6Q7k83j01M80j58j17N9k8q9K45Q1j92j04K31
3952A25j12M2n1k3J71j14L3j11M8O2moK4l29L54J10l8L4l10J62r6k13K42N3p3
$$ plain form
3781 43 120 44 -59 -98 345 23 181 47 -99 -41 81 77 -254 63 -229 -175 19 -171 -8 -56 19 -77 -189 46
3805 46 -26 -81 12 102 -162 34 115 -62 -55 98 108 138 30 40 -26 -77 -173 16 32 -51 -124 -29 -222 -48 -26 77
3831 77 -70 -142 124 29 -9 248 -14 -277 -7 -39 85 -11 17 127 -65 -187 169 -52 35 -73 48 131 -54
3854 -54 107 172 53 -122 138 -82 -82 -36 -153 -43 65 80 -140 -65 -55 50 -70 -70 -60 200 38 -102 207 10
3878 10 160 -217 153 36 -17 99 34 -210 -46 -171 -142 105 -88 -9 52 -60 -366 -161 105 119 -101 91
3900 91 9 -29 -29 19 -161 289 32 -12 -1 14 17 36 -177 -118 -127 -47 132 -241 -60 94 91 131 68 -72 75 114 113 15
3928 15 -132 103 123 -124 -129 -85 -218 -142 100 14 101 -182 -283 197 39 -78 -19 -47 -136 109 190 -2 -106 125
3952 125 13 55 4 -19 152 38 71 -40 8 70 66 60 84 -245 109 219 181 215 -95 67 -29 -242 0 53 -20
3977b0o4K02j49J5j6k06K09M0m9k03N8K31q5K8p1j61K54K5Mr6K16j61n6O3k59
4002b51N6J91j56J12k50K95N3k08J04L04k04q9L2k76L32l07L52k04J40j89R6R9
4024C2j27L32k80R4j55J02qK3J27Q4k66j35K16J0L5J15k68OKj54J48j48K54n0
4048a1j6m6K1N5Q1j52L4J83q9J0o3L1j88K69j48J75j23Kk25K51j30J74jR7m65
4073b74K43J03q1J09k41J17K1K85j84J6m0j30jOl1K21j23M5j0K4j80L25k34J61
$$ plain form
3977 -20 -84 118 -31 -16 -32 -238 -29 11 -38 -241 -183 48 -37 -9 -80 -241 13 38 42 -54 162 1 -55 8 -251
4002 -251 -195 -4 -160 -48 -298 -3 50 -158 -54 250 46 -43 -11 -287 45 -262 90 -114 26 -163 -67 32
4024 32 -95 237 -43 51 -104 -2 -10 13 140 224 -42 -177 39 49 84 199 -69 -63 -61 -215 -67 -215 39 -11
4048 -11 -27 -73 -52 3 84 -68 -34 149 60 70 7 38 -150 119 -29 146 23 25 -200 51 -79 95 94 191 -274
4073 -274 -31 72 -9 100 -141 -24 -3 282 98 114 74 -56 -57 -51 -82 139 16 61 51 75 -105 220 -14 147
$$ [...]
8191B24
##END NTUPLES=NMR FID
##END=
