##TITLE=1H_Pr bis
 CDCl3, 8 sc, 
 5.7.2019
##JCAMPDX= 6.0         $$ Bruker NMR JCAMP-DX V2.0
##DATA TYPE= NMR FID
##DATA CLASS= NTUPLES
##ORIGIN= UXNMR, Bruker Analytische Messtechnik GmbH
##OWNER= root
$$ XWIN-NMR		Version 3.5
$$ Fri Jul  5 14:14:45 2019 Russian Standard Time (UT+4h)  she@DPX200
##.OBSERVE FREQUENCY= 200.13155
##.OBSERVE NUCLEUS= ^1H
##.DELAY= (6, 6)
##.ACQUISITION MODE= SIMULTANEOUS
##.ACQUISITION SCHEME= undefined
##.AVERAGES= 8
##.DIGITISER RES= 18
##SPECTROMETER/DATA SYSTEM= spect
##.PULSE SEQUENCE= zg30
##.SOLVENT NAME= CDCl3
##.SHIFT REFERENCE= (INTERNAL, CDCl3, 0, 15.7039)
##AUDIT TRAIL= $$ (NUMBER, WHEN, WHO, WHERE, WHAT)
$$ ##TITLE= Audit trail, XWIN-NMR		Version 3.5
$$ ##JCAMPDX= 5.01
$$ ##ORIGIN= Bruker BioSpin GmbH
$$ ##OWNER= she
$$ F:/spectra/data/she/nmr/H-F/1/audita.txt
$$ ##AUDIT TRAIL=  $$ (NUMBER, WHEN, WHO, WHERE, WHAT)
(   1,<2019-07-05 14:13:40.04 +0400>,<she>,<DPX200>,
      <created by zg, POWCHK disabled, PULCHK disabled
       configuration hash MD5:
       00 E9 B6 7A A2 85 ED C7 34 08 36 98 17 FE 4E 26
       data hash MD5: 16K
       21 B4 DF 28 38 04 E6 59 42 B1 D4 7C B4 0F 8F 9D>)
$$ ##END=
$$ 
$$ hash MD5
$$ 94 66 DA CB 66 27 EE 03 7A 4A 86 61 4A EA 85 56
##$RELAX= 
##$RELAX= 
##$RELAX= 
##$RELAX= 
##$RELAX= 
##$RELAX= 
$$ Bruker specific parameters
$$ --------------------------
##$DU= <F:/spectra>
##$EXPNO= 1
##$NAME= <H-F>
##$PROCNO= 1
##$TYPE= <nmr>
##$USER= <she>
##$AMP= (0..31)
100 100 100 100 100 100 100 100 100 100 100 100 100 100 100 100 100 100 
100 100 100 100 100 100 100 100 100 100 100 100 100 100 
##$AQSEQ= 0
##$AQ_mod= 1
##$AUNM= <au_zg>
##$AUTOPOS= <>
##$BF1= 200.13
##$BF2= 200.13
##$BF3= 200.13
##$BF4= 200.13
##$BF5= 200.13
##$BF6= 200.13
##$BF7= 200.13
##$BF8= 200.13
##$BYTORDA= 1
##$CFDGTYP= 0
##$CFRGTYP= 5
##$CHEMSTR= <none>
##$CNST= (0..31)
1 1 145 1 1 1 1 1 1 1 1 1 1 1 1 1 1 1 1 1 1 1 1 1 1 1 1 1 1 1 1 1 
##$CPDPRG= <>
##$CPDPRG1= <>
##$CPDPRG2= <>
##$CPDPRG3= <>
##$CPDPRG4= <mlev>
##$CPDPRG5= <mlev>
##$CPDPRG6= <mlev>
##$CPDPRG7= <mlev>
##$CPDPRG8= <mlev>
##$CPDPRGB= <>
##$CPDPRGT= <>
##$D= (0..31)
0 1.2 0 0 0 0 0 0 0 0 0 0.03 0 0 0 0 0 0 0 0 0 0 0 0 0 0 0 0 0 0 0 0 
##$DATE= 1562321619
##$DBL= (0..7)
120 120 120 120 120 120 120 120 
##$DBP= (0..7)
150 150 150 150 150 150 150 150 
##$DBP07= 0
##$DBPNAM0= <>
##$DBPNAM1= <>
##$DBPNAM2= <>
##$DBPNAM3= <>
##$DBPNAM4= <>
##$DBPNAM5= <>
##$DBPNAM6= <>
##$DBPNAM7= <>
##$DBPOAL= (0..7)
0.5 0.5 0.5 0.5 0.5 0.5 0.5 0.5 
##$DBPOFFS= (0..7)
0 0 0 0 0 0 0 0 
##$DE= 6
##$DECBNUC= <off>
##$DECIM= 24
##$DECNUC= <off>
##$DECSTAT= 4
##$DIGMOD= 1
##$DIGTYP= 9
##$DL= (0..7)
0 120 120 120 120 120 120 120 
##$DP= (0..7)
150 150 150 150 150 150 150 150 
##$DP07= 0
##$DPNAME0= <>
##$DPNAME1= <>
##$DPNAME2= <>
##$DPNAME3= <>
##$DPNAME4= <>
##$DPNAME5= <>
##$DPNAME6= <>
##$DPNAME7= <>
##$DPOAL= (0..7)
0.5 0.5 0.5 0.5 0.5 0.5 0.5 0.5 
##$DPOFFS= (0..7)
0 0 0 0 0 0 0 0 
##$DQDMODE= 0
##$DR= 18
##$DS= 0
##$DSLIST= <SSSSSSSSSSSSSSS>
##$DSPFIRM= 0
$$ [...]
##$SUBNAM2= <"">
##$SUBNAM3= <"">
##$SUBNAM4= <"">
##$SUBNAM5= <"">
##$SUBNAM6= <"">
##$SUBNAM7= <"">
##$SUBNAM8= <"">
##$SUBNAM9= <"">
##$SW= 24.9336996594482
##$SWIBOX= (0..15)
0 0 2 0 0 0 0 0 0 0 0 0 0 0 0 0 
##$SW_h= 4990.01996007984
##$TD= 16384
##$TD0= 1
##$TE= 0
##$TE2= 300
##$TE3= 300
##$TEG= 300
##$TL= (0..7)
0 120 120 120 120 120 120 120 
##$TP= (0..7)
150 150 150 150 150 150 150 150 
##$TP07= 0
##$TPNAME0= <>
##$TPNAME1= <>
##$TPNAME2= <>
##$TPNAME3= <>
##$TPNAME4= <>
##$TPNAME5= <>
##$TPNAME6= <>
##$TPNAME7= <>
##$TPOAL= (0..7)
0.5 0.5 0.5 0.5 0.5 0.5 0.5 0.5 
##$TPOFFS= (0..7)
0 0 0 0 0 0 0 0 
##$TUNHIN= 0
##$TUNHOUT= 0
##$TUNXOUT= 0
##$USERA1= <user>
##$USERA2= <user>
##$USERA3= <user>
##$USERA4= <user>
##$USERA5= <user>
##$V9= 5
##$VALIST= <valist>
##$VCLIST= <CCCCCCCCCCCCCCC>
##$VD= 0
##$VDLIST= <DDDDDDDDDDDDDDD>
##$VPLIST= <PPPPPPPPPPPPPPP>
##$VTLIST= <TTTTTTTTTTTTTTT>
##$WBST= 1024
##$WBSW= 4
##$XGAIN= (0..3)
0 0 0 0 
##$XL= 0
##$YL= 0
##$YMAX_a= 99872
##$YMIN_a= -150831
##$ZGOPTNS= <>
##$ZL1= 120
##$ZL2= 120
##$ZL3= 120
##$ZL4= 120
##$ABSF1= 10
##$ABSF2= 0
##$ABSG= 5
##$ABSL= 3
##$ALPHA= 0
##$AQORDER= 0
##$ASSFAC= 0
##$ASSFACI= 0
##$ASSFACX= 0
##$ASSWID= 0
##$AUNMP= <proc_1d>
##$AZFE= 0.1
##$AZFW= 0.1
##$BCFW= 1
##$BC_mod= 2
##$BYTORDP= 1
##$COROFFS= 0
##$CY= 11.3945322036743
##$DATMOD= 1
##$DC= 2
##$DFILT= <>
##$DTYPP= 0
##$F1P= 18.9103706918063
##$F2P= -1.10871071338519
##$FCOR= 0.5
##$FTSIZE= 0
##$FT_mod= 4
##$GAMMA= 1
##$GB= 0.15
##$INTBC= 1
##$INTSCL= 1
##$ISEN= 128
##$LB= 0.24
##$LEV0= 0
##$LPBIN= 0
##$MAXI= 10000
##$MC2= 0
##$MEAN= 0
##$ME_mod= 0
##$MI= 1.114404
##$NCOEF= 0
##$NC_proc= 0
##$NLEV= 6
##$NOISF1= 3.799351
##$NOISF2= 2.8
##$NSP= 1
##$NTH_PI= 0
##$NZP= 0
##$OFFSET= 15.70392
##$PC= 1
##$PHC0= -8863.703
##$PHC1= 21.00096
##$PH_mod= 1
##$PKNL= yes
##$PPARMOD= 0
##$PSCAL= 0
##$PSIGN= 0
##$REVERSE= no
##$SF= 200.130013532006
##$SI= 16384
##$SIGF1= 3
##$SIGF2= 2
##$SINO= 400
##$SIOLD= 16384
##$SREGLST= <1H.CDCl3>
##$SSB= 0
##$STSI= 0
##$STSR= 0
##$SW_p= 3612.71676300578
##$SYMM= 0
##$S_DEV= 0
##$TDeff= 0
##$TDoff= 0
##$TI= <>
##$TILT= no
##$TM1= 0
##$TM2= 0
##$TOPLEV= 0
##$USERP1= <user>
##$USERP2= <user>
##$USERP3= <user>
##$USERP4= <user>
##$USERP5= <user>
##$WDW= 1
##$XDIM= 8192
##$YMAX_p= 0
##$YMIN_p= 0
$$ End of Bruker specific parameters
$$ ---------------------------------
##NTUPLES= NMR FID
##VAR_NAME=  TIME,          FID/REAL,        FID/IMAG
##SYMBOL=    X,             R,               I
##VAR_TYPE=  INDEPENDENT,   DEPENDENT,       DEPENDENT
##VAR_FORM=  AFFN,          ASDF,            ASDF
##VAR_DIM=   8192,          8192,            8192
##UNITS=     SECONDS,       ARBITRARY UNITS, ARBITRARY UNITS
##FACTOR=    0.0002004,     1,               1
##FIRST=     0,             0,               0
##LAST=      1.6414764,     0,               0
##MIN=       0,             -150831,         0
##MAX=       1.6414764,     99872,           0
$$ Real data points
##PAGE= N=1
##DATA TABLE= (X++(R..R)), XYDATA
0 0 0 0 0 0 0 0 0 0 8 -8 8 -8 16 -16 16 -24 25 -32 40 -44 51 -60 72 -81 95 -105 121 -137 158 -177 200 -224
32 -224 252 -282 314 -352 389 -435 482 -533 590 -655 725 -804 888 -987 1094 -1220 1362
49 1362 -1528 1723 -1956 2240 -2598 3063 -3694 4609 -6054 8699 -15141 67085 24377 -98063
63 -98063 15007 99872 63417 -14552 7007 39267 24968 -1787 34270 53006 668 -43349
75 -43349 15530 69204 28423 -28841 -12036 15071 9526 3457 11370 2950 -11703 -8240 11456
88 11456 9841 -18353 -28098 6810 23931 -6512 -22841 -1569 -113 -16083 -1980 15907 -4376
101 -4376 -24043 -6197 19904 14937 -14414 -27905 -5254 21604 21091 7795 -8291 -28514 -14502
114 -14502 37497 43485 -17700 -43759 6090 42729 15470 -20841 -15449 9289 10619 -3985 5253
127 5253 20485 -6035 -35756 -7438 29786 9791 -21295 -11580 4330 -3565 -11751 -4829 2628
140 2628 -4473 -18224 -11973 9420 5163 -19029 -19263 -3874 -3346 -1100 7217 -6576 -23858 -7438
154 -7438 13325 1482 -16613 -8606 11964 14136 -7269 -17293 4619 18028 -552 -5776 14724
167 14724 11663 -9241 2253 24955 10891 -13014 -2788 24299 27083 1240 -12630 7612
179 7612 21548 3119 -2566 23014 21837 -11531 -13091 19319 26183 3121 -9848 -618 13004
192 13004 14144 5083 2111 955 -8835 -2577 24412 23210 -11802 -21402 5772 20783 10673 -2487
206 -2487 -6902 1592 13979 11284 289 -929 1730 4790 12829 12597 725 445 9065 7486 6023
221 6023 10346 4762 375 13364 18183 1831 -6294 4879 16045 13890 2144 -4232 7263 14117
235 14117 -327 -4652 11912 9927 -9208 -5518 13082 9766 -6904 -12204 -4047 7420 7003 -5282
249 -5282 -9163 -3311 -5080 -5753 4417 1044 -14830 -11299 4421 2898 -7184 -9591 -7778 -2784
263 -2784 2944 -1500 -7246 -3895 -2568 -3594 926 -39 -6546 -796 7005 -1238 -7222 935 4011
278 4011 -167 1655 2336 -1178 592 3316 1413 1870 14 -3527 3784 9385 -1836 -8101 3510
293 3510 5898 -4127 -3680 3538 1835 -2333 -4339 -3843 1640 1913 -6540 -5969 3239 -1091 -7811 -1004
309 -1004 1171 -6905 -5162 1944 -6 -3250 -3021 -3944 -1039 2522 -2443 -3865 3099 2227 -3021 721
325 721 3110 -1536 1576 6211 615 -1327 6003 5330 377 2263 3679 3067 5450 3937 829 4299
341 4299 4949 -825 2999 8480 612 -3658 5450 6293 -2530 -2703 2800 2765 578 -2464 -3279 2385 2388
358 2388 -6461 -4951 4085 -751 -7568 -976 1964 -4986 -5233 -581 -1113 -2317 -2696 -4215 -744 1704
374 1704 -4119 -4692 2789 1228 -4134 306 2567 -2247 -251 3892 -263 -1291 4036 2763 75
389 75 2220 2013 1204 4154 2119 -597 4338 4514 -1914 982 6632 447 -3489 3666 4271 -1966 -1346
406 -1346 1064 457 837 -1663 -3910 1261 2142 -5529 -4339 3045 -1425 -6684 -697 924 -4541 -3881
422 -3881 -1005 -2336 -2227 -1908 -4135 -1052 1346 -4067 -4100 2069 43 -4316 471 1878 -2999 -779
438 -779 2927 -599 -1354 1725 647 316 2076 -182 -780 3161 1212 -2280 2328 3182 -3275 -1597
454 -1597 3841 -424 -3612 -113 -360 -2440 -745 -1853 -3782 -1592 -3116 -5688 -1399 -559 -7860 -7118
470 -7118 -71 -2987 -7786 -4771 -3932 -6028 -3799 -3059 -6098 -4977 -4275 -5941 -2145 -262 -7252 -7437
486 -7437 881 469 -4870 -2759 -1432 -2574 642 2102 -2014 -1547 1581 721 1976 3639 -683 -1120
502 -1120 4891 4253 63 2759 3616 -315 2335 6292 2508 -628 2276 2675 3170 3958 -26 -1724
518 -1724 3689 3209 -1319 1377 2614 -2867 -1244 4197 823 -3694 -984 416 -602 144 -1607 -3309
534 -3309 195 237 -3362 -621 999 -4541 -3706 3341 492 -5341 -2482 1346 71 -434 -2540 -3954
550 -3954 856 2826 -3010 -3567 603 -756 -1713 1330 -1586 -5074 -26 1507 -3199 -3039 -1056 -3008
566 -3008 -2710 -329 -3180 -4593 -2482 -3863 -3747 -382 -3963 -9106 -3706 625 -4447 -7181 -4936 -5232
582 -5232 -3784 -1454 -5225 -7796 -4396 -3302 -3991 -1475 -3398 -8086 -4484 653 -1851 -3648 -2466
597 -2466 -4953 -3381 3187 2097 -4107 -3858 -881 1396 4275 1528 -5169 -1988 5077 3392 171
612 171 804 -1290 -983 5324 4748 -2231 -2347 1151 2217 3350 828 -4108 -1835 4219 1327 -3262
628 -3262 -1428 -962 -2240 952 626 -4478 -3704 -464 -1918 -1782 -125 -3236 -4512 -806 -791 -1960 152
645 152 -2142 -5139 644 4756 -837 -3442 548 1732 1668 2460 1074 1730 5241 2248 -517 6068
661 6068 9005 2618 657 5800 7468 6939 6232 3404 4639 8855 6245 2824 7619 9783 3465 913
677 913 4633 7699 9124 4860 -3852 -1620 9899 9749 -1476 -5491 -1600 3963 6433 287 -8597
692 -8597 -5270 3001 689 -4002 -4032 -4701 -5538 -2611 -2312 -4770 -5483 -7980 -8563 -973 2245 -8696 -15290
709 -15290 -6064 2698 612 -7639 -14102 -8325 4269 3677 -9044 -11486 -3900 -662 81 -337 -4875
724 -4875 -7073 -3737 -1088 1651 4381 -2792 -11877 -5582 7410 8201 -1742 -11291 -10412 4129 14105
739 14105 1570 -14603 -10251 3366 7252 2346 -6184 -9842 -2621 4164 963 -2550 -3470 -6974
753 -6974 -5295 3742 4565 -4821 -9896 -5873 1559 6106 -749 -11735 -7806 4809 5340 -3338 -6715
768 -6715 -4577 876 5357 1497 -5044 -3195 1251 916 2603 4354 -851 -4074 447 4765 5982
783 5982 4201 -3024 -5737 4242 11743 5450 -2964 -4597 -154 8027 10295 405 -6403 -539 5119
798 5119 4590 3621 308 -4023 -1076 4261 4004 1779 -1041 -5021 -1815 5272 3174 -3909 -2830 -96
814 -96 -757 -18 521 -1738 -1692 -435 -1695 -464 2369 -1302 -4229 68 1930 -336 117 -7 -2585
831 -2585 24 3662 752 -2450 -760 737 2820 3884 -1688 -5109 1117 5875 2237 -779 -2046
846 -2046 -3071 1341 5776 1510 -4665 -3515 -363 2389 3703 -1471 -7176 -3396 1837 229 -1011
861 -1011 -1478 -5558 -5811 -300 1065 -2014 -3954 -6554 -5955 395 1951 -4456 -7379 -4795 -2833 38
877 38 1213 -4572 -7914 -2447 1248 -390 -1687 -3792 -4839 -6 3600 -782 -3907 -1809 -187 2079
893 2079 3516 -1360 -4629 901 5045 1712 -770 -1258 -996 3120 5303 -210 -3457 579 2103 2049
909 2049 2611 -434 -3270 90 2649 151 -124 194 -2857 -2576 1766 1200 -1966 -2423 -3135 -2506 1269
926 1269 1430 -3906 -4132 -1547 -1370 -47 880 -3237 -4792 -484 1303 -900 -1199 -1934 -2618 1177 2579
943 2579 -1336 -1953 1141 779 932 2253 170 -1183 3046 3299 -50 539 2195 1314 2706 3078 -251
960 -251 174 3610 2270 239 1981 1592 -113 2041 2530 -651 465 1849 -678 -507 1521 -13
976 -13 -1086 454 -1017 -2653 600 1038 -2516 -2268 -308 -1713 -788 405 -2927 -3351 326 -54 -1963
993 -1963 -686 -1052 -2442 322 1247 -1879 -1133 1650 -118 -684 1281 285 -112 2374 1442 -727 1583
1010 1583 2564 322 1452 2633 481 1209 3773 1587 -156 2250 1993 576 2051 1590 -395 1358
1026 1358 2433 -586 -629 1631 -47 -826 898 -718 -1819 573 293 -2664 -1071 57 -1849 -1405
1042 -1405 -232 -2186 -2307 295 -1240 -2781 -322 -631 -2166 -418 -306 -2481 -759 1208 -1058 -1444
1058 -1444 884 -156 -836 1534 553 -1425 1217 2282 -116 521 1697 -99 1074 2785 459 -485
1074 -485 2327 1494 -447 1680 1097 -944 1059 2146 -1000 -540 1330 -508 -906 842 -986 -1877
1090 -1877 562 -334 -2669 -851 -249 -2543 -1282 153 -2306 -2219 104 -1511 -2517 -272 -538 -1749
1106 -1749 -69 -187 -2111 168 1621 -916 -636 1543 107 205 2460 1580 -200 2134 2712 1219
1122 1219 2660 3174 909 1866 4140 2239 1890 3813 2270 989 3811 3361 796 1977 2550 917
1138 917 2186 3224 123 -487 2047 1107 -111 1478 -523 -2109 665 1372 -1964 -1710 -557 -2166
1154 -2166 -971 588 -2398 -3870 -1148 -1014 -1868 -869 -2463 -4287 -1018 988 -2001 -2703 -1131 -1924
1170 -1924 -717 1457 -1112 -3263 -396 1077 -161 867 -19 -2185 295 2889 777 -445 753
1185 753 -134 175 3145 1981 -1389 -164 1417 1031 2051 1313 -2010 -919 2855 919 -1030 -269
1201 -269 -858 -1168 1322 881 -2271 -1343 -95 -1395 -440 487 -2465 -2738 190 -86 -1185 -465 -1596
1218 -1596 -2762 701 1470 -1840 -1725 397 -208 234 1308 -889 -950 2084 1432 -779 1517 2263 315
1235 315 1376 2632 717 1491 3269 844 525 3014 2376 535 2341 2054 402 1969 2641 349
1251 349 1088 2260 -115 212 2871 1130 -1580 391 948 201 1324 305 -2786 -593 1994 165
1267 165 -1397 -723 -1579 -655 2342 173 -2686 -871 640 22 1131 1091 -1997 -1305 2383 2086 742
1284 742 1003 -953 -443 3637 3652 -34 -202 1132 1372 3841 4002 -599 -1573 3027 4346 2291 1340
1301 1340 -686 -688 3680 4315 -498 -1455 236 497 1680 2097 -1605 -3218 275 958 -643 -466 -2085
1318 -2085 -4242 -1299 1764 -1093 -3728 -3654 -2743 -270 1209 -3379 -6419 -1758 1065 -1397 -2583 -2455
1334 -2455 -3083 -830 755 -1479 -1940 -127 -1119 -1373 1643 1509 -1435 -982 590 1050 2879 2006 -2273
1351 -2273 -652 4764 3992 -365 -386 1449 2994 4105 806 -1854 2055 4664 1114 -844 1671 1638
1367 1638 864 1460 478 -374 1625 437 -1560 819 2024 -1660 -2241 729 857 -443 -1114 -2719 -957
1384 -957 2714 334 -4606 -2155 2092 1325 -852 -2106 -2013 1441 3440 -1050 -2968 975 2355 46
1400 46 618 1255 153 818 1270 662 2520 3232 -1116 -1571 3469 4643 1153 -778 -508 1392 4750
1417 4750 3070 -2291 -1560 3159 2742 722 195 -943 -752 1821 1234 -764 -141 -680 -2526 397 2678
1434 2678 -1324 -4177 -1667 563 1159 204 -3646 -4401 929 2821 -1325 -3425 -1913 -803 1191 1352
1450 1352 -2272 -2656 758 893 -553 959 765 -1618 -414 1949 1294 1217 628 -1706 20 3693 1991
1467 1991 -755 218 946 686 2627 1901 -1487 -513 1731 622 628 1261 -1052 -1878 1029 1512 -717 -684
1485 -684 -998 -1863 487 1129 -2261 -2506 -391 -738 -1171 -302 -1673 -2804 -219 2 -1954 -1011 -359 -1957
1503 -1957 -982 809 -705 -1081 242 -658 -1038 1746 1305 -1291 -124 1173 432 1599 2056 -679 -663
1520 -663 2657 2542 1000 1101 -146 82 3269 3211 -724 -653 1113 1066 1715 1934 -1167 -1976 1178 1591
1538 1591 -101 -95 -884 -2245 172 1435 -1050 -1839 -919 -1605 -915 1045 -940 -2749 -794 -375 -1215
1555 -1215 -37 -270 -2607 -1611 733 -203 -954 103 -1324 -980 1678 1191 -1239 -481 917 584 1715
1572 1715 1366 -1542 -258 3204 1951 -15 735 454 428 2910 2175 -731 87 1814 1246 1600 1521 -868
1590 -868 -753 1811 1300 -646 132 -195 -1391 473 1100 -1311 -1307 37 -1254 -968 422 -1068 -1908 -576
1608 -576 -1116 -1822 74 -201 -2512 -1307 646 -766 -1214 -250 -1283 -1084 956 333 -1394 158 751
1625 751 -330 832 1019 -885 198 2163 621 -408 1346 940 164 1953 1389 -732 755 1805
1641 1805 446 757 1324 -558 94 1675 259 -941 989 490 -956 114 441 -1298 -332 259 -1920
1658 -1920 -1276 578 -942 -1823 -463 -1190 -1699 -9 -440 -2434 -956 206 -1360 -1052 56 -1309
1674 -1309 -1115 1025 -356 -1469 573 668 -759 501 997 -556 520 1766 83 -86 1576 882
1690 882 499 1757 851 -331 1642 1821 -189 536 1501 69 649 1606 -192 -709 1198 532 -889
1707 -889 502 231 -1137 105 277 -1543 -980 397 -853 -1355 -165 -949 -1759 -115 -513 -1838 -691
1724 -691 -42 -1605 -1040 368 -1086 -837 466 -509 -820 852 430 -948 233 1052 -369 721 1281
1741 1281 -149 509 2083 945 203 1254 1207 311 2068 1660 -374 872 1946 252 432 1416 -41
1758 -41 -90 1629 415 -749 408 512 -606 351 430 -1622 -654 464 -1227 -1368 70 -1177 -1989 -4
1776 -4 -741 -2030 -673 -195 -1908 -973 -215 -1236 -1024 -65 -1116 -1135 585 -368 -1298 335 657 -1078
1794 -1078 477 1000 -632 -84 1391 254 186 1531 680 -5 1541 1231 -85 1040 1330 -74 1004
1811 1004 1744 196 138 1448 636 -335 850 549 -831 508 622 -879 -186 227 -1379 -790 838
1828 838 -1172 -1675 -354 -479 -1291 -376 -408 -2245 -992 473 -881 -1037 -697 -1630 -697 937 -193 -1916
1846 -1916 -215 201 -516 861 762 -1185 -339 1643 743 454 925 -41 12 2219 1447 -187 731 1077
1864 1077 275 1614 2072 -291 -445 1561 1073 600 803 -692 -633 1257 1240 -1279 -845 53 -891 37
1882 37 659 -1551 -1799 47 -262 -1396 -423 -1184 -2140 -514 63 -1301 -1032 -687 -1735 -526 1090 -936
1900 -936 -2268 -102 586 -488 160 -249 -1123 374 1399 -386 -125 1006 277 277 1464 655 -49 1466
1918 1466 1073 -232 1060 1705 -29 63 1351 356 125 1284 222 -309 1143 298 -1089 623 946
1935 946 -961 -891 172 -593 -734 -49 -1476 -1696 276 72 -1692 -1207 -893 -1469 67 263 -1969 -1717
1953 -1717 215 -428 -982 -26 -1184 -1443 319 727 -563 -280 -145 -998 677 2219 -136 -1035 393
1970 393 870 1151 1742 -150 -1649 1094 2905 928 -194 -100 -174 1395 2458 96 -1167 420 831
1987 831 237 1169 225 -1831 -799 1056 401 -124 -862 -2227 -1207 1646 538 -2412 -2231 -704 161
2004 161 687 -739 -3340 -1526 1238 493 -1343 -1031 -991 -673 1045 572 -939 -367 -132 -772 1119 1986
2022 1986 -589 -1640 629 1708 1336 1121 -835 -665 2480 2983 -72 -614 808 1197 1407 1373 -586
2039 -586 -200 1683 759 -569 704 708 -1082 -763 1028 190 -140 -542 -1605 -324 1590 -707 -2813
2056 -2813 -963 448 -673 -830 -1200 -1844 -167 640 -1554 -1741 87 -107 -1292 -485 -228 -326 367 -299
2074 -299 -1214 639 1832 -683 -818 1326 1018 327 843 244 246 1598 894 -363 1041 1853 238 -93
2092 -93 880 901 937 972 -320 -492 1808 1071 -921 -273 679 -115 -32 -27 -698 -463 289 -1171 -1159 579 -370
2113 -370 -1951 -783 -50 -782 -730 -780 -1647 -459 673 -886 -1780 -354 0 -420 176 -450 -1333 468
2131 468 1231 -570 -469 947 52 4 1407 809 -24 765 861 443 1346 1038 -319 595 1789 444 320
2150 320 1227 331 -94 1256 735 -435 323 756 -395 165 409 -510 -505 403 -722 -801 366 -393 -1670
2169 -1670 -504 -299 -1496 -595 -467 -1405 -819 -16 -886 -1188 -20 -406 -1017 116 -223 -1090 8 388
2187 388 -660 -244 994 165 43 809 185 286 1446 377 -448 909 1358 323 743 1140 55 409
2205 409 1827 658 -221 846 555 159 977 371 -762 -81 741 -473 -331 239 -882 -848 655 -284
2223 -284 -1553 -395 -174 -1030 -310 -464 -1347 -712 128 -1012 -937 68 -797 -1015 393 0 -819 68 360
2242 360 -399 196 1261 -81 -118 634 375 508 1551 388 -318 1447 1513 181 845 1404 324 647
2260 647 1704 666 -10 926 414 251 799 250 -482 501 709 -622 -228 276 -785 -433 375 -543 -1230
2279 -1230 -60 -323 -1305 -806 -222 -1235 -649 -282 -1423 -698 133 -940 -1346 -203 -407 -866 -105 -126
2297 -126 -1051 68 678 -433 -72 662 58 71 1185 437 -170 1037 1013 77 943 1217 116 736 1471
2316 1471 384 102 1191 710 72 876 279 -308 819 561 -588 -52 612 -324 -726 187 -719 -610
2334 -610 103 -475 -1278 -337 -231 -1150 -546 -395 -1325 -799 220 -960 -1197 -2 -413 -927 118 251 -868
2353 -868 0 498 -403 370 770 -91 25 1268 432 129 1447 1111 175 1000 1531 524 1340 1306 539
2372 539 849 1753 771 346 1274 840 514 1289 1017 -390 490 1375 77 111 585 76 1 965 -18 -720
2392 -720 259 158 -405 81 219 -1033 -233 664 -362 -610 449 -190 -589 342 167 -599 294 420 -253
2411 -253 219 642 -177 234 1035 489 -47 1049 645 -169 1094 1121 116 589 1004 52 626 1178 33
2430 33 20 928 696 -124 800 133 -473 415 743 -632 -465 126 -393 -374 283 -780 -1212 103 -256 -1134
2450 -1134 -441 -232 -1243 -242 40 -962 -975 -37 -482 -865 71 -290 -828 149 222 -728 292 470 -462
2469 -462 127 1018 173 -85 1023 438 55 912 848 -23 887 1145 318 709 1233 441 321 1234 529 109
2489 109 1043 334 -513 716 1061 -589 -241 447 -264 -66 324 -630 -886 259 -369 -978 -47 -88 -1394
2508 -1394 -613 127 -781 -531 -264 -1076 -851 494 -107 -889 -31 -123 -594 628 456 -629 56 977 348
2527 348 554 1149 223 -18 1365 1334 405 875 759 365 1352 1666 177 426 1406 990 696 1256 286 -193
2547 -193 1067 1091 -37 29 321 -437 272 898 -583 -1182 72 -109 -481 -4 -689 -1615 -402 262 -1007
2566 -1007 -1062 -709 -1128 -806 260 -620 -1567 -528 -183 -608 210 -13 -1375 -558 710 -32 -355 203 -377
2585 -377 74 1309 225 -596 354 697 414 844 939 -244 203 1108 514 143 776 210 52 810 697
2604 697 -14 144 395 -56 457 563 -815 -743 673 -166 -762 -257 -383 -820 54 -228 -1279 -652 306
2623 306 -1006 -981 -55 -734 -761 187 -353 -1044 190 71 -866 237 602 -320 -313 636 242 146 684 108 3
2644 3 1360 1058 -299 217 1155 704 811 900 -228 491 1674 776 -248 490 583 264 853 747 -580
2663 -580 62 707 -362 -164 530 -558 -1110 252 162 -558 -669 -744 -1294 143 499 -1363 -1571 -250 -218
2682 -218 -733 -438 -1199 -1177 411 66 -1122 -436 147 -756 -127 679 -238 -168 324 -17 -5 1336 290 -905
2702 -905 605 1400 702 311 264 8 1146 1599 133 -345 1076 984 500 762 695 -416 549 558 -353 336
2722 336 633 -484 -788 472 165 -457 -542 -635 -563 228 32 -1319 -864 268 -503 -923 -339 -567 -846 52
2742 52 -549 -1041 119 128 -1174 -452 604 -264 -287 14 -283 85 1000 213 -700 676 1078 53 330 782
2762 782 21 540 1144 139 73 1352 487 -299 719 1082 48 281 372 -60 404 806 -530 -732 700
2781 700 -99 -528 -7 -327 -795 -327 -31 -974 -287 -156 -1002 -887 58 -645 -1079 -331 -657 -985 21 -226
2801 -226 -1264 -377 289 -550 -346 261 -461 -364 756 319 -505 566 530 -95 785 576 -84 467 1039 469
2821 469 235 936 240 -158 1071 888 157 391 636 -86 516 733 -202 -126 616 -79 -471 289 -39 -684
2841 -684 113 127 -1153 -385 100 -777 -680 122 -660 -718 -74 -522 -964 -110 -344 -977 -210 84 -927 -358
2861 -358 227 -492 -302 406 -94 -628 523 436 -218 546 801 -67 307 774 26 367 976 335 61 636
2881 636 449 -119 606 323 -385 35 452 -333 -113 513 -626 -749 -2 -73 -841 -346 -640 -1113 -234 -181
2901 -181 -1386 -1112 -191 -990 -1091 -468 -1098 -1154 -405 -520 -1674 -519 -280 -1309 -664 -16 -872 -703 228
2920 228 -538 -649 426 -123 -645 212 320 -302 386 902 -1 139 995 102 156 953 358 -150 665 658 -169
2941 -169 648 724 47 505 924 -127 -69 761 394 -370 377 26 -377 239 47 -869 -178 291 -787 -503
2961 -503 154 -489 -624 141 -395 -896 -55 61 -756 -42 164 -320 -109 280 -106 -40 810 216 -91 751
2981 751 573 129 838 968 8 654 1317 621 902 1446 640 349 1424 1082 564 1006 1152 565 855 1080
3001 1080 280 729 1277 554 98 968 513 -135 612 389 -370 166 456 -501 -352 336 -402 -613 277 -301
3021 -301 -1047 136 -118 -938 -117 91 -1084 -592 104 -657 -734 187 -389 -652 -42 -245 -670 228 251 -461
3041 -461 66 503 -433 -2 465 -48 -236 525 109 -314 477 520 -289 127 395 -386 59 400 -495 -553 608
3062 608 -36 -685 189 -181 -741 132 115 -661 -665 187 -493 -694 -9 -582 -834 54 -304 -815 -115 28 -688
3083 -688 -102 300 -623 -355 316 -141 -339 355 79 -258 590 591 -214 129 611 171 551 739 341 108 806
3104 806 390 -104 893 657 -87 647 843 -58 266 731 -312 -74 703 44 -241 234 217 -273 394 85
3124 85 -585 169 318 -309 -492 145 -197 -283 133 -274 -519 56 140 -539 82 242 -333 -10 690 -164 -202
3145 -202 620 155 82 625 574 -281 422 980 127 422 792 342 275 1059 591 -174 1071 699 37 700 792
3166 792 89 421 534 -52 252 571 -155 -448 388 -144 -649 -31 -147 -728 -105 17 -645 -761 16 -687
3186 -687 -939 -3 -381 -930 -362 -412 -1110 -214 -372 -1000 -728 1 -487 -338 196 -450 -648 313 265 -408 306
3207 306 433 -291 312 895 -111 -94 578 157 7 851 206 -292 668 762 35 455 496 -424 222 884 -29
3228 -29 -308 8 123 -51 531 -168 -1044 -151 359 -317 -357 109 -819 -447 345 -495 -962 -384 -380 -664 231
3249 231 63 -1015 -566 127 -374 -126 -96 -684 -676 615 302 -334 39 18 -273 816 653 -434 -150 752
3269 752 79 221 646 22 58 692 614 -77 524 535 -142 636 650 -40 -257 358 -36 6 294 -72 -719 52
3291 52 216 -458 -363 -202 -705 -99 52 -658 -781 87 -256 -689 -127 -81 -749 -301 34 -463 -299 160 -500
3312 -500 -306 501 84 -371 229 187 -97 532 152 -227 417 775 13 -159 817 466 110 650 360 -53
3332 -53 734 773 -143 431 745 -40 33 512 89 -50 530 -272 -254 362 218 -799 -287 431 -448 -496 -180
3353 -180 -420 -292 20 -492 -672 21 40 -900 -355 -217 -629 -183 91 -748 -414 321 -182 -522 248 46
3373 46 -249 431 125 -339 287 589 -228 226 909 311 110 561 632 185 618 492 -316 453 861 -16 3
3394 3 582 218 -124 365 -37 -312 299 98 -601 -38 168 -485 -325 95 -499 -423 50 -623 -686 149 -376
3415 -376 -1062 -95 -205 -507 -406 -128 -718 -89 382 -407 -668 283 312 -155 181 303 -131 315 630 99
3435 99 210 681 164 26 741 604 136 524 308 -88 862 808 -108 265 970 127 90 572 -58 -70 518
3456 518 101 -477 170 66 -491 -215 202 -501 -369 300 -374 -758 -75 -594 -747 -58 -160 -751 -301 -31
3476 -31 -525 72 2 -589 -669 106 -204 -342 285 104 -406 190 409 -144 193 671 -210 -67 613 90 -189
3497 -189 432 185 -16 563 470 -334 164 436 -186 -135 381 -243 -277 350 -254 -597 -60 -55 -406 -263 -217 -632
3519 -632 -484 -53 -902 -617 -42 -628 -1119 -268 -289 -584 -400 -237 -874 -242 -65 -764 -487 99 -152 -326
3539 -326 306 92 -359 310 291 -197 547 725 -343 282 908 384 330 858 469 377 628 761 6 601 767
3560 767 175 513 820 126 168 975 97 42 351 321 -317 103 415 -218 -135 261 -180 -327 95 -389 -629
3581 -629 41 -41 -256 51 -247 -470 -52 211 -516 -206 527 -279 -341 440 191 -171 490 432 115 407 646
3602 646 72 396 908 301 331 774 371 172 957 659 67 700 895 206 351 837 390 117 673 275
3622 275 118 393 130 -244 330 254 -531 -157 73 -369 -230 202 -435 -728 -128 -418 -652 -325 -178 -834
3642 -834 -335 -323 -729 -431 -249 -710 -607 58 -327 -679 -99 -261 -555 -192 75 -391 62 334 -311 -80
3662 -80 592 -10 -62 447 187 -158 541 359 -285 390 627 -46 -150 451 238 -92 513 22 -226 149 354
3683 354 -359 32 195 -550 -28 218 -398 -448 23 -267 -443 56 -175 -439 37 125 -456 -217 34 -287 -224
3704 -224 381 -11 -205 521 210 -333 221 526 -8 411 587 210 183 704 325 296 654 521 136 696 580
3725 580 208 434 697 11 351 778 107 -2 562 340 10 442 100 -146 416 407 -392 -137 176 -316 -228
3746 -228 -6 -355 -438 177 -21 -480 3 2 -446 -131 309 -389 -310 46 -363 -255 446 43 -506 422 341 -271
3768 -271 55 574 -183 404 487 148 22 653 542 -28 622 447 51 442 626 3 74 351 82 83 430
3789 430 -41 -153 441 156 -323 -46 -131 -462 -206 70 -560 -374 -113 -498 -499 -42 -600 -916 -243 -305 -865
3810 -865 -319 -299 -723 -378 -8 -300 -503 -39 -223 -243 -16 31 -436 -34 142 -74 63 399 -124 -120 620 273
3832 273 16 579 355 168 426 400 23 313 649 -20 53 639 215 -9 457 58 -32 482 212 -402 77
3853 77 298 -412 -203 90 -475 -447 -292 -512 -608 -92 -270 -810 -130 -203 -728 -382 65 -556 -326 27 -220
3874 -220 -400 359 -3 -263 53 137 -290 -97 619 -167 -2 443 -29 54 676 405 -134 598 328 108 694
3895 694 764 32 395 532 119 265 413 86 29 556 233 -283 26 175 -309 -24 68 -471 -131 220 -265
3916 -265 -395 -46 -405 -548 51 -47 -574 -299 -69 -492 -324 -174 -368 -418 219 -87 -398 217 -142 -405 332
3937 332 478 -170 -109 562 163 310 719 -1 -114 265 592 52 325 526 -24 251 840 -58 10 457 -6
3958 -6 162 665 227 -115 -106 272 -5 -19 80 -535 91 167 -179 -495 -125 -128 -371 -108 -193 -769 -123 57 -650
3981 -650 -320 77 -568 -419 -21 -6 -294 132 -99 -308 255 425 -399 -35 470 66 161 319 -47 183 531
4002 531 200 168 234 510 -150 190 734 275 260 320 224 114 616 31 -228 180 379 88 -15 207 -201 60
4024 60 97 -284 -342 124 -248 -539 -243 -211 -475 -123 -185 -570 -166 41 -717 -604 76 -100 -553 66 -152 -416
4046 -416 124 73 -287 116 250 -98 -121 395 -17 48 445 396 98 323 355 -239 567 552 127 255 472 97
4068 97 123 437 173 -346 345 371 -155 241 66 -235 -79 334 -518 -344 441 -123 -578 -37 -114 -374 -253
4089 -253 -177 -568 -100 147 -567 -445 -136 -347 -491 -202 -165 -398 139 -202 -372 -47 -48 -351 28 173 15
4110 15 150 518 45 20 574 80 -232 313 610 42 40 360 60 200 486 105 -174 451 202 -237 257
4131 257 103 -338 10 355 -448 -265 137 -304 -286 60 -197 -510 -20 -286 -695 8 -45 -605 -515 14 -372
4152 -372 -256 -134 -368 -266 179 -28 -388 92 226 -144 51 424 -21 98 239 140 163 538 425 186 562
4173 562 545 105 438 557 363 283 680 146 29 418 265 -24 172 232 -113 204 249 -231 -45 322 -188
4194 -188 -269 265 -85 -428 -89 -205 -552 21 -98 -513 -301 168 -337 -639 -141 -186 -486 -73 -52 -361 -54
4215 -54 184 -273 82 203 -32 -117 318 23 34 506 86 -140 502 243 102 254 305 209 303 450 124 -7
4237 -7 544 163 50 421 203 -88 247 110 -467 171 178 -499 -123 9 -214 -444 -99 -290 -395 -57 -205
4258 -205 -625 -61 -7 -464 -394 -195 -427 -568 -33 -354 -338 -114 -30 -358 -47 65 -247 -273 183 -7 18 395
4280 395 -206 -253 262 355 -49 160 532 114 379 310 20 155 578 178 147 672 352 -203 78 289 -139
4301 -139 352 350 -292 40 403 -355 -12 102 -153 -249 173 -122 -595 -124 70 -540 -340 -163 -530 -352 171
4322 171 -153 -364 -66 -127 -92 71 203 -230 -6 435 -215 27 416 -87 -171 460 370 37 486 412 -134 490
4344 490 715 -45 185 499 109 144 586 257 -183 210 232 -301 123 231 -47 3 270 -404 -256 53 -107
4365 -107 -280 79 -58 -666 -173 -50 -541 41 109 -510 -308 111 -166 -366 25 -86 -244 -12 -125 -350
4385 -350 21 350 -356 26 350 -5 -137 259 88 -93 346 301 -78 227 469 -31 60 325 188 331 374
4406 374 202 -58 424 181 -139 217 229 -238 265 136 -252 -60 271 -318 -369 -59 -247 -477 -151 -9 -449
4427 -449 -210 -256 -441 -250 -16 -226 -487 65 -132 -450 85 -83 -525 115 92 -202 -77 190 -212 -46 351
4448 351 128 103 457 189 -102 392 436 -60 168 351 -65 158 416 128 -67 375 243 -116 238 222 -73
4469 -73 376 386 -237 66 226 -275 -152 132 -5 -545 -28 -201 -558 -79 -116 -458 -302 12 -354 -374 -249
4490 -249 -214 -507 118 -179 -384 241 23 -296 17 254 -282 -97 233 31 -97 353 230 34 314 518
4510 518 -123 342 344 225 211 471 206 186 550 307 108 471 276 58 94 397 -147 96 305 -84 -228 3
4532 3 -148 -429 232 -157 -476 -125 39 -300 -126 127 -225 -322 10 -248 -335 -74 1 -516 71 18 -269 -45
4554 -45 103 62 -60 364 -220 -26 201 23 26 350 273 -71 359 442 -106 86 466 8 83 411 88 -162
4576 -162 284 321 12 98 153 -298 230 389 -291 -207 169 -156 -139 -15 -145 -366 -81 -119 -524 -136 98 -379
4598 -379 -341 -207 -515 -385 -221 -266 -111 16 57 -438 35 218 -142 117 189 -33 -89 457 46 -64 445 202
4620 202 104 207 258 -105 368 369 146 49 350 159 -106 459 157 75 349 164 -13 110 93 -18 -216 184
4642 184 -279 -213 63 -4 -333 48 -104 -388 -126 120 -437 -288 -76 -214 -539 -91 -386 -353 58 -83 -387
4663 -387 96 14 -193 -66 34 -130 7 203 1 101 -6 339 -186 366 391 -79 263 607 135 386 407
4684 407 66 -21 572 -72 52 319 46 -206 453 436 -118 1 159 -143 -175 90 -167 -282 67 -150 -382
4705 -382 24 64 -450 -159 135 -460 -333 -102 -384 -275 70 -218 -441 -100 -99 -381 -64 -126 -261 -138 382
4726 382 -229 -207 330 65 -184 470 138 -62 192 242 11 56 565 148 54 253 103 -163 342 114 5
4747 5 344 226 -124 220 74 -152 -142 140 -278 -27 97 -211 -468 -19 -219 -484 63 4 -570 -152 -24
4768 -24 -346 -184 -16 -459 -321 35 108 -380 -123 -115 -383 38 424 -77 -230 262 -61 -44 373 215 -69 201
4790 201 142 -171 334 497 -34 97 325 155 30 491 79 64 426 243 -54 126 365 -51 -123 410 -152
4811 -152 -52 7 88 -119 169 -85 -262 -117 -30 -232 -205 111 -289 -448 79 -346 -436 152 -171 -342 34 -5
4833 -5 -413 -12 -16 -127 -53 207 -73 -161 382 119 -107 409 296 147 359 217 -63 -57 423 226 -84 376 180
4856 180 8 210 110 -19 180 87 -128 -96 279 -160 -103 134 -42 -216 -93 21 -400 55 -99 -445 -172
4877 -172 -107 -464 -397 -72 -124 -369 63 -119 -513 34 -139 -325 -240 134 -323 -114 175 -119 -106 319 85 -6
4899 -6 258 428 94 241 413 -169 245 488 -3 91 209 14 29 297 86 -45 100 135 32 -18 111 -46
4921 -46 -75 49 -21 -101 214 74 -416 -86 -183 -279 -215 -162 -292 -154 33 -149 -406 115 -170 -261 93 -58 -208
4944 -208 -52 -68 -217 54 239 -272 48 251 130 -120 293 207 -169 327 124 -58 83 263 150 89 332
4965 332 161 292 457 274 -123 238 338 -14 257 -42 -73 94 148 -153 -141 -4 80 -291 140 -159 -252 219
4987 219 -180 -522 -277 292 -346 -129 -52 -212 -346 16 -333 -259 48 113 -355 46 182 -120 -135 290 -166
5008 -166 -95 307 84 61 63 278 -161 295 195 -136 13 369 -21 108 182 157 109 146 259 -144 246 224 14
5031 14 56 127 -168 -31 149 -37 -161 159 -81 -379 -52 -107 -402 -44 -3 -265 -217 -84 -224 -433 -14 -135
5053 -135 -348 -84 -34 -345 -173 70 -145 128 170 -123 -167 377 -109 -123 197 339 -189 204 491 -104 339
5074 339 200 42 43 421 -26 90 338 166 -17 266 16 -147 37 329 -52 92 316 -25 -146 146 30
5095 30 -174 -74 18 -294 23 -6 -328 -260 -6 -268 -309 3 -249 -215 -15 -152 -358 -25 161 -310 -36 253
5117 253 -80 -128 195 16 -110 275 39 -83 123 101 -11 142 167 146 83 326 108 89 104 79 57 431 119
5140 119 -194 131 385 131 82 172 122 9 154 -198 -241 62 -209 -307 45 -12 -296 -128 -177 -132 -233 64 -321
5163 -321 -294 19 -148 -372 -83 -28 -124 -31 29 -149 113 157 -350 -36 98 82 -160 131 369 114 274 349 55
5186 55 186 354 227 84 245 120 80 266 -43 118 249 162 -84 231 315 -216 -98 243 -162 -181 87 -112
5208 -112 -233 52 64 -347 -45 -160 -396 -261 -8 -415 -256 -174 -101 -243 -172 -117 -172 -46 40 -103 -146 74 -227
5231 -227 -62 75 -123 -187 48 -91 -114 208 52 -198 183 386 107 120 252 -14 -105 271 206 -11 302 57
5253 57 -165 60 226 -44 57 175 81 -70 -40 -76 -229 252 136 -377 -62 84 -305 -322 101 -266 -255 16
5275 16 -188 -73 -48 -131 -204 -95 -71 -343 -81 20 -266 -296 25 -108 -56 131 -2 30 127 187 -113 312 454
5298 454 123 228 159 35 -155 398 50 105 317 194 -332 152 186 2 131 161 63 80 298 -200 -198 212 3
5321 3 -260 7 -19 -312 118 155 -419 -100 24 -263 -169 147 -163 -228 -2 -4 -376 -167 25 -265 -95 77 -159
5344 -159 -238 293 96 -181 184 171 -110 95 198 -15 6 263 122 56 331 318 189 373 102 -4 366 174
5366 174 -165 62 150 32 167 205 9 0 2 35 -338 -150 -103 -373 25 -10 -323 16 -162 -380 -146 -57 -337
5389 -337 -193 28 -144 -98 9 -130 -211 -196 176 -48 -97 43 -98 79 356 177 89 255 260 147 211 455 82
5412 82 90 220 88 56 384 163 60 368 217 -114 216 272 37 73 130 28 -10 244 -66 -114 139 -160 -215
5435 -215 -60 -64 -313 -124 -27 -190 -341 67 -275 -416 43 -154 -409 151 42 -239 -72 -230 -193 59 155 59
5457 59 -272 137 189 -44 181 213 -84 75 336 -134 -70 404 73 15 265 87 -33 -57 180 11 216 -71
5479 -71 -29 9 119 10 -84 144 -61 -131 119 -34 -177 114 -93 -305 -65 -10 -139 -353 119 -425 -153 -3
5501 -3 -22 -119 81 -83 -308 -104 -63 -304 -129 52 -89 -18 310 15 -89 279 164 -37 217 433 -34 259
5523 259 121 -88 143 269 19 -9 190 109 9 265 67 -1 60 152 -32 54 55 -66 -40 188 -21 -50 20 -9
5547 -9 -217 47 77 -410 -102 -52 -217 -131 -28 -210 -111 6 -268 -341 -29 9 -244 -21 10 -167 54 215 -183
5570 -183 -69 97 99 20 222 213 -73 192 210 10 192 388 -150 210 269 -3 152 243 326 -243 23 422 -13
5593 -13 2 115 -117 11 225 -78 -250 88 -47 -289 28 -52 -324 -103 240 -313 -379 -18 -180 -501 26
5614 26 -33 -304 -191 116 -203 43 249 -63 -22 21 -177 -182 164 15 -1 155 188 -101 375 171 -143 137 194
5637 194 57 -10 209 -32 55 198 86 37 196 123 -79 192 164 -46 -169 245 44 -133 82 -109 -218 125
5659 125 7 -249 -153 -188 -290 -140 -23 -226 -185 109 -229 -236 21 -42 -399 -228 60 -35 -95 208 -296 -137 212
5682 212 -176 -15 -73 222 -44 -31 183 -8 133 72 -18 323 381 43 0 174 113 119 212 77 43 147 161 234
5706 234 63 116 -98 -6 288 79 -211 24 11 -333 49 -53 -212 -173 -39 -67 -196 -87 -111 -148 -88 0 -80
5729 -80 -73 -98 -397 -193 81 -205 -87 85 -264 -188 99 96 -65 97 213 -14 54 117 81 129 338 124 -30 196
5753 196 1 85 265 138 -73 414 29 48 110 294 82 123 111 -81 -159 118 4 -161 -210 165 -235 -87
5775 -87 37 -148 -134 98 -308 -294 89 -133 -312 -20 -115 -339 -135 -50 -206 -181 81 -123 104 95 169 2 100
5798 100 284 -118 8 75 15 20 278 -97 181 300 71 -105 200 177 70 109 -19 108 1 296 -70 -52
5820 -52 307 -5 -35 150 -125 -154 204 33 -162 124 1 -368 -158 -45 -305 -290 79 169 -213 -105 -14 -124
5842 -124 -166 -194 -272 -139 116 -21 -68 133 69 -127 136 -95 -43 73 214 -55 174 208 139 23 157 2 -5
5865 -5 365 47 -103 143 183 -157 127 103 -12 11 285 51 -7 223 37 -240 -39 -76 -208 108 24 -186 -158
5888 -158 178 -252 31 -189 -36 -178 -77 -243 -295 -75 -174 -256 -175 82 -154 -163 73 -190 -146 167 -95 -51 136
5911 136 -10 -46 106 259 86 -35 25 -24 106 181 12 186 199 172 -90 -55 10 64 202 334 200 56 251
5934 251 -61 -100 259 55 14 85 -39 -243 6 72 -122 -223 144 -316 -297 -79 -74 -196 -93 -264 -179 -106 56
5957 56 -178 -162 -59 -156 -73 43 54 -91 150 145 -10 -115 181 115 141 207 79 22 408 8 76 121 92 69 178
5982 178 153 -99 330 189 5 -63 183 -45 -72 135 -123 59 25 185 -109 -110 -77 -225 -119 103 -108 -398
6004 -398 79 -45 -411 -94 1 -415 163 -24 -217 -108 -80 -85 -136 124 -101 -50 233 -155 -201 43 131 -268 -59
6027 -59 95 61 314 181 -7 1 108 67 -40 -80 248 24 51 169 34 -13 75 23 -68 105 -188 -231 22 28 -59
6052 -59 116 -145 -212 -128 99 -287 -132 4 -10 -72 101 1 -221 -80 -197 -193 -130 3 -165 -157 -4 -125 -156 -60
6076 -60 -65 -223 103 122 2 114 114 -302 -139 -23 -63 160 72 108 -122 133 94 -188 349 153 -125 154 150 -202
6100 -202 -18 184 87 -144 286 -9 -55 -75 -83 -245 -106 135 -272 -218 83 -234 -318 -55 -7 -94 12 -145 -242
6123 -242 44 -39 -392 -29 141 -186 -193 -52 11 -123 225 91 45 304 57 98 -109 98 35 -90 142 76 67
6146 67 226 37 -8 166 145 -182 190 152 -135 83 98 82 -16 61 25 -213 267 59 -247 52 47 -199 67 -59
6170 -59 -203 -170 -16 -175 -504 67 136 -276 -76 -93 -184 74 43 -202 -192 157 -246 -298 188 -6 -167 77 221
6193 221 58 31 286 100 -18 313 12 126 307 156 -30 58 82 -113 244 60 -37 4 64 -266 48 72
6215 72 71 48 6 153 -4 192 43 -326 322 115 -213 -222 -27 -109 -332 -32 -120 -194 123 -132 -306 46 12 -91
6239 -91 -56 228 142 -355 -175 -127 -157 -123 27 -74 139 222 -98 115 49 -67 -160 232 73 59 338 295 -38 236
6263 236 217 55 144 153 123 189 286 -17 -17 96 -58 -102 83 9 -26 154 161 -8 14 47 -147 -224 -165 -229 -210 -65 -221
6290 -221 120 -138 46 6 -213 -1 -138 -46 158 -245 -57 21 -141 -143 -149 130 -3 165 -66 31 324 233 51
6313 51 -16 392 166 -168 62 76 4 152 197 89 70 373 144 -43 128 -32 -5 70 -6 -145 91 -127 -235
6336 -235 49 258 -214 -139 -41 -45 -213 -25 -198 -273 -230 -149 -246 -118 202 -216 -136 -38 -195 12 27 3 -171 62
6360 62 163 -335 -129 32 17 148 266 60 -107 157 1 116 254 124 89 138 310 -57 -57 256 -39 106
6382 106 315 -87 -5 154 -229 73 -27 -37 14 -111 -27 -42 30 206 -35 -271 -26 7 -352 -59 -69 -308 33
6405 33 -53 -83 -75 -68 -156 -151 -10 -73 -195 18 46 -163 61 26 -99 -66 199 113 60 333 169 229 210 237 -83 18
6431 18 151 -40 101 200 66 129 174 -69 -20 194 38 -161 -6 5 -78 -141 11 -151 41 4 -38 -53 -17 -156
6455 -156 -48 97 -47 -114 -159 -97 -229 -212 191 -345 -218 -43 -93 -169 -61 90 -167 -62 25 -257 21 301
6477 301 -163 89 212 55 -159 33 261 -110 185 96 -174 207 284 -118 -40 223 53 50 265 150 37 30
6499 30 -19 -160 -113 36 -187 82 291 -139 -161 -25 -159 -183 -109 -273 -405 -96 -59 -242 -59 25 120 -224 -40
6522 -40 -84 144 63 -15 -224 -40 191 -123 49 64 -202 103 -138 46 127 74 -3 241 199 35 -76 166 238
6545 238 133 97 289 13 -4 188 22 -129 8 -127 108 51 -1 26 26 51 -102 -58 -25 -71 -229 18 -79 -220
6569 -220 -248 -81 -315 -163 -19 -151 -199 61 -208 -237 -39 -176 -125 89 -238 -173 -61 40 26 -130 184 98
6591 98 -121 255 -146 -29 290 102 -30 9 -89 13 166 239 -42 -103 286 -28 -162 -64 -167 -47 150 233
6613 233 -192 116 -46 -146 -34 11 11 -67 12 -122 -23 -47 -115 -64 -215 95 -153 -139 -230 -196 -144 177 10 -75 -52
6638 -52 -95 -93 11 12 -34 67 189 2 96 161 114 34 160 148 73 237 446 -73 21 223 43 45 200 50 122 251
6664 251 196 -5 123 -30 -128 53 217 -50 -273 134 115 -68 -44 82 -217 112 -135 -113 -51 -80 -184 46
6686 46 10 -239 -189 -72 -118 0 -14 121 -29 79 122 -1 122 7 -37 86 171 -41 -27 325 82 24 -48 280
6710 280 32 325 337 43 -153 152 -11 196 97 92 -46 -102 44 -87 162 0 -50 -129 48 -150 -99 -234 -239
6733 -239 15 162 -89 -164 17 -7 -123 -80 -23 29 -177 -164 -66 -142 -80 -159 23 13 -134 -2 91 0 59 28 67
6758 67 -9 221 181 -62 -37 -3 14 -117 119 281 11 -87 322 36 79 100 -116 -44 -23 94 -7 252 36 76
6782 76 84 150 -82 8 -56 50 -81 -4 -220 -179 -95 -67 -171 -124 90 -79 -197 -24 -278 -107 -136 -153 -221 19 -26
6807 -26 -365 20 -100 -239 -159 126 -98 -152 131 33 -38 110 19 -49 225 340 -122 181 115 120 255 85 -52
6830 -52 -98 187 88 -17 119 129 -116 88 142 46 101 117 -206 -24 158 18 -111 14 -109 -90 -144 60 -98
6853 -98 -120 174 -290 110 145 44 -151 23 10 -63 8 123 -267 20 158 -129 53 186 -3 -64 173 153 21
6876 21 149 -22 -45 164 91 -70 15 164 -106 290 -42 78 7 109 2 -128 -55 71 -234 -20 66 -44
6898 -44 -106 128 -172 -55 135 -7 -97 -88 -132 -250 -127 164 -86 -281 -67 -351 -133 122 -212 -158 40 74 -82
6921 -82 -43 -130 54 105 231 -65 38 135 -31 132 69 180 156 26 218 63 -35 164 -87 82 199 -27 -40
6944 -40 158 123 -125 205 64 -105 -66 -5 -150 18 -19 32 -123 -66 -66 -228 92 -149 -11 -60 -92 -250 -72 -60
6968 -60 -77 -191 134 -95 -104 11 75 -7 39 192 29 -90 83 49 -73 145 -68 31 127 234 -35 120 -72
6991 -72 -30 44 261 13 172 320 117 -284 208 145 -44 178 69 31 56 -68 -133 -86 100 12 -13 33 4 -28
7015 -28 4 -56 92 -47 -27 -222 -184 63 -191 -114 97 -55 -170 -151 -67 -71 -233 -90 -145 -33 -11 -42 266 45
7039 45 105 -42 270 152 17 200 168 72 100 171 156 -65 100 192 69 53 -117 93 290 247 -86 128 -60
7062 -60 -88 27 -72 -229 -121 169 -83 -374 -10 -80 -143 -36 -12 -343 111 73 -56 -179 66 -112 -107 39 -120
7085 -120 -192 -69 -54 8 -54 106 105 70 -35 -197 -60 261 135 144 177 -86 -97 -25 79 82 33 184 59 132 330
7110 330 24 13 316 54 -22 186 6 4 -87 195 -28 -34 -87 -251 -48 -56 0 -326 -17 220 -231 146 -61 -22
7134 -22 31 91 -372 -166 -46 -151 -217 -25 15 29 86 -4 -119 47 317 -27 -44 130 184 -196 190 -89 49
7157 49 109 100 -102 225 148 -49 -23 103 -103 56 148 -74 -103 79 -82 -28 88 262 -45 95 -124 12 38
7180 38 -165 56 -277 -105 -192 -289 -68 -93 -28 32 36 -109 -73 66 -107 -202 33 -59 -110 85 131 -303 128 110 -86
7205 -86 138 190 -8 -140 181 5 -80 255 233 -50 119 223 -174 -124 289 -15 -216 100 174 -10 126 281
7227 281 -51 97 162 29 113 -62 -161 182 17 67 -157 -114 5 -28 -125 -10 -158 -39 239 -286 -138 167
7249 167 -143 -266 126 56 -72 74 -115 -172 97 196 14 -201 -172 4 92 77 80 159 115 82 27 4 361 5
7273 5 220 202 80 52 163 -77 42 306 -67 -134 195 -10 -176 10 136 -167 -40 173 122 -80 -13 15 107
7296 107 -62 -166 -182 97 -236 -6 -15 118 -44 -170 6 -116 -74 48 -73 -162 143 83 -116 -59 204 -141
7318 -141 -31 122 -64 74 88 156 -26 16 131 51 127 146 143 79 95 74 110 197 166 -164 164 9 -173 153 -10
7343 -10 72 -163 1 -68 -146 -80 2 -139 -26 37 -122 -79 20 -102 -92 99 -183 -105 33 -156 -140 25 28 -34 92
7368 92 52 -110 76 154 -136 -133 92 73 -252 64 49 -34 106 155 33 171 110 -48 233 156 -97 -4 215 -36
7392 -36 -64 318 85 -140 159 175 -175 75 186 6 1 -82 -20 37 -5 132 -116 82 -181 -60 -19 129 -139
7415 -139 -60 -100 -64 -261 1 -79 -206 326 -81 -144 69 121 16 -67 241 -31 43 -50 -173 124 124 95 119 204 370
7440 370 -111 42 200 -90 74 103 -179 -156 68 324 53 134 -31 -251 15 5 11 62 -226 -1 -51 147 -24
7463 -24 -138 13 -38 -176 110 -12 -82 26 -178 -268 -99 55 -69 -308 -62 -23 -163 -111 95 -27 23 40 15
7486 15 -15 2 8 98 -1 -52 8 -16 39 -139 46 3 53 176 73 18 47 94 82 -53 -35 11 -41 -53 92 53 -23 171
7514 171 -174 -159 123 34 -5 102 142 -247 181 11 -160 -7 169 -118 -59 171 -131 -214 202 -95 -51 -44 -82
7537 -82 -193 -5 27 -49 69 101 -55 15 152 -41 -50 304 177 -36 188 70 -142 -50 271 -21 119 316 87
7560 87 -39 264 141 13 274 51 16 -66 110 -238 162 140 -64 -17 -103 -101 -143 30 3 -175 50 -51 -216
7583 -216 62 18 -113 -243 -60 -52 -216 84 -111 -229 -69 -162 -170 -30 39 -286 -28 5 -4 -87 112 100 -99 25
7607 25 322 17 206 319 -95 127 281 70 75 270 71 88 98 161 -66 106 134 -137 59 108 -135 -12 218
7630 218 -120 -154 45 73 -15 -178 51 -202 -72 -16 -77 -10 -160 -22 -20 196 -32 -255 8 164 -131 4 -317
7653 -317 -50 -59 98 -34 -11 231 71 35 197 111 37 62 264 50 90 104 187 7 98 58 -16 257 -123 26
7677 26 90 166 -89 -22 80 79 -53 78 -81 31 -12 -16 -58 141 58 -200 -91 -38 51 -98 -125 -198 -174 -12 -216
7702 -216 -375 -98 -138 -29 11 -164 -202 -153 -2 -188 -212 16 50 -143 162 183 -29 93 96 115 45 141 -10 145
7726 145 140 49 -119 192 127 -36 151 7 -89 25 22 -128 117 -26 -117 -199 174 -12 -270 212 30 -133 148
7749 148 45 -132 -176 -31 105 -191 -29 -174 -156 -168 43 -70 -129 -162 -117 -110 44 14 3 -58 30 -40 18 -21 139
7774 139 -55 169 -13 79 188 -33 123 49 1 63 177 -53 -87 21 13 -84 -29 24 -86 33 334 -81 -127 176
7798 176 -27 -64 75 -85 -149 141 61 -98 178 6 -236 -265 53 -139 -252 -171 -143 -8 10 74 -97 -55 17
7821 17 -112 -24 -21 -21 -37 107 -102 -170 16 -26 -92 -25 -38 -10 59 29 120 -75 269 67 -16 174 132 50 58 -14 -91 136
7849 136 71 22 -90 -5 -160 -30 159 16 54 -32 -61 -148 53 173 -249 -158 -138 -104 -114 -81 -1 4 -71 35 -90
7874 -90 98 -213 -69 -117 -37 -12 -170 20 58 -25 -30 25 -109 351 45 -26 160 -137 -2 21 218 -25 100 256
7898 256 15 61 230 19 -10 143 43 -36 -56 -36 92 13 105 -262 -134 141 -98 -55 -70 195 -98 -31 219
7921 219 101 -39 -24 8 -112 64 33 -7 11 20 -146 -181 109 5 -113 213 -1 -90 62 70 -130 66 96 -31
7945 -31 52 147 83 -85 90 -145 23 76 -75 -66 169 87 25 141 51 -70 11 108 -138 28 -48 -67 -37 84 128
7970 128 16 -106 -62 -118 -20 34 -138 -93 79 48 -66 197 -71 -86 -94 163 -34 -137 129 14 47 161 -7
7993 -7 134 163 21 85 -47 151 -118 113 54 -103 -35 141 -272 50 293 -244 -114 -70 110 -137 -2 194
8015 194 -184 -70 132 -47 -61 4 -126 -131 208 24 254 70 -87 -9 19 -44 73 -56 -309 -19 -140 112
8037 112 -62 92 -51 -105 -182 -38 -114 -101 -70 -21 -71 -165 -20 90 63 114 -73 -66 47 162 -94 -69 242 -52
8061 -52 11 115 -59 -52 126 -20 -266 180 2 9 -90 51 -91 35 201 -175 41 -148 -65 -136 53 -24 -193
8084 -193 -109 -94 -56 3 -6 -133 -89 63 -101 -200 -168 -28 -190 6 -98 -56 -17 219 -255 -152 -86 10 79 51 -114
8109 -114 -97 177 -55 -2 73 49 20 -87 106 3 -21 197 -106 -29 -28 165 15 102 57 -114 115 132 -48 -122
8133 -122 77 -50 89 -166 -76 -172 32 55 -176 24 -19 -318 -158 75 -117 -205 -108 -142 -33 9 -91 -64 -22
8156 -22 93 -161 7 -53 169 117 -6 86 -206 170 25 167 46 24 67 -14 239 322 -46 -2 99 -34 103
8179 103 389 -70 188 134 -57 75 133 -12 -25 39 -33 64
8191F4
$$ Imaginary data points
##PAGE= N=2
##DATA TABLE= (X++(I..I)), XYDATA
0 0 0 0 0 0 0 0 0 0 0 0 -8 8 -8 8 -8 11 -16 16 -18 24 -25 32 -35 40 -48 55 -62 70 -79 90 -99 113 -128 141
34 141 -158 176 -196 218 -239 266 -296 325 -361 399 -440 491 -546 610 -683 767 -870 992 -1143
53 -1143 1338 -1596 1959 -2505 3412 -5205 10068 -49674 -150831 -14864 79921 15684 -73591
66 -73591 -44138 6960 -5006 -34264 -7663 11783 -30766 -61864 -1371 48618 -2218 -61217
78 -61217 -31580 12430 5011 -10165 -3298 -6264 -16574 -9392 8318 5621 -17225 -20521 12893
91 12893 27208 -6246 -24673 1869 11584 -5648 1585 17937 -517 -19430 508 23388 10062
104 10062 -18499 -22984 4976 27104 14134 -10128 -19932 -22306 -4742 32609 27051 -32855 -49822
117 -49822 7131 39589 6 -38135 -23108 8049 8544 -10520 -8514 4534 -14219 -36202 -6313
130 -6313 28893 4017 -31623 -17232 6590 -1331 -11863 -4221 3206 -3397 -13077 -6152 11579
143 11579 6379 -17266 -15107 6858 8527 1954 5606 -3476 -16825 -324 19964 5606 -13656
156 -13656 -3423 15759 12365 -8780 -15060 6822 19673 -446 -11047 8197 9078 -11875 -4294
169 -4294 17281 3698 -19151 -6463 19018 14431 -12771 -22017 715 16110 -2368 -12500 8374
182 8374 9550 -20579 -19699 14422 18209 -10433 -20699 -4477 9460 6212 -6072 -9678 -5861 -7786
196 -7786 -2780 15674 10832 -22437 -26624 6495 19480 333 -14331 -12258 -1328 7909 2055
209 2055 -10731 -10071 -2669 -508 2876 1167 -9967 -10500 174 18 -5251 -2105 -4297 -9033 585
224 585 4982 -10579 -17072 -1838 8236 1222 -10700 -13327 -1348 5917 -6299 -11902 3346 5067
238 5067 -12659 -8988 10339 6287 -11908 -12124 1210 10656 6901 -5626 -8444 1433 3670 832
252 832 7135 5534 -8004 -3973 12176 9850 -3391 -3939 1934 6013 8561 3292 -3318 321 4157
267 4157 1642 3330 3284 -2926 199 7198 -807 -8198 331 4846 -1765 -2732 -834 -4154 -3461 -511
283 -511 -3255 -4517 -4489 -6563 -2112 2591 -7121 -13926 -2162 2799 -8110 -9133 -142 -1628 -7417
298 -7417 -7053 -4178 -208 391 -6686 -6710 2771 794 -6880 -1160 3474 -3585 -3202 5116 3114 -2191
314 -2191 -608 871 2269 5051 1214 -1307 5027 5303 -1075 1345 5467 759 1309 6150 1287 -2126
330 -2126 4443 4609 -1851 -512 2520 722 1213 328 -3275 -742 1343 -3725 -2633 2935 -2982 -8302
346 -8302 495 2560 -6925 -7068 231 -58 -3780 -4940 -4623 -72 779 -6590 -5826 3688 674 -7436
362 -7436 -1244 3825 -3008 -3901 2569 2161 -695 -24 133 2143 4349 -110 -1777 5409 5265 -1547
378 -1547 1760 5764 914 690 5433 1927 -566 4153 3768 -678 1326 2251 174 1910 1226 -2571
394 -2571 928 2329 -4054 -2829 3421 -1735 -6887 119 1806 -5145 -5157 -862 -1620 -2551 -3370 -4881
410 -4881 -930 554 -5820 -5750 2460 -356 -6817 -1153 2920 -2918 -2957 1669 904 -562 884 -21 1625
427 1625 4301 434 -710 5673 4918 -474 3501 6486 1579 2258 6887 3594 1497 5231 4792 2819
443 2819 4210 3387 1631 4704 3915 -529 2813 4748 -1268 -937 4772 1343 -3475 244 1521 -1962
459 -1962 -979 -651 -2668 -1343 -947 -4031 -1055 621 -5501 -5866 1774 25 -6299 -3518 -789 -3171
475 -3171 -1846 -353 -3390 -2863 -517 -1761 -334 1565 -3623 -4562 3762 3782 -3256 -1648 1982 226
491 226 1428 3072 -1026 -1533 2648 1857 660 2246 -963 -2451 3198 3228 -2714 -1199 1526 -2169
507 -2169 -1295 2697 -1276 -5011 -1608 -12 -1589 -1379 -3520 -5210 -612 68 -5226 -4022 -1075 -4859
523 -4859 -4700 665 -1921 -6865 -3168 -28 -2127 -2124 -2396 -3498 -333 850 -2602 -1096 2175 -1991
539 -1991 -1898 4709 2858 -3510 -236 5213 3154 1370 1030 738 4330 6440 676 -475 4752 4279
555 4279 1670 3951 2675 -752 3438 5981 417 -534 2781 1539 755 2645 716 -1781 991 765
571 765 -662 1940 -285 -4961 -210 4683 -1045 -4933 -557 468 24 1519 -992 -3767 81 2380
587 2380 379 1032 763 -2840 689 6159 2737 -818 1498 1513 2097 6983 5786 -1000 24 5259
603 5259 6419 6357 3835 -1372 1809 9004 6521 1047 1903 2195 2046 6431 5802 -1396 -1742 3786 3986
620 3986 2278 315 -3303 -1243 4345 1296 -4720 -2514 -148 -1984 -780 -854 -5307 -5112 -589 -2144
636 -2144 -3579 -2131 -4209 -5581 -1732 -1117 -3960 -2937 -3176 -5631 -1123 2939 -3190 -6727 -1296 937
652 937 -984 -742 -1390 -1500 1432 -300 -3388 1673 4529 -1831 -4460 1757 3532 419 -498 -1980
668 -1980 -1277 2617 827 -3573 -45 2638 -3491 -5874 -385 2263 188 -3749 -8833 -5600 4607
683 4607 3096 -8743 -11261 -3267 1721 999 -5129 -11249 -6386 2703 136 -6697 -5397 -3180 -3598
698 -3598 -1282 -143 -3066 -3610 -3090 -2745 2753 5263 -4377 -9202 1714 9993 4433 -4521 -6198 1330
714 1330 11510 8354 -4820 -5809 4931 8332 5031 2908 -192 -1551 2941 5749 5156 4466 -1119
729 -1119 -7140 61 11364 7947 -5221 -10706 -4922 7744 11941 -2800 -16982 -8320 6801 6947
743 6947 -2937 -10208 -10269 -1816 4164 -1331 -7443 -6410 -6317 -4438 2334 1635 -8265 -10920 -3697 3312
759 3312 3591 -3481 -11335 -5565 7280 5724 -5107 -7016 -1128 3892 5745 1398 -4835 -1592 4514
774 4514 3750 2822 3853 -309 -2546 3024 7219 5076 1463 -2866 -3148 5964 11212 2432 -6715 -4288
790 -4288 2405 7658 6469 -3778 -9351 -1184 5596 2556 -1695 -3685 -5774 -2384 2572 999 -3551
805 -3551 -5143 -6225 -2848 3120 206 -7515 -6076 -724 -1481 -2267 -1502 -3510 -3584 -1358 -1942 -1656 898
822 898 -2008 -4896 -174 2629 -1031 -1868 -316 -1778 4 3536 552 -3316 -465 2205 2304 1936
838 1936 -2135 -4444 1744 6284 681 -3654 -2504 -1144 1736 4680 -476 -6117 -3252 1571 2264
853 2264 1211 -3085 -7052 -2296 3655 1046 -2914 -2422 -4056 -3690 1653 2471 -2098 -3945 -3632 -2303
869 -2303 2758 3420 -3291 -5514 -712 2070 2639 1952 -2714 -4736 1417 5625 1646 -729 -1138 -1052 2877
886 2877 5421 433 -3182 371 2757 2706 2641 -1318 -3750 1870 5672 825 -2925 -1604 -390 2098
902 2098 2910 -2445 -5347 -285 2006 -211 -1036 -2870 -4845 -1298 1758 -1546 -3155 -1867 -3251 -3011
918 -3011 1084 553 -3676 -3117 -1749 -1138 1540 1221 -3671 -3453 845 1249 674 1345 -1547 -2813 2159
935 2159 4040 440 -188 713 412 3092 4278 -57 -854 2846 3078 1273 2321 1071 -204 2784
951 2784 3525 -497 -530 2113 1257 891 1298 -1238 -1248 1996 949 -2201 -540 228 -1828 -559 736
968 736 -2286 -2091 176 -1763 -2633 278 -900 -2501 -1148 -1004 -2463 16 1214 -2390 -2318 972 177
985 177 -190 1189 -825 -1668 2294 2553 -456 370 1469 101 1949 3332 -59 65 3092 1894 212
1002 212 2209 1770 445 2410 2126 -677 976 2515 156 -23 1567 -402 -586 1665 -37 -2270
1018 -2270 -149 351 -1531 -536 -104 -2214 -1218 724 -1994 -2488 -11 -738 -2140 -455 -877 -2315 3
1035 3 721 -2012 -881 1293 -465 -580 1232 -288 -837 2043 1185 -741 1349 2288 193 1220 2310
1052 2310 350 1113 3507 1240 128 2741 1987 392 2443 2066 -432 1533 2925 61 -348 1286
1068 1286 -111 -217 1632 -391 -1945 684 194 -2035 -946 -182 -2280 -1170 259 -2349 -2977 -156
1084 -156 -1346 -2564 -835 -1233 -2984 -779 -351 -2716 -1333 298 -1737 -1603 795 -1064 -1558 912
1100 912 388 -1372 931 1388 -395 845 1569 -416 892 3082 379 -171 2259 1742 255 2267
1116 2267 1615 -297 1455 2557 311 633 1840 -413 -222 2387 786 -958 954 27 -1212 849
1132 849 1200 -1632 -953 651 -668 -593 768 -1421 -2345 734 420 -1390 134 -363 -1781 715 1892
1149 1892 -1030 -1102 1167 459 689 2309 359 -1035 2038 3169 1109 1686 1725 99 2634 4793 1405
1166 1405 -141 2159 2356 2451 3805 1781 -987 2276 3761 1526 1064 1181 -487 1009 3461 856
1182 856 -1279 298 159 -237 1818 705 -2844 -1558 969 -44 -322 -740 -3120 -2011 1806 165
1198 165 -2926 -1462 -684 -1230 713 514 -2682 -1787 1136 180 9 1239 -807 -1310 2047 2317 8
1215 8 709 954 45 2489 3656 -92 -312 2638 2459 1466 2443 1080 228 3082 2726 -186 1131 2573
1233 2573 284 459 2158 90 -45 1557 222 -1354 1184 801 -1712 -522 179 -1803 -769 443
1249 443 -1595 -1802 -12 -1556 -2036 827 -515 -3249 -1309 487 -915 -645 -564 -2495 -837 2542
1265 2542 340 -1702 -169 170 453 2544 1384 -1770 366 2951 1575 1605 1817 -284 199 3747
1281 3747 3267 579 803 636 718 3725 3774 -788 -1020 1649 2104 2344 2306 -1799 -2647 2475 3460 81
1299 81 -1819 -1629 -1043 2152 2407 -2346 -3449 -149 546 -51 222 -2431 -3698 334 1796 -935 -1484
1316 -1484 -1275 -2548 385 3130 -6 -3285 -1265 765 2239 2647 -1256 -3469 1574 4751 1132
1331 1132 -824 440 786 1958 3527 805 -408 1994 1690 579 2806 2456 -703 -352 2017 1829
1347 1829 1545 829 -2318 -1082 3532 2557 -3042 -2550 537 1252 800 -1765 -4036 -274 2537 -1683
1363 -1683 -3947 -1009 0 -1699 -1215 -1513 -2112 -453 -499 -2736 -390 1028 -2236 -2855 689 1183 -980
1380 -980 -1094 -1114 255 3245 1010 -3274 -494 4516 2843 -611 -697 494 3130 4167 198 -1954
1396 -1954 2371 4271 930 568 2000 771 851 1856 1057 1670 2128 -1018 -1867 2957 3746 -1052 -2901
1413 -2901 -670 970 2540 415 -4224 -2957 2110 1638 -2205 -2154 -1783 -1600 649 219 -2249 -1579 -712
1430 -712 -1886 -14 1940 -1893 -4152 -444 2146 930 -416 -2543 -2461 2687 4128 -837 -2938 17
1446 17 1937 2378 1957 -1147 -1387 2452 2860 183 973 1767 -647 -10 2594 1640 152 232 -922 4
1464 4 3049 1305 -2376 -1275 769 250 630 275 -2753 -1980 863 197 -1352 -598 -1547 -2656 149
1481 149 674 -1951 -2209 -1082 -1728 11 924 -2096 -2810 773 735 -848 76 -452 -1383 762 1537 -598
1499 -598 -100 1544 39 334 2113 803 -111 1472 1024 101 2069 2137 -779 159 2027 1091 956 1560
1517 1560 -798 -910 2169 2008 -610 -806 -796 -742 1775 1642 -2476 -2671 264 382 -238 -291 -2465 -2827
1535 -2827 355 968 -1677 -1750 -1345 -2051 -302 1155 -1324 -2535 -535 -456 -398 1039 -338 -2271 -199
1552 -199 1367 61 534 847 -1115 -329 2631 1196 -249 1059 562 479 2779 2194 -770 85 1963
1569 1963 1423 1513 1158 -1004 -289 3041 1720 -1302 -399 104 132 1512 823 -2351 -1490 854 -19 -577
1587 -577 -291 -1939 -2362 759 379 -2385 -1084 -993 -2110 -665 396 -1843 -1939 -269 -671 -1112 289
1604 289 -490 -1681 -39 164 -757 481 880 -1399 -293 1963 657 -372 1297 476 -42 1984 1326
1621 1326 -385 1015 1881 387 831 1561 -226 276 2230 748 -786 829 821 -462 836 368 -1541
1638 -1541 -380 1016 -762 -1064 -142 -1274 -1459 392 -892 -2139 -563 -184 -1921 -971 -74 -1531
1654 -1531 -1475 73 -1484 -1349 550 -603 -1845 -231 59 -766 561 656 -1156 -130 1770 216 -151
1671 -151 1256 447 106 1915 1243 -566 1094 1976 239 683 1557 276 521 2024 270 -584 1119
1688 1119 977 -409 694 419 -1181 164 973 -1158 -1284 446 -854 -1172 41 -1157 -1960 -258
1704 -258 -498 -2040 -951 -356 -1690 -877 -31 -1691 -1543 291 -649 -1396 201 -111 -1358 224 619
1721 619 -895 67 1113 -265 27 1488 464 -203 1403 815 -54 1454 1662 -286 1080 2016 312
1738 312 531 1824 327 -36 1924 807 -399 654 676 -325 602 629 -1455 -555 807 -836 -1167
1755 -1167 239 -1046 -1524 -16 -296 -2164 -876 -218 -1642 -863 -179 -1672 -1268 262 -976 -1622 -73
1772 -73 -400 -1433 456 380 -1210 -83 1057 -293 -28 1322 160 -77 1464 470 93 1539 1188
1789 1188 -390 1145 2000 165 677 1864 358 224 1676 702 -321 1012 640 -586 757 698 -894
1806 -894 -373 558 -1022 -640 454 -1091 -1593 0 -465 -1743 -879 -463 -1878 -786 4 -1251 -1286 -258
1824 -258 -1419 -1068 463 -445 -2044 -222 417 -842 90 398 -949 -37 1674 390 -185 447 178
1841 178 559 2147 921 -889 881 1944 613 1125 1515 -339 270 2382 1380 97 448 209 24
1858 24 1652 944 -1079 -378 547 -575 -130 660 -1415 -1790 498 400 -1067 -1120 -1327 -1741 185 157 -2111
1877 -2111 -1929 -143 -1037 -718 114 -1356 -1814 531 579 -978 -180 -213 -1010 347 1103 -417 -547 587
1895 587 281 726 2158 467 -988 1224 2301 687 626 1104 238 953 1905 328 -58 1334 651 87
1913 87 1132 525 -796 533 679 -886 -207 882 -904 -1047 232 -438 -1132 -282 -817 -1481 -205 -450
1931 -450 -1787 -866 319 -1410 -1689 132 -371 -1207 -68 -753 -1210 716 786 -1099 -476 643 224 896
1949 896 1088 -903 -481 1843 1658 68 884 815 -13 1644 2380 482 337 853 571 1418 2371 442
1967 442 -1109 801 1866 754 874 -413 -1631 791 2308 -204 -1877 -814 -360 330 920 -1321
1983 -1321 -2532 -548 392 -751 -437 -635 -2338 -1163 1048 -6 -1407 -1247 -1692 -632 1746 458
1999 458 -2505 -1570 898 1359 1021 -217 -1989 32 2997 1627 -760 17 607 958 1940 1331 -22
2016 -22 335 1325 938 1480 2139 -180 -1191 1326 2375 893 -78 -859 -683 1969 2170 -1214 -1872 242
2034 242 806 66 -165 -1569 -1390 650 -13 -1712 -790 -72 -1837 -1241 499 -248 -1335 -1015 -1242 18
2052 18 1344 -644 -2665 -141 1391 164 -650 -286 -434 902 1788 -296 -833 1559 1324 -17 673
2069 673 1166 1005 1062 835 -14 1323 2360 68 -562 1627 1451 104 403 487 255 823 565 -813 143
2088 143 1005 -608 -1005 442 -26 -618 -348 -1161 -1356 662 331 -2066 -1571 103 -696 -1333 -720 -968
2106 -968 -859 91 -968 -1186 437 115 -1281 -490 1144 -78 -256 242 67 155 1652 391 -844 890
2124 890 1651 681 761 801 -65 1347 2089 372 59 1463 932 244 1160 896 -128 725 840 47 350
2143 350 355 -622 -411 1156 -217 -969 -26 -491 -1177 -244 -291 -1486 -904 -35 -1138 -877 -334 -1205 -1188 -295
2163 -295 -534 -1290 -32 -163 -1211 -421 596 -695 -296 605 -404 -150 915 40 -569 703 682 -256
2181 -256 933 965 17 548 1591 83 267 1555 497 129 975 644 266 1173 475 -685 432 1064
2199 1064 -345 -271 189 -567 -532 883 -51 -1674 -492 -165 -1032 -522 -533 -1771 -796 38 -725 -1047 -259
2218 -259 -1110 -1085 369 -124 -1519 -655 412 -472 -193 48 -655 -357 1070 -133 -233 815 467 -271
2236 -271 1137 1216 -85 764 1206 130 728 1667 496 110 1037 965 520 1011 679 -244 952 1205 -295
2255 -295 108 525 -432 -465 613 55 -1249 -71 92 -776 -200 -299 -1419 -504 298 -1105 -1294 -143 -682
2274 -682 -994 -61 -825 -1225 -200 88 -1082 -478 305 -418 -205 336 -296 -85 885 3 -619 913 1013
2293 1013 42 785 1317 312 682 1714 553 444 1471 790 697 1412 827 -84 799 1318 -11 394
2311 394 1127 34 139 982 -96 -600 453 289 -710 -21 -107 -1188 -179 13 -1348 -967 212 -840
2329 -840 -1147 -156 -547 -1029 34 -310 -1210 -87 125 -849 -504 203 -480 -96 976 77 -700 813 651
2348 651 -160 740 878 129 672 1268 442 630 1393 583 261 1397 889 210 1091 1050 -28 585 1205 328
2368 328 216 658 -24 -235 898 6 -784 163 273 -528 80 110 -1156 -420 541 -712 -1198 -116 -298
2387 -298 -929 191 -536 -1130 -96 190 -695 -376 429 -820 -415 751 93 -612 415 413 -208 578 532
2406 532 -362 438 1077 292 472 1019 188 98 1193 725 -26 786 714 -177 852 1140 -286 -66 768 13
2426 13 -306 707 -501 -586 340 90 -963 -396 -121 -1280 -460 161 -1219 -1265 -304 -774 -877 -205 -804
2445 -804 -1496 -82 -257 -1262 -752 -29 -815 -612 170 -724 -813 347 69 -638 352 374 -485 152 681 -202
2465 -202 235 871 -67 223 1392 380 -278 780 683 -215 547 727 -164 208 770 -35 -224 679 -271
2484 -271 -592 474 135 -829 9 -69 -1050 -384 219 -704 -1070 70 -655 -738 -111 -887 -1318 -127 -301 -1195
2504 -1195 -183 -20 -983 -481 473 -339 -408 362 -128 -368 1065 487 -488 456 633 192 680 991 -279
2523 -279 -43 1615 574 87 713 569 48 1103 1131 -205 172 767 15 556 717 -689 -782 752 456
2542 456 -532 96 -441 -789 6 562 -1052 -1071 -381 -735 -554 0 -1144 -1451 -129 -70 -824 -338 -539 -1144
2562 -1144 -168 655 -361 -910 18 -148 184 802 -4 -903 471 937 297 512 598 -514 205 1301 691
2581 691 -78 599 467 560 1346 555 -580 454 934 304 278 367 -199 -150 834 -80 -856 -32 -171 -715 21
2602 21 114 -1194 -903 -158 -693 -751 -78 -1216 -1218 152 -428 -1347 -560 -306 -894 -400 -39 -1166 -579 475
2622 475 -384 -816 301 -7 -452 514 431 -518 571 789 -95 401 985 290 70 1154 836 198 1070
2641 1070 480 81 1286 946 -540 51 1133 529 239 350 -239 -254 1043 225 -887 -214 259 -426
2659 -426 -3 38 -834 -670 415 -615 -590 175 -594 -1301 38 148 -771 -713 -546 -645 255 669 -1088 -1210
2679 -1210 635 490 -23 -22 -111 -325 1136 1149 -436 228 877 289 315 1322 611 -33 568 758 317 1340
2699 1340 421 -718 462 1529 626 -146 88 131 380 1018 -207 -1023 538 732 -439 -148 -91 -799
2717 -799 -166 192 -631 -619 295 -887 -1086 283 122 -908 -646 -223 -525 356 125 -1232 -591 914 52
2736 52 -588 52 186 -186 548 304 -374 493 958 -91 437 1190 526 111 698 580 258 1164 390 -304
2756 -304 820 1018 -82 147 912 113 58 580 -63 -453 526 -8 -744 -9 385 -545 -687 -180 -613 -614
2776 -614 14 -895 -1176 128 -224 -906 -177 -278 -870 -332 114 -797 -622 272 -398 -515 599 -13 -512
2795 -512 263 268 -124 396 550 -410 459 1168 315 -162 742 537 194 984 815 -310 595 821 -90 433
2815 433 636 -227 -84 755 94 -297 301 -36 -718 429 354 -690 -648 78 -664 -328 14 -839 -939 110
2835 110 -422 -972 -205 -335 -880 -437 76 -771 -245 482 -386 -586 263 125 -467 470 394 -192 515 858
2855 858 113 244 989 92 538 923 564 96 1116 458 56 759 685 -152 391 993 -60 106 571 -83
2875 -83 -140 535 142 -749 205 230 -767 -49 -161 -928 -502 -128 -1008 -1085 -22 -722 -1148 -209 -411 -955 -514
2896 -514 -462 -800 -170 116 -971 -713 408 -2 -707 371 252 -536 703 633 -185 524 1108 174 391
2915 391 1162 570 519 1165 805 475 1316 918 115 1043 998 -56 487 1233 284 177 899 410 -86 628
2935 628 251 -324 226 408 -445 -192 278 -556 -207 283 -425 -815 185 99 -822 -75 67 -759 -219 108
2955 108 -601 -191 426 -336 -193 446 278 -202 532 422 -115 654 959 39 530 1129 402 479 1375 648
2975 648 470 1250 950 172 906 1027 419 709 1062 16 -27 886 420 93 699 270 -355 600 393 -533
2995 -533 -196 130 -495 -134 89 -756 -634 329 -362 -1060 -36 -189 -1017 -381 -320 -864 -553 -4 -677 -736
3015 -736 8 -383 -624 183 -84 -578 184 332 -401 164 376 -251 -7 722 98 -298 620 283 -263 392
3035 392 370 -313 229 590 -434 -19 705 -136 -257 428 62 -555 35 -30 -908 -286 150 -844 -608 53
3055 53 -677 -778 -183 -578 -901 101 -333 -1049 -447 -258 -737 -272 10 -760 -682 154 -259 -551 369 -82
3075 -82 -339 376 307 -167 197 672 -46 235 908 61 188 920 633 13 764 662 185 626 1051 58 387
3096 387 698 -20 438 755 266 -312 544 342 -359 36 556 -513 -153 366 -333 -468 156 -456 -600 59
3116 59 -149 -936 -27 179 -576 -149 117 -359 -324 420 -444 -548 225 108 -383 535 263 -419 471 527 -169
3137 -169 383 943 108 154 925 407 66 759 749 14 649 670 -213 226 737 -54 -88 376 -75 -304 374
3158 374 -191 -599 -20 -8 -837 -586 -123 -989 -711 -419 -838 -1084 -311 -910 -1180 -325 -365 -1276 -607 -357 -1131
3179 -1131 -518 -221 -785 -776 69 -304 -754 140 -106 -618 271 49 -577 35 729 -271 -152 962 175 -134
3199 -134 766 177 -351 808 790 -108 532 728 -105 358 704 -192 -540 448 240 -370 357 -229 -850 205
3219 205 320 -638 -649 -171 -746 -483 -32 -641 -1248 -241 -155 -705 -311 -351 -1100 -641 459 -548 -707 -238
3239 -238 -426 -214 481 -60 -757 91 326 -146 472 424 -274 70 841 459 142 687 275 49 1060 1048
3259 1048 7 409 776 622 672 931 5 -159 963 682 3 275 117 -225 403 303 -426 -254 27
3278 27 -309 -315 227 -615 -1060 25 -199 -437 -218 -593 -883 -33 202 -763 -824 -59 -377 -498 148 -234 -621
3299 -621 96 169 -374 146 327 -365 137 675 250 81 541 190 117 1137 623 22 458 794 152 296
3319 296 564 -61 342 1174 249 -172 554 382 9 488 190 -316 194 276 -750 -186 411 -463 -715 -19
3339 -19 -318 -778 -192 -234 -797 -152 -77 -928 -499 140 -484 -652 -47 -246 -419 376 -214 -473 276 597 -424
3360 -424 -151 487 350 237 586 50 -168 983 439 -152 605 969 216 350 564 79 361 629 5 145
3380 145 854 315 -338 297 169 -188 117 -28 -710 -76 317 -588 -618 223 -334 -719 -136 -295 -820 -199
3400 -199 -112 -650 -297 99 -657 -501 112 -412 -424 -47 -403 -547 190 323 -791 -23 675 -230 -194 332 102
3421 102 143 768 182 -29 789 700 -64 450 666 85 328 997 -61 41 674 45 25 524 426 -383 39
3442 39 372 -222 72 239 -609 -432 365 -262 -690 -127 -381 -438 -131 -242 -795 -245 84 -475 -461 150 -296
3463 -296 -593 178 -102 -496 38 -19 -388 393 455 -91 84 543 172 163 574 247 -206 797 609 -61 213
3484 213 717 185 268 643 36 190 633 201 -238 726 342 -298 411 188 -315 167 115 -596 -287 349 -490
3505 -490 -481 76 -238 -635 87 -64 -871 -213 -31 -771 -393 -117 -755 -551 156 -180 -354 206 0 -342 148
3526 148 495 -219 128 383 129 266 868 404 -15 726 770 333 716 569 231 652 1006 258 633 1083
3546 1083 302 345 897 464 -12 510 470 119 535 469 -320 106 571 -294 -491 411 -347 -293 211 -87 -547
3567 -547 -195 -61 -793 -280 118 -591 -509 104 -139 -315 292 -289 -647 294 186 -238 87 350 -65 105
3587 105 373 101 25 860 427 -69 864 763 42 490 745 345 489 727 297 283 640 153 67 718 417
3608 417 -128 387 327 -556 46 263 -304 -188 115 -241 -696 130 -375 -656 -127 -304 -1048 -522 -69 -826
3628 -826 -827 -25 -639 -453 118 -388 -919 -11 -63 -510 -122 -136 -627 -206 190 -138 -164 220 -81 -182 472 374
3650 374 -229 352 596 -26 165 389 -69 -49 394 121 -27 554 238 -41 89 321 -243 213 278 -152 -107
3671 -107 313 -300 -352 332 79 -333 212 -200 -684 122 -112 -352 -228 261 -545 -130 280 -205 -489 92
3691 92 167 -249 146 414 -396 153 489 56 153 602 187 241 619 301 15 432 691 18 568 643 185 402
3713 402 733 432 121 724 300 -59 610 429 -201 200 347 -41 31 263 -58 -198 78 -186 -540 121
3733 121 -216 -461 7 -87 -419 -433 39 -389 -198 86 -308 -503 241 -222 -518 -43 97 -172 -211 216 -398
3754 -398 -76 427 -148 -191 440 -99 -278 208 282 -103 318 638 -134 66 245 -192 -26 439 -105 -327 351
3775 351 255 -474 46 -11 -444 -66 -70 -300 -416 109 -483 -543 -81 -324 -528 -304 -406 -841 -308 -102 -754 -598
3797 -598 -84 -630 -522 -219 -362 -501 -169 -113 -641 -59 287 -238 -15 171 -145 -10 342 174 -295 473
3817 473 426 -53 563 626 176 398 583 -88 246 340 153 -67 559 316 88 368 184 -139 258 256 -261 -137
3839 -137 362 -265 -337 28 -214 -458 -82 -159 -504 -37 -64 -547 -299 -110 -527 -298 -135 -257 -345 61 -146
3860 -146 -726 154 130 -360 36 358 -157 9 205 44 -123 558 328 -129 503 503 186 266 451 90 182 401
3882 401 122 174 645 303 -27 465 369 -68 118 375 -204 -145 207 -407 -89 209 -295 -368 175 -113 -645
3903 -645 88 -44 -739 -302 -95 -330 -334 -116 -530 -434 207 -47 -391 -106 36 -207 52 419 -433 -186 446
3924 446 -69 84 172 -47 -93 568 407 214 401 437 160 377 691 117 -24 696 344 136 569 80 -275
3945 -275 269 471 -110 -95 194 -311 -68 369 -260 -405 65 -185 -235 -1 -181 -786 -334 -46 -351 -232 -138
3966 -138 -741 -424 171 -243 -652 -14 -149 -429 65 102 -510 -106 447 -179 -162 378 -115 -173 509 382 -137
3987 -137 263 238 -37 589 765 -101 154 611 113 246 500 99 12 448 356 -334 -121 364 -306 -55 223
4008 223 -214 -304 185 -212 -447 57 109 -492 -264 160 -430 -428 -143 -400 -351 84 -550 -533 -63 -196 -575 -287
4030 -287 131 -414 102 -47 -233 49 429 -40 -221 566 355 -22 291 217 80 331 591 -9 262 654
4050 654 117 21 556 263 197 376 381 82 437 293 -372 134 174 -87 -266 271 -259 -224 140 -97 -586 -93
4072 -93 -80 -727 -261 -98 -452 -435 -19 -169 -360 -35 -187 -502 12 -25 -488 80 119 -66 -42 236 -121 58
4094 58 386 76 -84 340 286 -95 416 313 39 370 548 51 156 597 156 -55 452 319 -83 311 443
4115 443 -246 109 481 -143 -123 61 -227 -344 66 -112 -518 86 24 -442 -157 -3 -417 -311 20 -440 -470
4136 -470 -29 -276 -423 -43 -18 -286 -246 38 -416 -2 350 -171 -98 463 189 -116 405 211 32 304 493
4157 493 249 190 690 50 122 680 198 124 661 164 -39 332 546 -176 166 262 -8 -32 217 -123 -158 167
4179 167 15 -245 -140 61 -585 -147 -35 -536 -220 50 -528 -484 -167 -367 -457 63 -178 -394 -21 -149 -219
4200 -219 17 122 -247 -57 246 24 -171 563 138 -124 431 253 -78 215 422 39 322 382 280 220 539
4221 539 179 10 254 247 -102 438 361 -115 9 251 -25 -6 242 -109 -295 215 86 -448 -60 28 -448 -280
4243 -280 -33 -599 -413 33 -488 -541 -87 -340 -429 -8 -225 -336 166 -12 -578 -230 336 -176 -332 212 153
4264 153 -26 245 297 -213 170 295 16 234 550 164 396 450 150 0 337 304 -53 356 259 -125 -134 374
4286 374 -56 311 447 -60 -195 346 9 -181 91 75 -401 61 -51 -494 -205 28 -435 -326 199 -295
4306 -295 -239 -54 -59 -285 -220 41 -214 -113 310 -305 -197 177 -135 -15 318 103 -109 340 137 105 504 513
4328 513 -113 -51 554 208 25 555 39 -210 452 256 -57 115 348 -241 7 436 -233 -309 155 -146 -173
4349 -173 287 -197 -528 211 87 -485 -247 2 -241 3 71 -156 -567 74 -244 -263 161 -22 -442 -174 -3
4370 -3 -102 -138 203 -88 -278 172 172 -275 297 250 -127 220 249 -119 131 576 -117 112 522 165 -112 224 68
4393 68 -118 246 232 -183 211 239 -248 -298 145 -67 -425 70 -217 -291 -100 -99 -506 -185 -136 -415 -224 147 -373
4416 -373 -455 19 -122 -405 -140 -184 -547 -68 -2 -268 8 179 -200 -171 364 -44 -274 225 151 62 339 337 -99
4439 -99 275 349 10 157 726 46 -78 483 304 39 488 297 125 251 513 -45 -56 384 67 -145 268
4460 268 -28 -293 -35 79 -448 -79 -30 -473 -178 -117 -239 -549 -99 -371 -528 -67 39 -500 -70 -88 -442
4481 -442 -238 119 -178 -119 123 -11 -35 131 86 -133 419 370 -90 183 559 -1 196 603 214 238 301 238
4503 238 15 379 191 -86 339 320 -13 -19 207 74 -155 32 -78 -228 250 22 -330 -24 -71 -331 -114
4524 -114 -10 -375 -354 50 -170 -368 81 -235 -563 -154 -209 -206 -74 20 -268 91 230 -153 -237 120 88 -10 313
4547 313 207 -28 148 294 59 239 624 144 -33 408 38 -9 345 371 -58 303 226 1 30 431 -171
4568 -171 -167 79 -93 -311 82 -268 -519 54 -137 -401 -66 -155 -495 -154 -24 -255 -459 -178 -170 -316 -85 64
4590 64 -420 -185 94 -135 -294 -37 -422 -144 86 -254 -150 228 217 58 302 405 -118 274 487 203 97
4611 97 391 80 274 465 225 -7 342 250 -199 207 387 -22 16 249 -200 -100 226 -48 -354 40 -163
4632 -163 -319 -74 35 -404 -38 -2 -511 -183 81 -268 -471 -84 -241 -405 34 -138 -399 -170 132 -216
4652 -216 -147 87 0 -155 368 -25 -176 177 293 -68 205 463 -5 109 444 273 151 610 143 79 479
4673 479 254 -114 100 389 -235 162 222 -224 25 370 53 -232 140 10 -368 -74 -221 -276 -137 -74 -510
4694 -510 -395 -71 -185 -390 -310 -281 -263 -43 -248 -397 -63 153 -219 -128 168 -93 -110 140 -42 50 78 200
4716 200 -247 407 411 -140 198 332 -26 191 311 -129 194 228 220 86 418 394 25 126 121 212 -48 233 -146
4739 -146 80 229 -103 -322 101 115 -301 -195 72 -309 -214 -23 -282 -338 -85 -236 -404 28 -277 -649 -82
4760 -82 208 -422 -122 4 -398 -284 82 -71 -128 280 125 -133 261 257 -31 190 290 -88 176 525 117
4781 117 36 394 237 45 159 319 -2 208 131 -102 -15 197 20 21 435 4 -119 -13 -165 -370 -72 -132
4803 -132 -390 -56 52 -412 -175 -26 -316 -305 -44 -220 -278 -23 -53 -443 -71 110 -383 -238 40 -141 -55
4824 -55 166 92 -145 163 182 67 373 447 121 87 280 -6 34 416 239 -115 321 301 150 139 168 -89 81
4847 81 315 -255 -205 270 252 -257 72 -50 -226 176 9 -360 -147 113 -483 -474 46 -234 -427 151 -143 -452
4869 -452 4 32 -281 -214 60 -258 -153 -64 -320 -146 269 -138 31 244 246 -68 146 272 -34 123 304 94
4891 94 127 419 113 101 373 150 -213 114 256 45 426 257 -104 207 307 50 -176 181 94 -147 160
4912 160 -55 -226 -129 -93 -315 -130 -29 -178 -418 260 -343 -536 25 2 -395 14 -129 -429 49 32 -253
4933 -253 -308 109 -220 -222 -26 235 -119 336 207 -9 22 354 9 155 497 205 210 277 327 -45 362 351 39
4956 39 249 429 -216 193 489 108 0 246 91 -62 320 21 -322 -67 64 -350 -158 24 -352 -234
4976 -234 -48 -385 -391 128 -267 -401 -128 -105 -393 -121 -65 -247 -116 -134 -197 -191 132 -91 -220 121 238 -199 151
4999 151 290 121 -70 502 20 180 236 109 -265 390 352 -1 96 111 52 27 312 -73 -47 154 -166 -141 338
5022 338 -115 -204 -70 6 -160 -153 6 -240 -210 330 -429 -174 0 -238 -398 -12 -108 -260 -359 61 -244 -235 101
5045 101 -148 80 69 95 -267 209 140 -68 482 287 40 117 416 65 147 518 51 43 385 194 -30 366
5067 366 228 -69 255 317 33 31 11 127 -204 254 104 -278 -163 -88 -336 83 288 -209 -248 -18 -276 -412
5089 -412 -80 -115 -324 -96 -38 -310 -68 64 -247 48 -55 -265 -2 301 -24 -16 -80 127 -53 260 296 -290
5111 -290 129 289 -29 308 180 11 235 332 195 -172 336 109 216 51 227 -68 -113 306 -19 6 206
5132 206 -17 -123 -20 -8 -327 117 69 -123 -177 149 -262 -232 140 -391 -263 -39 37 -369 -102 -111 -286 27
5154 27 1 -292 -129 -73 -76 -236 191 126 -40 284 256 -76 136 337 -113 -83 232 -7 -54 254 72 80 333 121
5178 121 -66 143 218 -20 193 341 10 327 243 -1 29 88 46 -188 45 -73 -174 -61 32 -456 -222 100
5200 100 -381 -320 11 -79 -365 -15 -137 -284 -85 -62 -405 -49 125 -93 -66 -40 -186 -99 334 175 -122 154
5222 154 170 -71 36 198 2 168 375 57 49 335 316 134 193 296 21 273 215 -106 186 200 -122 -38 94
5245 94 -121 -204 84 37 -137 71 -136 -329 -8 179 -152 -179 -197 -156 -274 238 -113 -348 -81 57 -379 -98
5267 -98 47 -204 -194 209 -228 2 70 -91 -182 76 123 -24 85 135 -169 -11 371 24 194 320 182 -22
5289 -22 248 79 42 190 175 -148 298 159 24 -55 219 18 36 -103 8 9 20 -47 -167 -181 230 -142 -85 157
5313 157 -168 -239 34 -308 -437 -45 -53 -170 -50 -6 -319 -192 57 -84 -202 125 -58 22 -67 177 -250 199
5335 199 353 89 223 222 55 87 605 127 -2 182 210 114 193 133 -58 -35 306 -124 -146 154 -89 -138 52
5358 52 -59 -123 -64 40 -241 -82 138 -330 -350 116 -297 -183 -47 -462 -92 154 -196 -258 -257 106 -329 -163
5380 -163 75 -196 -92 17 -156 -234 181 137 1 -21 208 157 194 243 121 25 249 159 167 193 287 -40 195 293
5404 293 83 274 291 -323 -87 154 -146 -179 389 3 -80 -15 -117 81 -261 119 -321 -233 -140 -138 -88 43 -145
5427 -145 -268 130 69 -249 -157 -139 -222 -66 -139 -188 -118 -3 -291 -151 162 -15 -36 92 -198 -44 159 355 -42
5450 -42 153 472 57 147 209 413 182 218 183 -157 404 388 37 37 255 186 21 179 62 124 431 13 -8 27
5474 27 5 -175 -171 -73 -101 -42 -32 -286 -142 -201 -101 -234 -53 -132 -226 -36 -131 -162 -52 16 -225 -122 135 35 -77
5499 -77 35 -50 -171 157 217 -31 58 243 59 130 127 210 50 353 174 175 179 100 56 73 359 -73 36 339 159
5524 159 -3 333 -158 -220 337 67 18 1 121 -160 -186 0 -316 -338 82 -226 -430 -59 -88 -330 -108 -48
5546 -48 -449 -130 81 -247 -97 -56 166 -85 125 -80 -57 42 -14 -197 62 323 -25 117 236 257 34 226
5568 226 46 75 349 -34 61 357 168 -88 140 372 25 -88 459 41 -97 173 -55 -118 78 213 -199
5589 -199 -105 115 -49 -247 18 -18 -246 -140 -265 -77 -23 -32 -366 -75 162 -249 -120 69 -73 -76 128 -88
5611 -88 -263 98 122 -68 192 152 -119 -135 393 210 48 222 -190 56 280 216 -104 26 364 124 -62 192
5633 192 31 -105 246 -126 49 212 -5 -118 63 62 -142 -9 -164 -148 -110 -98 -70 -161 54 -178 -407 -270
5655 -270 -236 -2 -47 116 -158 -288 150 94 -186 15 -189 -162 98 123 71 197 48 -171 36 69 43 -70 220
5678 220 64 -40 376 281 2 292 131 -190 98 285 -206 131 336 -56 -77 231 169 -200 94 -28 -184
5699 -184 157 -11 -268 -160 14 -359 -358 -56 -111 -263 -68 -125 -280 11 -165 -162 -142 85 -133 -269 161 145 -304
5722 -304 -116 15 -67 -27 184 -219 -1 83 -83 59 126 -50 193 235 194 -103 360 152 78 71 350 -88 127
5745 127 361 -57 -69 297 113 38 110 115 -240 -119 136 -286 -83 74 -232 -95 207 -162 -190 -147 -183 -181 6
5768 6 -103 -197 -26 -74 -311 -170 124 -151 -109 92 -97 -55 54 170 -25 -95 20 -117 118 124 12 246 362
5791 362 217 18 261 76 -37 369 329 -68 46 320 -126 51 126 -19 -105 31 22 -49 -25 120 -242 -100
5813 -100 -81 -384 -139 56 -219 -377 -186 -175 -92 -53 -45 -111 -298 0 -225 -61 20 -81 -174 62 -60 -275 151
5836 151 20 -95 -38 42 -96 241 93 10 20 156 132 -172 283 71 83 287 22 95 209 -9 -72 21 354
5859 354 -85 90 35 58 180 124 145 -24 -41 268 -109 -112 52 -173 -120 -1 -167 -263 -21 -207 -170 6 -30 -241
5883 -241 40 -95 -107 -101 63 -122 -4 263 -68 -106 146 302 -100 188 235 80 61 256 211 -25 221 204 48
5906 48 80 429 -120 139 198 16 168 291 312 -6 80 66 -151 153 -60 -223 162 -153 -133 -137 42 -99 -189
5929 -189 108 -117 -218 -173 39 -143 50 -20 -295 -270 -71 -281 -25 -70 -136 -293 133 -50 -355 32 21 -185
5951 -185 52 76 -197 207 147 53 109 98 150 -176 245 234 60 197 186 -13 136 141 -135 -41 193 -94 -20 390
5975 390 -209 -78 241 33 -150 60 107 -18 -287 33 -186 -246 110 14 -83 78 -77 -267 -108 -4 -309
5996 -309 -150 126 -246 -193 159 -41 -78 83 49 -117 47 -16 -51 -66 157 19 97 270 56 -2 380 178 -24
6019 -24 57 121 116 216 124 -99 100 356 9 157 170 42 -49 269 -27 -227 167 49 -164 -281 113 -229 -23
6042 -23 -74 -10 -182 -132 -23 -160 10 -131 -135 57 -233 -180 -184 149 -27 -93 16 162 -117 -34 87 -227 49 59
6066 59 -136 138 137 123 -123 241 28 107 453 54 -84 119 109 99 185 117 -91 -6 28 132 -3 54 32 -66 110
6091 110 82 -336 -57 191 -243 -1 269 -149 -225 99 49 -91 -162 -63 -159 -199 -38 -36 -287 -56 -192 -158 67
6114 67 -208 -227 95 -11 20 29 196 -150 -163 76 -77 21 70 30 28 137 19 -30 -4 132 -73 243 384 -221
6138 -221 -45 237 -48 -38 145 61 -261 -2 52 -283 137 148 -149 -89 0 -398 -125 -207 -71 -267 -109 -56 -150
6161 -150 -103 16 -330 -191 96 -140 -93 68 -46 -71 -33 -214 -79 276 -63 -275 13 54 -191 -81 137 39
6183 39 114 346 47 23 292 52 -11 45 17 -53 235 177 101 -2 90 71 -1 -13 93 -59 2 112 -111 -79 15
6208 15 -78 -175 -126 -312 -72 -41 -112 -73 -239 -84 -418 155 11 -299 -202 -28 -161 -215 76 -143 -113 -18 110 37
6232 37 59 138 -109 55 202 4 -58 193 14 -57 14 94 92 106 99 4 90 155 92 103 86 -14 -105 146 -67 67
6258 67 96 80 -4 -68 184 -63 -108 182 -126 -154 155 -81 -196 71 -117 -102 -2 92 -320 -202 63 -146 -185
6281 -185 27 -189 -260 23 -27 -143 145 122 -66 57 12 122 79 271 112 -95 350 293 -72 112 20 68 203
6304 203 121 -161 216 16 140 122 114 17 -154 -3 168 -1 138 -116 -194 -37 104 -111 -265 44 -203 -138
6326 -138 9 -100 -252 -36 13 -426 -201 168 -223 -152 146 61 -230 -55 -105 -202 -5 187 -56 -45 137 -223
6348 -223 15 22 102 59 -8 -52 115 287 96 165 251 146 -61 -100 166 262 109 243 28 -5 40 85 -149 55
6372 55 197 -120 23 82 -238 -78 -63 11 -214 -5 -18 -151 170 -97 -184 -224 -116 -356 -428 47 -149 -336 156
6395 156 -109 -258 24 -50 -297 -39 164 30 75 109 90 81 110 105 119 192 207 18 117 42 51 34 212 140 24 377
6421 377 118 92 279 204 -5 21 -2 -28 68 167 -191 -164 83 -77 54 57 42 -348 -182 -173 -246 -173 -51 -278 -105
6446 -105 58 12 15 -48 -116 -89 -202 -59 -145 -25 60 -102 106 367 -73 189 220 182 -109 65 163 -26 274 295
6470 295 -30 246 130 -45 10 105 -37 74 179 95 -119 128 29 -141 -26 72 77 -37 83 60 -204 -8 -100
6493 -100 -85 103 -252 -170 -98 -19 -110 -125 -108 -188 -289 86 -53 -252 19 -204 -52 -147 -18 -74 154 65 -125 12
6517 12 215 57 144 89 -106 -40 93 217 80 63 216 -38 -14 281 -34 -24 91 -72 34 84 2 -127 18
6540 18 123 -43 165 -73 -3 60 -32 -214 -181 -55 -31 -268 -25 -183 -295 -230 -173 -114 -149 1 240 -111 -98 -25
6564 -25 -333 -1 -135 4 114 39 30 -9 223 -200 98 165 -181 -38 88 116 -13 -14 182 -59 -90 197 4
6587 4 -58 303 11 169 207 193 -101 295 177 -15 77 -174 -37 -83 -24 13 -197 32 3 -208 -140 -124 30 126
6611 126 144 -187 -140 27 -23 -265 138 -221 61 -55 -43 -202 6 112 -124 32 -45 -52 -130 138 -152 -74 -44
6634 -44 189 -30 23 303 162 162 353 27 74 123 15 128 253 133 -81 75 34 2 -23 77 -33 92 -85
6657 -85 -83 -50 199 -24 -53 -14 31 -168 72 11 -248 100 -64 -38 -47 92 -159 -182 105 0 -284 -16 -108 -85 -104
6682 -104 -56 -4 -17 98 65 164 269 21 -94 107 38 4 127 317 20 181 222 161 -10 66 164 66 104 13 -180
6707 -180 -27 57 48 34 171 -75 59 228 -99 -151 13 15 -280 46 -190 -113 17 -144 -53 -143 164 -168 -79 -34
6731 -34 -29 -91 142 -29 -262 -7 91 -112 -56 36 -2 -211 -72 84 12 184 20 82 154 104 14 66 220 102 18
6756 18 151 197 -20 348 -54 72 160 248 -110 211 166 -229 -63 121 -121 -168 -2 -211 -125 -140 46 -61 -182
6779 -182 56 -117 -169 111 -99 -101 -53 25 -205 -159 -170 -123 -74 74 -8 1 137 -175 86 33 125 -250 384 7 -60
6804 -60 103 58 -65 38 193 -11 -42 134 -112 -126 175 138 -7 158 -52 -143 114 66 -110 49 4 -106 -30
6827 -30 126 47 -60 5 -96 -106 -125 89 20 -139 -194 -157 -356 127 -194 -385 -33 -136 -219 -77 -49 -113 162 66
6851 66 -148 -63 118 25 -8 59 35 -110 278 -19 -274 183 159 -38 73 48 56 80 74 1 144 52 -12 69 126 95
6877 95 -175 7 122 -150 -86 166 86 -205 -16 263 -85 -61 16 -140 14 -20 -127 -120 138 -260 -145 -52 -165
6900 -165 73 185 47 -115 68 94 -72 -94 54 -25 42 50 -173 -206 148 57 -259 164 190 136 185 115 112 60 185
6925 185 -68 -26 101 16 51 286 38 41 111 76 -152 89 227 -171 -57 90 50 -110 -14 -35 -35 -54 -249 -210 109
6950 109 131 -163 -151 132 -191 -234 27 -120 -49 -107 51 -167 13 134 -153 -243 214 -63 -23 190 -97 20
6972 20 89 201 -16 157 259 -36 61 131 56 96 249 126 72 161 190 56 50 155 -13 62 20 95 -122 117 -97
6997 -97 118 22 -93 -188 66 28 -332 39 65 -151 -140 64 -142 -137 63 -48 -144 -27 14 -2 -122 2 -29 -81
7021 -81 92 -37 119 163 -5 -104 52 262 -38 403 99 141 82 73 -38 -132 191 40 66 91 419 -205 322
7044 322 133 0 88 57 -47 143 140 -71 -57 -166 -85 -234 -57 -44 -129 -148 60 -240 -120 -95 -295 -202 173 45
7068 45 -148 63 -71 -49 -167 -19 43 -76 139 -105 -101 259 -13 -54 273 -29 -146 186 16 77 143 56 -79
7091 -79 0 226 31 148 243 168 -129 99 74 59 110 -177 -157 -76 34 -4 -99 198 -76 -272 107 -11 -291 -259
7115 -259 -56 -76 -161 50 -72 -12 -227 -105 -163 -31 -30 -23 36 -88 11 -77 35 -55 43 177 44 -48 205 69 -168
7140 -168 164 173 -10 57 224 -3 9 68 -174 -112 176 131 123 205 164 -52 112 72 6 69 73 -147 87 271 -137
7165 -137 19 47 156 -28 36 -52 28 -196 -203 -252 -168 29 55 -311 -180 -109 -261 -48 -123 -35 117 -104 -167 20
7189 20 -11 -133 -51 103 120 48 416 -111 -137 8 170 48 230 238 110 -139 43 242 -100 173 137 -92 132
7212 132 161 -121 65 205 -29 -130 145 -198 15 65 -29 20 159 -147 33 -126 -78 -87 -62 111 -35 -324 54
7235 54 57 -259 29 7 -179 -84 219 -188 -23 115 -57 82 202 -163 147 93 -202 114 115 113 92 270 348 132
7259 132 -51 24 124 49 179 -13 7 118 113 -108 81 136 -72 -152 267 -57 -113 204 113 -201 66 -242 -231
7282 -231 -109 39 -278 142 -187 -253 15 198 -105 -236 -24 183 83 -14 31 -242 -85 121 -80 251 85
7303 85 -216 -63 228 18 4 106 -82 88 -71 -26 -102 212 232 -6 -21 181 41 115 43 225 166 38 7
7326 7 -10 -29 289 39 50 246 -161 -181 67 177 -117 0 211 -298 -57 23 -81 -35 -40 -174 30 40 -177 -114
7350 -114 73 -44 -235 -24 -210 49 19 132 28 -53 73 29 -160 -178 225 56 294 3 -64 173 155 150 -12
7373 -12 263 30 -11 43 -5 -29 188 -18 43 98 325 70 -115 45 -136 1 -9 39 -234 111 30 -83 -10 -5
7397 -5 -6 25 -53 -305 -184 -139 -242 -199 -23 50 -277 -165 -79 77 -28 102 -238 -62 5 -9 175 116 -30 25 102
7422 102 177 -145 -60 89 37 200 10 -193 88 116 94 -70 24 135 11 89 127 -21 204 228 35 29 61 53 -207
7447 -207 74 17 -13 57 -102 -128 4 38 -33 -165 142 -61 -129 -83 39 -94 -158 -137 170 -213 116 -88 -127 60
7471 60 55 -262 33 -50 -44 100 90 95 81 232 181 190 106 29 22 156 41 241 186 -11 147 161 192 -159 -173 120 -75
7498 -75 -227 -46 33 107 24 -6 10 266 97 -160 30 -24 -44 -167 44 -204 -95 57 -47 -82 29 49 21 -82
7522 -82 43 27 -221 137 57 4 65 -50 -209 237 -24 -77 90 48 49 53 156 32 120 98 138 162 -38 103 -10
7547 -10 131 70 -51 257 55 -7 0 -39 64 -103 91 188 -199 107 36 -79 45 57 -133 -75 -153 -204 63 -19
7571 -19 -242 -235 -150 -29 -119 -196 89 -107 -49 57 7 -117 102 -40 -128 22 104 57 -69 -14 -137 -4 135 -65
7595 -65 -34 153 107 68 192 -58 -42 156 145 16 6 277 0 10 -103 -27 70 -29 -6 130 26 82 -151 64
7619 64 50 21 -1 -36 -135 18 -212 22 -16 -52 -21 -253 63 -40 -97 -121 -15 -130 23 -17 8 4 21 -47 -115 192
7645 192 94 -171 32 73 10 -17 63 255 1 107 13 90 46 253 63 76 8 -8 -11 -124 180 145 -26 -115 6
7670 6 26 -89 -195 -57 109 11 -91 49 -21 131 7 -19 -190 189 -192 -129 -75 -20 -80 -12 -174 -18 -55 60
7694 60 -304 -287 14 -119 -220 160 66 -81 148 -123 -77 29 295 -99 -6 215 49 -34 227 47 9 102 87
7717 87 92 123 -48 -22 -2 -13 -46 -64 -32 127 -4 105 -44 -155 47 -95 -15 -191 -19 5 -5 -229 94 -140
7741 -140 -70 -141 -110 -57 -37 -140 -105 12 -61 29 36 -5 -192 88 26 -38 58 94 -142 17 99 -140 13 174 208 44
7767 44 68 122 -11 94 226 -25 -134 111 -8 169 -119 31 61 100 58 -60 189 -25 -108 -39 -74 -112 -179 161
7791 161 -218 -137 -24 -198 -66 -117 -45 -20 -75 -1 -124 -82 -128 -106 -84 -30 -113 -168 134 106 -143 31 140 -21 -11
7816 -11 33 -94 14 82 -8 239 201 203 182 -19 161 -150 -21 114 94 303 107 -70 166 151 128 -67 127 89
7840 89 103 -102 -67 -142 146 151 -174 31 32 -101 -135 -10 -115 31 73 -62 -23 72 58 -150 8 -2 -72 -71 -2 69
7866 69 3 110 67 -87 -113 59 -73 36 170 -95 65 156 201 53 329 -113 188 102 97 103 11 244 115 -55
7890 -55 56 -43 -77 -64 52 -74 176 -124 -29 23 38 -274 5 -133 -81 -89 27 -161 -101 28 15 -323 -34 132
7914 132 -163 186 31 95 -92 122 -262 -109 252 -164 8 60 -3 -203 -13 68 135 4 -21 229 -1 158
7936 158 31 -5 30 -13 -4 117 -131 -82 157 -15 53 -112 17 -51 -101 72 146 85 -79 96 108 -73 -13 -136
7960 -136 88 77 -100 -11 -7 -66 -194 -76 -21 -93 -78 127 -167 -272 95 -222 12 107 3 -140 30 -167 0
7983 0 83 110 -1 132 316 52 -99 58 -9 -32 4 0 165 156 108 128 138 144 -85 74 -27 7 89 181 209 -189 64
8010 64 126 -316 -6 55 -227 113 17 -38 77 -89 -27 -259 -16 37 -75 -221 -61 -55 -85 -1 -25 96 24 -45 -135
8035 -135 206 240 -70 39 41 -26 67 9 -91 -2 76 61 122 222 -52 -87 192 -12 58 56 210 169 -146 85 55
8060 55 195 141 81 13 12 -15 -32 -49 -76 -114 -4 352 -81 -138 0 -127 -55 80 -175 -213 56 134 7 -15 -135
8085 -135 41 -151 65 -105 -65 195 -83 -116 42 -102 -96 296 33 -140 190 338 195 -2 -134 -53 130 63
8107 63 392 161 208 54 -220 154 69 -123 -90 215 191 44 66 -3 -79 160 61 66 36 65 -371 -49 61 51 -106
8132 -106 -32 -83 -104 163 -27 19 -53 -86 -259 -95 -132 -93 14 143 -196 28 63 -60 -3 -254 248 19 16 74
8156 74 89 10 125 42 -184 51 22 -26 81 79 66 106 181 -106 20 47 28 83 201 247 62 -156 86 39 -114
8181 -114 89 -101 97 -1 -28 74 -7 -86 -130 -150
8191a50
##END NTUPLES=NMR FID
##END=
