##TITLE=1H_Pr YA3
 CCl4
 8 sc, 
 20.2.2024
##JCAMPDX= 6.0         $$ Bruker NMR JCAMP-DX V2.0
##DATA TYPE= NMR FID
##DATA CLASS= NTUPLES
##ORIGIN= UXNMR, Bruker Analytische Messtechnik GmbH
##OWNER= root
$$ XWIN-NMR		Version 3.5
$$ Tue Feb 20 14:18:14 2024 Russian Standard Time (UT+4h)  she@DPX200
##.OBSERVE FREQUENCY= 200.1313
##.OBSERVE NUCLEUS= ^1H
##.DELAY= (6, 6)
##.ACQUISITION MODE= SIMULTANEOUS
##.ACQUISITION SCHEME= undefined
##.AVERAGES= 8
##.DIGITISER RES= 18
##SPECTROMETER/DATA SYSTEM= spect
##.PULSE SEQUENCE= zg30
##.SOLVENT NAME= CDCl3
##.SHIFT REFERENCE= (INTERNAL, CDCl3, 0, 15.7039)
##AUDIT TRAIL= $$ (NUMBER, WHEN, WHO, WHERE, WHAT)
$$ ##TITLE= Audit trail, XWIN-NMR		Version 3.5
$$ ##JCAMPDX= 5.01
$$ ##ORIGIN= Bruker BioSpin GmbH
$$ ##OWNER= she
$$ F:/spectra/data/she/nmr/H-F/1/audita.txt
$$ ##AUDIT TRAIL=  $$ (NUMBER, WHEN, WHO, WHERE, WHAT)
(   1,<2024-02-20 14:16:15.40 +0400>,<she>,<DPX200>,
      <created by zg, POWCHK disabled, PULCHK disabled
       configuration hash MD5:
       00 E9 B6 7A A2 85 ED C7 34 08 36 98 17 FE 4E 26
       data hash MD5: 16K
       48 DC 21 21 3C BC 8C 80 04 89 3E EB 1D 05 BC 66>)
$$ ##END=
$$ 
$$ hash MD5
$$ 0B DA 74 42 E5 30 49 BD 30 40 AC 46 4E E4 91 54
##$RELAX= 
##$RELAX= 
##$RELAX= 
##$RELAX= 
##$RELAX= 
##$RELAX= 
$$ Bruker specific parameters
$$ --------------------------
##$DU= <F:/spectra>
##$EXPNO= 1
##$NAME= <H-F>
##$PROCNO= 1
##$TYPE= <nmr>
##$USER= <she>
##$AMP= (0..31)
100 100 100 100 100 100 100 100 100 100 100 100 100 100 100 100 100 100 
100 100 100 100 100 100 100 100 100 100 100 100 100 100 
##$AQSEQ= 0
##$AQ_mod= 1
##$AUNM= <au_zg>
##$AUTOPOS= <>
##$BF1= 200.13
##$BF2= 200.13
##$BF3= 200.13
##$BF4= 200.13
##$BF5= 200.13
##$BF6= 200.13
##$BF7= 200.13
##$BF8= 200.13
##$BYTORDA= 1
##$CFDGTYP= 0
##$CFRGTYP= 5
##$CHEMSTR= <none>
##$CNST= (0..31)
1 1 145 1 1 1 1 1 1 1 1 1 1 1 1 1 1 1 1 1 1 1 1 1 1 1 1 1 1 1 1 1 
##$CPDPRG= <>
##$CPDPRG1= <>
##$CPDPRG2= <>
##$CPDPRG3= <>
##$CPDPRG4= <mlev>
##$CPDPRG5= <mlev>
##$CPDPRG6= <mlev>
##$CPDPRG7= <mlev>
##$CPDPRG8= <mlev>
##$CPDPRGB= <>
##$CPDPRGT= <>
##$D= (0..31)
0 1.2 0 0 0 0 0 0 0 0.06 0 0.03 0 0 0 0 0.0002 0 0 0 0 0 0 0 0 0 0 0 0 
0 0 0 
##$DATE= 1708424174
##$DBL= (0..7)
120 120 120 120 120 120 120 120 
##$DBP= (0..7)
150 150 150 150 150 150 150 150 
##$DBP07= 0
##$DBPNAM0= <>
##$DBPNAM1= <>
##$DBPNAM2= <>
##$DBPNAM3= <>
##$DBPNAM4= <>
##$DBPNAM5= <>
##$DBPNAM6= <>
##$DBPNAM7= <>
##$DBPOAL= (0..7)
0.5 0.5 0.5 0.5 0.5 0.5 0.5 0.5 
##$DBPOFFS= (0..7)
0 0 0 0 0 0 0 0 
##$DE= 6
##$DECBNUC= <off>
##$DECIM= 32
##$DECNUC= <off>
##$DECSTAT= 4
##$DIGMOD= 1
##$DIGTYP= 9
##$DL= (0..7)
0 120 120 120 120 120 120 120 
##$DP= (0..7)
150 150 150 150 150 150 150 150 
##$DP07= 0
##$DPNAME0= <>
##$DPNAME1= <>
##$DPNAME2= <>
##$DPNAME3= <>
##$DPNAME4= <>
##$DPNAME5= <>
##$DPNAME6= <>
##$DPNAME7= <>
##$DPOAL= (0..7)
0.5 0.5 0.5 0.5 0.5 0.5 0.5 0.5 
##$DPOFFS= (0..7)
0 0 0 0 0 0 0 0 
##$DQDMODE= 0
##$DR= 18
##$DS= 0
##$DSLIST= <SSSSSSSSSSSSSSS>
$$ [...]
##$SUBNAM2= <"">
##$SUBNAM3= <"">
##$SUBNAM4= <"">
##$SUBNAM5= <"">
##$SUBNAM6= <"">
##$SUBNAM7= <"">
##$SUBNAM8= <"">
##$SUBNAM9= <"">
##$SW= 18.0517328524113
##$SWIBOX= (0..15)
0 0 2 0 0 0 0 0 0 0 0 0 0 0 0 0 
##$SW_h= 3612.71676300578
##$TD= 16384
##$TD0= 1
##$TE= 0
##$TE2= 300
##$TE3= 300
##$TEG= 300
##$TL= (0..7)
0 120 120 120 120 120 120 120 
##$TP= (0..7)
150 150 150 150 150 150 150 150 
##$TP07= 0
##$TPNAME0= <>
##$TPNAME1= <>
##$TPNAME2= <>
##$TPNAME3= <>
##$TPNAME4= <>
##$TPNAME5= <>
##$TPNAME6= <>
##$TPNAME7= <>
##$TPOAL= (0..7)
0.5 0.5 0.5 0.5 0.5 0.5 0.5 0.5 
##$TPOFFS= (0..7)
0 0 0 0 0 0 0 0 
##$TUNHIN= 0
##$TUNHOUT= 0
##$TUNXOUT= 0
##$USERA1= <user>
##$USERA2= <user>
##$USERA3= <user>
##$USERA4= <user>
##$USERA5= <user>
##$V9= 5
##$VALIST= <valist>
##$VCLIST= <CCCCCCCCCCCCCCC>
##$VD= 0
##$VDLIST= <DDDDDDDDDDDDDDD>
##$VPLIST= <PPPPPPPPPPPPPPP>
##$VTLIST= <TTTTTTTTTTTTTTT>
##$WBST= 1024
##$WBSW= 4
##$XGAIN= (0..3)
0 0 0 0 
##$XL= 0
##$YL= 0
##$YMAX_a= 296118
##$YMIN_a= -269087
##$ZGOPTNS= <>
##$ZL1= 120
##$ZL2= 120
##$ZL3= 120
##$ZL4= 120
##$ABSF1= 10
##$ABSF2= 0
##$ABSG= 5
##$ABSL= 3
##$ALPHA= 0
##$AQORDER= 0
##$ASSFAC= 0
##$ASSFACI= 0
##$ASSFACX= 0
##$ASSWID= 0
##$AUNMP= <proc_1d>
##$AZFE= 0.1
##$AZFW= 0.1
##$BCFW= 1
##$BC_mod= 2
##$BYTORDP= 1
##$COROFFS= 0
##$CY= 11.3945322036743
##$DATMOD= 1
##$DC= 2
##$DFILT= <>
##$DTYPP= 0
##$F1P= 15.7292609196834
##$F2P= 12.9074282941183
##$FCOR= 0.5
##$FTSIZE= 0
##$FT_mod= 4
##$GAMMA= 1
##$GB= 0.15
##$INTBC= 1
##$INTSCL= 1
##$ISEN= 128
##$LB= 0.24
##$LEV0= 0
##$LPBIN= 0
##$MAXI= 10000
##$MC2= 0
##$MEAN= 0
##$ME_mod= 0
##$MI= 1.114404
##$NCOEF= 0
##$NC_proc= 0
##$NLEV= 6
##$NOISF1= 3.799351
##$NOISF2= 2.8
##$NSP= 1
##$NTH_PI= 0
##$NZP= 0
##$OFFSET= 15.70392
##$PC= 1
##$PHC0= -25132.64
##$PHC1= 30.85264
##$PH_mod= 1
##$PKNL= yes
##$PPARMOD= 0
##$PSCAL= 0
##$PSIGN= 0
##$REVERSE= no
##$SF= 200.130013532006
##$SI= 16384
##$SIGF1= 3
##$SIGF2= 2
##$SINO= 400
##$SIOLD= 16384
##$SREGLST= <1H.CDCl3>
##$SSB= 0
##$STSI= 0
##$STSR= 0
##$SW_p= 3612.71676300578
##$SYMM= 0
##$S_DEV= 0
##$TDeff= 0
##$TDoff= 0
##$TI= <>
##$TILT= no
##$TM1= 0
##$TM2= 0
##$TOPLEV= 0
##$USERP1= <user>
##$USERP2= <user>
##$USERP3= <user>
##$USERP4= <user>
##$USERP5= <user>
##$WDW= 1
##$XDIM= 8192
##$YMAX_p= 0
##$YMIN_p= 0
$$ End of Bruker specific parameters
$$ ---------------------------------
##NTUPLES= NMR FID
##VAR_NAME=  TIME,          FID/REAL,        FID/IMAG
##SYMBOL=    X,             R,               I
##VAR_TYPE=  INDEPENDENT,   DEPENDENT,       DEPENDENT
##VAR_FORM=  AFFN,          ASDF,            ASDF
##VAR_DIM=   8192,          8192,            8192
##UNITS=     SECONDS,       ARBITRARY UNITS, ARBITRARY UNITS
##FACTOR=    0.0002768,     1,               1
##FIRST=     0,             0,               0
##LAST=      2.2672688,     0,               0
##MIN=       0,             -269087,         0
##MAX=       2.2672688,     296118,          0
$$ Real data points
##PAGE= N=1
##DATA TABLE= (X++(R..R)), XYDATA
$$ [...]
2733c318Q86Q350r915K263P520j0371L607O496j0497M832N311j0598O107M056
2747D729j0473P179K671j0023Q167J260r528Q974j85q702R591j590p867J0036
2761D239l042o754J0339m427n534J0369n682m189J0195o856k772R830p778j376
2775c438R175q557J29Q433r194J459P580r634K838O478r754M016N447r789N143
2790C32M192r624O118L027r360O933J919q959P686O59q354Q412o40p703Q836j852
2806A622o764R043k956n866R226m085m809R281n179l707R176o124k552Q813o908
2821a789j330Q301p670l8P673q191J153O937q650K448N959q838L559N025q907
2836d358M555L999q905N601K877q653O378J808q362P163O72p834P818n70p277
$$ y = [-3318, -2432, 5918, -3997, -1734, 5786, -4585, -978, 5518, -4979, -147, 5164, -5434, 673, 4729, -5744, 1435, 4106, -5917, 2250, 3510, -6018, 2956, 2771, -5931, 3660, 2070, -5797, 4239, 1197, -5557, 4782, 355, -5179, 5190, -492, -4681, 5514, -1342, -4114, 5716, -2062, -3438, 5737, -2820, -2691, 5742, -3452, -1993, 5587, -4047, -1209, 5269, -4485, -469, 4978, -4811, 332, 4524, -5100, 1018, 4045, -5315, 1618, 3537, -5422, 2264, 2923, -5431, 2981, 2341, -5362, 3474, 1622, -5142, 3901, 945, -4921, 4305, 220, -4589, 4692, -487, -4194, 4982, -1142, -3694, 5119, -1789, -3119, 5182, -2488, -2526, 5147, -3044, -1891, 5046, -3604, -1156, 4803, -4035, -476, 4549, -4358, 197, 4196, -4709, 892, 3769, -4884, 1494, 3302, -5060, 2103, 2775, -5059, 2759, 2189, -5088]
2851e088Q282j615o527Q652k783n635Q837l844m733Q914m893l667Q907n878k581
2866c652Q647o790j270Q122p424j05P561q126J218O824q519K418N847q811L704
2881c56M800q911M814L665q731N778K510q415O556J274p894P260O6p341P828j113
2897A790o600Q198k243n757Q401l331m795Q497m236l893Q382n131k882Q191n932
2912a341j795P831o643o84P318p091L44O725p596J463N985p879K516N140q016
2927c723L469M222q033M475L208p870N246K215p599N907J146p116O602M0o600
2942d411P016r83o006P443j972n259P573k919m446P705l837l569P643m595k734
2957c351P586n428j755P288o077p77O930o654K25O436p063J114N867p427K119
$$ y = [-5088, 3194, 1579, -4948, 3704, 921, -4714, 4123, 279, -4454, 4460, -433, -4100, 4807, -1071, -3652, 4995, -1795, -3065, 5057, -2367, -2472, 5089, -3037, -1819, 5005, -3514, -1096, 4751, -4060, -356, 4444, -4467, 347, 4012, -4719, 1059, 3569, -4846, 1710, 2984, -4910, 2350, 2416, -4925, 2903, 1790, -4810, 3388, 1145, -4612, 3789, 458, -4337, 4160, -76, -3969, 4413, -718, -3600, 4591, -1341, -3136, 4695, -1948, -2632, 4686, -2405, -2061, 4664, -2932, -1469, 4516, -3363, -847, 4293, -3723, -254, 3968, -4065, 410, 3618, -4252, 994, 3209, -4390, 1517, 2663, -4453, 2149, 2189, -4411, 2605, 1622, -4384, 3059, 1087, -4172, 3401, 482, -3964, 3741, -96, -3665, 3978, -617, -3351, 4235, -1193, -2948, 4340, -1737, -2514, 4416, -2238, -2013, 4423, -2640, -1526, 4341, -3086, -967]
2972i67N097p617L146M228p713L987L402p662M895K387p432N675J271p114O413
2987A996K29o658O935q56n915P252j931n206P567k960m336P627l915l392P631
3002D068m822k390P359n586j330P002o127l79O536o717O78N959p091J652N306
3017D118p339K626M506p468L481L646p381M274K762p187M989J782o925N666Q49
3032B399o530O217k29n940O601j193n244O842k136m607P030k982l756P040l877
3047c65k795O922m667j911O659n229r26O198n701j13N765o103P97N277o478J734
3063i36M578o613K472L990o718L218L216o692M025K372o597M625J657o402N249
3078A444Q41o076N658k7n632O042q85n144O388j705m539O618k570l813O663l317
$$ y = [-967, 4130, -3487, -341, 3887, -3826, 161, 3563, -4099, 796, 3183, -4249, 1426, 2697, -4417, 1996, 2225, -4433, 2502, 1646, -4269, 2983, 1052, -4154, 3413, 453, -3883, 3744, -171, -3563, 4068, -754, -3144, 4215, -1371, -2701, 4301, -1826, -2205, 4331, -2386, -1708, 4251, -2840, -1188, 4118, -3221, -595, 3911, -3557, -76, 3570, -3811, 463, 3225, -3962, 1027, 2809, -4116, 1550, 2399, -4131, 2086, 1857, -4083, 2518, 1325, -3919, 2923, 787, -3820, 3210, 228, -3528, 3512, -365, -3160, 3762, -905, -2816, 3843, -1386, -2312, 3886, -1815, -1928, 3837, -2266, -1469, 3808, -2670, -936, 3642, -2971, -499, 3491, -3227, -9, 3207, -3485, 540, 2912, -3685, 940, 2597, -3805, 1444, 2285, -3791, 1867, 1840, -3792, 2250, 1365, -3779, 2609, 904, -3635, 2983, 413, -3400, 3263, -54]
3094e4l107O647m105k212O521m818j254O099n355l55N776n866N59N249o209J448
3110a036M631o459K327M019o660L177L138o591M004K324o489M635J480o198N200
3125A502N77n833N665k80n331O047j125m845O318j961m206O454k805l361O405
3140C221l484k680O351m192j824O143m767r50N793n318l7N325n725Q70M709n886
3156b451J677M058o106K544L343o089L179K606n929L850J760n759M384R91n381
3171c323M813K12n048N191n42m604N530j292m090N626j951l549N707k612k892
3186b824N769l264k274N718l774j658N482m241r37N223m745r5M805n085O16M469
3202C185n385J343L988n618K066L347n643K770K640n582L376J931n453L940J203
$$ y = [-54, -3161, 3486, -619, -2831, 3690, -1128, -2382, 3717, -1638, -1993, 3783, -2083, -1524, 3725, -2484, -1036, 3595, -2864, -537, 3482, -3178, -1, 3137, -3454, 550, 2874, -3615, 1020, 2500, -3698, 1502, 2079, -3754, 1911, 1631, -3700, 2347, 1222, -3623, 2695, 734, -3472, 2982, 177, -3184, 3221, -263, -2943, 3408, -784, -2608, 3535, -1232, -2182, 3611, -1707, -1744, 3581, -2144, -1274, 3435, -2451, -774, 3284, -2822, -278, 3065, -3024, 155, 2761, -3168, 682, 2442, -3317, 1067, 2058, -3323, 1490, 1702, -3346, 1845, 1303, -3301, 2229, 937, -3153, 2473, 522, -3027, 2680, 68, -2824, 2945, -319, -2593, 3125, -649, -2307, 3175, -1066, -2003, 3220, -1525, -1620, 3185, -1900, -1284, 3185, -2200, -857, 3131, -2487, -421, 2926, -2717, 53, 2693, -2889, 487, 2418, -3035, 905, 2108]
3217B108n279M471N13n038M975m31m501N309j132m037N385j845l431N554k481
3232A40k894N620l242k141N570l788j473N369m305q09N170m786k2M779n051P35
3248a128M290n391J478L742n483K196L076n557K913K443n498L493J747n311L965
3263I75R85n089M593Q9m615M866o94m143N138j384l559N234k112k928N160k640
3279a24k331N177l240j697N058l705j036M777m105l09M441m439L19M101m704Q83
3295i34L722m838J518L178m968K136K700n036K685K156m960L110J536m755L634
3310H84Q71m487L939K26m234M304l91l874M632j173l342M707j675k896M803k279
3326A5k352M851k879j675M640l298j125M472l750m54M254m092J82L935m405P57
$$ y = [2108, -3171, 1300, 1813, -3225, 1750, 1319, -3182, 2127, 995, -3042, 2343, 498, -2933, 2621, 140, -2754, 2866, -376, -2517, 3053, -735, -2208, 3161, -1144, -1953, 3217, -1569, -1591, 3188, -1863, -1128, 3162, -2229, -751, 2991, -2492, -296, 2780, -2777, 136, 2579, -2919, 574, 2321, -2990, 975, 1960, -3129, 1464, 1553, -3062, 1804, 1110, -3033, 2105, 721, -2838, 2396, 284, -2644, 2516, -124, -2455, 2722, -518, -2215, 2843, -862, -1898, 2879, -1226, -1535, 2906, -1533, -1214, 2887, -1817, -934, 2788, -2050, -532, 2646, -2322, -186, 2514, -2522, 163, 2319, -2641, 469, 2005, -2750, 884, 1755, -2732, 1207, 1433, -2801, 1503, 1112, -2762, 1870, 697, -2645, 2062, 387, -2509, 2294, 15, -2337, 2514, -365, -2040, 2600, -698, -1823, 2649, -1101, -1555, 2699, -1393, -1211, 2724, -1681, -924]
3342i24L572m554J352L140m776J992K608m777K506K061m784L096J472m595L532
3357I21Q13m470L969K17m172M248m59l763M462j018l352M694j760k835M832k407
3373h0k145M695k905j549M553l380q79M308l765k30M003m079M42L557m218J004
3389f68L149m359J552K631m441K120K145m416K620J598m284L021J003m090L384
3404I65M30l836L644o9l595L991p19l153M098j189k864M151j615k353M177k207
3420a44j764M076k617j303L999k975p48L786l335j36L484l584L38L212l765Q59
3436f17K803l877J339K389l888J827J907l903K306J412l823K663R55l683L026
3451H36M20l480L326q9l224L563n75k971L742j010k688L927j530k270L944j983
$$ y = [-924, 2648, -1906, -554, 2586, -2190, -198, 2410, -2367, 139, 2200, -2584, 512, 1984, -2611, 921, 1734, -2736, 1233, 1450, -2722, 1526, 1067, -2696, 1766, 748, -2604, 2090, 330, -2505, 2327, -80, -2225, 2470, -435, -1984, 2569, -811, -1690, 2618, -1147, -1377, 2626, -1453, -1011, 2546, -1672, -668, 2481, -1878, -326, 2305, -2136, -16, 2129, -2287, 333, 1931, -2353, 668, 1671, -2419, 965, 1395, -2441, 1203, 1134, -2461, 1530, 811, -2342, 1756, 567, -2297, 1854, 239, -2114, 2063, -144, -1908, 2168, -449, -1752, 2247, -728, -1476, 2310, -1025, -1161, 2323, -1261, -923, 2289, -1476, -617, 2186, -1691, -352, 2037, -1851, -24, 1883, -2020, 286, 1698, -2125, 538, 1493, -2190, 836, 1256, -2224, 1102, 1013, -2211, 1352, 777, -2194, 1548, 538, -2150, 1777, 247, -2023, 1921, -62]
3467f2j811L962k470j291L820k776q45L705l148l03L500l487K48L199l704P71
3483f92K812l777J310K321l831J848J832l828K264J427l737K687P64l572L069
3498H97K43l269L285k78l064L592q22k631L588j166k341L706j666j845L673k147
3514b45j379L590k485r25L448k797m91L339l069J9L060l230L85K801l438R31K391
3531A905l441J284K007l411J683J577l444K201J130l420K465O72l127K740J75
3546I96k913K982l22k564L058o90k309L123j036j980L202j486j688L276j868j275
3562a494L232k220p85L068k392m42K876k644q4K721k900L26K587l065O77K328
3578A789l258J194J929l252J581J565l266K006J134l196K297P54l139K583L46
$$ y = [-62, -1873, 2089, -381, -1672, 2148, -628, -1473, 2232, -916, -1219, 2281, -1206, -958, 2241, -1463, -692, 2120, -1657, -347, 1974, -1857, -9, 1823, -2005, 259, 1686, -2051, 636, 1400, -2172, 897, 1140, -2129, 1156, 878, -2186, 1406, 584, -2047, 1541, 375, -1966, 1740, 74, -1771, 1902, -245, -1624, 1966, -519, -1444, 2004, -793, -1284, 2055, -1014, -995, 2065, -1165, -780, 2021, -1417, -486, 1905, -1536, -252, 1755, -1656, 27, 1604, -1840, 361, 1491, -1929, 536, 1208, -1919, 821, 996, -1917, 1065, 743, -1821, 1237, 547, -1762, 1361, 325, -1655, 1547, 61, -1627, 1649, -219, -1494, 1738, -482, -1267, 1801, -591, -1033, 1843, -801, -885, 1836, -1064, -738, 1849, -1216, -539, 1789, -1469, -275, 1654, -1598, -17, 1548, -1718, 288, 1422, -1774, 523, 1277, -1862, 721, 1067]
3593A067k920K788j33k631L022o19k326L092j030j925L108j514j475L129j807
3608a74j170L105k218p16K910k417k74K796k766J20K548k864N36K310l077R76
3624c75K037l117J354J666l146J778J223l056K018Q38k924K293M78k768K488Q7
3640H74k605K729l46k351K909p60k028K905j081j778K997j534j282K833j732r28
3656a178K759k087n24K635k337j45K503k486J98K200k536N44J934k671R03J731
3672A443k737J221J411k715J480J109k654J753Q17k669K038M27k488K272O5k318
3688a545K426k11k169K496n32j945K651q95j687K670j279j287K733j596r89K658
3704A499j935o84K607k070k83K394k350Q3K305k524M55K006k653Q36J698k644
$$ y = [1067, -1853, 935, 802, -1829, 1193, 574, -1752, 1340, 310, -1615, 1493, -21, -1496, 1633, -174, -1344, 1761, -457, -1173, 1737, -680, -954, 1842, -924, -804, 1744, -1120, -584, 1726, -1351, -375, 1662, -1455, -101, 1565, -1581, 197, 1420, -1636, 382, 1220, -1704, 589, 1067, -1701, 787, 874, -1731, 998, 652, -1699, 1210, 450, -1578, 1327, 246, -1532, 1465, -69, -1351, 1482, -250, -1178, 1581, -506, -1030, 1605, -732, -877, 1626, -860, -662, 1538, -998, -454, 1480, -1191, -288, 1443, -1294, -73, 1338, -1377, 103, 1212, -1442, 311, 1128, -1541, 497, 924, -1564, 708, 773, -1545, 881, 670, -1499, 997, 465, -1480, 1171, 276, -1411, 1259, -20, -1307, 1426, -170, -1159, 1499, -436, -1120, 1487, -583, -866, 1528, -822, -739, 1566, -958, -503, 1503, -1150, -314, 1384, -1260]
3720a260J226J338k623J479R55k571J780O96k529K065L56k399K235J0k277K400
3736H81l43k025K535p52j679K636j156j415K651j432j135K620j701p90K535j919
3752d89m59K378k067r9K180k318L18J937k389O55J692k435R69J428k523J307J016
3769A101k370J498P46k269J741M14k224J924J60k017K007j65j854K182n15j584
3785a225K195p43j454K270j020j143K314j344q58K225j562n87K207j709l28K059
3801A297j865j48J967j954K36J671k049M86J586k139P48J302k221J041J137k211
3817a116J269Q32k153J501M49j991J670K09j910J860j03j728J996l90j631K092
3833H56o14j365K064q70j081J955j025q64K079j349o69K071j651k95J966j813
$$ y = [-1260, -34, 1304, -1319, 160, 1115, -1456, 324, 1020, -1509, 556, 912, -1487, 748, 758, -1519, 881, 538, -1487, 1048, 296, -1383, 1253, 97, -1318, 1333, -99, -1234, 1386, -315, -1105, 1430, -489, -948, 1430, -637, -736, 1444, -874, -556, 1381, -1008, -353, 1339, -1096, -127, 1301, -1222, 85, 1101, -1269, 229, 975, -1294, 447, 861, -1363, 561, 721, -1296, 711, 546, -1308, 874, 359, -1225, 970, 227, -1227, 1043, 23, -1120, 1194, -150, -1008, 1217, -345, -932, 1275, -434, -762, 1297, -568, -716, 1251, -703, -467, 1204, -845, -359, 1227, -912, -164, 1138, -1083, -42, 1095, -1116, 153, 985, -1168, 333, 782, -1209, 461, 670, -1240, 620, 517, -1211, 785, 395, -1236, 856, 242, -1123, 941, 71, -1010, 945, -80, -944, 1135, -214, -883, 1188, -463, -758, 1208, -605]
3849f05NJ820j957K63J669k022N27J440k040Q20J135k122J129J005k174J346O23
3866H62k030J552L25j878J702R3j848J924k61j603J945n00j353J933p50j095J957
3883I75j012q72J964j294n45J883j444l45J804j648q1J741j697J74J406j732M78
3900b45J307j834N94J169j922R71Q45j824J089O79j837J256M77j754J403K69j719
3917a076J551J2j513J604k37j384J691m30j226J772o89r76J799r09q54J826j091
3934a30o16J679j202m02J678j462n2J479j603K10J399j630L17J241j669N83J073
3951H93j725P81R32j769J024O39j751J231M11j657J309K02j552J464J2j488J556
3968E12k11j316J748n01j177J780p15j069J868r57p74J729j146m57J649j322k15
$$ y = [-605, -600, 1220, -737, -474, 1195, -827, -300, 1140, -900, -80, 1055, -1067, 62, 1067, -1107, 239, 862, -1168, 384, 709, -1169, 533, 626, -1222, 702, 441, -1162, 783, 283, -1070, 863, 113, -982, 975, -37, -909, 1055, -239, -784, 1099, -345, -690, 1114, -534, -615, 1126, -571, -397, 1009, -723, -245, 1062, -772, -178, 991, -931, 40, 885, -939, 150, 829, -1008, 248, 725, -1029, 374, 643, -1076, 475, 487, -1026, 578, 341, -1043, 648, 218, -1008, 764, 75, -901, 898, -11, -865, 961, -130, -746, 933, -269, -671, 1007, -455, -507, 972, -631, -421, 978, -652, -335, 906, -763, -180, 893, -832, -51, 881, -888, 136, 775, -976, 255, 666, -991, 318, 520, -1032, 432, 444, -1044, 512, 301, -1015, 733, 232, -945, 835, 120, -949, 919, -38, -812, 917, -229, -686, 963, -359, -574]
3985e74J566j461l6J477j525J98J278j618N21J042j659P83Q30j697R80O08j581
4002h68J101M41j635J283K11j458J407j06j309J457k19j187J525m28j071J588
4018G32o52q87J588q03p53J599r86m87J496j141k66J433j271r0J374j401J82J195
4036H62j445L12J105j466N69Q40j502P21P08j436P56N82j398J028L31j332J084
4053C19J97j293J194q3j137J284k22j022J359m05r54J388n64p65J384p97n72J410
4071G21q36m82J333r77l01J338j158p4J221j233R7J209j400L33R83j376M58R23
4089G79j511O78P91j467Q30N28j425J062K73j341J115R9j215J268j68j005J205
4106D96k94q76J235n12p43J337o52o28J334q40m29J363j039k35J171j012j50J194
$$ y = [-574, 992, -469, -505, 972, -553, -355, 923, -695, -174, 868, -791, -8, 822, -875, 105, 713, -868, 233, 674, -961, 322, 533, -925, 482, 376, -933, 524, 305, -882, 643, 215, -856, 732, 80, -807, 781, -22, -775, 824, -162, -649, 847, -294, -560, 873, -398, -488, 886, -515, -333, 862, -583, -271, 834, -632, -63, 777, -725, -4, 704, -732, 24, 606, -792, 236, 567, -765, 319, 516, -777, 417, 334, -803, 481, 259, -763, 596, 191, -763, 625, 61, -704, 680, -117, -689, 721, -115, -597, 736, -241, -542, 796, -362, -436, 785, -448, -351, 858, -542, -209, 774, -602, -144, 779, -732, -54, 737, -730, 100, 628, -797, 265, 538, -803, 312, 411, -804, 464, 296, -709, 496, 202, -674, 561, 49, -694, 643, -9, -637, 697, -143, -572, 791, -248, -483, 688, -324, -474, 720]
4124G20j085M5J022j195K37R52j242L70Q08j237N92O22j273P48N04j304Q85L49
4142E18j225R71J62j113J058j6j070J161k74q16J112l47o87J068m68n80J125n94
4160a5n22J137p35l39J087q54j72J020q90n5R64r98J32Q64j046K45O99r85L49
4179a14O64j072N08N48j121O34M40j086P46L43j084Q22J69j070R86J0r36R65q3
4198B69q93J057l26o70J077n09n67J168o47m93J100p16k76J003q08j70R76q89
4216c14rR62j001R4Q91j066L54P08j115L66O35j020N38M56j038O85K92r81P59
4235A96J85r92Q88oq73R79j37q14J027l23o77J026m02o06J036n32m83J065o54
4254i7l38R88p45k09R52q03k5P99q61J52P34r59K54O57q99L38N07r34N62L14q76
$$ y = [720, -365, -320, 702, -493, -256, 696, -546, -176, 632, -605, -13, 609, -664, 84, 588, -716, 169, 518, -707, 264, 426, -687, 371, 355, -715, 446, 172, -644, 468, 121, -566, 502, 34, -546, 579, -15, -537, 600, -135, -474, 613, -241, -413, 607, -283, -338, 626, -372, -240, 624, -422, -177, 522, -463, -114, 550, -522, -14, 534, -587, 47, 487, -599, 147, 490, -594, 228, 397, -673, 313, 323, -613, 352, 269, -624, 433, 107, -563, 514, 5, -562, 606, -41, -534, 566, -150, -426, 577, -231, -401, 575, -314, -323, 639, -362, -268, 623, -443, -89, 619, -496, -130, 505, -515, 23, 479, -559, 126, 418, -563, 196, 381, -611, 277, 271, -602, 377, 240, -574, 453, 130, -547, 479, 77, -529, 507, -25, -508, 557, -97, -435, 553, -192, -401, 551, -252, -277, 522, -339, -187, 547, -412, -158, 499, -400, -62, 445, -489, 73, 387, -489]
4275d89O00K23q03O47J65q29P16Np25P49q3o42P77j41o05Q19l47m49Q35m20l94
4296c91Q03m20m21R02n77k46Q15o58j09P69o79k0P06p80J24P26q90K01N33p33
4316c45L20M57q11M01M00q23N08K52q08O06J34p18O57N0p12P35q1o70P61k00n18
4337d05P80l34m02P33l88l59Q18n65k14P50n44j96P65o41m6P19p20R8O27p76J57
4358a43N67p75L00M58p98M26M44r35N08K63p54N87J23p14O13O0o54O60j00n73
4378d37P36k96m04P46l25l93O79l28k64O63m69j91O86n33j42O35n47J0N44o20
4398b50J32M30o01K19M04o40K90L11o61M24K49o84M34K02o33M97Q1n61M80N2n74
4419c99N39Kn43O76j45m87O40k08m48O54l08k88O27l93j60N97m16j36N22m61q8
$$ y = [-489, 111, 334, -469, 178, 343, -486, 230, 235, -490, 259, 176, -466, 311, 170, -435, 384, 37, -412, 423, 3, -391, 412, -8, -429, 473, -104, -350, 465, -193, -302, 467, -212, -232, 474, -306, -182, 544, -346, -145, 388, -345, -25, 432, -379, 22, 422, -401, 107, 359, -449, 157, 291, -427, 230, 280, -432, 303, 222, -448, 313, 113, -405, 375, 41, -361, 372, -16, -375, 443, -122, -336, 414, -130, -326, 439, -202, -248, 471, -249, -151, 476, -300, -143, 424, -351, -51, 407, -391, 35, 479, -456, 52, 315, -439, 148, 271, -443, 170, 230, -424, 236, 136, -437, 299, 3, -401, 345, 20, -373, 306, -22, -286, 377, -92, -283, 403, -130, -272, 363, -184, -174, 370, -250, -118, 312, -289, -70, 334, -306, -16, 295, -366, 58, 307, -377, 57, 259, -374, 123, 204, -357, 123, 175, -399, 140, 142, -401, 275, 130, -357, 283, 75, -373, 281, -27, -315, 312, -81, -241, 356, -60, -196, 326, -135, -223]
4440b23N28n12O7M80n81J35M31o30K96L22n99L17K72o33L88K02o23M11J81n67
4460c38M41J12n73N66n4n41O22j03n05O36k34l34O19k67l38O13l92k18N77l90
4480a01j47N77n08J3N36o26J50M37n39J94L25o11K67L37n90L31K36o07L92J90
4500B56n33L83L1m55M78j2m99N98j29m15N28j43m07O03k15l43N26k93j59N14m01
4521h7j39N48m59m0M80n04P4M14m79P4M71n70J71L30n44K59L03n75L53K23n60
4542b57L18J44m80M25M1m74M28k5m36N30j03m12O05l10k46M31j77k60N04k58k14
4563b26N56m04j25M95m30m9M77m78L9M57m54O0L88n45J60M22o08K40K38n17K94
4584a0K53n14M01J22n64M10P4m84M77%n11N00n9m38N56j60l56O36l36k95O15l44
$$ y = [-223, 305, -207, -140, 340, -241, -106, 325, -305, -9, 313, -286, 31, 303, -330, 58, 260, -363, 48, 229, -338, 103, 215, -358, 208, 154, -387, 235, 132, -373, 263, 29, -305, 314, 47, -291, 322, -70, -288, 289, -101, -248, 329, -179, -166, 370, -256, -106, 331, -208, -14, 311, -300, -33, 304, -286, 45, 281, -326, 66, 256, -277, 106, 137, -318, 160, 148, -351, 247, 118, -297, 231, 88, -319, 284, 69, -274, 252, -41, -200, 314, -87, -226, 322, -137, -177, 303, -201, -127, 287, -192, -118, 353, -217, -46, 284, -260, -1, 302, -273, 80, 303, -257, 61, 205, -275, 150, 191, -283, 145, 120, -316, 214, 111, -301, 304, -6, -252, 179, 2, -258, 246, -12, -226, 330, -74, -199, 296, -134, -183, 294, -184, -145, 312, -142, -82, 306, -239, -79, 343, -265, -25, 213, -304, -10, 243, -271, 130, 252, -312, 98, 172, -312, 165, 165, -346, 154, 95, -343, 213, 53, -303, 333, -3, -298, 317, -27]
4606b7k76O45m11q9M61m10l1M20m14rM62n64R1M68n34J58L76n98K57K85n41L51
4628G0J86n52L76J52n85M97L6n36N08J9m91N30j20m13N85k00l59N63l04k10N11
4649B63l12j90N27m16r7N34m43MM73n23R2M43n65J15L76n40K46L05n53K86K35
4670B60n91L51K25n34L97J09n84M72Q9n89N35N6n54N48r5l91N07j16l82N65l30
4691e2k50N76l10k41O06l59k26O19m46r9N59n49l3N29n27Q2M44o05K08L42o12
4712c44L39L02n88L40K30o37M19J63n55M56M5m90M57J0m67N19j20m13N99k02l88
4733c25O05k46l89O58l19k53N85l87k18O60m87q7O01n79M5M85n38Q7M47o46K12
4754h9L94n94K98K79n92L24K11n69M07K07o36M81J04n43M80K2n39N27o2m64N98
$$ y = [-27, -303, 342, -69, -158, 303, -107, -138, 282, -132, -141, 321, -243, -152, 316, -218, -60, 316, -282, -25, 260, -281, 70, 256, -296, 80, 232, -353, 144, 180, -356, 152, 171, -320, 210, 90, -323, 262, 62, -297, 266, -38, -248, 263, -49, -239, 288, -128, -225, 309, -134, -130, 343, -180, -88, 355, -210, -95, 281, -259, -13, 292, -261, 25, 260, -331, 20, 245, -289, 108, 217, -367, 105, 194, -395, 140, 196, -358, 190, 95, -296, 211, 95, -287, 278, -52, -302, 274, -36, -277, 329, -30, -256, 363, -83, -182, 377, -172, -205, 324, -203, -121, 323, -282, -74, 268, -344, -5, 297, -291, 49, 279, -358, 61, 224, -331, 125, 170, -320, 137, 147, -320, 199, 79, -334, 265, 63, -325, 280, 34, -355, 303, -16, -269, 316, -71, -289, 371, -116, -203, 398, -181, -136, 349, -189, -102, 345, -301, -89, 305, -289, 9, 288, -304, 20, 231, -338, 69, 276, -360, 121, 225, -318, 162, 184, -355, 172, 110, -354, 244]
4775B44j87m06O26k23l48O01l32k25N54l71j64N85m61j24O00n42k9N52n68J15
4795a03M18n70J76L93o05K45L98o45K55L94p00M19K47o73M24J19n45M72Q6n98
4815c93N86l4m91N49r3n15O55j97m31O60k64l96O73l26k95O66m04k44O66n57o0
4836b45N91n53jO25o51R9M46o02J58N06p01L03L44o80L31L20o63M37K38p40N28
4857I0J68o63N84M4o32O98j90n19O81j88m71P36l01l59P08l78l16O65m16k50P30
4878D21n97j31O68n45PN79o24Q8N36p38K29N26p35K58M27o99L35L01p30M52K51
4899B79o20M30J74o56N34Q4n97O43q0n81O23p5n41O62j84m77P52l58l45O70l52
4920a5l14O84m53j75O94n47j38N81m74p8O41o15P7N89p62K06M71o82K69L96p06
$$ y = [244, 57, -349, 277, 54, -294, 307, -25, -250, 304, -67, -231, 354, -107, -231, 369, -173, -202, 350, -218, -103, 315, -255, -79, 314, -291, -46, 352, -293, -38, 356, -344, 75, 322, -351, 73, 192, -353, 119, 205, -393, 193, 159, -332, 217, 124, -391, 264, 67, -364, 296, 32, -364, 309, -17, -312, 354, -50, -294, 372, -185, -245, 346, -207, -208, 417, -234, -135, 311, -291, -133, 373, -328, -25, 319, -361, -30, 290, -373, 64, 302, -438, 90, 258, -405, 179, 223, -409, 289, 99, -420, 261, 73, -398, 338, 37, -322, 386, 8, -308, 357, -59, -309, 421, -176, -307, 361, -184, -177, 402, -222, -134, 402, -336, -107, 419, -316, -58, 369, -330, 5, 306, -424, 28, 279, -341, 89, 263, -393, 141, 225, -372, 271, 191, -390, 233, 158, -383, 279, 95, -382, 370, 12, -333, 337, -15, -329, 355, -98, -273, 421, -126, -264, 317, -157, -235, 406, -209, -132, 457, -305, -99, 372, -310, -41, 355, -351]
4941c51L58L30p23M59K21o93N32J36o64N64P6o96O51l5o41P95j72o15Q19k95m73
4962d17P73k98m35P97m89l43Q19n13k44Q37o69o9P07o24o6O81p42J38N88q24K75
4983a18N74q73M00M74q46M14L48p74N04K46q32O49J26o93N96%p02P78j33o23P56
5004B71k05n06Q00l50m25P97m22l94Q52n53k09P77n67j75P63o23j25Q46q37J03
5024a82O41p84J25O27q32L32N39q71M00M16q58N44K93q89N83K37p60O59Q5p40
5044d35O99%p69P92j39o24Q11k11n78Q28l22m41Q20m84l29Q20n78k35Q39n83k48
5065c67Q39o78o5P77p62P5O65q80K55O21q79L64M56r05M71M63r38N55L59r67O96
5086A55K10r02P50P8q20P85n8p06P80j43o03Q99l58n51R23m49m12Q71n54k99Q93
$$ y = [-351, 7, 337, -386, 73, 294, -399, 133, 269, -395, 169, 245, -451, 200, 165, -476, 319, 147, -468, 351, 56, -417, 356, 58, -377, 420, -69, -412, 407, -106, -350, 487, -182, -251, 456, -168, -234, 447, -295, -157, 431, -393, -118, 456, -417, -17, 457, -389, 25, 373, -401, 103, 349, -483, 166, 292, -401, 195, 195, -507, 271, 138, -485, 271, 66, -440, 360, 10, -415, 382, -40, -434, 418, -135, -344, 433, -134, -309, 454, -169, -294, 552, -285, -182, 459, -325, -200, 427, -405, -73, 466, -405, -5, 411, -447, 97, 390, -499, 84, 321, -439, 220, 305, -435, 264, 264, -505, 287, 148, -476, 335, 124, -454, 374, 52, -389, 431, -53, -382, 438, -140, -375, 464, -119, -367, 472, -206, -271, 506, -256, -181, 484, -396, -141, 480, -399, -35, 421, -484, -13, 450, -488, 67, 426, -541, 155, 365, -537, 213, 291, -529, 256, 198, -508, 272, 129, -474, 425, 67, -484, 439, -10, -422, 449, -105, -404, 489]
5107D89o48j56Q47p69n1P80q00P6P60q69J47O92q92K33O52r54M48M24q55M96L99
5128D49r83O55K91r23O58J62q42Q45l5q11Q54j39o73Q31k36n96Q76l12o01J013
5148D83n28m28R70o08l38R56o15k54Q96p92m5P86p93L1P54p97J01P54q78K70N96
5169E21r75M80M97j022N22L88r65O84K63r25P49J26r08Q60j7q97R71j69p22R43
5189D04k92o05R33l88n50R36m18m37R34n99l69R73p14j57R26q50n7Q95q89J03
5209b21P39q71J85P51j056M29N66r79M29N12r60N95L30j033P67K04r41P24J40
5228C10q64Q56q0p87R23j76p51R71k86o57R89l72n06R41n60m12J007o99k44R87
5248E90q10r2Q84q62K8P90q83J53P68r75L09O43r79M22N33r37M79L87r46N89L30
$$ y = [489, -159, -315, 532, -237, -288, 492, -308, -232, 528, -341, -194, 498, -394, -161, 491, -463, -15, 409, -446, 50, 449, -534, 121, 412, -511, 147, 309, -533, 312, 277, -534, 320, 181, -492, 339, 103, -493, 383, 71, -530, 483, -45, -473, 497, -111, -449, 507, -108, -362, 534, -258, -303, 483, -310, -279, 475, -322, -221, 533, -345, -75, 521, -454, 26, 523, -499, 23, 411, -554, 130, 393, -532, 217, 343, -565, 295, 278, -619, 352, 183, -539, 404, 112, -493, 440, 52, -498, 438, 20, -417, 517, -82, -451, 522, -192, -349, 577, -273, -330, 565, -324, -221, 518, -353, -168, 583, -473, -44, 522, -457, -28, 484, -476, 119, 449, -584, 183, 387, -554, 170, 310, -554, 302, 222, -565, 358, 182, -569, 402, 116, -541, 448, 76, -430, 511, -49, -461, 546, -153, -397, 590, -220, -312, 572, -290, -262, 528, -355, -202, 566, -409, -100, 543, -436, -14, 519, -418, 61, 448, -498, 91, 421]
5269D21r88P32K08r16P85L7q40Q62k2q64R11j60p49R85k99o16R77l94n87J068
5289E51n87l88R60o52k70R25p21j31Q82q36l8Q35q29J57P18r36K02P28j080M58
5309e2N87j013N00M70j016O30K94r98P90K19j026Q67J6r13J008j57p87R27k15
5328A31o60J003m14o02J042n11m89J021o28l69J068p97k09J022q70n8R42r75J04
5347b49Q31j035K60P99j058L29O66j028M99M90j037N76M16j037P21K16j014R09
5365B54P6r20Q47Lq06R61k41p24R88k88p01J033m68m99J014n53m17R49o17l04
5385d13J011p59k13R78q54m1Q89q74M5Q61j029J60Q25j011L47N67r57M80M88j091
5405e91O10M03j003P48K38j004Q44L4q87R84p7r46J037k12q01J024j94p23J000
$$ y = [421, -567, 165, 373, -543, 242, 279, -561, 301, 279, -585, 326, 166, -583, 402, 103, -513, 464, 70, -517, 551, -36, -424, 536, -116, -386, 539, -182, -313, 569, -267, -305, 530, -299, -142, 576, -360, -158, 570, -510, -52, 535, -478, 22, 492, -524, 106, 400, -598, 192, 411, -615, 252, 268, -645, 363, 206, -581, 346, 131, -529, 474, 60, -542, 500, -11, -500, 521, -107, -476, 592, -205, -414, 608, -262, -320, 622, -353, -249, 582, -453, -193, 606, -452, -123, 543, -485, 14, 504, -533, 43, 459, -578, 143, 359, -655, 254, 330, -590, 257, 260, -546, 415, 174, -550, 438, 150, -551, 482, 14, -485, 529, -24, -441, 508, -109, -413, 598, -161, -374, 604, -250, -291, 598, -276, -231, 630, -399, -239, 586, -425, -78, 489, -468, 12, 500, -591, 19, 422, -581, 167, 405, -599, 245, 279, -608, 376, 299, -647, 390, 178, -623, 401, 207, -516, 484]
5424D84m51n92J064n64l94J013o62k95R94p62k04R24q49KR03r79J62Q02j030K79
5444a55P45j073M41N53j049N66M63j083O34L57j008P83J84q96P77J00r43Q61K5
5463B82q65R90k71p39J019l46o21J054n37m75J068o35l83J048p14l75J020q09
5481b89j02R71r17P2P63q86J61Q06r63K23O85r82M02N59j037N99M07j000O34L17
5501D23j011P91K08r92Q19J20r67R33r5q33J000k29p10R79l88n87J019m76n20
5520e16R86m79m21J018p23k70Q82o91j27R17q65N0Q18r21J54P61r32K40O82j021
5540d58L71N86r63N38M00j023O24K94r62P66J72r15Q75k9q87Q99q5p77R43k02
5560A67p26J006l50o57J082n43m74J036o24l83J064p60k37R46p98r3R26q77P6
$$ y = [484, 33, -559, 505, -59, -453, 560, -102, -397, 597, -165, -369, 555, -294, -292, 611, -368, -206, 596, -434, -155, 590, -483, -42, 511, -538, 28, 491, -592, 42, 399, -609, 174, 358, -538, 239, 339, -604, 257, 282, -583, 407, 136, -603, 416, 70, -551, 503, -34, -509, 559, -76, -459, 589, -125, -500, 520, -289, -391, 580, -337, -265, 498, -388, -227, 579, -384, -161, 524, -458, -56, 503, -534, 65, 472, -528, 106, 423, -588, 203, 411, -581, 238, 358, -609, 324, 229, -604, 396, 167, -543, 436, 48, -539, 480, 4, -516, 470, -9, -430, 588, -135, -405, 477, -214, -341, 576, -289, -239, 579, -342, -188, 573, -359, -119, 563, -458, -87, 499, -464, 74, 474, -549, 75, 369, -593, 173, 345, -570, 305, 276, -611, 288, 203, -574, 369, 167, -559, 447, 97, -560, 522, -21, -495, 541, -83, -466, 598, -162, -399, 547, -251, -344, 582, -295, -219]
5579b19Q15j004K47P80j103L75O42j022N34M12r90O24M01j063P11K75r71P96Q7
5598C27r29Q97K7q78Q72j20p98R64k32o51R58l96n19R58n40m15R76n94l19J023
5618F11p74k23R39q54l2R33r15O4Q22r63K66P45j044L26O08j003M64N50j067O16
5638F9L67r64O48K71r36P88Q9r24Q82o7q14R12j04p83J035l40o39R75l94n95J014
5659D90m87m43R55n69l70R72p48j54R27q14o7Q95q82J1Q40r22J50P84j027L05
5679a54P28j020M46N24j016N81M18j070P80J98r93Q25R1r36Q20N2q87J019k16
5698A90q02J043k55p63J049m21n27R90n19m81J072p14l60J073p57k25R69p67q8
5717b93R18j011J93P90r69K21P21j064M29N75j056N18N30j029N85L97j012P17
$$ y = [-219, 596, -408, -161, 619, -484, -109, 533, -489, 45, 457, -533, 91, 492, -571, 140, 415, -556, 240, 327, -602, 295, 322, -556, 316, 196, -602, 362, 130, -521, 437, 41, -478, 480, -60, -475, 501, -93, -412, 611, -163, -386, 553, -301, -333, 600, -315, -251, 571, -392, -126, 619, -425, -99, 509, -494, -30, 520, -547, 69, 436, -528, 120, 391, -545, 243, 332, -592, 290, 223, -591, 321, 217, -566, 469, 129, -510, 465, 71, -524, 490, 3, -440, 515, -54, -424, 548, -200, -354, 573, -241, -308, 587, -295, -284, 556, -366, -216, 568, -459, -154, 574, -446, 0, 524, -492, 89, 507, -563, 217, 415, -578, 247, 338, -598, 222, 274, -613, 406, 190, -612, 431, 176, -587, 462, 41, -486, 504, -15, -496, 576, -138, -498, 575, -182, -407, 562, -205, -293, 625, -386, -193, 597, -372, -151, 570, -494, -65, 510, -546, -28, 502, -527, 58, 455, -557, 160]
5735A60K39j006P88J52q99Q62m7q70R39k10o78J013l19o58R95m18n43J057o30
5754g3l79R86o34k65R41p69j50Q82p97LQ09q94J18Q72j046K97N75r34L46O21j013
5775e04N07M31r38N40L64r54P04K18r73Q08J07r14R00l6q64R70j76p42R56l15
5795H9o11R98n00n17J055n20n23J067o61l10R80p49j29R61q91QQ15q66P0P38r17
5816d13K94O94j075M97N65j061M74N00j073P08L08r64P39J67r41Q47L2q84R64
5835C78k26p41J030k34p68J002l75n85J080n51m92J023o60k90R96p61j63R25q16
5854b28j21Q94q75J3R16r50J75P33j001L57O57j065M42N50j011O02L47r84O66
5873A17L05r37O63J98r39Q12J12q92Q69j01p44R11j83p51R76l80n66R95m78n12
$$ y = [160, 399, -607, 181, 333, -566, 296, 249, -621, 318, 108, -570, 443, 124, -534, 461, 43, -500, 557, -73, -452, 534, -100, -365, 576, -193, -343, 539, -258, -255, 554, -340, -222, 650, -396, -99, 476, -458, -112, 509, -504, 3, 434, -504, 36, 400, -554, 150, 368, -605, 203, 310, -604, 296, 260, -604, 366, 190, -552, 404, 89, -522, 476, -24, -541, 514, -6, -529, 538, -123, -433, 547, -202, -331, 630, -261, -253, 562, -304, -234, 504, -413, -119, 575, -500, -3, 562, -499, -25, 475, -598, 110, 418, -546, 193, 360, -581, 266, 298, -586, 378, 152, -589, 441, 207, -561, 441, 66, -519, 561, 10, -482, 541, -119, -409, 587, -174, -337, 588, -228, -349, 545, -330, -317, 599, -351, -176, 557, -444, -87, 570, -495, -53, 497, -514, 88, 435, -549, 117, 422, -515, 148, 346, -593, 219, 331, -561, 308, 207, -537, 374, 191, -560, 416, 36, -530, 465, -13, -525]
5893e25J041n70m23J030p47k02J001p78j47R14q94qR42j020K20P77j049L50O18
5912E30j021M24N57j030N76M28j014O51L08r64P34J81r57Q67J6q49R45j75q12
5931f05R96k00p21R71l76o23J083n44m46J022o70l22J074q46j65R75q65p5R31
5950E94r36L4Q75r92K77P13j072M15O50j111N64M71j045O22L75j063Q11J72r44
5969e90Q26J49r98Q83j4r29J043k03p37R52k87o93J072m53n43J019n62l52R14
5988D97n94l35J012p79j14Q56q40N2P98q99J11P67r34K78O79j010M00N48r67N00
6008B6M45r86O60K95r92P25J63r20Q17J19r55Q78m4q32R78j81q06J025l06o27
6028e18R51m09n26J040o12l80R58o69k62R96p87j43R25q75K6Q86r23J34P41r67
$$ y = [-525, 516, -54, -477, 553, -194, -396, 605, -173, -320, 594, -300, -308, 634, -386, -166, 611, -438, -88, 530, -491, -67, 490, -540, 36, 464, -550, 101, 409, -555, 179, 360, -597, 270, 286, -563, 382, 207, -605, 391, 191, -530, 441, 65, -558, 525, -19, -465, 557, -113, -435, 639, -207, -372, 603, -262, -337, 594, -342, -308, 567, -425, -148, 565, -507, -92, 558, -553, 11, 482, -563, 59, 434, -629, 182, 354, -590, 236, 385, -613, 270, 256, -673, 370, 167, -570, 382, 95, -598, 474, 21, -522, 497, -65, -417, 497, -97, -432, 580, -199, -313, 543, -297, -245, 553, -346, -235, 532, -402, -124, 555, -455, -55, 493, -474, 26, 471, -515, 145, 440, -552, 173, 336, -584, 233, 352, -603, 275, 231, -601, 377, 196, -610, 415, 109, -518, 433, 24, -502, 538, -74, -454, 504, -165, -427, 569, -218, -361, 564, -311, -285, 601, -322, -188, 553, -414]
6048d14K61P11j011L42O30j008M86N10j053O41L44j015P43K37r57Q24O0r26Q99
6067C04r7q05R56j73p69J064l61o67J047n02n22J075o25m37J094p45k60J060q74
6086b37j20R36r25J36Q01r33J28P67r56L22O56j040L95N83j018N53M29j081O99
6105I5K53q99P22J71r39Q72k8p91R09j90p63R56k37p02J028m43n18J014n29n03
6125e22J033o25l39J021p33k49R26p75m4Q97r28O6Q81r77J63P56j004L64O11j044
6145e22M89N38r86N16M34r28N93K75r79P45J42q75Q39J0q32P99n6p80R45k09o82
6166e24R62l78n75R86m90n28J070o42l78J071p72k32J042q64m7R20r07N7Q42r70
6186c57K35O81r98M03O11j062M98N03j042O03M10j053O86L05j012Q51O8r44R09
$$ y = [-414, -153, 558, -453, -111, 519, -489, -3, 507, -546, 95, 439, -576, 167, 404, -553, 271, 331, -595, 304, 207, -598, 358, 185, -584, 480, 119, -548, 499, -3, -525, 550, -75, -512, 582, -163, -423, 637, -237, -357, 579, -346, -210, 591, -342, -214, 553, -403, -81, 575, -465, -70, 513, -505, 48, 477, -604, 95, 348, -551, 171, 342, -597, 275, 247, -544, 365, 175, -588, 368, 131, -571, 457, 14, -504, 510, -19, -522, 511, -114, -453, 568, -165, -414, 512, -263, -307, 590, -338, -272, 609, -368, -205, 551, -453, -89, 522, -522, -33, 505, -481, 35, 469, -459, 134, 409, -570, 175, 317, -558, 281, 291, -541, 258, 202, -578, 367, 158, -524, 438, 60, -515, 471, -19, -547, 523, -119, -497, 574, -198, -430, 612, -252, -299, 621, -286, -229, 613, -357, -122, 559, -439, -36, 575, -487, 11, 514, -528, 75, 485, -568, 118, 423, -589, 262, 330, -614, 295]
6205B95Jq48Q70j29p33R67l18o52R64l71n33R95n34m17R60o17k91R69p91o7Q55
6226E75q23k6Q95r37J15P94r97K86O46r64L84N68r89M73M68r59O14L20j043P83
6246A83J95q98P02J46q82Q18k3q20Q97j36p39R87l25o44R76l82n48R76n05m24
6266d46R19n83l18R45o81j85Q63p46p5Q27q21J8Q71r66K09P08r45L35N99j003
6286d75M78M84r80N26M03r96O44L46r97P96M8q39Q90o6q58R16j97o29R05k86p15
6307f02J026l64o14J064n41m23R55n80l32R69p98j50R57q70j2Q82q74R6P36r22
6327c97K45O54r29L87N17r35M52M96j009N97L54r41O63K07r60Q82K2q51Q09k4
6347B39q54R59j77p35R69l16n95R07l59m71R31n14l57Q67o15k74R26p24j25Q20
$$ y = [295, 296, -552, 318, 189, -544, 423, 105, -547, 417, 46, -487, 508, -26, -443, 517, -100, -391, 578, -213, -280, 575, -248, -274, 621, -316, -201, 593, -404, -118, 528, -436, -52, 516, -473, 0, 468, -491, 123, 443, -600, 183, 378, -520, 182, 328, -554, 264, 241, -579, 318, 182, -557, 430, 105, -539, 437, 55, -493, 483, -22, -446, 473, -110, -428, 517, -164, -349, 514, -232, -307, 520, -301, -283, 588, -378, -169, 539, -406, -71, 528, -475, 3, 487, -493, 33, 436, -560, 84, 430, -567, 229, 277, -562, 328, 262, -596, 320, 123, -506, 399, 113, -602, 424, 60, -554, 510, -31, -454, 501, -79, -411, 558, -240, -390, 567, -303, -315, 567, -307, -211, 525, -397, -152, 502, -427, -40, 477, -458, -6, 490, -519, 78, 432, -509, 154, 361, -599, 283, 305, -546, 263, 239, -615, 344, 167, -568, 401, 85, -510, 397, 38, -433, 498, -16, -373, 494, -121, -395, 531, -193, -318, 502]
6367E02p53MQ04q73J48P01q59J80O39r20L40N61r01M27M44r70O03L13q79O38J54
6388C03q30P69O7q43P90j9q11Q93j88o64Q91k52o78R90m20m91J009n68l84R41
6408E05o45k94J007p92p8Q78q05m5Q13q54Q9P30q79J65P10r57M09M72r34M95M75
6429D65r78N78L47r25O70J47q54P45J01q16Q46o7q34R71k48o98R54l29n84R67
6449D58m74m46R26n38l91J041p19k85Q91o61j26Q10p98P7P59q87J15P35r28L11
6469a30O65j015M84M44r46N60L45r13O05K11p93P15J49q71P02Q2p95P68l7p52
6489e22Q67j92o61R05l10n65R33m89m42R05n45k97R05n84k81R06o98j33P97p84
6509b85j0P92q10J52O99q82K25N89r15M30M83r24M86M09r08N45K97r20P15J38
$$ y = [502, -251, -247, 557, -316, -168, 533, -326, -146, 493, -427, -87, 474, -427, 0, 444, -526, 77, 390, -489, 149, 303, -527, 242, 309, -534, 256, 237, -574, 319, 131, -533, 358, 106, -572, 418, -2, -493, 516, -52, -436, 505, -140, -434, 573, -219, -297, 581, -224, -269, 544, -310, -221, 509, -370, -205, 505, -452, -43, 429, -505, -10, 465, -513, 65, 412, -513, 157, 304, -550, 195, 296, -520, 326, 259, -575, 396, 148, -550, 404, 75, -509, 458, -16, -462, 464, -74, -465, 576, -143, -428, 463, -198, -324, 486, -312, -235, 524, -363, -248, 487, -441, -130, 535, -480, 4, 448, -498, 62, 407, -506, 99, 310, -483, 232, 381, -490, 212, 294, -501, 267, 230, -522, 345, 153, -508, 397, 87, -478, 455, -34, -476, 429, -116, -413, 492, -92, -373, 533, -165, -298, 499, -285, -295, 497, -313, -161, 538, -344, -119, 470, -445, -15, 468, -456, 30, 439, -469, 76, 373, -547, 168, 306]
6529C06q51Q11jq16Q26j7q02Q23j25o73R38m04m89R02m48l91Q53n50l05R60o54
6550a07k39Q96p42p4Q09p78k3Q16r23J77P20r98L30O12r02L80N02r43N30M06r47
6571d98N95K39q92P51J02q71P98O2p71P64r4p01Q49j81o76R02l39n19R20m38m52
6592d50Q87n42l14Q93o22j82P98o58j46Q21p92R4O93q27K13O03q44K80N39q86
6612d42M37M10q24M54L53q75O07K85q76O46J85r19Q38j5p83Q69j93o28Q30k49
6632A10n54Q61m12m67Q60m59m38R51n24l43Q96o42k20R12p09r7P14o80K6P47q57
6653c25J53O47q17K55N11q37M05M41q60M62L18q33O14K09q20O13J49q14Q08np77
6674e03Q41j69o84Q70k34o07R51m46m56Q66m50l95Q97o34k10Q72p09j54R08q39
$$ y = [306, -545, 266, 265, -551, 275, 258, -544, 279, 154, -519, 419, 15, -474, 428, -20, -411, 442, -108, -413, 547, -107, -346, 550, -192, -266, 543, -235, -258, 558, -365, -188, 532, -466, -136, 476, -426, -46, 456, -487, 43, 449, -498, 97, 336, -556, 195, 297, -574, 224, 286, -485, 279, 185, -516, 333, 152, -524, 378, 39, -480, 440, 2, -450, 437, -105, -419, 474, -148, -330, 468, -190, -336, 485, -307, -213, 480, -347, -134, 469, -375, -95, 444, -442, -5, 405, -419, 35, 388, -487, 120, 405, -471, 175, 360, -559, 279, 264, -519, 350, 157, -471, 359, 110, -444, 417, 5, -462, 398, -61, -499, 452, -72, -415, 481, -161, -381, 531, -178, -275, 439, -241, -215, 532, -325, -172, 475, -342, -87, 424, -413, -8, 433, -427, 35, 353, -480, 134, 343, -477, 136, 285, -529, 279, 274, -503, 338, 169, -515, 355, 121, -486, 465, 19, -437, 429, -21, -416, 481, -153, -363, 509, -200, -354, 554, -285]
6694b85L8P93q20N9P01q29K46N81q22K60N82r12L54N21r76N50L69q92N85K19q38
6715e16P07M1p41P77o0o77Q08k07o33Q51k94n05Q37l77m96R43n10l38Q51n47l11
6736c97Q98o83p6P78p57LP72q62J63O71q49J91N95q16K63N84r19M44L96q37N28
6757I0L04q67O46J63q41P17L5p60P57k0o77P34j36o76R04l24m94Q16l28m46Q75
6778D72n19l59Q46n13k65Q78p27r3P86p32m5P70p36J3P37r35L00N94r20M07M91
6799D50r11M88L73q58O17K34r07O63K13r36P26R2p30P57q6p65R31k75n41Q31k82
6820H4n34Q98m67l87Q40m85l34Q11n04k56Q23o19j10P29p34L2O61p87J63O38q00
6841c38K54N35q44M22L32p76M28L46q36N89K53q24O09J38p41O61mp04Q23j55o25
$$ y = [-285, -247, 546, -274, -215, 486, -343, -97, 484, -338, -78, 504, -408, -54, 467, -509, 41, 410, -482, 103, 322, -516, 191, 232, -509, 268, 208, -469, 339, 132, -501, 350, 56, -449, 388, 11, -485, 458, -52, -390, 461, -86, -397, 501, -182, -258, 520, -237, -234, 538, -324, -161, 510, -339, -148, 447, -369, -106, 478, -441, 3, 399, -438, 90, 394, -473, 173, 336, -505, 212, 247, -513, 244, 224, -453, 281, 145, -531, 373, 49, -445, 371, 43, -403, 472, -47, -406, 440, -73, -338, 540, -187, -280, 506, -226, -271, 499, -237, -224, 513, -422, -122, 472, -448, -41, 450, -461, 27, 400, -458, 159, 393, -514, 149, 362, -574, 152, 244, -486, 271, 185, -580, 351, 76, -465, 366, 84, -450, 448, -19, -406, 434, -51, -385, 426, -78, -334, 489, -130, -240, 489, -245, -213, 448, -339, -176, 462, -338, -84, 451, -393, 29, 361, -415, 13, 359, -477, 112, 365, -459, 150, 288, -453, 208, 204, -500, 323, 168, -457]
6862d57P77j82n78P99l07n03Q52m06l67P77m63k56P80o24j27O72n62p1P15p03
6882b34k1P20p64J01O56p65J79N56q38L86M45q50M49M00r07N58K74p97O13J12
6902B73p43O74K8p09P70j27o45P67k03n64Q70k81n47Q32l26m77Q99n50k61P75
6922D55n82k53Q55o82qO97p71J17O16p43J61N85q19K46N59p78L08M07p78M93L00
6943C85q04N13K23p89O62P8p13O42l5o09P24j25n82P46k68m56P88l77l85Q00m34
6964a6l88Q79o06k02P74o02j13P03o63J4P02p66J90N61p81J25N97p56K99M81q57
6985d25M39L38p49M15L41p92N54J82p56N51J45o92P32n5o31P22j59o25Q06k33
7005A08m89P81m72m01Q78m75k86P97n96j97Q15o08j33P05o51nP14p30Q2N80p40
$$ y = [-457, 320, 138, -440, 359, 52, -451, 401, -5, -372, 405, -58, -314, 466, -158, -285, 387, -175, -246, 469, -234, -255, 465, -299, -198, 458, -307, -128, 428, -410, -24, 421, -429, 20, 420, -487, 71, 345, -452, 161, 273, -470, 204, 232, -477, 293, 166, -479, 288, 85, -479, 391, 110, -437, 395, 69, -408, 491, -59, -320, 455, -127, -380, 475, -207, -215, 482, -289, -172, 444, -299, -138, 447, -372, -126, 433, -345, -37, 370, -408, 85, 385, -419, 94, 317, -472, 190, 268, -445, 197, 162, -447, 277, 152, -430, 316, 48, -408, 380, 3, -382, 418, -16, -404, 475, -131, -333, 441, -161, -274, 429, -234, -220, 482, -284, -94, 467, -314, -189, 408, -348, -49, 432, -425, 14, 352, -397, 18, 359, -433, 121, 303, -453, 98, 243, -449, 283, 228, -403, 319, 160, -465, 341, 108, -381, 400, -72, -473, 405, -70, -356, 441, -155, -352, 463, -145, -278, 427, -224, -229, 485, -245, -163, 417, -323]
7026c23K93M60p93L02N09q56M34L73q10M71K92p63M79K19p09N79J05p55P79n4
7046B32p06Q04j95o03Q12k98m80Q27l95l93Q29n00l10Q56n67k25P91o88j23P94
7066D62p07P2O63q10J77O15q48K87N01p75L26M19p77M32L17p68M97J87p19O08
7086A59J07p03O65K9p07O97r2o10P15j69n21P36k31m58P29l53l75P59m40k44P60
7107D53n87j30O85o24mO68o81J1O07p34K51N32p91L02M01o92L41L97p91M60L15
7128C89p95M89K08p15N76J53p53O32M6o43O95j02o43P87k07n75P87k79m40P72
7148C82l50m50Q11m82k92Q18n75j82P17n09j48P15o80RO71p40J66N49p41K75M30
7169C94p93L55L57p42M90K27p15M99J93o90N93Q1o82O36%o23O92j51n59P60k09
$$ y = [-323, -30, 430, -363, -61, 448, -408, 26, 399, -411, 60, 352, -411, 68, 287, -422, 157, 262, -493, 286, 232, -474, 330, 135, -468, 344, 46, -434, 393, -2, -395, 434, -66, -376, 480, -87, -312, 479, -209, -332, 462, -245, -173, 490, -320, -143, 472, -376, -89, 412, -363, -37, 382, -395, 37, 354, -414, 83, 270, -449, 159, 266, -437, 228, 257, -450, 247, 155, -455, 260, 91, -430, 306, 75, -383, 346, -7, -382, 377, -63, -307, 453, -134, -264, 421, -203, -207, 461, -220, -209, 398, -336, -85, 447, -344, -42, 359, -333, 8, 405, -386, 74, 389, -406, 83, 291, -424, 152, 305, -448, 184, 230, -413, 282, 180, -463, 324, 117, -458, 329, 50, -390, 382, 32, -418, 393, -89, -381, 437, -138, -320, 397, -112, -260, 455, -225, -216, 455, -285, -119, 430, -311, -36, 394, -399, -44, 313, -429, 61, 288, -427, 72, 265, -425, 168, 249, -433, 203, 203, -420, 272, 121, -438, 322, 113]
7190A13n54P66k92l53O93m45k53P47n31k21P59n71j63P36o79M2N89n87Q0N01o40
7211b63J98M91p29K52L84p06L57L51p20M40K42p09M98K44p58O00M4o06N83l0n61
7232c98O35j17m78O75k50l95O04k63l60P21m24k68P17m61k31P02o15q3P00n92
7252a81n0O15o01L3N99p07J85M79o98K46M00o58K90L82p10L75L28p44M97J39o49
7273d30N92P4o44N98m1n87O94j43n22P18k42m47P42l79l64P78m83k49P16m81j94
7294b94O87n16j03O05n74kO47o87R6N28o63J43N22p46L47L74p42M37K48o78M41
7315G0K15o89N03R6o49O20J15o67N94j16m91O80j40m93O30j92n01P32l10l38P02
7336C71m60k24O33m38j10N22m00j39O12n95K3N76o52J48N33o09J41M25o84K62
$$ y = [113, -441, 325, 33, -320, 373, -72, -325, 422, -109, -330, 429, -142, -305, 431, -248, -206, 383, -204, -124, 377, -263, -65, 426, -303, -51, 333, -373, -16, 335, -385, 55, 297, -412, 86, 330, -428, 172, 216, -390, 193, 163, -398, 237, 120, -358, 317, 67, -328, 276, 13, -347, 374, -50, -318, 399, -62, -293, 409, -206, -289, 411, -181, -231, 384, -217, -184, 415, -292, -107, 372, -326, -80, 320, -338, -48, 334, -376, -1, 327, -417, 80, 219, -430, 162, 236, -408, 190, 149, -438, 256, 113, -409, 309, 67, -380, 362, -17, -381, 397, -86, -335, 381, -100, -294, 393, -123, -226, 379, -195, -197, 450, -237, -141, 387, -276, -133, 389, -357, -10, 364, -378, 59, 307, -371, 70, 285, -404, 99, 195, -454, 166, 281, -386, 208, 92, -399, 281, 141, -352, 278, 86, -415, 317, 7, -331, 371, -89, -313, 320, -118, -228, 294, -106, -245, 367, -228, -205, 371, -281, -133, 400, -209, -68, 357, -327, -65]
7356f5M22p14M32K76p08M05K07o34N05J25o42N84K1n63N19Nn71O41j52m44O44
7377B93k34m06O36k64l74P55m17k87O24l70k81P52n62j42O53n78%N80n80Q6M62
7398C46o71K40M87p47L01L82o74L60K86o92M04K54o74N24M3n55N68K2o07N91M
7419A92n15N50j28m46O18k38l75O16l16l28P32m20l11P35n14r3N65n21o2O50n86
7440a95J8N44o20J63M50o85K62L49n98L11K96o70M18K34o49M07K56o66N23O4n98
7461c86N57Jn27N79j19l92N28j75m35O64k42l93O03k23l17N62l02l16O97m24k03
7482b63O45n10p3N63n45J4N55o05J08M69o26J83L87n23K07L25o50L21K89o15L93
7503D9K14n95M45J15n99N21P1n97O42j56m62N54j44l61N70k15l99O06k74k68N93
$$ y = [-65, 357, -357, 75, 351, -357, 48, 255, -379, 126, 251, -391, 193, 214, -349, 170, 175, -396, 245, 93, -351, 293, 59, -347, 289, 25, -349, 406, -11, -298, 326, -44, -325, 427, -135, -277, 376, -202, -202, 378, -202, -116, 346, -325, -85, 402, -345, -44, 338, -336, 24, 310, -382, 22, 276, -398, 126, 169, -386, 182, 204, -403, 188, 192, -323, 227, 99, -347, 271, 33, -342, 274, -42, -370, 362, -58, -369, 366, -148, -241, 324, -197, -259, 391, -195, -177, 367, -253, -90, 360, -325, -63, 286, -312, -1, 295, -375, 43, 277, -372, 35, 291, -375, 148, 212, -386, 171, 172, -355, 224, 105, -287, 241, 66, -369, 295, 53, -340, 263, 40, -277, 285, -17, -333, 364, -60, -263, 382, -128, -201, 362, -183, -169, 386, -219, -111, 358, -268, -85, 302, -221, -14, 311, -339, -18, 271, -344, 49, 263, -332, 113, 228, -371, 150, 221, -376, 266, 110, -352, 202, 58, -303, 267, 52, -347, 259, -15, -283, 310]
7524C10l92k01O13m60j17O37n68RM96n44MN49n88J06M51o17K66L89o83K87M02
7545C49o59L02L13o81M53J57n70M65N3n31M82Km92N19p7m70O05j02m36N99k25
7566E6l41O14l58k57O13l68j99O04n14p6N91n51k3N76n45M3M68o07K09M04n99
7587b60J58M34n81K27L05o05L42K63o18M17J64o27N03R5n64N25l5n28N08j9m76
7608c72O44k32m02O02k37l57O43k69l32O51l86k04N62m64n6N97m82r3N10n38Q2
7629a33N11o17J32M77o29J89L92n97K74K79n76L25J96n99M61J77o08M58Q4n15
7649c19M74L6m84N10j35m47N91j14m60O47k45l85O40l67j70N64l98j73N39m49
7669a45m0N50n51m1N81n66L6N12n67J62L90n92K50L33o71L97K10o16M31J92o44
$$ y = [310, -82, -283, 330, -130, -247, 390, -178, -169, 327, -217, -213, 336, -252, -146, 305, -312, -46, 343, -340, -53, 349, -310, -8, 305, -376, 77, 234, -336, 129, 182, -349, 133, 135, -357, 162, 85, -385, 220, 118, -318, 281, 56, -285, 329, -29, -286, 327, -41, -240, 364, -150, -226, 365, -186, -209, 367, -178, -135, 333, -274, -65, 339, -260, -102, 332, -249, -22, 283, -322, 20, 283, -335, 82, 246, -381, 122, 217, -347, 178, 143, -385, 123, 104, -372, 272, 40, -362, 240, 3, -354, 289, 20, -312, 339, -47, -251, 311, -153, -209, 388, -94, -187, 323, -215, -133, 378, -239, -107, 370, -259, -70, 322, -275, -1, 278, -298, 27, 223, -376, 85, 262, -346, 112, 196, -319, 155, 191, -293, 217, 82, -365, 226, 112, -348, 299, 54, -331, 309, -58, -228, 336, -62, -235, 304, -145, -185, 365, -186, -227, 354, -212, -176, 336, -231, -69, 321, -271, -21, 312, -359, 38, 248, -368, 63, 255, -389]
7690c89M75J16n36M73M2n04M13Q5n60O05q8m55N49j93l89N62k21l39O45l41k14
7711b64O09m08j40N15m38l6N56n81N8M90n81J47L46n50K40L53n70K15L86o35L06
7732A8K23n66L80J91n25L66J21n36M83M4n33N07k6m81N56j32m20N07j38l02N64
7753C01k96k77N57l30k52O18m00j65N99m69m1M31m23nN49n97O6M90n64J69L76
7774C37o29K66L23n87K91K53n71M38J01n57M50P6n78N13O9n81O06j09m34N26j53
7795E0l74N62k09l67O56k95k97O01l81j86N47l89j19N33n20L0M74m47l6M78n28
7816b17O3M20n28K06L55n84K33L11n55L32K35n54L27J92n71L88J22m44L56M2m20
7837b91N09r6m60N60j62l58O02k53l39N51k47l09N46l32j30M98m01j49N51m25
$$ y = [-389, 86, 202, -334, 139, 181, -323, 90, 175, -385, 220, 132, -323, 226, 33, -356, 206, -15, -354, 291, -50, -264, 345, -63, -203, 312, -126, -162, 394, -187, -129, 361, -220, -73, 273, -277, -37, 316, -254, -39, 347, -288, 18, 241, -325, 55, 246, -279, 87, 208, -328, 155, 199, -334, 173, 147, -334, 222, 90, -330, 177, 39, -263, 301, 5, -272, 285, -45, -297, 321, -79, -244, 355, -114, -155, 276, -147, -152, 397, -200, -134, 356, -208, -39, 337, -292, -26, 297, -290, 1, 254, -317, 121, 222, -335, 115, 191, -387, 126, 195, -386, 220, 111, -323, 203, 50, -324, 238, 29, -338, 318, 23, -274, 327, -54, -240, 307, -82, -201, 332, -188, -158, 316, -131, -167, 311, -217, -154, 266, -262, -56, 299, -285, -52, 259, -296, 36, 271, -283, 44, 236, -335, 53, 175, -269, 87, 129, -291, 218, 122, -338, 222, 60, -298, 304, 51, -288, 263, 16, -293, 253, -79, -209, 289, -112, -261, 290, -135]
7857a35N0L78n40J13M66n38R1M44n36J35L45n60K28L84o38L26K33o17M10J84n42
7878c19M02J67n67M75k2m54M83o9m58N65j05l83N41j71l33M82k15k86N87l82k12
7899b74O00m32r2N64n44qN03m80K6M43m68J13L21n26J99K93n36K79K61n31L61
7920G2K91o40L78J14n29M45Q8n36M21K7l61M46j40l38M98k00l44N72k39k45M58
7941B38l35j54N53l88j62M73l41o1M63m61M1M41n35J25M08n07J39L48n14J88L00
7962B59n02K56K27n08L61J18m94L64R5m54L90O1m44M58q5l93N16j38l40M50j25
7983G2k65M10k19k90N20k80j89N10k70j80M54l91q3N34m50k9M44m76L6L89m49
8004b02J96K74n04K19K60n24L20J77m78L07J82m91L36P6n19M86L9m67N14r0l91
$$ y = [-135, -85, 293, -247, -134, 332, -206, -115, 329, -207, -72, 273, -287, -59, 325, -313, 13, 246, -371, 39, 223, -319, 83, 250, -317, 158, 136, -318, 165, 96, -362, 203, 98, -285, 256, 85, -248, 234, 19, -267, 320, -62, -274, 326, -106, -198, 366, -178, -186, 317, -163, -137, 306, -162, -49, 272, -254, -55, 238, -298, -19, 242, -289, 72, 363, -277, 101, 215, -314, 131, 219, -317, 104, 131, -230, 216, 76, -262, 236, 36, -308, 264, 25, -220, 238, -97, -251, 302, -86, -248, 225, -116, -177, 286, -175, -134, 307, -228, -103, 305, -202, -63, 285, -229, -41, 259, -243, 13, 240, -268, 93, 211, -283, 81, 176, -278, 112, 173, -271, 187, 102, -291, 225, 87, -253, 197, 72, -193, 217, -2, -292, 228, -52, -241, 269, -1, -181, 273, -118, -201, 333, -117, -146, 298, -178, -142, 247, -202, -6, 268, -236, -17, 243, -281, 39, 216, -262, 45, 227, -264, 72, 148, -371, 115, 154, -313, 201, 111, -280]
8025b80M35r5l76N80k62k76N77k69k70N26l55j55N36l85j10M35l79o4M72m24P6
8046f3L64m87O9L77n01J88L15n36K70L06n57K79K04n20M11N7n14M89km02M17p
8068A57m52M16k4l25L66o3l17M55j50l66M98k23j67M72l45j27M55l17j18M73m02
8089a04lL50l90j8M50m15K0L43l82J22K96n52K84L05n37K49J74m59K74J74m17
8110b36K91J20m23L70qm04M03m4l14M17p4l93N27j87k62M37k53k01N29l50j61
8131b16N06l86n9M18l61n0M26l77l6M04n05J49L36m23J02L32m18J31K30m58K79
8152B4K58n44L21J16m75L91P5m53L58R1m58M41m2l76M08o9l30M61j86k48M81k48
8174dk54M49k19j87M42l39q0M81m52l3M43l99O4L36l90K6L62
$$ y = [-280, 155, 60, -316, 264, 2, -274, 303, 34, -236, 290, -65, -220, 316, -69, -179, 256, -123, -187, 285, -139, -63, 301, -186, -117, 260, -241, -53, 262, -274, -4, 302, -255, 24, 228, -292, 119, 176, -338, 151, 149, -253, 164, 157, -295, 121, 97, -228, 138, 75, -242, 213, 63, -303, 195, -28, -195, 277, -68, -195, 260, -57, -175, 298, -104, -107, 243, -147, -165, 285, -130, -110, 233, -149, -27, 269, -283, 1, 306, -231, 18, 192, -267, 7, 181, -236, 55, 175, -248, 122, 114, -290, 113, 69, -245, 172, 98, -295, 232, 45, -217, 220, -33, -234, 295, -55, -216, 290, -96, -155, 263, -98, -148, 278, -99, -135, 269, -236, -87, 249, -174, -72, 260, -158, -27, 203, -255, 24, 282, -262, 59, 175, -300, 91, 166, -287, 71, 162, -296, 145, 103, -273, 135, 66, -264, 197, 11, -237, 244, -4, -258, 191, -28, -215, 227, -112, -192, 289, -163, -196, 247, -152, -88, 248, -142, -116, 246]
8191B46
$$ Imaginary data points
##PAGE= N=2
##DATA TABLE= (X++(I..I)), XYDATA
0@%%%%%%%%%%qJ6j6J6k4L2m0M8n6P2q8J04j20J37j61J92k25K59k99L46l94M48
32B39n12N80o54P36q26R29j042J165j296J439j599J771j958K165k392K637k906
49a524L202l527L884m280M719n208N760o384P097p922Q885j0027J1412j3129J5321
64H279j8229K2288k8381L8624n9962J72877k19138r0428M70188m58456N1573L79122
76B68357m38495Q0688L60831m76844J60905K90706m62998K01042K49488m69701
86b36021K60432J81416m47439K94689J30024m32528L36205O5820m00071L60202
96A12729J2198l70624L84934m6035l30127L97396r6930k90524M07294j48495k44124
107b12308M07664j93754j97137M03370k36432j46673L90887k72591r6092L73216
$$ y = [0, 0, 0, 0, 0, 0, 0, 0, 0, 0, 0, -8, 8, -8, 8, -16, 16, -24, 24, -32, 40, -48, 56, -64, 73, -88, 104, -121, 138, -161, 185, -209, 239, -273, 307, -347, 389, -437, 492, -550, 615, -681, 758, -841, 930, -1028, 1137, -1255, 1382, -1524, 1678, -1849, 2035, -2245, 2474, -2734, 3026, -3358, 3739, -4183, 4702, -5325, 6087, -7042, 8279, -9950, 12338, -16043, 22581, -37381, 135496, -83642, -174070, 296118, -162338, -110765, 268357, -170138, -89450, 271381, -205463, -44558, 246148, -216850, -15808, 233680, -236021, 24411, 205827, -241612, 53077, 183101, -249427, 86778, 152598, -247473, 112729, 124927, -245697, 139237, 93202, -236925, 160471, 63541, -226983, 180311, 31816, -212308, 195356, 1602, -195535, 207835, -28597, -175270, 215617, -56974, -153066, 220150]
117B20150l03967m4854L49214l28774N340L20223l47705N4525K86156l59838J01163
128d8367K48115l65282J44797K06762l64137J84374J63240l56709K19569J18329
138A50691l43724K50193P2798l25443K75857K7297l02377K96391j7478k75130
148a90925L11796o1022k43969L21945j02774k09523L26706j42177j72244L26203
158A64016j78735j32765L20471k11994r1410L09450k41536m8674K93068k66507
168h4616n459K71394k86433L7615K44821l00720P9514K13794l08965J19408J78996
179A59349l11121J56454J41088l07070J89762J01016k96801K18667N9626k80933
189a69963K42598J7969k59741K61035k2963k33985K73832o2131k04525K81075
$$ y = [220150, -83817, -128671, 220543, -108231, -102891, 217332, -130373, -75848, 210308, -149530, -48367, 199748, -165534, -20737, 186025, -178112, 6262, 169502, -187207, 32362, 150691, -193033, 57160, 129958, -195485, 80372, 107669, -194708, 101683, 84205, -190925, 120871, 59849, -184120, 137825, 35051, -174472, 152234, 10057, -162187, 164016, -14719, -147484, 172987, -39007, -130417, 179033, -62503, -111177, 181891, -84616, -90075, 181319, -105114, -67499, 177322, -123398, -43884, 169910, -139055, -19647, 159349, -151772, 4682, 145770, -161300, 28462, 129478, -167323, 51344, 110970, -169963, 72635, 90604, -169137, 91898, 68935, -165050, 108782, 46651, -157874, 123201]
199A23201r9154j72001K82908j33138j37481K79645j64034j01164K71405j91213
209d1026o3978K58560k14350k6414K41345k33175J0739K20251k47351M6815J95796
220A47212k57021Q1456J68203k61754J13888J38085k61704J43671J06027k56825
230a38762J70248P2634k47175J92849L8870k33295K11511N081k15408K25571k7606
241E4518j94381K35522n9145j70416K40998q8819j44092K42268j16258j15972
251a15777K39423j41068q6629K32720j63053n6725K22794j82077k6542K09558
261A32624j98168L762J93338k10988L3626J74211k20552O2917J52566k26687R1122
272a2229J28525k29001J17655J02392k27701J42361P4625k22548J64814M5202
$$ y = [123201, 24047, -147954, 134954, 1816, -135665, 143980, -20054, -121218, 150187, -41026, -105004, 153556, -60794, -87208, 154137, -79038, -68299, 151952, -95399, -48584, 147212, -109809, -28353, 139850, -121904, -8016, 130069, -131635, 12036, 118063, -138762, 31486, 104120, -143055, 49794, 88664, -144631, 66880, 71961, -143447, 82124, 54518, -139863, 95659, 36514, -133902, 107096, 18277, -125815, 116453, 195, -115777, 123646, -17422, -104051, 128669, -34384, -91109, 131685, -50392, -76934, 132624, -65544, -61782, 131556, -79432, -45806, 128405, -92147, -29230, 123336, -103351, -12229, 116296, -112705, 4950, 107342, -120359, 22002, 96627, -125921, 38893, 84095]
282H4095k13382J84355J4823k00147K00557j5873j83133K12840m6190j62608K20858
293I6195p5351j39048K24490j02919j12911K23903j28213q4925K18795j50634
303c0618n5669K09568j69912k5768J96496j85563M142J79978j97535L3389J60496
314A19004k05643O1460J38377k09921Q8066J14264k10566J12703Q8385k07331
324a11202J35227O1031k00490J54998L2978j89996J71618M646j76077J84877k3516
335D4094j58996J94425n0644j39254K00262p6583j17097K02135j00610r3103K00063
346A04692j22182o7779J94119j40932m1631J84625j56643j5384J71999j68970
356e8086J0314J56653j78057L5293J38905j83785N8978J19236j86375Q1328R8012
$$ y = [84095, -129287, 55068, 69891, -130256, 70301, 54428, -128705, 84135, 37945, -124663, 96195, 20844, -118204, 106286, 3367, -109544, 114359, -13854, -98779, 120016, -30618, -86287, 123281, -46631, -72399, 124097, -61466, -57324, 122654, -74881, -41492, 119004, -86639, -25179, 113198, -96723, -8657, 105607, -104959, 7744, 96129, -111202, 24025, 85056, -115434, 39564, 72542, -117454, 54164, 58810, -117267, 67610, 44094, -114902, 79523, 28879, -110375, 89887, 13304, -103793, 98342, -2268, -95371, 104692, -17490, -85269, 108850, -32082, -73713, 110912, -45731, -61115, 110884, -58086, -47772, 108881, -69176, -33883, 105022, -78763, -19785, 99451, -86924, -5596, 92416]
367I2416j85852J01747P5670j82289J20241N2388j75927J36568K8812j67018J50572
378D7328M825j55427J62276j9217j41517J71415m2938j25222J77658o5887j06772
389i3478J80810q7820q6371J80831j08275o4357J77608j26742m1187J71071j42953
400d0863j7161J61322j56464P214J48385j66782L1318J32625j73843N4640J14659
411I5050j77666P6714R4569j78003R6940P3134j75161J15366N0626j69288J31518
422C3799K7267j60362J45293L573j48661J56310j9989j34415J64609m3012j17969
433i3557J69897o5122r9542J72250q6092p9323J71463j05508n7634J67506j22876
444b8538l5015J60471j37913j1688J50278j50065J1554J37277j59168L4239J21817
$$ y = [92416, -93436, 8311, 83981, -98308, 21933, 74321, -101606, 34962, 63774, -103244, 47328, 52153, -103274, 59002, 39785, -101732, 69683, 26745, -98477, 79181, 13294, -93478, 87332, -488, -86859, 93972, -14303, -78660, 98948, -27794, -68981, 102090, -40863, -58024, 103298, -53166, -45952, 102433, -64349, -33031, 99594, -74249, -19609, 95050, -82616, -5902, 88667, -89336, 7604, 80738, -94423, 20943, 71569, -97719, 33799, 61066, -99296, 45997, 49570, -99091, 57219, 37230, -97185, 67424, 24412, -93557, 76340, 11218, -88324, 83926, -2166, -81489, 89974, -15534, -73168, 94338, -28538, -63553, 96918, -40995, -52683, 97595, -52470, -40916, 96361, -62807, -28568, 93249]
455I3249j65029N6025J04155j67629P6284Q4959j67067R4795O4283j63066J11015
466B1974M2975j56332J24822K1494j46929J35980J59j35165J44587k0530j21575
477h8540J50613m0541j06231J54154n9625q9401J55105p7300p1529J53741r3675
488a3229n2760J50038j08381l3363J43952j21306j3455J35698j32325O589J25152
499H6610j41210K6705J12532j47712M6277R7917j51546O5050Q1531j52607Q2590
510F137O3706j50923R8492M4877j46635J12682K5347j39613J24666N382j30105
521h5987J34370j4561j18305J41490l4044j04492J46111n2719q8986J48165p0419
532F23p2091J47627q6719n4001J44594j01665l4935J39043j14767j5322J31204
$$ y = [93249, -71780, -15755, 88400, -79229, -2945, 82014, -85053, 9742, 74025, -89041, 21974, 64949, -91383, 33439, 54933, -91996, 43984, 44143, -91022, 53565, 33035, -88540, 62073, 21532, -84699, 69455, 9830, -79571, 75534, -1766, -73295, 80446, -13229, -65989, 84049, -24332, -57695, 86257, -35049, -48504, 87194, -45131, -38542, 86610, -54600, -27895, 84637, -63075, -16798, 81119, -70427, -5377, 76154, -76453, 6137, 69843, -81080, 17412, 62289, -84346, 28336, 53683, -85930, 38736, 44118, -85987, 48383, 33822, -84483, 57007, 22963, -81529, 64582, 11863, -77123, 71042, 623, -71468, 76159, -10560, -64561, 80033, -21632, -56567, 82476, -32291, -47613, 83591]
543H3591j25984M657J20904j35022K4657J08414j41531M4213R3909j45525O3021
554d696P7533j46691Q0643N9717j45001R6708M0691j40489J10761K0911j33094
565h3007J22423J000j23221J31532j8682j10879J37768l7663r6582J41171n5528
576H332q0706J41786p1915o3722J39755q6646m5898J35350r9492k7758J28499
587G7585j10146r580J19701j18802Q414J09142j25364K5866R6918j29787M2694
598a3359Q3503j32120N8658O8749j32394P3625N2999j30346Q7099L6577j26263
609g3272R9095J9620j20066J09472K333j11919J17886j4830j01782J24169l1771
620A8935q9895J28131m7792p6476J29800o2945o1982J29129p6640m6547J26288
$$ y = [83591, -42393, -37736, 83168, -51854, -27197, 81217, -60314, -16101, 77808, -67717, -4696, 72837, -73854, 6789, 66506, -78495, 18213, 58904, -81585, 29176, 50087, -83007, 39416, 40416, -82805, 48727, 30045, -80834, 56934, 19271, -77311, 63860, 8332, -72374, 69412, -2503, -66225, 73530, -13116, -59014, 76336, -23156, -50914, 77585, -32561, -42141, 77560, -41242, -32828, 76314, -49050, -23184, 73734, -56053, -13359, 70144, -61976, -3318, 65431, -66963, 6662, 59661, -70685, 16414, 52991, -73272, 25823, 45443, -74623, 34849, 37182, -74737, 43149, 28319, -73463, 50706, 18935, -70960, 57171, 9379, -67097, 62703, -242, -62224, 66905, -9735, -56282, 70006]
631G0006q8965l0506J21384r9684j4171J14502j08588K304J05700j15687J8729
642b4976R5209j20739L4680Q3234j23983N0122O9868j25147O4786N5379j24245
653f5812P8287L9973j21357R0791K3530j16215J01717O677j09076J10923j0410
664B9028r9729J18057k7590q8476J23010m4147p5415J25479n9881o0917J25521
675F4940p4400m5181J22973q7379k8588J17918r8477j1461J10448j07430N537
686c1100J00955j14023K2131Q9632j18268L7989P6755j20204N2777O2705j19810
697f0461O6347M7835j17273P8465L2338j12806Q8978J6635j06339R7730Q08r8198
709f5941J04728j4801q8398J09779k9943p7291J13116m4558o4952J14342n8285
$$ y = [70006, -18959, -49465, 71919, -27765, -41936, 72566, -36022, -33718, 71982, -43705, -24976, 70233, -50506, -15826, 67408, -56575, -6453, 63415, -61732, 3054, 58433, -65812, 12475, 52448, -68909, 21882, 45412, -70803, 30914, 37591, -71485, 39438, 29028, -70701, 47356, 19766, -68710, 54300, 10153, -65262, 60217, 336, -60581, 64940, -9460, -54641, 68332, -19047, -47635, 70283, -28194, -39655, 70793, -36637, -31100, 69855, -44168, -22037, 67595, -50673, -12684, 64071, -56133, -3356, 59349, -60461, 5886, 53721, -63552, 14913, 47251, -65555, 23423, 40058, -66281, 31449, 32257, -65941, 38787, 23986, -64412, 45367, 15424, -61867, 51249, 6691, -58261, 56081, -2204]
720b204n1361J13368p0745l7004J10450q1835k2255J05677r1428p126R8852r9050
732c4661P814R0339j04802K2434Q0305j08571L6453O9042j10221M9412N6738j09984
744e5702O1352M3783j08018P2124L0266j04192Q1534J6358r8798Q9646K329r1869
756f1187R6238j1627q3528J01306k5501p3712J04716l8958o2847J06649n1900
767c51n0777J06613o4063l7718J04855p5234k3924J01152q5253r389R5621r3715
779c2183N284Q8125j00349K0040P8782j04993L4368O7948j07608M8064N5843j08176
791e4855O0811M2469j06395P2088K8540j02606Q1963J4046r6779R0056m18q9166
803f0246R6253j4757p9954J00619k8514o9481J02973m1508n7876J03515n3637
$$ y = [-2204, -53565, 59803, -10942, -47946, 62504, -19331, -41586, 64091, -27337, -34463, 64389, -34661, -26847, 63492, -41310, -18876, 61429, -47142, -10689, 58353, -51868, -2456, 54282, -55702, 5650, 49433, -58585, 13539, 43805, -60387, 21147, 37505, -61293, 28353, 30682, -61187, 35051, 23424, -60104, 41202, 15701, -58011, 46705, 7747, -55100, 51549, -351, -51128, 55485, -8578, -46296, 58559, -16675, -40599, 60553, -24700, -34089, 61532, -32183, -26899, 61226, -39123, -19083, 59699, -45294, -10926, 57022, -50586, -2522, 53321, -54855, 5956, 48425, -57970, 14118, 42658, -59948, 22015, 36061, -60718, 29338, 28920, -60246, 36007, 21250, -58704, 41915, 13401, -56080, 46893, 5385, -52491, 51024, -2613]
814b613m5376J02246o4760l2210R9151p4572j8584R4347q2918m890Q7954q9903
826c2128Q995P9996r5062K2506P0673r8547L5618O0064j00231M7926M8409r9846
838e1627N9093L6048r7700O9052K3172r3694P7570J0051q8045Q4412k872q0925
850e5465Q9590j5481p2498R3035k7570o2983R4865l8953n2621R5040m9406m1645
862d4092R3745n8985l0118R0994o7467j8355Q6938p4947o239Q1447q1322O011
874b2390P4752q6335J8140O6789r0019L0164N7612r2228M1569M7561r2871N2577
886E321L6327r1847O2630K4520q9219P1644J2106q4809P9307o29p8666Q5454j3370
899A8769p1085Q9913k5761o2146R2650l7658n1969R3493m8740m0811R2483n8774
$$ y = [-2613, -47989, 54257, -10503, -42713, 56438, -18134, -36718, 57629, -25289, -30179, 57775, -32128, -23133, 56863, -38199, -15693, 54980, -43567, -7949, 52115, -48116, -190, 48219, -51627, 7466, 43514, -54186, 14866, 38038, -55656, 21914, 31965, -56080, 28332, 25460, -55465, 34125, 18644, -53854, 39181, 11611, -51372, 43493, 4540, -48081, 46959, -2447, -44092, 49653, -9332, -39450, 51544, -15923, -34278, 52660, -22287, -28526, 52921, -28401, -22390, 52362, -33973, -15833, 50956, -39063, -8899, 48713, -43515, -1946, 45615, -47256, 5321, 41648, -50199, 12431, 36951, -52268, 19376, 31482, -53327, 25980, 25351, -53315, 32139, 18769, -52316, 37597, 11836, -50310, 42340, 4682, -47287, 46206, -2534, -43345, 49138, -9636]
911i636k9058Q9826o7564j6871Q5428p5045m391P9561q1133P983P2240q5630K0054
924a4236O3734q8573L1788N4161r0033M2920M3526q9689N3190L2220q7893O2562
936A3677K0315q4357P0698Q072p9360P7493m309p2677Q2644j6500o4733Q6224
948C7187k8231n5595Q7998l9333m5465Q8127m9448l4657Q6419n8306k3344Q3088
960D8440o5859j2045P8395p2063p15P2381p6840J0331O5297q0149K0958N7223
972D5354q2102L1098M8295q2590M0365L8906q1883M9015K9035p9956N6847J8679
984C1063p6728O3712Q208p2436O9635k480o6950P4522j3240o0269P8051k3683
996I405n2669Q0357l3819m4000Q1250m3416l4558Q0639n2192k4555P8681o0148
$$ y = [-9636, -38694, 51132, -16432, -33303, 52125, -22920, -27311, 52250, -28883, -20900, 51340, -34290, -14236, 49498, -39075, -7287, 46874, -43159, -239, 43287, -46402, 6788, 39008, -48885, 13677, 33992, -50365, 20333, 28405, -50955, 26538, 22229, -50448, 32196, 15696, -49037, 37187, 8956, -46639, 41359, 2026, -43439, 44688, -4760, -39417, 47002, -11304, -34648, 48440, -17419, -29464, 48931, -23132, -23847, 48534, -28306, -17975, 47322, -32827, -11869, 45354, -36748, -5650, 42645, -39945, 420, 39326, -42557, 6458, 35493, -44463, 12384, 31063, -45665, 18047, 26255, -46181, 23454, 20974, -45976, 28546, 15306, -44963, 33088, 9405, -43264, 37093, 3274, -40726, 40524, -2892, -37450, 43189, -9003, -33558, 45123, -15025]
1008a5025j3996P5254o6939l150P0297p2420P594O4175p6587J8204N6834p9213
1020c4972K8424M8465q0465L8058L9442q0249M6835K9688p8566N4786J9422p5601
1032d4733O1897Q886p1189O7760j884o5616P2539j2624n8873P6061k3194n0962
1044d1932P8159l3321m2220P8834m2922l2446P7916n1639k2138P5472n9324j1318
1056b6879P1532o5906m47O6258p0939J0345N9652p4592K0856N1886p6572L0634
1068d172M3242p6944L9626L4053p6012M7687K4428p3531N4630J4534o9824O0401
1080A8118M565o4944O4948n073n9047O8298j4507n2344P0528k3520m4962P1600
1092C3660l2021l6875P1464m0030k8233P0248m7273j9287O7909n3744j0015O4431
$$ y = [-15025, -29021, 46233, -20706, -23856, 46441, -25979, -18385, 45790, -30797, -12593, 44241, -34972, -6548, 41917, -38548, -490, 38952, -41297, 5538, 35226, -43340, 11446, 30868, -44733, 17164, 26050, -45139, 22621, 20737, -44879, 27660, 15036, -43837, 32224, 9030, -41932, 36227, 2906, -39314, 39520, -3402, -35848, 42068, -9571, -31709, 43763, -15561, -26879, 44653, -21253, -21700, 44558, -26381, -16036, 43616, -30976, -10120, 41766, -34806, -4172, 39070, -37874, 1752, 35805, -40207, 7480, 31908, -41623, 13007, 27541, -42283, 18118, 22683, -42261, 22687, 17614, -41433, 26865, 12358, -39986, 30542, 7022, -37940, 33660, 1639, -35236, 36228, -3802, -32035, 38213, -9060, -28347, 39562, -14182, -24197, 40234]
1104D0234n9296o02N9916o3930Q847N4409o7379J8157M7823o9616K7049M0470
1116C6082p0595L5560L2332p0318M3196K3799o8637N0026J4845o5902N5921N737
1128B2046o1951O0786l414n6998O4546j2401n1054O7080k1109m4249O8582k9429
1140B435l6822O8883l7192k8783O8046m4469k0137O6044n0921j1187O2918n6486
1152a7671k075N8743o1330P395N3374o4948J6622M7012o7379K5731L9704o8544
1164c3366L4220L1579o8226M2072K2826o6769M9189J3644o3868N5176M325n9717
1176c8915O0008n070n4311O3470j4091m8075O5668k2757m0922O6593l0730l3174
1188c2306O6102l7969k5039O4640m4422j6516O1774m9802q014N8049n4270N39
$$ y = [40234, -19062, -19664, 40252, -23678, -14831, 39578, -27801, -9644, 38179, -31437, -4388, 36082, -34513, 1047, 33379, -36939, 6257, 30056, -38581, 11445, 26290, -39612, 16309, 22046, -39905, 20881, 17467, -39531, 25015, 12614, -38440, 28640, 7531, -36718, 31864, 2435, -34387, 34496, -2696, -31479, 36567, -7902, -28039, 38005, -12916, -24103, 38815, -17671, -19746, 38997, -22333, -14938, 38436, -26512, -9890, 37122, -30257, -4526, 35178, -33366, 854, 32433, -35793, 6279, 29105, -37664, 11525, 25169, -38699, 16477, 20802, -38915, 21093, 16023, -38288, 25182, 11091, -36984, 28684, 5927, -34995, 31598, 868, -32306, 33796, -4173, -29212, 35428, -8994, -25510, 36264, -13538, -21552, 36497, -17773, -17234]
1200a7234N3406n7848Q923M7982o0346J7056M1757o1843K4803L4925o2234L2080
1212A427K7608o1742L8875J9813o0052M4835J1688n7333M9991L464n3601N4243
1224A9216m794m9074N7494j2829m3542N9541k0535l7378O0635k7699l0755O0599
1236C0879l4336k3605N9540m0327j6094N7453m5528q456N4460m9942q12N0656
1248C3888n3467O895M5897n6102J4327M0666n7956K1597L4673n8820K8573K7987
1260B8158n8699L5181K0846n7637M1333J3084n5478M6714N170n2323N1322l042
1272A4629m8130N5016j1292m2882N7615j9244l6876N9091k6890l0100N9395l3976
1284c644k2723N8474m0398j4841N6290m5762o873N3067n0309J149M8911n3715
$$ y = [-17234, 36172, -21676, -12753, 35229, -25117, -8061, 33696, -28147, -3344, 31581, -30653, 1427, 29035, -32707, 6168, 25981, -34071, 10764, 22452, -34881, 15110, 18574, -35027, 19216, 14422, -34652, 22842, 10013, -33529, 26012, 5477, -31901, 28734, 1035, -29720, 30879, -3457, -27062, 32478, -7849, -23943, 33510, -12018, -20474, 33986, -15956, -16768, 33888, -19579, -12684, 33213, -22889, -8562, 32104, -25852, -4255, 30418, -28402, 171, 28158, -30541, 4640, 25486, -32151, 9182, 22266, -33212, 13502, 18672, -33651, 17671, 14629, -33501, 21515, 10223, -32659, 24956, 5712, -31164, 27927, 1037, -29063, 30332, -3644, -26367, 32107, -8291, -23132, 33158, -12604, -19477, 33590, -16719, -15570, 33341, -20374]
1296b0374R057M3730n5930J6543L7853n7204K3727L1467n7299L0226K4483n6294
1308c0015L6122J7197n4454M1348R805n1662M5752K285m8029M9337n216m3541
1320c1071N2008j2495l8380N3754j9630l2539N4620k6229k6219N4378l2378j9463
1332b3644N3227l7966j2194N1073m2650n053M7876m6414K011M4118m9395R135
1344i876L9419n1412J5828L4219n2443K2097K8561n2545K7811K2543n1767L2963
1356E398J6272n0294L7680R770m7957M1685L154m5019M5034l391m1274M7679r913
1369H824l6933M9537j6410l1814N0677k2665k6322N0985k8600k0233N0427l4124
1381f651j3732M9023l9162o763M6488m3410K80M3217m6923P347L9010m9463J4331
$$ y = [-20374, -11317, 32413, -23517, -6974, 30879, -26325, -2598, 28869, -28430, 1796, 26279, -30015, 6107, 23304, -31150, 10198, 20003, -31659, 14093, 16378, -31651, 17686, 12470, -31071, 20937, 8442, -29938, 23816, 4186, -28353, 26267, 38, -26181, 28197, -4181, -23644, 29583, -8383, -20577, 30496, -12154, -17207, 30669, -15745, -13734, 30384, -19011, -9876, 29543, -21869, -6041, 28178, -24265, -2168, 26393, -26152, 1659, 24202, -27565, 5398, 21670, -28624, 9056, 18826, -29131, 12554, 15708, -29311, 15723, 12332, -28942, 18737, 8824, -28109, 21428, 5018, -26796, 23881, 1216, -25106, 25879, -2721, -22954, 27473, -6651, -20383, 28640, -10522, -17285, 29203, -14207, -13927, 29290, -17633, -10286, 28724, -20739, -6408]
1394f408L4063n1099K1057K8404n1640K7192K2290n1115L2807J5719m9669L7722
1406I323Q919m7223M1855K156m4007M5204m716l9928M7573j1414l5161M9091j7720
1419C952k9823M9704k3734k3956M9402k9248j7784M8281l4219j1333M6275l8526
1431a1009m597M3465m2235K139L9786m4988Q781L5376m6882J5231L0381m7947
1443b2499K1308K4896m8029K6894J8960m7224L1864J2760m5425L6109O430m2908
1455b6864L9658J51l9602M2319n955l5724M4194j1783l1288M5170j7249k6442
1467b3415M5443k2342k1309M5112k7019j6052M4082l1240j0405M2267l4872m758
1479a4508L9882l8119J092L6894m0707O868L3258m2601J2652K9015m3910J8233
$$ y = [-6408, 27655, -23444, -2387, 26017, -25623, 1569, 23859, -27256, 5551, 21270, -28399, 9323, 18242, -28981, 12874, 15030, -28977, 16227, 11511, -28417, 19156, 7742, -27419, 21672, 3952, -25871, 23833, 99, -23857, 25545, -3703, -21487, 26794, -7425, -18758, 27517, -11009, -15606, 27859, -14376, -12237, 27549, -17439, -8658, 26718, -20164, -4933, 25448, -22499, -1191, 23705, -24324, 2570, 21530, -25694, 6170, 18930, -26495, 9614, 16044, -26864, 12794, 12945, -26657, 15662, 9707, -26017, 18177, 6394, -24894, 20276, 3027, -23415, 22028, -314, -21623, 23489, -3530, -19582, 24500, -6740, -17145, 25122, -9750, -14508, 25374, -12745, -11653, 25241, -15466, -8598, 24660, -17941, -5289, 23726, -20184, -1951]
1491a951K4249m4370K3560J9009m4085K8539J3414m3089L3008P443m1069L6812
1503A1470J450l8363L9937m577l5065M2305j0539l0928M3821j6211k6350M4539
1515B1489k1564k1307M4403k6413j5933M3444l0783j0249M1775l4657m403L9277
1527B5079l7880J524L6096m0291P276L2383m2016J2945K7927m2984J8374K3130
1539B1563m3257K3570J7828m2772K8277J2157m1282L2336O334l9159L5949L34
1551A1878l6189L8792n748l2552M0750j1454k8320M1949j6934k3563M2256k1979
1563a114j8453M1762k6559j3065M0386l0299p640L8322l3471k209L5716l6100
1575a2724L142L2497l7856Q186K8836l9058J3207K4705l9544J7741K0413l9491
$$ y = [-1951, 22298, -22072, 1488, 20497, -23588, 4951, 18365, -24724, 8284, 15727, -25342, 11470, 12920, -25443, 14494, 9917, -25148, 17157, 6618, -24310, 19511, 3300, -23050, 21489, -75, -21382, 23021, -3392, -19325, 24119, -6664, -16913, 24862, -9795, -14198, 25079, -12801, -11277, 24819, -15472, -8196, 24187, -17829, -4884, 23043, -19941, -1567, 21563, -21694, 1876, 19704, -23068, 5209, 17366, -23916, 8420, 14754, -24405, 11544, 11878, -24311, 14481, 8733, -23819, 16931, 5477, -22843, 19106, 2172, -21391, 20865, -1114, -19567, 22195, -4364, -17429, 22957, -7342, -14982, 23340, -10131, -12340, 23376, -12724, -9582, 22915, -14941, -6755, 22081, -16977, -3770, 20935, -18609, -868, 19545, -19946]
1587a9946K2008J5664l8748K5969J0769l7475K9453N788l5592L2389O76l3054
1599b2099L4885m509k9997L6839r656k6463L8151j4646k2426L8827j9364j7929
1611a8387L8688k3799j3115L7944k7727q103L6507l1086l046L4362l3932K054
1623i640L1640l6043P172K8326l7641J2112K4605l8489J6740K0451l8667K1091
1635A657J5928l8163K5129J1071l6970K8674O161l5273L1773J044l2842L4294
1647A2483m139k9780L6263r350k6230L7626j4377k2086L8175j9177j7384L7983
1659B0007k3618j2482L7062k7576p222L5358l1007j860L2978l3642L405K9872
1671B1275l5659Q606K6286l6866J3453K2314l7387J8014J7827l7106K2128J3197
$$ y = [-19946, 2062, 17726, -21022, 4947, 15716, -21759, 7694, 13482, -22110, 10279, 10955, -22099, 12786, 8277, -21720, 15119, 5463, -21000, 17151, 2505, -19921, 18906, -458, -18387, 20301, -3498, -16613, 21331, -6396, -14499, 22008, -9078, -12124, 22238, -11694, -9640, 22000, -14043, -6871, 21455, -16186, -4074, 20531, -17958, -1218, 19233, -19434, 1657, 17585, -20578, 4551, 15622, -21348, 7326, 13487, -21786, 9987, 11031, -21811, 12483, 8344, -21436, 14827, 5477, -20753, 16873, 2496, -19590, 18585, -592, -17976, 20007, -3611, -16093, 20969, -6607, -13829, 21529, -9478, -11338, 21640, -12002, -8597, 21275, -14384, -5778, 20508, -16358, -2905, 19409, -17978, 36, 17863, -19243, 2885, 16082]
1683A6082l6105K5631Q359l4498K8691L588l2352L1009j065k9688L2920n774k6529
1696a9731L4137j0225k3047L4910j4498j9180L5036j8458j5042L4525k2163j0570
1708a4306L3466k5453o099L1967k8276j454K9802l0657L217K7142l2428P815K4046
1721A8782l3671J2138K0527l4221J6343J6638l4206K0172J2448l3561K3595Q213
1733A3197l2369K6470L990l0653K8974m96k8397L0895m825k5715L2471r184k2594
1746a8236L3346j3166j9186L3728j7029j5406L3608k0700j1267L2793k4061o851
1758a2427L1433k6956k465K9632k9497K219K7100l1459O865K4127l2978J1507
1770b899K0520l3648J5802J6506l3718J9923J2175l3070K3601P574l1756K6740
$$ y = [16082, -20023, 5608, 13967, -20531, 8160, 11748, -20604, 10405, 9340, -20348, 12572, 6798, -19731, 14406, 4181, -18866, 16044, 1546, -17634, 17402, -1056, -16098, 18427, -3736, -14306, 19160, -6293, -12392, 19575, -8701, -10155, 19647, -11010, -7793, 19349, -13079, -5264, 18782, -14889, -2751, 17776, -16445, -102, 16536, -17670, 2502, 14950, -18611, 4984, 13197, -19172, 7298, 11288, -19365, 9609, 9113, -19284, 11611, 6786, -18929, 13542, 4358, -18236, 15110, 1944, -17242, 16486, -543, -15949, 17659, -3041, -14308, 18485, -5576, -12427, 19006, -7950, -10415, 19217, -10280, -8061, 19039, -12420, -5555, 18572, -14406, -2899, 17621, -16027, -225, 16281, -17437, 2486, 14661, -18409, 5192, 12766, -18990, 7750]
1782G750K911k9839K9245j788k7253L1096o257k4240L2363j0690k0775L2958j4723
1795G58j7003L2932j8403j2998L2173k1607q821L0977k4484m555K9252k6798l42
1808h919K7077k8728L892K4389l0053P977K1326l0880J1963J7936l1154J5648
1820D74J4265l0991J9083J0281l0081K2124O191k8711K4730K063k6854K6857k149
1833G282k4526K8547o241k1752K9647j0128j8799L0264j3720j5360L0140j7006
1845a652j1875K9667j9950q201K8748k2676m390K7293k4772o77K5494k6698L199
1858f490K3184k8066O933K0555k8999J0611J7620k9482J4011J4384k9537J7458
1870B182J0724k8954K0473O931k8072K3289K941k6337K5518j238k4298K7473n288
$$ y = [7750, 10661, -19178, 10067, 8279, -18974, 12122, 5865, -18375, 13988, 3298, -17477, 15481, 758, -16245, 16687, -1716, -14714, 17459, -4148, -12969, 18008, -6476, -11031, 18221, -8577, -8919, 18158, -10570, -6678, 17711, -12342, -4365, 16961, -13919, -1956, 15980, -15174, 474, 14739, -16252, 2831, 13112, -16969, 5155, 11346, -17365, 7365, 9428, -17426, 9431, 7282, -17244, 11303, 5062, -16690, 12957, 2829, -15970, 14294, 574, -14786, 15354, -1652, -13527, 16140, -3810, -12011, 16737, -5939, -10329, 16964, -7808, -8485, 17009, -9689, -6490, 16694, -11372, -4439, 16116, -12883, -2272, 15348, -14134, -123, 14261, -15276, 2182, 12906, -16048, 4425, 11356, -16716, 6573, 9514, -16823, 8695, 7457, -16841, 10632, 5344]
1883E344k1782K8867r392j8718K9618j3253j5311K9748j6810j1616K9434k0181
1895d052p671K8398k2956l625K6821k5159K97K4825k7051M287K2320k8270Q183
1908c653J9398k8969J1712J6234k9103J5117J2794k8768J8163R118k7914K0879
1920E008N392k6541K3163J552k4760K5061k297k2497K6494o073j9844K7418r806
1933B270j6725K7758j3188j3506K7767j6438r955K7031j9228o219K5882k1651
1945f202k550K4389k3680J192K2286k5094M752J9867k6132Q231J7260k6695J1389
1958i87J4341k6676J4234J1365k6333J6901Q110k5568J9300M826k4352K1241J522
1971G924k2831K2940j799k0948K4247n025j8823K5272q370j6230K5787j1560j3402
$$ y = [5344, -16438, 12429, 3037, -15681, 13937, 684, -14627, 15121, -1689, -13305, 16129, -4052, -11723, 16675, -6281, -9906, 16915, -8244, -7947, 16878, -10173, -5886, 16434, -11836, -3653, 15745, -13224, -1512, 14722, -14381, 736, 13530, -15238, 2925, 12043, -15871, 5008, 10400, -16141, 7022, 8574, -16186, 8875, 6578, -15919, 10575, 4502, -15342, 12076, 2270, -14455, 13303, 115, -13391, 14376, -2062, -12017, 15014, -4214, -10433, 15449, -6202, -8752, 15637, -8043, -6851, 15435, -9659, -4907, 14960, -11172, -2941, 14319, -12376, -987, 13354, -13322, 912, 12277, -14056, 2845, 10955, -14613, 4687, 9513, -14839, 6402, 7924, -14907, 8033, 6234, -14714, 9533, 4508, -14315, 10957, 2587, -13643, 12144, 584, -12818]
1984a2818K5979j4561j0304K5678j7427o851K4836j9907l380K3551k2044K34K1849
1997A4835k3853L891J9703k5166P433J7181k5921J0734J4268k6130J3931J1121
2009A2027k5866J6696P847k5211J9284M499k4046K1406R56k2403K3066k469k0369
2022a4583K4439n873j7987K5160r130j5295K5504j2135j2378K5446j5055r231
2034a1118K4906j7595n837K3825j9875k292K2305k1763J142K0433k3152M616J8129
2047A3724k4152Q000J5436k4605J1120J2571k4655J4016R433k4131J6578O249
2059I584k3159J8666K992k1851K0504k83k0077K1825l411j8048K2729o339j5833
2072a2701K3218r204j3278K3434j1843j0653K3163j4150p887K2504j6245n084
$$ y = [-12818, 13161, -1400, -11704, 13974, -3453, -10304, 14532, -5375, -8755, 14796, -7248, -7014, 14835, -9018, -5127, 14576, -10590, -3157, 14024, -11897, -1163, 13105, -13025, 906, 12027, -13839, 2857, 10704, -14507, 4777, 9276, -14770, 6636, 7592, -14811, 8255, 5786, -14583, 9856, 3983, -14004, 11156, 2026, -13269, 12235, 100, -12278, 13168, -1887, -11118, 13788, -3807, -9644, 14181, -5694, -7986, 14319, -7444, -6302, 14131, -9021, -4405, 13724, -10428, -2428, 13008, -11597, -477, 12094, -12561, 1455, 10888, -13243, 3335, 9584, -13575, 5091, 8083, -13768, 6736, 6453, -13624, 8201, 4790, -13258, 9471, 3132, -12701, 10517, 1313, -11965, 11469, -374, -11027, 12136, -2014, -9901, 12603, -3642, -8726]
2084h726K1665j8149k167K0399j9676Q17J8774k0912L695J6938k1993O724J4691
2097A2080k2484R478J2221k2630J2200R572k2473J4661O662k1891J6937L618k0841
2110a2890J8829N74j9448K0347k482j7672K1546n528j5583K2251q354j3239K2609
2123A0960j1111j0672K2578j3583p981K2169j5844n148K1377j7848k138K0164
2135A2923j9495P55J8538k0652L762J6600k1588O700J4327k2204R606J1795k2265
2148a1198J2202R101k1956J4579O200k1264J6777L082k0034J8549n5j8483K0011
2161G511l159j6501K0872o077j4292K1571q986j1776K1628j1620r058K1274j3812
2174b425o318K0562j5773l516J9456j7455o58J8112j8711K023J6388j9515M581
$$ y = [-8726, 12939, -5210, -7377, 13022, -6654, -5837, 12937, -7975, -4280, 12658, -9335, -2611, 12080, -10404, -926, 11295, -11335, 865, 10437, -12036, 2625, 9287, -12604, 4333, 7951, -12890, 5939, 6513, -12935, 7412, 4930, -12742, 8804, 3276, -12307, 9944, 1590, -11649, 10960, -151, -10823, 11755, -1828, -9809, 12360, -3484, -8632, 12745, -5103, -7241, 12923, -6572, -5817, 12721, -7931, -4169, 12431, -9157, -2457, 11870, -10334, -728, 11067, -11198, 1004, 10105, -11851, 2728, 8928, -12336, 4441, 7523, -12511, 6038, 5983, -12500, 7511, 4352, -12149, 8723, 2646, -11646, 9925, 939, -10837, 10791, -829, -9887, 11387, -2425, -8743, 11819, -3954, -7470, 11986, -5469, -6127, 11985, -6726, -4703, 11685, -7830, -3249]
2187c249J4525k0090P085J2361k0330R419J0174k0226J1542P804j9855J3489N280
2200G929j9045J5145K761j8106J6693J15j6752J7879k537j5191J8878n138j3247
2213a0616J9376p578j1224J9662r975q855J9470j2074o561J9183j4123l845J8283
2226A1123j5763j356J7158j7108J187J5859j8228L731J4142j8903O153J2335j9417
2239i087Q533J0264j9503J0627Q087j9343J2741N629j8744J4460L190j7876J6057
2252E035O32j6747J7370k014j5174J8345m594j3375J9001p101j1332J9312r578
2265b20q951J9310j1889o423J8746j3791l792J7903j5595j056J6616j6888J658
2278d372J5108j7912M296J3175j8521O730J1241j8778R045R016j8679J1081O623
$$ y = [-3249, 11276, -8814, -1729, 10632, -9698, -279, 9895, -10331, 1211, 9015, -10840, 2649, 7929, -11116, 4029, 6790, -11316, 5377, 5492, -11260, 6619, 4082, -11109, 7769, 2631, -10616, 8760, 1182, -10042, 9620, -355, -9210, 10260, -1814, -8375, 10808, -3315, -7160, 11123, -4640, -5996, 11162, -5946, -4759, 11100, -7128, -3397, 10745, -8158, -2005, 10330, -9087, -554, 9710, -9793, 834, 8921, -10422, 2319, 7948, -10796, 3664, 6854, -11022, 5035, 5667, -11080, 6290, 4276, -10898, 7447, 2853, -10522, 8479, 1378, -9954, 9358, -220, -9171, 10139, -1750, -8173, 10573, -3218, -7010, 10893, -4702, -5758, 10858, -6030, -4372, 10736, -7176, -2880, 10295, -8226, -1496, 9745, -9033, 12, 9028, -9651, 1430, 8053]
2291H053j8148J2824M313j7387J4423J843j6306J5650o14j4936J6598k868j3426
2304i981J7187n059j1683J7613p273r749J7685r196p729J7400j1021n510J6928
2317I612j2687l161J6056j4081q77J4948j5209J494J3574j6122L849J1880j6657
2330g381N990J0219j6895Q010Q193j6892R950O198j6539J1615M026j5906J2993
2343C581J896j5038J4247k36j4054J5341k375j2736J5996m424j1155J6397o457
2356I83r500J6649q361p719J6679j0139n759J6327j1810l613J5693j3285j349
2369e204J4682j4474Q82J3509j5469L238J1984j6202N507J0188j6498P697Q241
2382H081j6614R656O147j6284J1456L889j5661J3028J580j4712J4277p30j3390
$$ y = [8053, -10095, 2729, 7042, -10345, 4078, 5921, -10385, 5265, 4651, -10285, 6313, 3445, -9981, 7206, 2147, -9536, 8077, 804, -8945, 8740, -456, -8185, 9215, -1806, -7316, 9612, -3075, -6236, 9820, -4261, -5138, 9810, -5399, -3905, 9669, -6453, -2604, 9276, -7381, -1391, 8828, -8067, -57, 8136, -8756, 1194, 7392, -9147, 2468, 6494, -9412, 3581, 5477, -9561, 4686, 4450, -9604, 5737, 3362, -9374, 6622, 2198, -8957, 7440, 983, -8517, 8132, -229, -7948, 8731, -1408, -7167, 9160, -2650, -6263, 9430, -3855, -5204, 9478, -4996, -4114, 9395, -6074, -2836, 9148, -7054, -1547, 8641, -7857, -160, 8081, -8533, 1123, 7270, -9014, 2442, 6331, -9330, 3698, 5278, -9434, 4843, 4113, -9277]
2395i277J5188k985j1973J5838n042j0301J6119p135q447J6161q887o522J5838
2408H575j0544m550J5412j1920k455J4481j3141l92J3488j4065J704J2110j4681
2421e978L722J0610j5098N658Q994j5304P499P104j5128R180N234j4689J0565
2434B369L270j4108J2031J143j3185J3052r87j1925J3770k867j0690J4331m736
2447A468r176J4522o533p404J4556q135n841J4318r576m016J3875j0873k202J3159
2461H142j1887l58J2277j2815J423J1233j3452L198R998j3943M915Q684j4218
2474f803O621P127j4280Q271N389j4099R766L573j3569J1024J756j2898J2169
2487D047k76j1898J3146k269j0696J3783m207r210J4162o141p503J4288p898n778
$$ y = [-9277, 5911, 2926, -9047, 6791, 1749, -8552, 7567, 432, -8015, 8146, -741, -7263, 8575, -1969, -6519, 8893, -3027, -5482, 8999, -4142, -4534, 8954, -5111, -3407, 8703, -5978, -2256, 8354, -6744, -1086, 7908, -7396, 103, 7207, -7921, 1259, 6493, -8196, 2369, 5639, -8469, 3562, 4705, -8480, 4572, 3585, -8340, 5430, 2563, -8127, 6204, 1468, -7708, 6814, 281, -7123, 7433, -702, -6543, 7775, -1801, -5817, 8058, -2815, -5017, 8142, -3745, -4103, 8174, -4641, -3218, 8015, -5437, -2239, 7759, -6184, -1269, 7415, -6803, -182, 6945, -7335, 936, 6325, -7774, 1992, 5565, -8004, 3020, 4776, -8122, 4047, 3771, -8127, 5019, 2750, -7946, 5837, 1630, -7580, 6582, 441, -7062, 7226, -672, -6450]
2501f450J4026r408l869J3643j0828j926J2932j2012n0J1996j2876J881J0878
2514G937j3589L783R421j3888N514P951j4004P150O309j3892Q630M534j3468R997
2528B385K664j2828J1075R07j1994J2045j018j0948J2749k779r670J3232m651
2541A169q228J3422o302o528J3311p831m853J3071r241l022J2387j0288j269J1685
2555G483j1305N57J0598j1931K252R418j2388L910Q244j2732N401O814j2700O889
2569E10N343j2561Q030L899j2160R161K375j1730J0219P47j0969J0962q14j0055
2583g043J1590k373r014J2067l978p788J2282n382o520J2409o810n075J2284q113
2597a464l540J1946r403j803J1271j0368n0J0429j1147J557R452j1741L278Q278
$$ y = [-6450, 7576, -1832, -5701, 7942, -2886, -4812, 8120, -3892, -3942, 8054, -4822, -2941, 7937, -5652, -1869, 7552, -6336, -822, 7129, -6875, 275, 6584, -7308, 1322, 5856, -7612, 2385, 5049, -7779, 3296, 4203, -7791, 4254, 3236, -7712, 5037, 2258, -7412, 5820, 1169, -7059, 6363, 61, -6467, 6844, -987, -5840, 7231, -2010, -5032, 7355, -2933, -4202, 7483, -3822, -3265, 7333, -4598, -2346, 7072, -5316, -1406, 6838, -5894, -493, 6321, -6379, 510, 5853, -6708, 1322, 5221, -6939, 2222, 4597, -7133, 3086, 3833, -7136, 3826, 3012, -7043, 4547, 2174, -6840, 5227, 1249, -6539, 5743, 361, -6159, 6250, -560, -5635, 6649, -1464, -5004, 6942, -2461, -4264, 7007, -3361, -3411, 7018, -4129, -2572, 6880, -4861, -1583, 6695]
2611F695j2323N017O879j2392O442N470j2260P710L933j1985Q974K339j1502J0067
2625C064O61j0724J0837r35r835J1501k571q729J1990m132p518J2166n609o133
2639e967J2188p020m619J1947q288k947J1430r363j302J0760j0261L75R851j1034
2653d250K084Q726j1507L734P403j1682N229O041j1721O654M459j1457P874K890
2667D477j0955Q916J329j0269R692j44r473J0357j692q510J0750l063p401J1001
2681E015m441o214J1079n684m922J0946o788l633J0620p745k373J0225q576r91
2695c482R661r356L99Q930r971J867P893j0395L250O908j0622M556N691j0666
2709e337N787M372j0531O961L059j0241P965J669r686Q800J64r003R500j219q205
$$ y = [6695, -5628, -611, 6268, -6124, 318, 5788, -6472, 1238, 5171, -6814, 2160, 4499, -7003, 3064, 3725, -6999, 3838, 2903, -6932, 4569, 1998, -6731, 5259, 1127, -6391, 5775, 166, -5967, 6221, -799, -5418, 6529, -1759, -4706, 6724, -2639, -3941, 6819, -3442, -3067, 6784, -4250, -2166, 6560, -4947, -1213, 6190, -5492, -263, 5778, -5943, 711, 5170, -6287, 1587, 4477, -6478, 2438, 3767, -6502, 3190, 3046, -6427, 3930, 2238, -6272, 4478, 1415, -5986, 5015, 574, -5640, 5439, -245, -5167, 5779, -1009, -4642, 5978, -1767, -4140, 6085, -2491, -3482, 6179, -3177, -2778, 6152, -3819, -1952, 5941, -4454, -1204, 5704, -4918, -362, 5329, -5337, 450, 4822, -5709, 1252, 4311, -5930, 2035, 3704, -5982, 2818, 2982, -6021, 3479, 2260, -5945]
2724e945J0072k702p150J0365l967o080J0535n252m875J0481o388l604J0294p443
2738a659k314R933q367r29R388r200M78Q687r740J814P725j0173L241O681j0469
2753d904M570N539j0510N796M248j0360O941K849j0021P968J416r451Q758o5q610
2768e836R372j560p633R812l000o569J0085m286n406J0067n470m115R939o617
2782a217k736R515p516j392Q939q238j45Q384q826J195P440r103K315O563r388
2797d210L469N677r515M549M612r517N607L529r292O464K278q875P292J014q363
2812e281P954k72p676Q493j367o977Q845k656n934R008l787m938R146m846l889
2827d177R006n860k699Q709o649j524Q288p401k89P680p967R02P033q453K039
$$ y = [-5945, 4127, 1425, -5725, 4640, 673, -5407, 5128, -124, -4999, 5482, -906, -4510, 5784, -1659, -3973, 5960, -2407, -3336, 6052, -3148, -2670, 6017, -3723, -1909, 5816, -4357, -1116, 5565, -4904, -334, 5205, -5305, 491, 4739, -5621, 1320, 4169, -5852, 2116, 3532, -5919, 2839, 2774, -5836, 3536, 1976, -5657, 4155, 1155, -5414, 4671, 385, -5021, 5046, -424, -4539, 5400, -1217, -3953, 5562, -1954, -3346, 5593, -2645, -2790, 5594, -3232, -2037, 5403, -3700, -1385, 5178, -4210, -741, 4936, -4579, -30, 4582, -4935, 672, 4201, -5091, 1373, 3651, -5224, 2068, 3082, -5281, 2673, 2401, -5275, 3218, 1851, -5126, 3719, 1063, -4871, 4137, 350, -4588, 4558, -288, -4177, 4829, -1031, -3730, 4979, -1670, -3194, 5094, -2307, -2596, 5084, -2883, -1981, 5052, -3401, -1362]
2842a362O225q730L163N287q837M183M395q969N257L312q782O140K184q446O886
2857A906J102q121P621j59p445Q219j371o747Q623k579n893Q924l623m930Q962
2872D489m799l783Q830n773k538Q482o624j348Q061p355r1P390p930J234O645
2887D890q332K373N706q624L561M741q623M624L685q585N529K582q304O305J510
2902C038p887O993L56p334P481p66o658P924j805n890Q147k915n003Q226l810
2917I7m090Q181m726l084Q032n541k076P731o215j020P268o841J17O736p313J178
2933a566N973p645K292N151p785L240M309p839M108L335p737M971K494p630N706
2948A377J396p140O339L59o722O806n82o185P228j591n479P487k534m778P641
$$ y = [-1362, 4863, -3867, -704, 4583, -4254, -71, 4324, -4645, 612, 3924, -4858, 1282, 3466, -4980, 1906, 3008, -5113, 2508, 2349, -5096, 3123, 1752, -4995, 3628, 1049, -4844, 4080, 457, -4473, 4489, -310, -4093, 4737, -1036, -3574, 4908, -1716, -3064, 4997, -2358, -2449, 4941, -2989, -1755, 4890, -3442, -1069, 4637, -3987, -426, 4315, -4308, 316, 4001, -4584, 945, 3527, -4777, 1528, 3038, -4849, 2144, 2500, -4834, 2647, 1881, -4777, 3147, 1342, -4548, 3599, 684, -4319, 3907, 97, -3993, 4188, -538, -3622, 4410, -1131, -3207, 4524, -1691, -2711, 4557, -2284, -2167, 4569, -2744, -1566, 4407, -3238, -946, 4205, -3580, -340, 3969, -3870, 238, 3573, -4164, 807, 3301, -4329, 1377, 2773, -4367, 1972, 2331, -4391, 2415, 1833, -4352, 2876, 1285, -4194, 3293, 759, -4019, 3622]
2963C622l414m014P750m329l137P669n101k221P439n742j127O990o462j39O614
2978D398o978Q99O062p358J965N158p600K980M438p711L897L463p691M859K377
2993C158p369N646J301p087O272K71o547O816p55n984P238j853n226P471k887
3008D65m324P499l716l492P485m573k594P349n339j558P008n959n92O587o450
3023b204L38O077o905J413N322p160K387M587p266L242L700p167M012K875p103
3038c852M781J953o859N471Q93o391N948kn913O337r63n240O655j939m513O749
3054C115k821l708O810l628k954O743m240k122O553m891j296O219n408m80N959
3069C851n867L62N430o244J329M878o502K065M281o680K861L613o728L620K881
$$ y = [3622, 208, -3806, 3944, -385, -3522, 4147, -954, -3175, 4264, -1478, -2605, 4385, -2077, -2216, 4398, -2580, -1681, 4381, -2977, -1012, 4146, -3454, -474, 3964, -3747, 150, 3613, -4078, 781, 3158, -4211, 1435, 2736, -4351, 1921, 2192, -4355, 2461, 1706, -4278, 2960, 1107, -4119, 3352, 465, -3859, 3640, -76, -3568, 3917, -656, -3250, 4099, -1240, -2798, 4210, -1749, -2341, 4246, -2204, -1866, 4211, -2694, -1281, 4041, -3119, -732, 3855, -3411, -169, 3531, -3636, 376, 3251, -3852, 929, 2882, -3977, 1494, 2387, -4004, 1944, 1942, -3971, 2366, 1403, -3837, 2818, 879, -3634, 3115, 294, -3414, 3396, -232, -3186, 3557, -683, -2805, 3748, -1143, -2439, 3780, -1628, -2108, 3851, -2016, -1654, 3776, -2468, -1139, 3739, -2763, -698, 3583, -3097, -236, 3377, -3351, 269, 3150]
3084C150o689M296J958o426M939J128o133N418L64n786N929o93n221O320j519
3099A035m676O543k490l811O679l353l047O566m008k280O463m712j386O246n350
3114a581m02N777n770M45N263o149J369M671o400K200M015o567L008L328o517
3129c310L732K496o417M363J679o194N008Q35n916N516m2n430N890r34m844O134
3145B566j791m169O292k647l430O371l422k617O156m013j786N880m598r54N651
3160C489n106r2N165n504P23M657n645J484M031n798K243L392n919K974K672n811
3176c045L567J991n701M137J223n472M555N41n127M993k03m728N182q13m220N378
3192B258j547l837N723k306l246N745k893k589N703l585j836N542m068j167N315
$$ y = [3150, -3539, 757, 2715, -3711, 1228, 2356, -3777, 1641, 2005, -3781, 2148, 1455, -3766, 2554, 1035, -3641, 2902, 412, -3399, 3280, -73, -3120, 3446, -562, -2842, 3621, -1091, -2477, 3769, -1581, -1983, 3794, -1976, -1531, 3732, -2417, -1048, 3623, -2777, -577, 3438, -3129, -121, 3207, -3310, 422, 2918, -3499, 864, 2543, -3651, 1357, 2192, -3724, 1792, 1750, -3680, 2210, 1276, -3568, 2566, 775, -3394, 2898, 251, -3179, 3192, -230, -2847, 3309, -704, -2490, 3390, -1208, -2162, 3489, -1617, -1709, 3456, -2048, -1325, 3332, -2313, -829, 3202, -2596, -353, 3039, -2880, 94, 2766, -3045, 522, 2513, -3188, 949, 2172, -3300, 1255, 1796, -3331, 1662, 1459, -3269, 1913, 1100, -3120, 2258, 711, -3126, 2597, 291, -2955, 2790, -103, -2692, 3011, -574, -2410, 3132, -936, -2103, 3212]
3207C212m582l76N017n063M33M514n263J264L969n557J998L367n623K640K708
3222B658n550L308K050n506L927J245n289M434N19m992M817j92m648N226r79m207
3238c179N499j701l653N570k340l011N684l053k417N571l625j664N396m158q74
3253a955N119m586j99M780m963O07M282n232J421L735n447K129L093n456K793
3268A21K383n356L433J567n116L960Q41m796M296J96m546M732n70l996M839j266
3284G22l501N008j839l079N144k407k484N066k998j872M961l442j218M762l832
3299a009o60M504m183L9M111m424O05L762m670J204L392m892J886K849m912K442
3315D4K292m830K960J615m743L465R82m558L961L06m197M173l00l884M472r55
$$ y = [3212, -1370, -1746, 3271, -1792, -1359, 3155, -2108, -844, 3125, -2432, -434, 2933, -2690, -50, 2658, -2892, 416, 2466, -3040, 887, 2132, -3157, 1277, 1796, -3196, 1621, 1429, -3219, 2007, 1028, -3179, 2320, 619, -3034, 2536, 196, -2815, 2869, -184, -2601, 2970, -655, -2319, 3077, -1081, -1955, 3164, -1422, -1621, 3159, -1804, -1197, 3085, -2147, -726, 3009, -2438, -309, 2784, -2672, 121, 2504, -2852, 581, 2148, -2968, 992, 1833, -2963, 1333, 1529, -3017, 1715, 1145, -2851, 1988, 722, -2779, 2229, 390, -2689, 2455, 48, -2436, 2630, -368, -2240, 2721, -721, -1939, 2823, -1009, -1669, 2835, -1348, -1309, 2802, -1622, -1017, 2745, -1925, -721, 2671, -2221, -335, 2514, -2398, 44, 2336, -2494, 466, 2081, -2662, 803, 1785, -2773, 1188, 1494, -2703, 1470, 1170, -2714, 1758, 803]
3331H03l387M613j596k945M743k097k404M681k672j881M706l171j293M587l640
3346i53o80M283l952k8M084m348N13L738m533J241L211m721J781K781m763K443
3362I7K201m812K967J561m645L459R64m486L831L04m121M206m04l739M413j095
3378G01l201M513j639k731M605k258k149M515k778j501M372l189r03M173l587
3393a057k49L801l857K99L587m158Q53L180m211J439K679m314J889K230m291K405
3409B25J658m187K855J122m061L205O22l876L548J8l500L735m74l201L886r99
3425E76k829M016j490k372L996j938j891M004k384j432L948k890q81L778l158
3440i47k82L458l460K35L233l657O84K901l795J238K448l865J710K032l908K166
$$ y = [803, -2584, 2029, 433, -2512, 2231, 134, -2270, 2411, -261, -2142, 2564, -607, -1900, 2687, -953, -1633, 2650, -1302, -1330, 2754, -1594, -1081, 2657, -1876, -635, 2576, -2145, -364, 2417, -2346, 97, 2298, -2514, 453, 2014, -2631, 828, 1792, -2694, 1137, 1441, -2680, 1526, 1122, -2617, 1796, 701, -2500, 2013, 374, -2357, 2248, -10, -2159, 2356, -422, -1923, 2449, -740, -1643, 2530, -1057, -1306, 2495, -1362, -1063, 2524, -1634, -781, 2399, -1812, -373, 2306, -2008, -119, 2111, -2180, 225, 1883, -2304, 551, 1673, -2388, 817, 1439, -2437, 1111, 1129, -2371, 1364, 890, -2311, 1575, 576, -2253, 1763, 273, -2099, 1897, -41, -1932, 2072, -312, -1744, 2204, -686, -1567, 2211, -947, -1229, 2229, -1231, -996, 2237, -1420, -736, 2165, -1630, -392, 2056, -1809, -99, 1933, -1975, 191]
3456A91J609l911K587J120l738K914O17l585L187J77l422L478l03l144L713q99
3472E91k715L854j433k375M009j945j832L908k386j402L841k742q36L635l129
3487i57k87L428l362K13L134l601P65K687l620J292K289l794J808J795l666K241
3503C65J266l658K627Q17l519K933L83l341L228j61l072L418o63k649L526j066
3519D34k333L556j520j964L668j940j623L620k320j024L420k566o05L208k945
3534i34j09L009l088L55K669l190Q10K360l360J218J994l361J664J582l334K014
3550B99J075l145K298P58l133K631K46k871K781j49k572K925n38k385L096r48
3566C68k096L193j377j754L294j729j413L264k047j074L200k417n84L009k573
$$ y = [191, 1800, -2111, 476, 1596, -2142, 772, 1389, -2196, 991, 1168, -2254, 1224, 921, -2223, 1490, 591, -2124, 1730, 297, -2078, 1931, -14, -1846, 2062, -324, -1726, 2115, -627, -1463, 2172, -957, -1244, 2184, -1178, -965, 2169, -1432, -667, 2020, -1600, -308, 1981, -1813, -5, 1790, -1876, 365, 1631, -2027, 600, 1417, -2102, 831, 1214, -2127, 1101, 940, -2132, 1286, 623, -2026, 1500, 434, -1899, 1657, 137, -1827, 1841, -99, -1722, 1898, -422, -1446, 1974, -592, -1197, 2011, -934, -1043, 1966, -1122, -767, 1902, -1288, -478, 1882, -1478, -260, 1734, -1627, 37, 1619, -1715, 299, 1374, -1771, 527, 1285, -1848, 783, 1029, -1842, 939, 790, -1782, 1143, 605, -1780, 1316, 368, -1728, 1465, 88, -1666, 1628, -101, -1514, 1750, -297, -1371, 1829, -588, -1172, 1837, -736]
3581g36l21K972k931K00K686l124P14K323l173J094J958l210J529J611l213J863
3597B42J181l204K258P74l000K456L46k885K781j78k594K949n68k303L026r93
3613B88j957L154j384j654L130j750j187L069k167q07L043k435m10K800k527l7
3629h31K693k905M69K282k925P90K067k998J154J760l065J527J383k997J879R75
3645A258k941K152O02k749K444Q4k500K578k47k318K690o32j972K808j034j676
3661a453K793j326j372K781j641r44K715j978o20K594k160l09K471k359J53K171
3677A516k419L68K030k588P87J779k723J131J507k748J354J301k758J689R12k661
3693a523J995N74k590K209J54k355K347j74k192K497m70j948K555q63j646K701
$$ y = [-736, -1057, 1915, -1016, -816, 1870, -1254, -540, 1783, -1390, -296, 1662, -1548, -19, 1592, -1621, 242, 1423, -1781, 477, 1251, -1749, 707, 1053, -1832, 949, 771, -1823, 1126, 558, -1745, 1281, 288, -1669, 1485, 101, -1553, 1577, -173, -1360, 1709, -458, -1265, 1778, -657, -1067, 1733, -794, -831, 1862, -1043, -574, 1708, -1217, -427, 1640, -1358, -204, 1556, -1509, 18, 1401, -1596, 283, 1258, -1683, 469, 1071, -1678, 766, 850, -1650, 928, 681, -1637, 1053, 421, -1551, 1257, 223, -1453, 1340, 14, -1358, 1423, -218, -1162, 1553, -425, -1045, 1549, -611, -920, 1551, -808, -655, 1516, -903, -535, 1495, -1093, -306, 1473, -1250, -119, 1388, -1360, -6, 1295, -1463, 226, 1138, -1523, 472, 1046, -1544, 665, 819, -1536, 811, 637, -1555, 942, 472, -1476, 1079, 216, -1430, 1271]
3709A271j185j414K684j492j114K690j818o71K512k019k42K311k286P5K227k477
3725i48M96J912k524P45J734k620J126J366k633J419J160k630J707P99k623K008
3741D94M11k385K164J00k305K348k59j998K444o33j821K566r29j550K611j291
3757c3j193K583j606q19K437j814m16K262j996j32K157k177K15J862k262O03J644
3774A315k329Q50J343k320J142J109k308J373Q05k184J584N15k176J759K19k044
3790a347J981l8j856K026k99j685K082n69j506K216q87j212K262j198j010K200
3806A160j331p97K170j568m41K071j781k08J982j981J88J822k111M29J632k194
3822i58P80J359k161R31J085k095J210Q11k124J465M91j980J620K63j887J838
$$ y = [1271, 86, -1328, 1356, -136, -1250, 1440, -378, -1049, 1463, -556, -798, 1513, -773, -698, 1529, -948, -452, 1460, -1064, -319, 1415, -1205, -79, 1287, -1346, 73, 1233, -1397, 310, 1109, -1514, 494, 905, -1480, 684, 784, -1521, 827, 568, -1430, 1014, 381, -1440, 1126, 197, -1353, 1258, -33, -1226, 1357, -249, -1068, 1369, -445, -861, 1401, -595, -727, 1430, -747, -532, 1330, -932, -329, 1315, -1014, -164, 1179, -1141, 1, 1110, -1198, 175, 980, -1204, 380, 895, -1281, 478, 697, -1347, 634, 596, -1260, 766, 467, -1218, 864, 295, -1211, 1005, 118, -1094, 1168, -30, -1040, 1160, -171, -968, 1202, -366, -807, 1264, -517, -725, 1257, -724, -536, 1286, -825, -396, 1236, -958, -178, 1181, -980, -49, 1036, -1059, 151, 962, -1162, 303, 794, -1186, 434, 697, -1190, 648]
3838F48j20j693J875l09j619K102n81j493K153q61j227K174j114q72K053j314
3854a98o93K055j567l86K021j791j16J888j920K61J662k071M31J562k097Q12J224
3871A077k131J117Q88k042J268O98k031J474M10j905J675O0j688J759k22j502
3887a095J854m62j351J926p21j166J974r78q96J916j178o21J826j307m66J835
3903A090j547j44J669j651J16J529j721L03J421j790N39J166j819P66R84j856
3919i45J034P07j750J151N39j735J338L25j712J494O5j546J642k40j343J608l51
$$ y = [648, 528, -1165, 710, 401, -1218, 884, 303, -1190, 963, 102, -1125, 1049, -65, -937, 1116, -198, -891, 1164, -403, -789, 1232, -559, -675, 1213, -707, -446, 1216, -855, -424, 1138, -959, -147, 1077, -1054, 63, 951, -1091, 177, 875, -1156, 318, 728, -1177, 498, 558, -1130, 629, 407, -1095, 759, 297, -1054, 872, 151, -1015, 959, -19, -915, 1001, -177, -798, 1028, -279, -745, 1090, -457, -601, 1068, -583, -467, 1062, -659, -356, 1065, -725, -186, 980, -839, -73, 911, -945, 89, 796, -954, 197, 736, -999, 339, 664, -1048, 446, 511, -1035, 607, 367, -976, 632, 281]
$$ [...]
8191i2
##END NTUPLES=NMR FID
##END=
