##TITLE=1H_Pr YA-S2
 CCl4
 8 sc, 
 20.2.2024
##JCAMPDX= 6.0         $$ Bruker NMR JCAMP-DX V2.0
##DATA TYPE= NMR FID
##DATA CLASS= NTUPLES
##ORIGIN= UXNMR, Bruker Analytische Messtechnik GmbH
##OWNER= root
$$ XWIN-NMR		Version 3.5
$$ Tue Feb 20 15:43:37 2024 Russian Standard Time (UT+4h)  she@DPX200
##.OBSERVE FREQUENCY= 200.1313
##.OBSERVE NUCLEUS= ^1H
##.DELAY= (6, 6)
##.ACQUISITION MODE= SIMULTANEOUS
##.ACQUISITION SCHEME= undefined
##.AVERAGES= 8
##.DIGITISER RES= 18
##SPECTROMETER/DATA SYSTEM= spect
##.PULSE SEQUENCE= zg30
##.SOLVENT NAME= CDCl3
##.SHIFT REFERENCE= (INTERNAL, CDCl3, 0, 15.7039)
##AUDIT TRAIL= $$ (NUMBER, WHEN, WHO, WHERE, WHAT)
$$ ##TITLE= Audit trail, XWIN-NMR		Version 3.5
$$ ##JCAMPDX= 5.01
$$ ##ORIGIN= Bruker BioSpin GmbH
$$ ##OWNER= she
$$ F:/spectra/data/she/nmr/H-F/1/audita.txt
$$ ##AUDIT TRAIL=  $$ (NUMBER, WHEN, WHO, WHERE, WHAT)
(   1,<2024-02-20 15:42:15.84 +0400>,<she>,<DPX200>,
      <created by zg, POWCHK disabled, PULCHK disabled
       configuration hash MD5:
       00 E9 B6 7A A2 85 ED C7 34 08 36 98 17 FE 4E 26
       data hash MD5: 16K
       8E 87 31 78 29 F6 27 02 B5 B8 A4 2A 79 6A 9E 1A>)
$$ ##END=
$$ 
$$ hash MD5
$$ B5 FF F4 17 60 BF 82 23 8D CB 6A 03 F6 A0 E0 00
##$RELAX= 
##$RELAX= 
##$RELAX= 
##$RELAX= 
##$RELAX= 
##$RELAX= 
$$ Bruker specific parameters
$$ --------------------------
##$DU= <F:/spectra>
##$EXPNO= 1
##$NAME= <H-F>
##$PROCNO= 1
##$TYPE= <nmr>
##$USER= <she>
##$AMP= (0..31)
100 100 100 100 100 100 100 100 100 100 100 100 100 100 100 100 100 100 
100 100 100 100 100 100 100 100 100 100 100 100 100 100 
##$AQSEQ= 0
##$AQ_mod= 1
##$AUNM= <au_zg>
##$AUTOPOS= <>
##$BF1= 200.13
##$BF2= 200.13
##$BF3= 200.13
##$BF4= 200.13
##$BF5= 200.13
##$BF6= 200.13
##$BF7= 200.13
##$BF8= 200.13
##$BYTORDA= 1
##$CFDGTYP= 0
##$CFRGTYP= 5
##$CHEMSTR= <none>
##$CNST= (0..31)
1 1 145 1 1 1 1 1 1 1 1 1 1 1 1 1 1 1 1 1 1 1 1 1 1 1 1 1 1 1 1 1 
##$CPDPRG= <>
##$CPDPRG1= <>
##$CPDPRG2= <>
##$CPDPRG3= <>
##$CPDPRG4= <mlev>
##$CPDPRG5= <mlev>
##$CPDPRG6= <mlev>
##$CPDPRG7= <mlev>
##$CPDPRG8= <mlev>
##$CPDPRGB= <>
##$CPDPRGT= <>
##$D= (0..31)
0 1.2 0 0 0 0 0 0 0 0.06 0 0.03 0 0 0 0 0.0002 0 0 0 0 0 0 0 0 0 0 0 0 
0 0 0 
##$DATE= 1708429335
##$DBL= (0..7)
120 120 120 120 120 120 120 120 
##$DBP= (0..7)
150 150 150 150 150 150 150 150 
##$DBP07= 0
##$DBPNAM0= <>
##$DBPNAM1= <>
##$DBPNAM2= <>
##$DBPNAM3= <>
##$DBPNAM4= <>
##$DBPNAM5= <>
##$DBPNAM6= <>
##$DBPNAM7= <>
##$DBPOAL= (0..7)
0.5 0.5 0.5 0.5 0.5 0.5 0.5 0.5 
##$DBPOFFS= (0..7)
0 0 0 0 0 0 0 0 
##$DE= 6
##$DECBNUC= <off>
##$DECIM= 32
##$DECNUC= <off>
##$DECSTAT= 4
##$DIGMOD= 1
##$DIGTYP= 9
##$DL= (0..7)
0 120 120 120 120 120 120 120 
##$DP= (0..7)
150 150 150 150 150 150 150 150 
##$DP07= 0
##$DPNAME0= <>
##$DPNAME1= <>
##$DPNAME2= <>
##$DPNAME3= <>
##$DPNAME4= <>
##$DPNAME5= <>
##$DPNAME6= <>
##$DPNAME7= <>
##$DPOAL= (0..7)
0.5 0.5 0.5 0.5 0.5 0.5 0.5 0.5 
##$DPOFFS= (0..7)
0 0 0 0 0 0 0 0 
##$DQDMODE= 0
##$DR= 18
##$DS= 0
##$DSLIST= <SSSSSSSSSSSSSSS>
$$ [...]
##$SUBNAM2= <"">
##$SUBNAM3= <"">
##$SUBNAM4= <"">
##$SUBNAM5= <"">
##$SUBNAM6= <"">
##$SUBNAM7= <"">
##$SUBNAM8= <"">
##$SUBNAM9= <"">
##$SW= 18.0517328524113
##$SWIBOX= (0..15)
0 0 2 0 0 0 0 0 0 0 0 0 0 0 0 0 
##$SW_h= 3612.71676300578
##$TD= 16384
##$TD0= 1
##$TE= 0
##$TE2= 300
##$TE3= 300
##$TEG= 300
##$TL= (0..7)
0 120 120 120 120 120 120 120 
##$TP= (0..7)
150 150 150 150 150 150 150 150 
##$TP07= 0
##$TPNAME0= <>
##$TPNAME1= <>
##$TPNAME2= <>
##$TPNAME3= <>
##$TPNAME4= <>
##$TPNAME5= <>
##$TPNAME6= <>
##$TPNAME7= <>
##$TPOAL= (0..7)
0.5 0.5 0.5 0.5 0.5 0.5 0.5 0.5 
##$TPOFFS= (0..7)
0 0 0 0 0 0 0 0 
##$TUNHIN= 0
##$TUNHOUT= 0
##$TUNXOUT= 0
##$USERA1= <user>
##$USERA2= <user>
##$USERA3= <user>
##$USERA4= <user>
##$USERA5= <user>
##$V9= 5
##$VALIST= <valist>
##$VCLIST= <CCCCCCCCCCCCCCC>
##$VD= 0
##$VDLIST= <DDDDDDDDDDDDDDD>
##$VPLIST= <PPPPPPPPPPPPPPP>
##$VTLIST= <TTTTTTTTTTTTTTT>
##$WBST= 1024
##$WBSW= 4
##$XGAIN= (0..3)
0 0 0 0 
##$XL= 0
##$YL= 0
##$YMAX_a= 621387
##$YMIN_a= -704769
##$ZGOPTNS= <>
##$ZL1= 120
##$ZL2= 120
##$ZL3= 120
##$ZL4= 120
##$ABSF1= 10
##$ABSF2= 0
##$ABSG= 5
##$ABSL= 3
##$ALPHA= 0
##$AQORDER= 0
##$ASSFAC= 0
##$ASSFACI= 0
##$ASSFACX= 0
##$ASSWID= 0
##$AUNMP= <proc_1d>
##$AZFE= 0.1
##$AZFW= 0.1
##$BCFW= 1
##$BC_mod= 2
##$BYTORDP= 1
##$COROFFS= 0
##$CY= 11.3945322036743
##$DATMOD= 1
##$DC= 2
##$DFILT= <>
##$DTYPP= 0
##$F1P= 15.7292609196834
##$F2P= 12.9074282941183
##$FCOR= 0.5
##$FTSIZE= 0
##$FT_mod= 4
##$GAMMA= 1
##$GB= 0.15
##$INTBC= 1
##$INTSCL= 1
##$ISEN= 128
##$LB= 0.24
##$LEV0= 0
##$LPBIN= 0
##$MAXI= 10000
##$MC2= 0
##$MEAN= 0
##$ME_mod= 0
##$MI= 1.114404
##$NCOEF= 0
##$NC_proc= 0
##$NLEV= 6
##$NOISF1= 3.799351
##$NOISF2= 2.8
##$NSP= 1
##$NTH_PI= 0
##$NZP= 0
##$OFFSET= 15.70392
##$PC= 1
##$PHC0= -25114.96
##$PHC1= 9.65264
##$PH_mod= 1
##$PKNL= yes
##$PPARMOD= 0
##$PSCAL= 0
##$PSIGN= 0
##$REVERSE= no
##$SF= 200.130013532006
##$SI= 16384
##$SIGF1= 3
##$SIGF2= 2
##$SINO= 400
##$SIOLD= 16384
##$SREGLST= <1H.CDCl3>
##$SSB= 0
##$STSI= 0
##$STSR= 0
##$SW_p= 3612.71676300578
##$SYMM= 0
##$S_DEV= 0
##$TDeff= 0
##$TDoff= 0
##$TI= <>
##$TILT= no
##$TM1= 0
##$TM2= 0
##$TOPLEV= 0
##$USERP1= <user>
##$USERP2= <user>
##$USERP3= <user>
##$USERP4= <user>
##$USERP5= <user>
##$WDW= 1
##$XDIM= 8192
##$YMAX_p= 0
##$YMIN_p= 0
$$ End of Bruker specific parameters
$$ ---------------------------------
##NTUPLES= NMR FID
##VAR_NAME=  TIME,          FID/REAL,        FID/IMAG
##SYMBOL=    X,             R,               I
##VAR_TYPE=  INDEPENDENT,   DEPENDENT,       DEPENDENT
##VAR_FORM=  AFFN,          ASDF,            ASDF
##VAR_DIM=   8192,          8192,            8192
##UNITS=     SECONDS,       ARBITRARY UNITS, ARBITRARY UNITS
##FACTOR=    0.0002768,     1,               1
##FIRST=     0,             0,               0
##LAST=      2.2672688,     0,               0
##MIN=       0,             -704769,         0
##MAX=       2.2672688,     621387,          0
$$ Real data points
##PAGE= N=1
##DATA TABLE= (X++(R..R)), XYDATA
$$ [...]
2969e346J1496n964q447J4933n683o488J1843r743j552J4909j3394k039J3137
2982G662j2440L615R897j7098O407J1033j5908P538N212j5757J3841L507j7692
2995a0183J3207J174j2743J6102n334j3329J8736n278j0363J6130j0668n150J9074
3008A1375j3967m910J6334j3485J585J3597j8478M131J4248j7069O035P990j7266
3021i880J2260O481j8526J1359L446j3684J4650k363j4579J6633k307j1073J4190
3034F607p661o671J7158r922o717J4118r692o38J2196j4096O86J2667j1903K601
3048a267O810j2617P671O711j3575O205L852r234R314o47j0571J0005L70p120
3062d093P776m374m123J0290m974m609O819m158L76N598p289K10N763m194J415
$$ y = [-5346, 6150, 186, -8261, 6672, 989, -5499, 6344, -3399, -4951, 9958, -3436, -5475, 7662, -4778, -1163, 8734, -8364, -1957, 9076, -6832, 706, 5918, -9839, 4002, 7509, -10183, 3024, 4198, -8545, 7557, 2223, -11106, 7630, 2352, -8011, 8119, -2549, -7699, 11375, -2592, -7502, 8832, -4653, -3068, 10529, -7949, -3818, 10430, -6639, -604, 7386, -9880, 2380, 8861, -9665, 1694, 5140, -8544, 6106, 3743, -10836, 5797, 3490, -7583, 6607, -1054, -7725, 9433, -489, -7206, 6912, -2780, -3418, 8778, -5318, -4632, 8035, -3868, -1267, 5543, -7074, 597, 7308, -6267, -62, 3790, -5444, 3870, 3223, -7348, 2657, 3027, -4093, 3683, -691, -4814, 5476, 502, -4107, 2712, -1446, -1070, 4528, -2761, -2551, 3212, -982, 433]
3077D33Q27m796M386K010m502J573l79m88L858l104j956K772q70J405r3l915K923
3094H4J727k431J711k341r91N660l078k367L371l075J936L736p316J661M940n151
3110a924L006Q50p189P230J974q230N799p10n083R360m060p215J0228l660l717
3125c341Q919q570j654J2075r270j659Q855j0255M040Q555j3949M467Q121j1697
3139e363P148L154j3614J1235L485j3284J0293o10j0060J4338m384j1170J4537
3152E705m738o889J3605j0119m625J6048j0550l568J2405j2152K216J2182j5613
3165f093K816J0874j3295O223O138j5649J0136O174j4658R471J571j1816J3621
3178E513j525j3013J3457k328q159J2736p435o660J4960p605n220J1371r519J83
$$ y = [433, 1260, -3536, 850, 2860, -1642, -69, -448, -936, 2922, -182, -2138, 634, -236, 1169, 1076, -2839, 84, 1811, -620, 1091, -1250, -2241, 3419, 341, -2026, 1345, -1730, 206, 3942, -3374, -1713, 3227, -1924, 1082, 1932, -5257, 1973, 3947, -4283, 1516, 806, -4277, 5083, 1023, -6192, 4036, 376, -3341, 5578, -2992, -4646, 7429, -1841, -3500, 5355, -4900, -860, 7695, -6254, -1787, 6334, -5363, 1785, 4939, -8675, 2560, 6045, -7239, 3054, 2444, -7616, 6722, 2338, -8832, 5705, 967, -5922, 7683, -2436, -7061, 8987, -1563, -5131, 7274, -4878, -2662, 9520, -6093, -3277, 7597, -5698, 525, 6663, -8986, 1150, 7324, -7334, 2137, 3708, -8108, 5513, 3988, -9025, 4432, 2104, -6055, 6681, -754, -7414, 7546, -59, -5279, 6092, -3427, -3244]
3192c244J1523j2099o0J0001r827L513N876j2265O329O473j0772N253K054q525
3206e770R187K14r681P970K9n486P634m358m983R634l584l837N973n015J01O939
3222D967o695j035N323m199K162K049o087L109L272m071J676m74k365M617r72
3237A277l275K060m09N99J697l393K67K209r99J090j608j775L862n91j871J652
3253G92k572J509L566m769Q8K891l109K926O07o013M613K109m965L968j435m101
3269c895P632k318n493O525k816j966P191o746k095Q895o058o90N909q207L088
3284a044P246j0025K518N271q402O245K551j1128Q085K948r344Q201j756q051
3298f685J1914k944q610J0457m222m386J1396q703m061J2326p967j672R369j0843
$$ y = [-3244, 8279, -3820, -3880, 6121, -3706, -193, 5683, -6582, -253, 6220, -4552, 701, 2755, -5770, 3417, 3631, -6050, 1920, 1949, -3537, 4097, -261, -5244, 4390, 806, -3031, 2942, -2073, -1972, 4967, -1728, -2763, 2560, -1639, 523, 2572, -3515, -406, 2866, -1205, 471, -3, -2368, 2249, 1277, -1998, 62, -347, 252, 1949, -1444, -1177, 1032, 33, 1123, -485, -2260, 1602, 1011, -860, 792, -1780, -271, 3295, -1474, -1386, 1505, -1604, 1322, 1929, -4084, 529, 2638, -2327, 1641, 206, -3895, 3737, 1419, -4074, 2451, -365, -2331, 4860, -1886, -3981, 4914, -1144, -1834, 4075, -4132, -1044, 6202, -3823, -1305, 3966, -4436, 1809, 4360, -6768, 1317, 4265, -5079, 3122, 1366, -6685, 5229, 2285, -6325, 4132, -90, -4476, 6920, -1783, -5844, 6482, -1485, -3157, 6212, -4631]
3312d631K083J0397j2164K128P620j0825O391N141j3399P788M851j0972Q215J49
3326B772j0219J1673o35j0408J0541k827o205J1575o637o123J2218o190l248R460
3340E747r111j12J0510r796j26P773q976M067N659j1114M653N589q728N335J206
3355B576q365Q324J023q255O532q98m572P828l731n199P904k686k616N455n350
3370b030m54O793n254j071M076m099K307K940n962J719L233l494K245k35l618
3385b904M163N74l384J906q36l36L104k540j386K197n28O27l6k479J753J283j259
3402h1N90j739K23L037k056q62J374j895K485R81m532K324J549k672K984j648
3418F2l281N514r37l526L971k780j051N899m804j914N790m165N83M260p125K274
$$ y = [-4631, -2548, 7849, -4315, -2187, 5433, -5392, 999, 6140, -7259, 529, 5380, -5592, 2623, 2772, -7447, 4226, 3591, -6817, 3724, 897, -5308, 6267, -370, -6493, 5725, -465, -3713, 5747, -3364, -3476, 7034, -2762, -2888, 4885, -4091, -24, 5635, -5479, -826, 4763, -3965, 1370, 2576, -5789, 2535, 3558, -4697, 1835, 937, -3635, 4193, 462, -4737, 3167, 481, -2135, 3320, -2030, -2484, 4309, -945, -2016, 2060, -2039, 268, 3208, -2754, -1035, 2198, -1296, 949, 714, -2904, 1259, 1833, -1551, 355, -481, -817, 2287, -253, -1639, 558, 30, 657, 621, -1858, -105, 1178, -81, 509, -1230, -1007, 2030, -26, -888, 486, -1409, 1076, 2057, -2475, -151, 1398, -1274, 1710, 62, -3219, 2295, 1358, -2168, 1803, -977, -2028, 3871, -933, -2847, 2943, -1222, -639, 3621, -3504, -1230]
3434a230N684o955K002L046o645N607K272q682N682J905o466O885j847o791R022
3449C489j612o029P710m294l187R613o424l773R044o107n43P468r172J362Q367
3464E912r037J966N186r075N913M494j0757N829L225q225P375m37q623R319l10
3479B755p525Q135l252m888J0174n147n220R237n279j731Q088q257l13Q641p607
3494b189M58N710q037L768N435r266L478L978o954N485R43q177P190J118o528
3509c588N632j602m286P576k692m984O309k554j720N421n096j144O043l887n53
3524a125L134m417K022L529n070J024K395l000K728J28m161L310J136k651J784
3539G66j191j017L238j299j755J451m36N74R61k340K39J525n29L39r57q90K188
$$ y = [-1230, 4454, -2501, -499, 2547, -4098, 1509, 3781, -4901, 781, 2686, -3780, 3105, 1258, -5533, 3489, 1877, -4152, 3558, -736, -3923, 5690, -734, -4507, 4537, -1570, -2113, 5355, -3817, -2455, 5912, -3125, -1159, 4027, -5048, 865, 5359, -5398, 431, 3656, -4569, 2806, 2369, -6254, 3065, 2755, -4770, 3365, 113, -4775, 5399, 252, -4968, 4269, -1010, -2741, 5347, -2910, -3223, 5418, -2189, -1731, 3979, -4058, -290, 5145, -4121, -643, 3335, -3619, 1866, 2809, -5368, 1822, 2940, -3588, 2044, 442, -3844, 3732, 1040, -3944, 2365, -189, -1909, 3512, -1584, -2728, 3315, -572, -1125, 2009, -2408, -386, 3143, -1927, -903, 1492, -1508, 1220, 1348, -2813, 497, 1633, -1018, 766, -425, -1442, 1796, 497, -1258, 193, -243, 331, 1292, -1048, -809, 716, 187, 526, -431, -1321, 867]
3556H67k65q27L73j243J386J328k660N28R14j098K129j006k684L072l9j687K345
3573A433k468n73M354k977j510L455k992J133L168n469J230L915m406K116J362
3588A771n269M563J790n890L756M21m110N931j887n124O448j463l520N776m288
3603a095k244P626m704k432O025n186Q34N760p568J092N906o489K501L045p368
3618d297M819L437p734M436J478o078O753o73p035P093o38m849O621l693l632
3633c992Q138m047l522O778m920m47O668o882m05O544n832J281M002p160L488
3648c08M378p111L043K180n543N255N11o525N375O15m566N091k123l912O664k288
3664G36l407M776k932q93N195m560j290M907l399L61K806m652J688L527m350J258
$$ y = [867, 602, -225, 148, -1095, 291, 1619, -1041, -513, 401, -697, 1432, 426, -2258, 814, 775, -912, 1433, -1035, -1608, 2746, -231, -1741, 1714, -1278, -145, 3023, -2446, -1216, 2699, -1707, 409, 1771, -3498, 1065, 2855, -3035, 721, 1142, -2968, 2963, 1076, -4048, 2400, 937, -2583, 3193, -1095, -3339, 4287, -417, -2849, 3176, -2010, -1176, 4584, -2984, -1892, 4014, -2475, 26, 3071, -4297, 522, 3959, -3775, 661, 2139, -3939, 2814, 2141, -4894, 2199, 1561, -3288, 3333, -360, -3992, 4146, 99, -3423, 3355, -1565, -2012, 4656, -2226, -2631, 3913, -1919, -638, 3364, -3796, -308, 4070, -3041, 2, 2182, -3361, 1894, 2405, -4120, 1255, 1870, -2696, 2395, 272, -3640, 3024, 736, -2671, 2105, -827, -1720, 3475, -1085, -2375, 2532, -867, -506, 2300, -2352, -664, 2863, -1487, -229]
3680b29J359k958K930N55l952K431R16j960K097j261j784L094m32j609J160r49
3696e92K94J819j939n82J302k01M36k58j344J052P46n26o7r91O34J165r62j41
3714a55q4m64J667l40j867J328J16m07J375k028m08K779j366p31J525k335J414
3731A9K231l724P58J941k519K100N38l975L190J181l459K671p49k644M718j427
3747H50l596M431j708j559M415m012j248N390l543p39L777m662J489M169n651
3762b197J176L429m784L133J720o068M039K096n180L836j82m471N960r91m949
3777c433N292j461k811N601l619k814O410l487j663M808m707M72N240n565K42
3792a495M167m875K351K930o274K981L002n214L201P58m801M996K88n080M215
$$ y = [-229, 1130, -1828, 1102, 1657, -2295, 136, 1052, -908, 1189, -72, -1856, 1238, 806, -803, 357, -592, -298, 1521, -418, -1000, 302, 101, 537, 279, -1065, -13, 733, 207, 140, -851, -217, 948, -14, -155, -239, -703, 964, 624, -1243, 85, 201, -206, 1169, -859, -1267, 1512, 146, -585, 940, -1395, 19, 2250, -1474, -716, 1225, -1294, 806, 1344, -2631, 559, 1740, -1719, 952, 203, -2441, 2277, 850, -2746, 1685, -23, -1582, 2833, -1179, -2427, 2963, -580, -1319, 2458, -2204, -715, 3454, -2197, -1021, 2408, -2376, 757, 2477, -3591, 448, 2544, -2636, 1200, 1018, -3453, 2507, 1516, -3433, 1859, 398, -2413, 3188, -431, -3245, 3165, -322, -1985, 2823, -1884, -1412, 3828, -1737, -1495, 2672, -2203, 148, 3078, -3196, -215, 2787, -2427, 774, 1532, -3269, 1727, 2015, -3065, 1150]
3807A150m48l042M924k555l008N284j891k142L975l396m84M588l832o40L387l197
3823a327J209K532m539J610K607l478J778O32l166L165N17l256K056J30j548K707
3839A629j385k097K810m78j097J470j614j7K266j509o49R80p18Q23M41j635L87
3856c93Q72k71J96p51l08J091j10k32m01l40J298J3j168M66k18L13J100j577o07
3875a027J651p22J68N88k021J169J647k212N57P30j789K124J95k918K113O47j938
3892a038K319j402j899L742j064k218K835j941m99L599l248q77L637k645K83K501
3908B085m252J585L193m169J367J580l723L350J051m838L327Q39l443L703j077
3923E78l490M861j028l143M021k202j566M898l451j845M708l192q7L596m598P44
$$ y = [1150, 702, -2340, 2584, 29, -2979, 2305, 414, -1728, 2247, -1149, -1633, 2955, -877, -1517, 1870, -1327, -118, 2414, -2125, -515, 2092, -1386, 392, 1024, -2142, 1023, 1540, -1716, 340, 470, -1078, 1629, 244, -1853, 957, 479, -618, 852, -762, -779, 1487, -22, -671, 309, -409, 414, 855, -780, -393, 479, 208, 404, -347, -655, 436, 326, 94, -307, -647, 651, 664, -504, -38, -256, 57, 1157, -420, -1027, 624, -98, 70, 658, -1363, -194, 1453, -759, -202, 528, -1261, 863, 1058, -1860, 253, 900, -1038, 1281, -121, -2020, 1722, 658, -1560, 1275, -666, -1165, 2434, -814, -1691, 1946, -699, -416, 2085, -2167, -582, 2611, -1558, -191, 1389, -2334, 1016, 2067, -2771, 556, 1395, -2048, 1655, 578, -2912, 1949, 921, -2222, 1799, -403, -1969, 2929, -522, -2367, 2341, -851, -938, 2658, -1940, -1196]
3939a196M184m425Q47K586m429K916K053n194K704J806m021L513j82m183M507
3954A486j54l680L865j415k082M561k641k308M276k196q36L367l590k5L828l192
3970g36L3K187l218J800K080l863J385J674k684K150J28l060K994L32k514J965
3986F53o60j297K852j160j884K140o30l22J625k061k84K282j270k24P11j226R62
4003B07Q57j669L26M75l23O50l70r23Q92K51k37l4p63O10N43n02j11l26K31R75
4023G59p32n89P09m07O54L48j704O84R72j088O75n6j417J952J26j969J296k8r40
4042g55K150j535j430K728j084q00J868k121J48K815k629l69K151k153J060J736
4058A780l514J417J938k916J855M68l174K998P01l604K800k67k302L775j650k712
$$ y = [-1196, 2988, -1437, -590, 1996, -2433, 483, 2536, -2658, 46, 1852, -2169, 1344, 1162, -3021, 1486, 1332, -2348, 1517, 102, -1980, 2581, -60, -2368, 1908, -288, -1124, 2243, -1347, -1372, 2456, -736, -703, 1484, -1734, 66, 2146, -1717, -332, 1342, -1342, 808, 936, -2124, 870, 1202, -1312, 653, -7, -1304, 1548, 388, -1496, 644, 14, -308, 1317, -744, -1028, 1254, -16, -240, 471, -755, 207, 1064, -605, -279, 196, -127, 523, 153, -770, 122, 373, 136, 102, -661, -51, 492, -10, -121, -447, -216, 759, 27, -562, 147, -260, 394, 742, -962, -278, 694, -394, 281, 225, -1192, 760, 886, -1083, 213, 185, -755, 1395, -140, -1570, 1158, 74, -726, 1142, -979, -831, 1984, -645, -1014, 1137, -1016, 44, 1780, -1734, -317, 1621, -1295, 560, 1028, -2146, 852, 1553, -2051, 749, 482, -1820, 1955, 305, -2407]
4074b407M062j436j624L315k846o39M218l255q26L422l264R65K724m323J260K688
4090B034l510J683J288l992L168J274m009K631K93k899L793r63l346M017q32k213
4106a583L378k371j325M124k414j389L158k598L32K985l729M26L003l079R88J548
4122A454l493K226J587l241J675O50k468K748k68k802K670n8j797K341j468j199
4138a443K957j267j216J813j349J20J769j981l40J805j165L78N81j667J033P97
4154H25j268L10J52n33J118k64j146R25N2l4L47r66P4Q33k31m7l64j72Q08k4o32
4175b37J21j53M22N66j245P8O69m42O46l05j240J512K14j217J075p45n33K095
4193A281j207j132J729r24j12J596k226K72K154k057M11J134k182J434J473l082
$$ y = [-2407, 1655, 219, -1405, 1910, -936, -1575, 2643, -612, -1438, 1984, -1280, -315, 2409, -1914, -654, 2034, -1476, 207, 1495, -2497, 671, 1945, -2064, 567, 860, -2039, 1754, 791, -2555, 1462, 630, -1583, 1795, -576, -1901, 2223, -191, -1580, 1578, -1020, -688, 2297, -1432, -1006, 1997, -1082, -94, 1454, -2039, 187, 1774, -1467, 208, 858, -1610, 1138, 870, -1932, 738, 680, -1117, 1224, -244, -1443, 1514, 247, -969, 844, -505, -385, 1384, -597, -937, 868, -297, 81, 662, -1005, 28, 825, -443, -133, 19, -514, 604, 340, -806, 119, 171, 137, 484, -482, -408, 425, 194, 147, -217, -389, 419, 395, -237, -116, -269, 153, 719, -526, -448, 221, -221, 425, 120, -1120, 392, 606, -611, 464, -281, -814, 1281, 74, -1058, 671, -253, -365, 1231, -995, -723, 1431, -626, -215, 919, -1263, 171, 1644, -1438]
4209a438J315J021k093K105p4k943K967J87k513K589j164j631L467j509j951L063
4225A398j592q24K864k809l87L380k778K2K283l173J305K490l797J277J835l106
4241a612K290O92l755L129O72l158K683n78k338L702j074k744L585j564j221L444
4257B153k743j055L593k437m57K525k977Q53K651l320O09J976k736J727J047l325
4273a916K163J011k550K072k97k248K960l65k399K306n80j060K288j614j097K588
4289A262j293o61J739j884M00J803j897l2J250j391R55N97j947R43R69j250P76
4306C39l33q95J498k33r74O92j97j29R20r05k77Q71k94K8l3o04O87J96l87P8l87
4327c39K18O57o38j51L86m75R26k83j150R09K59n32P09p25m38J646q22p83J233
$$ y = [-1438, -123, 898, -1195, 910, 836, -2107, 860, 1047, -1466, 1123, -41, -1672, 1795, 286, -1665, 1398, -194, -1018, 1846, -963, -1350, 2030, -748, -726, 1557, -1616, -311, 2179, -1618, -341, 1494, -1612, 678, 1370, -2385, 744, 1416, -1742, 941, 363, -1975, 1727, 653, -2091, 1494, -70, -1291, 2153, -590, -1645, 1948, -489, -946, 1579, -1398, -545, 2106, -1214, -605, 1371, -1365, 362, 1409, -1916, 247, 1258, -1292, 780, 483, -1765, 1195, 830, -1569, 737, 157, -903, 1385, -229, -1326, 1262, -31, -692, 1047, -837, -437, 1366, -531, -563, 687, -704, 251, 848, -1099, -156, 813, -437, 339, 6, -889, 609, 376, -598, 94, -103, -232, 688, -217, -494, 377, 83, 111, 78, -526, 161, 357, -30, 48, -339, -121, 536, -102, -253, 133, -342, 584, 301, -849, 60, 319, -213, 496, -229, -667, 979, 157, -626, 607]
4346F07r94K33J361j879J06J452j438N32Q11k068J433J010k153J113L50j768K249
4363I57l22k255K394l58j469K279j399j350K926j295j188K353k011j4K682k857
4379i27MK457k515Q14J499k880J478J793l053J553P99k819K753J64l062K742j6
4396G84k305K903j236k001L420j238j730K826j887o23L086k755n26K956k486M20
4412c92K094l196J116K274l269J324J140k687K141P66k975K105M56k141K295p11
4428C40j998K806n70j824K276j218o89K480j821r01K242j658J56J506k112O17
4444c68J684j898M19Q70j691J353N55j934J112M28j157J187l59j207J547j44q51
4461d54R13p28j22J128p35m60O75l76K81K35q37M11L38k33J06l03pN90k66k33
$$ y = [607, -387, -154, 1207, -672, -566, 886, -552, -20, 791, -1277, 156, 1166, -987, 126, 476, -1292, 957, 635, -1620, 774, 416, -1053, 1226, -173, -1523, 1403, 108, -1080, 1273, -738, -752, 1930, -927, -923, 1534, -981, -167, 1332, -1548, -70, 1723, -1330, 223, 1022, -1797, 956, 1120, -1942, 800, 784, -1521, 1382, 146, -1855, 1565, 327, -1403, 1423, -464, -1087, 1999, -756, -1282, 1674, -812, -392, 1702, -1494, -378, 1896, -1373, -49, 1091, -1596, 545, 1311, -1664, 441, 897, -1244, 1051, 340, -1658, 1148, 578, -1246, 1030, -188, -877, 1603, -218, -1119, 1123, -535, -379, 1127, -985, -368, 1316, -582, -163, 707, -984, 369, 924, -1010, 102, 530, -627, 560, 201, -1006, 541, 397, -454, 459, -269, -391, 737, 2, -458, 217, -159, 122, 357, -480, -69, 269, 36, 142, -161, -168, 422, 156, -77]
4481g7Q0k54N04J60q03L15J12j05N33n44n35J103l91l54O84r18K03J157j257K8
4501c59Q64j080Q53N46j758J019Q11j590J084j7j588K101l30j773J948p17p83
4518g69J925j392r45K366j365m90J840k019L15J995k264L22J583k264J284J207
4534A329k861J576J190k469J728K58k434K665j6k443K372o20j609K888j486j663
4550a595L141j641p82K370k340k18K871k510n0K278k659R72J829l153J258J585
4566A356k640J622O59k671K245N45k712K258j55j893K634r18j931K756j005j190
4582a040K257j615o50K537j822m29J859j826M06J806k427N40J512j972R16O85
4598G37j866J491M75j771J332jj244J648n83j052J312l62n20J138j072l35J504
$$ y = [-77, 3, -251, 253, 413, -390, -75, 37, -68, 465, -79, -614, 489, 98, -256, 428, -490, -287, 870, -387, -359, 505, -575, 278, 824, -934, 85, 896, -694, 390, 373, -1215, 886, 556, -1217, 731, 14, -769, 1156, -236, -1181, 1185, -180, -670, 1170, -849, -534, 1461, -803, -481, 1102, -1162, 122, 1329, -1532, 44, 1234, -1235, 493, 751, -1683, 982, 966, -1477, 895, 275, -1334, 1554, 68, -1595, 1546, -95, -877, 1493, -847, -1065, 1806, -704, -754, 1524, -1135, -163, 1666, -1487, -229, 1356, -1284, 338, 997, -1674, 571, 1116, -1596, 662, 507, -1386, 1248, 330, -1601, 1155, 150, -1040, 1217, -398, -1048, 1489, -333, -762, 1097, -729, -323, 1483, -944, -404, 1108, -864, 52, 737, -1129, 362, 837, -934, 398, 397, -847, 801, 218, -834, 478, 116, -404, 734, -338, -673, 831]
4615H31r28l55P45o50L74N83j157L61M89n05M97j67n81N07J12k80K07k57K1N62
4635D09n67R3J3j09O17l45n32O60j50j34N30r07J47R03q48J60M46r96Q40N10j427
4656f87P00L59q82J145m44j181J544j97j060J410j002n63J913j241o80J759j248
4673c55j55J667j976L15J843k060N60J106k120J417R31k502J631N49k147K049
4689G53q6k288K556m74j712K387j150j290K676j455j252K610j811k27K301k430
4705h92P0K396k359L52J883k839J439J445k868J454J008k429J959K57k542K477
4721H11j10k083K244n37j798K842j144j608K586j552m90K228k050k82K310k001
4737f34J63J718k251P44J665k343P84J086j908J292N52k120J574M28j619J435
$$ y = [831, -97, -452, 293, -357, 17, 600, -557, -196, 293, -212, 285, 118, -463, 44, 156, -124, 83, -174, -153, 409, -158, -65, -52, -161, 456, 111, -421, 239, 89, -45, 485, -422, -275, 628, -220, -60, 386, -610, 230, 740, -687, 13, 372, -510, 635, 191, -990, 554, 357, -703, 707, -295, -858, 1055, -186, -866, 893, -355, -510, 1157, -819, -504, 1339, -721, -161, 945, -1175, 242, 1173, -1329, 302, 851, -1296, 753, 667, -1621, 935, 461, -1251, 1136, -14, -1304, 1372, -83, -1335, 1275, -536, -763, 1538, -892, -822, 1574, -785, -433, 1450, -1389, 50, 1495, -1373, 81, 1089, -1340, 619, 876, -1666, 811, 701, -1382, 862, 325, -1473, 1369, 225, -1383, 1203, -349, -839, 1389, -661, -943, 1367, -634, -471, 1247, -1004, -260, 1405, -938, -154, 932, -976, 316, 868, -1252, 322, 750, -869, 566]
4753E66l85j241J846n13j135J601r60l57J352j028l47J379j002l2R14j275M94
4770a23Q04j115L01N04q45P97P4p64N48l0l38M22l59j80P29l66p7J27m33M19J35
4791B30m94K46m0j06M76m53k09P44n86J97L76r92P02M61r70N71M5q10J146k30
4811C04j118J213k46o89J284r62n46J693j087l88J374j416K53J418j792L12J395
4828A002j847R38R16k230J555N70k063J724k7j704K024k53k013K282o52j320K313
4845A215j333j143K610j515p25K227k040k3K293k382K50J907k477J113J433k769
4861a359J461J164k715J853M88k483K348J17k476K468l22j846K537j103j595K701
4877A238j226j093K377j783m35K378k111n3J973k116N77J657k464Q00J608k351
$$ y = [566, 181, -1060, 786, 273, -862, 739, -221, -578, 774, -254, -601, 778, -224, -256, 658, -617, -123, 681, -434, -133, 371, -474, 323, 397, -367, 181, 151, -187, 235, -124, -304, 425, 59, -18, 109, -324, 95, 230, -264, -18, -58, -164, 312, -141, -350, 394, -192, 5, 381, -611, 91, 552, -418, 153, 198, -612, 534, 304, -814, 399, 153, -536, 748, -214, -760, 933, -154, -542, 832, -584, -331, 1087, -705, -393, 1002, -845, 93, 1009, -1221, 334, 904, -1159, 565, 538, -1166, 858, 605, -1408, 874, 222, -1098, 1215, -118, -1261, 1349, -166, -891, 1336, -704, -727, 1566, -816, -566, 1341, -1136, -23, 1410, -1359, 102, 1266, -1449, 404, 892, -1591, 757, 874, -1602, 866, 544, -1302, 1235, 132, -1463, 1238, 12, -1081, 1296, -487, -922, 1456, -655, -708, 1265, -851, -274, 1383, -1081, -281, 1327, -1024]
4893a024J141P74k142J609N90k167J672Q2j571J819m88j406J971p18r91J720j031
4910a60o63J835j338l90J486j144J26J054j288K02R41j113M99M21j036P30K58
4927D20r24P94j02n73P91l94m28P30l15r2L53n24J40L62l62J41L8k61M18k14l16
4948c18M27k35N7M05m96J04K89n58M57M5o44P75m4p34Q92m04m75J156q05m33J189
4969F50q24j01J047j371K25J287j508L81R03j594J133P15k009J265M98j722J613
4986E88p6j689J901l34j491K059q30j124K172j298q56K187j590k82K009j990j33
5003g77K128k190N52J557k394J113J338k599J347R44k295J893K41k333K162n7
5019F30k002K353q41j542K614j208j333K504j276p91K326j937l71K326k223J74
$$ y = [-1024, 117, 891, -1251, 358, 948, -1219, 453, 535, -1036, 783, 295, -1111, 860, 142, -849, 871, -160, -823, 1012, -326, -716, 770, -374, -248, 806, -482, -280, 661, -452, 47, 468, -568, 162, 420, -504, 290, 188, -385, 406, 12, -416, 314, -1, -93, 260, -264, -124, 238, -124, 17, 55, -206, 212, -2, -318, 109, -126, -69, 336, -160, -56, 233, -325, 132, 177, -467, 308, 264, -470, 422, 18, -457, 699, -106, -539, 650, -174, -275, 772, -599, -374, 913, -595, -214, 689, -905, 228, 943, -1066, 199, 697, -1025, 588, 512, -1177, 724, 390, -1101, 958, 128, -996, 1176, -122, -978, 1209, -381, -663, 1346, -644, -777, 1351, -839, -287, 1270, -1124, -11, 1327, -1272, 75, 1019, -1276, 617, 858, -1475, 687, 630, -1372, 981, 140, -1402, 1212, 4, -1329, 1175, -101, -892, 1434, -503, -874, 1452, -771, -597]
5035e97J901k183N22J695k386J030J103k107J274O96k273J693M34k013J829k58
5051C60j450J925o26j292J988q93r01J860j216o56J906j367k01J464j531K73J283
5068I26j569L57J061j484P41N12j428J114K20j130R76n5p76R02j69p26Q48n23
5086b03j66P97n01j14N63n10J31K66n49L63nk57L76k59j23M90l63n4M04m86K89
5107H9J47o64N56Q1n50O44k80m06Q02n69k74R60p46p8R16r21M6R86j301M93P79
5128G10j510Q75N40j342J000J80j424J535lj574J663l63j270J877q52j004J944
5145I82j104p29J922j508j52J980k049P0J776k131O26J534k385J013J312k381
5161a224J450Q02k485K066J06k235K267k55j771K311p58j533K482j153j206K459
$$ y = [-597, 1304, -879, -357, 1338, -1048, -18, 1085, -1022, 252, 948, -1325, 368, 802, -1211, 618, 360, -1090, 835, 209, -1083, 905, 12, -889, 971, -245, -901, 1005, -362, -563, 901, -630, -357, 926, -643, -286, 775, -709, 32, 544, -884, 230, 450, -680, 296, 241, -535, 367, 198, -528, 320, -203, -369, 428, -73, -187, 376, -134, -3, 263, -286, 77, 72, -185, 191, -68, -191, 299, -64, -118, 286, -200, 89, 236, -428, 128, 209, -341, 303, 23, -383, 419, -150, -424, 536, -210, -288, 628, -293, -247, 739, -562, -69, 710, -800, 75, 615, -727, 273, 453, -971, 564, 561, -1013, 650, 287, -983, 894, 42, -962, 982, -122, -851, 1071, -437, -589, 1391, -658, -588, 1188, -943, -317, 1217, -1168, -155, 1157, -1224, 226, 1028, -1457, 609, 715, -1520, 747, 492, -1279, 1032, 274, -1259, 1223, 70, -1136, 1323]
5177A323j708o68K513j977k63K195k264M11J829k518Q80J581k421J084J096k364
5193a271J563O76k266J859R7j816J912k74j715K052o54j235K127j184p57J995
5209A109j309m95J849j671R7J378j593K94J301j622N45Q20j522R19N28j490J032
5226A70K51j138J180j21j102J190k19p81J046n38l95J026o61j84O69m90j13N78
5244C68o07Q9M82n48K91n0l28M33J2k32L22m05J29L13n11L03R5n05O22k25l82
5265c34O98l43k52O92o46j36Q77q55J64O14r08M46N57j111O03N31j311R71K21
5284D78j369J282K9j299J467m52j034J789q03r73J850j085n99J784j533j96J809
5301A145j757K8J656j984P22J318k216J103R91k136J461O27k348J841M23k180
$$ y = [1323, -385, -1053, 1460, -517, -780, 1415, -849, -438, 1391, -1127, -247, 1334, -1087, -3, 1093, -1271, 292, 968, -1298, 561, 658, -1158, 754, 480, -1235, 817, 163, -1072, 1055, -129, -886, 1109, -200, -695, 1154, -517, -420, 958, -635, -341, 960, -662, -117, 703, -819, 100, 628, -862, 170, 421, -717, 463, 342, -760, 430, 211, -570, 476, -62, -457, 569, -92, -276, 393, -97, -210, 368, -239, -150, 332, -216, 75, 25, -303, 130, 142, -90, 232, -173, -44, 269, -242, 61, 156, -349, 273, 48, -334, 364, 21, -231, 461, -185, -321, 556, -299, -135, 479, -429, 17, 574, -537, 66, 597, -714, 257, 478, -891, 391, 420, -879, 588, 136, -898, 891, 88, -885, 965, -120, -719, 1065, -468, -664, 1145, -612, -584, 1072, -912, -190, 1128, -1088, 15, 1006, -1130, 331, 958, -1390, 451, 874, -1306]
5317a306J976k47j751K388q33j546K343j048j002K354j650o80K470j924k50K004
5333A298k212M48J851k356P23J445k327J214J047k609J776O81k386J996l4j879
5349a324K220l44j767K208p86j271K199j210r59K170j351n44J881j755M6J786
5365A199j898L12J325j727O50J022j786R84P36j727J111K96j423J367lj280J314
5382D72k98o81J149n67p57J277o58k59P44p68K11O85q28J55M02o64N35K38p20
5401c32M98Q0n17N37j72m18O26l21p6K47l68K75K25n41L31j1k50N04m42j80O96
5422C91n46N6M92p25L05M59q60L77N73j089Q33J23j125R70J60j082J122k87r46
5441g99J526o48q36J573r55n32J664j312l74J627j467J48J424j834N63J377k116
$$ y = [-1306, 670, 423, -1328, 1060, 227, -1319, 1024, -24, -1026, 1328, -322, -1002, 1468, -456, -706, 1298, -914, -466, 1385, -971, -248, 1197, -1130, 84, 1131, -1478, 298, 979, -1407, 589, 555, -1324, 896, 552, -1215, 993, 207, -1064, 1135, -75, -1034, 1136, -215, -759, 1122, -633, -587, 1199, -699, -387, 938, -789, -139, 883, -903, 81, 817, -910, 201, 497, -926, 441, 438, -842, 472, 174, -507, 642, 75, -682, 595, -63, -322, 422, -346, -135, 550, -278, -123, 279, -385, 150, 388, -332, 166, 246, -271, 266, 94, -324, 302, -19, -95, 152, -216, 59, 284, -257, 74, 63, -187, 317, -125, -305, 391, -155, -99, 393, -332, -27, 432, -428, -51, 522, -567, 266, 389, -736, 234, 394, -688, 434, 147, -799, 727, 79, -757, 816, -139, -671, 993, -319, -693, 934, -533, -385, 1039, -795, -232, 1145, -971]
5458i71R59Q69j997J452O09k239J700K55j879K011l45j761K287o95j398K357j307
5475i3j030K482j644n95K056j702j07J922k177N04J778k335P55J357k312J245
5491A04J057k500J563O43k188J896R3k026K161l37j700K169p68j277K241j229
5507i8r54K232j416n98K028j727q5J812j798J92J492j950Q24J070k045R94Q77
5524H50j704J241K13j514J381o3j311J414l42r00J444o23p93J318p87k94J121
5541F51j007n6J047q96P0P19r44M36M55r07M55J85o95O58j4m75N38k30k36M76
5561B30m55J13M98m77P8P6k73M33j90l84N44j60k12N41n71J7O07o72L43K16q45
5582e43P02K61j029P68N9q00J082k91p96J071l52p35J338r71k66J453j279j28
$$ y = [-971, -12, 857, -1140, 312, 921, -1318, 382, 637, -1242, 769, 424, -1337, 950, 255, -1143, 1214, -93, -1123, 1359, -285, -880, 1176, -526, -633, 1289, -888, -384, 1394, -941, -186, 1171, -1141, 104, 1161, -1339, 224, 867, -1321, 575, 668, -1358, 803, 466, -1234, 935, 167, -1110, 1131, -98, -1052, 1180, -236, -834, 1194, -533, -618, 1194, -604, -412, 1080, -870, -46, 1024, -1021, -27, 850, -854, 387, 600, -914, 467, 404, -907, 507, 165, -735, 709, 86, -707, 611, -176, -470, 651, -356, -412, 635, -261, -191, 528, -416, 20, 475, -432, 23, 208, -487, 171, 157, -318, 220, -10, -246, 230, -225, -112, 386, -91, -13, 63, -210, 223, 33, -351, 193, 33, -179, 362, -209, -192, 415, -257, 86, 302, -543, 159, 420, -609, 159, 218, -582, 500, 209, -587, 484, 132, -603, 735, -236, -502, 951, -328, -456]
5600d56J246j346K38J190j596N96J118j751Q36P38j866J345N50j986J510J80j555
5617a009J724l03j708K175n78j309K067j170r30K221j406o72K170j843m2K059
5633A446k210K68J860k304P39J433k417J258J097k399J361O63j993J816J48k154
5649a388K016r7j688K064p86j221K254j100r72K001j266o08J970j698j42J755
5665A094j688L40J288j929P42J188j854Q86N86j612J128N28j760J465N7j386J547
5682F20l96j027J542n24q52J310p80n22J381q17m37J165r66qR01j083L03P82j035
5701d43L35M20o67N57J52p91N50L5m36N30k56l33N79k25r8L19l94K66O4k97J94
5722F1j43r2M36l78j09M67l17M8K13m35K20M19o94M45j19l63O90j77o40Q30k10
$$ y = [-456, 790, -556, -318, 872, -724, -128, 990, -761, 75, 813, -1053, 292, 842, -1144, 366, 546, -1009, 715, 412, -1296, 879, 301, -1008, 1059, -111, -1041, 1180, -226, -898, 1272, -571, -613, 1446, -764, -496, 1364, -940, -201, 1232, -1185, 73, 1170, -1229, 132, 795, -1198, 618, 766, -1388, 628, 531, -1157, 907, 121, -1100, 1154, 54, -918, 1083, -183, -791, 1179, -519, -661, 1094, -594, -254, 1034, -895, -153, 1035, -819, 67, 653, -959, 169, 697, -1063, 402, 459, -927, 620, 224, -803, 739, 215, -637, 673, -107, -629, 752, -65, -502, 663, -303, -311, 590, -493, -190, 592, -443, -108, 312, -355, 202, 354, -437, 113, 148, -288, 242, -14, -347, 232, 7, -91, 228, -166, 100, 164, -133, 61, -82, -174, 262, -116, -225, 242, -75, -27, 186, -249, -29, 390, -304, 141, 22, -341, 349, 172, -468, 362, 152]
5743A52o57R64n76l98J159p64k90J085j175K52R60j228L14R84j464Q71M74j580
5761i17J148N00j424J073p1j293J607j08j445J531l65j119J855j091r17K060j158
5778a34o32J784j458j84J823j929J91J577j947P53J165k078J059J031k023J246
5794B44M86j989J881P3j910J765j35j564K098q57j232K208j043r16J886j355l88
5811g48J905j622j42J574j628M11J287j948P62J177j905R02P65j732J202N41j902
5828a101J423J82j381J587m81j136J558m65q97J431q25m79J306r23l14J225j040
5845c30L6R69j190K82Q05r68L89L06q60P00K50r13O29J87o13O63k61n14P36k81
5865B2j31M01m54M4M53m11mJ81k84L16j31j89L03r9r4L12l36RK81l08K58Pn64
$$ y = [152, -505, 459, -117, -515, 644, -120, -410, 675, -500, -248, 712, -516, -202, 782, -682, 189, 663, -917, 231, 731, -693, 380, 309, -984, 623, 515, -930, 601, 236, -883, 972, -119, -1036, 1024, -134, -766, 1018, -440, -624, 1199, -730, -539, 1038, -909, -156, 1009, -1069, -10, 1021, -1002, 244, 730, -1259, 622, 695, -1215, 550, 415, -1149, 949, 92, -1140, 1068, 25, -891, 995, -360, -748, 1157, -465, -607, 967, -661, -250, 1037, -911, -149, 1028, -877, 25, 790, -942, 260, 801, -1101, 322, 504, -877, 710, 229, -907, 651, 186, -711, 720, -105, -584, 722, -201, -515, 710, -330, -294, 675, -515, -233, 572, -396, -7, 299, -561, 139, 389, -524, 105, 292, -321, 342, 81, -433, 303, 22, -109, 292, -162, -118, 335, -76, -80, 101, -183, 133, 2, -187, 116, 17, -77, 235, -101, -92, 189, -119, 139, 146, -418]
5888d18O96M8p67O45m5n22P25l99l37Q34n15l76R59r34J9J159j171K17Q80j255
5908e57N07N64j189P26M01j169J009J19j283J392k88j034J269l71q76J566p87
5925aq39J670j007n44J682j406j37J645j590K16J359j777O35J135j987J011Q74
5942I39j945J299L60j900J768M6j613J702k89j465J928o32j294K002r21p83J821
5959A023j281m56J876j556k58J669j650K25J480k029P37J188j872R77O47j677
5975i57J199N16j678J288N1j381J505k97j152J454m20q56J546r85n52J490r13
5992a42l93J308j205L5J185j271K09Q09j105N48N27j034O08L02q43N96J16p25
6010d75P88j57o27O85j54l04O04m46j26N19l07k2K16l34J04L62n78K09J00k23
$$ y = [-418, 278, 326, -441, 204, 159, -363, 362, -37, -374, 460, -55, -431, 528, -406, -387, 772, -399, -182, 698, -557, -50, 514, -675, 51, 452, -717, 292, 411, -872, 520, 232, -802, 467, 96, -780, 786, -1, -840, 830, -177, -721, 961, -445, -582, 1063, -527, -311, 1048, -729, -94, 1041, -946, 65, 939, -1006, 293, 653, -1247, 521, 567, -1046, 656, 367, -1098, 830, 198, -1096, 906, -15, -798, 1023, -258, -714, 1162, -394, -652, 1017, -633, -408, 1072, -957, -220, 968, -904, 73, 720, -957, 242, 758, -920, 368, 419, -962, 543, 246, -906, 548, 128, -728, 818, -167, -719, 771, -142, -535, 773, -432, -397, 788, -483, -274, 535, -570, -22, 505, -529, 79, 381, -462, 134, 250, -475, 313, 156, -471, 214, 60, -244, 360, -86, -212, 307, 0, -22, 194, -140, -36, 326, -252, -43, 57, -166]
6030a66K58j27j04K42j61J26N2j89oK45l78K73k7l36O48l07k74M99k33k49O28
6051D14p15R8O98p75J43N76r10M73M72r84N76L73r19Q38pj117J227j78r38J116
6071D61l48q47J430p66o62J336p29n49J575j336o2J388j403J64J258j635M92J192
6089I59j757Q36N93j557J237L94j628J279K23j580J613l17j309J799n92j059J678
6106H12q30q30J819j162n76J770j354k02J522j502J75J354j669N07J041j633Q60
6123A02N61j627J178M55j719J519n0j417J652k69j363J494l54q71J494q01p22
6140g38J436q49l20J244j153j8J213j330L63Q24j086M69M92j145N61N00r35N81
6158A09J93q33Q21p0o47O50r3m77P28l67k84N68l33r3L49l17M1L62m18N1J89l12
$$ y = [-166, 92, -35, -139, 103, -58, 68, 120, -69, -75, 170, -208, 65, 38, -298, 350, 43, -231, 268, 35, -214, 414, -301, -203, 495, -280, -137, 439, -471, 2, 474, -510, 66, 439, -480, 358, 351, -766, 461, 283, -655, 461, 113, -734, 696, -70, -732, 604, -125, -674, 901, -435, -497, 891, -512, -348, 910, -725, -233, 959, -798, 38, 631, -926, 311, 705, -923, 356, 579, -1001, 612, 295, -1014, 785, 193, -866, 812, -18, -848, 971, -191, -767, 1003, -351, -553, 969, -533, -358, 996, -673, -166, 875, -758, 102, 663, -964, 214, 669, -1050, 469, 419, -998, 654, 385, -978, 516, 162, -709, 785, -16, -738, 698, -151, -471, 773, -380, -398, 815, -515, -152, 672, -414, 55, 547, -598, -37, 463, -472, 109, 302, -531, 290, 220, -427, 223, 130, -347, 381, 14, -270, 298, -35, -128, 221, -96, -55, 307, -111, -60, 129, -183]
6180a83L01j02k83L82j78NK21k49N7J12j64L0R2k35L77j33k06L22k59j11M94n09
6202b19n5O50n79J69L84p35L76L83q44M67L06p10O24n8p45Q54k2q24R83l82n90
6223e67J109n55n79J262q26k62J139j083n2J149j178K68Q88j373O20Q56j553Q74
6241A37M89j429J134J98j394J200O9j289J549l86j070J533n88r26J534q49n35
6258f23J535j164m10J638j290n1J237j634M87J208j498N66P89j511Q53O05j530
6275g93R72L79j388J272l1j272J487l57j082J484o44n66J301q63n11J353r05k41
6293d05J032j124Q9J153j263L67P62j190N43O82j276P37L39r97P93k8p54R59j36
6312B83p59P99k40m19O94l46k88N95l50r7N00n66M2N75o46J72K35m14J30K16k67
$$ y = [-183, 118, 16, -267, 115, -63, -58, 163, -86, -29, 83, -81, -51, 41, -194, 183, 50, -156, 166, -93, -204, 290, -219, -274, 376, -203, -34, 350, -385, -9, 374, -470, -3, 303, -407, 217, 159, -586, 268, 246, -578, 405, 23, -567, 542, -13, -592, 670, -156, -418, 721, -362, -414, 735, -443, -175, 713, -660, -40, 816, -737, 137, 626, -803, 331, 529, -865, 335, 404, -885, 664, 278, -792, 741, 153, -773, 761, -88, -623, 912, -252, -662, 976, -314, -365, 872, -762, -275, 933, -565, 1, 790, -721, 132, 737, -793, 179, 558, -830, 442, 411, -861, 626, 269, -813, 671, 27, -539, 762, -101, -612, 741, -164, -405, 627, -497, -408, 745, -518, -151, 611, -579, -36, 646, -630, 107, 446, -551, 242, 214, -540, 419, 283, -476, 323, 83, -336, 358, 12, -276, 319, -31, -128, 372, -194, -152, 423, -223, -51, 184, -230, -100, 116, -151]
6333a51R2J49j93K69k80o5J98l7j6K20m10K78qk44K06K1m1K43j79j93M15m39J13
6356e2K85o48L93L51o33K83L54p73P34j1p87P96j03o31P64k15n56R05m66m04Q56
6377D42o50j97J057r12k13J027q92K00Q97j362M85P18j324Q19L68j164J073J56
6395E28j220J015P5j113J307l62j101J521n60q30J542r32m45J513j147l84J502
6412I09j381J65J185j531M90J085j680O65P34j357Q94N03j572J097M00j376J229
6429D59j05j222J402k20j083J500q05o34J326p24o26J453q77k28J155j266L7J232
6447G74j121J88P05j162P00N18j283P24L13q93Q53or70J008r1o99Q22l65m73Q87
6467D29n08l62Q99n65j61O52o58L2N79n71K37L48o39L38K46n70K42J17k73K95
$$ y = [-151, -59, 90, -103, 166, -114, -179, 19, -18, -34, 186, -224, 54, 46, -198, 8, 29, -12, 231, 52, -141, 274, -165, -52, 233, -415, -22, 329, -304, -21, 333, -440, 294, 283, -504, 292, 189, -442, 322, 107, -449, 456, -10, -414, 442, -208, -405, 652, -260, -473, 554, -338, -138, 759, -603, -118, 600, -724, 95, 463, -701, 372, 528, -692, 323, 398, -715, 592, 230, -871, 650, 90, -740, 802, -130, -575, 938, -209, -593, 909, -472, -307, 878, -653, -163, 922, -758, -93, 641, -716, 178, 681, -891, 206, 606, -770, 459, 354, -868, 534, 314, -769, 731, -74, -708, 618, -106, -732, 721, -156, -384, 771, -495, -458, 774, -347, -159, 546, -616, 84, 602, -681, 43, 356, -537, 316, 310, -660, 348, 257, -442, 380, 15, -458, 429, -79, -441, 458, -107, -268, 384, -274, -242, 337, -234, 3, 351, -288, 50, 296, -274, -32, 85, -188, 107]
6487A07J9m32M90j28j15J08k71J30K90k37mM0p3K56l17m5K59k20O4K99m04K37
6509E3J78m18K34J01m82N32Q0o99N94j4l90N02l92l67Q88m05m13R05p05m1R14
6530F55r16P5O31p23K70O32j115L81O81j163P85K09j169J024J37j107J073k80
6548H0o03J171n15q11J318n45p01J329j034k31J293j009j71J212j238J98J050
6565G93j350L44J040j383N09P49j499R96M52j479J084K9j069J359k79j100J351
6582E47m52q44J348p20n46J484r72m21J313j076K7J204j386J28J146j232L83O97
6600F28j298P21N86j175O08L80j069R15J5r89J073k24n86Q54m60m81R81m96m12
6619d29R23o80o9P48p52n5P30o08J53L81p60L58M19o26K03J83m81O01q2l56L01
$$ y = [107, 126, -306, 184, 56, -59, 49, -222, -92, 198, -39, -43, -3, -76, 180, -137, -182, 77, -143, -79, 220, -184, 53, 231, -187, 47, 148, -334, 198, 278, -421, 173, 159, -231, 271, -121, -488, 400, -5, -418, 487, -218, -259, 655, -261, -186, 445, -278, -8, 624, -491, -110, 571, -592, 193, 402, -767, 257, 394, -713, 360, 80, -523, 648, 133, -678, 640, 95, -606, 723, -311, -542, 751, -258, -429, 783, -455, -257, 793, -557, -213, 827, -556, -47, 702, -797, 199, 651, -828, 256, 285, -784, 575, 296, -804, 547, 95, -749, 599, -121, -667, 817, -155, -576, 737, -339, -312, 892, -494, -366, 780, -452, -69, 628, -670, 51, 637, -538, 70, 450, -619, 296, 311, -678, 395, 171, -415, 439, -21, -502, 479, -17, -429, 494, -186, -255, 493, -259, -314, 416, -192, -39, 342, -418, -60, 359, -267, -64, 119, -362, 239, 157, -199, 102]
6640A02k6j38K35l08K4L78k04j37J11j32J36R9k21J7j0R0J80l15l7K55k31J42
6662A0J31l94M84l8m06L37j10k66O12l55m62O00r3k49O05n63r7O64n88kO48q24
6684c56L63N45q63L45M99r25O93O1j020Q79J84r70Q81p6p53J098l91q65J155m68
6704A6n05J180q57m66J452j042k49J082j165L69R29j330M23R03j373O92M99j360
6722h02R46M11j293J011J58j182J350k99j150J319l19q21J382p91n46J450q67
6739d3m00J212j185J25J006j216J97J037j190L43O49j198O39O43j145O61K51j037
6757f51J129p7j097R81j32o24J054m61o85R97m26l56Q76o25j78Q64p68p8P68q49
6777c38L06M61p98L41M27o22J35K67m84M29K02p01L02J34l05N49k93k02L51j57
$$ y = [102, 76, -62, 173, -135, -111, 267, 63, -74, 37, -95, 41, 140, -81, -64, -74, 16, 196, -119, -156, 99, -132, 10, 141, -253, 231, 193, -213, 124, 14, -252, 360, 5, -457, 143, 50, -199, 406, -157, -254, 410, -178, -180, 468, -356, 7, 552, -311, 34, 533, -392, 301, 362, -658, 221, 405, -565, 316, 240, -513, 585, 194, -671, 484, 16, -489, 691, -166, -632, 820, -222, -471, 611, -554, -185, 744, -586, -163, 740, -633, 59, 558, -802, 144, 555, -738, 273, 431, -751, 599, 300, -850, 469, 150, -671, 711, -80, -626, 824, -43, -443, 769, -416, -291, 715, -501, -304, 733, -457, -114, 535, -663, -24, 619, -526, 135, 386, -651, 478, 401, -696, 285, 153, -471, 583, 122, -563, 434, 8, -348, 528, -97, -275, 589, -179, -257, 511, -338, -32, 429, -369, -28, 399, -223, -88, 179, -305, 124, 326, -375, -73, 61, -244, 305, 12, -190, 161, 4]
6797Dn9K01m07R9L20j65p6J13j39K71q0k28J55j41K33O0k79M9K20j87L4q1j16
6820a99L78J4l78L40k85r2N25m21k07O77l88j64L92m83J78O40p89J69L98o96M99
6841A08J40p18O23J52p08O67j13o34R03k17p75R47l94l21Q95p62l19J108o53j92
6861b63R25r98R8J002j294L37P35j142P38N52j447R37L78j204R43Q0j213J255
6879D19q0r85J037l65n89J191n44q58J472p67l97J096r50n8J094j074J23R20j083
6898c98M12P40j426O44N57j132O85L84j087Q64K99j113Q61j20p96J116m42p13
6916f65J237m96m10Q64p40k21J097p58k01O86p16K55N66j016L77M81n92L38J47
6935B33o70M99K13n76L16L4l48N11o6n37N69n3k38L26k35j61M31k22j81J41j57
$$ y = [4, -55, 146, -261, -162, 158, -7, -83, 30, -109, 162, 82, -146, 9, -132, 101, 161, -118, -69, 151, -36, -2, -83, -199, 179, 193, -185, 155, -130, -222, 303, -118, -325, 352, -36, -200, 192, -291, -113, 527, -262, -93, 305, -391, 108, 248, -470, 153, 305, -403, 264, 151, -483, 420, 203, -572, 375, -19, -340, 555, -207, -526, 582, -71, -263, 662, -336, -238, 764, -530, -193, 542, -600, 138, 690, -757, 180, 558, -646, 297, 377, -836, 419, 339, -646, 391, 26, -563, 628, 84, -774, 698, -69, -466, 630, -320, -378, 716, -358, -235, 685, -398, 14, 754, -672, -28, 529, -603, 82, 466, -621, 243, 542, -571, 290, 170, -626, 490, 48, -665, 572, 76, -334, 530, -210, -431, 666, -92, -293, 393, -323, -68, 498, -518, -141, 340, -252, 86, 233, -437, 62, 275, -301, 15, 49, -299, 212, 146, -391, 178, 125, -113, 213, -22, -183, 248, 26, -155, -14, -171]
6956a71L30%k00j8Q8j5L4o5k72L31q1Q6o2j44J58J67m04K51n8j30L88k53j98M07
6980A69k77N6L53m98Q5M47m22PL32o56N90K31p87L33K52n42O21j08o35P26q6o17
7002d26P26l80l49J011o33l59P96o18N5P86r67n3J026r19J03Q68j267O78N16j211
7022f17N77M15r16Q27L7r78J044o1r01R90l67o65J244n97n87J051n99l08J024
7041F13r11j77J132r48NQ93j133M07P77j142L67O75j082O62L50j168R38J88j006
7060e60Q70n7p28R60k63p87R68l37m40R98p17l93J035o46k45Q04q61J32Q49q81
7080b99J64N34p08L72L28q44M65L33o08M30q2n02O64n2n66M74o0k21N56n00j68
7101b90M92k02j54K24k48J55K37m00M4J76k23K67J0k69K05J74k06N5k35J56J42
$$ y = [-171, 159, 159, -41, -59, 29, 14, 48, -17, -289, 42, -39, 47, -15, -159, -1, 166, -238, 13, -45, -175, 213, -40, -238, 169, -108, -52, 301, -197, -112, 335, -87, -80, 252, -404, 186, 417, -370, -37, 215, -327, 294, 186, -449, 277, 191, -426, 300, -80, -429, 582, -51, -410, 386, -232, -177, 609, -358, -411, 615, -304, -201, 667, -600, 78, 594, -617, -40, 375, -541, 286, 323, -655, 389, 328, -573, 417, 50, -615, 629, 32, -555, 496, -103, -411, 613, -298, -475, 657, -291, -286, 607, -526, -119, 658, -484, -117, 558, -524, 138, 488, -680, 258, 446, -560, 310, 253, -475, 485, 222, -565, 403, 66, -374, 624, -93, -486, 549, -97, -342, 462, -399, -267, 582, -299, -135, 399, -309, 63, 391, -453, 12, 345, -263, 167, 85, -417, 247, 195, -371, 103, 43, -178, 378, -122, -290, 202, 0, -154, 70, -178, -23, 214, -186, -142, 34, -189, 78, 88, -181, 24, 198, -8, 47, -188, -32, 110]
7122A10j36Q8j85j17M11l9k96K55j40N5J94k46j12L70k43p7K52m37L75K88n71
7143b01K53J19n08N69n4n85N28K8l81N43k89m06Q65m22n09P67n59O7P26q42%Q45
7165E54p58J77M75r62N55O25j124N42J39q45R58L7j025Q95jq10J003m28o71J137
7185D73l66p17J131p21l13J273r45l92J124o64o1Q55j260L88J005j189L26N57
7203E04j093P49L52j163Q13J76q39R17k75p53J037j58p32Q52l80n37J132o44m84
7222e26J036o36q3O77q83J27Q01p41M3N76p59M19M56j047O09K42o13N04m8n17
7242c63N35Q0n79N25j19l83P08m01k49N69l15q4K46k47m2M81m13p8K86l49L00
7263A08Q2m69J29J10P4Q9o7k51L06o2p6O5j80J19P6k01J60l0p3K34j15j55K66
$$ y = [110, -26, 62, -123, -240, 171, 132, -164, 91, -49, 6, 200, -46, -158, 212, -31, -108, 144, -293, 82, 370, -201, 52, 171, -337, 232, 178, -407, 121, 149, -232, 311, 22, -384, 481, 59, -450, 317, -242, -175, 551, -291, -291, 554, -204, -27, 448, -514, 41, 666, -458, 84, 223, -622, 336, 373, -652, 243, 242, -568, 435, 7, -664, 473, 107, -610, 521, -200, -513, 760, -185, -577, 547, -117, -178, 677, -583, -195, 810, -379, -53, 504, -589, 160, 512, -651, 162, 338, -501, 416, 141, -612, 425, 267, -465, 387, 7, -530, 602, -42, -526, 510, -126, -209, 468, -415, -288, 513, -228, -185, 391, -368, 51, 507, -540, 69, 311, -302, 202, 154, -363, 172, 252, -327, 198, 79, -304, 404, 3, -246, 323, 8, -76, 170, -77, -119, 362, -51, -129, 157, -192, 108, 190, -279, -150, -40, 34, 123, 56, -195, 111, 49, -27, 38, -142, -23, 53, -148, 12, -18, -91, 143, 28, -127, 139]
7286A39k14Q2K58l62j5L54l59J47m2l05L66J38n09L38J15m26O01l13l93O18j38
7307H0k94N88n82n0O67m93j75O95o56R4O03r48M98N31q64M33J23p67P87K60j043
7328e13O41M1m65P95l83p20R85k71o01Q50n03l34J052p64k89R33p18J12P94j101
7348d59K07Q23r34K92N45j030O04N51j144N36M33q85Q44j95q35R78m9q25Q69k83
7368D3n82J047m20m82Q23n17j88Q69r02M5P76q17J51M77p52N17M91r37L46K54
7388B42o44N66J66p73N30K44n73M82k48k78O04j44n33N49k29j66M56m77o6M97
7408B05k04j14K79l45J79K23l83J17J7l3K17p2l29K75Pn0n4%R0J03r0L3m8j03
7432h0J36N2k10K51k47k8L40l30ML51l11m8K53k92K28J64m65L55k2l69N60k07
$$ y = [139, -75, 7, 265, -97, -112, 242, -117, 30, -12, -317, 49, 187, -322, 16, 131, -295, 306, -7, -400, 218, 80, -214, 374, -208, -258, 409, -84, -259, 436, -220, -126, 477, -471, 27, 558, -306, 127, 250, -517, 270, 530, -513, 128, 169, -296, 499, 116, -604, 381, 110, -491, 359, -144, -478, 574, -190, -479, 454, -264, -152, 642, -459, -252, 571, -363, -71, 474, -556, 48, 599, -545, -9, 424, -461, 383, 188, -647, 331, 282, -543, 326, 43, -539, 508, 88, -394, 429, -88, -276, 593, -309, -264, 512, -305, -154, 323, -429, 88, 579, -358, -12, 242, -402, 164, 330, -443, 87, 331, -242, 240, -8, -286, 318, 174, -359, 190, -39, -205, 251, -226, -292, 205, 1, -113, 166, -179, 0, 223, -160, -43, -26, -59, 158, 86, -243, 32, 39, -11, -65, -65, 25, 128, 38, 71, 23, -80, 56, 108, -102, 149, -98, -126, 214, -116, -112, 239, -72, -120, 133, -159, 69, 233, -232, 123, 101, -268, 292, 85]
7454H5l15M69r3k83L45l78LN10l89j31L99n35K36N42q29K57M92o22K90J99p13
7475d61O18J25o58M86L6n94P94j57o82Q65l08l93P00n58k78R46m55l23O67o87
7495c17J25O88p28M9O36p18K64L99r39N41M70r36O07J44p64Q06O7r67Q03O0o11
7516c21P13l37o03J086n40m27Q01n77n8O67o05j94Q92o53P5N09q76L21N98p41
7536b70L12K83p31O61J53q56N50J05m85N73j91m31N48j9m88M46k24j44N77m35
7556f6j80M76k75M1J70m14J43L66l85O4J28k72L54j1m11K01J63k42K50o4j49K30
7578A17k6r3n0p9K62J9q0M4j29L3K07j51k18J44j62L24j28l01K88Q0j82J38j01
7601d4j73N01j45l24K56O5j94K26k07j07M00l23j0L25m76R9M30m79P3L70m33K65
$$ y = [85, -230, 239, 146, -137, 208, -170, -167, 343, -46, -177, 222, -313, -77, 465, -364, -107, 385, -237, 53, 252, -461, 157, 282, -376, 110, 146, -448, 346, 189, -493, 372, 64, -329, 371, -187, -465, 481, 26, -297, 370, -317, -192, 496, -232, -183, 453, -265, -1, 398, -541, 0, 470, -466, 141, 285, -479, 327, 394, -573, 230, 290, -321, 392, 55, -548, 538, -2, -429, 372, -205, -263, 404, -201, -395, 497, -156, -81, 428, -448, -127, 471, -270, 42, 325, -406, 255, 408, -448, 102, 207, -278, 295, 104, -327, 221, 202, -286, 160, -64, -208, 369, -66, -246, 230, -45, -4, 166, -248, -105, 261, -124, -60, 68, -204, 150, 139, -272, -71, 92, -150, 100, 36, -113, 117, 91, -2, -52, -131, 131, 150, 70, 114, -15, 18, 225, 74, -144, 0, -162, 162, 34, -267, 21, 101, -81, 57, -44, -217, 284, 139, -185, 71, 136, -58, 168, -39, -146, 254, -69, -79, 246, -230, -131, 299, -180, -107, 263, -170, 95]
7623I5J57n28K87L17o13M15j04l60O77j65n00N69k43l18P60m51l94P00l82j38
7643b19O41p04J09P15q21O6N67o29L78K67p83L47L79o38M91J32p94P61k5p57P22
7664B05M2o27Q06l25n51P48k40k69O01o24j89Q48n46j41N88o07K55M49p87K00
7684a64M92o51K35L19n92M98J37n66M11R4m90N98j24n85O12J7m98N33m06j28O11
7705C53k51l23M50l24N8K81m21J13K69k81Q6K10m19K11K16l34L2J11j94K45m5
7726D3j54J05J43l20K17k07K0K48o7q7qK9R1m8j05J44q5J13R4j54k2J42q3j7m7
7751a5j17K10J08k83J20N6j16K57k14j28K54j86Q7J67l44l0M26k67j10K83j92
7772c4J12P5l63J97K15m72N02n2m98M02Q0l65K95o4k61N22k44l34N22k04r3L48
$$ y = [95, 252, -276, 11, 328, -285, 130, 26, -334, 343, 178, -322, 247, 4, -314, 446, -5, -399, 301, -81, -219, 422, -282, -173, 542, -279, -213, 354, -275, 103, 370, -413, -66, 313, -325, 166, 298, -496, 265, 240, -517, 205, 247, -380, 426, 101, -450, 298, 58, -211, 390, -234, -423, 425, -121, -262, 326, -281, -26, 423, -364, -164, 328, -323, -88, 231, -361, 137, 274, -292, 119, 213, -277, 321, 197, -388, 224, 241, -257, 276, -130, -258, 353, 102, -221, 229, -95, -37, 244, -177, -64, 205, -76, 10, 220, -199, 12, 228, -106, -74, 37, -157, 88, 43, -111, -6, 137, -183, 34, -173, -153, 95, 28, -59, -67, -38, 53, 5, -100, 44, -41, 72, 166, 12, -10, 132, 49, 32, -15, -132, 78, 186, -97, 23, 79, -37, 220, 6, -122, 132, -54, 33, 200, -144, -174, 252, -15, -125, 158, -34, 78, 153, -210, -13, 202, -270, 232, 180, -318, 84, 164, -201, 94, 30, -231, 291, 47, -287, 235, 31, -62, 286]
7794B86m94K3O15n58j0M31n74L73K22o50L24K56m92L84M1p09P08J14p33N80m2
7815I5m16O21k88l58O28l35k09O85n72j30O32m60j60N27n15K34M41p19J62M57
7835C20n50J91K84o94N07L47q32N51K6m94N71k3o28O56j90j13L18l37l47N88j45
7856Fl26M24k14jM35m13q9L34k91J32K22l99J94K62l90J37M2k12K78R4m47K66
7878D4N5j03K00k87o9K73n0j19P1j29J61M3j29oJ17m5M9j67o5K36j32J82j52o2
7902h4R0J05q8o0J4o1K21j74j32K03rN7J22l74M0J86j65J56j6k35L24pl03K56
7926F6O4k11J95j8k47J86O7m33L84q3k00N01l20k17L83q0j14K98l21K6L07l97
7948a64J11L09n85L43J94l79J40K13m01L69J35o45M50J40m23L91j48l93N96j84
$$ y = [286, -208, -185, 430, -128, -138, 293, -281, 92, 314, -336, -12, 244, -248, 136, 177, -532, 176, 290, -443, 137, 95, -321, 300, 12, -346, 282, -53, -262, 423, -149, -279, 353, -107, -267, 260, -255, -21, 420, -299, -137, 320, -230, -39, 245, -449, 58, 405, -427, 124, 150, -344, 227, 204, -424, 232, 42, -71, 247, -90, -437, 151, 6, -320, 104, -110, -111, 324, -89, -178, 156, -135, -3, 219, -180, 14, 276, -114, 23, 65, -147, 131, 225, -222, 44, 99, -4, 196, -91, -160, 113, 63, -56, 15, -114, 47, 90, -39, -45, 72, 27, 76, -91, -156, 80, -52, 130, -22, -84, 6, 111, 23, -37, -23, -84, 137, -37, -169, 34, 25, 82, 204, -170, -130, 56, -109, 47, 31, -204, 120, 113, -190, 66, 130, -81, 114, 96, -151, 35, 102, -331, 53, -30, -230, 271, -49, -266, 117, 37, -77, 221, -100, -74, 233, -164, -53, 256, -329, 14, 208, -171, -31, 182, -219, 150, 285, -360, 90, 230, -193, 198, 50, -343, 253, 69]
7968F9m10M95j97n4L72m14p4N24l10j54M13m75O2M79n08O6L94m49K84J43n79L86
7990F3K32n67M22l8m55L84J37m73M58j51k46N03l46j89N51k62j64L58m14j5N12
8011C00m30J13J14k04J50J63m04j6N69n29K53k1k05L15l9k70J74M8k12K34j50
8032d7j81L72Lr8L6k05N3K14j30j09J03j1R9j1j41n0J97K8q0m5n1O0Q3j45J42
8057H6k28K10N0j39M1j38J43N0l1r1K5j9J72n3k62K02J39k79J66r5lJ92j14k42
8081b18J90M9n3K77l46r1M16k09kM5j65L9K56k26r5K74k14J71L9l47J41K54l36
8104a51K04J27l49L64om64J99J71l08N57l06l59N66j26l35M02k69JM00l78j42
8125b02L31k01JM62n46J84J91l46J45J57m52L22J57m77K77Q3k42K76j18k58L92
$$ y = [69, -341, 154, -43, -97, 275, -139, -213, 311, 1, -153, 260, -215, -153, 326, -182, -116, 278, -171, 113, 256, -323, 63, 295, -272, 150, 112, -343, 41, 178, -295, 163, 12, -234, 269, -77, -266, 285, 23, -141, 217, -197, -212, 300, -130, -17, 97, -107, 43, 206, -198, -214, 355, -174, 79, 58, -147, 168, 129, -141, 33, 81, -131, 103, -47, -228, 144, 147, 49, 85, -120, -67, 147, 17, -92, 11, 0, 99, 88, -53, -103, 94, 122, 42, -3, -54, 6, 89, -56, 86, -142, 68, 118, -21, 20, -118, 25, 75, 44, -47, -22, -41, 131, 78, -184, 18, 157, -122, 44, -51, -54, 138, 24, -218, -28, 21, -32, 245, -101, -192, 224, 15, 13, 58, -107, -68, 188, -38, -133, 141, -73, 98, 137, -210, -69, 185, -151, 53, 180, -169, 195, 189, -275, -76, 95, -213, 344, 38, -321, 245, 119, -216, 186, -83, -82, 318, -60, -202, 129, -72, -71, 391, -155, 29, 220, -126, 19, 176, -276, 46, 203, -274, 3, 86, -156, 120, 2, -256, 136]
8146A36l9l13K86j11q4M18l71j19M08j44j58K87l96pN14l48m4J69k37K26J66m11
8168a72J37K24l05K38K7l55K26K06k72J03lj36J75Lj74J30q0lJ79k63OM26k46
$$ y = [136, 97, -216, 70, -41, -125, 293, -78, -197, 211, 67, -91, 196, -200, -207, 307, -41, -85, 84, -153, 73, 239, -172, -35, 189, -116, 122, 149, -206, 20, 226, -46, 57, 54, -82, 93, 96, -78, 52, -28, -31, 148, -115, -109, 317, 71]
8191G1
$$ Imaginary data points
##PAGE= N=2
##DATA TABLE= (X++(I..I)), XYDATA
0@%%%%%%%Qj6J6j6K4l2M0n7P3q9J13j38J70k09K50k98L47m04M75n57O48p50Q61
30D59r83J121j277J451j643J852k079K330k607K913l247L610m005M436m911N429
46B849n993O612p287Q025q839R738j0731J1833j3063J4443j6006J7795j9861K2275
60A1790k5143K8617l2922L8418m5719N5922p1264R7139j51479M44724m97987l25505
72d73409J027369q92367K89439O21239j122330L80559P90887j022846M34686K88734
82C21961r03365Q14573K41780j064870P16639J04279o48274Q21503l01199p10034
92f07007R86915k15846n25959P04070m92203j89801Q91187o42341k69954O96307
102C35368n04356R5569N01296p93934J95356N85859o11997J87396K08645n80894
$$ y = [0, 0, 0, 0, 0, 0, 0, 0, 8, -8, 8, -8, 16, -16, 24, -33, 40, -49, 64, -74, 96, -113, 137, -161, 186, -218, 257, -300, 348, -402, 459, -524, 597, -680, 771, -872, 980, -1099, 1231, -1376, 1537, -1710, 1900, -2105, 2331, -2580, 2849, -3144, 3468, -3819, 4206, -4633, 5105, -5626, 6207, -6856, 7587, -8419, 9376, -10485, 11790, -13353, 15264, -17658, 20760, -24959, 30963, -40301, 56838, -94641, 350083, -147904, -473409, 553960, -338407, -48968, 572271, -550059, -169500, 621387, -401459, 33227, 321961, -581404, 233169, 474949, -589921, 126718, 230997, -417277, 404226, 103027, -607007, 379908, 164062, -361897, 342173, -150030, -339831, 551356, -90985, -360939, 335368, -168988, -73419, 427877, -366057, -170701, 415158, -196839, -9443, 199202, -381692]
112c81692N19415J93913o71350L64219R7911l40080M79687k10002m21339N59375
122A90057p9961k57585L16305l08800k0565M73919l52052j28283K75196k17710
132a09479J67832J38451m19851J60679K15499k06832J32101r5047j83514L45903
142A45742l9681k16875J37562j07019O7615K17633k98566k7416K04115j21262
152c8152J25974k6905k82117K69919R2090k26260J48949j28009p3952L69160k15386
163A5311j95292K80572j64906N6824K30584m21933Q3942L41062l21144J10415
173A5435R5799l81533L70803J35711m79584K81236L9828k79877M42999j85583
183E5234l89457N26715j18804k50754M08825l59269r4662N78676m18997j42398
$$ y = [-381692, 137723, 331636, -339714, 24505, 122416, -217664, 262023, 52021, -369318, 190057, 110096, -147489, 168816, -139984, -160549, 313370, -38682, -166965, 108231, -109479, 58353, 196804, -223047, -62368, 153131, -53701, 78400, -16647, -200161, 145742, 106061, -110814, 26748, -80271, -12656, 204977, -93589, -121005, 83110, -38152, 87822, 60917, -221200, 48719, 140809, -85451, 63498, -64511, -138463, 230697, 15311, -179981, 100591, -64315, -7491, 223093, -198840, -114898, 226164, -94980, 15435, 111234, -270299, 100504, 236215, -243369, 37867, 77695, -202182, 240817, 55234, -334223, 192492, 73688, -177066, 231759, -127510, -222172, 356504, -62493, -204891]
193b04891M34433m04014J36914L77443o17230J61978M13775m96596K42733J51718
203A96263n58559M72812J72770n91319L92009K5203l98544N65502j79901m79188
213c82952O01645j42826l02417N09253l90788j69449O52600m25892j74075M86861
223B61960m43086R8812M55300o29019J12897M48591n05296K25778K03403n82268
233c52928M18425K29155n77739L47898N6502m06655N19323j05376m78946N16848
243A66507q0548k89533M46964l12191j92903N60762l04687j84975L88804l34967
253a36767N6608L82221m74626L5176L53285l40946J44571J48896m24993K80131
263B3556J95453l86635J96043L4775k49392L47954o3779l24014L04250k8809j43531
$$ y = [-204891, 229542, -174472, -37558, 339885, -277345, -115367, 298408, -198188, 44545, 196263, -362296, 110516, 283286, -308033, 83976, 109179, -289365, 276137, 96236, -382952, 218693, 75867, -226550, 282703, -108085, -277534, 375066, -50826, -224901, 261960, -181126, -82314, 372986, -256033, -143136, 305455, -199841, 25937, 229340, -352928, 65497, 294652, -283087, 64811, 121313, -285342, 233981, 128605, -350341, 166507, 85959, -203574, 243390, -68801, -261704, 299058, -5629, -190604, 198200, -136767, -80159, 302062, -172564, -137388, 215897, -125049, 19522, 168418, -256575, 23556, 219009, -167626, 28417, 63192, -186200, 161754, 97975, -226039, 78211, 49402, -94129]
274i4129K48309k16381j01679L38244j62550r6067J67245j88594R4638J86204
284A75240k74452K9101J46253j31591J23350j6849k06402J89795N2544j34017
294d7028Q5219q8342k0751K01147j24719q3894J04070o9218Q5251M8877k03734
305a13122Q4751R7470r5847Q6663q0583j01221K21582m7669j26214J17361j06605
316f3434L6857J84223k29896j8417J82422j45383Q8984N8349k68086J87916J29963
327A43498k47104J39927j1351j80996L03523p0564k67113K74889o6454j17408
337i9153K81025k49452j09418L76357k18661p7533K49071l00323R7866K98969
347B48748l95656O4440K46500l14798K06864J11817m24088K91842J49246l66052
$$ y = [-94129, 154180, -62201, -163880, 174364, 11814, -84253, 82992, -105602, -10964, 175240, -99212, -70111, 76142, -55449, 67901, 51052, -155350, 34445, 86989, -47028, 38191, -50151, -70902, 130245, 5526, -78368, 25702, -43516, 41735, 90612, -113122, -28371, 69099, -26748, 59915, -20668, -121889, 99693, 52024, -74190, 43171, -63434, -26577, 157646, -72250, -90667, 91755, -53628, 35356, 93705, -174381, 13535, 143498, -103606, 36321, 24970, -156026, 147497, 76933, -190180, 84709, 18255, -99153, 181872, -67580, -176998, 199359, -19302, -96835, 152236, -148087, -50221, 248748, -146908, -82468, 164032, -150766, 56098, 167915, -256173, 35669, 184915, -181137]
357a81137K66622k3270l01180M24624q1964l48290L75020j09649j80032L93367
367B34111k89653j68163M55678k56640j00819L22906l52766O5267L71063m25401
377a44417M3667K88682l52693J98639J68758m58149K64484J91467l83383K58358
387G5413J1817l34945M05441k8561l66123L48129p6277k00922L82001k38600k01458
398b24085M21652j99010j20091K99678l04026K3415L49369l46625j695K53526
408A52108k81473J47742J59639l76388J81379J76909k83321J74966J3239k53806
418a89006K95452M102k69770K17780m1175j19721K53069j61859j43793K66302
428A11381j01970o3541J53113j92135L5548K07393j95029p749J09135j31170J17601
$$ y = [-181137, 85485, 62215, -238965, 185659, 103695, -244595, 130425, 20776, -159256, 234111, -55542, -223705, 231973, -24667, -125486, 197420, -155346, -90079, 280984, -144417, -100750, 187932, -164761, 33878, 202636, -255513, 8971, 200438, -182945, 75413, 87230, -247715, 157726, 129165, -236958, 111171, 34894, -166028, 215973, -22627, -224085, 197567, -1443, -121534, 178144, -125882, -102467, 246902, -99723, -101418, 152108, -129365, 18377, 178016, -198372, -16993, 159916, -123405, 51561, 64800, -189006, 106446, 110548, -159222, 58558, 17383, -102338, 150731, -11128, -154921, 111381, 9411, -54130, 98983, -93152, -57604, 149789, -45240, -52989, 56146, -75024, 42577]
439D2577M8216k05870J05133P2806j00848R1030o4159q6931J73579l6061q8826
450d9354P1556o8155M0395J02351j43422j023Q1363n7490P3455k6860j23435J29516
462B8897K1377q2021P0938q5854p567J63692j19124n2964J06683r5282P1842P7262
474I7879k05984Q2179J13092j44064R8915j2947j64594K14094K304j92255J61840
485E0459n4038q4015K32282j59250j26146K54145j25763m3096J86117k40874L7116
496g3063K53660k56699K2617J64118k43621J65463J25972l34343J74487J25693
506A24284k56788K16449j6866k74735L21988j4274k67608K69918r9803j53427
516a50862L45731k02161j76839L41351j82730o6866K76408l03658R901L27133
$$ y = [42577, 90793, -115077, -9944, 62862, -37986, 53044, -11115, -98046, 75533, 39472, -49354, 22202, -45953, -5558, 96793, -46629, -47652, 33711, -23779, 49676, 22816, -100619, 28897, 50274, -31747, 39191, -46663, -54230, 109462, -9662, -62626, 44057, -51225, 20617, 97879, -108105, -25926, 87166, -56898, 42017, 29070, -135524, 78570, 80874, -111381, 50459, -3579, -87594, 144688, -14562, -140708, 113437, -12326, -55422, 130695, -110179, -73063, 180597, -76102, -53485, 110633, -132988, 32475, 158447, -175896, -1409, 124284, -132504, 83945, 67079, -207656, 114332, 100058, -167550, 102368, 2565, -150862, 194869, -7292, -184131, 157220, -25510, -92376, 184032, -119626, -109725, 217408]
526B17408l05685J8637K17648l01922J62958J84977l76925J65749J61389k91368
536a47134K21917K1574l13555L09600K7634k88365K60371p0936j82964L37761
546A75903j54282k05636L17622j40486r0853K67684k59009l2239L10953k45273
556e5616j8116K02793k54450J14850J86917l15664J04225J54876k30601J63958
566E3172L4561k62427K29860N0435k24083J77705m4632j36546K49544r8180j62837
577a33428K11162p9675n2664J69189j77054k3733K03354j38719j4617R8188j46094
588h4091Q9989R9992j81096N1286O9293r3439R9959k2945j26717J28923J3425
599D4579p7992O5678o4047j2252J23141p9857m3117O2033m6575N2376K7602j15516
$$ y = [217408, -88277, -69640, 148008, -153914, 9044, 194021, -182904, -17155, 144234, -147134, 74783, 96357, -217198, 92402, 120036, -168329, 92042, 21106, -161858, 175903, 21621, -184015, 133607, -6879, -97732, 169952, -89057, -121296, 189657, -55616, -73732, 129061, -125389, -10539, 176378, -139286, -35061, 119815, -110786, 53172, 87733, -174694, 55166, 105601, -118482, 59223, 14591, -121955, 127589, 29409, -133428, 77734, -1941, -54605, 114584, -62470, -86203, 117151, -21568, -36185, 62003, -84091, 5898, 105890, -75206, -23920, 45373, -48066, 51893, 28948, -97769, 31154, 44579, -33413, 32265, -31782, -44034, 79107, -750, -43867, 18166, -28409, 23967, 51569, -63947]
611f3947N0387M8849m9655N1104n3267m7822J21325l5943n4348N7967o9795M0800
623d345Q9925j35190J3973P9900q3416P6829M173j45559J30362L7223j24027J01224
635D1072m8124p8155J86532q2866j15848J61005q1958k2087J54711j81532j0628
646g7878J95310j57650J3451J12051j96506J14612J28913k39149R6210Q7861j82565
657a05340J74718L815k32195K17568J7035j85849J97168q5706j37793K77678j21603
668A9496j51203K38836j39204m4152K37386k38192k7562K57922k14649K0381J67794
679A26853k61420J19760J79793k90015J10503J17382k35254J97824L6834k78363
689a76103K28707L8707k18181K17388p0531j74662K88266r5936j75718K40764
$$ y = [-63947, -13560, 35289, -14366, 36738, -16529, -64351, 56974, 21031, -33317, 24650, -45145, -4345, 85580, -49610, -35637, 44263, -39153, 37676, 41849, -103710, 26652, 63875, -60152, 41072, -7052, -85207, 101325, 18459, -97389, 63616, -18342, -40429, 114282, -67250, -77878, 117432, -40218, -26767, 85284, -111222, 3390, 132303, -106846, -10636, 77225, -105340, 69378, 73193, -159002, 58566, 75601, -110248, 86920, 1214, -136579, 141099, 19496, -131707, 107129, -32075, -76227, 161159, -77033, -104595, 153327, -61322, -40941, 126853, -134567, -14807, 164986, -125029, -14526, 102856, -132398, 65426, 102260, -176103, 52604, 91311, -126870, 90518, 19987, -154675, 133591, 37655, -138063, 102701]
699A02701j23174o8790K45533k10725n9175K51317j80814m923J67983k31926P9748
710c2245J83032k44702O7216J16297j97039J51236N4202k39311J66297N5578j74442
721i3881J58790m3166j47192K19708n1252j44845J67352p9477m9802J78180j46271
732c1856n5498J74548j09089k629J00155j54944N6946J20384j47771L3900N5222
743C9368j03508J03831J4544j36204R2175K3205o7416P9184n5952n2802J18525
754E4950l8883m7550N3441n4611K8345O4945r1854N579M6776l8006M7372j7888
766A2616o9780P5034P093m0103L8403n4497N857Q5764p1370j4978M6680n5811
778c5092N8393K5068j13839O4854L8147p2370P4715l8461p7776J36429l3544q4552
$$ y = [102701, -20473, -89263, 156270, -54455, -113630, 137687, -43127, -48050, 119933, -111993, -32245, 150787, -93915, -26699, 89598, -107441, 43795, 97997, -141314, 24983, 80561, -93881, 64909, 21743, -125449, 94259, 43007, -101838, 65514, -13963, -63765, 114415, -31856, -87354, 87194, -21895, -24524, 75631, -79313, -22367, 98017, -49754, -15854, 39368, -64140, 39691, 54235, -81969, 10206, 33411, -34005, 45179, -10773, -63575, 54950, 16067, -31483, 21958, -32653, -4308, 60637, -31217, -25638, 21138, -16868, 30504, 12616, -57164, 17870, 24963, -15140, 23263, -31234, -25377, 60387, -10983, -25961, 20719, -35092, 23301, 48369, -65470, -616, 37531, -34839, 39876, 1415, -76361, 60068, 26524, -58028]
790e8028J02585o9846j5208J36066j28885l1096J38090j08253K3895R0260j69065
801h9485P3515J16665j68926O8660N4274j52518J49175K3553j90969J50101J3788
812D7833j34087J69030p2369j32083K18977p4189j13736J78837j24225l8687K10412
823A35713j79203m1793J93738j64849K9751J44810k26640P7777J59584k18284
833h9396Q8080Q3961k07086J71084N4051k35715J70440K8083j73514J99357n9420
844B9925j71806K39782o2644j40415K01784j22884o7803K33186j68418o6873K04869
855A08703j57647R692J62276k17330M8591J69778j97796O2328R3510j91918J36601
866B6788P3705k11586J27156M3689j49614J56652l0152j55642J84538k5188j20280
$$ y = [-58028, 44557, -25289, -40497, 95569, -33316, -64412, 73678, -34575, -10680, 79580, -89485, -15970, 100695, -68231, 429, 54703, -97815, 51360, 74913, -116056, 34045, 47833, -86254, 82776, 10407, -121676, 97301, 23112, -90624, 88213, -36012, -74699, 135713, -43490, -85283, 108455, -56394, -26643, 118167, -108473, -30696, 128888, -89396, -1316, 82645, -124441, 46643, 100694, -135021, 35419, 63502, -110012, 89345, 29925, -141881, 97901, 35257, -105158, 96626, -26258, -94061, 139125, -29293, -96166, 108703, -48944, -39252, 123024, -94306, -45715, 124063, -73733, -11405, 82105, -109813, 26788, 100493, -111093, 16063, 59752, -89862, 66790, 36638, -119004, 65534, 40346, -79934]
877g9934J47077q2025o1641J77808j09334o7507J44636r8000K483J12916j48282
888f1803K1802J21190j19330L1690N2659j18410R0691M7005j28105O6955K1143
899B5487p0540R2791l4095q1667J01838j5943m4333O0445o0864k675Q5700o5408
911i264j4775M2185m3980M2046J7917p6524L8604K3539l2152L8609l7345k6577
923c7717P2552k7123k3090L0916m6833L3856M4324p8871K0544L0537m5383N8464
935C2176j6455p5639Q5675k596n4717O7408n5786k3407J11088p5391l6821Q9030
947D4565p6893K3775P9972j31072L4127R3062j12820N4545L6604j30896J13476
958B8445L7909j44659J02856L681j03337J46505m9714j20791J63193m8159q0493
$$ y = [-79934, 67143, -14882, -76523, 101285, -8049, -75556, 69080, -28920, -26437, 86479, -61803, -40001, 81189, -38141, -6451, 46208, -72202, 18489, 65494, -62611, 4344, 25487, -45053, 47738, 13643, -68024, 33814, 17871, -26462, 33983, -26881, -29556, 56144, -9264, -24039, 18146, -25834, 16212, 34129, -42395, -3791, 19748, -12404, 26205, -11140, -37717, 34835, 7712, -15378, 15538, -31295, 2561, 46885, -31986, -11442, 19095, -26288, 32176, 15721, -59918, 25757, 23161, -31556, 35852, -19934, -43341, 67747, -7644, -44465, 44565, -32328, -8553, 71419, -59653, -25526, 67536, -45284, 9261, 45865, -85031, 28445, 66354, -78305, 24551, 28232, -75105, 71400, 21686, -99105, 64088, 15929, -64564]
969f4564J44534j10135m3778J79878j28334l9687J44088j37078L0158J32485j86429
980g8862M3879J29389j63734P7050O5909j81953J33027O2664j84571J26124J5428
991D4350j42394J73531l6572j54644J82798m1912j06169J69953j08633p1451K00393
1002A09250j22648n9296J61050j38845J1221J53457j83673K3654J41471j59399
1012f3758O2239Q1508j80931J11384P8807j75082J04411K7826j36305J49477j3665
1023D5911j47717J49695j9389r6602J38566p9172p1485J62472q1455n9486J20847
1034F2185r6665J723J18413j28459J624J04777j00671L6198N4401j21305O8880
1045A101N9736j07749N4421J5439p6478R2631r823q8169Q0071q289m0917O9170
$$ y = [-64564, 79970, -30165, -73943, 105935, -22399, -62086, 82002, -55076, -24918, 107567, -78862, -34983, 94406, -69328, 7722, 73631, -108322, 24705, 87369, -97202, 28922, 44350, -98044, 75487, 38915, -115729, 67069, 25157, -81012, 88941, -19692, -91143, 109250, -13398, -72694, 88356, -50489, -39268, 114189, -69484, -45830, 95641, -63758, -1519, 79989, -100942, 10442, 89249, -85833, 18578, 46404, -89901, 59576, 45911, -101806, 47889, 28500, -68102, 70464, -8708, -80193, 82279, 824, -58662, 62185, -34480, -32757, 85656, -42803, -41179, 63598, -37073, -875, 53526, -67779, 1101, 60837, -46912, 7509, 22948, -53530, 39101, 29278, -58891, 21180, 12891, -28026, 41144]
1057D1144n4279k9374Q5701m2335k0077M1848n1046K6266M4155o7199J3371K6798
1069A4973l1871L9226j3667m5943N1037j493k1858K7223l9491P853N0350m6104
1081i765m88K0876l5521M4473N095o4277M6252P149l3650N1507m0290l2906Q2517
1094D0972l7526k9366N6991o0021J5470P1522r0826R504O4215p5439M6110L0346
1106D1952j06666P4691L8830r8357P2216m678q3128J17641k6261r6717J12813
1117D2336l7401n3909J19663q9823m5827J40352r0220k5397J07910j19184K4627
1128b6873J17313j45313K7820R5231j30506P4091N7035j58059J00769N5993j41200
1139g3699J05493K863j24579J49106j9077j28948J40409l9193q1045J50301r1290
$$ y = [41144, -13135, -42509, 43192, 857, -19220, 22628, -28418, -2152, 42003, -25196, -11825, 14973, -16898, 22328, 8661, -37282, 13755, 12262, -9596, 17627, -21864, -14011, 36339, -9765, -10253, 10623, -24898, 19575, 24670, -39607, 6645, 13794, -19856, 31651, -8639, -41545, 40972, 3446, -25920, 31071, -28950, -13480, 58042, -32784, -23280, 40935, -34504, 11606, 41952, -64714, 9977, 48807, -49550, 22666, 17988, -65140, 52501, 26240, -70477, 42336, 4935, -48974, 70689, -19134, -64961, 75391, -14829, -40226, 67684, -51500, -26873, 90440, -54873, -27053, 68178, -62328, 11763, 68798, -89261, 11508, 67501, -73699, 31794, 34657, -89922, 59184, 40107, -88841, 51568, 12375, -68670, 81631, -9659]
1150i659p1337J62661r1180m3030J30221j24726N382J38760j45000J1074J10014
1161G3180j32596N9766P6779j60304Q2297P1838j38933R0756J8609j27563J31581
1172D5410J814j28173J20491k2087q1564J32735o7466p6341J39400o4520m5524
1183d5825J08531r7086n371J17436j07462l821Q7045r5493M0719O0660j17485
1194e8152N0863N7319r1183N5644J1416q3995Q6215N831q1197O6406j2174m1165
1206c4172P7309m3250m3965P5722l1052j6801M6487n5512Q166N7052n3317K278
1218a1055K6089l7999L5771J0090n2487L0520J0247k1562K9632k6629j6173M5493
1230B1937j9494r546J7003l1350K5678K2127m6583J8384Q344k3195M1836k1559
$$ y = [-9659, -80996, 81665, -9515, -52545, 77676, -47050, -41668, 97092, -47908, -36834, 73180, -59416, 350, 77129, -83175, -878, 70960, -67973, 22783, 41392, -86171, 45410, 47224, -80949, 39542, 17455, -64109, 68626, 1160, -75181, 64219, -301, -45825, 62706, -34380, -39751, 77685, -29777, -33598, 53447, -42046, -1327, 59333, -58152, -7289, 50030, -41153, 14491, 25907, -58088, 28127, 33958, -47239, 19167, 6993, -34172, 43137, -113, -44078, 31644, 592, -16209, 30278, -25234, -17068, 39984, -13333, -11055, 15034, -22965, 12806, 22896, -29591, 929, 11176, -10386, 19246, -7383, -23556, 21937, 2443, -7103, 9900, -21450, 4228, 26355, -20228, -1844, 6500, -16695, 25141, 3582]
1242C582l7744N4424j5492j9103M0993m8723K555O2399n7837j046M2436n7206
1254c0762L8017L2767q4782M4024L3457o7577N7078m958p3285Q9025p398p2931
1266d7325P8462l1987m1966J00558o3825m6117J02771o3300j4514Q5751r9101
1277d0593J0830R9115j05217J8424O8722j07109O3091N5248j29575P1122M4540
1288D8598j08072R1833J22j11693J21214o616j02179J11963m0256o8460J34715
1299G1169p1682o6957J29921p4750k8901J14078j12371l477J21943j14175R312
1310b5890Q7463j18798N3743P5811j37065O0155N9283j13742Q3191J7610j19144
1321g7383J07807J1970j05558R9377k3512p5406J21697m8354p4992J13862n2942
$$ y = [3582, -34162, 20262, 4770, -14333, 26660, -22063, -19508, 42891, -14946, -15992, 26444, -30762, 7255, 40022, -44760, -736, 32721, -34856, 22222, 17264, -56021, 33004, 25606, -47325, 31137, -850, -42816, 57742, -6083, -52200, 50571, -12729, -27243, 58508, -40593, -29763, 69352, -35865, -17441, 51281, -55828, 7263, 62511, -67064, 4058, 48598, -59474, 32359, 32481, -79212, 42002, 35386, -66793, 45170, 4914, -63546, 71169, -513, -67470, 62451, -12299, -41200, 72878, -39493, -42970, 78973, -35202, -25890, 61573, -57225, -3482, 72329, -64736, -4581, 54702, -59040, 24151, 41761, -77383, 30424, 42394, -63164, 36213, 12701, -62705, 58992, 10638, -64354, 49508, -3434]
1332c434l6445J01654q8109j7554J08160q5203m858P5104r2207L4761O7832j04937
1344d5236L5100N1081q1713N7098J6053q8593P3223J5152p1443O1141j5545m7361
1356d1043P9991k9775m8567O5172k9199j4637N4519n4562o716N8308m2637J758
1368g388K6674m5742K8742K6494m9976J8579J2040k4981L3522j2122l1305L6027
1380A0564m457j2425J9385k7534N402L1072k7942J850Q665k0372K9648j060l4936
1393b2140K7894k709j2248L1412l3055j0319M6633k9938l827K7356m4755K5381
1405c15L3998n9764K2380K3362m7197M6781J30o3335O1600K048n1223N8561k8479
1418a453l8190Q2876m0572m0738P3425m8843q825P3541p8660j839P8798p4650
$$ y = [-3434, -39879, 61775, -26334, -43888, 64272, -20931, -25789, 49315, -42892, -8131, 59701, -45236, -10136, 40945, -40768, 16330, 32383, -56210, 17013, 32165, -39278, 21863, 6318, -41043, 38948, 9173, -39394, 25778, -3421, -18058, 36461, -18101, -24817, 33491, -9146, -7388, 19286, -26456, 2286, 28780, -21196, -2617, 9423, -15558, 17964, 5842, -25463, 10564, 6107, -6318, 13067, -14467, -9065, 22007, -5935, -4085, 4580, -15792, 13856, 12796, -22140, 5754, 3045, -9203, 22209, -10846, -21165, 25468, -4470, -8297, 19059, -25696, -315, 33683, -26081, -3701, 19661, -27536, 19245, 19375, -43960, 17640, 19688, -31535, 27026, -1453, -39643, 43233, 2661, -38077, 35348, -13495, -22320, 51221, -27439, -29278, 49520, -25130]
1430b5130J5418N2279r0064M6746N3518r8951M8002L2505q4368P7021N822r5936
1442f3138Q9184J113p6971Q9941l5875o1794J12317m8930n7112R9509o2801k1225
1454c5782J01087r3209j1660R9824q9049J1727P2144j06724M2719P1347j11474
1465d9050M6718M4938r7542P6861K0327j07453Q5713J2527q4656Q7768k4020p2112
1477e9981J07191l3483o4652R2578m9067l0429R5477p4182k4761R1592o8588r91
1489a9296O6923q6467K3912O8012q6408K5257M2574p5378N3536K4130q4449N6271
1501H617J8273o1615N8346j3182n4301P3984j6303m6638N6835k9423j7995O0987
1513C7585m6608j7651N3746l6609K990L1891n0248J7748L5340m3376J4033J1469
$$ y = [-25130, -9712, 42567, -47497, -751, 52767, -46184, 1818, 34323, -50045, 26976, 32798, -63138, 26046, 27159, -49812, 40129, 4254, -57540, 54777, 5847, -51265, 48244, -14557, -35782, 65305, -27904, -39564, 60260, -28789, -17062, 55082, -51642, -8923, 62424, -49050, -2332, 42606, -54936, 21925, 42252, -65201, 20512, 33039, -51617, 36151, 12131, -59981, 47210, 13727, -50925, 41653, -7414, -37843, 57634, -16548, -41309, 50283, -18305, -19296, 47627, -38840, -14928, 53084, -33324, -8067, 34507, -40871, 12665, 36795, -47654, 8617, 26890, -34725, 23621, 10439, -43862, 30122, 13819, -32819, 24016, -5407, -23402, 37585, -9023, -26674, 27072, -9537, -6547, 25344, -24904, -7156, 28184, -15192, -1159, 10310]
1525A0310l1412L4311J639l7049K6963J48j3652K5110k2445j0097L1411j5183
1537E4l225J0149k2021J7977J3113k7660J1594J336j0658K6077j6721j8289K9858
1550A1584j2409l076J9824l3609J0718L0667l5602R634J3898l4204L5070O988
1562A9483m8544L6689L930l3215M5153k2238l5089O2168k3603k9354N1861m1246
1574a4005o715O3048n8869o939N8034n6598J7122M3222p6829L2680M6788p4355
1586c3416L8365K1668p1843O5680J0769p9337O6557j30n9289P7590k9635n7464
1598e0485R0551l3685m4422P9240n5799j9369Q9025p2503j5132P8578p2493J3438
1610a3056O4054r3241K9483O3105q8442L9540L4883q7747O7325K4258r2334O8307
$$ y = [10310, -21102, 13209, 14848, -22201, 4762, 4910, -8742, 16368, -6077, -16174, 15237, 54, -3171, 6978, -15043, 2934, 16047, -11613, -19, 1317, -9341, 16736, 15, -18274, 11584, -825, -3901, 15923, -17686, -6968, 23699, -11903, -2269, 11629, -22575, 12495, 19483, -29061, 7628, 11558, -21657, 23496, 1258, -33831, 28337, 4734, -24620, 27241, -14005, -20720, 42328, -16541, -23480, 34554, -22044, -4922, 38300, -38529, -5849, 40939, -33416, 4949, 26617, -45226, 20454, 31223, -48114, 18443, 18313, -40976, 36614, 6979, -50485, 40066, 6381, -38041, 41199, -14600, -33969, 55056, -17447, -32579, 45999, -26494, -13056, 50998, -42243, -12760, 50345, -38097, 1443, 36326, -51421, 15904, 40162, -52172, 16135]
1622A6135Q165p0740Q1584k0440o9447R1437k4744n3051Q1092m8835k9803R0210
1634E1563o1498k5184P7247o2438L336O4813q0857J5226O2462p2803K4591L6423
1646C2881p4016M8330K9694p5831M5787J4601n6235N8349p909n7503O3958q896
1658A3210m1355N3606k9617k4587O2753l6019k2461M8384l5320J634L9957m9659
1670a9474O284L8265l8457J3443J5213l9370K9516J4147l7615K1387J796j9392
1682a4257L0462j3289k1347K8029q109n808J5780k2874N286K0975j9692L836L473
1695B465j3958K1391k496k0537J7596n477l046J9058k4101j542K5142j9786N127
1708a64J0151k8801K3243J3088l4389K0487K532k3792L5999j2412l1886M1922
$$ y = [16135, 24300, -46440, 35144, 14704, -54743, 36694, 11950, -41101, 39991, -8844, -38647, 51563, -9935, -35119, 42128, -20310, -16974, 47839, -33018, -17792, 44670, -28133, -3542, 32881, -41135, 7195, 36889, -38942, 6845, 21446, -34789, 23560, 15651, -41852, 22106, 13210, -28145, 25461, -4156, -28743, 34010, -2009, -24470, 23914, -11406, -9772, 30185, -19474, -13190, 25075, -13382, 61, 15274, -24096, 5420, 19567, -18048, 3339, 5135, -14257, 16205, 2916, -18431, 9598, 1489, -4319, 11461, -11413, -6127, 14848, -4844, -1008, 2465, -11493, 9898, 7402, -13135, 4461, -1016, -4062, 14996, -9105, -10647, 14495, -5291, -164, 9987, -18814, 4429, 17517, -16872, 3615, 6147, -17645, 18354, 5942, -25944, 15978]
1720A5978j2323j9443L8328l2961r745N1002l8926p836M0268m4134J4997L8277
1732C3482o0722J9543L6587n4501L2793J5989o2068N1572J4023o1883N0978l844
1744A1949m8602O8172k1570n1307P0791k6068l3157O7831n0036k0722P7061n5771
1756a1429j3109O2545o3548J2486N9520p8609J9017N2133p1388L6041L0175p9110
1768d5276N3977K6413p5667N5297M559o2632P3059j2044o3860P4021j9375m3336
1780c4864P2925m3808l2069Q0132m8149k2240O5405n8295K843O3488p0869Q035
1792a7466N4240o3534K5883L4235p1763M0560L1012o5448M0740J0075n4409N6899
1804B1024k285n5307N4149q348l5572N3367k8416k8869N8583k8248j9960M3476
$$ y = [15978, 3655, -15788, 22540, -10421, -20166, 30836, -8090, -15926, 24342, -19792, -4795, 33482, -27240, -7697, 28890, -25611, 7182, 23171, -38897, 12675, 26698, -35185, 15793, 11949, -36653, 31519, 9949, -41358, 29433, 3365, -29792, 38039, -11997, -32719, 44342, -11429, -24538, 38007, -25541, -13055, 46465, -32144, -13127, 39006, -32382, 3659, 33834, -45276, 8701, 35114, -40553, 14744, 19303, -43329, 29730, 17686, -46174, 27847, 8472, -34864, 38061, -5747, -37816, 42316, -5833, -28073, 37332, -20963, -18120, 45368, -25501, -17466, 36774, -26760, -877, 33358, -38405, 2155, 33167, -32281, 8459, 18534, -35875, 21024, 18739, -36568, 17581, 9233, -26339, 27028, -1388, -30257, 28326, 78, -19882, 23594]
1816B3594l6530n33M3857m3886l05L5016l5563J4518J9653m2588K2035J9991l4305
1829a5046J9516K576k5929L1573l078k6692K3927n384r594K2566j9397p168K3757
1842A1627j3022m01Q050j7512J2736R400j8267Q289j062o041J7888j2409r593
1855a0317J7136r567L072R816k3437J1534J4620k1621J1952Q77j9876K7960l760
1868H389k5966K6586q027j2831L1202k4636j2903L8495k4582n394K8810l5972
1880a6829R956L3812m3820J0497K5849m0549K7785J4444n1121L6028J3684m4735
1892b4999L9621n571m1014N5584j2885m1246N2409k2177k4226N8070m1146k0596
1904b8176O1163m2382p529M9838n6229R762N2610o2851J4192L9754n9979L4103
$$ y = [23594, -12936, -13469, 30388, -13498, -13803, 21213, -14350, 168, 19821, -22767, -732, 19259, -15046, 4470, 7046, -18883, 12690, 9612, -17080, 6847, 1463, -8131, 14435, -4962, -12130, 11627, -1395, -1796, 6254, -11258, 1478, 10878, -7389, 900, -162, -6203, 11685, -724, -10317, 6819, -2748, 324, 10140, -13297, -1763, 12857, -8764, 3188, 4065, -15811, 12149, 8389, -17577, 9009, 982, -11849, 19353, -5283, -18186, 20309, -4273, -9667, 19143, -16829, -6873, 26939, -16881, -6384, 19465, -21084, 6701, 21145, -29976, 6052, 19736, -24999, 14622, 9051, -31963, 23621, 10736, -30510, 21899, -278, -24504, 33566, -7580, -28176, 32987, -9395, -16924, 32914, -23315, -13553, 39057, -23794, -9602, 30152, -29827, 4276]
1916D276K7481o9286M2217K2807o0317M8331J025n6336O3288o343n3679N9891
1928B3355j9014l5638O6135l6800l1836O6911l8395j6460N6218n3538j62N8400
1940C9176n7783M720M4346n6464K4884L4133o5199L1108K8364n5183L8000Q069
1952A8171n3287N1280K743m9303M6585j0046l2581N2910k4212l0643N1353k4032
1964a062j5658M1511l7120l974M3978l7693q38K9956l5654J5543K3165m1509J6317
1977c038J9088l0588K1190K813l0001K9105K616k5408K1380o689j2306K6659j4484
1990C37j3522K1993j0254j608J3430j9513M211J5803j4787L837K306j0958J4963
2003F238o12j3538J0175l630n25J1518j5526K63J2941j0956O414J747j7153J7747
$$ y = [4276, 31757, -37529, 4688, 27495, -32822, 15509, 16534, -39802, 23486, 17143, -36536, 23355, 4341, -31297, 34838, -1962, -33798, 33113, -5282, -21742, 34476, -19062, -19224, 39176, -18607, -13887, 30459, -26005, -1121, 33012, -32187, -1079, 27285, -27898, 10102, 18171, -35116, 16164, 18907, -30396, 16189, 6143, -26438, 26472, 2260, -28383, 22970, -1062, -16720, 24791, -12329, -16303, 27675, -10018, -10856, 19100, -16554, -1011, 22154, -19355, -3038, 16050, -14538, 6652, 9465, -20536, 8569, 11185, -14223, 7157, 468, -11838, 14821, 337, -13185, 8808, -1446, -3054, 10376, -9137, -4926, 10877, -3910, -73, 2233, -8725, 6238, 5626, -7912, 2263, -1367, -1892, 9626, -5900, -5637, 7304, -3652, 2762, 4509, -12644, 5103]
2017E103L246j7985J5130o141r883K5598j5648j3521K6281j5837k185K2560k9501
2030a2783M304K8286l0227P091J7656l3012K2940J4870m0526K4082J0578l2870
2042a9611L3267m797l5831M2702o202l1019L9520j9881j9924M9100l0389j9194
2054b2259M6036l2725l650M1663m7394M622M3843m7564J1955K9820n1202K9269
2066B414K5810n7047L2132J6729m8054M3467K54n0394N2056l328m2538N0132j9846
2079A787l0746N8994k9393k8224N4280l3768j0934N0426m8115l043N0626m6989
2091a5099N651L6231n1806K2203L3108n5756K4168K2848m7257L6195Q124n0148
2103c1538M2673N118m1153M0940j0817l1977M9707j7723k9560M3710k2287j3042
$$ y = [5103, 8349, -9636, 5494, -647, -10530, 15068, -580, -14101, 12180, -3657, -5842, 16718, -12783, -8479, 19807, -10420, -3329, 14327, -18685, 4255, 19125, -21401, 2681, 13259, -19611, 13656, 8859, -26972, 15730, 9528, -21491, 18029, -1852, -21776, 27324, -3065, -22259, 23777, -8948, -12598, 29065, -18329, -13707, 30136, -17428, -5473, 24347, -26855, 2414, 28224, -28823, 3309, 20038, -28016, 15451, 15705, -34689, 17367, 14039, -28499, 21633, 1787, -28959, 30035, 642, -27582, 26698, -7070, -18004, 32422, -15693, -18736, 31890, -15099, -9448, 26783, -25023, -2820, 30288, -25468, -1300, 21548, -25709, 10486, 18610, -31538, 11135, 16253, -24900, 16040, 5223, -26754, 22953, 5230, -24330, 19380, -2907, -15949]
2115a5949M1300l4575q392M1102l1820j1K7778l6573J3004K6457l7750J2297J6845
2128A3713k9616K2717N701l2330K4877N034k2758K1807p753j6330K7884r546j4733
2141a1333J9312j1266j799J8048j8983j494J6262j2307M104M916j5177J1125O360
2154G768j3057O744k051m376J2962p753o677R980n621L290M891j4447P461P251
2168F365j0626Q023l706r453J8196n802j1682J4984r814j183J8233k0526j315
2181h306K0590j8744N552J2299k6533J5895J4600k9010J6010O144k5190K7957
2193A1264j801l0229L0736l720k2061L2073j7637j8422M0274k0946j5480L4247
2205A8298k7334k136L6356l7914M64L4339l6121J1293K3959m3939K1937K3938
$$ y = [-15949, 25351, -9224, -17616, 23486, -8334, -8345, 19433, -17140, -4136, 22321, -15429, -3132, 13713, -15903, 6814, 12515, -19815, 5062, 10096, -12662, 9145, 1392, -14938, 12946, 3400, -11333, 7979, -3287, -5086, 12962, -6021, -7515, 8747, -3560, 544, 5460, -9717, 1408, 7768, -5289, 1455, -596, -4972, 7990, 237, -6440, 3540, -2081, 1209, 6100, -8347, -886, 6365, -4261, 3762, 56, -9397, 8799, 2997, -8685, 6299, -3515, -4698, 13535, -6991, -8306, 12284, -6460, -908, 11391, -15142, 753, 15353, -13657, 2353, 8497, -16693, 11264, 9463, -20766, 9970, 6250, -15811, 16262, -1375, -19797, 20477, -469, -15949, 18298, -9036, -11172, 25184, -12730, -12266, 22073, -14048, -2755, 21204, -22735, -798, 23140]
2217B3140m4011K4142J1649l9708L7319K979m2948L9410j809l2691M2220j7440
2229B252k8345M9207k1021k3013M3042l0119q447M5234l9900n265M1039l8313
2241a3649P429L1117m6961J7401L0090m5181K0154J7013m1713L3182R373m4119
2253b5864L4088L826l3311L7324j0502l0613M3039j2430k4665L6519k1470j2071
2265a6130L9481k8698j0558L4648k7021J529K6485l4828Q331K6442l1807J0483
2277a643J4280k9462K1394R930l1314J9743N399k1044K2829o048k0382K5997n197
2290D482j4293J8581j2209m874K1504j5627n360J5171j1725M032Q932j7118O253
2303b251R449j1047O103j228q371J2524j526q693P042m319J350P927j0892M36
$$ y = [23140, -20871, 3271, 14920, -24788, 12531, 15510, -27438, 11972, 10163, -22528, 19692, 2252, -26093, 23114, 2093, -20920, 22122, -7997, -16444, 28790, -11110, -16375, 24664, -13649, -6220, 24897, -22064, -4663, 25427, -19754, 400, 17413, -24300, 8882, 18255, -25864, 8224, 12050, -21261, 16063, 5561, -25052, 17987, 5557, -19108, 17411, -4059, -16130, 23351, -5347, -15905, 18743, -8278, -6749, 19736, -15092, -6761, 19681, -12126, -1643, 12637, -16825, 4569, 14499, -16815, 2928, 8327, -12717, 10112, 4064, -16318, 9679, 4482, -9811, 8770, -3439, -8313, 13191, -2436, -7796, 7375, -4350, -318, 8614, -8504, -2251, 7198, -3849, 2254, 1026, -7345, 5179, 3653, -5040, 2002, -2317, -967, 6960, -3932, -3496]
2317c496P062n884N432j082j0147J1521N75q374Q541p111k333J5108j1616m678
2331f482J2981j1278M709R970k0230Q015J2583j7927J0248L247j9569K0746J936
2344H949k2551J9624k894j5164K5736j3060j6730K9614j3518j0394K5603k3514
2356h299k262L0689k8070r70K4827k8532J0975K0518l6513J5055J9866l3054K0202
2369D432P950l4194L0638N298l4614K9708k677k5818L6731j3544k6066L8964j5051
2382A757j7489L5131k6448q812L9284l0265o038L2148l2101P164K8371l9939J1444
2395e793K5558l5665J7805J3788l7786K7662J1104l6812K7106J765k8374L4381
2407A4739p750k8747L5283r549j9332L2170k0492j2517L5840k2609r500K8148
$$ y = [-3496, 3566, -2318, 3114, 2032, -8115, 3406, 3981, -4393, 4148, -2963, -5296, 9812, -1804, -6482, 6499, -4779, -70, 9900, -10330, -2315, 10268, -7659, 2589, 5836, -13733, 7013, 8949, -13602, 6022, 3128, -12036, 13700, 640, -16090, 13524, 6, -10388, 15215, -8299, -10561, 20128, -7942, -8912, 15915, -12617, -1642, 18876, -17637, -2582, 17284, -15770, 4432, 12382, -21812, 8826, 14124, -20490, 9218, 6541, -19277, 17454, 3910, -22156, 16808, 1757, -15732, 19399, -7049, -15861, 23423, -6842, -12880, 19268, -12833, -5669, 22702, -17237, -5793, 19765, -15900, 1905, 15693, -22093, 5569, 16673, -20139, 6967, 8732, -19642, 14739, 6989, -21758, 13525, 3976, -15356, 16814, -3678, -16195, 19645, -2964, -12464, 15684]
2419A5684k4729K509K5722l0962M414K3082k6257J0650J2524k8814J8001J1983
2431A3807k6884J5972L687j9977K2657k809k1140K1633l293j2637J8916j1951
2443b019q697K2066j1437o772J4295j2860K659J3520j6746J712J0583j0561O380
2456B123K245j2570R776L683r032N749l100k902J0151n790m272N794l903L667
2470A619K387r486N069L397m880N480m993m288J1552n029m384P334q306L722R371
2485H565j4124K513Q884j1135Q237K458j6180J3815L977j4916J2489l229j1394
2498a0040K0273p740j3886J9434q845o170J9675j8477l792K3437j8510o76J7118
2511A1801k2822Q877J7774k7725R719J3947k4317J7597O014k8741K3308N431k5627
$$ y = [15684, -9045, -6536, 19186, -11776, -7362, 15720, -10537, 113, 12637, -16177, 1824, 13807, -13077, 2895, 6582, -13395, 9262, 6453, -14687, 6946, 3653, -8984, 9932, -2019, -10716, 11350, -87, -6859, 7436, -5424, -2765, 10755, -5991, -4279, 6304, -4257, 2123, 4368, -8202, 1574, 5257, -3775, 1974, -1126, -4028, 6123, 333, -3939, 1855, -2048, 1619, 4006, -5480, -411, 2986, -1894, 3586, -1407, -5695, 5857, 828, -3556, 3778, -4528, -806, 8565, -5559, -3046, 5838, -5297, 2940, 5398, -10782, 3033, 7010, -7906, 4583, 1354, -10040, 10233, 2493, -11393, 8041, -804, -6974, 12701, -5776, -9568, 13869, -4641, -5317, 11801, -11021, -2144, 15630, -12095, -2376, 11571, -12746, 4851, 10865, -17876, 5432, 10863, -14764]
2524a4764K3375m449k1134L1096r471k1548K9429j2885j2002K9910k2862q882
2536a4187L2022k2916l651K4923k8376O411K5407l2352P913J9656k9120J7049
2548B779J1867l3472K1770J0500k9017K2676j05k5557L0566m437k5154K8242q801
2561A857j5260K9504j8131j3312L0848j7725p116K3810k3543J725K4902k6239
2573h680K459J8888k3350J1370J2348k7336J4288J1389k2103J4892J774j9684
2585a3745K1258l57j9072J7619l806j0731J9278j0734j0456J9579q841n233J3257
2598H016j3597P44J5247j4042l18R391j0832O685N407j4147O692N766q593O416
2612B835k119p044J0480j344o386N122l414Q90O172p398n13M560k996L798j618
$$ y = [-14764, 8611, 4162, -16972, 14124, 4653, -16895, 12534, -351, -12353, 17557, -5305, -14187, 17835, -5081, -8732, 16191, -12185, -5774, 19633, -12719, -4806, 14850, -14270, 2779, 14646, -18826, 2944, 13444, -15573, 7103, 6998, -18559, 12007, 7570, -17584, 10658, 1857, -13403, 16101, -2030, -15342, 15506, -2219, -9335, 14475, -9068, -7343, 17559, -8680, -6221, 12667, -10683, 687, 13035, -14301, -13, 11376, -10727, 4165, 5939, -13745, 7513, 7156, -11916, 5703, 1897, -8834, 10444, -290, -10746, 8833, -8, -5241, 8016, -5581, -4837, 10410, -3632, -3950, 5441, -5391, 1294, 6701, -7446, -754, 5012, -3581, 2835, 716, -6328, 4152, 2808, -3578, 1544, -1870, -980, 5192, -2206, -2719, 1841, -1155, 2643, 1025]
2627A025o085O977K1l334M085o231J299Q496q106m02N039p174P006K788j2765
2642g361Q013L692r224R498l740r824J5753l888j0178J2980p797l622J6583j4021
2656c136m772J6903j2722J135J2475j9089O188J5122j9897O640R112j8989J5005
2669C975N962k3336J6293M296j8178J9214m889j8035K4948n903j6389K2136j1990
2682a896q686K5928j8513q445K4586j7957p75K0323k5299M708K1915k5284O693
2695b702J4303k5012J5796J1067k8456J6820P970k2692K0646j337k3104K5796
2707I095k368j9972K2841r316j2864K6902j4646j2717K5090j4870m498K1404k2123
2720h042O3K2692k1254K218J5230k1802J0904J2907k4531J0827R728j8975J4884
$$ y = [1025, -5060, 1917, 1938, -1396, 2689, -3542, -2243, 6253, -1853, -2255, 2784, -4390, 2616, 5404, -7361, 652, 4344, -4880, 4618, 878, -8946, 6807, 2919, -7259, 5721, -2076, -5698, 10885, -3136, -7908, 8995, -3727, -2592, 9883, -9206, -3018, 12104, -7793, -1153, 7959, -11030, 3975, 9937, -13399, 2894, 7190, -10988, 8226, 3337, -14698, 10250, 4347, -12042, 10094, -1896, -10582, 15346, -3167, -11612, 12974, -4983, -5758, 14565, -10734, -6026, 15889, -9395, -2702, 11601, -13411, 2385, 13452, -15004, 1816, 9786, -12906, 7740, 6403, -16701, 9095, 6727, -13245, 9596, 280, -12584, 14318, -328, -13045, 12045, -2825, -7323, 14081, -8042, -7979, 14713, -6541, -4323, 10907, -10895, 9, 12916, -11615, -788, 8940, -10035, 4849]
2733D849J890k0205J8716J568j6511J5617m930j0645J9607q577j0984J6429p801
2746i77l715J3770j3753j425J4952j1330j31P914j1582O302P729j3255M127N073
2760C699p785P467q05r287Q731J193o047N274l959j947Q379m590l347M314k839
2775a549K575K192o652K345K889k149K482l397k215O610k337j892K285m607M227
2790H07L840q276K957K501m957P113k375q424J0206j108o022Q206o888k801J3331
2805H110r109m341J0849r418K518J0093j5531L621J1448j3648O044N239j5695
2818i820J2364N912j7547J1393J873j3163J6552m022j5316J8585l911j1123J7187
2831H964j1291p111K1428j3456o803J7854j4938R64J7317k1126K620J7138j8910
$$ y = [4849, 6739, -13466, 5250, 6818, -9693, 5924, 994, -9651, 9956, 1379, -9605, 6824, -977, -4692, 9078, -4675, -6100, 8852, -2478, -2609, 5305, -6277, 25, 7754, -5501, -1374, 3699, -4086, 3381, 2576, -6711, 2020, 3213, -2834, 2440, -1519, -3466, 4913, 323, -3024, 1290, -1549, 1026, 3218, -3434, -1089, 1800, -349, 2133, -1264, -3479, 3131, 794, -1098, 1187, -3420, 807, 4647, -3629, -672, 1829, -3128, 3985, 1610, -6814, 3392, 2284, -3738, 4468, -2420, -5221, 8110, -999, -5340, 5509, -3909, -1391, 8702, -6829, -3208, 8240, -5408, 636, 5875, -9820, 2544, 8456, -9091, 2302, 4175, -8988, 7564, 3542, -11774, 6811, 2900, -8223, 8964, -2327, -9438, 11990, -1466, -8269, 9585, -5353, -4389, 12928, -8198, -5578, 11560, -7350]
2844g350O797J0210k1831J3437J0148k2543J3175M701j8343J8995j184k0189K0607
2857F630j898j4860J9493r756j1344K3686j1477j0236J9708j4009k195J9439j9377
2870f196j073J8668j7343L717J2286k0484R403J2573k0435Q853O807j6610J4734
2883D900K210j8839J5399J541j3323J4814n629j1163J8438o131j0032J4133q477
2896b159k910J4626j2641l215J3477r882J126P991j2987N017R035j1687L527L791
2910C109q453Q415J197j0368O977J672n282O206l920m298Q494k349l621L706l580
2925b095J587M636n830k84L091j788K742j265m272M198P88j715J451l760J464
2940a052M561m181j10J226l031N312l26o601M897M57k963N615n156l351R480m554
$$ y = [-7350, -553, 9657, -12174, 1263, 11411, -11132, 2043, 6744, -11599, 7396, 6212, -13977, 6630, 4732, -10128, 9365, -391, -11735, 11951, 474, -9762, 9946, -4063, -6258, 13181, -6196, -7269, 11399, -5944, -2227, 10059, -10425, -1022, 11551, -8884, -31, 6776, -9834, 4900, 7110, -11729, 3670, 5211, -8112, 6702, 1073, -10090, 8348, 2217, -7815, 6318, -2159, -5069, 9557, -3084, -6299, 7178, -2704, -1578, 6413, -6574, -1557, 7478, -4209, -682, 3109, -5344, 3071, 4268, -6100, 877, 2549, -2733, 3473, -447, -4745, 3749, 1400, -2221, 1485, -2095, -508, 4128, -1702, -1986, 1105, -683, 2059, 794, -3478, 720, 1508, -207, 1244, -2516, -1052, 3509, -672, -782, 444, -2587, 2725, 2399, -4202, 695, 1152, -1811, 3804, -1352, -4703, 4777, 223]
2956B23k996O207p112K337Q368j1068J311P662r019N692L537j3139R069N104j2265
2971f089Q704k51j0481J4303k702j2198J3551l767p127J4449j0247o431J7037
2984H751r700m303J3206j3602J761J4949j6802J522J2426j4967P341Q128j9029
2997a0319J0577Q458j6947J0967K071j5456J6768j20j6797J5943k669j0881J7457
3010I052r053j0454J9574q866p261J5897j3408j355J7477j6041j189J4347j4817
3023f097N075J0544j8648P538J0650j6159Q345M290j5325J3885K564j5805J2199
3036C056K29j0739J4406n547j0673J5630m781p386J2217r170k829J4322j0673
3049a938l207J0999r560K459Q321j2888L458Q559r964M252L025r860Q384K893
$$ y = [223, -2773, 3434, -3678, -1341, 7027, -4041, -2730, 4932, -4087, 1605, 5142, -7997, 1072, 6176, -6089, 2615, 2364, -8117, 6186, 3484, -8714, 4837, 1070, -6057, 8392, -1855, -8286, 8751, -949, -5252, 7954, -5648, -3887, 11062, -5740, -4218, 8208, -6759, 582, 8710, -10319, 258, 8716, -8231, 2736, 4807, -10649, 6119, 5999, -10798, 5145, 2476, -8405, 9052, -1, -10455, 9119, 253, -7008, 8889, -4519, -5874, 11603, -4438, -5627, 8720, -6097, -1022, 9522, -9126, -1588, 9062, -7097, 1248, 5538, -9787, 4098, 6662, -9143, 3056, 3285, -7454, 6952, 1405, -9268, 6362, 1581, -5805, 6412, -2758, -5587, 8735, -1938, -5145, 5854, -3706, -1247, 7074, -5814, -2356, 6203, -3761, 491, 3516, -6344, 2040, 4933]
3063D933j0010N891Q35n265P738l240o152P848j367l045M465m696j88O279m489
3078d63j251K560k509K893J104m983J992J550r32J651k762r94M090j386p37M16
3094B39k772L673J444m611K050k3j462M774l411l603O011k112j231L992n976J000
3110b018P125o966J11M611o536M881L414j0066N296L859p725O929j185q548J0921
3125D103q85q922R330l835m826J2227p968n832J2591p276k023J0454j2180J220
3139c822J2263j2449J650Q281j2405P185P140j5807P856O204j2800J0061P63j3655
3153i535J3994M09j2659J2424l639q432J5546p454r180J5355p380m554J3429j2428
3167d104j655J5062j2448o73J0811j3278N412R736j6133N716Q344j3106Q524L076
$$ y = [4933, -5077, 814, 1649, -3616, 4122, 882, -5270, 2578, 1211, -1834, 2631, -2065, -2253, 4026, -463, -1714, 846, -1663, 1230, 2334, -2649, -657, 893, -39, 1612, -1150, -2144, 1946, 560, -177, 239, -2533, 1140, 2584, -2027, 23, 0, -1462, 3312, -99, -3702, 2309, 197, -1034, 2958, -3018, -2018, 5107, -1859, -1748, 2863, -3673, 1208, 4622, -5444, -148, 3711, -4014, 2915, 1730, -6818, 4103, 3218, -5704, 3626, -209, -5035, 7192, -776, -6608, 5983, -1293, -3316, 7138, -5042, -3822, 8441, -4008, -2358, 5923, -6482, 703, 7843, -7964, -108, 6096, -6704, 3357, 4120, -9535, 4459, 4868, -7791, 4633, 994, -7438, 8108, 654, -8526, 6829, -551, -5105, 8324, -4104, -5759, 9303, -3145, -3818, 6993, -6285, -873, 8863, -7270, -1554, 6790, -6316, 2208, 5284]
3181E284j4204J1678K993j2841J0333j311r136J3846m566r863J2679m302n212
3194d622J1143q808l366J2759q409k265Q664r107K522Q456j1347K102O983q363
3208c658M863K612r850O900L464q344N439k84n542Q253j951o554O583j428k435
3223a932N564n080j795O731l479j277K740l883K391L337n045N93J942j574K342
3238A575j089l015L094M14r17P13k601J355K598k409J30k59j130L993j592l285
3254b425L270j023j79L072m784k1N261l913K97K288n176L921L329p187L031K164
3270A925n083N858r11p125P528J33n775O624l837l756R721n100m670Q333n508
3285a643o90Q356r607J08R366q694J765N719j0409N819O240j1888N588L799r554
$$ y = [5284, -8920, 2758, 5751, -7090, 3243, 1932, -7204, 6642, 2076, -7787, 4892, 590, -4622, 6521, -2287, -5653, 7106, -1303, -3568, 5096, -4011, -1489, 6967, -4380, -2278, 4705, -3658, 1205, 3817, -6033, 867, 4331, -4013, 1426, 1142, -4400, 3853, 1902, -4652, 1931, 503, -1932, 3632, -1448, -3243, 3488, 9, -1268, 1472, -2411, -20, 3317, -1728, -1135, 807, -767, 1575, 486, -2529, 565, 979, 62, 775, -1826, -471, 2127, -282, -152, -411, -1541, 2452, 860, -2425, 845, -178, -357, 2715, -2069, -2090, 3171, -742, -445, 1843, -3333, 588, 3917, -3270, -239, 1925, -3158, 2700, 1789, -5336, 2192, 2325, -3450, 3174, -663, -4419, 5302, 202, -4468, 3865, -1643, -2333, 6023, -3584, -3476, 5890, -2804, -1039, 4680, -5729, 90, 6330, -5558, 30, 3829, -5725]
3300e725R099L02j1236J0617L09q969J0023m055p004J3112n471p145J1431o668
3314a380k489J1344j0625j728J1806r666O04Q123j1735M628Q503j2600M296N662
3328D743j0528Q133K608j2221R192K298r780R209k195q383J2136l186p926J0045
3342D145m598l632J0424p901l502J0551o817j011P250q984K133Q030r481J831
3356a562N194p681N343K795r263N485L004o537N336j029n667P498q67n597N320
3371A772j926k112O004m368k486N567k562o70K941m513J402M070m127L10J469
3386G71k430K879M27l936K146Q87j019J469j993p36K840q17n86O2j489K332O05
3403A412k492R57l73J61K546k977j186L352j845O49J338m195K479K933m482J835
$$ y = [-5725, 3374, 3676, -7560, 3057, 3366, -5603, 4420, 365, -6639, 6473, 1002, -6143, 5288, -1380, -3869, 7475, -3150, -4878, 6928, -2738, -2134, 5989, -5746, -1118, 7385, -5215, -919, 4743, -5785, 2348, 4956, -7265, 1927, 4225, -5555, 3654, 1459, -6924, 5212, 2026, -5900, 4145, -453, -4085, 6339, -1562, -5064, 5487, -1330, -2341, 4909, -4075, -1942, 6088, -3393, -1562, 3632, -4049, 1294, 4089, -5174, 311, 3315, -3222, 2114, 1085, -4582, 2916, 2049, -3548, 1772, -154, -2266, 3738, -630, -3116, 2451, -111, -781, 2160, -2353, -951, 3119, -1008, -698, 771, -1659, 1220, 1647, -2289, -143, 744, -275, 1194, -799, -1535, 1305, 488, -98, -36, -1525, 807, 1412, -1080, -123, -496, -335, 2211, -766, -1952, 1400, -445, 204, 1542, -2653, -174, 2759, -1723, 112]
3419A12O90l378M798l80n528M752M5l226N079l577l146P501l446k928N577m909
3435a964R3O823p181l02O338o182K199M056q570M352M981q303M132K013p456P605
3451B634P67q955P651j10o144Q391l889o029J0302l822n036Q497o079j667R792
3466F303q390j733Q750p624J529O456j0180L500O957r413L862L492r014P464K506
3481D465j0054O976J291p246Q233k301p178R589k178n835P893m617k899R395o495
3496i61l003Q077n884K02O355q320J385P000p313J783L805p266N076L099p979
3511c944M042K282n483N311p46n850O450j25m612M618k436k167O034l332k704
3526b662M479k473n6L368m606L98L949k889K56J178l033K714J461l482J161O39
$$ y = [112, 802, -2576, 2222, 1842, -3686, 1066, 1111, -2115, 2964, -613, -3759, 3742, 296, -2632, 2945, -1964, -1871, 4952, -2229, -2531, 3807, -2375, -176, 3880, -4690, -338, 4643, -3660, 472, 2485, -4971, 2634, 3401, -5554, 2097, 1987, -4157, 4234, 345, -5684, 4618, 796, -4240, 4257, -1822, -3489, 6303, -2087, -3820, 4930, -2694, -1165, 5291, -4889, -1389, 5568, -3845, 17, 3509, -5505, 1959, 4465, -5589, 1387, 2678, -4568, 3665, 1364, -5814, 3775, 1597, -4238, 3655, -962, -3861, 5534, -961, -3964, 4113, -1771, -1569, 4786, -3534, -2149, 4851, -2462, -679, 3126, -4140, 936, 4035, -3944, 98, 2380, -3103, 2208, 1462, -4388, 2062, 1937, -2675, 1943, -493, -2660, 3374, 42, -2662, 1817, -656, -712, 2656, -1950, -1552, 2397, -492, -236, 942, -2091, 623, 2084, -1398, -237, 402]
3542D02j084K089j309j826K213K02o44L72j585R26J730j572j8k79k31J968j066
3559B88j524J399l71O47R09k878Q12K097j858Q76j21k430L527K40l560K445l70
3576A28j644M083k634k631M869k081j236L519m335M52N118m956j3L605m549K655
3592C50K959o625K931L403n585L750N01n787O197M55o179N352j000l967O947l363
3608C39m530P397l059k781O357n486j123P620o105r81N808o141K201N095q329
3623c718K605M931o836L843J992p578O214J967p428N575j67n284P348k246n771
3638d553P294j932l681O513m777k199P788n014j997N770n228R48N272o883J024
3653a655N065n674K504K334o290M274K694o201L554P80m312N301r26m946N083
$$ y = [402, -682, 1407, 98, -1728, 485, 687, 43, 415, -1170, -244, 1486, -86, -104, -383, -614, 1354, 288, -1236, 163, -208, 439, 1348, -1530, -718, 1379, -479, 397, 276, -2154, 1373, 1613, -1947, 498, 128, -1516, 2567, -67, -2698, 2171, 90, -1146, 2373, -1962, -1510, 3608, -1348, -1361, 2244, -2305, 350, 3309, -3316, -385, 3018, -2567, 1183, 1684, -4103, 2094, 2549, -3630, 1722, 722, -3245, 3702, 339, -4191, 3206, 147, -2634, 3723, -1763, -2886, 4734, -1371, -2352, 3456, -2685, -484, 4611, -3718, -1113, 3818, -3018, 825, 2817, -4761, 1453, 3420, -4008, 1567, 1400, -3884, 3464, 1218, -4553, 2741, 809, -2872, 3641, -1136, -3335, 4453, -561, -2558, 3212, -2016, -1068, 4204, -2679, -1655, 3410, -2264, 240, 2574, -3716, 558, 3252, -2949, 605, 1385, -2927, 2374, 1448, -3498, 1585]
3668A585n69k958M334k909k139N520k622k095L655l030M49L613m260m8L232k509
3684g51R41J144l391K116J844k933J106J18j322K373m48k408J766J54l60R06j618
3701g63r4J695m66m64j73n70J410J84j238R5L1O45P95j719j03J115n59R08l47
3720C82j949K044N56j711J192r45o86K936j640j793K560j217k76K534l460J38
3736a335L560l018M27J818l656K574K065m561J956J670l570L632l65m422M686
3751A461O7l850M046j963k387N703k854k910M946k959o42M677n206k07N394m619
3767a303M83L432n457K673L715o288K371K687n085M143P07n924N086Q36m865M669
3783A880j407l717O247k145m128N535k422j916N559m747j393N901m063n70M215
$$ y = [1585, 1016, -1942, 2392, -517, -2656, 2864, 242, -1853, 1802, -1228, -779, 2834, -1426, -1474, 1758, -751, 190, 1334, -2057, 59, 1903, -1030, 76, 194, -1128, 1245, 797, -1611, 155, 309, -51, 855, -763, -857, 838, 372, -92, -265, -835, 575, 759, -479, -384, -353, 292, 1087, -632, -735, 380, -179, 729, 382, -1567, 477, 1033, -678, 514, -431, -1117, 1819, 179, -1614, 946, -271, -547, 1987, -1473, -1335, 2225, -793, -366, 1452, -2204, 370, 2435, -2126, -170, 1500, -2070, 1562, 1197, -3225, 1461, 1528, -2322, 1724, -239, -2626, 3077, 223, -2687, 2259, -700, -1342, 3335, -1871, -2078, 3316, -1303, -820, 2612, -2845, -172, 3543, -2745, -374, 2313, -2772, 1371, 2078, -3846, 1240, 2076, -2789, 1880, 473, -3244, 3003, 858, -3270, 2265, -157, -2073, 3486, -1261, -2654, 3247, -816, -1386, 2829]
3798B829n193J581M458n821J255L219m702L061J687n622L642J821m504L428l25
3813H14l728M997q77l824M049j340j868M196k972j849M493k058j054K745l343
3828a619Q16L420l600m4K365k558J630J286l616J714J551k254J471m33j767K742
$$ y = [2829, -2364, -783, 3675, -2146, -891, 2328, -2374, 687, 2374, -3248, 394, 2215, -2289, 1139, 814, -2914, 2083, 1206, -2618, 1431, 91, -1777, 2419, -553, -2402, 2091, 33, -1021, 1724, -1619, -803, 2617, -983, -1027, 1338, -1220, 410, 1696, -1920, -206, 1345, -909, 562, 129, -1638, 1104]
$$ [...]
8191b1
##END NTUPLES=NMR FID
##END=
