##TITLE=1H_Pr YA-S1
 CCl4
 8 sc, 
 20.2.2024
##JCAMPDX= 6.0         $$ Bruker NMR JCAMP-DX V2.0
##DATA TYPE= NMR FID
##DATA CLASS= NTUPLES
##ORIGIN= UXNMR, Bruker Analytische Messtechnik GmbH
##OWNER= root
$$ XWIN-NMR		Version 3.5
$$ Tue Feb 20 15:37:28 2024 Russian Standard Time (UT+4h)  she@DPX200
##.OBSERVE FREQUENCY= 200.1313
##.OBSERVE NUCLEUS= ^1H
##.DELAY= (6, 6)
##.ACQUISITION MODE= SIMULTANEOUS
##.ACQUISITION SCHEME= undefined
##.AVERAGES= 8
##.DIGITISER RES= 18
##SPECTROMETER/DATA SYSTEM= spect
##.PULSE SEQUENCE= zg30
##.SOLVENT NAME= CDCl3
##.SHIFT REFERENCE= (INTERNAL, CDCl3, 0, 15.7039)
##AUDIT TRAIL= $$ (NUMBER, WHEN, WHO, WHERE, WHAT)
$$ ##TITLE= Audit trail, XWIN-NMR		Version 3.5
$$ ##JCAMPDX= 5.01
$$ ##ORIGIN= Bruker BioSpin GmbH
$$ ##OWNER= she
$$ F:/spectra/data/she/nmr/H-F/1/audita.txt
$$ ##AUDIT TRAIL=  $$ (NUMBER, WHEN, WHO, WHERE, WHAT)
(   1,<2024-02-20 15:35:57.81 +0400>,<she>,<DPX200>,
      <created by zg, POWCHK disabled, PULCHK disabled
       configuration hash MD5:
       00 E9 B6 7A A2 85 ED C7 34 08 36 98 17 FE 4E 26
       data hash MD5: 16K
       50 2E 61 21 A9 8A BE BD 79 C1 CA 9A 4C 6C 09 1C>)
$$ ##END=
$$ 
$$ hash MD5
$$ EE C1 42 F5 6C 5D 97 E3 E3 FF C2 DE F2 B6 B6 3D
##$RELAX= 
##$RELAX= 
##$RELAX= 
##$RELAX= 
##$RELAX= 
##$RELAX= 
$$ Bruker specific parameters
$$ --------------------------
##$DU= <F:/spectra>
##$EXPNO= 1
##$NAME= <H-F>
##$PROCNO= 1
##$TYPE= <nmr>
##$USER= <she>
##$AMP= (0..31)
100 100 100 100 100 100 100 100 100 100 100 100 100 100 100 100 100 100 
100 100 100 100 100 100 100 100 100 100 100 100 100 100 
##$AQSEQ= 0
##$AQ_mod= 1
##$AUNM= <au_zg>
##$AUTOPOS= <>
##$BF1= 200.13
##$BF2= 200.13
##$BF3= 200.13
##$BF4= 200.13
##$BF5= 200.13
##$BF6= 200.13
##$BF7= 200.13
##$BF8= 200.13
##$BYTORDA= 1
##$CFDGTYP= 0
##$CFRGTYP= 5
##$CHEMSTR= <none>
##$CNST= (0..31)
1 1 145 1 1 1 1 1 1 1 1 1 1 1 1 1 1 1 1 1 1 1 1 1 1 1 1 1 1 1 1 1 
##$CPDPRG= <>
##$CPDPRG1= <>
##$CPDPRG2= <>
##$CPDPRG3= <>
##$CPDPRG4= <mlev>
##$CPDPRG5= <mlev>
##$CPDPRG6= <mlev>
##$CPDPRG7= <mlev>
##$CPDPRG8= <mlev>
##$CPDPRGB= <>
##$CPDPRGT= <>
##$D= (0..31)
0 1.2 0 0 0 0 0 0 0 0.06 0 0.03 0 0 0 0 0.0002 0 0 0 0 0 0 0 0 0 0 0 0 
0 0 0 
##$DATE= 1708428957
##$DBL= (0..7)
120 120 120 120 120 120 120 120 
##$DBP= (0..7)
150 150 150 150 150 150 150 150 
##$DBP07= 0
##$DBPNAM0= <>
##$DBPNAM1= <>
##$DBPNAM2= <>
##$DBPNAM3= <>
##$DBPNAM4= <>
##$DBPNAM5= <>
##$DBPNAM6= <>
##$DBPNAM7= <>
##$DBPOAL= (0..7)
0.5 0.5 0.5 0.5 0.5 0.5 0.5 0.5 
##$DBPOFFS= (0..7)
0 0 0 0 0 0 0 0 
##$DE= 6
##$DECBNUC= <off>
##$DECIM= 32
##$DECNUC= <off>
##$DECSTAT= 4
##$DIGMOD= 1
##$DIGTYP= 9
##$DL= (0..7)
0 120 120 120 120 120 120 120 
##$DP= (0..7)
150 150 150 150 150 150 150 150 
##$DP07= 0
##$DPNAME0= <>
##$DPNAME1= <>
##$DPNAME2= <>
##$DPNAME3= <>
##$DPNAME4= <>
##$DPNAME5= <>
##$DPNAME6= <>
##$DPNAME7= <>
##$DPOAL= (0..7)
0.5 0.5 0.5 0.5 0.5 0.5 0.5 0.5 
##$DPOFFS= (0..7)
0 0 0 0 0 0 0 0 
##$DQDMODE= 0
##$DR= 18
##$DS= 0
##$DSLIST= <SSSSSSSSSSSSSSS>
$$ [...]
##$SUBNAM2= <"">
##$SUBNAM3= <"">
##$SUBNAM4= <"">
##$SUBNAM5= <"">
##$SUBNAM6= <"">
##$SUBNAM7= <"">
##$SUBNAM8= <"">
##$SUBNAM9= <"">
##$SW= 18.0517328524113
##$SWIBOX= (0..15)
0 0 2 0 0 0 0 0 0 0 0 0 0 0 0 0 
##$SW_h= 3612.71676300578
##$TD= 16384
##$TD0= 1
##$TE= 0
##$TE2= 300
##$TE3= 300
##$TEG= 300
##$TL= (0..7)
0 120 120 120 120 120 120 120 
##$TP= (0..7)
150 150 150 150 150 150 150 150 
##$TP07= 0
##$TPNAME0= <>
##$TPNAME1= <>
##$TPNAME2= <>
##$TPNAME3= <>
##$TPNAME4= <>
##$TPNAME5= <>
##$TPNAME6= <>
##$TPNAME7= <>
##$TPOAL= (0..7)
0.5 0.5 0.5 0.5 0.5 0.5 0.5 0.5 
##$TPOFFS= (0..7)
0 0 0 0 0 0 0 0 
##$TUNHIN= 0
##$TUNHOUT= 0
##$TUNXOUT= 0
##$USERA1= <user>
##$USERA2= <user>
##$USERA3= <user>
##$USERA4= <user>
##$USERA5= <user>
##$V9= 5
##$VALIST= <valist>
##$VCLIST= <CCCCCCCCCCCCCCC>
##$VD= 0
##$VDLIST= <DDDDDDDDDDDDDDD>
##$VPLIST= <PPPPPPPPPPPPPPP>
##$VTLIST= <TTTTTTTTTTTTTTT>
##$WBST= 1024
##$WBSW= 4
##$XGAIN= (0..3)
0 0 0 0 
##$XL= 0
##$YL= 0
##$YMAX_a= 643150
##$YMIN_a= -582365
##$ZGOPTNS= <>
##$ZL1= 120
##$ZL2= 120
##$ZL3= 120
##$ZL4= 120
##$ABSF1= 10
##$ABSF2= 0
##$ABSG= 5
##$ABSL= 3
##$ALPHA= 0
##$AQORDER= 0
##$ASSFAC= 0
##$ASSFACI= 0
##$ASSFACX= 0
##$ASSWID= 0
##$AUNMP= <proc_1d>
##$AZFE= 0.1
##$AZFW= 0.1
##$BCFW= 1
##$BC_mod= 2
##$BYTORDP= 1
##$COROFFS= 0
##$CY= 11.3945322036743
##$DATMOD= 1
##$DC= 2
##$DFILT= <>
##$DTYPP= 0
##$F1P= 15.7292609196834
##$F2P= 12.9074282941183
##$FCOR= 0.5
##$FTSIZE= 0
##$FT_mod= 4
##$GAMMA= 1
##$GB= 0.15
##$INTBC= 1
##$INTSCL= 1
##$ISEN= 128
##$LB= 0.24
##$LEV0= 0
##$LPBIN= 0
##$MAXI= 10000
##$MC2= 0
##$MEAN= 0
##$ME_mod= 0
##$MI= 1.114404
##$NCOEF= 0
##$NC_proc= 0
##$NLEV= 6
##$NOISF1= 3.799351
##$NOISF2= 2.8
##$NSP= 1
##$NTH_PI= 0
##$NZP= 0
##$OFFSET= 15.70392
##$PC= 1
##$PHC0= -25119.11
##$PHC1= 13.85264
##$PH_mod= 1
##$PKNL= yes
##$PPARMOD= 0
##$PSCAL= 0
##$PSIGN= 0
##$REVERSE= no
##$SF= 200.130013532006
##$SI= 16384
##$SIGF1= 3
##$SIGF2= 2
##$SINO= 400
##$SIOLD= 16384
##$SREGLST= <1H.CDCl3>
##$SSB= 0
##$STSI= 0
##$STSR= 0
##$SW_p= 3612.71676300578
##$SYMM= 0
##$S_DEV= 0
##$TDeff= 0
##$TDoff= 0
##$TI= <>
##$TILT= no
##$TM1= 0
##$TM2= 0
##$TOPLEV= 0
##$USERP1= <user>
##$USERP2= <user>
##$USERP3= <user>
##$USERP4= <user>
##$USERP5= <user>
##$WDW= 1
##$XDIM= 8192
##$YMAX_p= 0
##$YMIN_p= 0
$$ End of Bruker specific parameters
$$ ---------------------------------
##NTUPLES= NMR FID
##VAR_NAME=  TIME,          FID/REAL,        FID/IMAG
##SYMBOL=    X,             R,               I
##VAR_TYPE=  INDEPENDENT,   DEPENDENT,       DEPENDENT
##VAR_FORM=  AFFN,          ASDF,            ASDF
##VAR_DIM=   8192,          8192,            8192
##UNITS=     SECONDS,       ARBITRARY UNITS, ARBITRARY UNITS
##FACTOR=    0.0002768,     1,               1
##FIRST=     0,             0,               0
##LAST=      2.2672688,     0,               0
##MIN=       0,             -582365,         0
##MAX=       2.2672688,     643150,          0
$$ Real data points
##PAGE= N=1
##DATA TABLE= (X++(R..R)), XYDATA
0 0 0 0 0 0 0 0 0 0 0 0 0 0 0 0 0 0 0 0 -4 4 -2 0 0 0 -3 3 -2 -4 4 -4 4 -5 10 -12 18 -22 24 -29 35 -44 51 -58 65 -74 85 -98
46 -98 111 -125 139 -151 165 -183 199 -215 230 -243 252 -258 258 -241 200 -125 -12 257 -703 1559 -3345
67 -3345 7634 -21252 129420 518240 -510360 -21862 538040 -546863 69672 474103
77 474103 -574487 122408 428327 -575891 200351 368064 -582365 242732 306925 -572112
87 -572112 308857 246677 -555384 341253 178770 -535190 388407 123017 -503463 414909
97 414909 53721 -473710 441571 2655 -432471 461201 -60165 -396415 472150 -109814
107 -109814 -347247 480795 -160650 -307389 479731 -208047 -254070 476816 -247362 -209388
117 -209388 463747 -286801 -158470 451984 -317174 -108791 427672 -345476 -62265 407049
127 407049 -366299 -12619 376414 -385202 31415 345413 -394441 75939 312815 -404813
137 -404813 116994 274322 -405311 156274 238605 -405417 191519 198140 -400732 227039
147 227039 158039 -390368 255793 117096 -380324 285796 75162 -362702 310398 32335
157 32335 -344189 331626 -8860 -321535 351968 -53213 -294624 364883 -94127 -264697
167 -264697 376540 -135723 -231557 381783 -176361 -193374 381787 -212254 -154948 377413
177 377413 -248314 -111970 366371 -278174 -68256 349744 -304310 -24813 329306 -326426
187 -326426 21100 301653 -341660 63300 271748 -352469 105609 237719 -357790 145201
197 145201 199626 -356304 180505 161942 -351811 214351 120281 -340832 243061 79360
207 79360 -325400 267562 38396 -307296 289416 -3764 -282985 304741 -42829 -257282
217 -257282 316709 -81653 -227789 324058 -118755 -195118 324881 -151631 -162035 323286
227 323286 -183073 -125781 315151 -210040 -89644 303155 -232460 -53905 287934 -252379
237 -252379 -17133 267386 -265778 16507 245534 -276314 49494 220850 -282644 81034
247 81034 193255 -283955 108370 166578 -283522 135193 137350 -278570 158440 108261 -271160
258 -271160 178878 80172 -262552 198578 50178 -249794 214052 22221 -236596 228628
268 228628 -6462 -220998 240725 -35060 -202451 249300 -61695 -183953 257219 -89446
278 -89446 -161945 261069 -115083 -138637 262229 -139549 -114606 261452 -163684 -87163 255721
289 255721 -184198 -60153 248409 -203586 -31686 237286 -220435 -2237 222191 -233337
299 -233337 25966 205783 -244957 55430 185170 -252042 83168 162796 -255922 109621
309 109621 138884 -257663 136307 111633 -254337 159413 84357 -249077 181487 55183
319 55183 -240206 201500 24528 -227372 217620 -4935 -212719 232595 -36116 -193713
329 -193713 243000 -66024 -172045 249703 -94738 -148614 253795 -123199 -121394 252161
339 252161 -147991 -93785 247734 -170832 -64509 238887 -190899 -33915 225453 -206030
349 -206030 -4938 210266 -219173 24909 190843 -227226 52431 169346 -231587 77943
359 77943 146820 -233465 102573 121667 -230416 123502 97223 -225425 142908 71772 -217832
370 -217832 160030 45989 -206986 173399 21748 -195627 185828 -3201 -181010 195159
380 195159 -26989 -165241 201872 -49309 -148860 207317 -72035 -129609 208842 -92057
390 -92057 -110716 209193 -111463 -90266 207085 -129527 -68733 201555 -144644 -47974 195307
401 195307 -159325 -25763 185703 -171079 -4069 174480 -180671 16991 162231 -188947
411 -188947 38683 146978 -193878 58563 131406 -197651 78403 114122 -199383 97861
421 97861 95095 -198282 115113 76174 -196397 132645 55096 -191397 148372 33756 -184193
432 -184193 162348 12005 -175913 175999 -11422 -163993 186236 -34040 -150731 195273
442 195273 -57242 -135033 201828 -80522 -116311 204501 -101759 -96880 205686 -122933 -74524
453 -74524 202613 -141817 -51355 196573 -158139 -27739 187827 -173157 -2622 175074
463 175074 -183761 21157 160721 -192245 44929 143668 -197835 67914 124064 -199272
473 -199272 88461 104235 -198893 108497 82212 -195059 125941 59752 -188614 141065
483 141065 37527 -180472 154977 14112 -168890 165294 -7951 -156108 174118 -29819
493 -29819 -141544 180573 -51351 -124635 183608 -70747 -107636 185077 -89964 -88408 183250
504 183250 -106807 -68910 179046 -121477 -49427 173174 -134796 -28743 164014 -144926
514 -144926 -9519 153940 -153379 9641 142139 -159885 28260 128451 -163320 44932
524 44932 114767 -165899 61599 99389 -165994 76589 83731 -164352 90088 68345 -162120
535 -162120 103683 51432 -157397 115150 35315 -152294 126177 18501 -145711 136248
545 136248 895 -136944 144196 -15708 -128054 152080 -33454 -116768 157727 -50716
555 -50716 -104204 161598 -67214 -90780 164429 -84218 -74905 164146 -99384 -58962 162366
566 162366 -113830 -41534 158574 -127239 -22860 151432 -138238 -4703 143361 -148021
576 -148021 14530 132539 -155488 33197 119889 -160647 51207 106046 -164292 69434
586 69434 89766 -164655 85668 73043 -163530 101327 55253 -160110 115943 36069 -153967
597 -153967 128086 17195 -146664 139478 -2663 -136324 148357 -22143 -124292 154839
607 154839 -40996 -111055 159844 -60143 -95163 161309 -77075 -78700 160851 -92882 -61276
618 -61276 157971 -107538 -42472 151849 -119160 -24433 144448 -129506 -5751 134434
628 134434 -137022 12038 122716 -141972 28675 110498 -145581 45118 96150 -146177
638 -146177 59314 81842 -145332 72857 67069 -143071 85234 51371 -138603 95340 36724
649 36724 -133605 105133 21312 -126932 113243 6080 -118915 119683 -8331 -110636
659 -110636 125728 -23333 -100295 129491 -37091 -90002 132365 -50594 -78643 134084
669 134084 -63933 -65994 133538 -75396 -53449 132345 -86977 -39819 129085 -97053 -25998
680 -25998 124397 -105554 -12419 118834 -113850 2218 111163 -119715 15827 102654
690 102654 -124844 29750 93140 -128748 43879 81840 -130494 56640 70509 -131687
700 -131687 69755 57465 -130806 81866 43669 -128435 92963 29573 -125008 104057
710 104057 14073 -119201 112976 -1208 -112038 120913 -16948 -103222 127662 -33307
720 -33307 -92209 131835 -48446 -80574 134974 -63792 -66809 135198 -77829 -51889 133282
731 133282 -90199 -36883 129734 -101986 -20506 123279 -111045 -4538 115475 -118442
741 -118442 11515 105846 -124175 27115 94176 -127002 41404 82157 -128590 55450
751 55450 68720 -128051 67943 54664 -125369 78823 40677 -121799 89215 25849 -115952
762 -115952 97491 11619 -109111 104473 -2583 -101311 110388 -16865 -91619 113940
772 113940 -29855 -81758 116725 -42826 -70691 117586 -54628 -58919 116718 -65108 -47178
783 -47178 115106 -75390 -34534 111148 -83502 -22284 106517 -90536 -10158 100808 -96682
794 -96682 2145 93530 -100806 13344 86110 -104387 24713 77546 -106497 35354 68392
805 68392 -107298 45096 59309 -107887 55185 49002 -106586 63924 38698 -105042 72582
816 72582 28074 -102308 80848 16383 -98283 87712 5192 -93783 94823 -6981 -87663
827 -87663 100341 -19173 -80283 104732 -31059 -72333 108511 -43389 -62463 110194 -54777
838 -54777 -52143 110713 -65918 -40763 109699 -76457 -28262 106368 -85099 -15920 102300
849 102300 -93277 -2705 96111 -99782 10437 88347 -104485 23015 79964 -108252 35780
860 35780 69737 -109738 47413 58851 -110049 58365 47312 -108995 69022 34616 -105708
871 -105708 77940 22383 -101646 86141 9239 -95801 93093 -3941 -88509 98234 -16455
882 -16455 -80553 102709 -29367 -70883 104805 -41095 -60469 105438 -52097 -49603 104821
893 104821 -62375 -37478 101900 -70881 -25891 98159 -78676 -13860 92804 -84825
903 -84825 -2073 86048 -89068 8823 79026 -92516 19918 70493 -93981 29573 61913
914 61913 -94593 38724 52839 -94348 47428 43095 -92408 54775 34090 -90446 61876
925 61876 24347 -87199 68051 14565 -83054 73259 5424 -78785 78361 -4682 -73146
936 -73146 82252 -14056 -67272 85365 -23369 -60758 88145 -32784 -53116 89202 -41295
947 -41295 -45313 89775 -49989 -36751 88937 -57980 -27647 87252 -64919 -18567 84871
958 84871 -71543 -8695 80682 -76803 875 76044 -81694 10509 70492 -85638 20509
969 20509 63509 -87869 29766 56326 -89825 39178 48048 -90397 48186 38808 -89597
980 -89597 56496 29515 -88402 64776 19071 -85061 71675 8760 -80986 77980 -2201
991 -2201 -75897 83434 -13489 -68968 87084 -24163 -61598 90243 -34984 -52755 91414
1002 91414 -45003 -43049 90968 -54110 -33047 89460 -62847 -22177 86057 -69703 -11444
1013 -11444 81501 -75283 -805 75895 -80099 10021 68559 -82709 19728 61175 -84662
1024 -84662 29112 52839 -85028 37905 43981 -83949 45320 35219 -82366 52697 25710
1035 25710 -79387 58557 16564 -75638 63769 7510 -71342 68330 -1896 -65793 71594
1046 71594 -10228 -60314 74316 -18852 -53875 75973 -27154 -46660 76375 -34426 -39762
1057 -39762 76524 -41629 -31898 75148 -47780 -24162 73235 -53352 -16572 70646 -58553
1068 -58553 -8533 66979 -62127 -1144 63198 -65645 6604 58509 -68419 13983 53199
1079 53199 -70132 20995 47914 -71642 28162 41556 -72046 34743 35026 -71894 41248
1090 41248 28311 -71471 47739 20689 -69563 53341 13184 -67661 58848 4961 -64290
1101 -64290 63774 -3567 -60032 67754 -11830 -55407 71251 -20704 -49197 73529 -29103
1112 -29103 -42728 74852 -37246 -35322 75380 -45127 -27033 73870 -51797 -18759 72032
1123 72032 -58129 -9806 68739 -63457 -767 64026 -67361 7693 59082 -70638 16688
1134 16688 52654 -72572 24794 45793 -73380 32561 38659 -73484 39905 30241 -71903
1145 -71903 46268 22382 -69969 52319 13834 -66746 57486 5136 -62421 61357 -3165
1156 -3165 -57957 64888 -11716 -51931 67134 -19638 -45703 68306 -27093 -39001 68685
1167 68685 -34372 -31531 67596 -40407 -24385 65996 -45959 -16591 63365 -50766 -9180
1178 -9180 59834 -54070 -2123 55989 -57339 5122 51179 -59034 11688 46237 -60331
1189 -60331 17783 41169 -61020 23690 35357 -60823 28934 29762 -60303 34121 23971 -59283
1201 -59283 38787 17876 -57307 42928 12074 -55492 46936 5551 -52698 50326 -795
1212 -795 -49484 53346 -6991 -46056 56189 -13673 -41609 57872 -19709 -37059 59459 -26101
1224 -26101 -31776 60055 -32083 -25974 59595 -37379 -20155 59096 -42828 -13582 57236 -47334
1236 -47334 -7008 54732 -51147 -391 51838 -54726 6521 47669 -57101 13103 43269
1247 43269 -59179 19695 38147 -60384 26146 32343 -60575 32059 26349 -60406 38085 19457
1259 19457 -58913 43364 12653 -56672 48008 5485 -53932 52348 -2202 -49768 55526
1270 55526 -9437 -45388 58018 -16865 -39922 59635 -23864 -33847 60005 -30344 -27494 59718
1282 59718 -36474 -20417 58137 -41589 -13568 55755 -45890 -6604 52656 -49572 530
1293 530 48486 -51814 6945 44186 -53790 13191 39298 -54656 19158 33800 -54526 24208
1305 24208 28471 -54263 29206 22705 -52932 33340 17099 -51125 37204 11457 -49070 40773
1317 40773 5578 -46205 43363 8 -43200 45797 -5504 -39772 47679 -11029 -35618 48714
1329 48714 -15999 -31686 49688 -21132 -26942 49756 -25681 -22371 49403 -29902 -17587 48681
1341 48681 -34040 -12454 47041 -37190 -7547 45213 -40342 -2542 42897 -42992 2668 40086
1353 40086 -44876 7446 37059 -46841 12591 33532 -47959 17359 29558 -48645 22106 25363
1365 25363 -49105 27054 20401 -48692 31133 15629 -47894 35572 10071 -46480 39512 4401
1377 4401 -44236 42823 -1401 -41517 46110 -7614 -38018 48356 -13647 -33896 49801 -19395
1389 -19395 -29287 50887 -25334 -23861 50822 -30335 -18402 50031 -35093 -12442 48431 -39328
1401 -39328 -6224 45870 -42524 -498 43014 -45380 5641 39005 -47127 11418 34840 -48250
1413 -48250 16771 30258 -48803 22059 25029 -48399 26447 19933 -47473 30622 14522 -45951
1425 -45951 34493 8877 -43576 37505 3511 -41112 40246 -2126 -37706 42207 -7378 -34060
1437 -34060 43602 -12428 -30106 44504 -17542 -25693 44482 -21677 -21283 44162 -25806 -16486 43145
1450 43145 -29315 -11642 41409 -32122 -7110 39499 -34737 -2313 37057 -36643 1977 34402
1462 34402 -38185 6001 31486 -39387 10212 28209 -39788 13787 25073 -40245 17696 21503
1474 21503 -40275 21192 17669 -39763 24471 14052 -39250 27695 9913 -38075 30489 5658
1486 5658 -36681 33256 1418 -34865 35810 -3190 -32495 37747 -7672 -29883 39512 -12160
1498 -12160 -26758 40682 -16800 -22957 41278 -20934 -19188 41551 -25132 -14681 40921 -28868
1510 -28868 -10176 39778 -32172 -5662 38293 -35329 -768 35848 -37596 3873 33318 -39368
1522 -39368 8728 30111 -40877 13479 26507 -41447 17905 22547 -41832 22051 18059 -41312
1534 -41312 26032 13449 -40345 29496 8685 -38939 32866 3592 -36569 35557 -1389 -33887
1546 -33887 37621 -6353 -30732 39146 -11314 -26824 40016 -15897 -22918 40256 -20223 -18590
1558 -18590 39946 -24112 -13971 38732 -27446 -9355 37221 -30350 -4791 34945 -32374 -394
1570 -394 32631 -34081 3733 29647 -35221 7819 26571 -35589 11421 23373 -36008 14918
1582 14918 19837 -35664 17985 16341 -35137 20834 12860 -34326 23653 9055 -32958 25870
1594 25870 5569 -31557 27918 1818 -29783 29818 -1983 -27646 31187 -5426 -25397 32500
1606 32500 -9027 -22717 33222 -12591 -19909 33724 -15798 -16958 33817 -19109 -13610 33613
1618 33613 -21849 -10426 32844 -24483 -6956 31821 -27038 -3300 30461 -28848 -10 28797
1630 28797 -30719 3850 26652 -32192 7401 24417 -33141 10772 21775 -34150 14507 18625
1642 18625 -34211 17772 15480 -34312 21280 11834 -33825 24378 7830 -32851 27075 3820
1654 3820 -31514 29760 -490 -29331 31775 -4711 -26807 33405 -8971 -23854 34731 -13242
1666 -13242 -20460 35147 -17066 -16842 35042 -20653 -12967 34480 -23992 -8693 33067 -26735 -4719
1679 -4719 31650 -28969 -434 29452 -30756 3529 26724 -31987 7283 23923 -32751 11020
1691 11020 20684 -32808 14265 17455 -32628 17453 13938 -32150 20163 10383 -30946 22589 6806
1704 6806 -29753 24793 3146 -27863 26539 -388 -25759 27874 -3809 -23631 28980 -7268
1716 -7268 -20949 29494 -10379 -18149 29790 -13416 -15321 29647 -16191 -12235 29064 -18453 -9301
1729 -9301 28439 -20683 -6244 27239 -22489 -3310 25779 -23936 -485 24435 -25319 2498
1741 2498 22587 -26217 5056 20786 -27076 7898 18699 -27748 10621 16415 -27779 13086
1753 13086 14058 -27984 15671 11356 -27799 18158 8626 -27219 20453 5776 -26535 22697 2384
1766 2384 -25183 24629 -825 -23728 26227 -4163 -21855 27600 -7685 -19444 28489 -10846
1778 -10846 -16975 29097 -14178 -14094 29153 -17194 -11134 28923 -19729 -7797 28169 -22435 -4297
1791 -4297 26962 -24433 -951 25428 -26083 2451 23450 -27509 5881 21190 -28289 9021
1803 9021 18632 -28970 12165 15690 -28966 15117 12650 -28586 17879 9498 -27957 20292 5939
1816 5939 -26687 22363 2704 -25194 24240 -736 -23167 25609 -4245 -20910 26393 -7482
1828 -7482 -18339 27055 -10622 -15552 27141 -13448 -12655 26833 -15876 -9710 26171 -18166 -6601
1841 -6601 25028 -19947 -3752 23753 -21311 -893 22126 -22578 1887 20243 -23213 4393
1853 4393 18535 -23798 6801 16406 -24008 9072 14156 -23945 11122 12053 -23977 13271 9675
1866 9675 -23464 14997 7530 -22853 16827 5068 -22048 18419 2536 -20991 19775 24
1878 24 -19797 21069 -2503 -18294 21993 -5000 -16640 22819 -7523 -14952 23297 -10109 -12808
1891 -12808 23466 -12277 -10492 23572 -14339 -8223 23294 -16528 -5879 22620 -18290 -3363
1903 -3363 21851 -19903 -769 20717 -21298 1812 19290 -22329 4424 17752 -23366 7219
1915 7219 15660 -23848 9637 13571 -24240 12268 11166 -24199 14662 8512 -23726 16724 5931
1928 5931 -22995 18839 2809 -21928 20579 -92 -20498 21922 -3073 -18675 23083 -6235
1940 -6235 -16529 23649 -8979 -14077 24021 -11684 -11504 23848 -13966 -8695 23141 -16053 -6100
1953 -6100 22374 -17953 -3197 21230 -19307 -525 19699 -20265 1977 18014 -21325 4513
1965 4513 16050 -21640 6911 14143 -21676 9002 11966 -21663 11012 9696 -21199 12755 7508
1978 7508 -20600 14408 5167 -19851 15824 2870 -18777 16963 660 -17568 18005 -1698
1990 -1698 -16169 18696 -3817 -14518 19222 -5943 -12925 19617 -8001 -11041 19577 -9843
2002 -9843 -9220 19461 -11466 -7198 19070 -13032 -5329 18617 -14263 -3344 17995 -15600 -1399
2015 -1399 17005 -16421 404 15960 -17396 2331 14915 -18117 4400 13596 -18659 6111
2027 6111 12306 -19067 8003 10513 -19396 9939 8767 -19308 11686 6879 -19113 13558 4708
2040 4708 -18510 15109 2517 -17888 16540 262 -16866 17861 -2225 -15465 18703 -4522
2052 -4522 -13942 19557 -6915 -12091 19890 -9157 -10147 19943 -11245 -8198 19928 -13193 -5704
2065 -5704 19223 -14799 -3412 18449 -16286 -1108 17399 -17430 1209 16005 -18317 3444
2077 3444 14558 -18864 5662 12671 -19181 7732 10831 -19180 9583 8858 -18965 11403 6753
2090 6753 -18413 12961 4555 -17679 14305 2313 -16600 15540 12 -15409 16306 -2104
2102 -2104 -14031 16957 -4200 -12277 17316 -6175 -10566 17380 -7894 -8933 17341 -9660 -6899
2115 -6899 16848 -10809 -5137 16279 -12187 -3337 15485 -13088 -1631 14715 -13851 -15
2127 -15 13730 -14434 1682 12546 -14856 3102 11463 -15227 4521 10297 -15441 6071 8885
2140 8885 -15510 7410 7633 -15545 8644 6256 -15435 10089 4733 -14886 11197 3129 -14570
2153 -14570 12311 1486 -13857 13241 -302 -13059 14050 -1992 -12125 14837 -3799 -10946
2165 -10946 15363 -5400 -9539 15639 -7110 -8275 15854 -8677 -6545 15687 -10031 -4900 15460
2178 15460 -11490 -3242 14973 -12782 -1522 14271 -13744 193 13522 -14776 1989 12369
2190 12369 -15326 3904 11143 -15779 5680 9788 -16106 7485 8075 -15943 8884 6402 -15799
2203 -15799 10611 4487 -15379 11867 2553 -14534 12992 637 -13606 13950 -1467 -12548
2215 -12548 14575 -3355 -11004 15208 -5174 -9612 15344 -6738 -7958 15215 -8340 -6249 15012
2228 15012 -9553 -4549 14331 -10768 -2890 13661 -11584 -1255 12884 -12387 381 11855
2240 11855 -12869 1807 10769 -13104 3277 9776 -13394 4536 8305 -13366 5775 7267 -13340
2253 -13340 6938 5829 -13060 7972 4569 -12699 8905 3246 -12379 9738 1846 -11675 10534
2266 10534 529 -10913 11165 -877 -10199 11755 -2306 -9155 12121 -3410 -8247 12341
2278 12341 -4752 -7295 12267 -5954 -6137 12331 -7000 -5084 12353 -8056 -3824 12087 -8855
2291 -8855 -2481 11746 -9829 -1318 11268 -10630 -32 10619 -11154 1248 9897 -11873 2519
2304 2519 9218 -12352 3910 8176 -12654 5187 7086 -12777 6548 5821 -12742 7803 4445
2317 4445 -12695 9013 2924 -12176 10122 1338 -11634 10838 -211 -10793 11813 -1833
2329 -1833 -9819 12313 -3365 -8784 12645 -4711 -7534 12888 -6497 -6163 12766 -7584 -4680
2342 -4680 12509 -8615 -3252 12044 -9609 -1721 11435 -10369 -347 10688 -11041 1048
2354 1048 9785 -11448 2425 8735 -11765 3740 7752 -11880 5023 6532 -11850 6115 5227
2367 5227 -11589 7058 3919 -11305 8105 2686 -10645 8719 1407 -10063 9277 1 -9431
2380 -9431 9922 -1218 -8421 10145 -2372 -7584 10429 -3634 -6659 10417 -4597 -5564 10410
2393 10410 -5462 -4642 10399 -6383 -3536 9967 -7044 -2649 9682 -7640 -1487 9346 -8287
2406 -8287 -587 8713 -8605 285 8365 -9143 1328 7701 -9431 2260 7110 -9781 3214
2419 3214 6330 -9981 4192 5417 -10094 5083 4542 -10029 5968 3750 -9905 6919 2551
2432 2551 -9655 7728 1443 -9336 8555 194 -8811 9140 -1026 -8038 9496 -2141 -7344
2445 -7344 10063 -3374 -6419 10125 -4455 -5491 10349 -5549 -4512 10178 -6498 -3458 10144
2458 10144 -7403 -2266 9790 -8170 -958 9263 -8948 267 8651 -9380 1322 7904 -9933
2471 -9933 2555 7133 -10072 3646 6119 -10215 4785 5021 -10055 5899 3824 -9786 6652
2484 6652 2711 -9543 7458 1359 -8917 8212 281 -8393 8552 -1022 -7598 9046 -2171
2497 -2171 -6638 9147 -3160 -5842 9204 -4115 -4800 9080 -5004 -3844 8920 -5715 -2864
2510 -2864 8660 -6441 -1892 8208 -6819 -939 7836 -7320 -187 7346 -7627 694 6706
2523 6706 -7793 1482 6064 -7970 2360 5367 -8097 3256 4758 -8098 3888 3969 -8042
2536 -8042 4498 3222 -7914 5152 2533 -7717 5664 1683 -7513 6492 792 -7147 6812
2549 6812 -22 -6665 7070 -969 -6208 7523 -1776 -5667 7650 -2630 -4905 7986 -3420
2562 -3420 -4314 8012 -4178 -3585 8025 -4963 -2830 7985 -5574 -1977 7680 -6187 -1159 7504
2576 7504 -6871 -319 7151 -7294 610 6655 -7807 1380 6114 -8097 2545 5315 -8273
2589 -8273 3456 4570 -8385 4245 3757 -8241 5119 2831 -8139 5892 1744 -7822 6506
2602 6506 836 -7396 7094 -288 -6812 7454 -1188 -6142 7852 -2290 -5424 8001 -3157
2615 -3157 -4518 7954 -3968 -3561 7888 -4624 -2727 7665 -5275 -1990 7344 -5840 -1136
2628 -1136 6983 -6250 -266 6574 -6580 568 6127 -6955 1360 5428 -7004 2209 4824 -7041
2642 -7041 2817 4109 -7101 3574 3378 -6995 4143 2649 -6794 4662 1979 -6551 5036 1091
2656 1091 -6196 5317 398 -5815 5788 -358 -5278 5918 -1101 -4956 6175 -1641 -4354 6285
2670 6285 -2318 -3857 6344 -2829 -3311 6327 -3308 -2829 6344 -3818 -2059 6260 -4302 -1529 6067
2685 6067 -4778 -1087 5968 -5184 -398 5619 -5625 216 5286 -5869 992 4966 -6148 1492
2699 1492 4477 -6312 2279 3972 -6421 3005 3340 -6534 3567 2681 -6503 4305 1913 -6331
2713 -6331 4854 1240 -6131 5275 527 -5782 5818 -415 -5257 6079 -1073 -4879 6428 -1938
2727 -1938 -4169 6545 -2719 -3595 6541 -3323 -3047 6648 -4061 -2310 6587 -4494 -1569 6225
2741 6225 -5010 -805 5847 -5523 -36 5432 -5789 593 5022 -6062 1338 4492 -6211 2087
2755 2087 3926 -6136 2685 3271 -6238 3303 2543 -6019 3883 1875 -5864 4251 1177 -5489 4725
2770 4725 427 -5157 5068 -194 -4828 5228 -887 -4233 5374 -1474 -3820 5370 -2063 -3373
2784 -3373 5449 -2434 -2811 5365 -2906 -2183 5271 -3233 -1776 5153 -3562 -1280 4979 -3949 -835
2799 -835 4733 -4239 -293 4650 -4487 225 4217 -4672 649 3996 -4918 1088 3543 -5027 1601
2814 1601 3159 -5125 2139 2777 -5163 2605 2270 -5001 3089 1797 -4978 3484 1305 -4863 3846
2829 3846 735 -4534 4205 183 -4424 4559 -365 -4115 4785 -1087 -3658 4975 -1472 -3387 5154
2844 5154 -2032 -2955 5209 -2636 -2498 5155 -3061 -1984 5087 -3683 -1381 5080 -3909 -799 4879
2859 4879 -4423 -295 4678 -4617 435 4154 -4922 1106 3794 -5213 1628 3350 -5128 2175 2805
2874 2805 -5275 2699 2216 -5128 3278 1606 -4847 3617 956 -4756 3922 370 -4456 4311 -215
2889 -215 -4057 4468 -733 -3732 4620 -1324 -3197 4607 -1773 -2870 4679 -2259 -2384 4700 -2630
2904 -2630 -1842 4480 -2894 -1474 4315 -3402 -974 4218 -3558 -514 4047 -3703 7 3858 -3933
2919 -3933 459 3499 -4169 896 3080 -4086 1226 2800 -4292 1667 2456 -4208 1956 2030 -4186 2392
2935 2392 1679 -3944 2664 1124 -3996 2939 856 -3845 3314 314 -3642 3438 -4 -3530 3645
2950 3645 -420 -3315 3856 -874 -3033 3996 -1304 -2727 4064 -1695 -2430 4228 -2064 -2083 4306 -2455
2966 -2455 -1702 4190 -2788 -1262 4189 -3125 -871 4072 -3482 -271 3878 -3712 96 3713 -4004
2981 -4004 514 3375 -4225 1197 2859 -4405 1571 2615 -4416 2064 2198 -4391 2586 1635 -4247
2996 -4247 2976 1235 -4211 3333 653 -4028 3599 131 -3855 3879 -376 -3468 4087 -853 -3123
3011 -3123 4215 -1310 -2716 4265 -1875 -2359 4332 -2290 -1981 4220 -2576 -1456 4116 -2858 -1039
3026 -1039 4013 -3281 -558 3717 -3406 -17 3545 -3675 354 3218 -3849 835 2925 -3837 1357
3041 1357 2488 -3824 1579 2020 -3869 1940 1767 -3755 2272 1306 -3774 2601 1022 -3496 2734 525
3057 525 -3313 2819 322 -3235 3165 -165 -2936 3319 -578 -2853 3497 -963 -2538 3488 -1169
3072 -1169 -2243 3652 -1528 -1983 3554 -1830 -1684 3591 -2057 -1405 3525 -2288 -1069 3639 -2689 -652
3088 -652 3422 -2919 -296 3302 -3098 42 3060 -3438 501 2776 -3483 886 2612 -3692 1333
3103 1333 2213 -3766 1759 1969 -3703 2003 1474 -3687 2468 1018 -3646 2679 743 -3610 3016 354
3119 354 -3358 3296 -105 -3176 3459 -581 -3031 3626 -1035 -2587 3688 -1430 -2255 3878 -1776
3134 -1776 -1952 3837 -2225 -1403 3753 -2547 -1209 3803 -2779 -681 3562 -3100 -254 3283 -3354
3149 -3354 149 3086 -3462 828 2674 -3626 1066 2463 -3626 1421 2010 -3557 1752 1578 -3567
3164 -3567 2140 1308 -3545 2434 784 -3310 2567 465 -3128 2901 178 -2989 2950 -235 -2784
3179 -2784 3126 -582 -2546 3253 -764 -2254 3370 -1177 -2046 3281 -1452 -1732 3351 -1772 -1532 3318
3195 3318 -1945 -1225 3240 -2387 -805 3115 -2511 -557 2993 -2689 -236 2887 -2700 12 2554
3210 2554 -2978 445 2439 -3106 764 2213 -3133 1159 2005 -3198 1464 1656 -3217 1677 1407 -3235
3226 -3235 2080 1050 -3216 2213 856 -3214 2586 376 -3038 2751 124 -2966 2933 -318 -2838
3241 -2838 3206 -595 -2555 3237 -1025 -2346 3409 -1359 -2032 3561 -1663 -1569 3491 -2050 -1378 3522
3257 3522 -2366 -834 3354 -2655 -445 3127 -2863 -129 3031 -3141 387 2780 -3224 691 2460
3272 2460 -3330 1111 2134 -3432 1449 1655 -3404 1811 1443 -3365 2137 1070 -3309 2434 608
3287 608 -3182 2664 364 -2998 2815 6 -2872 2917 -388 -2619 3097 -785 -2353 3117 -1111
3302 -1111 -2140 3145 -1467 -1740 3181 -1643 -1439 3201 -1870 -1118 3079 -2151 -788 3011 -2469 -428
3318 -428 2809 -2530 -46 2577 -2645 287 2500 -2719 438 2203 -2817 683 2008 -3111 1039
3333 1039 1800 -2921 1359 1581 -2960 1637 1234 -2999 1871 886 -2979 2061 722 -2831 2285 399
3349 399 -2747 2570 155 -2637 2657 -234 -2531 2750 -457 -2321 3009 -749 -2203 3123 -1119
3364 -1119 -1909 3130 -1468 -1594 3322 -1779 -1262 3127 -2062 -1050 3069 -2310 -649 2930 -2606 -210
3380 -210 2796 -2799 158 2646 -2920 463 2420 -3040 772 2173 -3219 1228 1920 -3341 1553
3395 1553 1600 -3277 1884 1338 -3296 2207 1010 -3068 2459 614 -2970 2612 144 -2871 2865 -179
3411 -179 -2627 3031 -522 -2406 3159 -924 -2136 3235 -1199 -1773 3196 -1574 -1569 3181 -1782 -1212
3427 -1212 3104 -2112 -842 2991 -2325 -507 2802 -2561 -211 2532 -2658 182 2462 -2788 532
3442 532 2233 -2864 838 1901 -2892 1095 1754 -2981 1365 1475 -2938 1649 1244 -2891 1861 848
3458 848 -2772 2112 581 -2727 2315 376 -2638 2425 18 -2530 2607 -256 -2297 2751 -501
3473 -501 -2217 2801 -844 -1941 2922 -1077 -1673 2978 -1314 -1544 2978 -1681 -1062 2896 -1918 -810
3489 -810 2828 -2183 -555 2776 -2407 -208 2711 -2498 22 2530 -2712 465 2265 -2842 803
3504 803 2095 -2949 1057 1866 -3063 1366 1628 -3142 1615 1365 -3125 1900 1010 -3017 2248 632
3520 632 -2991 2465 374 -2815 2717 -28 -2790 2867 -351 -2465 3103 -774 -2250 3211 -1085
3535 -1085 -1913 3164 -1491 -1646 3228 -1759 -1353 3128 -2111 -1074 3135 -2289 -573 2987 -2555 -231
3551 -231 2759 -2741 266 2583 -2889 426 2336 -2985 786 2138 -3023 1123 1820 -3093 1525
3566 1525 1551 -3184 1745 1261 -3014 1909 944 -3044 2236 640 -2857 2367 245 -2663 2622 -121
3582 -121 -2545 2769 -420 -2248 2916 -773 -2066 3044 -911 -1859 2935 -1232 -1522 2929 -1555 -1270
3598 -1270 2817 -1749 -1078 2811 -2001 -766 2860 -2240 -444 2674 -2521 -198 2469 -2585 140
3613 140 2331 -2672 541 2253 -2838 795 2019 -2918 1109 1789 -2952 1353 1457 -2944 1672 1311
3629 1311 -2978 1941 928 -2967 2262 731 -2946 2559 330 -2802 2699 -59 -2743 2918 -277
3644 -277 -2510 2939 -686 -2220 3152 -1136 -1923 3207 -1542 -1680 3171 -1903 -1339 3152 -2103 -929
3660 -929 3095 -2440 -556 2954 -2616 -165 2843 -2864 138 2727 -3056 636 2412 -3195 923
3675 923 2164 -3205 1330 1897 -3308 1591 1641 -3240 1836 1161 -3247 2261 741 -3112 2527 445
3691 445 -3023 2717 55 -2772 2880 -283 -2626 3020 -751 -2407 3178 -926 -2033 3137 -1344
3706 -1344 -1784 3197 -1658 -1480 3173 -1906 -1103 3052 -2138 -828 2857 -2361 -308 2811 -2578 -22
3722 -22 2648 -2762 270 2490 -2956 581 2169 -3046 808 2061 -3053 1154 1846 -3089 1511 1467
3738 1467 -3046 1789 1195 -2985 2022 977 -2987 2201 731 -2937 2562 423 -2767 2667 38
3753 38 -2664 2829 -277 -2550 2956 -701 -2165 3083 -1035 -2039 3134 -1453 -1707 3144 -1631 -1409
3769 -1409 3195 -2022 -1033 3213 -2265 -830 3112 -2479 -355 3020 -2766 21 2790 -2940 336
3784 336 2640 -2981 714 2299 -3251 1065 2149 -3383 1484 1777 -3376 1759 1437 -3313 2151 1168
3800 1168 -3288 2478 743 -3260 2754 253 -3041 2847 -95 -2868 3168 -527 -2636 3329 -798
3815 -798 -2302 3368 -1316 -2087 3311 -1634 -1603 3320 -1958 -1295 3338 -2209 -918 3159 -2526 -527
3831 -527 3040 -2676 -95 2854 -2929 282 2675 -3056 581 2502 -3160 1038 2040 -3245 1240
3846 1240 1827 -3200 1569 1558 -3203 1970 1245 -3091 2229 933 -3183 2418 581 -2881 2642 219
3862 219 -2822 2678 -196 -2592 2997 -455 -2458 3066 -818 -2049 3091 -1143 -1917 3142 -1411
3877 -1411 -1490 3152 -1676 -1321 3086 -1934 -1072 3018 -2221 -649 2925 -2393 -316 2815 -2661 93
3893 93 2743 -2831 271 2601 -3114 706 2379 -3132 1003 2080 -3160 1249 1834 -3301 1695 1525
3909 1525 -3283 2025 1103 -3227 2234 857 -3117 2609 399 -3139 2860 -51 -2984 3006 -314
3924 -314 -2653 3217 -676 -2382 3347 -1256 -2130 3431 -1524 -1823 3422 -1872 -1446 3312 -2245 -984
3940 -984 3414 -2346 -606 3218 -2784 -263 3047 -2986 143 2836 -3186 559 2601 -3316 998
3955 998 2344 -3495 1304 1913 -3389 1753 1647 -3401 1985 1251 -3375 2400 913 -3239 2603 518
3971 518 -3049 2771 161 -2904 2974 -295 -2643 3233 -677 -2427 3127 -932 -2041 3280 -1392
3986 -1392 -1748 3151 -1698 -1488 3266 -1945 -1168 3232 -2226 -809 3069 -2400 -371 2909 -2610 -118
4002 -118 2735 -2799 196 2581 -2925 511 2409 -3030 803 2116 -3199 1211 1975 -3230 1547
4017 1547 1659 -3225 1726 1284 -3302 2027 1059 -3188 2365 729 -3176 2480 362 -2922 2800 18
4033 18 -2697 2991 -271 -2567 3072 -736 -2390 3278 -1139 -2037 3256 -1562 -1739 3428 -1854 -1355
4049 -1355 3369 -2172 -1030 3309 -2371 -680 3239 -2693 -318 2996 -2951 175 2954 -3133 493
4064 493 2698 -3339 904 2308 -3367 1285 2073 -3566 1672 1804 -3562 2083 1412 -3471 2433 938
4080 938 -3401 2665 497 -3300 2983 61 -3100 3196 -359 -2761 3344 -689 -2577 3441 -1035
4095 -1035 -2233 3441 -1536 -1803 3409 -1799 -1501 3371 -2087 -1105 3230 -2408 -615 3225 -2655 -351
4111 -351 3047 -2871 31 2791 -2926 520 2567 -3071 736 2287 -3108 1080 2023 -3269 1471
4126 1471 1741 -3251 1735 1431 -3286 2033 1067 -3165 2298 714 -3070 2445 382 -3003 2696 182
4142 182 -2735 2989 -225 -2553 2968 -589 -2364 3127 -949 -2063 3201 -1157 -1857 3237 -1552
4157 -1552 -1595 3259 -1935 -1191 3124 -2128 -901 3123 -2449 -522 3077 -2734 -204 2864 -2872 61
4173 61 2746 -3026 491 2624 -3140 940 2360 -3371 1265 2028 -3386 1611 1704 -3459 1906 1369
4189 1369 -3440 2329 1082 -3434 2637 657 -3189 2820 188 -3145 3029 -158 -2867 3261 -647
4204 -647 -2578 3426 -1057 -2259 3355 -1539 -1919 3529 -1756 -1604 3548 -2154 -1186 3423 -2461 -762
4220 -762 3339 -2858 -381 2980 -2960 95 2974 -3086 368 2710 -3262 806 2347 -3414 1207
4235 1207 2011 -3415 1646 1762 -3430 1913 1378 -3302 2125 1050 -3191 2507 618 -3064 2727 244
4251 244 -2928 3026 -197 -2782 3078 -477 -2476 3141 -822 -2209 3222 -1152 -1908 3291 -1497
4266 -1497 -1643 3139 -1796 -1390 3179 -2026 -1032 3110 -2197 -592 3064 -2591 -456 2911 -2605 56
4282 56 2673 -2859 230 2474 -2978 658 2338 -3049 1039 2139 -3308 1230 1900 -3371 1606 1544
4298 1544 -3292 2017 1204 -3178 2282 1011 -3270 2514 617 -3069 2806 199 -3017 3026 -106
4313 -106 -2730 3129 -708 -2496 3313 -1042 -2293 3427 -1476 -1851 3483 -1767 -1583 3393 -2041 -1254
4329 -1254 3420 -2407 -795 3241 -2742 -443 3099 -2999 -39 3036 -3119 350 2789 -3415 940
4344 940 2678 -3531 1238 2154 -3650 1640 1926 -3516 2002 1392 -3673 2265 1041 -3574 2788 746
4360 746 -3342 2829 205 -3154 3140 -275 -2908 3355 -613 -2514 3346 -965 -2248 3359 -1352
4375 -1352 -1864 3383 -1763 -1585 3393 -2013 -1217 3293 -2186 -745 3285 -2391 -505 3011 -2823 -73
4391 -73 2855 -2980 234 2717 -3038 612 2416 -3103 1093 2120 -3148 1164 2042 -3317 1654 1655
4407 1655 -3325 1851 1298 -3267 2138 1054 -3199 2357 648 -3032 2764 249 -2893 2811 -39
4422 -39 -2749 3023 -434 -2453 3175 -777 -2500 3253 -1160 -2055 3282 -1462 -1789 3366 -1800 -1448
4438 -1448 3359 -2069 -1028 3163 -2377 -715 3170 -2615 -441 2997 -2940 -5 2874 -3110 411
4453 411 2599 -3261 827 2482 -3429 1142 2262 -3508 1605 1928 -3543 1955 1592 -3514 2249 1106
4469 1106 -3485 2577 676 -3330 3003 302 -3166 3060 -266 -3015 3187 -664 -2612 3485 -1117
4484 -1117 -2411 3417 -1389 -2089 3522 -1795 -1607 3458 -2149 -1297 3430 -2473 -820 3309 -2736 -502
4500 -502 3117 -2891 -55 2920 -3059 433 2764 -3261 741 2476 -3372 1154 2226 -3448 1461
4515 1461 1821 -3339 1775 1454 -3389 2034 1082 -3373 2376 732 -3203 2598 327 -2984 2888 117
4531 117 -2809 2865 -274 -2567 3115 -796 -2375 3257 -1003 -1977 3242 -1332 -1685 3177 -1598 -1499
4547 -1499 3162 -1908 -1107 3204 -2130 -873 3014 -2392 -580 2994 -2584 -151 2822 -2923 189
4562 189 2675 -3029 534 2483 -3168 746 2167 -3309 1192 1979 -3469 1566 1643 -3392 1964 1437
4578 1437 -3364 2251 1050 -3436 2546 675 -3191 2806 217 -3111 3049 -209 -2905 3164 -587
4593 -587 -2587 3421 -982 -2381 3487 -1386 -1922 3531 -1886 -1592 3507 -2155 -1227 3571 -2505 -915
4609 -915 3387 -2751 -501 3157 -3147 -58 3014 -3205 373 2754 -3460 865 2597 -3512 1173
4624 1173 2171 -3646 1531 1833 -3597 1969 1396 -3420 2220 1014 -3468 2676 638 -3327 2901 157
4640 157 -3056 2993 -101 -2836 3249 -552 -2631 3331 -931 -2244 3279 -1378 -1897 3411 -1769
4655 -1769 -1647 3342 -1969 -1123 3343 -2144 -931 3124 -2437 -532 2995 -2673 -153 2807 -2846
4670 -2846 164 2580 -2958 539 2484 -3075 812 2167 -3203 1164 1946 -3332 1562 1648 -3333 1798
4686 1798 1438 -3278 2068 996 -3272 2428 697 -3057 2512 305 -3116 2863 -6 -2838 3103
4701 3103 -467 -2563 3249 -733 -2386 3175 -1111 -2157 3273 -1463 -1809 3414 -1765 -1470 3271
4716 3271 -2154 -1152 3270 -2407 -676 3370 -2673 -339 3077 -2953 76 2988 -3247 395 2754
4731 2754 -3515 833 2517 -3502 1391 2184 -3638 1603 1836 -3633 2127 1472 -3684 2430 986 -3417
4747 -3417 2681 523 -3240 3024 176 -3113 3219 -298 -2923 3365 -779 -2511 3474 -1143 -2411
4762 -2411 3580 -1576 -1919 3543 -1776 -1555 3539 -2172 -1130 3339 -2483 -641 3251 -2745 -286
4777 -286 3009 -2954 5 2823 -3081 413 2636 -3084 904 2200 -3335 1240 2153 -3389 1594
4792 1594 1697 -3347 1850 1430 -3349 2205 1039 -3134 2317 798 -3149 2612 347 -2980 2851
4807 2851 14 -2815 2936 -307 -2590 3021 -655 -2377 3057 -1096 -2157 3302 -1384 -1801 3287
4822 3287 -1675 -1493 3256 -1855 -1159 3199 -2251 -743 3099 -2406 -439 3018 -2673 -140 2816
4837 2816 -2858 289 2656 -3088 568 2499 -3279 913 2257 -3395 1326 1922 -3408 1632 1704 -3578
4853 -3578 2058 1246 -3422 2357 811 -3392 2643 464 -3258 2872 71 -3056 3145 -358 -2829
4868 -2829 3373 -697 -2498 3422 -1170 -2303 3461 -1511 -1807 3590 -1830 -1479 3521 -2203 -1075
4883 -1075 3353 -2516 -768 3325 -2761 -275 3100 -3139 109 2959 -3249 693 2707 -3437 915
4898 915 2262 -3463 1352 2081 -3564 1792 1706 -3479 2021 1325 -3400 2263 982 -3314 2696 579
4914 579 -3144 2882 163 -2960 3036 -324 -2748 3007 -598 -2434 3178 -964 -2116 3217 -1329
4929 -1329 -1805 3291 -1590 -1561 3141 -1921 -1146 3162 -2131 -801 3036 -2397 -447 3048 -2536 -171
4945 -171 2764 -2779 238 2565 -2979 463 2323 -3048 842 2166 -3173 1165 1913 -3256 1492
4960 1492 1625 -3193 1840 1383 -3181 2159 1139 -3223 2261 749 -3096 2606 410 -2969 2742
4975 2742 -60 -2791 3051 -413 -2647 3146 -706 -2429 3257 -1182 -2076 3258 -1537 -1771 3376
4990 3376 -1906 -1417 3410 -2127 -1108 3299 -2420 -675 3192 -2745 -292 2996 -2941 119 2863
5005 2863 -3181 504 2531 -3402 925 2325 -3427 1366 1984 -3330 1766 1752 -3482 2095 1237 -3498
5021 -3498 2396 859 -3338 2687 481 -3255 2859 97 -3028 3081 -335 -2641 3214 -710 -2473
5036 -2473 3346 -1189 -2022 3370 -1441 -1777 3384 -1753 -1383 3261 -2133 -987 3107 -2395 -679 3017
5052 3017 -2535 -254 2874 -2913 147 2733 -2938 419 2528 -3069 761 2199 -3130 1131 1988
5067 1988 -3250 1493 1707 -3131 1735 1303 -3050 2073 1043 -3103 2184 668 -3080 2327 384
5082 384 -2916 2583 100 -2758 2875 -301 -2402 2936 -627 -2299 3004 -859 -2069 3062 -1222
5097 -1222 -1746 3102 -1536 -1541 3128 -1907 -1184 3091 -2018 -825 3045 -2438 -612 3000 -2619 -151
5113 -151 2728 -2836 213 2605 -3022 512 2493 -3185 952 2208 -3321 1341 1927 -3432 1705
5128 1705 1598 -3414 2014 1166 -3305 2290 853 -3375 2586 481 -3128 2900 78 -2907 3112
5143 3112 -343 -2837 3241 -715 -2413 3250 -1163 -2171 3365 -1543 -1748 3309 -1861 -1328 3316
5158 3316 -2160 -1072 3183 -2310 -616 3072 -2703 -291 2897 -2983 145 2667 -2984 600 2444
5173 2444 -3126 841 2188 -3247 1251 1948 -3273 1562 1552 -3257 1988 1209 -3169 2151 969 -3105
5189 -3105 2442 518 -2879 2633 123 -2714 2715 -240 -2586 2956 -523 -2310 2909 -934 -2145
5204 -2145 3082 -1197 -1799 3066 -1365 -1529 2975 -1756 -1227 2927 -1997 -997 2935 -2130 -614 2802
5220 2802 -2382 -369 2683 -2515 -11 2574 -2725 419 2413 -2877 676 2255 -3034 995 1977
5235 1977 -3135 1322 1667 -3115 1693 1482 -3129 1917 1157 -3192 2226 822 -2956 2480 341 -2915
5251 -2915 2702 40 -2810 2969 -375 -2588 3192 -681 -2334 3167 -1073 -1998 3183 -1525 -1834
5266 -1834 3267 -1773 -1491 3156 -2021 -1090 3114 -2364 -723 3072 -2549 -360 3049 -2939 38
5281 38 2725 -2973 497 2485 -3082 902 2309 -3315 1362 2003 -3321 1639 1561 -3246 1859 1153
5297 1153 -3219 2257 850 -3172 2543 365 -3034 2848 120 -2797 2883 -393 -2513 3063 -718
5312 -718 -2310 3093 -975 -2029 3127 -1394 -1633 3146 -1564 -1272 2966 -1811 -1095 2991 -2089 -766
5328 -766 2931 -2334 -455 2680 -2493 -87 2467 -2674 388 2451 -2722 598 2233 -2846 914
5343 914 1901 -3009 1239 1654 -3038 1439 1475 -2971 1789 1172 -2988 2043 887 -2892 2295 610
5359 610 -2905 2507 275 -2586 2656 -130 -2547 2796 -349 -2316 2924 -809 -1971 2935 -1092
5374 -1092 -1768 3081 -1413 -1560 3125 -1702 -1246 2996 -2015 -874 2940 -2219 -662 2872 -2514 -244
5390 -244 2818 -2669 133 2537 -2962 456 2365 -3106 936 2155 -3210 1286 1913 -3326 1589
5405 1589 1612 -3285 2002 1230 -3307 2253 781 -3157 2502 479 -3024 2799 40 -2856 2915 -303
5421 -303 -2528 3147 -725 -2257 3141 -1077 -2025 3234 -1407 -1561 3216 -1737 -1344 3135 -2044 -930
5437 -930 3094 -2236 -611 2883 -2506 -244 2740 -2759 150 2535 -2866 499 2355 -2884 919
5452 919 2084 -3016 1117 1705 -3023 1454 1503 -3011 1853 1139 -2973 2063 817 -2839 2240 462
5468 462 -2779 2446 124 -2549 2599 -271 -2481 2605 -429 -2223 2729 -754 -1989 2910 -938
5483 -938 -1771 2892 -1333 -1417 2848 -1534 -1218 2885 -1818 -962 2699 -2031 -615 2760 -2296 -409
5499 -409 2711 -2398 36 2406 -2627 302 2313 -2687 671 2056 -2889 1055 1888 -3015 1348
5514 1348 1703 -3084 1569 1436 -3131 1916 1015 -2968 2236 653 -2866 2382 377 -2879 2667 22
5530 22 -2635 2855 -478 -2428 3019 -703 -2192 2996 -1194 -1938 3157 -1497 -1643 3044 -1785 -1199
5546 -1199 3075 -2065 -897 3010 -2232 -522 2838 -2538 -83 2764 -2839 216 2469 -2912 617
5561 617 2368 -2971 1016 2021 -3053 1326 1650 -3138 1669 1312 -3136 1987 993 -3012 2227 569
5577 569 -2864 2610 278 -2805 2639 -103 -2638 2789 -459 -2287 2894 -787 -2062 2906 -986
5592 -986 -1755 2814 -1335 -1483 2923 -1530 -1111 2679 -1824 -987 2731 -2024 -579 2718 -2151 -327
5608 -327 2621 -2291 -18 2403 -2570 310 2173 -2642 538 1970 -2709 864 1821 -2725 1165
5623 1165 1651 -2947 1391 1334 -2917 1869 1015 -2743 2005 672 -2749 2174 398 -2618 2394 -7
5639 -7 -2547 2629 -159 -2351 2667 -605 -2209 2745 -831 -2010 2887 -1142 -1681 2990 -1382 -1424
5655 -1424 2867 -1756 -1136 2928 -2040 -770 2778 -2378 -450 2759 -2431 -16 2541 -2757 301
5670 301 2360 -2785 590 2131 -2983 999 1878 -3056 1349 1600 -3031 1698 1325 -3117 1990 997
5686 997 -3005 2273 669 -2922 2507 273 -2731 2741 -275 -2512 2816 -516 -2109 2902 -857
5701 -857 -1939 3003 -1242 -1609 2966 -1453 -1281 2892 -1748 -1023 2868 -1987 -804 2834 -2218 -362
5717 -362 2578 -2397 -47 2320 -2564 175 2293 -2592 650 2033 -2652 809 1765 -2739 1153
5732 1153 1525 -2737 1434 1204 -2683 1662 837 -2589 1951 679 -2542 2197 312 -2363 2197 99
5748 99 -2400 2457 -192 -2171 2447 -568 -2018 2503 -803 -1745 2698 -1052 -1511 2684 -1206 -1222
5764 -1222 2586 -1513 -1049 2507 -1699 -742 2625 -1877 -469 2527 -2122 -198 2385 -2303 60
5779 60 2266 -2478 435 2081 -2552 741 1910 -2765 953 1670 -2795 1419 1303 -2913 1738 1129
5795 1129 -2719 1992 822 -2773 2119 372 -2661 2381 91 -2563 2521 -315 -2345 2801 -570
5810 -570 -2065 2890 -904 -1890 2851 -1247 -1598 2931 -1548 -1197 2789 -1794 -894 2695 -2031 -662
5826 -662 2629 -2221 -344 2603 -2493 54 2415 -2587 389 2093 -2650 791 1864 -2707 1022
5841 1022 1593 -2806 1342 1374 -2824 1712 1021 -2764 1998 802 -2608 2069 423 -2576 2297 141
5857 141 -2324 2421 -158 -2170 2433 -499 -1845 2597 -799 -1694 2492 -1090 -1527 2563 -1257 -1177
5873 -1177 2628 -1456 -1004 2479 -1756 -696 2452 -1762 -389 2366 -2065 -210 2219 -2069 80
5888 80 2066 -2263 466 1890 -2438 670 1766 -2596 803 1618 -2549 1183 1279 -2590 1415 1056
5904 1056 -2506 1657 891 -2573 1850 570 -2459 2091 340 -2333 2245 19 -2217 2424 -439
5919 -439 -2098 2531 -626 -1863 2660 -943 -1692 2685 -1132 -1442 2639 -1454 -1105 2714 -1736 -847
5935 -847 2660 -1884 -591 2574 -2149 -215 2402 -2411 143 2129 -2490 414 2037 -2646 802
5950 802 1846 -2730 1233 1508 -2787 1370 1120 -2586 1665 986 -2637 1976 669 -2669 2101 355
5966 355 -2416 2300 42 -2277 2459 -352 -2065 2547 -527 -1847 2574 -943 -1566 2684 -1177
5981 -1177 -1403 2613 -1437 -1018 2528 -1615 -797 2428 -1872 -452 2324 -2032 -257 2250 -2219 64
5997 64 2061 -2274 354 1963 -2433 629 1764 -2341 864 1549 -2452 1126 1228 -2435 1332 1045
6013 1045 -2372 1520 693 -2396 1789 535 -2260 1984 237 -2177 2087 1 -1940 2177 -266
6028 -266 -1955 2334 -461 -1764 2474 -843 -1609 2425 -985 -1333 2373 -1228 -1146 2418 -1451 -933
6044 -933 2491 -1686 -704 2284 -1876 -376 2304 -2098 -42 2265 -2313 199 2070 -2322 567
6059 567 1825 -2448 755 1651 -2522 1167 1381 -2587 1288 1131 -2625 1685 878 -2472 1927 597
6075 597 -2499 2109 190 -2364 2199 10 -2115 2438 -441 -2012 2522 -728 -1751 2657 -923
6090 -923 -1567 2670 -1247 -1164 2637 -1494 -969 2562 -1704 -653 2337 -1937 -379 2355 -2105 -39
6106 -39 2176 -2234 164 1978 -2390 450 1794 -2405 780 1634 -2377 1121 1274 -2393 1309 1057
6122 1057 -2456 1547 772 -2338 1764 567 -2289 1789 254 -2019 2023 -82 -2080 2121 -325
6137 -325 -1793 2290 -562 -1670 2294 -728 -1470 2288 -874 -1343 2273 -1132 -1096 2290 -1408 -819
6153 -819 2286 -1483 -572 2210 -1701 -386 2038 -1844 -135 1983 -2022 43 1910 -2079 459
6168 459 1754 -2189 597 1594 -2337 789 1503 -2362 1195 1187 -2373 1364 980 -2418 1608 683 -2430
6185 -2430 1751 450 -2260 1973 136 -2113 2032 -134 -2009 2427 -451 -1930 2384 -717 -1626
6200 -1626 2552 -959 -1392 2428 -1217 -1111 2466 -1490 -951 2487 -1681 -573 2355 -1838 -292 2256
6216 2256 -2113 -45 2076 -2082 244 1989 -2264 561 1727 -2375 892 1476 -2344 1153 1253
6231 1253 -2491 1355 927 -2462 1695 700 -2410 1757 423 -2235 1970 193 -2067 2048 -137
6246 -137 -1981 2256 -440 -1739 2311 -657 -1574 2278 -865 -1333 2345 -1165 -1054 2323 -1248 -911
6262 -911 2281 -1502 -554 2246 -1717 -385 2110 -1709 -194 1971 -1986 108 1917 -2055 419
6277 419 1631 -2107 572 1465 -2276 813 1301 -2181 1091 1087 -2190 1127 848 -2168 1442 696 -2164
6294 -2164 1568 425 -2011 1797 144 -1966 1985 46 -1848 2058 -316 -1741 2095 -489 -1566
6309 -1566 2209 -791 -1324 2226 -926 -1207 2308 -1220 -1016 2388 -1375 -752 2224 -1509 -524 2174
6325 2174 -1824 -226 2064 -1997 24 1883 -2031 247 1855 -2273 582 1661 -2293 927 1344
6340 1344 -2290 1080 1120 -2365 1422 942 -2352 1623 587 -2250 1839 363 -2139 1984 92 -2012
6356 -2012 2160 -270 -1855 2300 -464 -1556 2247 -627 -1583 2382 -943 -1217 2413 -1283 -972 2302
6372 2302 -1409 -711 2213 -1485 -530 2090 -1799 -279 1986 -1985 91 1772 -2151 355 1610
6387 1610 -2074 521 1464 -2134 752 1278 -2158 1064 1155 -2170 1266 862 -2196 1389 574 -2130
6403 -2130 1567 431 -1999 1629 136 -1857 1820 45 -1741 1878 -383 -1561 1858 -466 -1408
6418 -1408 2053 -650 -1220 2012 -856 -1068 2004 -983 -895 2061 -1216 -698 2075 -1398 -605 2055
6434 2055 -1612 -220 1878 -1672 -87 1786 -1877 147 1805 -1995 535 1614 -2071 702 1379
6449 1379 -2053 867 1281 -2135 1191 1056 -2182 1341 722 -2136 1494 531 -1921 1775 271 -2054
6465 -2054 1860 70 -1877 2054 -282 -1778 2174 -583 -1456 2210 -762 -1411 2169 -1047 -1097 2310
6481 2310 -1318 -859 2194 -1406 -655 2154 -1679 -310 2100 -1722 -167 1928 -1864 245 1809
6496 1809 -2011 337 1597 -2104 607 1352 -2214 983 1156 -2202 1025 888 -2144 1314 658 -2156
6512 -2156 1516 442 -2018 1734 268 -1857 1858 -36 -1712 1922 -322 -1610 1987 -547 -1442
6527 -1442 1929 -790 -1252 2086 -928 -1057 1985 -1166 -811 1974 -1277 -678 1956 -1326 -463 1924
6543 1924 -1510 -248 1820 -1660 -97 1643 -1715 193 1548 -1770 409 1425 -1972 563 1153
6558 1153 -1887 782 1047 -1920 918 958 -1969 1130 692 -1981 1384 539 -1804 1501 323 -1859
6574 -1859 1706 74 -1685 1754 -239 -1595 1855 -313 -1493 1904 -596 -1342 1931 -661 -1138
6589 -1138 1987 -960 -901 1950 -1148 -737 2049 -1396 -536 1979 -1466 -296 1893 -1793 35 1729
6605 1729 -1762 144 1591 -1913 386 1465 -2043 649 1323 -2069 939 1073 -2134 1137 817 -2114
6621 -2114 1322 713 -2044 1477 304 -1929 1782 89 -1782 1833 -163 -1707 1914 -407 -1485
6636 -1485 1979 -616 -1231 2095 -851 -1047 2033 -1057 -880 1980 -1174 -681 1932 -1361 -481 1664
6652 1664 -1544 -154 1778 -1643 -174 1616 -1693 153 1538 -1820 473 1267 -1829 588 1241
6667 1241 -1963 774 909 -1815 1086 916 -1917 1158 548 -1806 1264 495 -1775 1411 285 -1603
6683 -1603 1543 86 -1452 1653 -158 -1497 1645 -413 -1233 1726 -414 -1147 1807 -690 -1031 1850
6699 1850 -866 -725 1796 -1014 -667 1822 -1098 -518 1762 -1394 -398 1676 -1449 -52 1642 -1553
6715 -1553 71 1534 -1697 423 1488 -1851 502 1250 -1901 726 1215 -1847 928 957 -1941 1179
6731 1179 698 -2034 1433 409 -1834 1530 292 -1809 1671 6 -1610 1733 -263 -1581 1851
6746 1851 -527 -1430 1891 -632 -1211 1930 -894 -1032 1946 -1065 -931 1948 -1307 -683 1895 -1414
6762 -1414 -241 1836 -1524 -150 1752 -1632 152 1524 -1645 300 1395 -1882 609 1184 -1822
6777 -1822 713 1061 -1934 1012 847 -1827 1102 583 -1777 1297 304 -1708 1509 254 -1542 1499
6793 1499 -20 -1512 1620 -295 -1369 1742 -490 -1231 1777 -508 -1081 1673 -764 -907 1843 -933
6809 -933 -796 1688 -1090 -585 1666 -1141 -254 1620 -1218 -205 1549 -1410 -70 1360 -1476 103
6825 103 1345 -1486 309 1258 -1636 477 1063 -1574 627 955 -1676 910 856 -1769 983 666 -1626
6842 -1626 1213 374 -1633 1257 232 -1571 1453 46 -1653 1560 -125 -1360 1726 -269 -1256
6857 -1256 1719 -594 -1172 1723 -713 -1006 1768 -914 -877 1820 -1128 -741 1783 -1199 -507 1703
6873 1703 -1397 -178 1622 -1625 42 1591 -1627 350 1431 -1732 445 1274 -1713 574 1074
6888 1074 -1837 830 975 -1796 1065 720 -1872 1220 455 -1707 1383 273 -1676 1571 87 -1562
6904 -1562 1533 -47 -1495 1706 -376 -1219 1727 -599 -1087 1694 -718 -944 1698 -934 -801 1666
6920 1666 -1026 -572 1583 -1260 -398 1548 -1321 -219 1546 -1477 16 1419 -1522 167 1247
6935 1247 -1530 335 1228 -1535 635 1024 -1589 630 865 -1606 878 745 -1567 1023 580 -1614
6951 -1614 1154 361 -1447 1265 221 -1445 1357 41 -1334 1433 -194 -1264 1468 -399 -1129
6966 -1129 1522 -518 -934 1610 -666 -854 1709 -733 -789 1578 -904 -625 1607 -1176 -442 1613
6982 1613 -1234 -238 1461 -1288 -83 1514 -1395 58 1321 -1536 323 1223 -1576 476 1134 -1784
6998 -1784 727 1004 -1658 735 801 -1747 1102 591 -1670 1252 447 -1702 1348 177 -1476 1505
7014 1505 -87 -1524 1589 -272 -1297 1705 -476 -1199 1730 -650 -1001 1722 -759 -827 1676 -970
7030 -970 -720 1686 -1107 -428 1566 -1281 -368 1473 -1358 -195 1463 -1473 97 1273 -1518 400
7046 400 1280 -1616 490 1011 -1572 745 809 -1641 752 754 -1616 1003 500 -1497 1159 350 -1544
7063 -1544 1362 228 -1437 1425 -66 -1291 1480 -129 -1102 1546 -371 -1082 1588 -497 -959 1505
7079 1505 -653 -850 1523 -633 -754 1532 -834 -563 1559 -978 -459 1328 -1284 -198 1467 -1246
7095 -1246 -10 1435 -1355 60 1173 -1424 290 1130 -1418 441 1076 -1435 602 867 -1478 674
7111 674 727 -1523 931 555 -1569 1003 485 -1565 1167 261 -1419 1353 78 -1332 1480 -100
7127 -100 -1306 1323 -348 -1127 1562 -438 -967 1573 -576 -904 1598 -859 -647 1654 -1011 -631
7143 -631 1582 -1033 -425 1484 -1264 -206 1433 -1253 9 1412 -1501 194 1316 -1600 429
7158 429 1085 -1581 740 991 -1563 846 868 -1604 872 658 -1616 1070 492 -1536 1275 256 -1456
7175 -1456 1430 44 -1373 1384 -164 -1288 1538 -323 -1128 1592 -544 -883 1508 -648 -794 1606
7191 1606 -726 -614 1445 -902 -517 1518 -1068 -327 1444 -1178 -258 1307 -1325 0 1203 -1254
7207 -1254 233 1054 -1307 202 923 -1468 454 908 -1330 512 702 -1427 800 711 -1415 946
7223 946 482 -1524 1001 341 -1425 1103 232 -1295 1301 -17 -1138 1268 -58 -1084 1347 -236
7239 -236 -1071 1323 -400 -935 1393 -543 -843 1445 -701 -597 1528 -931 -595 1488 -979 -367 1353
7256 1353 -1048 -352 1418 -1182 -63 1267 -1303 67 1292 -1443 290 1122 -1381 429 1078 -1455
7272 -1455 559 879 -1562 797 684 -1501 957 466 -1478 1084 349 -1424 1148 166 -1308 1314
7288 1314 -70 -1270 1403 -290 -1210 1525 -340 -989 1471 -654 -827 1630 -614 -795 1522 -916
7304 -916 -612 1421 -1030 -341 1480 -1222 -218 1359 -1303 -130 1291 -1389 91 1227 -1441 285
7320 285 1104 -1401 429 897 -1361 503 781 -1495 818 656 -1412 923 475 -1307 964 336 -1434
7337 -1434 1210 104 -1201 1076 52 -1186 1243 -202 -1105 1225 -256 -983 1366 -430 -905 1330
7353 1330 -550 -815 1416 -612 -588 1419 -815 -509 1422 -925 -387 1276 -1069 -304 1273 -1056
7369 -1056 -102 1237 -1154 129 1149 -1320 154 1134 -1250 350 927 -1325 479 844 -1407 570
7385 570 775 -1392 790 540 -1331 955 480 -1319 1023 195 -1311 1247 20 -1221 1354 -133
7401 -133 -1165 1489 -330 -1074 1382 -531 -921 1473 -618 -763 1443 -758 -649 1440 -875 -512
7417 -512 1589 -1179 -302 1422 -1076 -193 1400 -1342 -49 1233 -1287 213 1117 -1396 413 997
7433 997 -1475 572 881 -1459 642 669 -1264 769 562 -1402 979 364 -1379 1073 288 -1367 1261
7450 1261 -10 -1098 1318 -123 -1102 1397 -279 -974 1356 -524 -884 1300 -598 -587 1454 -690
7466 -690 -643 1297 -961 -508 1342 -942 -264 1179 -1051 -202 1186 -1052 6 1159 -1074 103
7482 103 1039 -1275 255 1001 -1187 363 920 -1252 462 767 -1186 667 555 -1317 708 481 -1233
7499 -1233 857 314 -1188 1023 159 -1165 1041 32 -1094 1167 -11 -1174 1207 -164 -940 1287
7515 1287 -348 -936 1374 -450 -773 1297 -707 -681 1340 -691 -514 1262 -907 -284 1330 -1054
7531 -1054 -147 1205 -1116 -23 1267 -1202 138 1079 -1194 338 963 -1307 491 908 -1267 660
7547 660 848 -1358 734 626 -1329 875 527 -1355 941 353 -1198 1124 70 -1218 1202 -21
7563 -21 -1143 1249 -279 -1098 1320 -357 -845 1391 -539 -736 1360 -674 -666 1320 -740 -572 1276
7580 1276 -888 -359 1288 -945 -221 1243 -1062 -46 1130 -1216 185 988 -1220 281 975 -1266
7596 -1266 319 797 -1268 406 852 -1288 613 556 -1177 786 384 -1086 837 325 -1173 901
7612 901 172 -1167 1081 97 -994 1061 -171 -972 1145 -272 -871 1100 -373 -685 1197 -382
7628 -382 -704 1317 -614 -589 1245 -750 -490 1275 -795 -276 1200 -920 -131 1163 -1002 -35 1158
7645 1158 -1084 76 1006 -1089 131 932 -1178 364 834 -1197 445 772 -1190 637 757 -1243
7661 -1243 912 558 -1182 857 336 -1217 811 145 -1210 1089 110 -1031 1242 -162 -1067 1159
7677 1159 -291 -932 1199 -318 -780 1261 -600 -678 1314 -705 -618 1287 -717 -404 1329 -874 -331
7694 -331 1266 -1022 -79 1163 -1115 26 1141 -1124 222 971 -1189 360 915 -1178 474 679
7710 679 -1281 628 641 -1309 743 451 -1177 909 214 -1131 976 182 -1190 1057 1 -959 1190
7727 1190 -88 -850 1168 -264 -814 1161 -416 -731 1211 -564 -683 1240 -601 -537 1125 -683
7743 -683 -463 966 -763 -228 1101 -843 -77 980 -993 31 954 -934 119 956 -982 152
7759 152 907 -1056 305 854 -1044 425 672 -1140 507 637 -1066 667 537 -1174 803 396 -1151
7776 -1151 905 251 -1015 850 63 -1024 1013 -76 -862 1127 -156 -905 1025 -302 -786 1148
7792 1148 -411 -623 1161 -534 -512 1161 -706 -379 1244 -797 -202 1236 -900 -200 1075 -969
7808 -969 -93 1050 -1068 134 1002 -1151 214 896 -1172 490 788 -1167 472 551 -1172 714 510
7825 510 -1189 734 381 -1256 930 228 -1087 909 69 -1049 930 -63 -1077 1180 -221 -951
7841 -951 1221 -302 -814 1120 -435 -739 1119 -559 -559 1163 -651 -414 1045 -769 -333 1203 -875
7858 -875 -111 1086 -846 3 918 -993 155 969 -1017 323 702 -1035 273 745 -1082 427 622
7875 622 -1070 591 515 -1063 595 418 -1134 665 188 -962 797 106 -922 845 41 -900 1008
7892 1008 -79 -813 999 -173 -825 1066 -342 -500 1068 -393 -539 1049 -444 -465 1053 -572
7908 -572 -506 1088 -711 -183 892 -838 -162 1056 -847 -80 976 -1113 81 832 -949 187 826
7925 826 -1014 256 682 -1067 514 700 -1146 525 561 -1080 667 450 -1201 713 284 -1192 900
7942 900 211 -986 983 -7 -1001 941 -90 -891 1002 -152 -670 1056 -369 -729 1131 -468 -566
7959 -566 1052 -591 -388 1045 -712 -295 1098 -768 -194 1152 -921 -96 1004 -951 128 883
7975 883 -1013 155 768 -1041 290 794 -942 418 587 -1127 528 582 -1034 677 360 -978 715
7992 715 284 -1066 794 131 -929 908 73 -847 992 -40 -923 901 -194 -611 1011 -309 -593
8009 -593 995 -462 -542 953 -500 -396 937 -574 -283 1152 -610 -209 1036 -657 -98 924 -743
8026 -743 -97 801 -837 89 734 -889 145 727 -859 134 745 -1002 373 597 -1001 439 509 -1028
8044 -1028 578 392 -915 691 316 -974 723 292 -930 828 49 -813 904 37 -776 1014 -130
8061 -130 -743 959 -343 -636 984 -385 -575 1024 -522 -388 957 -655 -340 1073 -700 -247 1068
8078 1068 -753 -76 1128 -830 -37 932 -982 99 823 -1045 234 753 -962 362 718 -1125
8094 -1125 396 631 -1087 594 364 -1005 664 373 -1006 770 168 -976 850 35 -925 932
8110 932 -13 -861 1050 -154 -764 1038 -251 -708 981 -436 -513 984 -501 -419 993 -663 -340
8127 -340 977 -576 -158 840 -772 -179 891 -702 -17 823 -853 133 823 -898 200 576 -842
8144 -842 215 581 -886 296 518 -1060 426 440 -878 652 406 -884 579 227 -797 667 90
8161 90 -842 771 31 -739 841 -84 -707 921 -175 -615 754 -216 -568 897 -333 -466 830 -480
8179 -480 -379 856 -422 -351 951 -637 -258 870 -658 -160 914 -755
8191g55
$$ Imaginary data points
##PAGE= N=2
##DATA TABLE= (X++(I..I)), XYDATA
0 0 0 0 0 0 0 0 0 8 -8 8 -8 9 -16 24 -32 40 -48 56 -65 81 -102 121 -139 163 -193 227 -266 307 -352 403
30 403 -461 527 -601 679 -766 862 -966 1085 -1213 1354 -1505 1672 -1852 2053 -2273 2511
46 2511 -2769 3052 -3363 3705 -4082 4496 -4955 5466 -6038 6681 -7416 8258 -9234 10380
60 10380 -11755 13435 -15541 18269 -21950 27210 -35366 49752 -82337 298136 -183182 -386174
72 -386174 643150 -353213 -251556 596818 -352441 -216637 596008 -438655 -129252 552935
82 552935 -443980 -70306 529496 -498125 -638 475981 -500957 64438 439079 -524871
92 -524871 119878 379283 -524245 180237 335013 -525512 227128 271396 -517377 274360
102 274360 225273 -503684 315775 160916 -486424 348565 113137 -460877 381453 54014
112 54014 -436511 402657 3250 -400046 422944 -46709 -369362 433572 -96561 -327360
122 -327360 442543 -139370 -288746 441238 -182614 -246320 440709 -219583 -200918 428588
132 428588 -254058 -158946 417963 -282885 -112478 399817 -310557 -69506 378382 -330229
142 -330229 -25717 356496 -350968 17169 327700 -363923 59549 299879 -375299 98965
152 98965 267613 -383697 140237 233066 -385142 176389 197159 -386679 213350 158909 -381079
163 -381079 247440 117379 -372125 277169 76853 -359091 306862 32148 -339975 329187
173 329187 -11303 -316782 348925 -54965 -289570 363376 -99520 -256058 371154 -139404
183 -139404 -221288 374798 -179598 -181690 371795 -215094 -139693 362190 -246399 -98131 349261
194 349261 -274880 -53267 329097 -297044 -10710 305750 -315055 31865 279070 -329026
204 -329026 73819 247231 -336108 111904 215042 -340179 149350 178713 -338813 183173
214 183173 141092 -331895 212908 103522 -322461 240702 63508 -306373 262634 25014
224 25014 -287527 280892 -13090 -265253 295432 -51094 -238274 302955 -85136 -210543
234 -210543 307945 -118239 -179543 307130 -147949 -146959 301436 -173417 -115095 293753 -197341
245 -197341 -81170 280538 -215945 -49098 265299 -231764 -17630 248155 -244936 13879
255 13879 227277 -253390 42068 206812 -260790 70658 183906 -264556 97415 159761
265 159761 -265555 121797 135780 -265418 146372 109224 -261274 167796 83015 -255515
275 -255515 188055 55967 -247534 207100 27180 -235402 222395 -115 -222535 236723
285 236723 -29047 -205791 247681 -57533 -186209 254967 -84318 -165492 260744 -111879
295 -111879 -140860 261177 -136506 -115676 259179 -159990 -88996 254263 -182103 -59714
305 -59714 244616 -200232 -31271 233346 -217317 -1302 218205 -230995 28568 199814
315 199814 -241160 57255 180237 -249734 86877 156370 -253547 114144 131544 -254421
325 -254421 140326 104680 -252275 165474 75063 -245077 186575 45966 -235746 206352
335 206352 14995 -222023 222275 -16054 -204268 233857 -45568 -184827 242853 -75438
345 -75438 -160840 246244 -102245 -135784 246224 -127102 -109433 242543 -149923 -80822 233981
356 233981 -168154 -53469 223616 -184547 -25350 209582 -197341 2110 192882 -206274
366 -206274 27430 175586 -213517 52997 155232 -216681 75816 134537 -217746 97276
376 97276 113342 -216932 117803 90262 -212392 135104 68349 -206973 151865 45033 -198785
387 -198785 166137 21770 -188210 177642 -283 -176935 188251 -23577 -162360 195352
397 195352 -44991 -147042 200533 -65628 -130405 203815 -86230 -111502 203588 -104184
407 -104184 -92789 202261 -121724 -72557 198056 -137459 -51668 191584 -151051 -31357
417 -31357 184096 -164261 -9266 173656 -174577 11853 161890 -183734 33122 148657
427 148657 -191537 55157 132616 -196066 75627 116298 -199802 96630 97281 -200847 116673
438 116673 76730 -198935 134999 55685 -195527 153192 32256 -187996 168326 8875
448 8875 -178285 181630 -15107 -165965 192768 -39977 -150036 199733 -63024 -132760
458 -132760 204728 -85987 -112582 206001 -107393 -90588 203329 -126189 -68494 198750
468 198750 -143941 -44305 190069 -158130 -20772 179149 -170069 2750 166221 -179890
478 -179890 26541 150048 -185721 48281 133565 -190155 69797 114782 -191739 89889
488 89889 94585 -189874 107594 74601 -186880 124764 52806 -180221 139026 31442 -171872
499 -171872 151267 10269 -161727 161783 -11554 -148424 168686 -31276 -134694 174170
509 174170 -50939 -118951 176514 -69094 -101766 176123 -85196 -85080 174634 -100480 -66586
520 -66586 169925 -113263 -48766 163737 -124532 -31103 156463 -134672 -12750 146791
530 146791 -141995 4088 137115 -148906 21085 125843 -154251 37874 113385 -157439
540 -157439 53434 100831 -160640 69524 86192 -161072 84514 71604 -160520 98778
550 98778 56126 -158753 112929 38982 -154434 124931 22118 -149113 136621 4113
560 4113 -141440 146621 -14391 -131582 154282 -32166 -120649 160974 -50669 -107004 164529
571 164529 -67974 -92255 166174 -84589 -76241 166048 -100750 -58377 162485 -114382 -40613
582 -40613 157619 -127427 -21583 150163 -138619 -2116 140259 -147187 16572 129511
592 129511 -154897 36201 115853 -159474 54588 101205 -162402 72212 85279 -163376
602 -163376 89576 67223 -161130 104628 49219 -157371 118933 30127 -150850 131044
612 131044 10431 -141665 140589 -8425 -131491 148682 -27773 -118256 153376 -45739
622 -45739 -103998 155757 -62219 -88596 156171 -78174 -71693 153282 -91312 -55174 149074
633 149074 -103337 -38192 142573 -113467 -20976 134170 -121056 -5120 125274 -127795
643 -127795 11234 114426 -132218 26381 102955 -135021 40600 91162 -137176 54731
653 54731 78028 -136765 67144 65117 -135839 79324 51390 -133453 90431 37106 -129275
664 -129275 99881 23299 -124668 109122 8529 -117900 116521 -5658 -110140 122499
674 122499 -19689 -101675 127626 -33905 -91104 130347 -46927 -80677 132476 -59798
684 -59798 -68697 132728 -72079 -55928 131073 -82958 -43097 128726 -93773 -28958 124240
695 124240 -102867 -14889 118529 -111071 -564 111872 -118591 14587 102965 -123966
705 -123966 28962 93473 -128841 43781 82358 -131874 58509 69605 -132750 71845
715 71845 56550 -132778 85532 41391 -130214 97599 25976 -125526 108262 10170 -119479
726 -119479 117860 -6686 -110571 124815 -22608 -100738 130308 -38676 -88820 133519
736 133519 -53800 -75284 133702 -67390 -61449 132855 -80506 -46051 129054 -91381 -30784
747 -30784 123526 -100629 -15664 116674 -108788 1 107752 -114336 14511 98106
757 98106 -118741 28977 87221 -121244 42614 75048 -121911 54948 62874 -121671 67063
768 67063 49583 -119244 77437 36233 -115526 86668 23096 -110844 95101 9158 -104029
779 -104029 101179 -3888 -96621 106543 -16797 -88218 110193 -29286 -78408 111958
789 111958 -40336 -68731 113048 -51369 -57821 112162 -60959 -46969 110128 -69386 -36140
800 -36140 107357 -77593 -24520 102828 -84054 -13660 98202 -90223 -2361 92343 -95445
811 -95445 9054 85440 -99424 19698 78664 -103311 31284 69951 -105742 42020 60965
822 60965 -107123 52620 51434 -107782 63436 40317 -106598 73038 29318 -104585 82385
833 82385 17158 -101034 90828 4517 -95747 97434 -7821 -89668 103961 -21127 -81413
844 -81413 108089 -33663 -72236 110588 -45640 -62063 112089 -57549 -50488 111073 -67810
855 -67810 -38646 109106 -77649 -26131 105280 -86304 -12943 99561 -93028 -269 93115
866 93115 -99120 12991 84743 -103413 25733 75632 -106094 37667 65608 -107841 49991
877 49991 54154 -107358 60495 42643 -105893 70513 30231 -102521 79470 17342 -97568
888 -97568 86694 4957 -91731 93011 -7943 -84101 97190 -20009 -75336 100036 -31286
899 -31286 -66168 101478 -42187 -55721 100705 -51489 -45393 99147 -60173 -34627 96267
910 96267 -67438 -23624 91621 -73311 -13387 87023 -78732 -2889 80940 -82547 7137
921 7137 74336 -85551 16466 67752 -88002 26086 59782 -89031 34668 52037 -89696
932 -89696 43159 43749 -89551 51336 34698 -88044 58590 25950 -86362 65861 16408
943 16408 -83222 71999 6916 -79249 77284 -2540 -74853 82181 -12607 -68779 85448
954 85448 -21809 -62582 88382 -31193 -55209 89982 -40440 -46883 90068 -48548 -38758
965 -38758 89810 -56662 -29425 87962 -63920 -19820 85039 -70479 -10246 81581 -76535
976 -76535 226 76317 -81299 10216 70468 -85488 20711 63552 -88654 31149 55239
987 55239 -90071 40713 46797 -90977 50650 36860 -90212 59472 26605 -87916 67511
998 67511 15921 -84748 74885 4487 -79553 80468 -6501 -73423 85065 -17574 -66142
1009 -66142 88210 -28279 -57382 89329 -37796 -48576 89564 -47061 -38611 87894 -55022
1020 -55022 -28746 85027 -61735 -18785 81333 -67764 -8422 75895 -72064 1052 70292
1031 70292 -75639 10531 63788 -78243 19811 56512 -79207 28007 49084 -79971 36210
1042 36210 40887 -79208 43413 32570 -77737 49983 24336 -75661 56275 15482 -72303
1053 -72303 61086 7250 -68469 65486 -1243 -63913 69015 -9560 -58410 71274 -17157
1064 -17157 -53030 73208 -24841 -46551 74012 -31821 -39912 73782 -38117 -33341 73298
1075 73298 -44417 -25905 71453 -49641 -18855 69426 -54581 -11580 66765 -59144 -3853
1086 -3853 63116 -62868 3493 59197 -66428 11540 54419 -69157 19205 48895 -71122
1097 -71122 26803 42842 -72877 34763 35909 -73160 41976 28668 -72750 48985 20462
1108 20462 -71474 55848 11847 -68672 61307 3353 -65392 66521 -5849 -60450 70507
1119 70507 -14642 -54778 73189 -23141 -48588 75114 -31829 -40934 75278 -39378 -33263
1130 -33263 74693 -46429 -25028 73040 -52836 -16288 69731 -57982 -7877 66268 -62714
1141 -62714 1000 61307 -66299 9674 55604 -68689 17821 49614 -70607 26059 42347
1152 42347 -70777 33331 35055 -70543 40320 27325 -69163 46752 18900 -66608 51904
1163 51904 10967 -63558 56896 2517 -59266 60510 -5402 -54181 62894 -12863 -48803
1174 -48803 64885 -20258 -42677 65120 -26769 -36357 65036 -32691 -29863 64099 -38113
1185 -38113 -22996 61918 -42559 -16658 59770 -46618 -9904 56675 -50023 -3625 53171
1196 53171 -52624 2439 49703 -55056 8878 45262 -56605 14790 40857 -58042 20628
1207 20628 36052 -58757 26701 30553 -58979 31846 25210 -58664 37330 19109 -57649 42216
1219 42216 12790 -55951 46612 6700 -53896 50858 -259 -50652 54126 -6702 -47105
1230 -47105 56914 -13280 -42899 59092 -20000 -37818 60203 -25875 -32697 60801 -32035 -26774
1242 -26774 60548 -37607 -20461 59280 -42643 -14069 57640 -47480 -6984 54733 -51145
1253 -51145 -173 51435 -54523 6908 47364 -57504 14146 42314 -59122 20826 36894
1264 36894 -60435 27882 30632 -60465 34098 23849 -59646 39944 17008 -58138 45377 9416
1276 9416 -55186 49728 2105 -51771 53382 -5319 -47492 56116 -12570 -42201 57513
1287 57513 -19188 -36848 58332 -25510 -30659 57930 -31037 -24357 56760 -35867 -18309 55054
1299 55054 -40305 -11575 52114 -43592 -5516 48989 -46377 535 45408 -48542 6658 40999
1311 40999 -49926 12074 36913 -50953 17469 32119 -51365 22552 27165 -51031 27010 22220
1323 22220 -50529 31509 16790 -49142 35320 11472 -47411 38777 6186 -45359 41932 713
1335 713 -42420 44189 -4485 -39517 46389 -9736 -36052 47677 -14713 -32152 48619 -19232
1347 -19232 -28178 49228 -23960 -23642 48916 -28024 -19169 48258 -31979 -14550 47463 -35717 -9414
1360 -9414 45570 -38992 -4450 43801 -42029 935 41046 -44557 6431 37866 -46648 11711
1372 11711 34244 -48566 17363 30013 -49479 22682 25423 -49890 27913 20217 -49766 33092
1384 33092 14381 -48574 37473 8759 -46918 41585 2441 -44280 45006 -3902 -40914 47501
1396 47501 -9780 -37034 49483 -15908 -32349 50330 -21427 -27257 50570 -26614 -22000 49907
1408 49907 -31457 -16211 48361 -35202 -10693 46432 -38740 -4835 43652 -41718 950 40394
1420 40394 -43677 6362 36669 -45384 11965 32357 -46157 16957 27736 -46484 21796 23040
1432 23040 -46229 26336 17797 -45017 30188 12764 -43501 33694 7460 -41418 36526 2289
1444 2289 -38562 38868 -2718 -35745 40771 -7730 -32201 41829 -12266 -28552 42327 -16400
1456 -16400 -24697 42346 -20332 -20444 41836 -23508 -16590 41137 -26856 -12458 39822 -29568 -8336
1469 -8336 38106 -31862 -4415 36457 -34142 -188 34148 -35862 3934 31755 -37449 7981
1481 7981 28941 -38823 12243 25874 -39550 16133 22582 -40248 20228 18815 -40287 24188
1493 24188 14530 -39875 27822 10530 -39196 31233 5812 -37576 34201 1229 -35615 36808
1505 36808 -3429 -33361 39027 -8332 -30220 40514 -12878 -26952 41703 -17423 -23139 42119
1517 42119 -21738 -18873 41719 -25550 -14584 41116 -29489 -9682 39684 -32407 -5048 37861
1529 37861 -35238 -186 35463 -37568 4871 32385 -39290 9510 29076 -40600 14372 25167
1541 25167 -41085 18805 20775 -40991 22960 16289 -40550 27091 11297 -39137 30373 6381
1553 6381 -37158 33307 1585 -34700 35722 -3495 -31712 37089 -7983 -28495 38227 -12327
1565 -12327 -24779 38589 -16499 -20828 38261 -19969 -16895 37793 -23214 -12598 36398 -25801
1577 -25801 -8660 34688 -28075 -4825 32915 -30060 -770 30537 -31375 2768 28221 -32586
1589 -32586 6436 25430 -33529 9925 22609 -33814 13165 19826 -34052 16575 16394 -33763
1601 -33763 19481 13033 -33396 22235 9612 -32616 25200 5918 -31259 27213 2542 -29888
1613 -29888 29251 -1141 -27998 30893 -4795 -25774 32202 -8195 -23412 33287 -11826 -20719
1625 -20719 33761 -14968 -17786 34075 -18150 -14942 33857 -21297 -11367 33319 -23948 -8103
1637 -8103 32428 -26585 -4394 31211 -28831 -444 29439 -30734 3380 27346 -32621 7460
1649 7460 24588 -33760 11278 21651 -34581 15311 18414 -35074 19151 14450 -34652 22565
1661 22565 10595 -34057 25860 6349 -32638 28675 1933 -30683 30816 -2275 -28453 32707
1673 32707 -6702 -25416 33791 -10503 -22290 34418 -14365 -18971 34527 -17926 -15261 33937
1685 33937 -20911 -11428 33086 -23652 -7553 31541 -25995 -3708 29695 -27864 -69 27597
1697 27597 -29265 3841 24982 -30414 7248 22333 -30990 10595 19398 -31227 13972 16165
1709 16165 -30977 16687 12923 -30433 19390 9510 -29428 21800 6055 -28110 23748 2764
1721 2764 -26559 25510 -597 -24822 26704 -3716 -22661 27547 -6619 -20441 28249 -9762
1733 -9762 -17855 28420 -12181 -15519 28631 -14732 -12912 28239 -17039 -10074 27574 -18955 -7619
1746 -7619 27018 -20937 -4746 25834 -22692 -1949 24715 -24175 868 23302 -25645 4066
1758 4066 21407 -26608 6862 19397 -27635 10089 17019 -28349 13056 14423 -28396 15977
1770 15977 11594 -28414 18749 8532 -27934 21327 5098 -26866 23631 1810 -25608 25677
1782 25677 -1700 -23792 27188 -5140 -21671 28301 -8586 -19215 29208 -11924 -16561 29398
1794 29398 -14713 -13676 29378 -17685 -10404 28745 -20270 -7053 27789 -22341 -3788 26305
1806 26305 -24353 -220 24503 -25887 3007 22575 -27054 6370 20029 -27895 9613 17242
1818 17242 -28017 12661 14463 -28100 15676 11133 -27456 18370 7921 -26465 20389 4535
1830 4535 -25250 22406 1215 -23471 23727 -1997 -21542 24840 -5044 -19374 25477 -7853
1842 -7853 -16943 25681 -10473 -14523 25632 -12882 -11819 25256 -14868 -9333 24572 -16651 -6761
1855 -6761 23691 -18272 -4154 22427 -19501 -1849 21283 -20743 705 19810 -21702 3196
1867 3196 18094 -22319 5451 16511 -23027 7925 14504 -23166 10095 12421 -23310 12243
1879 12243 10366 -23294 14433 7737 -22861 16377 5471 -22192 18219 2932 -21250 19758
1891 19758 369 -20127 21081 -2227 -18822 22266 -4941 -17176 23086 -7223 -15281 23606
1903 23606 -9704 -13368 23978 -12234 -11055 23982 -14371 -8700 23647 -16394 -6176 23104
1915 23104 -18466 -3516 21975 -20030 -901 20936 -21472 2074 19363 -22707 4839 17368
1927 17368 -23522 7706 15343 -24152 10475 12870 -24268 13074 10296 -24072 15508 7361 -23415
1940 -23415 17722 4397 -22311 19570 1542 -21131 21078 -1570 -19256 22121 -4419 -17225
1952 -17225 22712 -7027 -15071 23294 -9604 -12708 23094 -11697 -10350 22615 -13890 -7892 22040
1965 22040 -15496 -5424 20942 -16865 -2871 19876 -18203 -440 18409 -19007 1909 16945
1977 16945 -19666 4010 15173 -20303 6329 13292 -20403 8394 11375 -20366 10282 9382 -20191
1990 -20191 12121 7193 -19643 13664 5036 -19062 15127 2829 -17970 16275 664 -17061
2002 -17061 17242 -1360 -15834 18043 -3433 -14448 18521 -5323 -12961 18925 -7133 -11377
2014 -11377 19238 -8868 -9769 19181 -10535 -8004 19059 -12050 -6212 18730 -13535 -4329 18217
2027 18217 -14841 -2453 17576 -16198 -285 16686 -17231 1688 15449 -18247 3853 14098
2039 14098 -19001 6110 12447 -19478 8383 10737 -19719 10493 8673 -19726 12415 6472 -19286
2052 -19286 14226 4170 -18807 15907 1719 -17780 17124 -681 -16606 18387 -2968 -15116
2064 -15116 19182 -5421 -13388 19528 -7530 -11594 19897 -9607 -9425 19689 -11520 -7296 19191
2077 19191 -13117 -5286 18696 -14744 -2863 17659 -15885 -671 16502 -16919 1483 15194
2089 15194 -17666 3685 13493 -18186 5783 11879 -18374 7859 9819 -18307 9693 7773 -17944
2102 -17944 11315 5804 -17390 12773 3690 -16527 13986 1498 -15496 14848 -417 -14331
2114 -14331 15674 -2331 -12940 16013 -4106 -11561 16267 -5719 -10147 16315 -7219 -8574
2126 -8574 16069 -8497 -7086 16056 -9843 -5524 15543 -10765 -3993 15006 -11858 -2613 14480
2139 14480 -12677 -878 13582 -13447 532 12844 -14237 2295 11743 -14860 3788 10706
2151 10706 -15139 5314 9397 -15391 7037 7928 -15504 8424 6499 -15341 9935 4886 -15222
2164 -15222 11231 3208 -14705 12351 1436 -14016 13559 -319 -13181 14422 -1996 -12280
2176 -12280 15055 -3787 -11152 15668 -5593 -9717 16052 -7104 -8348 16119 -8798 -6691 15997
2189 15997 -10383 -5088 15619 -11601 -3198 15163 -12825 -1397 14297 -13811 608 13245
2201 13245 -14673 2368 12022 -15263 4464 10536 -15570 6143 9024 -15829 7905 7265 -15661
2214 -15661 9581 5396 -15128 10819 3608 -14710 12073 1662 -13789 13028 -227 -12672
2226 -12672 13652 -1988 -11509 14298 -3773 -10130 14441 -5187 -8819 14537 -6585 -7473 14419
2239 14419 -7886 -5786 13851 -8910 -4303 13476 -9968 -2973 12833 -10619 -1560 12118 -11250
2252 -11250 -245 11357 -11893 1267 10431 -12228 2564 9485 -12602 3877 8331 -12791
2264 -12791 5136 7106 -12751 6233 5954 -12649 7322 4699 -12452 8390 3419 -11847 9313
2277 9313 2142 -11577 10136 742 -10920 10737 -542 -10390 11383 -1793 -9506 11846 -3067
2290 -3067 -8538 12282 -4260 -7791 12486 -5564 -6627 12498 -6649 -5628 12363 -7649 -4462
2303 -4462 12395 -8761 -3117 12053 -9772 -1751 11654 -10676 -306 11074 -11377 1223
2315 1223 10197 -12122 2640 9253 -12584 4300 8090 -12818 5685 6706 -12977 7172 5371
2328 5371 -12893 8486 3764 -12480 9438 2252 -11904 10474 730 -11266 11265 -886 -10267
2341 -10267 11867 -2349 -9359 12233 -3723 -8134 12419 -5231 -6907 12428 -6327 -5619 12390
2354 12390 -7454 -4387 11898 -8335 -2959 11541 -9227 -1503 10867 -9908 -107 10064 -10492
2367 -10492 1104 9297 -10871 2411 8196 -11147 3716 7035 -11182 4685 5970 -11168 5982
2380 5982 4796 -10788 6958 3468 -10486 7616 2312 -10166 8313 1067 -9470 8876 58
2393 58 -8888 9277 -1083 -8176 9621 -2156 -7418 9796 -2961 -6701 9968 -3945 -5753
2406 -5753 10059 -4740 -5124 10061 -5493 -4126 9909 -6376 -3260 9736 -6971 -2290 9530
2419 9530 -7707 -1301 9097 -8390 -275 8565 -8917 872 8016 -9502 1982 7319 -9731
2432 -9731 3057 6654 -10032 4132 5627 -10233 5239 4662 -10175 6278 3426 -10072 7260
2445 7260 2324 -9749 8074 1262 -9275 8802 70 -8757 9351 -1239 -8079 9779 -2415
2458 -2415 -7325 10185 -3564 -6433 10342 -4677 -5412 10302 -5744 -4398 10302 -6641 -3136
2471 -3136 9986 -7479 -1906 9597 -8224 -798 9023 -8858 441 8256 -9351 1664 7367
2484 7367 -9670 2890 6600 -9774 4045 5441 -9775 5150 4292 -9735 5904 3146 -9354
2497 -9354 6723 2003 -8903 7354 902 -8271 7884 -67 -7633 8324 -1088 -7028 8456
2510 8456 -2088 -6181 8707 -2907 -5425 8585 -3653 -4616 8629 -4418 -3869 8424 -5089
2523 -5089 -3102 8079 -5742 -2207 7959 -6196 -1349 7642 -6665 -446 7083 -7057 218
2536 218 6715 -7396 1165 6113 -7619 1893 5517 -7959 2809 4871 -7814 3543 4114 -7908
2550 -7908 4304 3441 -7899 5021 2544 -7665 5680 1809 -7560 6226 959 -7252 6673
2563 6673 54 -6833 7160 -763 -6476 7548 -1651 -5860 7946 -2518 -5307 8086 -3311
2576 -3311 -4610 8331 -4149 -3895 8285 -4874 -3000 8252 -5571 -2210 7956 -6323 -1243
2589 -1243 7623 -6888 -169 7164 -7413 722 6582 -7774 1812 5881 -8055 2730 5051 -8251
2603 -8251 3775 4155 -8223 4505 3206 -8109 5255 2380 -7891 6043 1288 -7312 6601
2616 6601 364 -6968 6958 -661 -6318 7343 -1513 -5659 7521 -2311 -5059 7572 -3167 -4281
2630 -4281 7603 -3793 -3601 7485 -4360 -2713 7326 -5026 -1983 6886 -5391 -1151 6541
2643 6541 -5889 -449 6178 -6149 479 5626 -6379 1168 5173 -6555 1916 4506 -6613 2612
2657 2612 3884 -6561 3190 3295 -6554 3726 2502 -6396 4239 1899 -6176 4737 1234 -6004
2671 -6004 5023 550 -5620 5373 32 -5395 5748 -631 -4964 5992 -1301 -4597 6153 -1893
2685 -1893 -4262 6301 -2554 -3700 6282 -3144 -3182 6442 -3497 -2653 6428 -4163 -1994 6212 -4647
2700 -4647 -1355 6099 -5216 -547 5902 -5567 200 5429 -6029 936 4911 -6232 1657 4438
2714 4438 -6449 2408 3995 -6504 3226 3093 -6524 3785 2394 -6440 4499 1750 -6317 4959
2728 4959 935 -6028 5428 134 -5673 5920 -480 -5285 6198 -1433 -4643 6273 -2077 -4034
2742 -4034 6430 -2662 -3569 6518 -3359 -2765 6315 -3854 -2245 6212 -4537 -1478 5989 -4821
2756 -4821 -671 5611 -5303 103 5212 -5681 797 4571 -5710 1477 4085 -5886 2088 3493
2770 3493 -5859 2728 2927 -5806 3181 2232 -5600 3639 1659 -5394 4085 1081 -5026 4292 508
2785 508 -4846 4564 -128 -4414 4826 -617 -4129 4985 -1199 -3770 5034 -1502 -3328 5066 -1926
2800 -1926 -3002 5178 -2473 -2486 5014 -2818 -2054 5068 -3207 -1729 5083 -3585 -984 4717 -3912 -639
2816 -639 4558 -4234 -101 4392 -4506 450 4013 -4747 1041 3649 -4940 1548 3288 -4925 2036
2831 2036 2792 -5139 2588 2387 -5084 3050 1756 -4997 3540 1336 -4804 3856 850 -4727 4177
2846 4177 266 -4516 4569 -264 -4291 4812 -1031 -3862 5018 -1547 -3507 5240 -2143 -3048 5250
2861 5250 -2671 -2431 5182 -3165 -1883 5219 -3502 -1241 5072 -4082 -623 4796 -4373 -125 4415
2876 4415 -4714 572 3880 -4773 1374 3454 -4889 1835 3061 -5020 2387 2456 -5008 2729 1999 -4863
2892 -4863 3168 1394 -4734 3704 862 -4463 3851 273 -4183 4040 -293 -3832 4300 -661 -3557
2907 -3557 4363 -1092 -3186 4472 -1652 -2774 4379 -1994 -2404 4492 -2204 -1920 4444 -2633 -1455
2922 -1455 4258 -2979 -1134 4126 -3367 -544 3864 -3486 -244 3611 -3664 135 3386 -3728 679
2937 679 3121 -4001 964 2831 -3949 1423 2487 -4036 1871 2172 -4019 2256 1828 -4061 2559 1384
2953 1384 -4033 2906 1022 -3912 3105 679 -3992 3535 279 -3677 3765 -179 -3439 3958 -597
2968 -597 -3261 4154 -1168 -2953 4173 -1536 -2597 4375 -2058 -2331 4386 -2285 -1791 4285 -2796 -1383
2984 -1383 4258 -3247 -748 4171 -3529 -289 3840 -3883 275 3581 -4128 832 3194 -4179 1274
2999 1274 2907 -4341 1755 2406 -4429 2286 1993 -4390 2615 1548 -4281 3068 908 -4077 3335
3014 3335 564 -3892 3534 51 -3729 3854 -282 -3433 3956 -868 -2975 4012 -1364 -2711 4055
3029 4055 -1695 -2288 4098 -2144 -1843 4069 -2439 -1399 3891 -2744 -897 3689 -3051 -555 3575
3044 3575 -3257 -45 3282 -3535 343 3084 -3566 659 2782 -3583 1167 2320 -3558 1482 2144
3059 2144 -3649 1778 1774 -3617 2058 1530 -3533 2274 1189 -3544 2559 751 -3374 2786 531 -3293
3075 -3293 3127 127 -3093 3144 -259 -2963 3367 -559 -2656 3505 -975 -2557 3500 -1310 -2289
3090 -2289 3609 -1819 -1865 3766 -2033 -1427 3623 -2389 -1087 3550 -2656 -769 3455 -2960 -307 3305
3106 3305 -3294 -13 3217 -3486 541 2807 -3679 923 2636 -3720 1283 2375 -3829 1672 2069
3121 2069 -3862 2169 1544 -3817 2532 1256 -3725 2741 839 -3654 3056 178 -3492 3319 -118
3136 -118 -3185 3591 -601 -2986 3724 -1075 -2712 3773 -1428 -2235 3788 -1776 -1786 3825 -2211 -1374
3152 -1374 3714 -2510 -928 3514 -2755 -602 3390 -3062 -184 3143 -3208 287 2830 -3294 788
3167 788 2537 -3377 1091 2248 -3336 1353 2037 -3454 1724 1706 -3458 1938 1304 -3306 2293 1001
3183 1001 -3296 2387 608 -3084 2787 313 -3160 2776 78 -2875 3001 -343 -2612 3100 -582
3198 -582 -2411 3202 -1060 -2160 3272 -1290 -1946 3178 -1494 -1604 3112 -1925 -1237 3161 -2005 -948
3214 -948 3045 -2363 -605 2950 -2520 -332 2887 -2732 -11 2789 -2896 337 2607 -3062 805
3229 805 2322 -3249 1014 2137 -3291 1331 1797 -3318 1622 1553 -3391 2001 1337 -3388 2312 839
3245 839 -3289 2570 514 -3208 2860 185 -3045 3105 -277 -2776 3252 -595 -2645 3515 -1063
3260 -1063 -2319 3364 -1374 -1963 3541 -1783 -1622 3426 -2138 -1193 3352 -2398 -889 3300 -2522 -320
3276 -320 3089 -2993 33 2905 -3014 357 2596 -3120 755 2399 -3316 1191 2058 -3328 1477
3291 1477 1694 -3390 1798 1449 -3322 2043 978 -3248 2382 753 -3103 2572 435 -2936 2707
3306 2707 60 -2710 2906 -293 -2571 2946 -475 -2263 3059 -928 -2167 3045 -1219 -1707 3109
3321 3109 -1434 -1447 3033 -1764 -1216 2944 -2012 -879 2908 -2138 -562 2866 -2332 -243 2575 -2569
3337 -2569 89 2527 -2724 232 2383 -2836 731 2181 -2848 1004 1885 -2875 1313 1805 -3121
3352 -3121 1551 1527 -2999 1824 1164 -3117 2038 903 -3014 2282 627 -2952 2628 176 -2826 2805
3368 2805 -142 -2683 2782 -455 -2359 2917 -772 -2215 3103 -1141 -1953 3139 -1455 -1566 3219
3383 3219 -1655 -1316 3244 -2087 -971 3052 -2357 -607 3054 -2600 -179 2845 -2748 151 2633
3398 2633 -3069 542 2408 -3063 827 2178 -3278 1076 1899 -3304 1517 1565 -3274 1921 1226 -3198
3414 -3198 2170 919 -3237 2531 534 -3007 2651 63 -2778 2854 -215 -2682 3040 -605 -2404
3429 -2404 3110 -931 -2109 3209 -1251 -1709 3077 -1484 -1365 3072 -1759 -1054 3030 -2002 -822 2879
3445 2879 -2312 -531 2709 -2280 -116 2647 -2539 163 2448 -2678 473 2157 -2839 759 1917
3460 1917 -2933 1004 1743 -2951 1276 1525 -2998 1366 1302 -2906 1721 1163 -2871 2049 837 -2833
3476 -2833 2158 469 -2713 2333 229 -2558 2573 -83 -2503 2753 -357 -2281 2797 -752 -2091
3491 -2091 2923 -970 -1673 2980 -1392 -1620 3104 -1615 -1313 2915 -1839 -1003 2914 -2174 -641 2871
3507 2871 -2434 -380 2754 -2577 6 2620 -2812 407 2414 -2921 646 2245 -3022 998 1977
3522 1977 -3219 1325 1728 -3166 1682 1361 -3181 2070 1008 -3215 2328 668 -2931 2537 361
3537 361 -2910 2766 26 -2641 2880 -485 -2461 3005 -776 -2111 3190 -956 -1871 3101 -1407
3552 -1407 -1461 3086 -1739 -1204 3116 -2114 -816 2995 -2275 -524 2859 -2475 -187 2681 -2659 149
3568 149 2512 -2766 542 2300 -2878 900 2074 -2992 1036 1847 -3100 1395 1575 -3070 1548 1245
3584 1245 -3001 1934 960 -3012 2120 611 -2782 2414 264 -2602 2567 112 -2571 2668 -271
3599 -271 -2240 2793 -544 -2027 2799 -854 -1919 2907 -1245 -1694 2871 -1374 -1389 3000 -1777 -1102
3615 -1102 3039 -1974 -750 2792 -2265 -452 2842 -2384 -264 2816 -2667 100 2504 -2726 374
3630 374 2439 -2943 680 2212 -3024 1161 1784 -3066 1399 1673 -3199 1793 1287 -3145 2064 926
3646 926 -3161 2319 718 -3069 2575 209 -2882 2836 -31 -2728 2932 -461 -2479 3144 -824
3661 -824 -2061 3056 -1200 -1969 3205 -1585 -1582 3222 -1811 -1259 3206 -2165 -895 3138 -2472 -519
3677 -519 3060 -2617 -112 2912 -2848 279 2781 -3103 561 2345 -3155 936 2065 -3356 1354
3692 1354 1861 -3307 1679 1539 -3327 1992 1228 -3163 2353 799 -3066 2378 519 -2941 2726 155
3708 155 -2700 2808 -223 -2488 2888 -646 -2281 3001 -1046 -1898 3059 -1271 -1691 3147 -1507 -1307
3724 -1307 3090 -1894 -1076 2991 -2137 -806 2927 -2381 -486 2835 -2552 -175 2715 -2584 173
3739 173 2598 -2838 380 2320 -2875 786 2065 -3000 1075 1945 -3200 1436 1607 -3043 1729 1388
3755 1388 -3231 2029 1063 -3121 2207 806 -2952 2409 387 -2852 2578 34 -2678 2845 -305
3770 -305 -2438 2985 -718 -2202 3162 -1056 -1959 3194 -1443 -1728 3250 -1665 -1454 3301 -1928 -1123
3786 -1123 3143 -2356 -765 3225 -2620 -368 3018 -2847 -63 2910 -3048 379 2535 -3180 890
3801 890 2280 -3270 1183 2034 -3462 1549 1744 -3391 1914 1364 -3509 2184 1046 -3305 2553 661
3817 661 -3071 2776 212 -2892 2916 -241 -2692 3159 -581 -2594 3184 -939 -2192 3302 -1311
3832 -1311 -1957 3209 -1652 -1562 3245 -2021 -1292 3236 -2178 -811 3036 -2465 -568 2957 -2717 -50
3848 -50 2768 -2734 238 2595 -3053 506 2401 -3137 984 2098 -3166 1123 1797 -3246 1473 1637
3864 1637 -3215 1812 1239 -3174 2084 934 -3065 2327 710 -2925 2521 376 -2746 2611 -67
3879 -67 -2653 2857 -332 -2372 2966 -788 -2144 3185 -997 -1887 3190 -1378 -1678 3163 -1686 -1456
3895 -1456 3143 -1913 -1008 3161 -2148 -793 3149 -2477 -373 3047 -2734 -51 2802 -3089 190
3910 190 2643 -3076 657 2546 -3316 1040 2140 -3361 1427 1959 -3416 1781 1541 -3399 2103 1196
3926 1196 -3369 2413 743 -3232 2780 381 -3036 2946 -128 -2887 3170 -253 -2647 3192 -858
3941 -858 -2349 3431 -1264 -1986 3344 -1678 -1735 3441 -1965 -1418 3388 -2246 -1009 3267 -2506 -521
3957 -521 3212 -2841 -177 2955 -3016 158 2852 -3123 612 2500 -3282 937 2226 -3435 1388
3972 1388 1931 -3422 1656 1428 -3328 2087 1188 -3205 2410 992 -3122 2537 450 -2977 2641 215
3988 215 -2846 2771 -319 -2536 3026 -469 -2290 3072 -938 -2193 3210 -1301 -1715 3138 -1543
4003 -1543 -1708 3207 -1876 -1253 3176 -2078 -860 3001 -2272 -665 2932 -2617 -257 2863 -2803
4018 -2803 65 2650 -2952 400 2480 -3034 773 2189 -3192 1025 1995 -3257 1383 1691 -3402
4033 -3402 1774 1443 -3262 2079 1040 -3206 2430 746 -3163 2553 319 -2890 2825 42 -2829
4048 -2829 3057 -350 -2647 3217 -792 -2341 3274 -1144 -2093 3334 -1578 -1728 3418 -1923 -1350 3380
4064 3380 -2239 -1070 3204 -2573 -592 3335 -2857 -277 3116 -3059 185 2817 -3274 578 2623
4079 2623 -3434 964 2331 -3496 1397 2022 -3584 1785 1649 -3514 2052 1180 -3373 2463 843 -3248
4095 -3248 2719 455 -3065 2925 -35 -2899 3014 -497 -2612 3149 -804 -2296 3310 -1134 -2032
4110 -2032 3307 -1404 -1705 3332 -1730 -1345 3289 -2108 -1011 3140 -2397 -715 3066 -2562 -439
4125 -439 2975 -2835 12 2770 -2923 295 2546 -3065 706 2302 -3196 983 1962 -3217 1332
4140 1332 1774 -3305 1713 1437 -3193 1971 1200 -3195 2214 797 -3019 2436 410 -2969 2551 68
4156 68 -2825 2815 -146 -2674 2995 -371 -2416 3023 -1018 -2241 3123 -1209 -1939 3307 -1615 -1709
4172 -1709 3299 -1861 -1252 3296 -2227 -955 3313 -2416 -549 3239 -2765 -380 3107 -3038 201
4187 201 2834 -3183 479 2574 -3307 956 2375 -3537 1249 2148 -3447 1688 1700 -3505 2050 1353
4203 1353 -3479 2325 908 -3484 2636 542 -3218 2914 -4 -2977 3044 -387 -2694 3376 -809
4218 -809 -2477 3427 -1112 -2144 3485 -1612 -1816 3480 -1979 -1356 3429 -2199 -1097 3372 -2600 -695
4234 -695 3252 -2725 -315 3092 -2865 74 2926 -3184 422 2550 -3316 886 2335 -3389 1174
4249 1174 2054 -3365 1554 1733 -3370 1902 1401 -3333 2107 1021 -3215 2393 686 -3125 2554 295
4265 295 -2856 2701 -152 -2709 2920 -392 -2516 3112 -755 -2189 2940 -1027 -1996 3183 -1356
4280 -1356 -1702 3209 -1635 -1415 3113 -1852 -1127 3049 -2324 -857 3195 -2407 -514 3064 -2774 -157
4296 -157 2845 -2997 210 2669 -3062 562 2421 -3265 854 2211 -3284 1360 1936 -3425 1656
4311 1656 1601 -3361 1985 1207 -3382 2344 831 -3339 2534 493 -3082 2911 148 -3046 3092 -309
4327 -309 -2792 3191 -689 -2603 3434 -1087 -2138 3520 -1427 -1807 3516 -1874 -1535 3521 -2237 -1050
4343 -1050 3380 -2544 -754 3389 -2891 -267 3127 -3109 161 2961 -3311 414 2793 -3449 1044
4358 1044 2456 -3477 1282 2063 -3548 1818 1728 -3535 2225 1302 -3404 2340 977 -3424 2541 516
4374 516 -3169 2819 79 -2970 3099 -269 -2715 3109 -529 -2405 3163 -974 -2175 3245 -1289
4389 -1289 -1984 3395 -1616 -1630 3230 -1991 -1222 3200 -2200 -947 3121 -2465 -561 2945 -2603 -148
4405 -148 2830 -2886 123 2746 -3007 612 2504 -3199 907 2199 -3189 1114 1951 -3300 1414
4420 1414 1660 -3199 1708 1467 -3218 2100 1081 -3276 2377 739 -3095 2618 412 -2899 2710
4435 2710 -34 -2759 2957 -449 -2582 3053 -713 -2368 3266 -1140 -2137 3453 -1479 -1943 3426
4450 3426 -1672 -1429 3410 -2113 -1171 3311 -2536 -769 3286 -2825 -365 3109 -3020 89 3001
4465 3001 -3229 445 2660 -3387 928 2539 -3580 1204 2212 -3489 1750 1688 -3603 2076 1374 -3535
4481 -3535 2482 987 -3377 2657 553 -3213 2969 184 -3047 3142 -253 -2775 3310 -660 -2562
4496 -2562 3403 -1208 -2141 3502 -1410 -1894 3494 -1898 -1599 3533 -2084 -1053 3242 -2443 -805 3201
4512 3201 -2728 -393 3005 -3020 129 2810 -3051 435 2734 -3219 747 2405 -3270 989 2153
4527 2153 -3226 1492 1941 -3403 1708 1509 -3313 2050 1158 -3220 2301 819 -3048 2558 533 -2939
4543 -2939 2648 139 -2883 2848 -184 -2530 2943 -591 -2301 3066 -859 -2177 3132 -1308 -1871
4558 -1871 3221 -1560 -1623 3215 -1895 -1293 3254 -2196 -949 3256 -2430 -665 3090 -2768 -289 2942
4574 2942 -2882 74 2910 -3207 500 2686 -3351 879 2286 -3470 1287 1993 -3528 1748 1711 -3561
4590 -3561 2087 1428 -3449 2292 1011 -3342 2583 682 -3283 2871 137 -3183 3166 -274 -2815
4605 -2815 3287 -645 -2632 3348 -1118 -2261 3523 -1463 -1944 3559 -1945 -1457 3459 -2339 -1167
4620 -1167 3518 -2549 -730 3389 -2829 -199 3171 -3063 89 3021 -3309 543 2639 -3399 918
4635 918 2439 -3436 1167 2118 -3466 1593 1745 -3356 2012 1298 -3499 2372 896 -3353 2439 583
4651 583 -3039 2731 145 -2983 2889 -190 -2633 3122 -564 -2449 3180 -839 -2139 3192 -1165
4666 -1165 -1816 3297 -1589 -1599 3309 -1748 -1265 3295 -2297 -951 3225 -2401 -743 2972 -2639 -313
4682 -313 2902 -2918 116 2792 -3051 430 2550 -3085 689 2279 -3233 1069 2145 -3425 1515
4697 1515 1786 -3338 1767 1439 -3329 2077 1045 -3297 2304 832 -3246 2615 395 -3022 2877
4712 2877 13 -2844 3035 -382 -2694 3208 -837 -2430 3366 -1193 -2139 3416 -1554 -1864 3525
4727 3525 -1858 -1445 3520 -2347 -1088 3410 -2649 -759 3399 -2851 -298 3118 -3104 169 2998
4742 2998 -3344 613 2747 -3511 1018 2396 -3566 1459 2084 -3588 1830 1705 -3561 2226 1300 -3463
4758 -3463 2531 894 -3410 2734 448 -3198 2876 67 -2998 3252 -403 -2793 3277 -810 -2345
4773 -2345 3302 -1109 -2100 3391 -1627 -1721 3435 -1867 -1432 3324 -2132 -950 3325 -2450 -672 3123
4789 3123 -2766 -268 3048 -2941 -13 2781 -3057 451 2611 -3234 782 2358 -3174 1199 2142
4804 2142 -3308 1388 1627 -3265 1908 1354 -3354 2104 1119 -3138 2265 797 -3073 2484 415 -2872
4820 -2872 2722 -17 -2860 2839 -179 -2593 3050 -570 -2347 2998 -926 -2140 3217 -1238 -1860
4835 -1860 3246 -1723 -1518 3283 -1872 -1305 3271 -2334 -853 3381 -2506 -638 3135 -2874 -201
4850 -201 3063 -2974 263 2787 -3204 657 2603 -3358 1073 2200 -3473 1467 1948 -3446 1819
4865 1819 1538 -3445 2235 1324 -3438 2576 888 -3343 2704 445 -3195 2986 34 -2960 3225
4880 3225 -392 -2779 3302 -780 -2357 3457 -1275 -2073 3502 -1635 -1751 3540 -1906 -1376 3455 -2369
4896 -2369 -979 3439 -2558 -583 3219 -2875 -212 3061 -3118 181 2739 -3167 650 2531 -3274
4911 -3274 946 2296 -3556 1435 1994 -3437 1737 1608 -3349 2014 1208 -3321 2237 888 -3211 2535
4927 2535 502 -3011 2694 129 -2684 2943 -148 -2558 2985 -499 -2427 3015 -847 -2107 3097
4942 3097 -1308 -1892 3186 -1496 -1643 3200 -1774 -1212 3155 -2169 -1051 3098 -2346 -561 3005 -2560
4958 -2560 -311 2807 -2801 101 2754 -2970 418 2528 -3156 716 2279 -3222 1025 2012 -3335
4973 -3335 1484 1812 -3341 1769 1471 -3256 2141 1076 -3290 2367 721 -3090 2595 309 -2981
4988 -2981 2839 -113 -2794 2948 -383 -2606 3183 -791 -2347 3308 -1199 -2088 3429 -1505 -1680
5003 -1680 3504 -1881 -1421 3417 -2363 -1035 3357 -2555 -568 3265 -2877 -72 3076 -3078 253
5018 253 2756 -3296 664 2589 -3390 1145 2186 -3485 1570 1888 -3497 1742 1505 -3436 2224 1185
5034 1185 -3331 2451 633 -3172 2623 377 -3098 2929 -69 -2827 3041 -483 -2527 3151 -786
5049 -786 -2375 3325 -1129 -1992 3329 -1502 -1643 3196 -1857 -1431 3221 -2042 -1147 3045 -2293 -727
5065 -727 2889 -2528 -330 2890 -2722 54 2761 -2981 384 2584 -3014 622 2265 -3112 1032
5080 1032 1938 -3140 1347 1777 -3189 1649 1504 -3130 1939 1081 -3178 2124 705 -3197 2347 368
5096 368 -2817 2653 137 -2864 2754 -215 -2616 2971 -478 -2295 3099 -892 -2107 3220 -1233
5111 -1233 -1863 3272 -1510 -1465 3185 -1853 -1262 3257 -2208 -862 3285 -2492 -427 3090 -2816 -167
5127 -167 2941 -3068 269 2695 -3131 684 2582 -3317 1046 2221 -3464 1473 1872 -3402 1673
5142 1673 1575 -3378 2139 1180 -3291 2385 734 -3207 2581 259 -2995 2829 -10 -2776 2993 -410
5158 -410 -2579 3164 -885 -2285 3211 -1233 -1912 3343 -1588 -1574 3366 -1894 -1248 3348 -2174 -882
5174 -882 3177 -2392 -608 3032 -2671 -185 2903 -2854 179 2633 -3017 660 2445 -3084 915
5189 915 2110 -3136 1262 1861 -3188 1522 1554 -3126 1933 1246 -3114 1956 836 -3070 2257 528
5205 528 -2813 2391 222 -2664 2525 -145 -2438 2728 -431 -2245 2859 -685 -2070 2920 -1015
5220 -1015 -1771 2999 -1277 -1538 3022 -1711 -1387 3093 -1895 -1081 2987 -2150 -692 2798 -2377 -398
5236 -398 2943 -2626 -117 2777 -2874 340 2468 -2987 762 2266 -3104 1033 2095 -3123 1298
5251 1298 1805 -3230 1760 1508 -3207 1900 1085 -3118 2340 766 -3026 2548 445 -3045 2755 101
5267 101 -2833 2996 -418 -2655 3154 -742 -2362 3265 -1204 -2026 3312 -1493 -1704 3352 -1965 -1327
5283 -1327 3214 -2094 -977 3117 -2536 -590 3144 -2732 -180 2946 -2929 188 2757 -3093 654
5298 654 2313 -3256 950 2181 -3251 1406 1723 -3230 1774 1428 -3199 1953 1168 -3092 2234 802
5314 802 -2956 2446 382 -2881 2697 124 -2685 2649 -368 -2336 2916 -665 -2152 3011 -966
5329 -966 -1851 3037 -1262 -1717 3069 -1582 -1367 3025 -1745 -1072 2879 -2054 -722 2837 -2279 -484
5345 -484 2813 -2550 -50 2684 -2629 161 2466 -2747 443 2305 -2922 880 1979 -2956 1174
5360 1174 1702 -2956 1417 1505 -3107 1644 1236 -2930 1939 972 -3034 2274 517 -2814 2544 186
5376 186 -2697 2537 -25 -2581 2777 -443 -2386 2985 -747 -2121 3031 -1162 -2026 3106 -1394
5391 -1394 -1681 3144 -1839 -1232 3093 -1983 -791 3087 -2377 -608 2974 -2694 -112 2880 -2952
5406 -2952 168 2653 -3100 606 2290 -3193 1103 2097 -3181 1393 1787 -3271 1720 1460 -3268 2006
5422 2006 1019 -3095 2317 704 -2964 2530 410 -2863 2714 -48 -2612 2940 -566 -2348 3030
5437 3030 -808 -2145 3054 -1188 -1868 3062 -1408 -1469 3113 -1770 -1236 3146 -2112 -948 2871 -2378
5453 -2378 -404 2768 -2508 -146 2697 -2693 134 2457 -2779 513 2199 -2957 798 1966 -2959
5468 -2959 1161 1742 -3083 1452 1345 -3018 1690 1137 -2882 1908 827 -2843 2150 496 -2684 2333
5484 2333 310 -2581 2503 -76 -2354 2759 -354 -2274 2736 -664 -2014 2789 -892 -1915 2868
5499 2868 -1255 -1508 2940 -1540 -1341 2895 -1838 -1122 2902 -2049 -678 2860 -2373 -317 2827 -2577
5515 -2577 -23 2620 -2695 336 2487 -2981 664 2144 -3113 991 2038 -3094 1373 1537 -3101
5530 -3101 1749 1343 -3079 2125 911 -3048 2296 581 -2905 2509 176 -2684 2600 -73 -2619
5545 -2619 2894 -475 -2364 2954 -829 -2241 3097 -1205 -1640 3118 -1495 -1460 3134 -1866 -1099 3122
5561 3122 -2213 -882 3033 -2392 -393 2788 -2601 58 2664 -2828 410 2373 -2921 761 2122
5576 2122 -3069 1014 1764 -3025 1348 1568 -3037 1701 1286 -2975 1968 977 -2881 2044 619 -2737
5592 -2737 2317 297 -2627 2439 -55 -2333 2586 -341 -2259 2733 -727 -1941 2853 -898 -1626
5607 -1626 2857 -1103 -1581 2763 -1419 -1178 2877 -1730 -981 2805 -1954 -756 2631 -2164 -348 2573
5623 2573 -2355 -83 2402 -2464 277 2263 -2601 490 1998 -2797 860 1883 -2836 1196 1633
5638 1633 -2806 1364 1391 -2883 1760 1085 -2865 1964 747 -2862 2135 551 -2662 2445 151 -2580
5654 -2580 2441 -107 -2319 2776 -517 -2154 2766 -868 -1881 2889 -1192 -1603 2978 -1536 -1287
5669 -1287 3034 -1817 -970 2918 -2068 -612 2927 -2377 -356 2858 -2575 47 2748 -2706 403
5684 403 2293 -2893 842 2134 -2981 1215 1811 -3101 1505 1554 -2978 1720 1047 -3059 2067 741
5700 741 -2919 2259 593 -2821 2497 74 -2426 2582 -194 -2352 2771 -638 -2040 2740 -841
5715 -841 -1793 2831 -1144 -1487 2812 -1502 -1154 2770 -1624 -1077 2699 -1949 -687 2496 -2088 -337
5731 -337 2589 -2367 -85 2392 -2448 310 2135 -2586 526 1882 -2649 875 1740 -2667 1083
5746 1083 1550 -2684 1320 1263 -2734 1561 1060 -2717 1797 732 -2550 1973 477 -2434 2244 176
5762 176 -2363 2398 -73 -2193 2372 -402 -1984 2514 -767 -1765 2524 -1022 -1586 2663 -1220 -1377
5778 -1377 2648 -1568 -1110 2661 -1727 -779 2727 -2131 -475 2615 -2253 -114 2458 -2452 143
5793 143 2434 -2585 492 2094 -2711 908 1984 -2858 1118 1644 -2948 1488 1226 -2877 1802 1030
5809 1030 -2869 2044 658 -2789 2335 393 -2608 2505 -7 -2453 2560 -312 -2284 2626 -615
5824 -615 -1997 2821 -927 -1687 2821 -1283 -1489 2785 -1496 -1189 2772 -1872 -879 2704 -2057 -467
5840 -467 2573 -2107 -133 2406 -2376 146 2346 -2638 494 1974 -2664 760 1786 -2663 1060
5855 1060 1549 -2724 1330 1242 -2676 1587 940 -2661 1849 611 -2544 1983 383 -2387 2050 68
5871 68 -2208 2195 -157 -2099 2367 -481 -1930 2455 -659 -1684 2550 -882 -1613 2575 -1191 -1216
5887 -1216 2501 -1318 -1059 2444 -1773 -768 2466 -1836 -546 2486 -2080 -253 2389 -2227 190
5902 190 2161 -2257 344 1886 -2522 652 1722 -2712 925 1697 -2544 1087 1403 -2596 1473 1074
5918 1074 -2670 1649 899 -2555 1926 552 -2597 2108 312 -2340 2253 7 -2336 2479 -305
5933 -305 -2092 2650 -590 -1893 2599 -940 -1558 2662 -1286 -1416 2711 -1517 -1100 2703 -1807 -724
5949 -724 2688 -2089 -393 2525 -2342 -69 2389 -2407 253 2159 -2536 581 1991 -2659 853
5964 853 1676 -2772 1175 1465 -2801 1523 1133 -2506 1746 893 -2552 1870 509 -2461 2187 107
5980 107 -2356 2244 -119 -2150 2426 -386 -1909 2425 -631 -1650 2499 -837 -1477 2411 -1023
5995 -1023 -1208 2493 -1319 -1074 2431 -1575 -725 2398 -1821 -497 2254 -1899 -211 2228 -2192 -7
6011 -7 2135 -2257 341 1937 -2325 588 1693 -2294 848 1532 -2542 1187 1306 -2478 1197 1141 -2388
6028 -2388 1542 845 -2385 1687 519 -2307 1932 314 -2231 2068 70 -2163 2258 -191 -2018
6043 -2018 2285 -465 -1717 2370 -639 -1595 2406 -1002 -1481 2565 -1285 -1210 2514 -1597 -997 2552
6059 2552 -1698 -735 2441 -2061 -277 2338 -2201 32 2273 -2330 375 2137 -2524 648 1797
6074 1797 -2565 932 1633 -2693 1208 1367 -2701 1475 1067 -2658 1751 672 -2540 1943 504 -2416
6090 -2416 2115 253 -2259 2340 -123 -2122 2398 -396 -1908 2535 -726 -1768 2444 -983 -1463
6105 -1463 2465 -1272 -1144 2531 -1507 -870 2433 -1584 -590 2369 -1908 -266 2359 -2075 50 2054
6121 2054 -2234 205 1911 -2337 453 1676 -2290 872 1536 -2379 1088 1376 -2444 1342 1088 -2334
6137 -2334 1377 824 -2322 1646 565 -2195 1809 349 -2145 1864 66 -2007 1918 -200 -1825
6152 -1825 2155 -499 -1751 2208 -693 -1615 2257 -846 -1324 2319 -1063 -1112 2368 -1326 -874 2336
6168 2336 -1541 -739 2271 -1697 -325 2193 -1933 -171 2092 -2165 247 1886 -2215 458 1815
6183 1815 -2308 662 1632 -2409 904 1521 -2407 1238 1259 -2488 1399 889 -2436 1657 673 -2410
6199 -2410 1856 348 -2302 2030 90 -2137 2161 -195 -2067 2298 -427 -1777 2311 -777 -1639
6214 -1639 2445 -964 -1368 2451 -1314 -1119 2386 -1524 -868 2367 -1942 -496 2291 -1986 -232 2243
6230 2243 -2147 172 2163 -2268 405 1859 -2346 630 1622 -2425 932 1494 -2444 1161 1202 -2348
6246 -2348 1378 884 -2310 1632 667 -2261 1831 429 -2223 1932 65 -2087 2018 -127 -1745
6261 -1745 2165 -426 -1664 2191 -742 -1521 2204 -823 -1292 2228 -1031 -966 2109 -1283 -782 2133
6277 2133 -1426 -582 2129 -1651 -433 2058 -1779 -155 1924 -1981 131 1898 -2058 387 1600
6292 1600 -2177 564 1496 -2106 834 1363 -2229 1204 1263 -2289 1279 950 -2175 1468 730 -2127
6308 -2127 1581 546 -2117 1678 248 -2025 1927 18 -1884 2051 -291 -1666 2164 -484 -1581
6323 -1581 2277 -822 -1414 2249 -1071 -1076 2408 -1271 -1051 2302 -1404 -623 2311 -1698 -566 2216
6339 2216 -1871 -148 2049 -2084 0 1862 -2181 478 1848 -2303 753 1599 -2429 935 1335
6354 1335 -2360 1233 1103 -2357 1557 757 -2228 1668 561 -2229 1838 279 -2101 1930 -21
6369 -21 -1832 2103 -249 -1755 2207 -362 -1612 2233 -827 -1331 2176 -1002 -1208 2276 -1264 -840
6385 -840 2276 -1434 -628 2180 -1675 -365 2126 -1792 -137 1941 -1911 141 1694 -1990 332
6400 332 1654 -2057 620 1526 -2039 704 1258 -2088 941 1027 -2055 1177 835 -2122 1255 684 -1923
6417 -1923 1539 468 -1836 1653 246 -1908 1820 -15 -1679 1876 -218 -1567 1919 -434 -1525
6432 -1525 2006 -692 -1339 2028 -925 -1214 2105 -962 -1022 2045 -1158 -709 2133 -1503 -493 1985
6448 1985 -1637 -345 1983 -1802 -76 1738 -1950 165 1800 -2047 564 1625 -2111 747 1311
6463 1311 -2285 1017 1226 -2197 1181 987 -2204 1441 718 -2201 1488 468 -2056 1724 217 -2007
6479 -2007 1884 -158 -1839 1976 -255 -1570 2145 -531 -1433 2212 -785 -1288 2236 -1014 -1140 2128
6495 2128 -1240 -731 2161 -1487 -605 2044 -1695 -271 1864 -1770 22 1902 -1961 230 1706
6510 1706 -2158 550 1545 -2088 738 1179 -2111 920 1046 -2106 1251 968 -2129 1440 525 -2026
6526 -2026 1425 496 -1959 1540 124 -1840 1744 -78 -1650 1778 -218 -1511 1908 -413 -1396
$$ [...]
8191d07
##END NTUPLES=NMR FID
##END=
