##TITLE=1H_Pr X-2
 200.13MHz, CCl4,
 8 sc
 
 24.4.2025
##JCAMPDX= 6.0         $$ Bruker NMR JCAMP-DX V2.0
##DATA TYPE= NMR FID
##DATA CLASS= NTUPLES
##ORIGIN= UXNMR, Bruker Analytische Messtechnik GmbH
##OWNER= pz
$$ XWIN-NMR		Version 3.5
$$ Thu Apr 24 14:41:04 2025 Russian Standard Time (UT+4h)  she@DPX200
##.OBSERVE FREQUENCY= 200.1313
##.OBSERVE NUCLEUS= ^1H
##.DELAY= (6, 6)
##.ACQUISITION MODE= SIMULTANEOUS
##.ACQUISITION SCHEME= undefined
##.AVERAGES= 8
##.DIGITISER RES= 18
##SPECTROMETER/DATA SYSTEM= spect
##.PULSE SEQUENCE= zg30
##.SOLVENT NAME= CDCl3
##.SHIFT REFERENCE= (INTERNAL, CDCl3, 0, 14.3821)
##AUDIT TRAIL= $$ (NUMBER, WHEN, WHO, WHERE, WHAT)
$$ ##TITLE= Audit trail, XWIN-NMR		Version 3.5
$$ ##JCAMPDX= 5.01
$$ ##ORIGIN= Bruker BioSpin GmbH
$$ ##OWNER= she
$$ F:/spectra/data/she/nmr/H-C/1/audita.txt
$$ ##AUDIT TRAIL=  $$ (NUMBER, WHEN, WHO, WHERE, WHAT)
(   1,<2025-04-24 14:39:51.46 +0400>,<she>,<DPX200>,
      <created by zg, POWCHK disabled, PULCHK disabled
       configuration hash MD5:
       00 E9 B6 7A A2 85 ED C7 34 08 36 98 17 FE 4E 26
       data hash MD5: 16K
       C7 4E 55 80 D0 0C 7C 71 BF 5E 36 60 2C F9 2A 75>)
$$ ##END=
$$ 
$$ hash MD5
$$ 05 01 C3 35 22 E7 27 0E BD 68 63 92 CD 59 4A CA
##$RELAX= 
##$RELAX= 
##$RELAX= 
##$RELAX= 
##$RELAX= 
##$RELAX= 
$$ Bruker specific parameters
$$ --------------------------
##$DU= <F:/spectra>
##$EXPNO= 1
##$NAME= <H-C>
##$PROCNO= 1
##$TYPE= <nmr>
##$USER= <she>
##$AMP= (0..31)
100 100 100 100 100 100 100 100 100 100 100 100 100 100 100 100 100 100 
100 100 100 100 100 100 100 100 100 100 100 100 100 100 
##$AQSEQ= 0
##$AQ_mod= 1
##$AUNM= <au_zg>
##$AUTOPOS= <>
##$BF1= 200.13
##$BF2= 200.13
##$BF3= 200.13
##$BF4= 200.13
##$BF5= 200.13
##$BF6= 200.13
##$BF7= 200.13
##$BF8= 200.13
##$BYTORDA= 1
##$CFDGTYP= 0
##$CFRGTYP= 5
##$CHEMSTR= <none>
##$CNST= (0..31)
1 1 145 1 1 1 1 1 1 1 1 1 1 1 1 1 1 1 1 1 1 1 1 1 1 1 1 1 1 1 1 1 
##$CPDPRG= <>
##$CPDPRG1= <>
##$CPDPRG2= <>
##$CPDPRG3= <>
##$CPDPRG4= <mlev>
##$CPDPRG5= <mlev>
##$CPDPRG6= <mlev>
##$CPDPRG7= <mlev>
##$CPDPRG8= <mlev>
##$CPDPRGB= <>
##$CPDPRGT= <>
##$D= (0..31)
0 0.7 0 0 0 0 0 0 0 0 0 0.03 0 0 0 0 0 0 0 0 0 0 0 0 0 0 0 0 0 0 0 0 
##$DATE= 1745491191
##$DBL= (0..7)
120 120 120 120 120 120 120 120 
##$DBP= (0..7)
150 150 150 150 150 150 150 150 
##$DBP07= 0
##$DBPNAM0= <>
##$DBPNAM1= <>
##$DBPNAM2= <>
##$DBPNAM3= <>
##$DBPNAM4= <>
##$DBPNAM5= <>
##$DBPNAM6= <>
##$DBPNAM7= <>
##$DBPOAL= (0..7)
0.5 0.5 0.5 0.5 0.5 0.5 0.5 0.5 
##$DBPOFFS= (0..7)
0 0 0 0 0 0 0 0 
##$DE= 6
##$DECBNUC= <off>
##$DECIM= 32
##$DECNUC= <off>
##$DECSTAT= 4
##$DIGMOD= 1
##$DIGTYP= 9
##$DL= (0..7)
0 120 120 120 120 120 120 120 
##$DP= (0..7)
150 150 150 150 150 150 150 150 
##$DP07= 0
##$DPNAME0= <>
##$DPNAME1= <>
##$DPNAME2= <>
##$DPNAME3= <>
##$DPNAME4= <>
##$DPNAME5= <>
##$DPNAME6= <>
##$DPNAME7= <>
##$DPOAL= (0..7)
0.5 0.5 0.5 0.5 0.5 0.5 0.5 0.5 
##$DPOFFS= (0..7)
0 0 0 0 0 0 0 0 
##$DQDMODE= 0
##$DR= 18
##$DS= 0
##$DSLIST= <SSSSSSSSSSSSSSS>
$$ [...]
##$SUBNAM0= <"">
##$SUBNAM1= <"">
##$SUBNAM2= <"">
##$SUBNAM3= <"">
##$SUBNAM4= <"">
##$SUBNAM5= <"">
##$SUBNAM6= <"">
##$SUBNAM7= <"">
##$SUBNAM8= <"">
##$SUBNAM9= <"">
##$SW= 18.0517328524113
##$SWIBOX= (0..15)
0 0 2 0 0 0 0 0 0 0 0 0 0 0 0 0 
##$SW_h= 3612.71676300578
##$TD= 16384
##$TD0= 1
##$TE= 0
##$TE2= 300
##$TE3= 300
##$TEG= 300
##$TL= (0..7)
0 120 120 120 120 120 120 120 
##$TP= (0..7)
150 150 150 150 150 150 150 150 
##$TP07= 0
##$TPNAME0= <>
##$TPNAME1= <>
##$TPNAME2= <>
##$TPNAME3= <>
##$TPNAME4= <>
##$TPNAME5= <>
##$TPNAME6= <>
##$TPNAME7= <>
##$TPOAL= (0..7)
0.5 0.5 0.5 0.5 0.5 0.5 0.5 0.5 
##$TPOFFS= (0..7)
0 0 0 0 0 0 0 0 
##$TUNHIN= 0
##$TUNHOUT= 0
##$TUNXOUT= 0
##$USERA1= <user>
##$USERA2= <user>
##$USERA3= <user>
##$USERA4= <user>
##$USERA5= <user>
##$V9= 5
##$VALIST= <valist>
##$VCLIST= <CCCCCCCCCCCCCCC>
##$VD= 0
##$VDLIST= <DDDDDDDDDDDDDDD>
##$VPLIST= <PPPPPPPPPPPPPPP>
##$VTLIST= <TTTTTTTTTTTTTTT>
##$WBST= 1024
##$WBSW= 4
##$XGAIN= (0..3)
0 0 0 0 
##$XL= 0
##$YL= 0
##$YMAX_a= 104672
##$YMIN_a= -104970
##$ZGOPTNS= <>
##$ZL1= 120
##$ZL2= 120
##$ZL3= 120
##$ZL4= 120
##$ABSF1= 10
##$ABSF2= 0
##$ABSG= 5
##$ABSL= 3
##$ALPHA= 0
##$AQORDER= 0
##$ASSFAC= 0
##$ASSFACI= 0
##$ASSFACX= 0
##$ASSWID= 0
##$AUNMP= <proc_1d>
##$AZFE= 0.1
##$AZFW= 0.1
##$BCFW= 1
##$BC_mod= 2
##$BYTORDP= 1
##$COROFFS= 0
##$CY= -3
##$DATMOD= 1
##$DC= 2
##$DFILT= <>
##$DTYPP= 0
##$F1P= 0
##$F2P= 0
##$FCOR= 0.5
##$FTSIZE= 0
##$FT_mod= 4
##$GAMMA= 1
##$GB= 0.15
##$INTBC= 1
##$INTSCL= 1
##$ISEN= 128
##$LB= 0.25
##$LEV0= 0
##$LPBIN= 0
##$MAXI= 10000
##$MC2= 0
##$MEAN= 0
##$ME_mod= 0
##$MI= 1.114404
##$NCOEF= 0
##$NC_proc= 0
##$NLEV= 6
##$NOISF1= 3.799351
##$NOISF2= 2.8
##$NSP= 1
##$NTH_PI= 0
##$NZP= 0
##$OFFSET= 14.38212
##$PC= 1
##$PHC0= -832.6384
##$PHC1= 15.9922
##$PH_mod= 1
##$PKNL= yes
##$PPARMOD= 0
##$PSCAL= 0
##$PSIGN= 0
##$REVERSE= no
##$SF= 200.129724274929
##$SI= 16384
##$SIGF1= 3
##$SIGF2= 2
##$SINO= 400
##$SIOLD= 16384
##$SREGLST= <1H.CDCl3>
##$SSB= 0
##$STSI= 0
##$STSR= 0
##$SW_p= 3205.1282051282
##$SYMM= 0
##$S_DEV= 0
##$TDeff= 0
##$TDoff= 0
##$TI= <>
##$TILT= no
##$TM1= 0
##$TM2= 0
##$TOPLEV= 0
##$USERP1= <user>
##$USERP2= <user>
##$USERP3= <user>
##$USERP4= <user>
##$USERP5= <user>
##$WDW= 1
##$XDIM= 8192
##$YMAX_p= 0
##$YMIN_p= 0
$$ End of Bruker specific parameters
$$ ---------------------------------
##NTUPLES= NMR FID
##VAR_NAME=  TIME,          FID/REAL,        FID/IMAG
##SYMBOL=    X,             R,               I
##VAR_TYPE=  INDEPENDENT,   DEPENDENT,       DEPENDENT
##VAR_FORM=  AFFN,          ASDF,            ASDF
##VAR_DIM=   8192,          8192,            8192
##UNITS=     SECONDS,       ARBITRARY UNITS, ARBITRARY UNITS
##FACTOR=    0.0002768,     1,               1
##FIRST=     0,             0,               0
##LAST=      2.2672688,     0,               0
##MIN=       0,             -104970,         0
##MAX=       2.2672688,     104672,          0
$$ Real data points
##PAGE= N=1
##DATA TABLE= (X++(R..R)), XYDATA
$$ [...]
$$ plain form
2292 778 1988 3309 3811 3297 2076 -104 -1584 -3240 -3768 -3428 -2442 -993 993 2645 3486 3678 2909
2309 2909 1313 -236 -2255 -3392 -3960 -3081 -2082 -313 1807 3026 3660 3341 2477 496 -1066 -2843
2325 -2843 -3470 -3581 -2641 -1271 707 2159 3170 3577 3070 1780 56 -1833 -2964 -3749 -3376 -2362 -669
2342 -669 1533 2684 3599 3398 2813 1049 -482 -2183 -3092 -3477 -2893 -1627 95 1780 3119 3348 3191
2359 3191 2243 423 -1357 -2730 -3427 -3250 -2590 -1076 428 2110 3364 3389 3104 1638 -126 -1747 -3032
2376 -3032 -3663 -3272 -2291 -546 1063 2532 3480 3606 2345 1013 -495 -2219 -2970 -3317 -2863 -1660 42
2393 42 1671 3228 3321 3220 1970 329 -1374 -2422 -3232 -3114 -2336 -805 649 2140 3249 3206 2576 1461
2411 1461 -56 -2009 -2801 -3365 -3008 -1920 -403 1044 2636 3242 3234 2229 854 -794 -2093 -3170 -3087
$$ packed form
2292G78J210J321N02n14j221k180j480j656n28L40R86J449J986J652Q41J92p69
2309B909j596j549k019j137n68Q79R99J769K120J219O34l19q64j981j562j777
2325b843o27j11R40J370J978J452J011M07n07j290j724j889j131p85L73J014J693
2342f69K202J151R15k01n85j764j531j701r09l85N84J266J722J685J339K29j57
2359C191r48j820j780j373o97J77O60J514J504J682J254K5k85j466j764j621j285
2376c032o31L91R81J745J609J469R48J26j261j332j508j724p51l47M54J203J702
2393D2J629J557R3j01j250j641j703j048q10J18P78J531J454J491J109m3o30j115
2411A461j517j953p92n64L57J088J517J447J592O06qj005j375j648j299j077Q3
$$ plain form
2428 -3087 -2651 -1449 206 1896 2883 3102 2764 1862 403 -1174 -2598 -3222 -2978 -2155 -929 859 2025
2445 2025 3090 3218 2522 1474 -541 -1863 -2851 -3147 -2825 -1679 -362 1560 2406 3287 2787 2025 859
2462 859 -779 -2323 -3105 -3195 -2552 -1201 432 1980 2699 3227 2891 1943 -64 -1614 -2424 -3166 -3030 -2226
2480 -2226 -756 905 2254 3252 2983 2492 1037 -366 -1939 -2579 -3322 -2841 -1514 -39 1393 2477
2496 2477 3233 2761 1667 348 -875 -2314 -3013 -2774 -2305 -1051 618 1945 2683 3213 2715 1495 -77
2513 -77 -1419 -2526 -3186 -3006 -1964 -639 848 2246 3110 3024 2396 1005 -384 -1813 -2882 -3142 -2668
2530 -2668 -1363 45 1505 2698 3129 2851 1721 444 -1009 -2224 -2804 -2942 -2236 -956 566 1823
2546 1823 2740 2880 2608 1438 109 -1437 -2501 -3084 -2733 -1959 -510 1143 2269 3075 2878 2018 1043
$$ packed form
2428c087M36J202J655J690R87K19l38r02j459j577j424o24K44Q23J226J788J166
2445B025J065J28o96j048k015j322r88k96L22J146J317J922Q46Q81n00p62j166
2462H59j638j544p82r0O43J351J633J548P19N28l36r48k007j550q10p42J36Q04
2480b226J470J661J349R98k69m91j455j403j573o40p43M81J327J475J432J084
2496B477P56m72j094j319j223j439o99K39M69J254J669J327P38N30m98j220j572
2513g7j342j107o60J80J042J325J487J398Q64q6o28j391j389j429j069k60M74
2530b668J305J408J460J193M31k78j130j277j453j215n80j38P06J280J522J257
2546A823R17J40k72j170j329j546j064n83L51P74J449J653J126Q06j97q60r75
$$ plain form
2563 1043 -484 -1511 -2722 -3005 -2645 -1551 294 1301 2629 2967 2658 1886 412 -948 -2138 -2809
2579 -2809 -2864 -2275 -1016 523 1783 2748 3118 2590 1499 25 -1549 -2509 -2930 -2737 -1633 -525 790
2596 790 2285 2794 2980 1950 809 -519 -1854 -2836 -2855 -2669 -1399 87 1293 2595 2943 2545 1873
2613 1873 470 -1061 -2114 -2942 -2837 -2137 -1051 461 1549 2624 3005 2301 1327 -28 -1621 -2627
2629 -2627 -3020 -2658 -1778 -466 1012 2089 2861 2611 2156 837 -438 -1750 -2795 -2901 -2299 -1103 -27
2646 -27 1412 2297 2901 2550 1519 332 -994 -2104 -2657 -2735 -2079 -968 551 1757 2535 2731 2214 1176
2664 1176 26 -1428 -2372 -2971 -2737 -1588 -373 1010 2065 2705 2631 1946 699 -431 -1691 -2448 -2739
2681 -2739 -2350 -1375 -133 1239 2302 2604 2582 1708 385 -851 -2101 -2521 -2793 -2185 -735 554 1794
$$ packed form
2563A043j527j027j211k83L60J094J845J007J328L38l09p72j474j360j190o71
2579b809n5N89J259J539J260R65L70n28j091j474j574r60m21J93J104J108J315
2596G90J495N09J86j030j141j328j335r82j9J86J270J486J206J302L48l98o72
2613A873j403j531j053q28J05P00J086J512J088J075L81p04r74j355j593j006
2629b627l93L62Q80J312J478J077P72k50m55j319j275j312j045j06O02J196J076
2646b7J439Q85O04l51j031j187j326j110n53p8O56J111J519J206P78J96n17j038
2664A176j150j454r44n99K34J149J215J383J055O40p4o85j247j130j260p57k91
2681b739L89R75J242J372J063L02k2q74j323j236j250m20k72O08J450J289J240
$$ plain form
2698 1794 2641 2689 2251 993 -205 -1477 -2139 -2786 -2386 -1386 -198 946 2026 2611 2685 1857 830 -432
2716 -432 -1660 -2346 -2720 -2207 -1210 98 1339 2139 2645 2314 1543 492 -755 -2071 -2565 -2387 -1877 -562
2734 -562 328 1818 2425 2435 2077 1151 -475 -1509 -2047 -2392 -1955 -1306 -221 920 2026 2366 2293 1832 728
2753 728 -436 -1655 -2457 -2553 -2036 -1058 161 1281 2224 2600 2221 1371 245 -933 -1874 -2423 -2625 -1726
2771 -1726 -885 466 1601 2289 2368 2081 931 -154 -1513 -2341 -2418 -2279 -1534 -397 802 1662 2440 2505
2789 2505 1703 555 -617 -1639 -2211 -2374 -1984 -970 136 1321 2138 2228 2137 1434 185 -1022 -1808 -2358
2807 -2358 -2346 -1537 -515 524 1491 2403 2444 2107 955 -127 -1392 -2120 -2324 -2214 -1295 -258 937 1783
2825 1783 2195 2244 1634 712 -495 -1625 -2270 -2310 -1882 -1308 348 1350 2009 2222 2145 1283 -75 -957 -1595
$$ packed form
2698A794Q47M8m38j258j198j272o62o47M00J000J188J144J080N85P4q28j027j262
2716d32j228o86l74N13R97J308J241Q00N06l31p71j051j247j316m94J78N10J315
2734e62Q90J490O07J0l58r26j626j034n38l45M37O49J085J141J106L40p3m61j104
2753G28j164j219q02r6N17R78J219J120R43L76l79q50j126j178r41n49k02Q99
2771a726Q41J351J135O88P9k87j150j085j359q28p7J39P45J137J199Q60P78O5
2789B505q02j148j172j022n72j63L90J014J106J185Q17R0r1p03j249j207p86n50
2807b358J2Q09J022J039R67R12M1l37j152j082j265p28k04J10R19J037J195Q46
2825A783M12M9o10r22j207j130o45m0M28N74J656J002O59K13p7q62j358q82o38
$$ plain form
2844 -1595 -2096 -2262 -1441 -668 632 1505 2357 2148 1605 860 -162 -1133 -2065 -2339 -1876 -1315 -140 733 1794
2863 1794 2397 2121 1485 489 -676 -1526 -2153 -2200 -1837 -883 183 1409 1891 1998 2099 1168 219 -995 -1832
2882 -1832 -2073 -1988 -1582 -351 435 1642 1914 2131 1718 934 -80 -1306 -1837 -2317 -1950 -1075 113 939
2900 939 1845 2162 2211 1472 487 -639 -1439 -1963 -2197 -1726 -992 148 1196 2025 2295 1781 898 152 -988
2919 -988 -1788 -2172 -2093 -1335 -518 542 1505 2110 1850 1586 753 -121 -1231 -1863 -2148 -1799 -1177 -232 979
2938 979 1753 2228 1842 1326 328 -702 -1351 -1781 -2025 -1477 -1068 357 1158 2059 2317 1923 1311 38 -1107
2957 -1107 -1731 -1992 -2002 -1384 -347 631 1343 1980 1933 1694 587 44 -1129 -1693 -1920 -1665 -1093 -83 779
2976 779 1687 1975 1876 1389 355 -491 -1226 -1974 -2004 -1622 -665 104 1025 1884 2064 1584 904 -4 -862 -1590
$$ packed form
2844a595n01j66Q21P73J300Q73Q52k09n43p45j022r71r32k74M63N61J175Q73J061
2863A794O03k76o36r96j165q50o27m7L63R54J066J226M82J07J01r31r49j214q37
2882a832k41Q5M06J231P86J207K72K17m13p84j014j226n31m80L67Q75J188Q26
2900I39R06L17M9p39r85j126q00n24k34M71P34J140J048Q29K70n14q83p46j140
2919i88q00l84P9P58Q17J060R63O05k60k64q33q74j110o32k85L49O22R45J211
2938I79P74M75l86n16r98j030o49m30k44N48M09J425Q01R01K58l94o12j273j145
2957a107o24k61j0O18J037R78P12O37m7k39j107n43j173n64k27K55N72J010Q62
2976G79R08K88r9m87j034q46p35p48l0L82R57P69R21Q59J80m80o80r08q58p28
$$ plain form
2996 -1590 -1858 -1952 -1396 -565 655 1321 1675 1945 1657 806 -289 -955 -1740 -2013 -1772 -991 94 720 1673
3015 1673 1793 1458 1050 529 -405 -1255 -1942 -1847 -1405 -760 170 815 1807 1956 1676 989 67 -788 -1382 -1820
3035 -1820 -1915 -1331 -486 480 1193 1752 2014 1544 873 -321 -969 -1832 -1964 -1480 -858 -64 875 1605 1671 1745
3055 1745 1191 376 -539 -1163 -1710 -1888 -1335 -769 249 1076 1675 1861 1587 993 295 -926 -1535 -1724 -1647
3074 -1647 -1022 -426 612 1104 1670 1594 1436 959 -384 -902 -1572 -1641 -1646 -905 -162 855 1477 1633 1579 1213
3094 1213 386 -472 -1271 -1647 -1591 -1295 -522 278 795 1610 1789 1344 895 168 -435 -1244 -1583 -1625 -1110 -242
3114 -242 631 1037 1575 1682 1258 672 -93 -952 -1317 -1804 -1325 -822 -162 736 1261 1498 1453 1217 452 -210
3134 -210 -989 -1558 -1728 -1129 -687 303 1042 1414 1886 1361 786 202 -785 -1294 -1484 -1485 -1003 -267 603 975 1555
$$ packed form
2996a590k68r4N56Q31J220O66L54K70k88q51j095o66p85k73K41P81J085O26R53
3015A673J20l35m08n21r34q50o87R5M42O45R30O45R92J49k80o87r22q55n94m38
3035a820r5N84Q45R66P13N59K62m70o71j194o48q63j32M84O22P94R39P30O6P4
3055A745n54q15r15o24n47j78N53N66J018Q27N99J86k74n94o98j221o09j89P7
3074a647O25N96J038M92N66p6j58m77j343n18o70o9nP41P43J017O22J56n4l66
3094A213q27q58p99l76N6K96P73Q00N17Q15J79m45m49p27o03q09l39m2N15Q68
3114b42Q73M06N38J07m24n86p65q59l65m87M79N03O60Q98N25K37m5k36p65o62
3134b10p79n69j70N99M42R90P39L72M72n25n75n84r87n09j90jM82P36Q70L72N80
$$ plain form
3155 1555 1553 1260 590 -126 -719 -1302 -1569 -1470 -703 -237 551 1152 1614 1519 1200 228 -307 -812 -1473 -1387 -1314 -537
3177 -537 157 840 1333 1551 1292 960 60 -475 -996 -1422 -1436 -1115 -374 381 1055 1390 1430 1320 361 -144 -776
3198 -776 -1273 -1515 -1184 -868 -80 567 1185 1520 1406 907 240 -287 -871 -1568 -1350 -1163 -505 -111 632 1094
3218 1094 1615 1377 782 134 -474 -1293 -1421 -1186 -859 -294 167 906 1448 1480 996 359 -261 -736 -1253 -1452
3238 -1452 -1424 -690 -67 488 1138 1305 1355 933 273 -285 -951 -1473 -1309 -1098 -601 323 926 1290 1391 1004
3258 1004 755 309 -547 -1130 -1196 -1252 -967 -243 250 1226 1165 1321 1171 703 -126 -733 -1317 -1166 -1137 -645 -170
3279 -170 659 1021 1263 1472 868 489 -423 -981 -1228 -1346 -983 -514 174 679 1315 1405 1189 774 89 -628
3299 -628 -975 -1175 -1224 -961 -313 107 804 1245 1290 869 583 -324 -719 -1222 -1394 -1194 -763 -195 487 1154 1494
$$ packed form
3155A555kk93o70p16n93n83k67R9P67M66P88O01M62r5l19r72n35n05o61Q6P3P77
3177e37O94O83M93K18k59l32r00n35n21m26j4L21P41P55O74L35M0j10r59n05o32
3198g76m97k42L31L16P88O47O18L35j14m99o67n27n84o97K18J87O58L94P43M62
3218A094N21k38n95o48o08q19j28K35L27N65M61P39N42L2m84o37o20m75n17j99
3238a452K8P34O23N55O50J67N0m22o60n58o66n22J64K11M97R24O03L64J01l87
3258A004k49m46q56n83o6n6K85P24M93R76o1J56j50m68q29o07n84J51K9M92M75
3279a70Q29L62K42K09o04l79r12n58k47j18L63M69O88N05O36R0k16m15o85p17
3299f28l47k00m9K63O48M20O97M41M5m21k86r07l95n03j72K00M31N68O82O67L40
$$ plain form
3320 1494 1128 986 287 -519 -961 -1074 -1339 -966 -326 131 747 924 1246 956 635 345 -321 -897 -1128 -1350
3340 -1350 -754 -271 195 855 1352 1366 962 596 -284 -726 -914 -1465 -1157 -813 -139 434 957 967 1205 804
3360 804 425 -262 -816 -1026 -1295 -975 -472 -36 414 1116 1191 1093 670 138 -367 -941 -1255 -1362 -1020 -264 351
3381 351 732 1169 1334 1077 508 -42 -592 -1034 -1122 -924 -717 -112 502 998 1232 1231 804 314 -197 -856 -977
3402 -977 -1164 -757 -591 195 722 1028 1172 1076 494 56 -346 -825 -1365 -1143 -861 -252 162 575 1365 1082
3422 1082 934 493 77 -820 -1090 -1083 -919 -704 -553 310 663 1051 1172 809 427 -218 -739 -1199 -1033 -886
3442 -886 -496 148 503 885 1231 936 675 303 -656 -852 -1024 -1221 -854 -344 254 832 1014 1224 769 551
3462 551 -49 -640 -892 -1091 -812 -613 -222 410 812 1000 1082 674 383 -106 -513 -927 -1117 -884 -420 37
$$ packed form
3320A494l66j42o99q06m42j13k65L73O40M57O16J77L22k90l21k90o66n76k31k22
3340a350N96M83M66O60M97J4m04l66q80m42j88n51L08L44O74N73N23J0K38m01
3360H04l79o87n54k10k69L20N03M36M50P02P5r8m23n32n05n74l14j07L42P56O15
3381C51L81M37J65k57n69n50n50m42q8J98K07O05O14M96K34jm27m90n11o59j21
3402i77j87M07J66P86N27L06J44r6n82m38m02m79n40K22K82O09M14M13P90k83
3422A082j48m41m16q97k70PJ64K15J51Q63L53L88J21l63l82o45n21m60J66J47
3442h86L90O44L55L82L46k95k61l72r59j96j72j97L67N10N98N78J82K10m55k18
3462E51o00n91k52j99K79J99L91O32M02J88Q2m08k91m89m07m14j90K33M64M57
$$ plain form
3482 37 620 980 1202 1153 643 200 -420 -1032 -1117 -866 -842 -371 280 677 859 1337 889 411 78 -522 -855
3503 -855 -1024 -811 -752 -33 280 819 933 1034 559 441 -354 -641 -967 -866 -745 -423 62 617 977 1156
3523 1156 980 811 163 -300 -728 -852 -851 -694 -175 94 688 870 986 778 366 32 -361 -914 -906 -1117 -513
3544 -513 131 453 663 1211 903 913 256 -442 -521 -808 -905 -692 -615 -148 280 644 736 809 671 21 -506 -759
3566 -759 -875 -756 -663 -260 185 564 906 850 733 357 133 -362 -625 -941 -918 -494 154 356 524 919 1107
3587 1107 778 357 -70 -860 -857 -813 -767 -355 -95 333 747 790 862 486 160 -202 -664 -641 -777 -838 -258 164
3609 164 547 489 1043 698 447 -122 -314 -725 -862 -837 -541 65 166 869 683 918 620 344 -53 -705 -794
3630 -794 -945 -843 -462 -90 394 646 719 702 614 160 -279 -563 -996 -645 -829 -309 87 621 780 1006 543
$$ packed form
3482C7N83L60K22m9n10m43o20o12q5K51K4M71O51L97J82M78m48m78l33o00l33
3503h55j69K13N9P19L13N39J14J01m75j18p95k87l26J01J21L22M85N55L60J79
3523A156j76j69o48m63m28j24JJ57N19K69N94J82J16k08m12l34l93n53Qk11O04
3544e13O44L22K10N48l08J0o57o98p9k87r7K13P7M67M28L64R2P3j38o50n27k53
3566g59j16J19R3M03M45L79L42n6j17l76k24m95k63l16K3M24O48K02J68L95J88
3587A107l29m21m27p90LM4M6M12K60M28M14M3P2l76l26l62m62K3j36o1N80M22
3609A64L83n8N54l45k51n69j92m11j37K5K96O06J01P03j86K35k98k76l97o52q9
3630g94j51J02L81L72M84K52P3j7q8m54m39k84m33L51j84N20L96N34J59K26m63
$$ plain form
3651 543 282 -93 -297 -697 -813 -885 -467 -180 392 368 778 968 586 295 -260 -580 -679 -836 -610 -302 46
3672 46 338 597 625 710 593 19 -170 -549 -738 -765 -545 -272 14 535 665 717 508 220 200 -435 -599 -744
3694 -744 -517 -618 -305 414 552 714 779 593 344 -125 -492 -766 -1007 -638 -507 42 372 637 955 732
3714 732 606 213 -78 -669 -856 -776 -749 -271 184 613 575 734 642 371 -209 -295 -880 -778 -732 -656 -318 216
3736 216 589 748 626 393 231 -54 -318 -573 -668 -606 -285 151 236 356 838 565 382 13 -189 -432 -577
3757 -577 -733 -619 -120 150 367 692 824 445 112 217 -261 -603 -778 -784 -290 27 300 584 648 630 345
3778 345 250 -150 -632 -572 -584 -643 -532 -2 541 656 757 595 449 171 -320 -335 -598 -751 -391 -312 98 394
3800 394 778 946 459 383 56 -334 -453 -510 -699 -499 33 154 625 527 646 573 244 -101 -456 -629 -734
$$ packed form
3651E43k61l75k04m00j16p2M18K87N72k4M10J90l82k91n55l20r9j57K26L08L48
3672D6K92K59K8Q5j17n74j89l79j89k7K20K73K86N21J30N2k09k88k0o35j64j45
3694g44K27j01L13P19J38J62O5j86k49m69l67k74k41L69J31N49L30K65L18k23
3714G32j26l93k91n91j87Q0K7M78M55M29l8J59r2k71n80q6n85J02M6P6L38N34
3736B16L73J59j22k33j62k85k64k55r5O2L21M36Q5J20M82k73j83l69k02k43j45
3757e77j56J14M99K70K17L25J32l79l33J05m78l42j75oM94L17K73K84O4j8k85
3778C45r5m00m82O0j2n9J11N30N43J15J01j62j46k78m91j5k63j53L60P9M10K96
3800C94L84J68m87p6l27l90j19n7j89K00N32J21M71r8J19p3l29l45l55j73j05
$$ plain form
3821 -734 -835 -179 -72 424 723 875 422 497 172 -413 -475 -631 -761 -663 -225 218 649 626 610 475 295 -24
3843 -24 -441 -556 -928 -601 -587 -123 243 409 691 580 438 23 -201 -535 -756 -636 -324 -94 55 378 587
3864 587 644 612 103 -8 -156 -502 -752 -466 -448 -196 299 357 571 777 749 236 -8 -368 -506 -588 -678 -270
3886 -270 -198 191 515 696 743 468 310 -19 -635 -659 -486 -624 -374 58 329 692 469 512 452 125 -160 -529
3908 -529 -733 -559 -448 -217 159 439 543 481 402 194 91 -366 -425 -589 -688 -373 -312 75 523 402 452 454 211
3931 211 -216 -325 -609 -736 -406 -310 309 496 823 565 243 270 188 -311 -515 -710 -586 -545 -332 309 380 440
3953 440 644 495 356 13 -408 -639 -779 -404 -406 47 203 316 704 583 511 140 -255 -353 -519 -568 -690 -246
3975 -246 -25 444 592 701 597 390 -35 -180 -432 -576 -480 -485 -122 187 427 650 574 382 361 26 -207 -618
$$ packed form
3821g34j01O56J07M96K99J52m53P5l25n85o2j56j30R8M38M43M31k3j6j35j80l19
3843b4m17j15l72L27J4M64L66J66K82j11j42m15k24l34k21J20L12K30J49L23K09
3864E87N7l2n09j11j48l46k50K86J8K52M95N8K14K06k8n13k44l60j38q2r0M08
3886b70P2L89L24J81M7k75j58l29o16k4J73j38K50M32K71L63k23M3o0l27k85l69
3908e29k04J74J11K31L76K80J04o2p9k08j03m57n9j64r9L15O1L87M48j21N0Kk43
3931B11m27j09k84j27L30R6O19J87L27k58l22K7q2m99k04j95J24M1K13O41P1O0
3953D40K04j49j39l43m21k31j40L75kM53J56J13L88j21p2l71l95r8j66m9j22M44
3975b46K21M69J48J09j04k07m25j45k52j44R6nL63L09K40K23p6j92k1l35k33m11
$$ plain form
3997 -618 -642 -772 -380 -122 245 434 578 497 393 199 -47 -386 -503 -430 -550 -361 88 409 508 697 447
4018 447 227 18 -382 -386 -543 -572 -496 -178 173 54 711 387 559 198 -109 -491 -346 -523 -589 -316 -284 73
4040 73 314 506 488 405 268 -166 -438 -780 -541 -228 -335 -135 422 578 678 459 325 13 39 -243 -512
4061 -512 -483 -193 -105 166 329 630 571 266 139 34 -130 -637 -636 -551 -565 -99 165 300 698 557 330 193
4083 193 -125 -291 -541 -250 -501 -224 126 242 323 441 331 230 220 -66 -443 -667 -490 -508 -157 186 366
4104 366 519 748 481 198 -22 -312 -443 -452 -541 -234 -376 18 564 448 379 367 -5 -182 -358 -344 -595 -392
4126 -392 -150 -1 391 415 476 535 491 145 -392 -469 -599 -502 -301 -120 209 290 392 468 385 -9 132 -316 -549
4149 -549 -529 -334 -353 -219 306 434 361 367 233 161 -43 -338 -443 -494 -370 -328 -149 74 419 569 532 313 -1
$$ packed form
3997f18k4j30L92K58L67J89J44q1j04j94k46l39j17P3j20J89M49L21R9J89k50
4018D47k20k09m00mj57k9P6L18L51j19O57l24J72l61l07l82J45j77o6K73L2L57
4040G3K41J92j8q3j37m34k72l42K39L13j07K00N57J56J00k19j34l12K6k82k69
4061e12K9K90Q8K71J63L01n9l05j27j05j64n07JQ5j4M66K64J35L98j41k27j37
4083A93l18j66k50K91k51K77L50J16Q1J18j10j01j0k86l77k24J77j8L51L43J80
4104C66J53K29k67k83k20k90j31rq9L07j42L94N46j16o9j2l72j77j76J4k51K03
4126c92K42J49L92K4O1N9m4l46n37p7j30R7K01J81L29Q1J02P6q3l94J41m48k33
4149e49K0J95j9J34N25J28p3Oj34p2k04k95j05n1J24M2J79K23L45J50l7k19l14
$$ plain form
4172 -1 -252 -367 -477 -411 -315 -66 134 466 439 509 577 180 106 -290 -447 -448 -446 -284 -75 321 410 297 509 447 70
4197 70 26 -325 -331 -536 -422 -313 224 148 189 654 539 314 158 -104 -356 -390 -463 -300 -80 181 126 460 327
4220 327 279 3 88 -238 -372 -683 -300 -347 -62 88 176 570 322 305 -6 -94 -92 -407 -424 -249 -227 35 268
4243 268 400 404 569 419 239 -210 -236 -434 -506 -223 -139 -91 122 621 489 164 97 -10 -377 -359 -450 -609 -286
4266 -286 1 406 400 396 364 284 188 -185 -284 -375 -405 -379 -169 41 239 268 517 423 310 -37 -49 -314 -397 -492 -294
4291 -294 -259 53 387 521 371 589 453 37 -228 -377 -344 -237 -473 100 57 9 259 329 368 67 -75 -180
4313 -180 -458 -729 -394 -150 -74 170 352 217 476 246 241 57 -498 -173 -358 -341 -71 246 301 94 328 350
4335 350 344 42 -283 -278 -367 -369 40 -135 303 155 343 276 466 316 -48 90 -263 -636 -342 -245 184 156 294
$$ packed form
4172ak51j15j10O6R6K49K00L32k7P0O8l97p4l96j57jKJ62K09L96Q9j13K12o2l77
4197G0m4l51ok05J14J09N37p6M1M65j15k25j56k62k52l4p3J63K20K61n5L34j33
4220C27m8k76Q5l26j34l11L83m7K85J50Q8L94k48j7l11q8Kl15j7J75K2K62K33
4243B68J32MJ65j50j80m49k6j98p2K83Q4M8K13M99j32l25o7j07l67J8r1j59L23
4266b86K87M05oml2q0r6l73r9r1l0K6K10K10J98K9K49r4j13l47j2k65q3r5J98
4291b94L5L12L34J34j50K18j36m16k65j49L3J07k36N73m3m8K50P0L9l01j42j05
4313a80k78k71L35K44P6K44J82j35K59k30nj84n55L25j85J7K70L17N5k07K34K2
4335C50ol02l25Nq9kM09j75M38j48J88o7J90j50l64J38l53l73K94R7M29k8J38
$$ plain form
4358 294 312 12 200 265 -150 -328 -478 -359 -421 -32 371 134 380 456 509 215 -121 -89 -406 -236 -309 -166
4380 -166 -233 -50 396 272 454 451 -19 -53 -263 -380 -527 -386 -215 148 114 204 417 271 349 -6 -86 -225 -385
4403 -385 -320 -218 -115 85 155 40 463 123 78 132 -255 -201 -434 -350 -261 -126 158 216 248 224 153 8 85 -57
4427 -57 -301 -306 -475 41 -4 162 352 357 338 219 42 -144 -148 -363 -365 -295 -395 63 305 339 237 129 452 -87
4451 -87 -21 28 -354 -380 -298 116 -43 219 312 67 166 98 79 -289 -75 -367 -217 -195 -21 75 286 235 389 221
4475 221 -32 -324 -284 -326 -381 -285 -216 181 308 331 193 66 299 42 -175 -378 -546 -356 -281 -163 154 361
4497 361 361 336 195 82 -36 -122 -264 -196 -237 51 45 54 196 309 157 363 174 0 -179 -127 -180 -314 -47 -54 120
4522 120 324 322 233 -74 90 -155 -144 -124 -400 22 -89 -15 169 -16 255 60 117 -61 -143 -56 -284 -190 -244 62
$$ packed form
4358B94J8l00J88O5m15j78j50J19o2L89M03k37K46P6N3k94l36L2l17J70p3J43
4380a66o7J83M46j24J82lm70l4k10j17j47J41J71L63l4R0K13j46P8l55q0j39j60
4403c85O5J02J03K00P0j15M23l40m5N4l87N4k33Q4Q9J35K84N8L2k4p1j45P7j42
4427e7k44nj69N16m5J66J90Nj9j19j77j86mk15kP0j00M58K42L4j02j08L23n39
4451h7O6M9l82k6Q2M14j59K62R3k45R9o8j9l68K14k92J50K2J74R6K11n1J54j68
4475B21k53k92M0m2n5R6O9L97J27K3j38j27K33k57k17k03j68J90P5J18L17K07
4497C61%k5j41j13j18q6j42O8m1K88oRJ42J13j52K06j89j74j79N2n3j34K67pJ74
4522A20K04kq9l07J64k45J1K0k76M22j11P4J84j85K71j95N7j78q2Q7k28R4n4L06
$$ plain form
4546 62 125 170 168 380 22 261 76 -211 -228 -291 -367 155 108 130 290 186 234 138 -138 -97 -93 -257 -234 -115 45
4571 45 -31 250 280 128 380 -43 -138 -259 -213 -249 -214 -116 8 62 228 47 214 135 32 78 -173 -235 -335 -302
4595 -302 -117 152 -6 249 201 223 270 90 40 -128 -283 -10 184 -160 -99 206 229 53 254 -37 -189 -165
4617 -165 -239 -121 -348 -199 218 316 85 209 249 -25 -4 -182 -55 -202 -213 -291 -183 163 81 271 85 183 343
4640 343 -4 -140 -218 -206 -380 -289 -198 121 169 -143 65 -15 225 -72 -5 -313 -154 -149 -153 156 51 212 308 447
4664 447 165 -8 -194 -173 -176 -300 -223 -185 61 -139 80 159 276 79 111 -197 -170 -161 -5 102 -388 -44 204
4687 204 382 318 314 21 39 14 -186 -232 -208 -213 62 80 113 83 199 136 -57 148 -5 -294 -137 -123 -73 67 2
4712 2 -38 204 208 127 -100 69 -200 -192 -2 -170 -373 -76 81 57 386 239 -7 122 5 -225 -211 -308 -382 -169
$$ packed form
4546F2O3M5kK12l58K39j85k87j7o3p6N22m7K2J60j04M8r6k76M1Mj64K3J19J60
4571D5p6K81L0j52K52m23r5j21M6l6L5R8J24N4J66j81J67p9j03M6k51o2j00L3
4595c02J85K69j58K55m8K2M7j80n0j68j55K73J94l44O1L05K3j76K01k91j52K4
4617a65p4J18k27J49M17R8k31J24M0k74K1j78J27j47j1p8J08L46q2J90j86R8J60
4640C43l47j36p8J2j74R1R1L19M8l12K08q0K40k97O7l08J59NmL09j05J61R6J39
4664D47k82j73j86K1lj24P7L8K46k00K19P9J17j97L2l08K7RJ56J07m90L44K48
4687B04J78o4mk93J8k5k00m6K4nK75J8L3l0J16o3j93K05j53k89J57J4N0J40o5
4712Bm0K42Mq1k27J69k69QJ90j68k03K97J57k4L29j47k46J29j17k30J4r7p4K13
$$ plain form
4736 -169 -122 99 85 51 31 58 223 -22 -66 -194 -266 -58 -214 -14 -40 131 198 46 202 68 -80 -407 -241
4759 -241 -227 -38 -53 33 46 116 224 41 28 -52 -7 -173 -280 -328 -168 142 35 120 234 257 280 70 -16 -32 18
4784 18 -196 -127 100 -227 -8 488 20 117 195 -55 -97 -153 134 -120 131 -203 114 -6 108 114 76 30 62 -34
4808 -34 -186 -104 -236 44 -147 15 -35 106 261 173 80 145 -7 -120 -31 -333 -234 -163 -39 128 248 21 293
4831 293 -197 137 -29 52 -116 -96 67 -95 358 28 -17 75 -13 -96 -26 -68 -118 -259 -274 -115 -173 67 -81 196
4855 196 127 -39 -99 1 -141 -143 -208 -120 127 -124 86 226 22 232 109 -47 -18 -33 -56 -179 6 22 -43 25
4879 25 132 221 37 81 -33 202 -14 -59 -60 -41 105 176 365 203 38 13 28 -89 -133 114 -233 -46 168 -100
4903 -100 -94 -3 191 -18 62 -51 -19 -206 -56 -131 -1 -18 -6 27 234 73 322 166 29 280 -109 125 -139
$$ packed form
4736a69M7K21j4l4k0K7J65k45m4j28p2K08j56K00k6J71O7j52J56j34j48l27J66
4759b41J4J89j5Q6J3P0J08j83j3q0M5j66j07m8J60L10j07Q5J14K3K3k10q6j6N0
4784A8k14O9K27l27K19M96m68R7P8k50m2n6K87k54K51l34L17j20J14Ol8m6L2r6
4808c4j52Q2j32K80j91J62n0J41J55q8r3O5j52j13Q9l02R9P1J24J67J20k27K72
4831B93m90L34j66Q1j68K0J63j62M53l30m5R2q8q3P0m2n0j41j5J59n8K40j48K77
4855A96o9j66o0J00j42ko5Q8K47k51K10J40k04K10j23j56K9j5k3j23J85J6o5O8
4879B5J07Q9j84M4j14K35k16m5jJ9J46P1J89j62j65k5J5j17m4K47l47J87K14k68
4903a00OR1J94k09Q0j13L2j87J50p5J30j7J2L3K07j61K49j56j37K51l89K34k64
$$ plain form
4926 -139 -425 -48 183 -11 454 271 156 5 -53 -154 41 15 -400 -92 51 133 -30 28 172 -48 311
4947 311 18 -183 -154 -368 -68 -115 69 171 148 51 185 92 107 124 -176 -278 -178 -396 119 5 68 307 110
4970 110 50 190 244 -30 -26 -159 -176 -143 -29 -169 -161 151 69 39 -66 46 -157 -60 52 -314 -121 -64 81 123
4994 123 159 97 -62 47 -168 38 -163 -107 -211 -121 164 196 134 158 1 41 -146 -2 -96 -201 -46 -32 96
5017 96 213 -130 -33 179 281 125 45 -34 -28 -18 -197 -291 100 28 -46 57 64 95 80 235 -246 -239 -256 -377 -57 -31
5043 -31 80 178 50 22 1 133 22 -62 -118 -169 -135 -250 -11 120 278 33 436 71 -126 98 -134 -132 -27
5066 -27 -367 -32 43 8 287 449 2 163 191 2 -229 -204 -165 -124 -43 -24 62 96 179 363 89 -5 -218 -229 -250
5091 -250 -189 -174 -226 44 42 258 183 100 67 -18 -132 19 -52 -81 -29 -79 -57 243 87 296 208 -82 -145 -294 -231 -238
$$ packed form
4926a39k86L77K31j94M65j83j15j51n8j01J95k6m15L08J43Q2j63N8J44k20L59
4947C11k93k01K9k14L00m7J84J02k3r7J34r3J5J7l00j02J00k18N15j14O3K39j97
4970A10o0J40N4k74Mj33j7L3J14j40QL12q2l0j05J12k03R7J12l66J93N7J45M2
4994A23L6o2j59J09k15K06k01N6j04R0K85L2o2K4j57M0j87J44r4j05J55J4J28
5017I6J17l43R7K12J02j56q0p9OJ0j79r4L91p2p4J03PL1j5J55m81Pj7j21L20K6
5043c1J11R8j28k8k1J32j11q4n6n1L4j15K39J31J58k45M03l65j97K24k32KJ05
5066b7l40L35P5l5K79J62m47J61K8j89k31K5L9M1Q1J9Q6L4Q3J84k74r4k13j1k1
5091b50O1J5n2K70kK16p5q3l3q5j14J51p1k9N2n0K2L00j56K09q8k90o3j49O3p
$$ plain form
5117 -238 -184 -204 59 85 192 196 278 -147 80 -52 -70 -304 -284 47 107 51 112 205 213 223 270 113 -321 -127 -205 -158
5143 -158 -77 371 -58 34 44 264 123 477 -100 -82 24 -208 39 -99 98 49 199 239 270 110 -10 -180
5165 -180 -192 -183 -217 -185 -247 -31 139 123 350 338 254 -25 -206 -1 -398 -206 -23 -59 174 129 190 187 367 79 -45
5190 -45 -442 81 -229 -201 -166 63 -15 113 195 287 130 11 51 63 -185 -241 -203 -126 111 126 88 159 136 -106 30
5215 30 -22 -75 -258 -51 -290 -94 83 -86 152 224 378 146 -39 -55 -143 -258 -406 -352 -219 102 213 188 87
5238 87 264 254 80 -149 -268 -381 -190 -118 -22 47 211 292 -117 95 123 -31 -303 -60 -130 -272 -199 90 319
5261 319 259 -3 -48 108 -101 -214 -251 -10 -180 -106 -23 -176 79 333 235 110 39 -6 -220 -425 -378 -62 -39
5284 -39 -41 307 362 121 132 199 -36 -162 -78 -217 -164 -284 22 83 298 102 198 427 -116 -42 -230 -184 -334 -227
$$ packed form
5117b38N4k0K63K6J07MQ2m25K27j32j8k34K0L31O0n6O1R3QJ0M7j57m34J94p8M7
5143a58Q1M48m29R2J0K20j41L54n77J8J06k32K47j38J97m9J50M0L1j60j20j70
5165a80j2Rl4L2o2K16J70j6K27j2q4k79j81K05l97J92J83l6K33m5O1lJ80k88j24
5190d5l97N23l10K8L5K29p8J28Q2R2j57j19M0J2k48n6L8P7K37J5l8P1k3k42J36
5215C0n2n3j83K07k39J96J77j69K38P2J54k32j85j6q8j15j48N4J33L21J11k5j01
5238H7J77j0j74k29j19j13J91P2R6O9J64Q1m09K12K8j54k72K43p0j42P3K89K29
5261C19o0k62m5J56k09j13l7K41j70P4Q3j53K55K54r8j25p1m5k14k05M7L16K3
5284c9kL48N5k41J1O7k35j26Q4j39N3j20L06O1K15j96R6K29n43P4j88M6j50J07
$$ plain form
5308 -227 65 17 136 307 441 94 138 166 -257 -360 -449 -162 -202 -343 115 152 59 321 265 332 -75 28 -53
5331 -53 -217 -400 -214 -127 90 255 332 241 70 7 60 -10 -76 -225 -122 -73 77 -14 70 124 400 157 57 -96
5355 -96 58 -48 -313 -250 -206 111 62 222 168 69 -215 8 41 -145 -214 -276 -364 163 242 99 210 232 175 339
5379 339 -186 -243 -129 -239 -105 -69 -128 96 234 93 75 134 177 -102 -284 -410 -229 -212 -8 -56 259 177 356
5402 356 319 77 -67 -201 -285 -371 -255 -154 -189 196 357 391 96 204 113 -221 -227 -184 -328 -328 -89 -112 92 246
5426 246 342 116 387 -51 -145 -183 -174 -148 -221 27 -7 58 252 188 523 200 94 93 -148 -300 -299 -214 -249 -68 159
5451 159 225 204 308 146 212 -305 -276 -413 -371 -203 113 75 76 241 45 204 126 -150 -181 -250 -305 -241 -167 226 286
5476 286 197 359 55 313 -110 -118 -283 -247 -214 -109 109 222 211 327 405 328 -48 -200 -186 -282 -368 -214 -91 33
$$ packed form
5308b27K92m8J19J71J34l47M4K8m23j03q9K87m0j41M58L7r3K62n6O7m07J03q1
5331e3j64j83J86Q7K17J65P7r1j71o3N3p0o6j49J03M9J50r1Q4N4K76k43j00j53
5355i6J54j06k65O3M4L17m9J60n4r9k84K23L3j86o9o2q8N27P9j43J11K2n7J64
5379C39n25n7J14j10J34L6n9K24J38j41j8N9M3k79j82j26J81J7K04m8L15q2J79
5402C56l7k42j44j34q4q6J16J01l5L85J61L4k95J08r1l34oM3j44%K39k3K04J54
5426B46R6k26K71m38r4l8RK6p3K48l4O5J94o4L35l23j06jk41j52JQ5l5J81K27
5451A59O6k1J04j62O6n17K9j37M2J68L16l8JJ65j96J59p8k76l1o9n5O4P4L93O0
5476B86q9J62l04K58m23qj65L6L3J05K18J13j1J16P8p7l76j52J4r6q6J54J23J24
$$ plain form
5500 33 92 396 321 264 258 31 -44 -197 -549 -408 -414 -157 -30 155 256 258 344 7 -136 -88 -173 -584 -310 -368 -165
5525 -165 -51 158 232 315 157 153 -10 -332 -194 -250 -284 -208 84 292 157 257 286 178 137 -199 -181 -279 -95 -288
5549 -288 -198 -41 23 175 411 307 433 -110 -400 -60 -448 -252 -231 -157 141 224 404 560 129 70 45 -166
5571 -166 -228 -326 -462 -177 -13 83 382 449 253 383 -17 -118 -310 -277 -423 -214 -259 200 35 287 260 200 227
5594 227 42 -149 -408 -358 -400 -102 -138 -42 278 501 228 158 -32 -156 -183 -189 -417 -438 -183 225 184 289 267 352
5618 352 -54 106 -90 -242 -199 -469 -277 102 71 132 253 157 226 203 5 -385 -254 -464 -396 -272 -191 58 325
5641 325 435 411 406 0 1 -254 -241 -72 -278 -200 160 81 316 356 517 233 121 -216 3 -208 -334 -358 -275 205
5665 205 -85 434 380 283 354 39 -87 -296 -203 -312 -150 172 25 262 369 444 215 5 -150 -217 -347 -444
$$ packed form
5500C3N9L04p5n7ok27p5j53l52J41oK57J27J85J01KQ6l37j43M8q5m11K74n8K03
5525a65J14K09P4Q3j58mj63l22J38n6l4P6K92K08j35J00K9j08m1l36J8r8J84j93
5549b88R0J57O4J52K36j04J26n43k90L40l88J96K1P4K98Q3J80J56m31n9k5k11
5571a66o2r8j36K85J64R6K99O7j96J30m00j01j92L3j46K09m5M59j65K52k7o0K7
5594B27j85j91k59N0m2K98l6R6L20K23k73p0j90j24k7ok28k1K55M08m1J05k2Q5
5618C52m06J60j96j52M3k70J92L79l1O1J21r6O9k3j98l90J31k10O8J24Q1K49K67
5641C25J10k4nm06Jk55J3J69k06P8L60p9K35M0J61k84j12l37K19k11j26k4Q3M80
5665B05k90N19n4r7P1l15j26k09R3j09J62L22j47K37J07P5k29k10j55o7j30r7
$$ plain form
5687 -444 -287 -140 185 107 288 491 163 402 -95 -11 -177 -498 -236 -246 -269 95 381 170 198 80 307 -9
5709 -9 -367 -332 -267 -169 -188 -74 99 162 72 325 298 164 136 -224 -198 -397 -375 -285 66 113 141 438 302 138 134 -177
5735 -177 -116 -170 -155 -171 -4 122 150 512 388 99 217 150 -155 -264 -360 -113 -218 -65 204 245 227 293 408
5758 408 15 -78 99 -327 -217 -327 -131 -148 -60 397 221 396 163 174 -46 -148 -466 -275 -217 67 81 150
5780 150 196 305 427 512 -138 -63 -117 -127 -317 -277 -25 291 553 242 268 229 16 -88 -238 -432 -301 -378 -242
5803 -242 -187 114 268 162 176 159 109 -64 -206 -380 -383 -228 -159 137 103 228 137 258 -88 -48 -253 -174 -256 -381
5827 -381 -244 -158 182 252 523 330 215 217 -66 -250 -191 -176 -309 -105 166 219 328 226 329 183 -123 -47 -241
5850 -241 -361 -315 -219 -135 253 92 257 493 213 35 -182 -196 -108 -282 -329 -162 -59 72 210 288 221 189 140
$$ packed form
5687d44J57J47L25p8J81K03l28K39m97Q4j66l21K62j0k3L64K86k11K8j18K27l16
5709il58L5O5R8j9J14J73O3r0K53k7j34k8l60K6j99K2R0L51M7K8K97j36j64ml11
5735a77O1n4J5j6J67J26K8L62j24k89J18o7l05j09r6K47j05J53K69M1j8O6J15
5758D08l93r3J77m26J10j10J96j7Q8M57j76J75k33J1k20j02l18J91N8K84J4O9
5780A50M6J09J22Q5o50P5n4j0j90M0K52L16K62l11K6l9k13j04j50j94J31p7J36
5803b42N5L01J54j06J4j7n0j73j42j74lJ55O9K96l4J25r1J21l46M0k05P9q2j25
5827c81J37Q6L40P0K71j93j15Kk83j84N9J5j33K04K71N3J09j02J03j46l06P6j94
5850b41j20M6R6Q4L88j61J65K36k80j78k17j4Q8j74m7J67J03J31J38P8o7l2m9
$$ plain form
5873 140 -86 -32 -320 -275 -333 -299 -176 143 126 237 177 153 156 22 -246 -501 -137 -356 -98 28 303 390 187
5896 187 349 157 -171 -55 -236 -459 -376 -53 -32 144 316 405 265 72 117 -239 -129 -199 -303 -421 -130 -141
5918 -141 260 417 319 255 200 137 -340 -253 -341 -444 -304 -270 -16 142 281 397 295 243 -129 -256 -399 -324 -295
5941 -295 -146 -109 251 296 351 371 194 176 -47 -182 -340 -336 -142 -277 -101 211 289 249 396 155 43 -150 -69
5964 -69 -292 -399 -166 -54 318 179 463 262 270 56 70 -279 -253 -401 -310 16 -186 187 221 67 304 289 -93
5987 -93 104 -328 -392 -88 -132 -239 -5 71 157 444 58 35 -130 -12 -294 -421 -436 -225 -153 207 167 283 406
6010 406 191 303 -98 -105 -214 -201 -376 -350 -12 -47 132 362 544 568 173 72 -199 -259 -213 -132 -58 23 302 183
6034 183 237 465 194 154 -118 -173 -21 -423 -196 -191 -10 273 317 384 184 152 -137 -164 -416 -223 -299 -27 -136
$$ packed form
5873A40k26N4k88M5n8L4J23L19j7J11o0k4Lj34k68k55L64k19K58J26K75Q7k03
5896A87J62j92l28J16j81k23Q3L23K1J76J72Q9j40j93M5l56J10p0j04j18K91j1
5918a41M01J57r8o4n5o3m77Q7q8j03J40L4K54J58J39J16j02n2l72j27j43P5K9
5941b95J49L7L60M5N5K0j77j8k23j35j58MJ94j35J76L12P8m0J47k41j12j93Q1
5964f9k23j07K33J12L72j39K84k01Qk14J4l49K6j48R1L26k02L73L4j54K37j5l82
5987i3J97m32o4L04m4j07K34P6Q6K87l86k3j65J18k82j27j5K11P2L60m0J16J23
6010D06k15J12m01pj09J3j75K6L38l5J79K30J82K4l95j01k71o0M6Q1P4Q1K79j19
6034A83N4K28k71m0k72n5J52m02K27NJ81K83M4O7k00l2k89k7k52J93p6K72j09
$$ plain form
6057 -136 -105 316 384 99 275 -39 -129 -156 -462 -474 -38 41 141 194 312 326 393 29 -43 80 -183 -260 -279 -219
6081 -219 -217 142 178 261 361 198 182 76 -154 -222 -388 -115 -91 42 293 299 174 241 271 113 -242 -225 -371 -206
6105 -206 -221 -156 -165 72 603 289 257 220 -146 2 -288 -308 -295 -271 -247 41 243 180 429 327 91 -93 -239 -296
6129 -296 -530 -116 -68 -24 183 342 399 200 240 -70 -176 -430 -314 -441 -376 -251 53 170 330 433 269 213
6151 213 -235 -140 -58 -128 -259 -177 -77 178 314 475 410 354 -33 -167 -103 -378 -365 -230 -166 -87 -10 -45 262 165
6175 165 89 5 -59 -300 -327 -292 -157 -109 14 233 438 242 197 244 -129 -180 -334 -143 -103 -208 134 102 233 238
6199 238 431 361 115 -68 -133 -139 -236 -250 3 54 -29 265 145 346 273 112 -99 -371 -361 -277 -263 -219 -31 213
6223 213 251 256 332 111 199 -264 -273 -259 -177 -210 -208 192 253 296 213 394 147 -42 -489 -273 -165 -318 -35 -111 -58 151
$$ packed form
6057a36L1M21O8k85J76l14r0k7l06j2M36P9J00N3J18J4O7l64p2J23k63p7j9O0
6081b19KL59L6Q3J00j63j6j06k30o8j66K73K4J33K51Oj25O7L0j58l55J7j46J65
6105b06j5O5rK37N31l14l2l7l66J48k90k0J3K4K4K88K02o3K49j02k36j84j46n7
6129b96k34M14M8M4K07J59N7j99M0l10j06k54J16j27O5J25L04J17J60J03j64n6
6151B13m48R5Q2p0j31Q2J00K55J36J61o5n6l87j34O4k75J3J35O4P9P7l5L07r7
6175A65p6q4o4k41k7L5J35M8J23K19K05j96m5M7l73n1j54J91M0j05L42l2J31N
6199B38J93p0k46j83o5or7j4K53N1q3K94j20K01p3j61k11k72J0Q4J4M4J88K44
6223B13L8NP6k21Q8m63rJ4Q2l3KM00O1M3q3J81k47j89m47K16J08j53K83p6N3K09
$$ plain form
6249 151 368 176 247 153 -76 -273 -397 -252 -211 -100 -6 15 207 282 334 55 61 -142 -151 -216 -255 -332 -21 -41 414
6274 414 143 173 99 73 72 -263 -176 -437 -170 -134 -202 42 212 428 300 97 15 -24 -207 -515 -214 -172 -118 -7
6298 -7 246 199 98 251 221 87 -190 -166 -195 -342 -45 -274 102 482 229 335 23 99 -23 -266 -250 -191 -357
6321 -357 -81 -123 -42 285 229 302 120 10 -46 -27 -207 -257 -282 -185 -116 335 319 202 217 94 47 -55 -188 -181 -206
6346 -206 -205 11 130 -1 379 389 213 16 -216 -152 -237 -272 -164 -122 21 244 94 244 257 204 -34 -109 -361
6369 -361 -345 -420 -104 123 11 93 256 237 249 243 102 1 -231 -318 -124 -360 2 13 156 257 481 211 188
6392 188 8 -330 -133 -570 -413 -40 54 220 358 271 -85 -45 101 -68 -158 -350 -287 -25 19 -62 307 134
6414 134 232 326 48 32 -35 -220 -317 -208 -117 -68 107 276 351 301 250 178 6 -320 -477 -450 -149 -296 -19 242
$$ packed form
6249A51K17j92P1r4k29j97j24J45M1J11R4K1J92P5N2k79Ok03ro5l9p7L11k0M55
6274D14k71L0p4k6jl35Q7k61K67L6o8K44J70K16j28k03q2l9j83l08L01M2N4J11
6298gK53m7j01J53l0j34k77K4k9j47K97k29L76L80k53J06l12P6j22k43J6N9j66
6321c57K76m2Q1L27n6P3j82j10n6J9j80n0k5R7O9M51j6j17J5j23m7j02j33Pk5
6346b06JK16J19j31L80J0j76j97k32O4q5l5J08M2J43K23j50J50J3n3k38p5k52
6369c61J6p5L16K27j12Q2J63j9J2oj41j01k32q7J94k36L62J1J43J01K24k70k3
6392A88j80l38J97m37J57L73R4J66J38q7l56M0J46j69r0j92O3K62M4q1L69j73
6414A34R8R4k78j6o7j85r7J09R1M9J75J69P5n0n1p2j72l26j57K7L01j47K77K61
$$ plain form
6438 242 175 460 424 204 24 -80 -247 -209 -173 -414 -4 -36 358 306 249 259 -53 74 -102 -131 -222 -199 -277 39
6462 39 53 107 392 228 450 114 -110 -75 -426 -123 -338 -241 45 2 262 67 390 108 174 -98 -221 -163 -314
6485 -314 -380 -35 -119 74 354 240 299 111 105 -269 -215 -221 -306 -342 -226 87 -46 338 177 254 -11 -23 -5 -212
6509 -212 -346 -475 -145 -119 334 117 283 316 70 159 -88 -277 -190 -272 -260 -111 143 22 365 15 331 127
6531 127 33 -110 -218 -351 -259 -216 -22 139 82 176 362 317 -15 -139 -170 -42 -168 -335 -234 87 113 306 188
6554 188 209 364 296 126 -194 -98 -429 -295 71 -182 231 334 302 125 76 -38 -58 -199 -167 -169 -43 -42 -61 288
6578 288 276 306 175 -72 -165 28 -341 -435 -233 -139 0 82 354 248 266 112 269 8 -249 -241 -150 -192 -125 -85
6602 -85 -109 233 171 293 231 -141 -423 -70 -496 -128 -102 -32 19 137 287 78 428 -21 -143 -282 -154 -231 -314
$$ packed form
6438B42o7K85l6k20j80j04j67L8L6k41M10l2L94n2n7J0l12J27j76k9r1K3p8L16
6462C9J4N4K85j64K22l36k24L5l51L03k15R7K86m3K60j95L23k82O6k72j23N8j51
6485c14o6L45q4J93K80j14N9j88ol74N4oq5l6J16L13j33L84j61P7k65j2J8k07
6509b12j34j29L30K6M53k17J66L3k46Q9k47j89Q7q2J2J49K54j21L43l50L16k04
6531A27r4j43j08j33R2M3J94J61n7R4J86m5l32j24l1J28j26j67J01L21K6J93j18
6554A88K1J55o8j70l20R6l31J34L66k53M13J03l2j77m9j14k0j41L2kJ26Jj9L49
6578B88j2L0j31k47r3J93l69r4K02R4J39Q2K72j06J8j54J57k61k57QR1m2O7M0
6602h5k4L42o2J22o2l72k82L53m26L68K6P0N1J18J50k09L50m49j22j39J28p7q3
$$ plain form
6625 -314 -251 57 1 152 122 183 203 -52 -108 -392 -19 -315 -257 11 192 -89 61 315 -12 -41 -20 -74 -129 -221
6649 -221 112 -302 -1 -50 181 345 189 246 14 -143 -160 -78 -119 -294 -140 -82 10 220 178 136 168 33 -150
6672 -150 -132 -223 -297 -12 -36 -3 159 220 150 312 231 45 110 -119 -187 -528 -187 -112 -121 86 152 386 158 1 -60
6697 -60 39 -146 -292 -192 193 -232 -144 230 241 242 65 145 -152 -309 -127 -249 -207 -91 -50 132 308 234 388
6720 388 148 -172 -132 -219 -373 -114 -262 -126 -175 179 272 230 275 136 -11 22 -268 -245 -294 -226 -161 50 360 312
6744 312 433 154 31 -66 -149 -278 -273 -178 -161 -170 14 193 356 127 139 -33 -141 -147 -101 -48 -290 -237 123 94 196
6769 196 178 290 -55 73 -106 -165 -268 -289 116 -36 263 199 234 224 390 -137 104 -49 -154 -174 -404 35
6791 35 -91 346 176 211 187 2 101 -50 -124 -337 -289 -188 -91 -8 238 208 205 154 90 74 -221 -45 -143 -232 -87
$$ packed form
6625c14O3L08n6J51l0O1K0k55n6k84L73k96N8K68J81k81J50K54l27k9K1n4n5r2
6649b21L33m14L01m9K31J64j56N7k32j57j7Q2m1j75J54N8R2K10m2m2L2j35j83
6672a50J8r1p4K85k4L3J62O1p0J62q1j86O5k29o8l41L41P5rK07O6K34k28j57o1
6697f0R9j85j46J00L85m25Q8L74J1Jj77Q0k97j57J82j22M2J16M1J82J76p4J54
6720C88k40l20M0q7j54K59j48J36m9L54R3m2M5j39j47L3k90K3m9O8O5K11L10m8
6744C12J21k79j23r7q3j29NR5J7rJ84J79J63k29J2j72j08oM6N3k42N3L60k9J02
6769A96j8J12l45J28j79n9j03k1M05j52K99o4L5j0J66n27K41j53j05k0k30M39
6791C5j26M37j70L5k4j85R9j51p4k13M8J01R7Q3K46l0ln1o4j6k95J76r8q9J45
$$ plain form
6816 -87 -102 48 439 118 244 374 127 66 -483 -295 21 -96 -200 -6 310 43 299 71 -60 53 -200
6837 -200 -298 -385 -222 -162 -209 8 198 398 334 344 187 37 -177 -392 44 -200 -158 -235 120 346 174 300 292
6860 292 64 71 -49 -219 -407 -147 -101 94 77 47 272 282 255 -103 99 -179 -367 -132 -275 -41 49 342 266
6883 266 428 82 146 94 19 -302 -72 -304 -245 87 226 436 239 345 290 -24 -99 -80 -335 -434 -55 -203 193
6906 193 -14 154 75 319 94 43 78 -212 -245 -253 8 -99 -48 69 197 208 233 235 -150 -167 -74 -289 -163 -70 -36
6931 -36 4 326 367 363 522 100 22 -33 -288 -273 -135 -223 -190 69 228 164 437 383 -146 167 -198 -34 -311 -103
6955 -103 -235 -139 202 338 164 281 184 -72 -95 -426 -299 -139 -295 -125 25 58 176 235 88 -65 -149 15
6977 15 -256 -326 -251 -327 -220 -205 108 264 403 244 183 -85 -296 -83 -408 -392 -74 -91 141 201 171 438 98
$$ packed form
6816h7j5J50L91l21J26J30k47o1n49J88L16j17j04J94L16k67K56k28j31J13k53
6837b00r8q7J63O0m7K17J90K00o4J0j57j50k14k15M36k44M2p7L55K26j72J26q
6860B92k28Pj20j70j88K60M6J95j7l0K25J0k7l58K02k78j88K35j43K34R0K93p6
6883B66J62l46O4n2p5l21K30k32N9L32J39K10j97J06n5l14p5J9k55r9L79j48L96
6906A93k07J68p9K44k25n1L5k90l3qK61j07N1J17J28J1K5Kl85j7R3k15J26R3L4
6931c6M0L22M1mJ59m22p8n5k55J5J38q8L3K59J59o4K73n4n29L13l65J64k77K08
6955a03j32R6L41J36j74J17r7k56k3l31J27J60j56J70J50L3J18N9j47j53q4J64
6977A5k71p0P5p6J07J5L13J56J39j59o1k68k11K13l25J6L18j7K32O0l0K67l40
$$ plain form
7000 98 44 165 -313 -127 -223 -230 -36 -150 125 78 369 195 167 -91 181 -348 -89 -200 -129 -125 57 66 227 285
7024 285 283 57 -104 -171 -173 -218 -253 -210 27 111 75 357 146 141 78 -178 -400 -158 -259 -133 -208 -136 -9 380 454
7049 454 208 244 163 -297 -215 -80 -287 47 20 -11 127 314 338 255 180 132 -253 -81 -451 -215 -146 28 -9 156
7073 156 142 232 41 -45 -26 -165 -105 -93 22 -225 97 138 294 281 302 80 -266 -200 -348 -495 -256 -387 167
7096 167 -17 238 442 189 350 36 -59 -218 -170 -128 7 -70 59 0 121 181 284 49 69 -158 -146 -317 -356
7119 -356 -321 95 -21 99 439 214 281 -79 88 8 -136 -227 -87 -114 -280 97 154 139 181 194 206 15 -99
7142 -99 -221 -314 -148 -5 -34 220 226 416 414 104 197 -114 -139 -407 -248 -288 -22 149 266 156 213 189 322 121
7166 121 94 -269 -425 -335 -296 -14 -92 84 338 216 224 -106 57 135 -291 -367 -296 -150 -116 258 388 320 151 246
$$ packed form
7000I8n4J21m78J86r6pJ94j14K75m7K91j74k8k58K72n29K59j11P1MJ82RJ61N8
7024B85kk26j61o7km5l5M3K37Q4l6K82k11no3k56k22K42j01J26p5P2J27L89P4
7049D54k46L6q1m60Q2J35k07L34k7l1J38J87K4q3p5m8l85J72l70K36O9J74l7J65
7073A56j4R0j91q6J9j39O0J2J15k47L22M1J56j3K1k22l46O6j48j47K39j31N54
7096A67j84K55K04k53J61l14r5j59M8M2J35p7J29n9J21O0J03k35K0k27J2j71l9
7119c56L5M16j16J20L40k25O7l60J67q0j44r1J40k7j66L77N7j5M2J3J2j91j14
7142i9j22r3J66J43k9K54OJ90kl10R3l11k5k68J59m0K66J71J17j10N7k4J33k01
7166A21k7l63j56R0L9K82p8J76K54j22Ql30J63P8m26p6P1J46L4L74J30o8j69R5
$$ plain form
7190 246 219 0 -313 -75 -189 -142 -339 -68 273 481 351 104 216 -60 -368 -274 -424 -281 -180 -55 128
7211 128 149 117 330 148 -60 256 -318 -279 -132 -357 -216 56 43 228 340 316 84 147 -216 -40 -143 -477
7233 -477 14 -33 25 325 435 344 155 115 38 -248 -172 -377 -127 -112 -142 18 386 274 319 -14 139 149 -170
7256 -170 -237 -267 89 -291 138 -46 368 360 98 208 -14 101 8 -314 -374 -104 -243 52 159 -45 399 61
7278 61 -64 -143 31 -145 -328 -322 -317 68 271 214 303 215 151 -41 -150 -182 -247 -152 -102 -115 423 297 246 388 163
7303 163 264 220 -145 -156 -168 -268 6 -80 109 71 212 365 93 196 7 -262 -167 -250 -493 -311 3 147
7325 147 135 86 197 336 -79 7 -208 -269 -36 -324 -186 -21 186 404 302 102 220 120 -10 -138 -118 -587
7347 -587 -238 -88 -61 -8 159 87 260 151 164 -91 -278 -195 -174 172 -78 -80 274 287 63 346 -1 7 -200 -362
$$ packed form
7190B46k7k19l13K38j14M7j97K71L41K08j30k47J12k76l08R4j50J43J01J25J83
7211A28K1l2K13j82k08L16n74L9J47k25J41K72j3J85J12k4k32O3l63J76j03l34
7233d77M91m7N8L00J10r1j89m0p7k86P6k05K50J5l0J60L68j12M5l33J53J0l19
7256a70o7l0L56l80M29j84M14qk62J10k22J15r3l22o0K70j39K95J07k04M44l38
7278F1j25p9J74j76j83ONL85K03n7Q9q8o4j92j09l2o5R5N0j3N38j26n1J42k25
7303A63J01m4l65j1j2j00K74q6J89l8J41J53k72J03j89k69R5q3k43J82L14J44
7325A47j2m9J11J39m15Q6k15o1K33k88J38J65K07K18j02k00J18j00j30j28K0m69
7347e87L49J50K7N3J67p2J73j09J3k55j87Q3K1L46k50kL54J3k24K83l47Qk07j62
$$ plain form
7371 -362 -149 -201 -31 56 122 87 190 81 -73 41 -34 -292 -337 -224 -133 28 77 112 -34 377 346 121 -48
7394 -48 -199 -373 -289 -59 -169 19 170 156 120 477 172 94 -13 -189 -263 -422 -281 -248 216 112 110 59 248
7417 248 123 283 -125 -198 -132 -338 -163 -211 -14 66 266 389 258 132 -49 -188 -143 -122 -184 -193 -137 92 158 58
7441 58 237 231 -4 -80 -219 -129 -327 -166 -249 99 203 230 262 345 341 100 -111 -67 -20 -417 -95 -61 -198 175 281
7466 281 349 227 3 133 -111 -194 -323 -193 -164 35 -223 17 443 333 247 146 -14 -255 -416 -207 -301 -149
7488 -149 -37 141 180 429 252 249 40 -156 -334 -355 -386 -372 -31 185 68 277 81 303 107 12 -101 -268
7510 -268 -143 -138 -233 -12 43 206 349 201 41 -132 -7 -327 -145 -223 -102 -132 29 90 122 244 162 158 40 -32
7534 -32 -336 -56 -27 -231 -222 293 84 187 178 127 168 140 -160 -254 -167 -336 -348 -76 76 277 396 184 192 108 80
$$ packed form
7371c62K13n2J70Q7O6l5J03j09j54J14p5k58m5J13R1J61M9L5j46M11l1k25j69
7394d8j51j74Q4K30j10J88J51j4l6L57l05p8j07j76p4j59J41L3M64j04kn1J89
7417B48j25J60m08p3O6k06J75m8J97Q0K00J23j31j26j81j39M5K1o2rN6K29O6j00
7441E8J79ok35p6j39R0j98J61q3L48J04K7L2Q3mk41k11M4M7l97L22L4j37L73J06
7466B81O8j22k24J30k44q3j29J30K9J99k58K40M26j10q6j01j60k41j61K09r4J52
7488a49J12J78L9K49j77lk09j96j78k1l1J4L41K16j17K09j96K22j96r5j13j67
7510b68J25Nr5K21N5J63J43j48j60j73J25l20J82p8J21l0J61O1L2J22q2mj18p2
7534c2l04K80K9k04RN15k09J03rn1M1k8l00r4Q7j69j2K72J52K01J19k12Qq4k8
$$ plain form
7559 80 -211 -162 -197 -101 -106 10 66 120 365 159 188 40 -130 -228 -341 -283 -94 -148 156 40 454 4 150 60
7583 60 -201 -148 -340 -48 -308 -152 -64 40 129 366 412 245 25 10 -160 -258 -220 -256 -98 -18 297 366 37 422
7607 422 281 80 -191 -48 -316 -294 -202 -112 85 46 234 25 100 194 -69 -100 -298 -349 -270 -312 37 -111 160
7630 160 335 355 299 197 -268 -287 -563 -338 -454 -294 104 284 277 473 305 -143 91 93 -277 -273 -5 -4 -194 30
7654 30 295 70 82 149 1 -50 -32 -239 -231 -195 -215 188 234 218 142 261 74 -156 -17 -253 -484 -196 -213 -216 99
7679 99 65 189 136 240 258 69 12 -358 -325 -426 -36 -227 45 90 55 343 117 158 2 -214 -316 -272 -478
7702 -478 -222 -74 90 135 340 197 308 176 -2 -196 -147 -488 -491 -132 -60 175 417 365 259 120 -40 116
7724 116 -370 -327 -291 -170 -20 9 53 183 295 354 276 -61 -6 -300 -296 -125 -194 -247 205 7 284 244 153 198 130
$$ packed form
7559H0k91M9l5R6nJ16N6N4K45k06K9j48j70r8j13N8J89n4L04j16M14m50J46r0
7583F0k61N3j92K92k60J56Q8J04Q9K37M6j67k20j5j70r8L8l6J58Q0L15O9l29L85
7607D22j41k01k71J43k68K2R2R0J97l9J88k09P5R4k63l1j98n1P9m2L49j48K71
7630A60J75K0n6j02m65j9k76K25j16J60L98J80pJ96j68m48K34Kl70MK68Jj90K24
7654C0K65k25J2O7j48n1J8k07QL6k0M03M6j6p6J19j87k30J39k36k31K88j7lL15
7679I9l4J24n3J04J8j89n7l70L3j01L90j91K72M5l5K88k26M1j56k16j02M4k06
7702d78K56J48J64M5K05j43J11j32j78j94M9l41lL59P2K35K42n2j06j39j60J56
7724A16m86M3L6J21J50K9M4J30J12N9p8l37N5k94MJ71o9n3M52j98K77m0r1M5o8
$$ plain form
7749 130 -224 -88 -165 -111 -157 -135 214 205 347 228 -19 329 -393 -238 -142 -494 -118 -29 -3 -3 321 415 194 138
7773 138 -43 -224 -300 -138 -267 -127 148 34 374 335 234 136 67 -210 -40 -151 -326 -363 -216 19 139 -1
7795 -1 298 221 167 89 -134 -228 -212 -131 -23 -8 203 110 240 24 63 85 -173 26 -407 -202 -173 -92 107 99 66 340
7821 340 319 105 59 -149 -214 -172 -232 -237 -34 115 -78 298 228 215 128 250 -216 -291 -374 -376 -132 -245 256 215 103
7846 103 204 419 -49 -36 -280 -317 -313 -147 -62 6 257 178 291 283 -8 68 -192 -290 -329 -201 -118 82 -28 197
7870 197 243 133 312 174 62 -182 -303 -284 -282 -194 103 8 230 311 89 282 86 -142 -296 -355 -468 -76 -38
7893 -38 -195 149 398 317 7 153 143 -233 -333 -333 -346 31 -111 -137 107 383 211 204 288 61 -193 -171 -236 -277
7917 -277 -110 -216 -21 33 235 370 409 141 -18 87 -282 -343 -264 91 11 26 -63 384 226 136 0 -69 -259
$$ packed form
7749A30l54J36p7N4m6K2L49rJ42j19k47L48p22J55R6l52L76Q9K6%L24R4k21n6
7773A38j81j81p6J62j29J40K75j14L40l9j01r8o9k77J70j11j75l7J47K35J20j40
7795aK99p7n4p8k23r4J6Q1J08J5K11r3J30k16L9K2k58J99m33K05K9Q1J99ql3K74
7821C40k1k14m6k08o5M2o0nK03J49j93L76p0j3q7J22m66p5q3kK44j13N01m1j12
7846A03J01K15m68J3k44l7MJ66Q5O8K51p9J13qk91P6k60r8l9J28Q3K00j10K25
7870A97M6j10J79j38j12k44j21J9KQ8K97r5K22Q1k22J93j96k28j54n9j13L92L8
7893c8j57L44K49q1l10J46j0l76j00%j3L77j42k6K44K76j72pQ4k27k54K2o5m1
7917b77J67j06J95N4K02J35L9k68j59J05l69o1P9L55q0J5q9M47j58r0j36o9j90
$$ plain form
7940 -259 -78 -310 -222 -196 -121 8 257 298 224 106 81 217 -119 -210 -157 -193 -92 -33 121 303 304 438 95 152
7964 152 -9 -149 -336 -410 -175 -249 259 498 269 338 207 111 -112 -259 -253 -206 -322 -38 -4 266 250 -1 122
7987 122 208 -107 -43 -303 -150 -330 18 -57 -39 340 233 92 36 196 -75 -26 -103 -60 -185 55 -30 120 132
8010 132 76 130 197 118 -108 -260 -273 -424 -267 -29 17 172 151 319 257 117 -110 -39 -408 -132 -217 -74 102
8033 102 61 103 176 436 482 154 78 -123 -324 -272 -238 -35 37 261 133 264 423 94 34 -153 -177 -157 -306 -192
8057 -192 -25 -22 268 368 259 16 144 -119 -49 -51 -296 -318 -161 -157 153 55 209 250 146 158 160 -346 -113 -369
8081 -369 -466 4 -106 -79 225 301 73 117 161 -160 -5 -129 -368 -188 -98 -42 125 219 318 134 269 56 -190
8104 -190 -195 -138 -32 -191 -182 284 336 252 315 251 69 -180 -300 -156 -171 -213 -106 214 205 13 186 97 288 78 -137
$$ packed form
7940b59J81k32Q8K6P5J29K49M1p4j18k5J36l36r1N3l6J01N9J54J82JJ34l43N7
7964A52j61j40j87p4K35p4N08K39k29O9j31r6k23j47OM7j16K84L4K70j6k51J23
7987A22Q6l15O4k60J53j80L48p5J8L79j07j41n6J60k71M9p7M3j25K40q5J50J2
8010A32n6N4O7p9k26j52j3j51J57K38M6J55k1J68o2j40k27P1l69K76q5J43J76
8033A02m1M2P3K60M6l28p6k01k01N2L4K03P2K24j28J31J59l29o0j87k4K0j49J14
8057a92J67LK90J00j09k43J28k63P0kk45k2J57ML10r8J54M1j04J2Kn06K33k56
8081c69r7M70j10K7L04P6k28M4M4l21J55j24k39J80R0N6J67R4R9j84J35k13k46
8104a90nN7J06j59RM66N2q4O3o4j82k49j20J44j5m2J07L20rj92J73q9J91k10k15
$$ plain form
8129 -137 -234 -254 -317 -239 17 -56 222 234 328 252 99 16 -230 -55 -289 235 -283 -113 263 146 178 287 394
8152 394 441 -11 -215 -132 -209 -116 -49 -136 43 268 329 325 299 227 -164 -90 -572 -264 -120 45 74 110 291 222 204
8177 204 -4 -94 23 -177 -114 -95 -313 -57 183 146 356 68 314 93
$$ packed form
8129a37r7k0o3P8K56p3K78J2R4p6j53q3k46J75k34N24n18J70L76j17L2J09J07
8152C94M7m52k04Q3p7R3O7q7J79K25O1mk6p2l91P4m82L08J44J65K9L6J81o9j8
8177B04k08r0J17k00O3J9k18K56K40l7K10k88K46k21
8191I3
$$ Imaginary data points
##PAGE= N=2
##DATA TABLE= (X++(I..I)), XYDATA
$$ plain form
0 0 0 0 0 0 0 0 0 0 0 0 0 0 0 0 0 -2 8 -8 8 -8 8 -16 16 -17 24 -24 31 -33 40 -46 51 -58 67 -75 88 -98 108
37 108 -124 138 -155 171 -191 213 -237 261 -287 318 -352 387 -427 470 -518 573 -632 699 -771
56 -771 857 -954 1066 -1199 1357 -1549 1793 -2108 2539 -3163 4165 -6037 10851 -55956 -90016
71 -90016 -35349 5596 59865 88414 104672 87017 56863 7548 -40195 -78562 -97964 -93801
83 -93801 -66552 -25756 24602 62913 93288 93318 78099 38372 -5820 -51703 -82676 -95690 -83432
96 -83432 -54751 -7730 34534 74996 91156 90523 64659 25115 -20329 -61203 -86286 -91001 -74191
109 -74191 -39061 4166 46867 77433 88496 80558 49564 12325 -33075 -65230 -85497 -82058
121 -82058 -61265 -24630 16290 55028 78083 85020 68584 39023 -3207 -41693 -71665 -84363
$$ packed form
0@%%%%%%%%%%%%%%%kJ0j6J6j6J6k4L2l3M1m8N5o4P3q6R7j09J25j42J63j86K06
37A08k32K62k93L26l62M04m50M98n48O05o70P39q14Q97r88J091j205J331j470
56g71J628j811K020k265K556k906L342l901M647n702P328j0202J6888o6807l4060
71i0016N4667M0945N4269K8549J6258j7655l0154m9315m7743l8367j9402M163
83i3801K7249M0796N0358L8311L0375L0j5219l9727m4192m5883l0973j3014J2258
96h3432K8681M7021M2264M0462J6160o33k5864l9544m5444m0874k5083m715J6810
109g4191L5130M3227M2701L0566J1063p938l0994l7239m5400l2155k0267L439
121h2058K0793L6635M0920L8738K3055O937j6436k9561m2230l8486k9972j2698
$$ plain form
133 -84363 -75285 -50579 -11193 28353 62508 80533 80012 59187 25632 -15494 -50026 -75767 -78810
146 -78810 -67496 -36211 -72 38750 65625 77746 70895 47320 11823 -24575 -56822 -73345
158 -73345 -74065 -55807 -24564 11639 46588 68021 75670 62363 36625 166 -34394 -62290 -73611
171 -73611 -68809 -45090 -13658 23969 52275 71282 69783 54388 24204 -10375 -42562 -64217
183 -64217 -70156 -59538 -34435 -1415 31440 56239 68188 62545 43740 12425 -18945 -49150
195 -49150 -63743 -66194 -49827 -23827 9589 39006 60466 65578 56897 32544 2757 -29896 -53392
208 -53392 -64895 -60696 -41320 -13254 19192 45284 61608 61438 48127 22245 -7511 -36561 -54476
221 -54476 -62063 -51561 -31838 -1525 25881 49581 59288 56034 38409 12250 -17124 -41850 -57166
$$ packed form
133h4363R078K4706L9386L9546L4155J8025n21k0825l3555m1126l4532k5741l043
146g8810J1314L1285L6139L8822K6875J2121o851k3575l5497l6398l2247j6523
158g3345p20J8258L1243L6203L4949K1433P649j3307k5738l6459l4560k7896j1321
171g3611M802K3719L1432L7627K8306J9007j499j5395l0184l4579l2187k1655
183f4217n939J0618K5103L3020L2855K4799J1949n643j8805l1315l1370l0205
195d9150j4593k451J6367K6000L3416K9417K1460N112q681k4353k9787l2653k3496
208e3392j1503M199J9376K8066L2446K6092J6324j70j3311k5882k9756k9050j7915
221e4476p587J0502J9723L0313K7406K3700R707l254j7625k6159k9374k4726j5316
$$ plain form
234 -57166 -57835 -45022 -21558 7833 34123 53313 57865 50602 28961 2689 -26197 -46494 -57513
247 -57513 -52713 -37158 -11027 15540 40554 52959 54916 41662 20039 -7042 -31744 -48725
259 -48725 -54288 -46289 -27362 -1937 23660 43790 52672 49809 33592 11107 -16206 -37116 -51475
272 -51475 -50782 -40316 -18209 6936 31348 46878 52239 43968 26238 955 -23071 -42088 -50289
285 -50289 -46801 -32064 -9263 14640 35749 47293 48214 36532 17324 -7000 -28577 -44404 -47683
298 -47683 -41677 -23544 -1459 22552 39341 47846 43699 30467 8423 -14377 -34928 -45825 -46452
311 -46452 -35172 -16145 7119 28597 42401 47035 38742 22526 -82 -21087 -38395 -44996 -42083
324 -42083 -27656 -8210 14799 32262 43498 42718 33073 14242 -6765 -27228 -40203 -43621 -36842
$$ packed form
234e7166o69J2813K3464K9391K6290J9190M552p263k1641k6272k8886k0297j1019
247e7513M800J5555K6131K6567K5014J2405J957j3254k1623k7081k4702j6981
259d8725n563P999J8927K5425K5597K0130Q882k863j6217k2485k7313k0910j4359
272e1475O93J0466K2107K5145K4412J5530N361q271j7730k5283k4026j9017q201
285e0289L488J4737K2801K3903K1109J1544R21j1682j9208k4324k1577j5827l279
298d7683O006J8133K2085K4011J6789Q505m147j3232k2044k2800k0551j0897o27
311d6452J1280J9027K3264K1478J3804M634q293j6216k2608k1005j7308o601K913
324d2083J4427J9446K3009J7463J1236p80r645j8831k1007k0463j2975l418O779
$$ plain form
337 -36842 -20730 227 21345 36670 44017 39802 26933 6436 -13936 -32862 -41801 -42235 -30937
350 -30937 -13911 8006 26367 39618 42068 35415 18900 -180 -20890 -35275 -41595 -37645 -24848
363 -24848 -6192 14253 30539 39930 38975 29707 12148 -7519 -26106 -37305 -41238 -32899 -18654
376 -18654 1818 19881 35010 40022 36940 23619 5601 -14710 -30431 -39356 -38346 -28410 -11701
389 -11701 8112 25131 36780 38570 32264 16979 -1078 -20030 -32664 -38594 -34154 -22872 -4347
402 -4347 13479 29401 37058 36730 26756 10971 -8005 -24549 -35656 -37945 -31000 -16420 2123
415 2123 19474 32739 37982 33915 21487 4740 -14221 -28336 -36760 -35275 -26248 -9928 7303
428 7303 24112 33615 36434 29207 15967 -1695 -18359 -31387 -35789 -32356 -20450 -4120 13254
$$ packed form
337c6842J6112K0957K1118J5325P347m215j2869k0497k0372j8926q939m34J1298
350c0937J7026K1917J8361J3251K450o653j6515j9080k0710j4385o320L950J2797
363b4848J8656K0445J6286R391r55r268j7559j9667j8587j1199l933Q339J4245
376a8654K0472J8063J5129N012l082j3321j8018k0311j5721q925J010R936J6709
389a1701J9813J7019J1649J790o306j5285j8057j8952j2634n930M440J1282J8525
402d347J7826J5922P657l28r974j5785j8976j6544j1107k289O945J4580J8543
415B123J7351J3265N243m067j2428j6747j8961j4115q424J485R027J6320J7231
428G303J6809R503K819p227j3240j7662j6664j3028m402L433J1906J6330J7374
$$ plain form
441 13254 27658 35095 34482 24853 10118 -8241 -23072 -33697 -35142 -29285 -14967 1726 19016
454 19016 30433 35798 31467 20098 3684 -13049 -26793 -33796 -32911 -24116 -9236 7455 22384
467 22384 31588 33766 27268 14733 -2087 -17266 -29567 -33453 -30384 -18935 -3845 13166 25888
480 25888 33506 31838 23663 8638 -7381 -22265 -31226 -33051 -26629 -13888 1963 17554 28511
493 28511 33059 28855 18669 3321 -11822 -25129 -31163 -31122 -21899 -8808 7120 20736 30017 31247
507 31247 25627 13072 -1475 -16761 -27225 -31458 -28111 -17897 -3088 11964 24457 31143 29447
520 29447 22005 8026 -6767 -20925 -28907 -31063 -24459 -13364 2313 15819 26634 29953 27210
533 27210 16874 3298 -11452 -23023 -29455 -28198 -20591 -7921 6751 19533 27975 28972 23788
$$ packed form
441A3254J4404P437o13r629j4735j8359j4831j0625j445N857J4318J6693J7290
454A9016J1417N365m331j1369j6414j6733j3744p003Q85Q795J4880J6691J4929
467B2384R204K178o498j2535j6820j5179j2301l886L069J1449J5090J7011J2722
480B5888P618j668q175j5025j6019j4884q961j825O422J2741J5851J5591J0957
493B8511M548m204j0186j5348j5143j3307o034M1R223J3091J5928J3616R281J230
507C1247n620j2555j4547j5286j0464m233L347J0214J4809J5052J2493O686j696
520B9447p442j3979j4793j4158p982k156O604J1095J5677J3506J0815L319k743
533B7210j0336j3576j4750j1571o432J257P607J2670J4672J2782Q442R97n184
$$ plain form
546 23788 12019 -1571 -16183 -25329 -29739 -25741 -16486 -2389 11170 23069 28480 27919 19575 7526
560 7526 -6866 -19090 -27034 -28148 -22715 -11896 1870 14791 24335 27825 24779 15691 2867 -10844
574 -10844 -20994 -27209 -25722 -19174 -6770 6220 18654 25495 27229 21568 11530 -2130 -14950
587 -14950 -23934 -27174 -24245 -14870 -2546 10576 21109 26331 25399 17958 6724 -6481 -17446 -24684
601 -24684 -25673 -21046 -10208 1702 14207 22269 25727 22250 14224 2200 -9884 -20051 -25017 -24226
615 -24226 -17172 -6231 6301 17340 23865 24937 19694 10140 -2587 -13751 -22500 -24864 -22263 -13236
629 -13236 -1880 10471 19311 24456 22919 16278 5388 -5722 -16888 -22713 -23562 -18514 -9416 2035
643 2035 13437 21062 23791 20470 12670 1458 -9666 -19142 -23092 -22264 -15111 -5412 6774 16019
$$ packed form
546B3788j1769j3590j4612r146m410L998R255J4097J3559J1899N411n61q344j2049
560G526j4392j2224p944j114N433J0819J3766J2921R544L490l046r088j2824j3711
574a0844j0150o215J487O548J2404J2990J2434O841J734n661j0038j3660j2820
587a4950q984l240K929R375J2324J3122J0533N222r32p441j1234j3205j0965p238
601b4684r89M627J0838J1910J2505Q062L458l477q026j2024j2084j0167m966P91
615b4226P054J0941J2532J1039O525J072n243r554j2727j1164q749k364K601R027
629a3236J1356J2351Q840N145j537o641j0890j1110j1166n825q49N048R098J1451
643B035J1402P625K729l321p800j1212j1124r476l950Q28P153R699J2186R245
$$ plain form
657 16019 22763 22935 18083 8438 -2571 -13385 -20663 -23113 -19933 -12017 -819 9802 18075 22605
671 22605 20995 14870 4776 -6146 -16006 -21039 -21840 -16690 -8055 3034 12699 20005 21649 19243
685 19243 11142 767 -10011 -17973 -21964 -20162 -13927 -4147 6660 15872 20957 21025 16403 7564 -2869
700 -2869 -12887 -19213 -21595 -17814 -10523 -356 9112 17804 20778 19292 13163 4014 -6500 -15191
714 -15191 -20178 -20042 -15497 -6965 3204 12461 18841 20674 17088 9743 111 -9853 -17422 -20672 -18538
729 -18538 -12745 -3244 6394 15427 19683 19649 14473 6393 -3657 -12316 -18292 -19763 -16696 -9320 289
744 289 9611 16537 19757 18124 11696 3099 -6741 -14494 -19167 -18624 -14476 -5745 3442 12695 18041 19705
760 19705 15755 8662 -816 -9776 -16950 -19251 -17550 -11071 -2278 6820 14814 18818 18409 13347 5512
$$ packed form
657A6019O744J72m852r645j1009j0814p278k450L180P916J1198J0621Q273M530
671B2605j610o125j0094j0922r860n033q01N150Q635J1089R665P306J644k406
685A9243q101j0375j0778p962l991J802O235R780J0807R212N085O8m622q839j0433
700b869j0018o326k382L781P291J0167R468Q692K974j486o129r149j0514q691
714a5191m987J36M545Q532J0169R257O380J833l586p345r632r964p569l250K134
729a8538N793R501R638R033M256l4n176q080j0050q659n976j471L067P376R609
744B89R322O926L220j633o428q597r840p753m673N43M148Q731R187R253N346J664
760A9705l950p093r478q960p174k301J701O479Q793R098P994M004m09n062p835
$$ plain form
775 5512 -3921 -11977 -17637 -18619 -15519 -7979 573 9696 15972 18949 16642 11181 1906 -6673 -14509
790 -14509 -18443 -18092 -12951 -5153 4329 12262 17649 18620 14900 8094 -1229 -10048 -16157 -18392 -16770
805 -16770 -10090 -2067 7163 13815 18348 17322 12922 4661 -3883 -11808 -16755 -17814 -14537 -7552 1198
820 1198 9734 15609 17868 15832 10186 1629 -6932 -14298 -17551 -17271 -12048 -4569 4603 11979 17166
835 17166 17553 14308 6971 -1373 -9813 -15387 -17639 -15483 -9641 -1511 6904 13537 17066 16520 11975
850 11975 4282 -4114 -11855 -16219 -17263 -13534 -7131 1510 9412 15241 17327 15446 9273 1462 -7115
865 -7115 -13529 -17191 -16025 -11588 -3831 4350 11590 16180 16926 13456 6637 -1342 -9218 -14672 -16873
880 -16873 -14643 -9143 -1325 6447 13280 16368 15908 11078 4019 -4192 -11089 -15724 -16224 -13316 -6422
$$ packed form
775E512r433q056n660r82L100P540Q552R123O276K977k307n461r275q579p836
790a4509l934L51N141P798R482P933N387R71l720o806r323q819o109k235J622
805a6770O680Q023R230O652M533j026m400q261q544p925m947j059L277O985Q750
820A198Q536N875K259k036n646q557q561p366l253K80N223P479R172P376N187
835A7166L87l245p337q344q440n574k252K156N842Q130Q415O633L529n46m545
850A1975p693q396p741m364j044L729O403Q641P902N829K086j881o173p811q577
865g115o414l662J166M437P757Q181P240M590P46l470o819p979p876n454k201
880a6873K230N500P818P772O833L088m60m830p059q211o897m635n00K908O894
$$ plain form
895 -6422 1428 8959 14667 16701 14366 8968 1282 -6925 -12737 -16430 -15376 -11100 -3784 4071 11340
910 11340 15379 16024 12558 6582 -1488 -8806 -14051 -15885 -14195 -8723 -1574 6439 12491 15331 15099
925 15099 10560 4007 -4008 -10759 -15124 -15441 -12510 -6128 1294 8917 13668 15853 13563 8452 1041
940 1041 -6361 -12627 -15363 -14722 -10117 -3798 4046 10577 14655 15124 11850 6138 -1302 -8264 -13430 -14861
956 -14861 -13334 -8195 -1624 6326 11767 14860 14119 10282 3307 -3755 -10287 -14154 -15087 -11657 -5748
971 -5748 1530 8410 13375 14721 13102 7825 855 -5913 -11627 -14392 -14024 -9636 -3428 3809 9714
986 9714 13696 14165 11739 5629 -1086 -8205 -12420 -14466 -12287 -7828 -929 5709 11380 14267 13199
1001 13199 9771 3416 -3516 -9845 -13527 -13890 -10896 -5453 1529 7843 12674 13702 12327 7249 884
$$ packed form
895f422P850P531N708K034k335n398p686q207n812l693J054M276P316P855P269
910A1340M039O45l466n976q070p318n245j834J690N472P149Q013O052K840k32
925A5099m539o553q015o751m365l17K931O382P422P623M751K185k290n111p411
940A041p402o266k736O41M605O319P844O531M078M69l274n712p440o962n166j431
956a4861J527N139O571P950N441L093p41l837o975p062o532l867r33L430N909
971e748P278O880M965J346j619n277o970o768n714k765L68M388O208P237N905
986I714L982M69k426o110o715p119m215k046K179M459O899O638N671K887j068
1001A3199l428o355o932o329l682l63K994N443O982O314M831J028j375n078o365
$$ plain form
1016 884 -5868 -11120 -13817 -12848 -9323 -3195 3362 9366 12893 13379 10725 5204 -1105 -7679 -11938 -13612
1032 -13612 -11813 -7310 -677 5810 11041 13481 12710 8687 2938 -3860 -9156 -13017 -12997 -10303 -4923
1047 -4923 1408 7782 11827 13150 11406 6994 728 -5312 -10297 -12975 -12077 -8559 -2680 3345 9331
1062 9331 12118 12765 9755 4836 -1641 -7344 -11742 -12874 -11330 -6598 -325 5711 10632 12882 11934
1077 11934 8242 2470 -3854 -9023 -12671 -12205 -9792 -4720 1612 7342 11274 12600 10627 6363 481
1092 481 -5276 -10231 -12493 -11642 -7896 -2510 3487 8653 12065 12096 9460 4269 -1532 -7182 -11370 -12431
1108 -12431 -10658 -5962 -324 5788 10318 12168 11042 7740 1953 -3740 -9080 -11727 -11775 -8958 -4237
1123 -4237 1892 7121 10862 11967 10180 5799 103 -5168 -9927 -11798 -11080 -7505 -2379 3824 8599
$$ packed form
1016H84o752n252k697R69L525O128O557O004L527M86k654n521o309o574m259j674
1032a3612J799M503O633O487N231K440p71m023n749o798n296l861K0K694N380
1047d923O331O374M045J323j744m412o266o040m985k678Q98L518N879O025N986
1062I331K787O47l010m919o477n703m398j132J544M732O273O036M921K250r48
1077A1934l692n772o324n169l648M66K413N072O332N730L932J326j973m264n882
1092D81n757m955k262Q51L746N386N997N166L412L1k636n191n801n650m188j061
1108a2431J773M696N638O112M530J850j126l302n787n693n340k647m8K817M721
1123d237O129N229L741J105j787m381n696n271m759j871P18L575N126O203M775
$$ plain form
1138 8599 11865 11531 8807 3781 -1916 -7374 -10740 -12111 -9905 -5801 58 5431 9788 11625 10655
1153 10655 7391 1895 -3756 -8553 -11297 -11498 -8429 -4038 1728 6618 10534 11377 9891 5428 223
1168 223 -5504 -9450 -11552 -10758 -7291 -1903 3777 8555 11210 11118 8352 3719 -1984 -7184 -10284 -11717
1184 -11717 -9529 -5493 40 5332 9562 11077 10577 6976 1976 -3679 -8221 -11042 -10745 -8367 -3660
1199 -3660 1944 6804 10299 11128 9295 5275 -169 -5407 -9486 -11224 -9864 -6934 -1705 3648 8467
1214 8467 10988 10885 7886 3729 -2082 -6917 -10322 -11044 -9162 -4984 20 5567 9126 11308 10083
1229 10083 6698 1650 -3737 -8159 -10661 -10526 -7704 -3469 1793 6895 10003 11066 8884 5139 -388
1244 -388 -5539 -9578 -10953 -9963 -6348 -1624 3904 8243 10464 10529 7863 3241 -2083 -6758 -9959 -11098
$$ packed form
1138H599L266l34k724n026n697n458l366j371K206M104N859N373M357J837r70
1153A0655l264n496n651m797k744k01L069M391N766M890L916Q43j486m463n205
1168B23n727l946k102P94L467N388N680M778K655r2k766m633n703n200l100j433
1184a1717K188M036N533N292M230J515n00l601n000n655m542k821K97K378M707
1199c660N604M860L495Q29j833m020n444n238m079j738J360K930N229N353M819
1214H467K521j03k999m157n811m835l405p22J882M178N004N547L559K182j225
1229A0083l385n048n387m422k502J35K822M235N262N102L108J063k182l745n527
1244c88n151m039j375R90L615M724N528M339K221O5k666m622n324m675l201j139
$$ plain form
1260 -11098 -8911 -4990 139 5216 9034 10824 9623 6618 1467 -3594 -7905 -10340 -10363 -7491 -3303
1275 -3303 2085 6701 9904 10889 8674 4827 -361 -5283 -9111 -10484 -9841 -6159 -1512 3736 7886
1290 7886 10473 10211 7908 3285 -1704 -6714 -9567 -10407 -8587 -4960 246 4991 8837 10343 9386 6336
1306 6336 1628 -3569 -7649 -10089 -10024 -7586 -3390 2026 6426 9574 10047 8815 4489 54 -5085 -8603
1322 -8603 -10242 -9293 -6142 -1153 3398 7624 9829 9987 7414 3256 -1785 -6361 -9228 -10247 -8290
1337 -8290 -4833 83 4877 8744 9999 9164 6090 1654 -3501 -7308 -10114 -9611 -7723 -3090 1754
1352 1754 6464 9107 10007 8428 4797 -102 -4728 -8466 -9978 -9005 -6072 -1409 3127 7178 9433
1367 9433 9615 7210 3301 -1864 -6094 -9058 -9666 -8411 -4680 -46 4617 8048 9574 8942 6103 1547
$$ packed form
1260a1098K187L921N129N077L818J790j201l005n151n061m311k435k3K872M188
1275c303N388M616L203R85k215l847n188m922l828j373O43L682M647N248M150
1290G886K587k62k303m623m989n010k853q40J820L627N206M745L846J506r57l050
1306F336m708n197m080k440O5K438M196N416M400L148M73j232m326m435n139l518
1322h603j639R49L151M989M551M226K205J58k573m158n041m576k867j019J957
1337h290L457M916M794L867J255q35l074m436n155l807k806N03J888M633M844
1352A754M710K643R00j579l631m899m626l738j512R73K933M663M536M051K255
1367I433J82k405l909n165m230k964o08J255L731M634M663L431J526o32k839m556
$$ plain form
1383 1547 -3276 -7177 -9682 -9443 -7190 -3105 1549 6160 8722 9843 7863 4596 -28 -4443 -8155
1398 -8155 -9397 -8799 -5879 -1768 2810 6779 9263 8949 6982 3050 -1575 -5766 -8725 -9427 -7774 -4316
1414 -4316 51 4654 7694 9490 8442 5903 1610 -2687 -7011 -8967 -9016 -6823 -3192 1568 5515
1429 5515 8478 9106 7543 4457 70 -4336 -7871 -8950 -8575 -5675 -1737 2723 6442 8721 8753 6632
1445 6632 2991 -1343 -5646 -8181 -8926 -7476 -4299 142 4336 7667 9081 8375 5452 1384 -3065
1460 -3065 -6689 -8693 -8612 -6246 -2947 1638 5340 8252 8647 7440 4077 164 -4146 -7292 -8737 -8015
1476 -8015 -5573 -1501 2735 6232 8313 8419 6565 2927 -1321 -5459 -8088 -8730 -7093 -4001 120
1491 120 4146 7473 8422 7868 5121 1428 -2778 -6154 -8404 -8202 -6195 -2755 1229 5163 7832 8417
$$ packed form
1383A547m823l901k505K39K253M085M654M611K562J121j980l267m624m415l712
1398h155j242N98K920M111M578L969K484l14j967l932m625m191k959p02J653L458
1414d316M367M603L040J796j048k539m293m297m324j956m9K193L631M760L947
1429E515K963O28j563l086m387m406l535j079L75K900L938M460L719K279L2k121
1445F632l641m334m303k535p45J450L177M441M194L331J414p06k923m068m449
1460c065l624k004Q1K366L299M585L702K912L95j207l363l913m310l146j445P22
1476h015K442M072M236L497K081J06j854l638m248m138k629o42J637L092M121
1491A20M026L327R49n54k747l693m206l376k250K02K007L440L984L934K669N85
$$ plain form
1507 8417 6981 3940 201 -3874 -7073 -8287 -7639 -5203 -1410 2523 6245 8168 8163 6021 2567 -1535
1523 -1535 -5060 -7773 -8268 -6889 -3848 109 4137 6908 8234 7791 5046 1260 -2630 -5945 -7920
1538 -7920 -7794 -6141 -2636 1188 5068 7366 8149 6766 4055 -65 -3805 -6845 -7984 -7278 -4797 -1309
1554 -1309 2984 6001 7616 7721 5765 2364 -1577 -5275 -7381 -7914 -6655 -3616 163 3855 6381
1569 6381 7967 7124 4964 1064 -2484 -5924 -7638 -7578 -5644 -2673 1404 4556 7270 7702 6454 3537
1585 3537 42 -3717 -6638 -7724 -7088 -4585 -1057 2838 5720 7677 7446 5651 2002 -1372 -4978
1600 -4978 -6853 -7793 -6202 -3628 322 3569 6430 7660 6999 4713 1147 -2616 -5522 -7215 -7246 -5306
1616 -5306 -2351 1570 4782 7042 7509 6419 3465 -398 -3779 -6459 -7538 -6782 -4366 -724 2731
$$ packed form
1507H417j436l041l739m075l199j214O48K436L793L933L722J923nk142l454m102
1523a535l525k713m95J379L041L957M028K771J326m43k745l786l890l315j975
1538g920J26J653L505L824L880K298P83j383k711m120l740l040j139P06K481L488
1554a309M293L017J615J05j956l401l941l698k106n33J259L039L779L692K526
1569F381J586q43k160l900l548l440j714O0J934K971M077L152K714M32j248k917
1585C537l495l759k921j086O36K503L528L895K882J957k31j795l649l374l606
1600d978j875r40J591K574L950L247K861J230o61k286l566l763k906j693l1J940
1616e306K955L921L212K260M67j090k954l863l381k680j079P56K416L642L455
$$ plain form
1631 2731 5837 7270 7175 5311 1996 -1582 -4762 -6982 -7241 -6239 -3265 395 3599 6374 7369 7038
1647 7038 4319 1021 -2713 -5592 -7192 -7185 -5286 -1953 1345 4665 6572 7328 5974 3248 -127 -3733
1663 -3733 -6192 -7241 -6403 -4120 -829 2643 5568 6854 6951 5078 2116 -1467 -4542 -6601 -7153 -5994
1679 -5994 -3041 121 3531 6033 7186 6391 4264 849 -2573 -5470 -6845 -6817 -5048 -1980 1346 4530
1695 4530 6530 6917 5694 3158 -384 -3417 -5992 -7092 -6354 -4047 -845 2654 5243 6921 6565 4927
1711 4927 2196 -1326 -4599 -6371 -6977 -5732 -3223 118 3547 5978 7140 6193 4234 888 -2301
1726 -2301 -5312 -6617 -6822 -5081 -2013 1672 4188 6448 6689 5405 2913 -498 -3624 -5731 -6667 -6096
1742 -6096 -3739 -853 2458 5100 6754 6641 4663 1863 -1319 -4346 -6073 -6755 -5346 -3024 358
$$ packed form
1631B731L106J433r5j864l315l578l180k220k59J002K974L660L204K775R95l31
1647G038k719l298l734k879j600PJ899L333L298L320J907P56j354k726l375l606
1663c733k459j049Q38K283L291L472K925J286R7j873k962l583l075k059n52J159
1679e994K953L162L410K502J153p95k127l415l422k897j375K8J769L068L326L184
1695D530K000L87j223k536l542l033k575j100P38K307L202L499K589J678l56j638
1711D927k731l522l273j772o06J245K509L341L429K431J162r47j959l346l189
1726b301l011j305k05J741L068L685K516K260K41j284k492l411l126k107r36N71
1742f096K357K886L311K642J654j13j978k800l182l027j727o82J409K322L382
$$ plain form
1757 358 3566 5746 6617 6073 3910 1103 -2466 -5024 -6527 -6499 -4606 -1665 1443 4252 6199 6541
1773 6541 5547 2777 -391 -3530 -5827 -6856 -5813 -4102 -987 2271 4817 6369 6225 4546 2051
1788 2051 -1430 -4072 -5988 -6582 -5391 -2779 346 3220 5666 6276 5847 3841 705 -2606 -5005 -6568
1804 -6568 -6074 -4614 -1876 1258 4174 5706 6306 5436 2870 -346 -3263 -5392 -6582 -5711 -3666 -791
1820 -791 2190 4878 6203 6127 4498 1899 -1280 -3944 -5679 -6168 -5183 -2536 308 3346 5170 6317
1836 6317 5621 3375 755 -2527 -4895 -6131 -5791 -4321 -1792 1235 4291 5698 6301 5011 2810 -191
1852 -191 -3183 -5206 -5991 -5511 -3391 -969 2177 4399 5889 5967 4473 1477 -1214 -3967 -5509 -5837
1868 -5837 -4751 -2594 163 3250 5169 5995 5267 3593 615 -2208 -4608 -5784 -5772 -4026 -1746 1113
$$ packed form
1757C58L208K180Q71n44k163k807l569k558j503K8J893K941L108K809J947L42
1773F541r94k770l168l139k297j029J043J711L115L258K546J552j44j679k495
1788B051l481k642j916n94J191K612L125K874K446O10m29k006l136l311k399j563
1804f568M94J460K738L134K916J532O00q70k566l216k917k129j190Q71K045K875
1820g91K981K688J325p6j629k599l179k664j735m89R85K647K844L038J824J147
1836F317o96k246k620l282k368j236L40J470K529L027L056J407O03j290k201l001
1852a91k992k023p85M80K120K422L146K222J490P8j494k996k691k753j542l28
1868e837J086K157K757L087J919Q26p28j674k978k823k400j176J2J746K280K859
$$ plain form
1884 1113 3771 5568 5826 4819 2585 -99 -3175 -5219 -5886 -5254 -3380 -599 2071 4285 5841 5529
1900 5529 4247 1552 -1054 -3942 -5283 -5698 -4611 -2408 734 3066 5065 5493 5031 3335 637 -2245
1916 -2245 -4410 -5460 -5503 -3746 -1584 1393 3589 5434 5574 4572 2291 -289 -3089 -4700 -5766 -5080
1932 -5080 -3150 -572 2201 4378 5496 5285 3868 1415 -1305 -3768 -5022 -5413 -4425 -2341 387 3151
1948 3151 4764 5456 4908 3030 590 -2392 -4193 -5386 -5137 -3834 -1401 1290 3853 4976 5506 4159
1964 4159 2007 -377 -2867 -4455 -5579 -4532 -3127 -278 2056 4584 4916 5044 3399 1196 -1327
1979 -1327 -3650 -5123 -5115 -4303 -1884 467 3092 4483 5207 4653 2782 524 -2111 -4079 -5172 -5084 -3454
1996 -3454 -1284 1027 3437 4993 5108 3993 2163 -656 -2878 -4543 -5206 -4410 -2684 -396 2210 4085
$$ packed form
1884A113K658J797K58j007k234k684l076k044o67O32J874K781K670K214J556l12
1900E529j282k695k606k888j341m15J087K203L142K332J999M28m62j696k698k882
1916b245k165j050m3J757K162K977K196J845J40j002k281k580k800j611j066O86
1932e080J930K578K773K177J118k11j417k453k720k463j254l91R88K084K728K764
1948C151J613O92n48j878k440k982j801j193K49J303K433K691K563J123N30j347
1964D159k152k384k490j588j124J047J405K849K334K528L32J28j645k203k523
1979a327k323j473QQ12K419K351K625J391P24n54j871k258k635j968j093Q8J630
1996c454K170K311K410J556J15j115j830k819k222j665o63P96J726K288K606J875
$$ plain form
2012 4085 5116 4660 3487 928 -1288 -3595 -4843 -5028 -4016 -2018 553 2952 4478 5036 4396 2626
2028 2626 434 -2280 -4063 -4996 -4812 -3511 -1150 1122 3455 5033 4955 3892 1712 -525 -2933 -4524
2044 -4524 -4980 -4471 -2668 -254 2226 3974 5011 4675 3327 912 -1220 -3759 -4681 -4733 -3715 -1692
2060 -1692 649 2834 4199 4854 4227 2852 333 -2160 -3921 -4708 -4571 -3251 -1053 1382 3505 4750
2076 4750 4656 3735 1695 -649 -2932 -4345 -5160 -4064 -2587 -210 2129 4040 4594 4423 3191 899
2092 899 -1397 -3440 -4535 -4595 -3655 -1760 560 2900 4152 4844 4121 2460 391 -2293 -3896 -4602 -4408
2109 -4408 -3224 -745 1548 3650 4511 4494 3382 1682 -611 -2903 -4408 -4614 -3894 -2263 -69 2200
2125 2200 3799 4783 4279 2957 883 -1562 -3130 -4605 -4353 -3588 -1548 638 2782 4001 4506 3887
$$ packed form
2012D085J031m56j173k559k216k307j248j85J012J998K571K399J526N58o40j770
2028B626k192k714j783r33J84J301K361K272K333J578p8j063k180k237k408j591
2044d524m56N09J803K414K480J748J037l36j348k415k132k539r22n2J018K023
2060a692K341K185J365O55o27j375k519k493j761p87J37J320K198K435K123J245
2076D750r4r21k040k344k283j413q15J096J477K377K339J911N54j71j232k292
2092H99k296k043j095o0R40J895K320K340J252O92p23j661k069k684j603p06J94
2109d408J184K479K293K102Q61j7j112j700k293k292j505k06P20J631K194K269
2125B200J599R84n04j322k074k445j568j475K52P65K040K186K144J219N05o19
$$ plain form
2141 3887 2266 56 -2015 -3555 -4346 -4150 -2832 -810 1453 3315 4244 4609 3340 1587 -922 -2577
2157 -2577 -4042 -4341 -3673 -2044 55 2112 3630 4604 3989 2961 710 -1439 -3224 -4160 -4113 -3382 -1523
2174 -1523 751 2829 4163 4309 3808 2092 35 -2050 -3802 -4184 -3988 -2631 -795 1481 3133 4180
2190 4180 4200 3138 1287 -849 -2700 -3883 -4138 -3541 -2078 -144 2033 3642 4234 3991 2883 902
2206 902 -1500 -3313 -4080 -4004 -3062 -1428 713 2606 3802 4149 3543 2051 -12 -1956 -3660 -4133 -3857
2223 -3857 -2656 -634 1400 3220 4050 4025 3180 1043 -836 -2687 -3794 -4204 -3446 -1935 -6 1903
2239 1903 3387 4088 3875 2333 598 -1400 -3074 -4100 -4019 -2845 -1387 838 2319 3728 4040 3358
2255 3358 1603 -253 -2087 -3607 -3953 -3604 -2430 -482 1235 3114 3971 3901 2806 1280 -667 -2554
$$ packed form
2141C887j621k210k071j540p91J96J318K022K263J862R29L65j269j753k509j655
2157b577j465k99O68J629K099K057J518R74o15j028k251k149j785r36M7P31J859
2174a523K274K078J334J46n01j716k057k085j752l82J96J357J836K276J652J047
2190D180K0j062j851k136j851j183k55N97J463J934K177J609N92k43j108j981
2206I02k402j813p67P6R42J634K141J893J196L47o06j492k063j944j704m73K76
2223c857J201K022K034J820Q30k5q45k137j879j851j107m10P58J511J929J909
2239A903J484P01k13j542j735j998j674j026Q1J174J458K225J481J409L12o82
2255C358j755j856j834j520l46L49J174J948J717J879Q57p0j095j526j947j887
$$ plain form
2271 -2554 -3763 -3835 -3016 -1975 156 1959 3341 3994 3469 2409 493 -1411 -2930 -3823 -3690 -2709 -1054
2288 -1054 995 2598 3302 3838 3105 1699 -298 -2160 -3381 -3817 -3381 -2178 -393 1270 2870 3596
2304 3596 3773 2840 1197 -828 -2326 -3629 -3550 -3200 -1712 19 1937 3305 3703 3222 2165 406 -1517
2321 -1517 -2903 -3579 -3479 -2437 -916 911 2357 3336 3620 3029 1587 -205 -1801 -3348 -3646 -3236 -1966
2338 -1966 -494 1523 2701 3642 3284 2450 925 -783 -2671 -3405 -3550 -2738 -1448 278 1956 2881 3596
2355 3596 3178 2044 163 -1297 -2864 -3490 -3275 -2377 -841 1056 2327 3360 3458 2825 1209 -149 -2148
2372 -2148 -3078 -3321 -2997 -1874 -327 1523 2839 3387 3350 2230 1012 -768 -2517 -3221 -3151 -2599 -1204
2389 -1204 323 2095 3076 3290 2794 1458 55 -1533 -2610 -3699 -2984 -2199 -771 1126 2448 3121
$$ packed form
2271b554j209p2Q19J041K131J803J382O53n25j060j916j904j519q93J33R81J655
2288a054K049J603P04N36p33j406j997j862j221m36M36J203J785J663J600P26
2304C596J77r33j643k025j498j303P9L50J488J731J918J368L98m81j057j759j923
2321a517j386o76J00J042J521J827J446R79K84n91j442j792j596j547k98M10J270
2338a966J472K017J178R41l58q34j525j708j888p34j45Q12J290J726J678R25P15
2355C596m18j134j881j460j567o26K15Q98J536J897J271J033R8o33j616j358j999
2372b148r30k43L24J123J547J850J316N48l7j120j218j780j749p04P0N52J395
2389a204J527J772R81K14m96j336j403j588j077j089P15P85J428J897J322O73
$$ plain form
2405 3121 3394 2438 1075 -615 -2196 -3215 -3561 -2869 -1660 -287 1502 2763 3084 3155 2287 760 -1002
2422 -1002 -2486 -3276 -3330 -2531 -1147 502 2248 2916 3278 2752 1667 141 -1640 -2911 -3331 -2969 -1882
2439 -1882 -559 1167 2472 3020 3454 2358 1230 -766 -2150 -3015 -3107 -2685 -1647 122 1449 2653
2455 2653 3117 3176 1790 424 -1175 -2447 -3131 -2980 -2599 -836 524 2009 2857 3195 2450 1706 -134
2472 -134 -1617 -2808 -3156 -2807 -1893 -307 1180 2425 2920 3040 2164 1031 -550 -1899 -3166 -3013 -2690
2489 -2690 -1330 238 1619 2629 3133 2795 1952 131 -1451 -2460 -3101 -3054 -2105 -805 827 2255 2800
2506 2800 3079 2725 1235 -269 -1487 -2645 -3231 -2844 -1754 -538 1216 2408 3201 3134 2063 886 -647
2523 -647 -2233 -2958 -2972 -2362 -1184 158 1680 2737 3050 2607 1868 144 -1361 -2676 -3110 -3016 -2221 -534
$$ packed form
2405C121K73r56j363j690j581j019l46O92J209J373J789J261L21P1q68j527j762
2422a002j484p90n4P99J384J649J746O68L62n26j085j526j781j271m20L62J087
2439a882J323J726J305N48M34j096j128j996j384q65r2M22J038J769J327J204
2455B653M64N9j386j366j599j272o84J51L81J763J360J485Q48L38p45p44j840
2472a34j483j191l48L49R14J586J487J245M95J20q76j133j581j349j267J53L23
2489b690J360J568J381J010N04l38q43j821j582j009o41M7R49J300J632J428N45
2506B800K79l54j490j504j218j158n86L87J090J216J754J192P93o7j071j177j533
2523f47j586p25j4O10J178J342J522J057L13m43p39j724j505j315m34R4P95J687
$$ plain form
2541 -534 694 2116 2953 3142 2577 1137 -64 -1628 -2863 -2960 -2740 -1642 -203 1259 2349 3091 2885
2558 2885 2022 690 -597 -2090 -2770 -3037 -2378 -1098 384 1831 2533 2853 2719 1499 282 -1277 -2484
2575 -2484 -2911 -2661 -2090 -629 650 2049 2854 2830 2458 1246 -358 -1730 -2701 -3102 -2625 -1848 -277 1198
2593 1198 2517 3001 2780 1944 890 -758 -2001 -2871 -2718 -2248 -1225 321 1799 2634 3037 2740 1529
2610 1529 217 -1128 -2379 -2979 -2979 -2077 -617 839 1950 2635 3119 2407 1007 -327 -1678 -2593 -2980
2627 -2980 -2675 -1493 -332 1183 2329 2843 2671 1814 733 -909 -2036 -2898 -2769 -2204 -1010 470 1817
2644 1817 2405 2973 2365 1681 -13 -1198 -2324 -2871 -2591 -1952 -730 870 2184 2550 2895 2207 1055
2661 1055 -248 -1538 -2534 -2889 -2493 -1566 -154 1132 2198 2831 2605 2020 676 -737 -1894 -2602 -2779
$$ packed form
2541e34J228J422Q37J89n65j440j201j564j235r7K20J098J439J462J090P42k06
2558B885q63j332j287j493o80k67O59J280J482J447P02L20j34j220j217j559j207
2575b484m27K50N71J461J279J399Q05k4l72j212j604j372r71m01M77P77J571J475
2593A198J319M84k21q36j054j648j243q70J53M70J023J546J478Q35M03k97j211
2610A529j312j345j251o00%R02J460J456J111O85M84p12j400j334j351r15l87
2627b980L05J182J161J515J146N14j72q57j081j642j127q62J29N65J194J480J347
2644A817N88N68o08o84j694j185j126n47K80O39J222J600J314L66L45o88j152
2661A055j303j290r96l55L96R27J412J286J066O33k26n85j344j413j157p08j77
$$ plain form
2678 -2779 -2003 -855 340 1710 2408 3066 2460 1411 143 -1055 -2131 -2580 -2524 -1812 -489 458 2011
2695 2011 2583 2547 2075 1038 -308 -1505 -2356 -2655 -2260 -1280 -120 1047 2138 2704 2572 1671 509 -812
2713 -812 -1814 -2461 -2555 -1931 -923 231 1487 2389 2658 2225 1361 -1 -1215 -2198 -2671 -2325 -1473 -448
2731 -448 747 1909 2582 2590 1905 754 -141 -1467 -2474 -2416 -2009 -951 31 1124 2289 2407 2347 1678 637
2750 637 -908 -1652 -2353 -2469 -1991 -1014 218 1305 2348 2542 2290 1375 153 -1261 -2133 -2255 -2379 -1550
2768 -1550 -419 700 1796 2231 2284 1878 880 -211 -1498 -2238 -2666 -1985 -937 -280 1155 2000 2369 2211
2786 2211 1585 528 -691 -1942 -2582 -2346 -2091 -766 134 1447 2271 2428 1814 1058 54 -1098 -2023
2803 -2023 -2478 -2123 -1365 -619 709 1842 2546 2569 1629 759 -370 -1468 -2214 -2452 -2045 -1164 48 1153
$$ packed form
2678b779P76J148J195J370O98O58o06j049j268j198j076m49N6P12J323R47J553
2695B011N72l6m72j037j346j197q51k99L95R80J160J167J091N66j32r01j162j321
2713h12j002o47r4O24J008J154J256R02K69m33q64j362j214r83m73L46Q52J025
2731d48J195J162O73Qo85j151q95j326j007N8M07J058R82J093J165J18o0o69j041
2750F37j545p44p01j16M78R77J232J087J043J94k52r15j222j414q72j22j24Q29
2768a550J131J119J096M35N3m06r98j091j287p40m28O81J048O57J435Q45L69j58
2786B211o26j057j219j251o40K36K55J325R00J313Q24J57o14p56j004j152r25
2803b023m55L55P58P46J328J133P04K3r40q70j129j098p46k38M07Q81J212J105
$$ plain form
2821 1153 1913 2494 2166 1321 284 -753 -1987 -2411 -2395 -1823 -776 446 1521 2170 2337 2150 1261 61
2839 61 -969 -1989 -2012 -2155 -1435 -351 862 1706 2338 2177 1697 752 -332 -1448 -2258 -2339 -1758 -1330 -174
2858 -174 1301 1967 2394 2228 1501 452 -650 -1519 -2318 -2270 -1672 -792 271 1425 1998 2191 1817 993 91
2877 91 -1277 -1867 -2282 -1845 -1247 -373 703 1584 2104 1944 1463 570 -315 -1553 -1994 -2355 -2112 -1099 -4
2896 -4 1053 1925 2051 1914 1430 71 -739 -1583 -2043 -2240 -1681 -652 424 1334 1951 2121 1517 942 -114
2915 -114 -1101 -1666 -1976 -1973 -1229 -405 612 1704 1956 1994 1490 698 -255 -1440 -1888 -2342 -1684 -936 -144 901
2935 901 1745 2004 2028 1271 323 -845 -1624 -2052 -2029 -1484 -631 252 1487 1748 2170 1574 865 -124 -1077 -1589
2955 -1589 -1972 -1808 -1144 -306 739 1591 1930 2039 1558 674 -518 -1268 -1805 -2163 -1509 -928 49 1145 1742
$$ packed form
2821A153P60N81l28q45j037j037j234m24J6N72J047J222J075O49J67j87q89j200
2839F1j030j020k3j43P20J084J213Q44O32j61m80r45j084j116q10q1N81M28J156
2858a74J475O66M27j66p27j049j102q69p99M8N98Q80J063J154N73J93l74q24r02
2877I1j368n90m15M37N98Q74J076Q81N20j60m81q93q85j238m41l61K43J013J095
2896dJ057Q72J26j37m84j359q10q44m60j97N59J029J076R10O17J70o04n75j056
2915a14r87n65l10LP44Q24J017J092K52L8n04p92r53j185m48m54O58P48P92J045
2935I01Q44K59K4p57r48j168p79m28K3N45Q53Q83J235K61M22n96p09r89r53n12
2955a589l83J64O64Q38J045Q52L39J09m81q84j192p50n37l58O54N81R77J096N97
$$ plain form
2974 1742 1873 1847 1199 433 -629 -1469 -1593 -1760 -1556 -725 309 1032 1902 1871 1918 975 100 -1330 -1716 -1973
2994 -1973 -1621 -1234 -147 698 1422 1743 1840 1429 720 -327 -1327 -1766 -1845 -1553 -977 -130 978 1647 1910
3013 1910 1647 1189 240 -745 -1462 -1923 -1934 -1288 -575 475 1221 1673 2003 1420 925 158 -1071 -1602 -2047
3032 -2047 -1743 -1296 -287 688 1385 1799 1815 1439 591 -298 -1143 -1724 -2007 -1452 -624 112 744 1449 1681 1550
3052 1550 1011 175 -655 -1444 -1894 -1966 -1225 -604 105 1157 1684 1562 1440 618 -9 -996 -1692 -2073 -1645 -1186
3072 -1186 -258 733 1484 1522 1755 1400 628 -254 -1242 -1859 -2013 -1564 -1216 -50 798 1335 1489 1717 1019 163
3092 163 -414 -1246 -1569 -1471 -995 -469 286 1140 1520 1586 1591 679 3 -800 -1616 -1697 -1647 -975 -160 794 1270 1696
3114 1696 1677 1313 382 -178 -883 -1540 -1572 -1424 -803 -52 975 1268 1787 1387 954 120 -443 -1186 -1725 -1422
$$ packed form
2974A742J31k6o48p66j062q40j24j67K04Q31J034P23Q70l1M7r43q75j430l86k57
2994a973L52L87J087Q45P24L21R7m11p09j047j000m39p9K92N76Q47J108O69K63
3013A910k63m58r49r85p17m61j1O46P13J050P46M52L30n83m95p67j229n31m45
3032b047L04M47J009R75O97M14J6l76q48q89q45n81k83N55Q28P36O32P05K32j31
3052A550n39q36q30p89m50p2P41O21P09J052N27j22j22q22o27r87o96l81M28M59
3072a186R28R91P51L8K33l55p72q82r88o17j54M49L48J166Q48N37J54K28o98q56
3092A63n77q32l23R8M76N26P55Q54L80O6Nr12o76q03q16q1N0O72Q15R54M76M26
3114A696j9l64r31n60p05o57l2J48O21P51J027K93N19m00m33q34n63p43n39L03
$$ plain form
3134 -1422 -1083 -421 274 1311 1564 1602 1521 672 -33 -673 -1317 -1659 -1280 -894 -254 500 1092 1477 1587 1032
3154 1032 423 -314 -963 -1435 -1688 -1321 -695 -38 651 1193 1533 1417 1092 325 -451 -1014 -1638 -1430 -1317 -266
3174 -266 268 831 1706 1760 1270 808 105 -966 -1270 -1570 -1642 -901 -125 601 1066 1351 1569 1049 487 -195
3194 -195 -830 -1226 -1487 -1367 -668 -68 584 1177 1451 1420 806 290 -575 -1073 -1597 -1362 -1206 -379 375 1055
3214 1055 1256 1618 1154 627 -87 -446 -1406 -1352 -1310 -995 -225 572 1080 1487 1331 1039 522 -234 -791 -1236
3234 -1236 -1404 -1083 -571 -144 537 1152 1330 1364 951 330 -336 -1248 -1436 -1507 -1010 -306 239 1064 1266 1395
3254 1395 1122 577 -112 -574 -1138 -1374 -1165 -968 -179 471 1188 1359 1199 1029 456 -434 -823 -1335 -1238 -1263
3274 -1263 -592 -82 752 1281 1279 1198 697 211 -332 -756 -1231 -1223 -979 -483 466 725 1143 1321 1173 636 104
$$ packed form
3134a422L39O62O95J037K53L8q1q49p05o40o44l42L79L86O40P54N92L85J10n55
3154A032o09p37o49m72k53L67O26O57O89N42L40j16l25p67p76n63o24K08J13J051
3174b66N34N63Q75N4m90m62p03j071l04l00p2P41P76P26M65K85K18n20n62o82
3194a95o35l96k61J20O99O00O52N93K74l1o14n16q65m98n24K35J56Q27P54O80
3214A055K01L62m64n27p14l59r60N4M2L15P70P97N08M07j56k92n17p56n57m45
3234a236j68L21N12M27O81O15J78L4m13o21o66r12j88p1M97P04N45Q25K02J29
3254A395k73n45o89m62n64k36K09J97P89O50P17J71j60j70n73q90l89n12R7k5
3274a263O71N10Q34N29kq1n01m86n43m24m75QK44M96R49K59M18J78j48n37n32
$$ plain form
3295 104 -751 -1072 -1153 -987 -754 -345 586 1116 1316 1427 1066 289 -100 -957 -1415 -1263 -1261 -759 -197 613 1192
3316 1192 1244 1037 657 349 -682 -1024 -1451 -1407 -904 -299 146 808 1014 1143 1121 575 145 -639 -880 -1189
3336 -1189 -1192 -727 -247 586 662 1166 1196 938 670 -334 -679 -1216 -1186 -949 -864 -31 549 911 1320 1069 858
3357 858 217 -337 -959 -939 -1109 -1060 -367 224 683 1031 1120 1302 542 -19 -659 -903 -1061 -1196 -905 34 233
3378 233 900 1361 1129 862 456 -74 -704 -1266 -1322 -934 -512 32 333 959 1296 1136 767 141 -364 -786
3398 -786 -1115 -1095 -859 -482 220 641 885 1209 724 551 5 -631 -983 -1054 -1140 -862 -127 480 834 1032 1275
3419 1275 822 272 -136 -740 -940 -982 -1115 -601 -103 252 889 1316 974 750 148 -114 -772 -939 -1154 -1058
3439 -1058 -531 185 605 1042 940 830 701 98 -481 -871 -1058 -1178 -656 -321 393 750 1083 1052 941 441
$$ packed form
3295A04q55l21q1J66K33M09R31N30K00J11l61p77l89q57m58J52KN02N62Q10N79
3316A192N2k07l80l08j031l42m27M4N03O05M45O62K06J29k2n46m30p84k41l09
3336a189lM65M80Q33P6N04L0k58k68j004l45n37L0K37Q5Q33N80L62M09k51k11
3357H58o41n54o22K0j70M9O93N91M59L48Q9J82p60n61o40k44j58j35K91R39J99
3378B33O67M61k32k67m06n30o30n62n6L88M22N44L01O26L37j60l69o26n05m22
3398g86l29K0K36L77P02M21K44L24m85j73n46o36l52p1q6K78P35O07L54J98K43
3419A275m53n50m08o04k00m2j33N14M98L55O37M27l42k24o02k62o58j67k15R6
3439a058N27P16M20M37j02j10j29o03n79l90j87j20N22L35P14L57L33l1j11n00
$$ plain form
3459 441 -78 -669 -1004 -1127 -977 -539 114 357 816 889 1017 750 200 -249 -728 -951 -1056 -642 -638 71 744
3480 744 846 1133 801 588 314 -350 -875 -1055 -1003 -827 -352 206 765 1039 1001 874 203 20 -378 -893 -864
3501 -864 -1014 -621 -4 542 793 1014 1006 776 186 -204 -618 -829 -1222 -897 -172 -99 568 978 861 903 373
3522 373 -101 -334 -798 -1217 -739 -421 -69 321 797 929 921 724 482 -133 -559 -1028 -867 -785 -499 -159 229
3543 229 992 910 726 647 124 -436 -609 -1066 -874 -559 -409 111 514 653 987 769 658 39 -223 -783 -1083
3564 -1083 -863 -606 -289 198 577 762 848 848 246 -107 -441 -723 -735 -731 -408 -8 367 823 977 937 752 283
3586 283 -155 -873 -818 -955 -667 -460 353 509 705 823 717 319 53 -589 -587 -1033 -786 -558 -355 259 502
3607 502 949 819 498 420 -174 -510 -688 -877 -803 -566 -129 191 782 843 449 396 303 -216 -533 -775 -879 -540
$$ packed form
3459D41n19n91l35j23J50M38O53K43M59P3J28k67n50m49m79k23j05M14MP09O73
3480G44J02K87l32k13k74o64n25j80N2J76M75N58N59K74l8j27o71j83l98n15K9
3501h64j50L93O17N46K51K21qk30n90l90m14k11l93L25P25P3O67M10j17M2n30
3522C73m74k33m64m19M78L18L52L90M76J32qj97k42o15m26m69J61Q2K86L40L88
3543B29P63q2j84p9n23n60j73m57J92L15J50N20M03J39L34k18j11o19k62n60l00
3564a083K20K57L17M87L79J85Q6%o02l53l34k82j2ML23M00L75M56J54m0j85m69
3586B83m38p18N5j37K88K07Q13J56J96J18j06l98k66o42Km46K47K28K03O14K43
3607E02M47j30l21p8n94l36j78j89P4K37M37L20N91O1l94n3r3n19l17k42j04L39
$$ plain form
3629 -540 -328 237 386 808 744 528 429 20 -476 -644 -998 -801 -555 -260 267 530 816 767 645 463 -96
3650 -96 -522 -606 -1077 -804 -494 40 514 637 870 1007 405 99 -212 -448 -875 -889 -503 -331 -158 404 686
3671 686 730 903 468 109 -317 -698 -818 -804 -549 -130 14 592 696 888 512 77 -137 -235 -778 -783 -751 -406
3693 -406 160 285 622 755 607 445 72 -100 -504 -683 -722 -421 -520 174 326 645 606 728 383 144 -251
3714 -251 -791 -612 -599 -456 -288 101 403 710 633 528 406 -4 -427 -856 -509 -840 -464 -204 229 509 712
3735 712 592 564 378 -208 -260 -533 -718 -592 -413 195 551 633 934 648 331 22 -250 -499 -558 -764 -544
3756 -544 -152 148 603 603 831 642 52 108 -250 -759 -743 -602 -693 -208 252 669 669 610 439 199 -32 -480 -613
3779 -613 -722 -651 -296 93 415 466 566 422 415 -50 -250 -470 -599 -577 -281 -104 224 419 685 776 435 333
$$ packed form
3629e40K12N65J49M22o4k16r9m09m96j68l54J97K46K95N27K63K86m9j22j82n59
3650i6m26q4m71K73L10N34M74J23K33J37o02l06l11k36m27j4L86J72J73N62K82
3671F86M4J73m35l59m26l81j20J4K55M19J44N78J04J92l76m35k14r8n43nL2L45
3693d06N66J25L37J33j48j62l73j72m04j79l9L01r9O94J52L19l9J22l45k39l95
3714b51n40J79J3J43J68L89L02L07p7j05j22m10m23m29L47l31L76K60M33K80K03
3735G12j20k8j86n86n2k73j85J26J79O08L56Q2L01k86l17l09k72k49n9k06K20
3756e44L92L00M55%K28j89n90N6l58n09J6J41r1M85M60M17%n9j71k40k31m48j33
3779f13j09P1L55L89L22N1J00j44pm65k00k20j29K2K96J77L28J95K66R1l41j02
$$ plain form
3801 333 -227 -62 -900 -862 -770 -461 -38 462 676 662 526 690 142 -200 -444 -595 -579 -467 -224 -15 250
3822 250 931 631 768 115 107 -397 -537 -780 -610 -538 -108 205 484 709 739 395 236 -204 -727 -644 -598 -513
3844 -513 -301 104 337 358 598 747 335 91 -202 -180 -783 -746 -351 -268 61 261 518 712 621 283 11 -210
3866 -210 -642 -668 -653 -269 -105 248 412 750 662 347 135 120 -417 -641 -618 -564 -395 29 286 507 657 691
3888 691 386 89 -121 -432 -478 -785 -368 -169 27 421 528 590 508 287 -197 -79 -631 -682 -866 -423 6
3909 6 337 488 715 515 559 339 -161 -549 -520 -524 -272 -230 233 270 517 500 612 579 -125 -242 -601 -676 -732 -335
3933 -335 -171 115 339 491 592 674 385 -50 -248 -530 -485 -506 -377 -122 194 422 520 417 443 461 83 -340
3955 -340 -578 -661 -509 -264 14 320 483 350 570 424 151 -131 -245 -705 -648 -466 -272 223 510 482 567
$$ packed form
3801C33n60J65q38L8R2L09M23N00K14j4j36J64n48l42k44j51J6J12K43K09K65
3822B50O81l00J37o53qn04j40k43J70P2M30L13K79K25L0l44j59m40n23Q3M6Q5
3844e13K12M05K33K1K40J49m12k44k93K2o03L7L95Q3L29K00K57J94r1l38k72k21
3866b10m32k6J5L84J64L53J64L38q8l15k12j5n37k24K3N4J69M24K57K21J50L4
3888F91l05k97k10l11m6l07M17J99J96L94J07O2q2k21m84J18n52n1j84M43M29
3909FL31J51K27k00M4k20n00l88K9mK52M2M63L7K47j7J12l3p04j17l59p5n6L97
3933c35J64K86K24J52J01Q2k89m35j98k82M5k1J29K55L16K28R8j03K6J8l78m23
3955c40k38q3J52K45K78L06J63j33K20j46k73k82j14m60N7J82J94M95K87k8Q5
$$ plain form
3976 567 560 375 101 -264 -310 -640 -594 -272 -142 -75 463 570 674 462 240 -196 -287 -507 -397 -424 -316 -177
3998 -177 210 666 643 847 526 -153 -187 -302 -545 -551 -509 -125 -31 503 658 798 584 176 -167 -390 -452 -649
4020 -649 -751 -332 -165 -22 436 481 555 576 255 -1 -399 -605 -621 -495 -429 188 268 455 630 552 327 292 12
4043 12 -477 -457 -442 -521 -154 52 177 625 704 257 325 -21 -204 -749 -734 -344 -278 -91 316 331 485 578 351
4066 351 200 -200 -334 -429 -616 -422 -164 99 160 472 543 436 427 184 -255 -455 -257 -556 -601 -370 96 315
4088 315 436 388 377 24 24 -186 -414 -766 -364 -338 -103 286 317 489 507 538 272 16 -316 -605 -440 -326 -246
4111 -246 5 171 467 512 496 397 188 -138 -361 -538 -403 -133 -43 202 499 501 574 449 104 3 -295 -528
4133 -528 -581 -442 -466 -268 232 353 609 591 271 129 -16 -372 -328 -339 -398 -462 100 147 80 645 400 229 47
$$ packed form
3976E67pj85k74l65m6l30M6L22J30O7N38J07J04k12k22m36r1k20J10k7J08J39
3998a77L87M56k3K04l21o79l4j15k43oM2L84R4N34J55J40k14m08l43k23o2j97
4020f49j02M19J67J43M58M5P4K1l21k56l98k06j6J26O6O17Q0J87J75p8k25l5k80
4043A2m89K0J5p9L67K06J25M48P9m47O8l46j83n45J5L90O6J87M07J5J54R3k27
4066C51j51m00j34r5j87J94K58K63O1L12P1j07rk43m39k00J98k99m5K31M66K19
4088C15J21m8j1l53%k10k28l52M02K6K35L89L1J72J8L1k66k56l32k89J65J14Q0
4111b46K51J66K96M5j6r9k09l26k23j77J35K70R0K45K97KP3j25l45j01k98k33
4133e28n3J39k4J98N00J21K56j8l20j42j45l56M4j1n9o4N62M7o7N65k45j71j82
$$ plain form
4156 47 -63 -315 -345 -477 -489 -169 -80 476 323 474 426 220 246 -219 -311 -153 -488 -266 26 104 257 646 434
4179 434 509 172 -160 -378 -654 -509 -393 -131 40 206 274 396 589 336 67 -122 -549 -375 -227 -466 -148
4200 -148 -172 132 395 522 115 235 -13 -121 -218 -441 -452 -248 -82 137 332 426 599 354 219 110 -169
4221 -169 -308 -465 -631 -330 104 103 405 129 437 347 98 -49 -196 -297 -365 -166 -189 -52 362 343 372 202
4243 202 156 -148 -322 -119 -338 -589 -465 5 186 130 432 468 228 258 -101 -386 -293 -223 -450 -321 -17 106
4265 106 447 397 462 172 41 -244 -307 -461 -280 -387 -178 246 162 309 489 371 328 151 -227 -477 -561 -511
4287 -511 -266 -141 -17 275 216 433 320 200 -210 -133 -428 -514 -303 -86 92 -123 221 328 508 373 -79
4308 -79 50 -270 -344 -385 -210 -195 -116 186 433 452 196 99 -9 -319 -209 -288 -285 -163 -317 -38 279 439 587
$$ packed form
4156D7j10k52l0j32j2L20Q9N56j53J51m8k06K6m65r2J58l35K22K92P8J53L89k12
4179D34P5l37l32k18k76J45J16K62J71J66O8J22J93k53k69j89m27J74J48k39L18
4200a48k4L04K63J27m07J20k48j08r7k23j1K04J66K19J95R4J73k45j35j09k79
4221a69j39j57j66L01M34jL02k76L08r0k49j47j47j01o8J99k3J37M14j9K9j70
4243B02m6l04j74K03k19k51J24M70J81n6L02L6k40L0l59k85R3P0k27J29L04J23
4265A06L41n0O5k90j31k85o3j54J81j07K09M24q4J47J80j18m3j77l78k50q4N0
4287e11K45J25J24K92n9K17j13j20m10P7k95q6K11K17J78k15L44J07J80j35m52
4308g9J29l20p4m1J75J5P9L02K47J9k56r7j08l10J10p9LJ22j54K79L17J60J48
$$ plain form
4331 587 356 204 -135 -216 -371 -328 -597 -444 111 142 97 469 368 192 56 -268 -24 -469 -503 -360 43 181
4353 181 374 388 355 365 108 42 -62 -269 -374 -408 -493 189 179 395 537 335 291 214 78 -206 -317 -328 -418 -299
4377 -299 100 73 219 384 262 89 -86 -88 -173 -342 -285 -384 -192 -6 189 140 500 467 177 114 -148 -297 -292 -281
4401 -281 -295 -121 -41 335 277 392 451 226 -157 -471 -412 -276 -269 -247 -1 92 190 252 571 282 112 -98 -398 -366
4425 -366 -536 -310 -222 155 333 156 375 224 159 -80 -185 -371 -265 -261 -140 -167 59 346 396 551 266 345
4447 345 -180 -272 -329 -221 -260 -273 -22 148 148 415 439 145 109 -159 -215 -320 -57 -404 -139 20 55 162 441
4470 441 221 -45 25 -169 -283 -190 -318 -207 9 -167 289 270 474 48 353 138 -129 -316 -363 -412 -321 -53
4492 -53 -155 165 204 324 129 116 -207 -52 -197 -315 -300 -339 128 -68 344 236 439 25 15 -82 -318 -189
$$ packed form
4331E87k31j52l39q1j55M3k69J53N55L1m5L72j01j76j36l24K44m45l4J43M03J38
4353A81J93J4l3J0k57o6j04k07j05l4q5O82j0K16J42k02m4p7j36k84j11j1r0J19
4377b99L99k7J46J65j22j73j75kq5j69N7r9J92J86J95m9L60l3k90o3k62j49NJ1
4401b81j4J74Q0L76n8J15N9k25l83l14N9J36PK2K46R3R8O2L19k89j70k10l00L2
4425c66j70K26Q8L77J78j77K19j51o5k39j05j86J06MJ21k7K26K87N0J55k85P9
4447C45n25r2n7J08l9j3K51J70%K67K4k94l6k68n6j05K63l47K65J59L5J07K79
4470D41k20k66P0j94j14R3j28J11K16j76M56j9K04m26L05k15k67j87m7m9R1K68
4492e3j02L20L9J20j95j3l23J55j45j18J5l9M67j96M12j08K03m14j0r7k36J29
$$ plain form
4514 -189 -160 -232 113 162 178 462 199 251 215 0 -208 -105 -27 -344 -317 -124 51 244 149 501 -67 125 -169
4537 -169 -180 -232 -101 -291 3 -81 208 112 148 476 254 46 -289 -220 -285 -270 -270 -81 -203 -43 147 360 167
4560 167 230 -15 -64 -185 -202 -245 -104 -31 78 344 226 154 60 93 108 -311 125 -29 -217 -19 -116 -37 185 245
4584 245 81 260 113 97 -164 -285 -248 146 1 49 202 330 293 87 57 -117 -324 -158 -124 -24 -318 -38
4606 -38 61 289 78 367 -10 10 -73 -34 -237 -285 -128 -197 105 251 291 175 134 -115 76 -132 83 -56 -149
4629 -149 -204 -12 -148 -12 224 28 205 -59 27 -1 -233 -299 -281 -129 18 -64 76 208 196 286 96 147 -77
4652 -77 -243 -206 -77 -103 60 173 155 460 15 280 -52 192 -228 -198 -102 -192 -19 -22 126 313 123 142 269
4675 269 65 142 -99 -311 36 0 -78 217 260 14 218 275 120 -84 -98 25 -170 30 -77 -34 161 -72
$$ packed form
4514a89K9p2L45M9J6K84k63N2l6k15k08J03P8l17K7J93J75J93r5L52n68J92k94
4537a69j1n2J31j90K94q4K89r6L6L28k22k08l35O9o5J5%J89j22J60J90K13j93
4560A67O3k45m9j21j7m3J41P3J09K66j18p2r4L3J5m19M36j54j88J98r7P9K22O0
4584B45j64J79j47j6k61j21L7L94j45M8J53J28l7k06l0j74k07J66L4J00k94K80
4606c8R9K28k11K89l77K0q3L9k03m8J57o9L02J46M0j16m1k49J91k08K15j39r3
4629a49n5J92j36J36K36j96J77k64Q6k8k32o6J8J52J47q2J40J32j2R0j90N1k24
4652g7j66L7J29k6J63J13j8L05m45K65l32K44m20L0R6r0J73lJ48J87j90J9J27
4675B69k04P7k41k12L47l6p8K95M3k46K04N7j55k04j4J23j95K00j07M3J95k33
$$ plain form
4697 -72 185 160 95 29 -55 -105 -154 -377 -249 -375 -186 73 -28 352 465 220 -17 29 20 -265 -68 -241 -162 -112
4721 -112 -198 -5 133 -5 5 26 -275 -303 -157 -158 -238 43 57 23 162 200 178 -10 163 -59 -231 -317 -192 -3
4745 -3 -65 -29 86 60 265 273 81 -6 -24 -145 -305 -244 -44 -207 -102 188 301 213 96 56 -165 -206 -50 -266
4769 -266 -169 -134 -152 262 18 -3 69 -9 -89 -152 -133 -252 -247 -108 -91 228 238 177 201 130 228 27 -187 -103 -97 -149 -69
4796 -69 -19 230 -34 112 311 140 2 -104 -112 196 47 -88 12 -4 35 196 60 17 42 35 -62 -201 -164 -218
4820 -218 -173 100 59 -25 137 96 141 67 34 -246 -146 -35 -174 -140 -96 91 153 113 187 81 209 -53 -163 -296
4844 -296 -37 -14 -105 85 -44 116 -8 225 148 86 104 -235 16 -50 14 -376 -402 127 -12 72 188 111 0
4867 0 101 16 -242 -124 -195 -154 -121 70 28 114 221 -63 1 83 -10 -144 -258 -39 -198 -29 99 109 34 139
$$ packed form
4697g2K57k5o5o6q4n0m9k23J28j26J89K59j01L80J13k45k37M6rk85J97j73P9N0
4721a12q6J93J38j38J0K1l01k8J46jq0K81J4l4J39L8k2j88J73k22j72q6J25J89
4745co2L6J15k6K05Qj92q7j8j21j60O1K00j63J05K90J13q8j17m0k21m1J56k16
4769b66R7L5j8M14k44k1P2p8q0o3J9j19NJ39J7L19J0o1K4p1R8k01k14Q4On2Q0
4796f9N0K49k64J46J99j71j38j06qL08j49j35J00j6L9J61j36m3K5pr7j39L7n4
4820b18M5K73m1q4J62m1M5p4l3k80J00J11j39L4M4J87O2m0P4j06J28k62j10j33
4844b96K59K3r1J90j29J60j24K33p7o2J8l39K51o6O4l90k6N29j39Q4J16p7j11
4867@J01q5k58J18p1M1L3J91m2Q6J07k84O4Q2r3j34j14K19j59J69J28J0p5J05
$$ plain form
4891 139 -12 72 -153 -68 -11 9 -139 -78 90 105 219 250 152 62 -128 -227 -1 -346 -166 97 -28 -82 -79 11 141
$$ packed form
4891A39j51Q4k25Q5N7K0j48O1J68J5J14L1r8r0j90r9K26l45J80K63j25n4LR0J30
$$ [...]
8191a55
##END NTUPLES=NMR FID
##END=
