##TITLE=1H_Pr X-1
 200.13MHz, CCl4,
 8 sc
 
 24.4.2025
##JCAMPDX= 6.0         $$ Bruker NMR JCAMP-DX V2.0
##DATA TYPE= NMR FID
##DATA CLASS= NTUPLES
##ORIGIN= UXNMR, Bruker Analytische Messtechnik GmbH
##OWNER= pz
$$ XWIN-NMR		Version 3.5
$$ Thu Apr 24 13:54:45 2025 Russian Standard Time (UT+4h)  she@DPX200
##.OBSERVE FREQUENCY= 200.1313
##.OBSERVE NUCLEUS= ^1H
##.DELAY= (6, 6)
##.ACQUISITION MODE= SIMULTANEOUS
##.ACQUISITION SCHEME= undefined
##.AVERAGES= 8
##.DIGITISER RES= 18
##SPECTROMETER/DATA SYSTEM= spect
##.PULSE SEQUENCE= zg30
##.SOLVENT NAME= CDCl3
##.SHIFT REFERENCE= (INTERNAL, CDCl3, 0, 14.3821)
##AUDIT TRAIL= $$ (NUMBER, WHEN, WHO, WHERE, WHAT)
$$ ##TITLE= Audit trail, XWIN-NMR		Version 3.5
$$ ##JCAMPDX= 5.01
$$ ##ORIGIN= Bruker BioSpin GmbH
$$ ##OWNER= she
$$ F:/spectra/data/she/nmr/H-C/1/audita.txt
$$ ##AUDIT TRAIL=  $$ (NUMBER, WHEN, WHO, WHERE, WHAT)
(   1,<2025-04-24 13:52:50.37 +0400>,<she>,<DPX200>,
      <created by zg, POWCHK disabled, PULCHK disabled
       configuration hash MD5:
       00 E9 B6 7A A2 85 ED C7 34 08 36 98 17 FE 4E 26
       data hash MD5: 16K
       07 66 1B E7 1E 08 44 DE 0E 85 3A 83 16 3A CA 85>)
$$ ##END=
$$ 
$$ hash MD5
$$ 25 BA DC 67 42 9F 39 08 51 3B 9E 2E 92 E2 83 3B
##$RELAX= 
##$RELAX= 
##$RELAX= 
##$RELAX= 
##$RELAX= 
##$RELAX= 
$$ Bruker specific parameters
$$ --------------------------
##$DU= <F:/spectra>
##$EXPNO= 1
##$NAME= <H-C>
##$PROCNO= 1
##$TYPE= <nmr>
##$USER= <she>
##$AMP= (0..31)
100 100 100 100 100 100 100 100 100 100 100 100 100 100 100 100 100 100 
100 100 100 100 100 100 100 100 100 100 100 100 100 100 
##$AQSEQ= 0
##$AQ_mod= 1
##$AUNM= <au_zg>
##$AUTOPOS= <>
##$BF1= 200.13
##$BF2= 200.13
##$BF3= 200.13
##$BF4= 200.13
##$BF5= 200.13
##$BF6= 200.13
##$BF7= 200.13
##$BF8= 200.13
##$BYTORDA= 1
##$CFDGTYP= 0
##$CFRGTYP= 5
##$CHEMSTR= <none>
##$CNST= (0..31)
1 1 145 1 1 1 1 1 1 1 1 1 1 1 1 1 1 1 1 1 1 1 1 1 1 1 1 1 1 1 1 1 
##$CPDPRG= <>
##$CPDPRG1= <>
##$CPDPRG2= <>
##$CPDPRG3= <>
##$CPDPRG4= <mlev>
##$CPDPRG5= <mlev>
##$CPDPRG6= <mlev>
##$CPDPRG7= <mlev>
##$CPDPRG8= <mlev>
##$CPDPRGB= <>
##$CPDPRGT= <>
##$D= (0..31)
0 0.7 0 0 0 0 0 0 0 0 0 0.03 0 0 0 0 0 0 0 0 0 0 0 0 0 0 0 0 0 0 0 0 
##$DATE= 1745488369
##$DBL= (0..7)
120 120 120 120 120 120 120 120 
##$DBP= (0..7)
150 150 150 150 150 150 150 150 
##$DBP07= 0
##$DBPNAM0= <>
##$DBPNAM1= <>
##$DBPNAM2= <>
##$DBPNAM3= <>
##$DBPNAM4= <>
##$DBPNAM5= <>
##$DBPNAM6= <>
##$DBPNAM7= <>
##$DBPOAL= (0..7)
0.5 0.5 0.5 0.5 0.5 0.5 0.5 0.5 
##$DBPOFFS= (0..7)
0 0 0 0 0 0 0 0 
##$DE= 6
##$DECBNUC= <off>
##$DECIM= 32
##$DECNUC= <off>
##$DECSTAT= 4
##$DIGMOD= 1
##$DIGTYP= 9
##$DL= (0..7)
0 120 120 120 120 120 120 120 
##$DP= (0..7)
150 150 150 150 150 150 150 150 
##$DP07= 0
##$DPNAME0= <>
##$DPNAME1= <>
##$DPNAME2= <>
##$DPNAME3= <>
##$DPNAME4= <>
##$DPNAME5= <>
##$DPNAME6= <>
##$DPNAME7= <>
##$DPOAL= (0..7)
0.5 0.5 0.5 0.5 0.5 0.5 0.5 0.5 
##$DPOFFS= (0..7)
0 0 0 0 0 0 0 0 
##$DQDMODE= 0
##$DR= 18
##$DS= 0
##$DSLIST= <SSSSSSSSSSSSSSS>
$$ [...]
##$SUBNAM0= <"">
##$SUBNAM1= <"">
##$SUBNAM2= <"">
##$SUBNAM3= <"">
##$SUBNAM4= <"">
##$SUBNAM5= <"">
##$SUBNAM6= <"">
##$SUBNAM7= <"">
##$SUBNAM8= <"">
##$SUBNAM9= <"">
##$SW= 18.0517328524113
##$SWIBOX= (0..15)
0 0 2 0 0 0 0 0 0 0 0 0 0 0 0 0 
##$SW_h= 3612.71676300578
##$TD= 16384
##$TD0= 1
##$TE= 0
##$TE2= 300
##$TE3= 300
##$TEG= 300
##$TL= (0..7)
0 120 120 120 120 120 120 120 
##$TP= (0..7)
150 150 150 150 150 150 150 150 
##$TP07= 0
##$TPNAME0= <>
##$TPNAME1= <>
##$TPNAME2= <>
##$TPNAME3= <>
##$TPNAME4= <>
##$TPNAME5= <>
##$TPNAME6= <>
##$TPNAME7= <>
##$TPOAL= (0..7)
0.5 0.5 0.5 0.5 0.5 0.5 0.5 0.5 
##$TPOFFS= (0..7)
0 0 0 0 0 0 0 0 
##$TUNHIN= 0
##$TUNHOUT= 0
##$TUNXOUT= 0
##$USERA1= <user>
##$USERA2= <user>
##$USERA3= <user>
##$USERA4= <user>
##$USERA5= <user>
##$V9= 5
##$VALIST= <valist>
##$VCLIST= <CCCCCCCCCCCCCCC>
##$VD= 0
##$VDLIST= <DDDDDDDDDDDDDDD>
##$VPLIST= <PPPPPPPPPPPPPPP>
##$VTLIST= <TTTTTTTTTTTTTTT>
##$WBST= 1024
##$WBSW= 4
##$XGAIN= (0..3)
0 0 0 0 
##$XL= 0
##$YL= 0
##$YMAX_a= 137567
##$YMIN_a= -136984
##$ZGOPTNS= <>
##$ZL1= 120
##$ZL2= 120
##$ZL3= 120
##$ZL4= 120
##$ABSF1= 10
##$ABSF2= 0
##$ABSG= 5
##$ABSL= 3
##$ALPHA= 0
##$AQORDER= 0
##$ASSFAC= 0
##$ASSFACI= 0
##$ASSFACX= 0
##$ASSWID= 0
##$AUNMP= <proc_1d>
##$AZFE= 0.1
##$AZFW= 0.1
##$BCFW= 1
##$BC_mod= 2
##$BYTORDP= 1
##$COROFFS= 0
##$CY= -3
##$DATMOD= 1
##$DC= 2
##$DFILT= <>
##$DTYPP= 0
##$F1P= 0
##$F2P= 0
##$FCOR= 0.5
##$FTSIZE= 0
##$FT_mod= 4
##$GAMMA= 1
##$GB= 0.15
##$INTBC= 1
##$INTSCL= 1
##$ISEN= 128
##$LB= 0.25
##$LEV0= 0
##$LPBIN= 0
##$MAXI= 10000
##$MC2= 0
##$MEAN= 0
##$ME_mod= 0
##$MI= 1.114404
##$NCOEF= 0
##$NC_proc= 0
##$NLEV= 6
##$NOISF1= 3.799351
##$NOISF2= 2.8
##$NSP= 1
##$NTH_PI= 0
##$NZP= 0
##$OFFSET= 14.38212
##$PC= 1
##$PHC0= -826.8645
##$PHC1= 2.192202
##$PH_mod= 1
##$PKNL= yes
##$PPARMOD= 0
##$PSCAL= 0
##$PSIGN= 0
##$REVERSE= no
##$SF= 200.129724274929
##$SI= 16384
##$SIGF1= 3
##$SIGF2= 2
##$SINO= 400
##$SIOLD= 16384
##$SREGLST= <1H.CDCl3>
##$SSB= 0
##$STSI= 0
##$STSR= 0
##$SW_p= 3205.1282051282
##$SYMM= 0
##$S_DEV= 0
##$TDeff= 0
##$TDoff= 0
##$TI= <>
##$TILT= no
##$TM1= 0
##$TM2= 0
##$TOPLEV= 0
##$USERP1= <user>
##$USERP2= <user>
##$USERP3= <user>
##$USERP4= <user>
##$USERP5= <user>
##$WDW= 1
##$XDIM= 8192
##$YMAX_p= 0
##$YMIN_p= 0
$$ End of Bruker specific parameters
$$ ---------------------------------
##NTUPLES= NMR FID
##VAR_NAME=  TIME,          FID/REAL,        FID/IMAG
##SYMBOL=    X,             R,               I
##VAR_TYPE=  INDEPENDENT,   DEPENDENT,       DEPENDENT
##VAR_FORM=  AFFN,          ASDF,            ASDF
##VAR_DIM=   8192,          8192,            8192
##UNITS=     SECONDS,       ARBITRARY UNITS, ARBITRARY UNITS
##FACTOR=    0.0002768,     1,               1
##FIRST=     0,             0,               0
##LAST=      2.2672688,     0,               0
##MIN=       0,             -136984,         0
##MAX=       2.2672688,     137567,          0
$$ Real data points
##PAGE= N=1
##DATA TABLE= (X++(R..R)), XYDATA
$$ [...]
2386B444m11k27q14m99r85l37j009n2l40k01L76n7P17M21O58N11P55N16N01M25
2406B392j43J3m55k97n96n94n96o94p67k89m87r8K53J55L61Q23N85M96M06Q08
2426A276L86N22K54j74k12m52k25o54q13p79n07n57k72j3N0L46J56l8J200Q20
2446C14M69M23N94L13K60j86k30j80o04o90n20p14o43m05j14p75K45K40N68L05
2466a330O57J000J73P58O00J07M84j55j69n78m10q71l66l54j035l91j42k27j31
2485b380L71M75L60M76P06M19J090M49K2k9K50p9k88p14n12l61j095l9p12m28
2505b019J0l13j04Q97K50O85O65P90O66j39P65J54K35l22m65l10q68m87o17n90
2525a117m43l99k25o8K29M53L37J53J058O81O74oO31K13J94l34k34o37m88n71
$$ plain form
2386 2444 2033 1806 992 493 -492 -829 -1838 -1890 -2230 -2431 -2055 -2112 -1395 -974 -316 195 950 1466 1967 2392
2406 2392 2249 2262 1807 1510 914 320 -276 -970 -1737 -2026 -2513 -2611 -2358 -2203 -1842 -1019 -434 62 468 1276
2426 1276 1662 2184 2438 2264 2052 1600 1375 721 -92 -871 -1378 -1935 -2207 -2220 -2170 -1824 -1668 -1706 -506 314
2446 314 783 1206 1800 2113 2373 2187 1957 1777 1173 483 -37 -751 -1394 -1799 -1913 -2688 -2443 -2203 -1635 -1330
2466 -1330 -673 327 500 1258 1858 1965 2449 2294 2125 1547 1137 266 -100 -454 -1489 -1880 -2022 -2249 -2380
2485 -2380 -2009 -1534 -1174 -698 8 427 1517 1966 1988 1959 2209 2130 1842 1128 616 255 -840 -879 -1591 -2019
2505 -2019 -2009 -2322 -2426 -1529 -1279 -594 71 861 1527 1388 2153 2307 2542 2220 1755 1445 577 90 -527 -1117
2525 -1117 -1560 -1959 -2184 -2252 -2023 -1570 -1233 -1080 -22 659 1333 1327 1958 2171 2365 2031 1797 1160 672 101
2545A01p95l98n85l28j63J81m0l7O23R10K83R07L01P94qM03J47q4n83%j031q03
2567b05m82k39o22p81K15l2l51P89M03N12M79J130L11K13N64M83l83j2K7n38q43
2588F38l92m54r91o59L7n91J13K30L53N23M43P27K44O20Q28N79j39m7K81l32p27
2609A284k58r40o83m90o64k97nJ96l06L47L88O04N49R06M38L48J35N86K54k59
2629B133l12n55m06p64k82o01o08q67J87j64P8N04N48j0R25O54N91O51K88J85
2649B175j08K14l45m37q12n11m93r59k07k99l21j14O9N15p5R15Q75M35L81P25
2669A623O5Q4M16K31n26l64m89q57o37o46j70r57J72O2j16K61M29R22l6P39Q43
2690A049L76J16Q66O6l55l67n20m21m67l86p76o10m44q9m49L11M37r6P02N70R94
$$ plain form
2545 101 -694 -1092 -1677 -2005 -2168 -1987 -2027 -2064 -1441 -531 -248 659 960 1754 1746 2149 2296 2212 1629 1629 598 -205
2567 -205 -687 -926 -1548 -2329 -2114 -2146 -2497 -1708 -1305 -793 -314 816 1127 1340 1904 2387 2004 1992 2019 1481 638
2588 638 246 -208 -1199 -1858 -1821 -2412 -2299 -2069 -1716 -1193 -750 -23 221 841 1669 2248 2109 2062 2343 2011 1284
2609 1284 1026 86 -597 -1087 -1751 -2048 -2053 -1857 -2163 -1816 -1428 -824 -275 631 1069 1417 1552 2138 2392 2133
2629 2133 1821 1266 860 96 -186 -787 -1395 -2262 -2075 -2239 -2161 -1657 -1109 -1119 -194 460 1051 1702 1990 2175
2649 2175 2067 2281 1936 1499 687 176 -317 -1276 -1483 -1782 -2103 -2217 -2148 -1633 -1708 -793 82 517 898 1623
2669 1623 1688 1772 2188 2419 1893 1529 1040 183 -454 -1100 -1270 -2227 -2055 -1993 -2109 -1848 -1419 -497 -533 206 1049
2690 1049 1425 1541 2407 2473 2118 1751 1231 810 343 -43 -819 -1429 -1873 -1962 -2411 -2100 -1663 -1759 -1057 -487 507
2711E07K58M80O99J55j39K61k60o61n8r36o07m10n87l85m48K3k57M12J96Q43M48
2732d66M75J142K19L28K81L89k11k69k63o53n43o06k38p51o93l08k1j43O48L55
2752a328M32K80Q51N33O23M28K74N0j89j84j39p44l03n02n52p47l31p2l32P0L32
2773a550J83K59M01P83M84O11N77N7K60J71j48o47m26m19n50o72m20m55n31J10
2793a922k52L09L93L05N18P30J79P76O11Q8M94m2l4o47k26o92p75k50m76p56q1
2814a750Q0l25N89j83N37K94P19P84J45O75K79J32J26l23k78k04n50m92p22p64
2834a231k03l03k10j62L87K03L86M27P16K39O80K73M94J9K55l56m0k22p61k65
2854C26p89n59j65n49j78RL31L95J55L30M06N82N19L27L85J87K87k10k24n55j47
$$ plain form
2711 507 765 1245 1944 2099 1960 2221 1961 1300 1242 306 -301 -711 -1298 -1683 -2131 -2108 -2365 -1953 -1757 -914 -466
2732 -466 9 1151 1370 1698 1979 2368 2157 1888 1625 972 429 -177 -415 -1166 -1859 -2167 -2188 -2331 -1683 -1328
2752 -1328 -896 -616 235 768 1391 1819 2093 2143 1954 1770 1631 887 584 82 -470 -1217 -1548 -1620 -1952 -1882 -1550
2773 -1550 -1367 -1108 -707 76 560 1171 1748 1805 2065 2236 2088 1441 1015 596 46 -626 -1046 -1501 -2032 -1922
2793 -1922 -2174 -1865 -1472 -1167 -649 81 260 1036 1647 1735 2229 2187 2153 1506 1280 588 -187 -437 -913 -1669 -1750
2814 -1750 -1670 -1995 -1406 -1589 -1052 -758 -39 745 890 1565 1844 1976 2102 1779 1501 1297 747 255 -467 -1231
2834 -1231 -1434 -1737 -1947 -2109 -1722 -1519 -1133 -706 10 249 929 1202 1696 1715 1970 1614 1574 1352 591 326
2854 326 -463 -1022 -1187 -1736 -1914 -1905 -1574 -1179 -1024 -694 -288 294 813 1140 1525 1712 1999 1789 1565 1010 863
2875H63o75o16o71j07r0m20l10L40L9K61O36J96Q38M29N71M26k6L12j82k27l30
2896A257m89p62m07m66k33l46m33n3K58K09M10M67M25P80K64L54L02J84J7Jk50
2917A489l13m47n70m33l68p32J88o38L3J32J90K73N17K06M71Q89K31L09K59K32
2937A918l59q0l89j70m83o97l78j63n27n64j32K20L42L61J81M78Q36L36K91L22
2957A343O98k75m1k34j38o90j47p24n97k80k48l20k0R0K96K75J51M91M67N65N54
2978A216K9K62K17k5k63k34m16m06n05n37k91k13p90M8J23J92N31L68J59M23Q34
2999G22L71L83k03K81N2k53j24k54o13m17m52m57n34k13j10J41K55k0P23K52N55
3020H5N73L51L94j20P63l13M4o48L6n87m77l03o05o92R9n16J58Q8M12L42J14N31
$$ plain form
2875 863 188 -428 -1099 -1206 -1296 -1716 -2026 -1686 -1647 -1386 -750 -554 284 713 1284 1710 1684 1996 1814 1587 1257
2896 1257 768 6 -401 -867 -1100 -1446 -1879 -1932 -1674 -1465 -1055 -588 -163 617 881 1235 1537 1721 1738 1739 1489
2917 1489 1176 729 159 -274 -642 -1374 -1186 -1824 -1791 -1659 -1469 -1196 -679 -473 -2 887 1118 1427 1686 1918
2937 1918 1559 1479 1090 920 437 -260 -638 -801 -1328 -1892 -2024 -1804 -1462 -1101 -920 -442 394 730 1021 1343
2957 1343 2041 1766 1725 1491 1353 663 516 -208 -805 -1085 -1333 -1653 -1673 -1583 -1287 -1012 -861 -370 97 662 1216
2978 1216 1245 1507 1724 1699 1436 1202 786 380 -125 -662 -953 -1166 -1956 -1908 -1785 -1593 -1062 -694 -535 -112 722
2999 722 1093 1476 1273 1554 1606 1353 1229 975 362 -55 -507 -964 -1498 -1711 -1821 -1680 -1425 -1445 -722 -470 85
3020 85 658 1009 1403 1283 2046 1733 1777 1129 1165 578 101 -202 -807 -1499 -1400 -1916 -1758 -1670 -1258 -916 -802 -271
3042b71L84N78O10K41N8l8Q8m05n70l24j96o28m65m71j86m08N41k09J15O61Q2
3063h13P09N28M11O04O4L6L11l38k16k12o39l89m70j65n22m31Q0n46L67P3M34
3084a124N91K59M73M74L03J38N15j7q4O1m22m22o03l02n24l26m23j27k6n1M23
3105a214O4K13P93K52M59N26O10j09k5r6j19m40k45l98o60l53l17J29n45j24J51
3126a448k17N04M37K10N92N60L61L1O88k25qpk73o62l87j87m41k62n40j69j61
3147a604j33O52P9K98J56O00K71K49P01J67J0j0K55o14m57m3o11m95m07O2p90
3168a664j58N27J48l33O67L07L47N72L40K58k05Q15K3l83j62J78q29o64k29j43
3188e88j23o34J07l15J10M11L62L48J54M93J77K73N41k66K96J15k43l39l49l80
$$ plain form
3042 -271 113 691 1301 1542 1600 1562 1650 1245 675 351 155 -473 -938 -1409 -1595 -2003 -1462 -1671 -1556 -895 -813
3063 -813 -104 424 835 1439 1503 1539 1850 1512 1296 1084 445 56 -414 -579 -1101 -1532 -1452 -1998 -1631 -1558 -1124
3084 -1124 -533 -274 199 673 976 1114 1629 1612 1528 1589 1167 745 142 -160 -684 -1010 -1433 -1560 -1586 -1637 -1214
3105 -1214 -1150 -937 -144 108 567 1093 1703 1594 1569 1473 1354 914 669 271 -389 -742 -1059 -930 -1475 -1599 -1448
3126 -1448 -1665 -1161 -724 -514 78 638 999 1030 1718 1493 1485 1478 1205 543 156 -31 -472 -734 -1274 -1443 -1604
3147 -1604 -1737 -1085 -1006 -708 -552 48 319 568 1269 1436 1446 1436 1691 1077 620 577 -34 -529 -936 -874 -1664
3168 -1664 -1822 -1295 -1147 -1480 -813 -506 -159 413 753 1011 806 1621 1644 1261 1099 1277 448 -216 -445 -588
3188 -588 -711 -1345 -1238 -1553 -1443 -1032 -670 -322 -168 325 502 775 1316 1050 1346 1461 1218 879 530 150
3208A50n19n07J71l79m05j87O28k98O59r3M57L06N31P64j9LP7M9m57k82j32m85
3230C2m71K9n70j70j4l59J70O1M25N84m0Q52P0N8L03L14j43j13K36n44k46k46
3252B18m14m31k16j50K4l83J19M35j11O41J52K72J21L84K00L82k46k76K60m91
3272D90k1j48j73n74k28K4o98J62J75K3K00L77L97L40M00j56M58k64L54p9l24
3293G35Qn49j13o55J04nl03j38o8PM7J73K85M23K56J73K8N98k8J04l43L99n16
3316F22Qp82J68m68j01p9l13R7j74J35J60L7N55M06K25J55R3K27j28p7J89l09
3338F46n27q5m63p4l21j88r0j30M80k16L69K53L86J77L39M28m95L07qQ5k05m32
3360B36J95n17R5n75j01o1k61j06K00K89k3K04L49K63K59K36N5j62O57o72K21
$$ plain form
3208 150 -369 -876 -705 -1084 -1489 -1676 -1048 -1346 -687 -780 -323 -17 514 1278 1259 1262 1339 1388 931 649 517 32
3230 32 -439 -410 -980 -1150 -1164 -1523 -1353 -1292 -867 -283 -323 529 599 657 960 1274 1131 1018 1254 710 464 218
3252 218 -196 -627 -843 -993 -969 -1352 -1233 -798 -909 -268 -116 156 277 661 861 1243 997 721 981 490
3272 490 469 321 148 -426 -654 -630 -1328 -1166 -991 -968 -768 -391 6 346 746 590 1048 784 1138 1059 735
3293 735 743 194 81 -574 -470 -475 -778 -916 -984 -977 -930 -757 -472 -49 207 380 408 1006 978 1082 739 1138 622
3316 622 630 -152 16 -452 -553 -632 -945 -848 -1022 -887 -727 -690 -135 271 496 651 744 971 843 766 955 646
3338 646 119 34 -429 -503 -824 -1012 -1102 -1232 -752 -968 -599 -346 40 217 556 984 489 796 788 873 668 236
3360 236 431 -86 9 -566 -667 -728 -989 -1095 -895 -606 -629 -425 -76 187 446 682 737 575 1232 560 781
3381G81j16k59j6m67o81K65n62k4J10K98N7L63k12K96O14J46r2K62J13j27N9j81
3403F27k03j12m85J7j71l02j75R1k40n6M10j25N81J36M91l5K65J28N2j81J85j80
3425G18k78k17k32j20m68j16k7j21n2L59K98m05K06K76M82K83J20K90k15Q5J20
3446I86k45k07k34l16k20j95n16K08j37k3J68J48J87k0L41M3M71K16K70j75j63
3467E87l1K49l33J57l25q10l39K20k86O1N8K19j32lM63K40L41j15N85j82K73j65
3489G32K25k25k75k65j27l07J4l85mj71K5o8N2L00L1O16J26J36J41qL70Oj48k82
3513E09j16o0l06j70l60q3j87m9J07N0J89m4M77j91m0P62M0K70j00L35m88P4k6
3536E93m84j44l86r6N6J9k02o9J21J72jK10L43N4r4O15k46L28Q5k79J23l34k30
$$ plain form
3381 781 665 406 390 -77 -758 -493 -1055 -1079 -969 -671 -614 -251 -463 -167 447 593 501 763 876 749 808 627
3403 627 424 312 -173 -156 -327 -629 -804 -713 -953 -1009 -599 -724 -143 -7 484 449 714 842 894 713 898 718
3425 718 440 223 -9 -129 -597 -713 -740 -861 -913 -554 -256 -661 -455 -179 303 586 706 996 781 866 986
3446 986 741 534 300 -16 -236 -431 -947 -739 -876 -899 -731 -583 -396 -416 -75 -32 439 655 925 750 587
3467 587 556 805 472 629 304 -506 -845 -625 -911 -850 -792 -573 -705 -708 -245 -5 336 221 806 624 897 732
3489 732 957 732 457 192 65 -242 -228 -613 -617 -788 -763 -831 -779 -479 -448 168 294 430 571 563 933 939 791 509
3513 509 393 333 27 -143 -503 -586 -773 -822 -715 -665 -476 -520 -43 -234 -274 488 528 798 698 1033 545 619 593
3536 593 109 -35 -421 -517 -461 -442 -644 -713 -592 -420 -421 -211 132 186 92 707 461 789 874 595 718 384 154
3559A54k29r4p3l48P6M2m14Q8L46J3N95j68P1K54l5N08j07k12OK2k15k32Or4k94
3584c34k21m3pM5J8j20L64J69P8J82L10pK28l88K77q5j18r9l01r2L14m34j09o5
3608d38l5j1j6L80qJ25K11k7n6J92L36j54K92k62k51K1l47q0Q8l04L3r8j24j25
3632f58M15j81K61l7L78mK9J33m3J59ll23m8O0l83J69j0j40k09J72j31N6q2L80
3656d0o6M45k25k9L83k87L09n9k34P1J19j66k03l27q8K13m70k1K55k0l18N30J32
3679i6J42L2J8K40K4O2j60L07j76j81k58K33K4n64k09M05l94J32K43J62j58k6
3701a98M19L4p5K80N0j53K13l31K92m06p4l86p6k02rJ89J18J6K28j62q8L92J06
3724A77K94j20P6K51k46M5k15K29l03k32m21J29O8l00M6K36QM2j02M09J68l7J81
$$ plain form
3559 154 -75 -169 -242 -590 -514 -472 -886 -798 -452 -439 156 -12 59 313 278 786 679 467 473 495 280 48 54 -40 -334
3584 -334 -555 -598 -605 -560 -542 -662 -298 -129 -51 131 441 434 662 274 551 466 348 249 -52 -144 170 -264 -373 -438
3608 -438 -473 -484 -500 -120 -128 -3 208 181 125 317 653 499 791 529 278 299 -48 -128 -40 -344 -311 -409 -533 -658
3632 -658 -243 -424 -163 -200 178 174 203 336 293 452 449 126 78 138 -245 -76 -86 -226 -435 -263 -394 -338 -420 -40
3656 -40 -106 339 114 85 468 181 490 431 197 268 387 221 18 -309 -397 -184 -654 -675 -420 -440 -758 -228 -96
3679 -96 46 78 96 336 360 422 262 569 393 212 -46 187 211 -353 -562 -157 -551 -419 -176 -14 -172 -198
3701 -198 221 255 180 460 510 357 570 239 531 125 51 -335 -411 -613 -622 -433 -315 -299 -71 -233 -321 71 177
3724 177 471 351 427 678 432 477 262 491 188 -44 -465 -336 -268 -568 -522 -286 -278 -236 -338 71 239 202 383
3747C83Q1NNL02m36r9m30L44l58M3q4l26j11j50K09J21J37J27K90K24K1P9J73
3770E50OJ22j31n0M1l00j64j54j52l81L33j56j68K73j57r1O35k09L30L11J13Q
3792F09J5j16j6l8l35P5j86r0k96J13o81M38j32L56L0J79oK16m1L65J86J30j41
3815F34k13J93j29k69k94J15m02j15R2j47k33L01k29K09j38M65P5L79J94R9Q0
3836F67pK60j22j11n76j97j5k08k09j32l8J44k78K33J13K36K9J38K80J45J03P4
3858E29K50K05m19k17J49ko18j28j52n3k57j86kJ84R6J98J86K82J91p2L23J02
3880E89J85q1j9k07n0j55k80J23k59j33k47k62p6R6M0J86J54L14jL98K65J48l5
3903F93L9K23n28L03l96l46j11k83j96o3o2p1M8pL8N06J9M31j1R0N56r0r0J65
$$ plain form
3747 383 464 469 474 776 340 241 -189 155 -203 -160 -244 -570 -681 -831 -622 -501 -364 -237 53 277 298 377 550
3770 550 556 678 547 497 538 238 74 -80 -232 -613 -280 -436 -604 -331 -488 -579 56 -153 177 488 601 609
3792 609 624 508 492 454 119 194 8 -82 -378 -265 -946 -508 -640 -284 -254 -75 -81 135 94 459 645 775 634
3815 634 421 614 485 216 -78 37 -365 -480 -388 -535 -768 -467 -696 -487 -625 -160 -85 294 488 587 667
3836 667 660 920 798 687 111 -86 -101 -309 -518 -650 -688 -544 -822 -589 -476 -240 -211 -73 207 352 455 529
3858 529 779 984 565 348 497 495 -123 -251 -403 -456 -713 -899 -901 -717 -621 -423 -237 45 236 164 487 589
3880 589 774 693 674 467 417 262 -18 105 -154 -287 -534 -796 -872 -776 -736 -550 -396 -82 -83 315 580 728 693
3903 693 732 955 427 730 334 -12 -123 -406 -602 -665 -727 -798 -750 -757 -719 -213 -194 237 226 316 872 782 692 857
3927H57m22K0O2l55l54k63j84j70J67O3k42M9L40l4PN30M93q9J20N2L43k99K2
3950G13k69J53o18k45l3k37k19K5l25L32L74j19j1K64O7M89r5K30LL07Q8l75J79
3973F78q1m77m45k8k45l0r0k6k0R3L02Q6J66K92J3N18j16J24N8j41J85j96n04
3996A16M15n10l54j78J41m30oK07k10L76K83l3O1N01P7L79O3k45P6j04j06l20
4018A99m4j4l25j82m60Q6J32j88N36j21J68l8K23N08j47K63K17j78L04o21M05
4039G23p82j15K0j54l05m5pJ02j68O1K15J64o7K69M80L09l60L43j29Q4Kl75l1
4062B34j27P3m14o3m60j92m2K48J20K92P6K21M00J15o2L05MJ56k93N4l22j5j54
4085A54j51m65K48l95k9k81L95k20K33q7L64M82q0M85N4o5K8m6R2l82j75p2j56
$$ plain form
3927 857 435 455 517 162 -192 -455 -639 -809 -642 -579 -821 -772 -432 -466 -459 71 564 475 595 647 990 691 713
3950 713 444 597 -21 -266 -299 -536 -755 -730 -1055 -723 -349 -468 -479 -215 -148 341 246 476 479 786 874 499 678
3973 678 597 120 -325 -353 -598 -628 -718 -744 -764 -671 -369 -283 -117 175 188 706 590 714 772 631 816 620 116
3996 116 531 21 -333 -511 -370 -800 -806 -599 -809 -433 -150 -183 -122 379 456 835 898 653 729 625 519 199
4018 199 155 141 -184 -366 -826 -740 -608 -796 -260 -381 -213 -251 -28 480 333 596 813 635 939 318 723
4039 723 -59 -174 -154 -308 -613 -658 -665 -563 -731 -670 -455 -291 -358 -89 391 700 340 683 554 638 640 265 234
4062 234 107 180 -234 -297 -757 -949 -991 -743 -623 -331 -255 -34 366 481 419 724 728 884 591 645 323 308 154
4085 154 3 -462 -214 -609 -638 -919 -524 -744 -511 -598 -234 248 168 653 707 642 670 624 716 334 159 87 -69
4108f9l15L7j49m51L20p5K93P2L3M00J09J61K99jo5N6M1m89L23j31l06k07l2l01
4132d47l64j23L95J29j86J22K09J66L57Q7M43JR5Nk48k39n3M1l23j92k32k92M4
4155f05k73Q4r7M50J97K6J31K16J32J42M04k0j68J28m2k04l61k22J28n43N7m22
4177h62M5m0M59l31L86J65K33k35L08M93M87m99LJ79j50j10m07l70R5k50L21p87
4199h67J59j61J62L38P4J64J15M43K56k17L45J32l74J21M5k94k63k53j00j76k85
4220f36k11K15l18K70k0QK85N26N85n86M15J72k6J48j27k09O4l17l92j14k30L23
4242a75o57K19j6pJ73N9K98K03j8M35M07l51K58j54N0m9l20o1m71O6q2l65l91
4265i49K38K47l29P3J98J93M49K72o0J17L71p5Q1Q0j83j30l52j38k21p3m56J19
$$ plain form
4108 -69 -384 -347 -496 -947 -627 -702 -409 -337 -304 96 205 366 665 664 599 655 696 207 530 399 93 -114 -146 -447
4132 -447 -811 -934 -539 -410 -596 -474 -265 -99 258 345 788 789 884 889 641 402 349 390 67 -125 -357 -649 -605
4155 -605 -878 -794 -891 -441 -244 -218 -87 129 261 403 807 787 619 747 705 501 140 -82 46 -497 -440 -862
4177 -862 -817 -857 -398 -729 -343 -178 55 -180 128 621 1108 609 612 791 641 531 124 -246 -151 -401 -80 -867
4199 -867 -708 -869 -707 -369 -295 -131 -16 427 683 466 811 943 569 690 735 441 178 -75 -175 -351 -636
4220 -636 -847 -632 -950 -680 -700 -692 -407 119 704 118 533 705 679 827 700 491 555 238 -154 -268 -498 -175
4242 -175 -832 -613 -629 -636 -463 -404 -106 97 79 514 921 570 828 674 724 675 355 294 -177 -111 -193 -558 -949
4265 -949 -711 -464 -793 -720 -522 -329 120 392 332 449 820 745 826 906 723 593 241 103 -118 -191 -647 -528
4287e28p0k36J04J24j27M24j8N38R5L22K31k34J92K34o04J11k28j04m86l55J64
4308d51m01J40p1O7R3K51p1L80j1L76M75L2k05J04nl31J80J94n39l16k84n5k28
4331f76Q7k08kL08k24J67K97K92O8L50K47K31J21l37r4k02k54J12k26m24l63N9
4353f71K55m75J60M7m4J82K97J68M72R2K07Q7J24m08K0k2O7m27l39j06l49j86
4375h49K8J53j28P0L1K86L90M1KN09o8R4K33J40l47k9k89O0l38k14j63l54Q5J7
4399f40k82O1L48O17k12M28mM24j11J21rq5J51j71j69l11O5l73k49k22k12K07
4421f28J75m18L04L94q4J51M34j10N78o17M74N5k63J80n06m2j84k87m05j97K68
4442g28j0O4O6K04j9M15M5K46K66j32L61M9k49P6l99J74n4o31J55l21M7j45m28
$$ plain form
4287 -528 -598 -834 -730 -606 -733 -309 -327 211 306 628 859 625 817 1051 447 558 330 226 -260 -615 -451
4308 -451 -852 -712 -783 -716 -623 -372 -443 -63 -74 302 777 809 604 708 703 372 552 746 207 -109 -393 -448 -676
4331 -676 -589 -797 -799 -491 -715 -548 -251 41 109 459 706 937 1058 721 627 425 171 283 57 -367 -730 -671
4353 -671 -416 -891 -731 -684 -728 -546 -249 -81 391 483 690 777 901 493 513 491 558 131 -208 -314 -663 -849
4375 -849 -821 -668 -796 -726 -695 -409 -19 22 24 533 465 559 792 932 585 556 267 327 -11 -225 -388 -742 -657 -640
4399 -640 -922 -861 -513 104 -108 320 316 740 629 750 741 656 807 636 467 156 221 -152 -401 -623 -835 -628
4421 -628 -453 -871 -567 -173 -257 -106 328 218 796 179 653 708 445 625 119 77 -107 -394 -799 -996 -728
4442 -728 -738 -674 -608 -404 -423 -8 37 283 549 417 778 827 578 654 255 429 375 -256 -101 -422 -375 -520 -948
4465i48M51k9J8K24K34J04L02m2P9K1J33K94j81l27J51l27m21K05l91n6j08J14
4487e00l62L21p7J75M91r0K59L34l3o5L05o6l08R7k78j27M3n65J37l54J47l42
4509h58J41J92K71m3L94q8J56K64J5K05J63j74M1k35k35j81Kk34k95Lj94J84l28
4532h34L46O9J96Q2L11J66K47j06J86J35Pk53j17k31J13n70l50J01j48j0O4oj88
4555g90L11K20L33j51M65MJ5K37O1P4m19O3r7l52J2Kl75k1j88M5m6J31kN29k25
4580a64M97r0K83p6J07Q0P8J28l11k15m92m3p9l24j2J50l40J83O7N3J40J44M52
4603B16j07L45M4J19K07j16J14l45l3l0o94j37j1k40n6R1J26j65K07J49J45K35
4625F4K24M8K59K01j6j95L2k17j22j14l03j67j06l49Q0J14l6o6J40j60N05M50
$$ plain form
4465 -948 -497 -526 -508 -284 -50 54 356 314 393 414 547 841 660 333 484 157 -264 -59 -450 -506 -614 -500
4487 -500 -862 -541 -618 -443 48 -42 217 551 518 453 758 692 384 481 203 76 119 -446 -309 -663 -516 -858
4509 -858 -717 -525 -254 -297 97 9 165 429 444 649 812 638 679 444 209 28 30 -204 -499 -496 -690 -506 -834
4532 -834 -488 -419 -223 -141 170 336 583 477 663 798 805 552 435 204 317 -253 -603 -502 -650 -660 -596 -602 -790
4555 -790 -479 -259 74 -77 388 392 407 644 705 779 360 423 326 -26 -14 -12 -387 -408 -596 -551 -597 -466 -468 61 -164
4580 -164 333 243 526 450 557 637 715 843 532 317 -175 -218 -297 -621 -633 -483 -823 -640 -573 -520 -380 -236 216
4603 216 109 454 498 617 824 708 822 477 444 414 -280 -417 -428 -668 -724 -633 -507 -672 -465 -316 -171 64
4625 64 288 336 595 796 780 585 617 400 278 164 -139 -306 -412 -761 -681 -567 -603 -669 -529 -689 -184 266
4647B66j40K64L53k8J56k6j85m51j56J92m80n3j39j45j32P1J69k21J58M84n5J65
4669F7L37M6K31J5k7j1j76J87m12k95L3l90J08j48l05J23qJ61o0K66j75M14J08
4692H9K89K17L38j82p6k33K02k49l71rl36l44L9J21k77J69J99j70L38K16M57m69
4714d2N67Mk8J29M2j56l0l97j01p3J64o51J3Nj00L2M3N8L93L8j66M90K85J3J36
4739F68R7j05l02J03L1k97k69j9m00m22J92K54j90MK30J49L49M0J13l0K55R5J54
4762G00P8Nk69k16j88J55m80l95J47j45j88j25O67j81N2K72K66mL48O6M0J1j49
4785D67J48M8m88l5k82l08J10k36L2O3l56J22M15NK23j6J92N98j68j80N50j26
4807G78k21k01j79k41r2j98n4j52j23J48j05P5L59L0N2K27q1L11J09K17k0n3k42
$$ plain form
4647 266 126 390 743 715 871 845 660 209 53 245 -235 -288 -427 -572 -704 -633 -464 -685 -527 -43 -98 67
4669 67 404 450 681 696 669 658 482 669 257 -38 -5 -395 -287 -435 -740 -617 -625 -464 -524 -258 -433 -19 89
4692 89 378 595 933 751 675 442 644 395 24 15 -321 -665 -626 -505 -782 -613 -414 -584 -246 -30 427 -42
4714 -42 525 529 501 630 672 516 486 89 -12 -85 79 -572 -559 -554 -654 -622 -579 -521 -128 -90 -256 234 519 532 668
4739 668 765 660 358 461 492 195 -74 -93 -493 -915 -723 -469 -659 -655 -425 -276 73 113 226 196 451 546 700
4762 700 778 783 514 298 110 265 -215 -610 -463 -608 -796 -921 -254 -435 -383 -111 155 151 499 565 605 616 467
4785 467 615 663 175 140 -142 -450 -340 -576 -544 -481 -837 -715 -300 -295 -72 -88 104 702 534 354 904 778
4807 778 557 356 177 -64 -156 -354 -408 -560 -683 -535 -640 -565 -206 -176 -124 103 22 333 442 659 639 586 344
4830C44K65n31j28O8k79j79p4k24j63M21j70J94J35J50N8L42l7N82j26K1k81K74
4852F62j30k62k83k51K52n36j36l6j32rL83K20J46K3K01K12J89K16l43J83M4l6
4874E77j95M3m30k25Pn9j68Pn0r5J86j06M95J96j38L28n6MM43K1p9l58J05k84
4898A69J80m22k94q9j1k85J34k4j14L96n5K70J24L94k68M32k43M16R4j07j14l36
4920B47m43J34k41j65l41N11l08K47k04J10K82k55N52K36KK19Q7l79K94j22J26
4941E89l23k08k45k19k70K82j38j7P9j35J74L11P3J03K89p2K9K76P0k93M26j12
4963F69j67l31m03p1M7l22j19j64j45N23P6J69J36K57K2J65MK91j01p9N87p51
4985B93r1Q5n87L6j54P8k12k76J02K60o9L14K37N3L20j24K96K87j54L13k93j48
$$ plain form
4830 344 609 78 -50 18 -261 -440 -514 -738 -901 -480 -650 -456 -321 -171 -113 229 192 774 648 669 388 662
4852 662 532 270 -13 -264 -12 -548 -684 -720 -852 -861 -478 -258 -112 -89 112 324 513 729 386 569 613 577
4874 577 382 425 -5 -230 -223 -282 -450 -443 -493 -588 -402 -508 -13 183 45 373 317 321 764 785 706 348 453 169
4898 169 349 -73 -367 -456 -467 -752 -618 -642 -756 -360 -415 -145 -21 373 105 537 294 710 804 697 583 247
4920 247 -196 -62 -303 -468 -809 -298 -606 -359 -563 -453 -171 -426 126 362 364 583 670 291 585 463 589
4941 589 266 58 -187 -406 -676 -394 -532 -549 -470 -605 -431 -120 -47 56 345 273 302 578 648 355 781 669
4963 669 502 171 -232 -303 -256 -578 -697 -861 -1006 -483 -407 -238 -102 155 177 342 346 637 536 457 1044 293
4985 293 202 287 -300 -264 -418 -340 -552 -828 -726 -466 -535 -221 16 69 389 265 561 848 694 1007 714 566
5007E66k63k70k33j41M3l08O9j82Q8P5J15K08K05j54M72K02J25R9j49l4n4L4j95
5030C18j40k71k49q9j29K40k37k58M03k1L3L98Q3M7L08M9R5M56o08k2r0k38l00
5053b22K83l77j22j41j17J30j08j25P0M95j88M10M84m14O51j19K95j34N4k90o02
5074h7J30k40q5j63J28l55l53K76O3K15p4M88J68J25L62o8k28L92nk30J9j31l45
5097Bl26J08r8l77L57k06j60K56j01K99j01L58L49NM00r6j20k93L61j61j93j45
5119A18j95j02j72j90L0m4k86L53O9N14n04L18N80J20M0l4k9J56j47k6l54m8k96
5142a29P7l07J20o67Q4R6K76j92M77L6J89J20L94P0j77N3KJ54k02j55m8l26m08
5165d63l7j79M28l78k22m1O16j71K87J93L78L40n25L79J76qm2l61j22k29k41L8
$$ plain form
5007 566 303 33 -200 -341 -298 -606 -537 -719 -631 -556 -441 -233 -28 -182 290 492 617 716 567 533 479 513 318
5030 318 178 -93 -342 -431 -560 -320 -557 -815 -412 -433 -400 -2 81 128 436 485 580 1036 428 406 316 78 -222
5053 -222 61 -316 -438 -579 -696 -566 -674 -799 -729 -234 -422 -12 472 58 709 590 885 751 805 515 -87
5074 -87 43 -197 -282 -445 -317 -672 -1025 -749 -686 -471 -545 -57 111 236 598 530 302 694 689 459 478 347 2
5097 2 -324 -216 -314 -691 -334 -540 -700 -444 -545 -246 -347 11 360 365 765 669 549 256 617 456 263 118
5119 118 -77 -179 -351 -541 -511 -555 -841 -488 -419 95 -409 -91 489 609 649 615 586 742 595 569 215 167 -129
5142 -129 -52 -359 -239 -906 -822 -726 -450 -642 -165 -129 60 180 574 644 467 520 522 676 474 319 271 -55 -463
5165 -463 -500 -679 -251 -629 -851 -892 -276 -447 -160 33 411 751 226 605 781 773 731 370 248 19 -222 -184
5187a84m14pK63o77J51M18J8J64L96j71J04L48J32m9K54J11l07Q3l83l0m91k91
5209e62J7j56k04K40k0r4J77L63l4N89j75L68L91l74K65M5m00J59nq08J2j06l01
5232f13n5M9j05J87k70L52K86J43J67J20N7N0O90j71m32L52k11j04k68k35k3m51
5254d85p7l7r9O9J44P9L86j12ML21K05j18M25J52P5l06o6n2m19k87j88M2k22j14
5278f80O3R8m02K99M23k97P39K96J0J85K80k78o7o5J11k39m35j91l29N5j15n8
5300e97pn35L63L64q3L86k7O25l51N41JoO5L7l33k77K28m06k20k45J22l67k38
5323i60J64K2L05j4L73J25K19j10L9M58J18l9o5n5n1k35j86m36l08j52J81k08
5345h15m8M10r4K97R3K07L7L81j67L84KJ27K3j97j1n27j73l29j03l20L25k11j53
$$ plain form
5187 -184 -598 -605 -342 -1019 -868 -450 -432 -268 128 -43 61 409 541 492 746 857 550 633 250 220 -271 -562
5209 -562 -545 -701 -905 -665 -685 -779 -602 -239 -273 316 141 509 900 526 791 836 436 595 590 -218 -206 -312 -613
5232 -613 -668 -619 -724 -537 -807 -455 -169 -26 141 261 318 368 1058 887 455 807 596 492 224 -11 -34 -485
5254 -485 -562 -599 -698 -629 -485 -406 -20 -132 -128 193 398 280 705 857 932 626 560 508 89 -198 -386 -344 -566 -680
5278 -680 -617 -519 -921 -622 -199 -496 243 539 549 734 1014 736 669 604 715 476 41 -150 -479 -424 -539 -597
5300 -597 -604 -1139 -776 -412 -495 -109 -136 489 138 679 680 674 739 776 443 166 394 -12 -232 -477 -355 -722 -960
5323 -960 -796 -774 -469 -483 -110 15 234 124 163 621 739 700 635 580 529 294 108 -328 -636 -788 -607 -815
5345 -815 -863 -453 -547 -250 -157 50 87 468 301 685 687 814 837 640 629 102 -71 -400 -503 -823 -498 -709 -862
5368h62j27N71n7L17K74L30j12M44m9j35J20k06L05l81j03n05j28K5o41O3K24
5389f33j84L15k92K00L34K11L23J68J36J06L54j11j11l14Qk39o2l88p3l06j90
5410g48M2j92N8M2M72K92K54l8M18OQ0J6J62p2j70m41N6j5k68l62j69j42p9J45
5434f53k84K40K86J59M33J75J67q1M5K55Knnl48J56m86k35n7j15m21K08j9k37
5457h20M42l3K26L15o3K31N14k55J46J36k45J99l72k32k49j32L1l18k69M9r8L4
5479g63K93k53N77j66M55k7M09J90j1K25k82j07R5l89o6l73m0m27R4j14j13J17
5501f76p4L57L2L93K26J33J90L42n50M40M1m81qj41Ql84k88O2m15J09O3K45k59
5524f35OM43m0L53K00J6L20Q8L43l77k11jk65l79m7l00j39M0k28q7R2K70K93M7
$$ plain form
5368 -862 -989 -418 -475 -158 116 446 334 778 729 594 714 508 813 432 329 -176 -304 -279 -920 -857 -633
5389 -633 -817 -502 -794 -594 -260 -49 274 442 578 684 1038 927 816 502 510 271 209 -179 -252 -558 -748
5410 -748 -706 -898 -840 -798 -326 -34 220 182 600 606 686 702 864 792 622 181 237 222 -46 -408 -577 -719 -798 -653
5434 -653 -937 -697 -411 -252 181 356 523 442 487 742 744 739 734 386 542 56 -179 -236 -351 -772 -564 -583 -820
5457 -820 -378 -411 -185 130 67 298 812 557 703 839 594 793 421 189 -60 -192 -161 -479 -748 -699 -797 -763
5479 -763 -470 -723 -146 -312 143 116 525 715 704 929 647 540 635 246 180 -193 -233 -660 -566 -680 -793 -676
5501 -676 -750 -393 -361 32 258 391 581 923 373 813 854 373 365 224 232 -152 -440 -378 -793 -684 -621 -376 -635
5524 -635 -629 -186 -226 127 327 343 663 751 1094 717 506 505 240 -139 -186 -486 -625 -585 -813 -900 -808 -538 -245 -198
5548a98k08L99M05J6J69m8K63p4j61p6N0l91m54J04k51j47O3jj66L6M1K54K19
5571a56K31L19O6L05j50J09Qn5l55j1l52p3k08l67K37M0l15k3L21J21J59N9L97
5594C07N8J19l7n9L60K36l70k48K08n70k73P6m88k64M60m52L0L55m6L69L53j84
5616f0M52J00J78j02M68o24K41m49P6k71k72j6l00J43m03mK61J27J57L45l21M71
5638A97P0J60J18O1J54l48Qo8L3k20m59m8J83l1m04J40r1L6p3J64L26K87J28J2
5662C35J98K88l74K97l8l20j66l38J86m42Q0m22J05k28K28M8K19j01L06R7M4M60
5684D62r2K86l3J08m52J48O3m31k50k80L09k18L0j85J5j88L44J74R8L6M63R7k65
5707B39L60L97k58K88n97j38j96j56m11L3k46O4r0j27K30N6J54L38P8J97P6K59
$$ plain form
5548 -198 -406 -7 398 414 583 535 798 724 563 487 537 146 -308 -204 -455 -602 -539 -540 -706 -670 -629 -375 -156
5571 -156 75 394 460 765 615 724 732 677 322 311 -41 -114 -322 -689 -452 -412 -727 -750 -429 -308 -149 -90 307
5594 307 365 484 447 388 748 984 614 366 574 4 -269 -193 -681 -945 -485 -937 -907 -552 -598 -229 124 -60
5616 -60 392 492 670 568 1036 412 653 204 280 9 -263 -279 -579 -436 -839 -843 -582 -455 -298 47 -274 197
5638 197 267 427 545 606 760 412 420 352 385 165 -294 -342 -159 -190 -594 -454 -545 -509 -582 -418 -92 195 323 335
5662 335 533 821 447 744 706 386 220 -118 68 -374 -294 -716 -611 -839 -611 -563 -344 -445 -139 -42 2 462
5684 462 370 656 623 731 279 427 490 59 -191 -471 -162 -380 -350 -535 -520 -708 -364 -190 -92 -56 407 504 239
5707 239 599 996 738 1026 429 291 95 -61 -472 -439 -685 -621 -711 -838 -608 -552 -398 -60 18 215 291 550
5729E50J59j30L12l39l55j21K9l80Q4k18k69j7J3J10Q5k84L04J92L44j27L86J36
5751D64RL03K2l81K7J27n02p8k15k45k12M4l1P7q0L06o5K73K27J58J67K77k50
5774D22L4K72q6k22j55k63p5L2n47M5L2l57O0N91p7j04L17L58M1J15J23K36m5
5797G47J06l49l6J42m78J8k52j68r9k27p4O4P6K66O0j6L43j75N54K8K11J40l25
5820E56kj67j2m69J8P7q9n24M5k88J35j40M02j3K97M44j64K56J37K16j99K13J08
5843H37n76J91Pj70o00J76l87J4k31M4o4K01J18M24k4K71r7K95O2J59k29j06K99
5866F14l27l07j51K2Q2m24j45L69k78l17N55j30K86L68r4K30Q0J81M8qj55pk00
5889B92o03K79l05O1J18n12K34q0J27J24j07K8K73K06J96J03P8r4L71k82q3m38
$$ plain form
5729 550 709 579 891 552 197 76 105 -275 -191 -409 -678 -695 -682 -572 -487 -771 -467 -275 69 -58 328 464
5751 464 473 776 798 417 444 571 69 -9 -224 -469 -681 -637 -668 -591 -671 -365 -430 -157 70 228 395 672 422
5774 422 456 728 642 420 265 2 -73 -41 -588 -543 -511 -868 -808 -217 -294 -398 -81 277 318 433 556 792 747
5797 747 853 504 468 610 132 150 -102 -270 -369 -596 -670 -606 -530 -264 -204 -220 123 -52 502 530 741 881 556
5820 556 554 387 375 -94 -76 1 -88 -612 -567 -855 -720 -860 -458 -471 -174 270 106 362 499 715 516 729 837
5843 837 261 452 459 289 -311 -135 -522 -508 -739 -695 -759 -558 -440 -16 -40 231 134 429 491 650 421 315 614
5866 614 287 -20 -171 -149 -67 -491 -636 -267 -545 -862 -307 -437 -151 217 123 353 433 614 662 654 499 492 292
5889 292 -311 -32 -337 -276 -158 -670 -436 -516 -389 -265 -372 -344 -71 135 331 434 512 418 789 507 424 -14
5911a4K83l08l00n6n9R8j17P1l9M2J15J02J70K30L39k60N32m28j05L09l9n34L5
5934F7k04J63j71l48J09m8R9k26R1j42M02Q8K71J8R2L9j39K84k04J82k15K8R8
5957C34n32mm5m74K13k16L49J99J54k34J72K94J84o9L27j12j4j3q7k04k77o6m9
5980a70j86R2k58M0Rk30O45l49Q9K35K28n7J13J58o7M21j48l40j6l66J96j49j94
6003c04k45J42m8j80Q0J00P2K53J88j67K58L68L38l36J23j96k0j92j26o6p6j49
6025a83j43M4L3j26p0N6K67R9L50j67J96m5J96l96L12j46j40J39j03j56j14k44
6047c41J68j37j54j61J28K38J99j34k7K92K06j9J96M27o14L00j34j00l90l8Oj06
6069a95K5m50J63J16PL9L04n2J04M1K0J76Q3J14l41N69m01k51j22j40K38j20k35
$$ plain form
5911 -14 269 -39 -339 -395 -454 -356 -473 -402 -441 -399 -284 -182 -12 218 557 297 829 401 296 605 566 32 67
5934 67 -137 26 -145 -493 -384 -432 -333 -559 -468 -610 -208 -120 151 169 261 300 161 445 241 423 208 236 334
5957 334 -198 -202 -247 -721 -508 -724 -375 -176 -22 -256 -84 210 394 325 652 540 526 513 426 222 -55 -121 -170
5980 -170 -356 -264 -522 -482 -473 -703 -58 -407 -318 -83 145 88 201 359 292 713 565 225 209 -157 39 -110 -304
6003 -304 -549 -407 -455 -635 -555 -455 -383 -130 58 -109 149 517 855 519 642 446 426 234 108 42 -34 -183
6025 -183 -326 -282 -249 -375 -445 -389 -122 -23 327 160 356 311 507 111 423 277 137 276 173 17 -97 -341
6047 -341 -173 -310 -464 -625 -497 -259 -60 -194 -221 71 277 258 454 881 267 567 433 333 -57 -95 -89 -195
6069 -195 -170 -620 -457 -341 -334 -295 9 -43 61 102 122 298 381 495 154 723 322 71 -51 -191 47 -73 -308
6092c08J3m6M4q6O1N44j13o2M1R0J76j85K47J87l3j62l58j03J36m69J36l02J72
6115c80k3j81J60O6L96o2j96M01J25r9K77j59J77j21k13O5m80J89j76j0Q0l83
6137e47J70k63L93k28M31J34K31k07K59L92n17j33J92J10k27j88l2M3j86j66j74
6158e13J13L9K1k12L3J26K15L57J70LLj23K48k9jk81j18L5m46L60l60J10j97L26
6182a21j02o5J71m5n0J65J40J17J48L11k11j34j37R9k74L5k01J48l15j90N7P5
6204c79j51K63J24Q5J75M4l64N58O1n4k22J89k9k1p4r2l19l04M23k63j1J00j22
6227c83J39m3J88j1R4K39K3j3J37p0M8P6k88K66n81j60L60k70P2k26J99p2l5Q4
6251b27j33M00qK86K30k91J63J2j36J0M7l67K65m62k13J85j59J6j87K40j16L1
$$ plain form
6092 -308 -295 -341 -297 -383 -322 222 109 47 88 178 354 169 416 603 570 408 50 -53 83 -386 -250 -552 -380
6115 -380 -403 -584 -424 -358 38 -24 -220 181 306 207 484 325 502 381 168 233 -247 -58 -234 -244 -164 -547
6137 -547 -377 -640 -247 -475 -44 90 321 114 373 765 248 115 307 417 190 2 -30 13 -173 -339 -513
6158 -513 -400 -361 -340 -552 -519 -393 -178 179 349 352 355 232 480 451 450 169 51 86 -360 0 -360 -250 -447 -121
6182 -121 -223 -288 -117 -162 -212 -47 93 210 358 669 458 324 187 286 12 47 -154 -6 -321 -511 -454 -379
6204 -379 -530 -267 -143 -58 117 161 -203 355 416 362 140 329 300 279 205 113 -206 -510 -87 -350 -361 -261 -383
6227 -383 -244 -287 -99 -110 -16 223 246 233 370 300 348 424 136 402 -179 -339 21 -249 -177 -403 -204 -276 -311 -227
6251 -227 -360 40 32 318 548 257 420 432 296 306 353 -14 251 -211 -424 -239 -398 -382 -569 -329 -445 -414
6273d14L23q8J46K69P7J66j35qL64n69J53q6P1n90m8J57k3k98J99j79J80L44J00
6296A11j55J41J67n5J27L51m10K09k36m8k21j72j1j07m7R0k97m6K94K38j19N6
6318a40L15P5k1N4M01l21j01M5l04K31j8nk01m02K69j08j43j22J87k42M28K49
6340A26n6J15j65M95K1p4l3k11j21J19L6o3k71n5k5k33J37L4l53J86K90J36Q0
6363A15P8j38M08K31m17K6K45k77Q7m32N0j6Q0k54l27M36l03r8J12R9J49R0K02
6386A46J31r6K37K17Q0m00J55k36k86ok36r8J67m32L6L85K8k72J54K64K31j69
6408@J63K27n7k71K96J11j91j28k31J63k70L1k68J30o1R5J36j01k29L31j04K98
6430G0J55J74Kj83J22Q2m04O5qj62k39o8K05k65L23k83J74j86N68k17K26K56m05
$$ plain form
6273 -414 -91 -179 -33 236 313 479 344 336 700 131 284 198 269 -321 -369 -212 -235 -533 -334 -513 -333 11 111
6296 111 -44 97 264 209 336 687 277 486 250 202 -19 -191 -202 -309 -356 -266 -563 -609 -315 -77 -196 -140
6318 -140 175 250 229 283 684 363 262 307 3 234 216 211 10 -392 -123 -231 -374 -496 -309 -551 -123 126
6340 126 70 185 20 515 536 462 429 218 97 216 252 189 -82 -137 -162 -395 -258 -224 -577 -391 -101 35 115
6363 115 193 55 463 694 277 303 548 271 358 -74 -24 -40 40 -214 -541 -105 -408 -506 -394 -295 -146 -56 146
6386 146 277 181 418 635 715 315 470 234 -52 -58 -294 -392 -225 -657 -621 -236 -208 -480 -326 -62 169 0
6408 0 163 390 333 62 358 469 278 150 -81 82 -188 -157 -425 -295 -356 -261 -125 -226 -455 -124 -228 70
6430 70 225 399 401 218 340 422 18 83 75 -87 -326 -394 -189 -454 -131 -414 -240 -426 142 -75 151 407 2
6453BM74j77N1M48o98j49M15k94J4k34r8m34K82O6R0J4J2J62j45L17L1RL82k04
6477C36o0J13K24k37m1j42k23k02j72L8Q4o9l45M98o7R9J29l2L06J62j91K23N6
6500D87j36R4j62K8j96l44L32k82k11j4J01k10J06J92K34RK28l91O48j78Kj2j07
6523B18j49M86m17k44r5K06m04lj81J95j97N00j87K58O0R0J27j03O7J87o5k30
6545A19L69l57J36k25q9k52L5q6j08l1J73n9N8K59j99L63K88l28L47M7o7j23j43
6568A27K02j22j53J78l76j47o9k41R6J57J22k7M44r6k28M37K64r8k59j18J83J16
6590C92j78N7l59K18l74j53K83j97m22J43M87l84j42L22M31n7K01n4L53K6l08
6611B85J96k65j80k14J37j4j02k41J73l62K40k01L21PJ90J68J34m9M3K41j1j88
$$ plain form
6453 2 476 299 350 798 100 -49 366 72 86 -148 -246 -680 -398 -332 -242 -228 -216 -54 -199 118 149 158 540 336
6477 336 276 389 613 376 335 193 -30 -232 -404 -366 -282 -351 -696 -198 -265 -166 -37 -69 237 399 208 431 487
6500 487 351 445 283 311 115 -229 103 -179 -390 -404 -303 -513 -407 -215 19 28 256 -135 513 335 337 325 218
6523 218 69 555 138 -106 -201 5 -399 -402 -583 -388 -585 -85 -272 -14 46 136 263 160 227 414 349 119
6545 119 488 131 267 42 -47 -299 -264 -350 -458 -489 -316 -375 -317 -58 -257 106 394 66 413 460 393 270 127
6568 127 329 207 54 232 -144 -291 -360 -601 -505 -348 -226 -253 191 95 -133 304 568 470 211 93 276 392
6590 392 214 271 -88 130 -244 -397 -114 -311 -733 -590 -103 -487 -629 -307 124 67 268 214 567 593 285
6611 285 481 216 36 -178 -41 -55 -157 -398 -225 -587 -347 -548 -227 -220 -30 138 272 223 266 507 496 308
6633C08R1l02J82j73j64L2l87LJ38m87K32Q4L07j7J76m3N3L80n7K0k14M67k43
6656C86K4k58j61m8N6k84n5m72L68m5K0j44M70K14J42l9J15j15L71j72L4K23k76
6679C54j04j96k45J90j79l24J50N4k21J97m0J21L98l7N2N9J55j5P8R5o7l46O6
6702A95k04L82n99J42l21J00Nj42J73J49r6K68j45L20n8Q1R3j74J77K80k27j39
6724B60k96k20J27j46j64j79K43k85M62j61K83K28k2J05j63N45r2Q4j98K04k72
6745C43q0l30P4l56J1l4l94N49l36J95K49K3J47m0J88NL35J36r5j58K36l39k85
6768D4j4O3r2l36l64J52Rj33K80q6L93J56n0J47L81Q7j93J46j19k32J8p3p2o1
6792E1k58j01p6j39J94k50J25L21j40j02M33K86n9K28J20j07K44n42j22K0k70
$$ plain form
6633 308 399 97 279 106 -58 -26 -413 -410 -272 -759 -527 -443 -136 -153 23 -20 33 413 356 376 162 629 386
6656 386 410 152 -9 -57 -1 -285 -340 -812 -444 -489 -469 -613 -143 71 213 174 289 174 545 373 407 630 354
6679 354 250 54 -191 -1 -180 -504 -354 -300 -521 -324 -364 -243 155 118 170 229 384 369 447 542 475 129 195
6702 195 -9 373 -226 -84 -405 -305 -300 -442 -269 -120 -216 52 -93 227 169 250 343 169 346 626 399 260
6724 260 -36 -256 -129 -275 -439 -618 -375 -660 -198 -359 -76 152 130 235 72 617 525 609 411 615 343
6745 343 263 -67 7 -349 -338 -372 -766 -217 -553 -358 -109 -86 61 21 209 214 549 685 590 432 668 329 44
6768 44 30 93 1 -335 -699 -547 -538 -671 -391 -477 -84 72 22 169 550 637 444 590 471 239 257 184 112 51
6792 51 -207 -308 -384 -523 -329 -579 -454 -133 -273 -375 58 344 285 513 633 526 770 228 106 126 -144
6813a44Ojj35m56K45mK68oj68J84K33K94M2R5j32J76k15J64m8l8j53m1p5m02j21
6838d32l63L11l59J64K00J10M37o4j66J82M15K17k34J31l4o5j91j79J12j37l06
6859b51k24K39l77J23j55M06l03L61j22M29O6K68M1j02%L06n72K60k35J50m39
6880a31K6o05M20j89j45M36j93j74N35k18N19o3m6L23jK7q0j01k4j50J68l48l55
6903c69jk09L71j76L2j52K01O8L13O4J99o9L80l05L01k16n5J32n08K78l06l01
6925c28L5j67nj3k02K68J07J22K07K2K14N85j62k76n8K73k16J68l56P2l03l40
6947c53rO4k32N0J45M3NRJ9K69K9K92J27J25j86R8j21j29p5j39j91J83l83k39
6971e99J21l0N6j44K29K29J54L2N2J28K61N8k74K79j41j37j87j72K99n12J1k19
$$ plain form
6813 -144 -138 -139 -274 -730 -485 -489 -221 -227 -395 -211 22 316 358 453 321 497 282 446 398 360 207 166 91 -311 -432
6838 -432 -795 -484 -843 -679 -479 -369 68 4 -162 20 435 652 418 549 515 450 259 80 192 55 -251
6859 -251 -475 -236 -613 -490 -645 -239 -542 -181 -303 126 192 460 501 399 399 705 133 393 158 308 -131
6880 -131 -105 -710 -290 -479 -624 -188 -381 -555 -20 -238 281 218 172 495 494 521 441 340 316 166 334 -14 -369
6903 -369 -370 -579 -208 -384 -352 -504 -303 -235 78 142 341 272 652 347 648 432 377 509 1 279 -27 -328
6925 -328 -293 -460 -465 -478 -680 -412 -305 -183 24 46 260 845 683 407 349 622 406 574 218 290 -13 -353
6947 -353 -362 -298 -530 -480 -335 -292 -287 -278 -259 10 39 331 458 583 397 495 374 245 170 31 -160 23 -360 -599
6971 -599 -478 -508 -452 -596 -367 -138 16 48 100 228 489 547 273 552 411 274 87 -85 214 -298 -287 -506
6993e06M3j22K69k18K81N6J27K40K2N0pJ47j67J74R7k89J0n2l7l23l67J15J18
7016c39n8k09M39j93J79M5J81M0K92j67o6K31l0j22l5L58k84m39J67k03L3n8j71
7039d09l4k61K62K42K06k34L18J52L44k83J36K34l79J0o0J53m81M5K3k84j44J28
7061c16L5Q8M1j51M60o2K49R8p2k63K10J49j76Q6l25j97K87l04m13P5N5R3k89
7084f42K86J36J16k9K16K6K80J12l18L20pr5k26k55K35p4L1n65K3K5r8L0l8K13
7108b98K03O6J01P7J18K43J85o6k85Lj49J05N9l65j37L8l73J89q4k82J73R8j49
7131e30L63N6K4M74J86j08Qj9q1m7o7k10k65K03k17k88J75j1m13O72l58J73R5
7154a85M7K84k57L62L89j82N6l2j45k89j55O6L7m10r6j86K50Q7K92m36L08R9M8
$$ plain form
6993 -506 -463 -585 -316 -534 -253 -197 -70 170 192 242 235 382 215 389 486 197 207 155 118 -205 -572 -457 -339
7016 -339 -397 -606 -167 -360 -181 -136 45 85 377 210 144 375 345 223 188 546 262 -177 -10 -213 -180 -238 -409
7039 -409 -443 -704 -442 -200 6 -228 90 242 586 303 439 673 294 304 244 397 -84 -39 -16 -300 -444 -316
7061 -316 -281 -193 -152 -303 157 95 344 442 370 107 317 466 290 376 51 -146 141 -163 -576 -501 -446 -353 -642
7084 -642 -356 -220 -104 -133 83 109 389 501 183 503 496 401 175 -80 155 81 112 -453 -430 -405 -503 -473 -511 -298
7108 -298 -95 -29 72 149 267 510 695 629 344 347 198 303 362 -3 -140 -102 -475 -286 -370 -652 -479 -381 -530
7131 -530 -167 -111 -87 387 573 465 473 454 373 326 259 49 -216 -13 -230 -518 -343 -354 -767 -95 -453 -280 -185
7154 -185 -138 146 -111 251 640 458 514 482 337 48 -107 -41 -4 -414 -510 -696 -446 -359 -67 -503 -195 -96 -48
7177d8k8K92R0p5M46m79K19O3L4l77p0l26j06p6j4J27J42m6J67k59L04J97k18
7200d1M07j70L09n9j31J03l41Jo0Q9k59m8N3k92j25K15j11M42p7Q2mM85k78M7
7224B37k2k4K99l71K22j79j37k22l8K9J32l88J07o4Q3L34j48J69r1n4L94J43l74
7247C7K75J20Kn7P9j99k76o7j35k07m6Q1q6L0L56M0k91L50k7L36j31J64mK06l91
7272A59K14jk15k48p6L7q4j71K6l55K47L2J76M48l25K67J26qK74K3r1j20Q1oj83
7297B27m40j4k40J08q8l2j8Q9O1J00n6K29L56l0K72j9k33j7J83m77J71L0l19m7
7321b04k10L8K65j56o1k52K15L69J43k29M17k2n9J74O6r6R6q2j38J9n23L35l15
7344b10p9K1l67J55N7n8J28Q3M7L48P6nn4N38p6l11K6k87M9q4k07N0R5m04J50
$$ plain form
7177 -48 -76 216 306 231 677 198 417 480 514 137 67 -259 -365 -441 -455 -328 -186 -232 -65 -324 -20 177 -41
7200 -41 366 196 505 446 315 418 77 78 18 107 -152 -200 -147 -439 -564 -349 -460 -18 -95 -13 -17 468 190 237
7224 237 215 191 490 119 341 162 25 -197 -235 -206 -74 -462 -355 -419 -336 -2 -150 19 -72 -126 268 411 37
7247 37 312 432 434 377 456 257 -19 -86 -221 -428 -474 -393 -479 -449 -93 -53 -344 6 -21 315 184 348 344 550 159
7272 159 373 372 157 -91 -167 -130 -214 -385 -359 -714 -467 -435 -259 189 -136 131 257 249 523 546 455 335 416 410 227
7297 227 -213 -227 -467 -359 -447 -479 -497 -408 -347 -247 -303 -74 282 252 524 505 272 255 438 -39 132 162 -157 -204
7321 -204 -414 -376 -111 -267 -328 -580 -365 4 147 -82 335 313 254 428 494 398 494 412 274 293 -230 105 -210
7344 -210 -289 -268 -635 -480 -423 -481 -353 -270 -223 125 201 196 142 680 604 293 319 32 81 -3 -210 -160 -65 -469 -319
7369c19o5J76j69K34J10j49K09K73l2M32l39P7k87L49j84M18n93n60L92k12j64
7390d03lk8K31j94K16J22J12J57k43O01p3JP4l19J14k23J26l69R8k0m31K08k02
7413d48J87j88J53L12j10j37L82lj56K16N2l5l2M41m81K0m1k70J53o05L89j34
7435c35k89J19o8L68J07RPL09J34R2Q6k13p0l84K73N8O2n01j12J60j56q6N2N0
7459c28P5M8O9K5K34J58NJ07q1J2K62m82l2R1J44j98k43l6j54n2J30k14K99k25
7483c86M46j77J83L29k58L41M6j81M3k94J04j72L25m69L9j48p3n8k39L76k28K09
7505b42K97l1L57l70J1M18k89L34J44l54j18k39J05l32K42k97Pn0M21l56j97M70
7527f9l32M40J44O6J18J13j57Rj81L98m73K20j78k06rk06Pk4P7R1q5J96j56K8
$$ plain form
7369 -319 -384 -208 -377 -143 -33 -182 27 300 268 700 361 438 151 500 316 734 141 -419 -27 -239 -403
7390 -403 -406 -434 -203 -397 -181 -59 53 210 -33 568 495 496 570 251 365 142 268 -101 -3 -23 -454 -246 -448
7413 -448 -261 -449 -296 16 -94 -231 151 148 -8 208 260 225 193 634 153 173 132 -138 15 -590 -201 -335
7435 -335 -624 -505 -573 -205 -98 -89 -82 227 361 453 539 326 256 -128 145 203 265 -236 -348 -188 -344 -430 -378 -328
7459 -328 -253 -205 -136 -111 123 281 286 393 312 324 586 104 72 163 307 109 -134 -170 -324 -376 -246 -460 -161 -386
7483 -386 60 -117 66 395 137 478 524 343 386 92 196 24 349 -120 -81 -229 -302 -360 -599 -223 -451 -242
7505 -242 55 24 381 11 22 440 151 485 629 275 157 -82 23 -309 -67 -364 -357 -407 14 -342 -539 -69
7527 -69 -401 39 183 249 367 480 323 332 151 549 76 296 118 -88 -97 -303 -296 -320 -243 -152 -237 -41 -197 -169
7551a69J59M15j87j0K7K70k21J14j01l05j35O6nj54k7l9j20NL80l00K24rL11P9
7575B68O0j60J83j82L08j25k05j58J84k97J08j49m47N08k63K06j42K22J4PJ89
7596A29L6J45K30J49k12j73L1n3k46k50k5L75o33J58n0k9J65l41J52K11K55j31
7618a07L95J87j16M6j21J16o0L41m96j87J6k33r9m4L6J25k37p6L53J36R8k27M04
7641B50l4L35k23o9q3J73n6l68J31j55j97J77l09j8J43J6j49L25O9j2J06K15j0
7664B57L4M00m77J68r8o4k56L27l20k19o5l78L8K5K77L87k53n1M3M83j61J81L7
7687C15q3N0M3O2q8k0k17K0j75Jj89j62q5K07O2j65K38R1K74j3J89mk12m7L44
7712D36j27k93K15k38M5j91j88l3j32J99p5Q6K7L89r0P1P9j7K89j75p9K91l33
$$ plain form
7551 -169 -10 405 218 208 235 505 284 398 297 -8 -143 -77 -82 -236 -263 -302 -422 -417 -37 -337 -113 -122 189 268
7575 268 328 168 351 169 477 352 147 -11 173 -124 -16 -165 -612 -104 -367 -161 -303 -81 -67 -60 129
7596 129 165 310 540 689 477 304 335 282 36 -214 -239 136 -497 -339 -389 -418 -253 -594 -442 -231 24 -107
7618 -107 288 475 359 405 284 400 340 681 185 -2 14 -219 -318 -362 -326 -201 -438 -514 -161 -25 73 -154 250
7641 250 216 551 328 259 176 349 293 -75 56 -99 -296 -119 -428 -446 -303 -287 -436 -111 -42 -54 52 267 257
7664 257 291 691 214 382 284 220 -36 291 -29 -248 -313 -691 -653 -628 -351 36 -217 -268 -225 258 97 278 315
7687 315 232 282 325 387 299 279 62 82 -93 -92 -281 -443 -528 -321 -259 -424 -186 -95 179 166 355 351 139 92 436
7712 436 309 16 231 -7 38 -153 -341 -374 -506 -307 -382 -296 -269 120 30 101 180 163 452 277 198 489 156
7735A56N8j66p5k07L4J76k73k8n25N78k23K69J97j43L84k31K20j09L79N7k72j10
7757A46J02J71j94m02j88R6j26J36N1k00K13R6q7K90j97N23p2J79j4r1m39K69
7779B62J41r7j70j66j11j70J28k12j3k52K74j39K78R0J72K94M8J19k57J6J12k35
7801A12J08q4N1k27j63l6j00p6J49j04N1J42L44k64j04J56L63j60LK29j95k9O8
7824B34r7k77L2J4j27j41q6K45J02j34J29k11J70K26J21K2J80RJ17k84j55Q2j59
7847A2k50L43j69j96j39M5Pn6J50nJ00N32j73l17L20l2K56l83N66l98q7m5j7j04
7871d0j22j32j09J32j36n8J31J49Nj69R1L10L19O1L7Q4l06J32k37Jj37K5k66j41
7895c76M6O2P2l52P2M64j41j47J42M69k10Q8L40j07J00j07m97M37k96k0l2j58
$$ plain form
7735 156 214 48 -27 -234 -200 -24 -297 -325 -850 -272 -495 -226 -29 -172 212 -19 201 92 471 528 256 146
7757 146 248 419 225 -177 -365 -269 -395 -259 -208 -408 -195 -99 -186 104 -93 430 358 537 523 432 -7 262
7779 262 403 306 136 -30 -141 -311 -183 -395 -408 -660 -386 -525 -247 -157 15 309 357 476 219 235 347 112
7801 112 220 136 187 -40 -203 -239 -339 -415 -266 -370 -319 -177 167 -97 -201 -45 318 158 161 390 195 166 234
7824 234 137 -140 -108 -94 -221 -362 -448 -203 -101 -235 -106 -317 -147 79 200 222 402 411 528 244 89 171 12
7847 12 -238 105 -64 -260 -399 -354 -347 -403 -253 -258 -158 374 201 -116 204 172 428 45 611 213 126 81 64 -40
7871 -40 -162 -294 -403 -271 -407 -465 -334 -185 -180 -349 -258 52 371 432 469 553 247 379 142 143 6 31 -235 -376
7895 -376 -330 -268 -196 -548 -476 -12 -153 -300 -158 311 101 189 529 422 522 415 -82 355 59 39 7 -151
7917a51j35L5J01l64L92j26R9K46k40L13R8j01O6J51R0k5l34j1j39J4J0n10L55
7940a66q9r8O6J89J33j87L44n5j9K60k25N5L2R3n5R9j82k08J50k28k53j80Q6R6
7964c42n4m8K67n7J35l9M00p8L57k11K76l88L22l53P1k84N1k46l44L08O3q9m7
7987c30l0P6J70n2K19M4Q1OK17j17j06R9k79K03o2k03J2l30m4K16j41n3J59O2
8011a83L09j21J20J62k6O0N3o0k18K83j32j72j88j59J61j41p3N4J83k85J2J75
8033a86J15J00j01K93oQ2m6J63j21K39j25l65Q4pk02j2l22O3m6j83L25j7M2N6
8057a77M41k02M11k19O3J55k76J24q2q2kj68j22m4k70L8K43k55K55O7Q7j11L4
8080i2J27K64k36J89J42R6p3q3q8l61J20R1k25k56M0j19o5K72Q8P2K06O7k0j76
$$ plain form
7917 -151 -286 -251 -150 -514 -122 -248 -149 97 -143 170 268 167 233 384 474 449 115 104 -35 -21 -11 -521 -166
7940 -166 -255 -353 -287 -98 35 -152 192 137 118 378 153 208 240 333 278 377 195 -13 137 -91 -344 -524 -438 -342
7964 -342 -396 -444 -177 -234 -99 -138 262 184 541 330 606 218 540 187 258 -26 25 -221 -565 -257 -194 -283 -330
7987 -330 -360 -284 -114 -166 53 97 178 184 401 284 178 277 -2 201 139 -64 -52 -382 -426 -210 -351 -404 -245 -183
8011 -183 126 5 125 287 261 321 374 314 96 379 247 75 -113 -272 -111 -252 -325 -271 -88 -373 -361 -186
8033 -186 -71 29 -72 221 215 297 251 414 293 532 407 42 126 119 -83 -95 -417 -354 -400 -583 -258 -275 -233 -177
8057 -177 264 62 473 254 317 472 196 320 238 156 154 -14 -136 -180 -450 -412 -169 -424 -169 -102 -15 -126 -92
8080 -92 35 299 63 252 394 490 417 334 246 -115 5 96 -129 -385 -345 -464 -529 -257 -169 -97 109 176 156 -20
8104b0N19q8j56K59k21k38oqk05o5J51j53k6k82J44K34J61J8J90j78k3L38j62
8127A83o1o8M89l72k18l0N3M0j32j45J27J00k34j79m0O36l01K40J66l38L91r8
8149B09J68R0k60J14q8n8n7m24l8J39k05j45L53r4l62M46J01k89L53M1J59L5J48
8172C36R4J30k55j18j25R2j96k51J06l31K70k88K94j2J08j12K37k52K85
$$ plain form
8104 -20 499 411 255 514 293 55 49 41 -164 -229 -78 -231 -257 -539 -395 -161 0 18 208 30 7 345 183
8127 183 122 54 543 171 -47 -77 -24 16 -116 -261 -134 -34 -268 -447 -487 149 -152 88 254 -84 307 209
8149 209 377 467 207 321 233 175 118 -306 -344 -205 -410 -555 -202 -296 -658 -212 -111 -400 -47 -6 153 188 336
8172 336 430 560 305 187 62 154 -42 -293 -187 -518 -248 -536 -242 -254 -146 -258 -21 -273 12
8191A2
$$ Imaginary data points
##PAGE= N=2
##DATA TABLE= (X++(I..I)), XYDATA
0@%%%%%%%%%%%%%%Qj6J6j6J6k4L2l3M1m8N6o5P4q9J04j18J35j54J72j95K21k48
36a31K78l15L53l93M38m88N41n98O63p34Q12q95R87j087J197j319J453j605J774
55I31j960K171k415K696l027L422l899M494n262O292p758J0035j4082K3527r2557
70g7392n9592M5117k1462M0814L3823J6541K2977O3517K6965N357J5825J5572
82A28062k8027j0810M365l2367n0936j8772l2349m1301j1859K286j7824p925J6359
95a01098K1286J6733L7383M3105J8950J6351L2053J5589L903Q255n519k7319k9977
108D9695k2452k2914l1635k5654j5762k5989j6843J1412J3486Q466K3097K7488
120b7605J8396K2238L5786K8695O331P109Q683j6604j7679j384k2439l8719k1646
$$ plain form
0 0 0 0 0 0 0 0 0 0 0 0 0 0 0 0 8 -8 8 -8 8 -16 16 -17 24 -24 32 -33 41 -48 56 -62 73 -81 91 -104 117 -131
36 -131 147 -168 185 -208 230 -258 283 -315 348 -386 426 -469 518 -569 628 -691 762 -843 931
55 931 -1029 1142 -1273 1423 -1604 1818 -2081 2413 -2849 3443 -4315 5720 -8362 15165 -77392
70 -77392 -136984 -91867 -113329 -72515 -38692 -22151 826 64343 91308 96665 112490 128062
82 128062 100035 89225 93590 61223 10287 -8485 -40834 -82135 -93994 -91708 -109532 -117457 -101098
95 -101098 -79812 -63079 -25696 17409 36359 52710 84763 100352 104255 112510 106991 79672 49695
108 49695 27243 4329 -27306 -52960 -68722 -94711 -111554 -100142 -86656 -78190 -55093 -27605
120 -27605 -9209 13029 48815 77510 83841 90950 99633 83029 65350 63966 41527 2808 -18838
133a8838k0281l0984j3832M558l796p601J6007K3506J1255K6843L9503J3670Q008
146D8018K5171R460o103L137k709k6059k5940j3688k0921k7995j1387p519k1373
159g7908n520J4677N816R941K6510J9716J1624K1790K3791J1899N495O884l257
172G1458j6433j1089r720k2771k1331j4564j9482j6412l928P91J623N818J2860
185d3180J6065J4394J9705K1501J2079Q834R329J447l980m602r627j5565j8996
198G404j6153j3557j6127j0217l037n553o10J0733J0820J1254J7306J7033J2224
211B1520J1335J2553P873j382j672l822j4150j3723r502j5851j5921q614r466
224d0822q254n10N085N121P488J3718J4028J0196J3578J4632N249M267L994m702
$$ plain form
133 -18838 -39119 -70103 -83935 -79377 -83173 -90774 -74767 -51261 -40006 -13163 26340 40010 48018
146 48018 73189 82649 76546 79683 76974 50915 24975 11287 -9634 -37629 -49016 -56535 -77908
159 -77908 -83428 -68751 -62935 -52994 -26484 -6768 4856 26646 50437 62336 67831 74715 71458
172 71458 55025 43936 34216 11445 -9886 -24450 -43932 -60344 -64272 -63481 -61858 -56040 -43180
185 -43180 -27115 -12721 6984 28485 40564 49398 58727 60174 56194 51592 41965 26400 7404
198 7404 -8749 -22306 -38433 -48650 -51687 -57240 -57850 -47117 -36297 -25043 -7737 9296 21520
211 21520 32855 45408 53281 51899 50227 46405 32255 18532 9030 -6821 -22742 -31356 -40822
224 -40822 -49076 -49586 -44501 -39380 -31892 -18174 -4146 6050 19628 34260 39509 43776 47770 43068
238D3068p376o624j1453j3882j2749j1288j0585q591k874J92P06O504J0563R121
252a5268J2127J3278R937R215P218L105O14l163n905q322j0693j1279j0250j1217
266b0603q268n631m054L29L076N239R265J0322R973J1495R675P270P107J990m33
281C6752l285o522q202r831j0530r408r704q034l628k797QN329N254P272J0455
296f871R551R331R045O625M493K002j089l074p078q201q021j0607r629p320p464
311b8307m115n11O18L485P050P801R231R614Q962Q115N453L646J955k952l708
326B6337n591r084q227q497r770p040n251l900r28K033M055O504P424R377R659
341G101P476Q148N576K261J465j914n357n796p978r414q377q842p140m755l303
$$ plain form
238 43068 35692 29068 17615 3733 -9016 -20304 -30889 -39480 -42354 -42162 -41456 -34952 -24389 -15268
252 -15268 -3141 10137 20074 29289 36507 39612 40226 37063 31158 22836 12143 864 -9386 -20603
266 -20603 -28871 -34502 -38556 -38227 -35151 -29912 -20647 -10325 -352 11143 20818 28088 35195 37185 36752
281 36752 33467 26945 18743 8912 -1618 -11026 -20730 -28764 -32392 -35189 -35181 -29852 -24598 -17326 -6871
296 -6871 2680 12011 21056 27681 32174 34176 33087 30013 22935 14734 6713 -3894 -13523 -20843 -28307
311 -28307 -32422 -32933 -32315 -28830 -21780 -13979 -4748 4866 13828 21943 27396 31042 32997 30045 26337
326 26337 20746 11662 3435 -5062 -14832 -21872 -27123 -31023 -31951 -29918 -25863 -19359 -11935 -2558 7101
341 7101 14577 22725 28301 30562 32027 30113 24756 18960 10982 1568 -6809 -15651 -22791 -27546 -30849
356c0849j89K312M139O943Q018P703R938P727O423N920K434n64q56n028o742p360
372I969r289q562p974p102n049k865k16L187L465O763Q765P649Q653R321O043
387B2758M683L362n9k838m520o424p656r364q150o951q221m180j336j283K106
402b8073N350N407P863Q961Q818P587N995N667K712j049j329l427p853p893p245
417A491r327q380n791m925l017o04K659M968N562Q328R324O393P904P813L903
432B6301K109J276k165n169o209o752p887r164o939n842p106k229J699P93L446
447b3838P399O757O795R219R217O013L371M137L14l911k652l324j0215q557o267
462e542q585p559k882j539k584J101N308N485N714R983R026L937O213P391J640
$$ plain form
356 -30849 -31038 -28726 -24587 -17644 -9626 -1923 8015 15742 22165 28085 30519 29955 29099 24071 17329 9969
372 9969 680 -7882 -15856 -22958 -28007 -30872 -31088 -27901 -24436 -17673 -8908 -1259 7394 16715 22758
387 22758 27441 30803 30744 27906 23386 16962 9306 -58 -8208 -15159 -23380 -27560 -28896 -30179 -28073
402 -28073 -22723 -17316 -9453 -492 8326 15913 21908 27575 30287 29238 27909 24482 16629 8736 1491
417 1491 -7836 -16216 -22007 -26932 -29949 -30553 -27894 -22926 -17364 -9036 288 6681 14585 22398 26301
432 26301 28410 29686 27521 22352 16143 9391 1504 -7660 -14599 -20441 -27547 -29776 -28077 -27284 -23838
447 -23838 -16439 -9682 -2887 6332 15549 21562 24933 29070 29384 25473 22821 19497 9282 725 -5542
462 -5542 -14127 -21686 -24568 -26107 -28691 -27590 -22282 -16797 -11083 -1100 7926 11863 18076 25467 27107
477B7107L9P95m090p971o668n707q189q573m542m870o369L77M101J930M988Q632
493i010N867N610Q833Q415L491J792K673k711n592k536m017r665p942n245q019
508a8056n960l11N70j537K189O578N157N431J0689Q040K149M891N336n70p95j15
524B3686n257q806p011m868p384o901j710l664n141K118N532K997N637Q552M925
539B705L817P542O934J768P04J176m233p460k037l822r521o049m262p197m422
554b4357K341J699P2K860P347M312N208R959O339P52L591K750k750k040k87n656
570A2140q732o064m617n958m480M2k072l435L496N507L167O171Q316L961K513
585I955N607M637L39j35l07n204p152k838m096p910m343k485n385k848L473K971
$$ plain form
477 27107 27146 27941 23851 15880 9212 3505 -4684 -13257 -17799 -22669 -29038 -28661 -24560 -22630 -17642 -9010
493 -9010 -3143 2467 11300 19715 23206 24998 27671 24960 19368 16832 12815 3150 -4792 -10037 -18056
508 -18056 -24016 -24327 -23757 -25294 -23105 -16527 -11370 -5939 4750 12790 14939 19830 25166 24596 23801 23686
524 23686 18429 9623 2612 -2256 -9640 -16541 -18251 -21915 -27056 -24938 -19406 -16409 -10772 -2220 2705
539 2705 6522 14064 20998 22766 23470 24646 20413 12953 10916 7094 -2427 -8476 -12738 -19935 -24357
554 -24357 -22016 -20317 -20245 -17385 -10038 -5726 -518 9441 15780 16532 20123 22873 20123 18083 17796 12140
570 12140 3408 -2656 -7273 -13231 -17711 -17669 -19741 -23176 -19680 -14173 -11006 -4835 3481 7442 9955
585 9955 15562 20199 20538 20403 20096 14892 7740 4902 806 -7104 -11447 -13932 -19317 -22165 -18692 -15721
601a5721J444M595O258L377L936Q373M670j59J734P14l684l230j038n159p613
616a503m838l643n623k461J919p61j161L760N374L294N986P236L376J296L588
631A5839K507j527j298r28n684o442l080l795n975k263j611l174p24L195L668
646a1292K530M676N765K945L053N764L243q83O67j029m719l525k240m459o000
661e504m163k474l538j079K391J002Q41M782M469L256N061N228K446P60J299K25
677A5002k152k095k114m973n946k883k999m344j142M6j073Q26L312L856L130M452
693I03N426K108J970L543J183j423p16k040n033l435l369m021l806k746j426j557
709a4439L77K642K369J806M894M134K735L754L540J056M78j2j376k932k880k798
$$ plain form
601 -15721 -14277 -9682 -3424 -47 3889 12262 16932 16773 18507 19221 15537 12307 11269 6110 -1503
616 -1503 -6341 -9984 -15607 -18068 -16149 -16910 -18071 -14311 -8937 -5643 343 7579 10955 12251 15839
631 15839 18346 16819 15521 14593 8909 2467 -613 -4408 -10383 -12646 -14257 -17431 -18155 -14960 -11292
646 -11292 -8762 -4086 1679 4624 7677 13441 16684 15801 16468 15439 10720 7195 4955 496 -5504
661 -5504 -9667 -12141 -15679 -16758 -14367 -13365 -12524 -7742 -3273 -17 5044 10272 12718 13478 14777 15002
677 15002 12850 10755 8641 3668 -2278 -5161 -8160 -12504 -13646 -13600 -14673 -13847 -10535 -6679 -3549 903
693 903 6329 8437 10407 13950 15133 13710 12994 10954 5921 2486 -883 -4904 -8710 -11456 -12882 -14439
709 -14439 -14062 -11420 -9051 -7245 -2351 1783 4518 8272 11812 12868 13346 13334 11958 9026 6146 3348
725C348m360m907k551k515k285k43Q66Q17K388L619L695L630L597L734K049J015
741A1897J429o13j954j817l233m011l551l222l419k248j512j41P7J112L008K867
757e331K967M131L402K702K809J464Q03m76k094j663l438l483l295l468l498j860
773a0328j399j254J006J601K528K743L483L782L055L048K394J357J86j92j610
788A0400k958k428l460l529l157k957k461j385n22O03J512K186L381L105L371
803A701L910K408K214J226P99j181q63k497l186l050l705k913k924k300r62n27
819a1850N22J459K329K699L426L394L242K868J760J723K26m57j332k484k752k958
835A815l824l257k476k592o59o45Q9J875K509K419L389L396K761L004J930J304
$$ plain form
725 3348 -1012 -5919 -8470 -10985 -13270 -13513 -12647 -11830 -9442 -5823 -2128 1502 5099 8833 10882 11897
741 11897 13326 12713 10759 8942 5709 1698 -1853 -5075 -8494 -10742 -12254 -12395 -12318 -11206 -8198 -5331
757 -5331 -2364 1767 5169 7871 10680 12144 12947 12471 10377 8714 5276 1793 -1502 -4970 -8468 -10328
773 -10328 -11727 -12981 -11975 -10374 -7846 -5103 -1620 2162 5217 8265 10659 12016 12202 12010 10400
788 10400 7442 5014 1554 -1975 -5132 -8089 -10550 -11935 -12457 -11854 -10342 -8156 -4775 -1670 1701
803 1701 5611 8019 10233 11459 12258 11077 10214 7717 4531 1481 -2224 -5137 -8061 -10361 -11323 -11850
819 -11850 -11328 -9869 -7540 -4841 -1415 1979 5221 8089 9849 11572 11798 11341 10009 7525 4773 1815
835 1815 -2009 -5266 -7742 -10334 -10993 -11638 -11549 -9674 -7165 -4746 -1357 2039 4800 7804 9734 11038
851A1038M03n66j338k144l044k840l395l257k467j998j550k73N42J009K584K475
867d821L232L123K944L094K206J017O47p10j329k365l006k681l055l317k313j852
883i186j362l37K71J391K517K412K686L568K431K658K280J015K92J21j624k035
899G098k371l111k949k983k841j519j698o54Q78J418J839K610K720K563L352K481
915F833K123J141K14j36j663j882k234l152k898k111l104k369m10k90K51P77K198
932f712K431K557K966L349K183J488J718q0l77p76k097k513k847k594k566k915
948f785j561o89j135M76J621J690J955L438K463K247K284K109J372qj1q42k672
965E952k284j896k871l000j668k206j610j55O59J261J465K400K727K015K952K971
$$ plain form
851 11038 11441 10875 9537 7393 4349 1509 -1886 -5143 -7610 -9608 -11158 -11431 -10889 -9880 -7296 -4821
867 -4821 -1589 1534 4478 7572 9778 10795 11442 10732 9403 7038 4032 1351 -1704 -5021 -7334 -9186
883 -9186 -10548 -10885 -10614 -9223 -6706 -4294 -1608 1960 4391 7049 9329 10344 10636 10757 9133 7098
899 7098 4727 1616 -1333 -4316 -7157 -8676 -10374 -11028 -10150 -8732 -6893 -4283 -1563 1000 4352 6833
915 6833 8956 10097 10311 10175 8512 6630 4396 1244 -1654 -3765 -6869 -9238 -9648 -9938 -9687 -8910 -6712
932 -6712 -4281 -1724 1242 4591 6774 8262 9980 9900 9523 8747 6650 4137 1290 -1304 -3870 -6785
948 -6785 -8346 -9035 -10170 -9694 -8073 -6383 -4428 -990 1473 3720 6004 8113 9485 9477 9466 8624 5952
965 5952 3668 1772 -1099 -4099 -5767 -7973 -9583 -9738 -9079 -7818 -6353 -3953 -1226 789 3741 6712
981F712R48R98R62j034j555j029j601l189k724k195k341k023k47P2n83O27K661
998e541J621K239L467K265J449J627J217O68o43o25j394l192k570j549k672k081
1014e714j050j420j224Q81J792J349J981K731K349J589K216K617L38k56K51j588
1030F842k306j288j549k990k666j590j753j354M40J127P9J219K972J493K343L662
1046D681J777K57M82J367j073j295o96j741l666k230j196k639j426K05m61o85
1062h339J563K600J516K084K937J786N16J781J792o2q29j73k453k809j415j648
1078a153k645j862q91j303q13J515J857P03J899K549J738J405L412J104k25L0
1094G320r6j441j701j268j681l337k030r39k183p15J251L11j26K138K190K219
$$ plain form
981 6712 7660 8658 9620 8586 7031 6002 4401 1212 -1512 -3707 -6048 -8071 -8318 -8246 -8829 -8202 -5541
998 -5541 -3920 -1681 1786 4051 5500 7127 8344 9012 8369 7744 6350 3158 588 -961 -3633 -5714
1014 -5714 -6764 -8184 -9408 -8527 -6735 -5386 -3405 -674 1675 3264 5480 8097 8435 8179 8430 6842
1030 6842 4536 3248 1699 -1291 -3957 -5547 -7300 -8654 -8214 -7087 -7008 -5789 -2817 -1324 1019 4681
1046 4681 6458 6715 7197 8564 7491 6196 5500 3759 93 -2137 -3333 -5972 -7398 -7193 -7654 -8339
1062 -8339 -6776 -4176 -2660 -576 2361 4147 4663 6444 8236 8174 7345 7172 4719 1910 495 -1153
1078 -1153 -3798 -5660 -6551 -7854 -8667 -7152 -5295 -4592 -2693 -144 1594 2999 6411 7515 7290 7320
1094 7320 7224 5783 4082 2814 1133 -2204 -4234 -5173 -7356 -8071 -6820 -6509 -6635 -4497 -2307 -88
1110h8J855K745J516R7Q89J065j174j145p76k778l132j076j410k172j219k37k71
1127g311m62J744K669R24K483K480J202J125K180J111p25o55j000k028k123j189
1143D25j834k879j653n34j701J59J711J132O99K328K240J921J790K401R90m50
1159F745R2J46j719j640r53k684l020j147j134j625m75P40pM29K254K371J447
1176a80K427K200R77O16J243J83q59j130j342k488k162j330j590k494r57p7o68
1193g631R57J517J757J118K319K310J340J604J624O74q11m85p12j985j906j302
1209C88k456k479r93r53q34J79Q04J157R99K226K374J636J759K209R3P26K66p14
1227F387j173j295j967k089k407j209j242k092J25N38m5R65K052K058J519K097
$$ plain form
1110 -88 1767 4512 6028 6125 7014 8079 6905 5760 4984 2206 -926 -2002 -3412 -5584 -6803 -7040 -7311
1127 -7311 -7773 -6029 -3360 -2436 47 2527 3729 4854 7034 8145 7420 6765 5765 3737 1614 425
1143 425 -1409 -4288 -5941 -6475 -8176 -8017 -6306 -5174 -4475 -2147 93 2014 3804 6205 7195 6745
1159 6745 6837 6983 5264 3624 2671 -13 -3033 -4180 -5314 -6939 -7414 -6674 -6681 -6252 -3998 -1627 -180
1176 -180 2247 4447 5424 6040 7283 7466 6607 5477 4135 1647 -515 -1845 -3435 -5929 -6886 -6963 -7631
1193 -7631 -6674 -5157 -3400 -2282 37 2347 3687 5291 6915 7589 6778 6293 5581 3596 1690 388
1209 388 -2068 -4547 -5540 -6493 -7327 -7148 -6344 -5187 -4188 -1962 412 2048 3807 6016 6109 6835 7101 6387
1227 6387 5214 3919 1952 -137 -2544 -3753 -4995 -7087 -6962 -6424 -6469 -5504 -3452 -1394 125 2222
1243B222J672J187J199Q01J13r98q68j181k402j871j577k087j613j092j55k78
1259f928M18J852J340J541K115J691J514J773J312n4K77o98j120j371j926j704
1275C2j930k015j237n77j009K07Q66M59J351K346J508K208J436J400J264K29P7
1292F615r32r21j251j505k269j850j386j701p24o39K22O00R03J648J718J352K366
1309B246J557J166R24L73pq13o99j854j333j823k087j127j448r17l17o5N63J295
1327d366P52J905K053J565J592J385Q99K62K97n64j577j280j474k042j526j665
1343c784j233o84o62L46O43R83J282J916J640J577J482J510O93N11l79l73j108
1360D360j413j657j704j943j248j357n97k07J53P09M25J954J200J929J753J304
$$ plain form
1243 2222 3894 5081 6280 7081 7194 6196 5328 4147 1745 -126 -1703 -3790 -5403 -6495 -6650 -6928
1259 -6928 -6510 -4658 -3318 -1777 338 2029 3543 5316 6628 6574 6851 6153 5033 3662 1736 32
1275 32 -1898 -3913 -5150 -5727 -6736 -6529 -5663 -5204 -3853 -1507 1 2209 3645 5045 6309 6538 6615
1292 6615 5683 4762 3511 2006 -263 -2113 -3499 -5200 -5924 -6563 -6341 -5741 -4838 -3190 -1472 -120 2246
1309 2246 3803 4969 5893 6266 6259 5446 4747 2893 1560 -263 -2350 -3477 -4925 -5842 -6159 -6224 -5661 -4366
1327 -4366 -3614 -1709 344 1909 3501 4886 5785 6047 6344 5780 4203 2923 1449 -593 -2119 -3784
1343 -3784 -5017 -5701 -6363 -6017 -5374 -4391 -3109 -1193 447 2024 3506 5016 5709 6220 5841 5468 4360
1360 4360 2947 1290 -414 -2357 -3605 -4962 -5559 -5766 -5613 -4904 -4479 -2525 -1325 604 2357 3661
1376C661J303O11Q9J97j081q63j217j430j337k075j467j169p10o32O05L11R01
1393d303J605J561J567J982J123J321R82l58J93m79j145j498j642j639j530j591
1409c851j226o43l54N42N18R47J665J487J481J675J748P05Q61M29l56m15j487
1426C726j097j828j507j474j402j407o39k87L38O57R84J610J466J834J516J437
1442C927Q13R01J05j05n56j021j656j560j428j499j644j444l19n50K96O34J379
1459c727Q27K160J669J079J861J041Q09j8l45n47j253j610r19j804j809j115j192
1476d893j022P9M28O91P90J568J521J397J994J657O02K51J154p64p41p85j279
1493B648k018j603j317j369j221p77m6J99L02J553J403J102J951J546J119J367
$$ plain form
1376 3661 4964 5575 5664 5861 4780 3917 2700 1270 -67 -2142 -3609 -4778 -5488 -6120 -5515 -5204 -4303
1393 -4303 -2698 -1137 430 2412 3535 4856 5838 5480 5673 5194 4049 2551 909 -730 -2260 -3851
1409 -3851 -5077 -5720 -6074 -5532 -5014 -4067 -2402 -915 566 2241 3989 4694 5555 5984 5628 5213 3726
1426 3726 2629 801 -706 -2180 -3582 -4989 -5628 -5915 -5577 -4920 -3936 -2326 -860 974 2490 3927
1442 3927 4740 5641 5746 5641 5085 4064 2408 848 -580 -2079 -3723 -5167 -5486 -6036 -5740 -5106 -3727
1459 -3727 -2900 -740 929 2008 3869 4910 5719 5701 5356 4809 3556 1946 1027 -777 -2586 -3701 -4893
1476 -4893 -5915 -5836 -5408 -4717 -3927 -2359 -838 559 2553 4210 4812 5063 6217 5453 4712 3927 2648
1493 2648 630 -973 -2290 -3659 -4880 -5657 -5703 -5504 -5202 -3649 -2246 -1144 807 2353 3472 4839
1509D839P93K66o64k23j056j964j113q61k274j896m45q16n62K83J157M00R69K087
1527a080J578J381J873J288K65j20P10j045j235n77j832k080j734r45r78q85J73
1544e243O7R9J185J646J345J107K219J298K97J409M31l81p54m70j605k038r23
1561c11j032j696j432n97n83k58R74J431Q37J345J996J186Q26J882J174l91n31
1578D820j99r24j524m54j423k503j445m10q59l45M92N58j1J042K148J253J534
1595A750J558J054k18P32N04p59r86o36j556k150q53n64j607j082L11n23n1J653
1613c423J347L27J709J607J188N87J408M67n16m86p3j822j223m83j725j811r83
1630c905k04j008K64N63J078m2J366K142J009R84J522P16k11J40J20j048j038
$$ plain form
1509 4839 5632 5898 5234 5011 3955 1991 878 17 -2257 -4153 -4598 -5414 -5976 -5693 -4536 -4136 -3167 -1080
1527 -1080 498 1879 3752 5040 5305 5185 5895 4850 3615 3038 1206 -874 -2608 -3553 -4531 -5416 -5243
1544 -5243 -5176 -5077 -3892 -2246 -901 206 2425 3723 4020 5429 5860 5479 4725 4255 2650 612 -311
1561 -311 -1343 -3039 -4471 -5068 -5651 -5909 -4935 -3504 -2667 -1322 674 1860 2686 4568 5742 5351 4820
1578 4820 4621 3697 2173 1719 296 -2207 -3652 -4062 -4921 -5266 -4774 -4216 -4227 -3185 -1037 216 1750
1595 1750 3308 4362 4144 4876 5380 4621 3635 2999 1443 -707 -1560 -2124 -3731 -4813 -4502 -5025 -5076 -3423
1613 -3423 -2076 -1749 -40 1567 2755 3342 4750 5217 4701 4215 4142 2320 1097 614 -1111 -2922 -3905
1630 -3905 -4109 -5117 -4853 -4290 -3212 -3254 -1888 254 1263 2247 3769 4485 4274 4414 4534 3486 2448
1647B448p47j711j994o64l29j172m52M73j18M7J975R40J418R78J381N14O02O37
1665D226O72r47n92l74j438j809l55j343j374m71j58n83O15J013P09N18J279J412
1683A000R32Q32J133M15n76n1k81j227p36q76j449j393o99l42r05J91N39L14M50
1702b729J256J298R01J155J146j12K95N76j54n85r16p79j604p78n31q36j131n6
1720c584J86j80O76J197O68Q68J211L86Q86R39N54m67N6o47o79j221n01j034q24
1739a510j118k50j13n77P73L97L73N86J248J177O66Q34N97J98j84j60k48j100
1757A589p69o40j096r46k59r01r9N1J70N03N29R91M97J082P45Q97J47N10J04n95
1777B510k37o92o82r19j089n84n90n07J26j17mM57Q50R21Q30P73N03P34M04M09
$$ plain form
1647 2448 1701 -10 -2004 -2668 -2997 -4169 -4621 -4148 -4266 -4219 -2244 -1304 114 1092 2473 2987 3589 4226
1665 4226 4898 3951 3359 2985 1547 -262 -617 -1960 -3334 -3805 -3963 -4546 -3931 -2918 -2209 -1691 -412 1000
1683 1000 1932 2764 3897 4312 3736 3685 3404 2177 1441 565 -884 -2277 -2976 -3318 -4223 -4032 -3493 -3179 -2729
1702 -2729 -1473 -175 726 1881 3027 2915 3210 3786 3632 3047 2131 1352 -252 -1030 -1561 -2397 -3528 -3584
1720 -3584 -3398 -3578 -2902 -1705 -1037 -169 1042 1428 2314 3253 3807 3340 3396 2749 2070 849 348 -686 -1510
1739 -1510 -2628 -2878 -2991 -3568 -2795 -2398 -2025 -1439 -191 986 1652 2486 3083 3281 3097 2937 2689 1589
1757 1589 820 180 -916 -1862 -2121 -3022 -3121 -3070 -2900 -2397 -1868 -877 -380 702 1447 2344 2491 3001 3105 2510
1777 2510 2273 1581 899 -20 -1109 -1693 -2283 -2790 -2664 -2781 -2785 -2328 -1478 -557 273 1046 1549 2283 2687 3096
1797C096l05l28m90k89r05j071n92m65j051o9k81J76P3M33P37O88Q29O61P52O39
1817B238N54M4M7m66m45n00q89p36p47n34n17n94k34K04J82N86O66J069J19J071
1837A118O16M16M44j7K11o59j38o45p11j246o40k82p17k69j87K06J81Q04M05M80
1857f30R56P11P56P7N27J15l6l07m42p29m67p26q81o49o51M8k25MK77O85N73N37
1879d77R63L83O43O57L88J1n3j90p18k10j241m82r92o96k39j51k16J53L75L14
1899a778R54J92J063P26L52O88j78P28m06k77l80o39p69j079n66n06m37k07L20
1918b199l08N04N67M42Q54N61Q52N02N11K9J51o6o11q8n84p32q87o38o45n62l66
1939b713M47R1J71M37O87M65O86O90O42O37M10K8m40k00n71m58q13o06p62m08
$$ plain form
1797 3096 2791 2463 1973 1684 779 -292 -884 -1349 -2400 -2469 -2750 -2574 -2501 -2068 -1331 -643 186 847 1599 2238
1817 2238 2792 2836 2883 2417 1972 1472 583 -153 -900 -1434 -1951 -2545 -2779 -2575 -2393 -1807 -1141 -72 47 1118
1837 1118 1734 2150 2594 2577 2788 2129 1991 1346 635 -611 -1251 -1533 -2250 -2519 -2706 -2500 -2319 -1515 -1110 -630
1857 -630 326 1037 1793 1870 2397 2512 2476 2169 1727 998 531 -195 -1076 -1725 -2376 -2328 -2553 -2549 -2272 -1587 -1014 -477
1879 -477 486 869 1512 2169 2557 2568 2515 2325 1607 1397 156 -326 -1318 -2014 -2253 -2404 -2620 -2467 -2092 -1778
1899 -1778 -824 -632 431 1157 1509 2197 2019 2747 2341 2064 1684 1045 276 -803 -1369 -1875 -2312 -2519 -2199
1918 -2199 -2507 -2003 -1436 -994 -140 421 1273 1775 2286 2315 2466 2400 1789 1701 1117 385 -502 -1140 -1785 -2347 -2713
1939 -2713 -2266 -2175 -2004 -1567 -880 -415 271 961 1603 2240 2650 2678 2238 2038 1467 1009 196 -410 -1172 -1580
1959a580o80j82l34M83L53L84N74P75K92J000L87M20L79L82m39n3k47j097l58
1978D59j150j25o16r91Mnr2M77M62P37N08Q81O82M03J98O34o7j65q1q07n93m15
2000C38p63o65p01j57m44J46k1M19P3P40P72Q31M26N95Q43l55P0L12m64m60r01
2021F34n75m81q21m69k57j46l3l17K72P80O85N23Q80M54K72O69J80J26l78p6n65
2042A357j77j088m49j28j181l28m44J63J48K72P75K22L65Q58O16L52O75J81j74
2061B015k12K4k13q10n09o07q50l43l32O8n10L21M72J08O43N53O41K23J106J10
2081A898j2j64L02m21o16o3p67p97l03k07o24n30Q4L87Q8N92R64J33L66N41P88
2102A639j26J98M23m28m15l88k59n45o32j70n96m52l04J89j64M41L84P5J036O89
$$ plain form
1959 -1580 -2260 -2442 -2776 -2293 -1940 -1556 -982 -207 85 1085 1472 1892 2271 2653 2214 2161 1914 817 459
1978 459 -691 -816 -1432 -2423 -2419 -2424 -2516 -2039 -1577 -840 -332 549 1231 1634 1832 2466 2399 2234 2153 1346 753 338
2000 338 -425 -1090 -1791 -1948 -2392 -2246 -2267 -1848 -1775 -1035 -263 568 994 1589 2432 2077 2147 2459 1995 1535 634
2021 634 59 -422 -1243 -1712 -1969 -2115 -2148 -2465 -2193 -1413 -728 -205 675 1129 1401 2070 2250 2376 1998 1922 1357
2042 1357 1180 92 -357 -485 -1666 -1994 -2438 -2275 -2127 -1855 -1080 -858 -493 365 981 1333 2008 2189 2015
2061 2015 1803 1827 1614 804 295 -312 -1162 -1505 -1837 -1769 -2279 -1958 -1486 -1378 -735 -182 459 682 1788 1898
2081 1898 1886 1722 2024 1603 987 924 157 -640 -943 -1150 -1774 -2304 -2220 -1833 -1745 -1153 -189 -56 310 851 1639
2102 1639 1513 1711 2134 1706 1291 903 644 99 -533 -703 -1299 -1751 -2055 -1866 -2030 -1589 -1205 -1130 -94 595
2122E95N59J06P54J1L5o09L4n32o18k74o14r07p5K18n88qK66L4M06M91Q81L24
2144D89K62Q92L28m14K30J2m26l62n81o13m72m82r9o08l64J18K33M92M12Q19J97
2165F3L75P25J84N16L18P1o06l90l49o04l57n49n18p53k66L74j18Q1Q62Q1M40
2186d20M03Q50K02M48O81k76q6m10J27m88o50l95o31o31m12j59j4l42L93M67R3
2207a250J133N07J78P08N97n9J80qM2o00n28m21q07k29o66l18m15j3k11N15L8
2228a627P27P29K27N20R97L8M50N33p85J16n98j7r15o84o35m62k15m30r0k6L73
2249a774P14J88N45O65N30M6R92J89k48K52R6m57r97m96n10n59n86j30k43m47
2269b230O9M81L88L25Q72L91P18j5Q02L50l23N45n88l41l81n60o88l87q08l89
$$ plain form
2122 595 1154 1260 2014 2025 2060 1451 1485 953 335 61 -553 -1460 -1535 -1317 -1905 -1913 -1647 -1613 -1207 -716 165 489
2144 489 751 1643 1971 1557 1787 1799 1373 1011 430 -183 -655 -1137 -1236 -1844 -2208 -2090 -1857 -1365 -953 -134 63
2165 63 438 1163 1347 1863 2181 2252 1646 1256 907 303 -54 -603 -1121 -1874 -2140 -1766 -1884 -1803 -941 -860 -420
2186 -420 -17 833 1035 1483 2164 1888 1802 1392 1519 1031 381 -14 -645 -1276 -1688 -1847 -1861 -2203 -1810 -1343 -1250
2207 -1250 -117 390 568 1276 1873 1814 1994 1986 2028 1428 900 479 -328 -557 -1223 -1541 -1956 -1969 -2180 -1665 -1627
2228 -1627 -900 -171 56 576 1573 1611 2061 2594 1809 1925 1327 1310 395 -289 -924 -1386 -1601 -2031 -2121 -2147 -1774
2249 -1774 -1060 -872 -327 338 868 914 1906 2095 1847 2099 2195 1738 741 245 -265 -824 -1410 -1540 -1783 -2230
2269 -2230 -2161 -1680 -1292 -967 -95 296 1014 999 1801 2151 1828 2373 1785 1444 1063 503 -185 -572 -1380 -1769
2289a769l27o8J0J04O51M07P49L70P44O48J12M18R7n2j07n39m98n16p20m39q40
2310a565l91j22j81Q0O8L69Q22M81N34O53P77N6N76n5J7r3l89p25l03q50m84m78
2332a203q32q2l83K91J40O92J87P45L03J206J25O22K10M20k33j59k4q77m49r13
2352b14m16o05l53r24J56L9J99K61Q08L40P24Q46K01Q36L71N6J8j49n18m59n41
2373F76o34m18q30o66l77k60J78L8M75N61O91M59P47P61M92n7N27n8m8m29k07
2394A621r07p24p16o58m54k65l25J44K5M42L58O52N89J027N01J1P71O5p0K39l89
2415A937r07m57l69p12m83n10o06ok85M46k64N52Q98N58M11Q59N02O82L6j72J19
2436B229j64p35m91p94p08m46n87k29m81K05L4L24N39M09P20O58M35N87M23M75
$$ plain form
2289 -1769 -2096 -2164 -2154 -2050 -1399 -992 -243 127 871 1519 1631 2049 2146 2094 1987 1448 950 434 -286 -725 -1565
2310 -1565 -1956 -2078 -2259 -2179 -2111 -1742 -920 -439 95 748 1525 1581 2157 2102 2119 2026 1637 912 609 -241 -725 -1203
2332 -1203 -2035 -2117 -2500 -2209 -2069 -1377 -1190 -445 -142 1064 1189 1811 2021 2441 2208 2049 2025 1148 699 -214
2352 -214 -630 -1235 -1588 -2512 -2356 -2317 -2118 -1857 -1049 -709 15 861 1062 1898 2269 2325 2343 2194 1676 1217 676
2373 676 42 -376 -1206 -1872 -2249 -2509 -2331 -2293 -1818 -1257 -566 -107 640 1401 1893 1836 2363 2305 2257 1828 1621
2394 1621 714 -10 -726 -1384 -1838 -2103 -2428 -2284 -2259 -1817 -1459 -807 -218 809 1310 1321 2092 2157 2087 2326 1937
2415 1937 1030 573 204 -508 -991 -1501 -2107 -2113 -2398 -1952 -2216 -1664 -766 -208 203 1062 1564 2246 2282 2110 2229
2436 2229 2065 1330 839 45 -663 -1109 -1696 -1925 -2406 -2201 -2167 -1843 -1304 -895 -175 483 918 1505 1928 2403
2456B403k62L50p86O5o22j046m61o06p54m21k05JK19L04M65P33O01M62O05M93
2476A538N49M52O4m06k33l69p67o13o38p40m58J9o79j65J25K81M71O37O00O80
2496C48P04J23Q77J16j54j6m0m65k69r46p26n92j36n67n26J07j05J85M65O36O36
2517c45M87R35L46K29L72M44o5m62m03m89q36o19k99o58p04R4l79o5N48O03K83
2538i83M83O13O98R07K72J88K63o26J67k74o37m79q28r45m11j55l57QK15k1K55
2559a647N31M99P84M62P41M33J97J71L76p32l10l95o88p33k14p16m75n49J49q
2579b124K00L87N95N62O38O37K91M79N19O6n7m65M6p73o40m83o39o34p63J80j49
2600b127K50j42P53K54M38Q16O44J0R02J16M6L72R3j013l19m30q95p69j1o28m12
$$ plain form
2456 2403 2141 2491 1705 1770 1148 102 -359 -965 -1719 -2140 -2345 -2344 -2125 -1821 -1356 -623 -22 440 1045 1538
2476 1538 2087 2539 2603 2197 1964 1595 828 215 -423 -1163 -1621 -1602 -2281 -2446 -2321 -2040 -1569 -932 -332 348
2496 348 1052 1175 2052 2168 2014 1998 1958 1493 1224 278 -448 -1040 -1176 -1743 -2269 -2162 -2267 -2082 -1617 -981 -345
2517 -345 142 1077 1423 1652 2024 2468 2403 1941 1538 1049 213 -406 -705 -1363 -2067 -1973 -2352 -2417 -1869 -1266 -983
2538 -983 -500 113 811 1718 1990 2178 2441 1815 1982 1708 1071 592 -236 -1181 -1592 -1747 -2104 -2096 -1881 -1902 -1647
2559 -1647 -1116 -617 167 629 1370 1803 2000 2171 2547 1815 1505 1110 422 -311 -525 -1241 -1716 -2265 -2116 -2124
2579 -2124 -1924 -1537 -942 -380 258 895 1186 1665 2184 2250 2193 1728 1774 1001 361 -122 -761 -1395 -2158 -1978 -2127
2600 -2127 -1877 -2019 -1266 -1012 -574 242 886 896 1798 1914 1960 2332 2425 1412 1093 663 -232 -1001 -1012 -1640 -2052
2621b052j33k20L44N19O68P24L36L49O96N55N0L41Ln4n75l27q34n68l71n08p02
2642a759k77L1k8j59O54L95N08O99N14P39K23N74L36l10m2m74o51n62m49o08o09
2663a255l14j09k62k92M08J33L50O65Q80M82J59O81L26J27N39m09o58m87m94l02
2683A68r36n05k32p47j65L83k6N3P73N90O68N96M42O95K57K38J65o75J65o36p68
2704E03m45n45r32m14j56o0o4J63O81j16M69Q49P72L00O53K17MK32m0k78n64p77
2726D52k36q23n12q8k97q27J86N8M0P41N97O29M58M53O11N95j27M07j51p75j06
2747A285l99p33o04o47m89l0k41k23N5J71P63L72O07N70Q96J1M12L09q4J94k75
2768A920p18p15j67n62q41l31l0k43n21J14L92n3P56O26O26M23M84P34J73J62
$$ plain form
2621 -2052 -2185 -2405 -2061 -1542 -874 -150 186 535 1231 1786 1836 2177 2180 2126 1551 1224 390 -178 -549 -1057 -1759
2642 -1759 -2036 -2005 -2033 -2192 -1538 -1143 -635 64 578 1317 1540 2114 2450 2140 2098 1624 973 411 -38 -646 -1255
2663 -1255 -1569 -1678 -1940 -2232 -1824 -1691 -1341 -676 204 686 845 1526 1852 1979 2518 2109 1451 964 470 168
2683 168 -768 -1273 -1505 -2252 -2417 -2034 -2060 -2007 -1234 -644 24 620 1062 1757 2014 2252 2417 1742 1907 1271 503
2704 503 58 -487 -1419 -1833 -1989 -2049 -2113 -1950 -1269 -1385 -916 -67 705 1005 1658 1875 1879 2111 2071 1793 1229 452
2726 452 216 -607 -1119 -1207 -1504 -2331 -2145 -2087 -2047 -1306 -709 -80 378 831 1442 2037 1910 2317 2166 1391 1285
2747 1285 886 153 -451 -1098 -1587 -1617 -1858 -2081 -2026 -1855 -1092 -720 -113 457 1353 1364 1776 2085 2001 2195 1920
2768 1920 1202 487 320 -242 -1083 -1414 -1444 -1687 -2208 -2094 -1702 -1755 -999 -373 253 676 1160 1894 2067 2229
2788B229j89j41o89m80m58p25m62m64n94j97L37k22J49K59P91O28M05O05N66J81
2808A529M24L2J11m59o3o58n74p61k29p91k56Jj11K4L11M08J72M68N96O65K30
2829A069L41N06K72k47p7l16n38o95o34m48m26n81j60K92m28L68N86J41N59L61
2849e5P35M76M86K96m1k16J56n26o05l59o23o01j33o28K0r4j04K47K31K88M59
2870e91O43N09M46K56L75K00j8l81l8l68m92m75p58m61m35j44q9p0K28K16M76
2891i71N82M09Q42K6N80K91J20j63j0m85l39o03m23l37m28n00j61m33J90rO99
2912a123K36L74R34J48M41K71L22M03l83J54l28m64o97l01l70m75n48Jk90j32
2932a827J04L61L21O29L19O18J62O29L75L03m46j0j49l73m59n23l92p96lm16k82
$$ plain form
2788 2229 2040 1899 1210 730 272 -453 -915 -1379 -1973 -2170 -1833 -2055 -1906 -1647 -856 -228 177 782 1348 1529
2808 1529 1953 1985 2096 1637 1574 916 342 -419 -648 -1439 -1695 -1694 -1805 -1781 -1470 -1062 -890 -422 174 839 1069
2829 1069 1410 1916 2188 1941 1864 1548 1010 315 -319 -767 -1193 -1774 -1934 -1642 -2070 -1702 -1116 -975 -416 -55
2849 -55 680 1156 1642 1938 1897 1681 1837 1311 706 347 -276 -877 -1010 -1638 -1618 -1712 -1816 -1569 -1338 -1050 -591
2870 -591 52 561 1007 1263 1638 1838 1820 1439 1401 1033 541 66 -692 -1153 -1588 -1732 -1821 -1891 -1663 -1447 -971
2891 -971 -389 20 862 888 1468 1759 1879 1716 1706 1221 882 279 -144 -481 -909 -1409 -1570 -2003 -1813 -1822 -1123
2912 -1123 -887 -513 421 569 1010 1281 1603 2006 1623 1777 1449 985 288 -13 -383 -858 -1406 -1405 -1695 -1827
2932 -1827 -1723 -1362 -1041 -412 -93 525 687 1316 1691 1994 1548 1538 1389 1016 557 34 -358 -1154 -1157 -1573 -1855
2953a855M4K76O6K98M37N03Q08Q07k68K97J96J27Pn17k10l70o52n63l44k87k43
2974a443j31k51M50K10L29L20N79N83K03M43N3M99j41k08m6m78m15l03p31l18
2994g96n68o8k1m25k41Q10K27M74M34Q16j7P38J72K31kj3j40m40m42l64o93l27
3016f55n87m12J21j13o5K83J2Q99J97M23N50L90L27N64q1l9m34J7q35m01l13m53
3038f05k92p60K14k74o8J83M69M18J26P34O93J91O50lJ03l02q6k54m05k15n49
3059c2p93m17j29k75j10J49J77K23J46R71K13J53O56M60L1r5N02n03j65l65n23
3080B74m83j56n05m67q9l32O8L53N9L92O71k55P24O76L3M30M57j04k4q40K03p93
3102B92k41n26n45k77p5k76P1K25J44K26M37O95J80N07L02J90o5K07L14l48m90
$$ plain form
2953 -1855 -1811 -1535 -1469 -1171 -734 -231 577 1384 1116 1413 1609 1736 1743 1226 1016 646 -6 -569 -913 -1200 -1443
2974 -1443 -1574 -1825 -1375 -1165 -836 -516 63 646 849 1292 1345 1844 1703 1495 1449 971 556 253 -478 -796
2994 -796 -1364 -1432 -1453 -1878 -2119 -1309 -1082 -608 -174 642 625 1363 1535 1766 1764 1751 1611 1171 729 365 -328 -655
3016 -655 -1242 -1654 -1533 -1646 -1711 -1428 -1416 -517 -320 103 653 1043 1370 1934 1853 1814 1380 1397 562 161 -152 -605
3038 -605 -897 -1657 -1443 -1717 -1785 -1602 -1133 -715 -589 145 838 1029 1679 1676 1779 1477 1391 1137 732 517 -32
3059 -32 -825 -1242 -1371 -1646 -1756 -1607 -1430 -1207 -1061 -90 123 276 932 1392 1423 1328 1830 1327 1162 797 274
3080 274 -209 -365 -870 -1337 -1426 -1758 -1690 -1337 -1278 -886 -215 -470 254 930 963 1393 1850 1746 1722 882 1085 292
3102 292 51 -475 -1020 -1297 -1372 -1648 -1577 -1352 -1208 -982 -545 150 330 837 1139 1329 1264 1471 1785 1437 947
3123I47n39m91Pp53j72j13m95M23l82R3N17P32R9N52L66L28R5L87M1N6n72p8o37
3146D11m50o5m92n61p6j09r1J0M89J95J11M77L59K61K79P37P7j44K2Q8n97l69
3168E62k32m62n57m78J15n47kL27JR7O50K92K64O56K40J61N16P1j77j14m84j49
3190G50j11q85l1n56m18j15o8P9K48K16J20K18O51M95K61J94N32k19N8r6j10n59
3212F54k28k35m83n40l81K7m8J18J02J84J58M20K27L51O24oM18k46L50m93p9l12
3234E82k25n01j05m89l97j18k3J24j84M29J39P04PL30N13J79J32L63j58l31O8
3255A039k50m58n14j71l30m41Q1j2j17L21j55L26M8O15M18K84Q1M92L2j2k24j84
3277H69l66k05l33k91j94l19m8o3m7J69P5J34J38K74M78L75L97k27LJ56j1l70
$$ plain form
3123 947 408 -83 -76 -829 -1001 -1114 -1609 -1186 -1568 -1475 -958 -226 -127 425 791 1119 1214 1601 1642 1698 1126 1048 411
3146 411 -39 -104 -596 -1157 -1233 -1342 -1433 -1423 -934 -739 -628 -151 208 469 748 1485 1562 1418 1440 1528 931 562
3168 562 330 -132 -689 -1167 -1052 -1599 -1601 -1274 -1273 -1176 -526 -234 30 686 926 1087 1603 1674 1497 1383 899 750
3190 750 639 -246 -277 -833 -1251 -1366 -1434 -1355 -1107 -891 -771 -553 98 593 854 1048 1580 1361 1419 1323 1213 654
3212 654 426 191 -292 -832 -1213 -1186 -1234 -1116 -1014 -830 -672 -252 -25 326 950 944 1362 1116 1466 973 894 582
3234 582 357 -144 -249 -738 -1135 -1253 -1276 -1152 -1336 -907 -768 -64 -57 273 786 965 1097 1460 1302 971 1039
3255 1039 789 331 -183 -354 -684 -1125 -1044 -1056 -1173 -852 -1007 -681 -633 -18 400 684 765 1257 1289 1277 1053 869
3277 869 503 298 -35 -326 -520 -839 -887 -950 -997 -828 -753 -619 -481 -207 271 646 1043 816 819 975 964 594
3299E94J31k96k26m62l84j4n71J57J17j76M77K78K18K15P6N03O8K63J64k61K21
3320A092m98l3k87l97l32j74n3j56j9k58N20j2RL98K26K47K83K77q9J45K41k22
3342I08k02n75Q7l89l66Oj89k36L9lk6J65J97K44O66m1P2J48L29J38k14n8N9p48
3366A1K89l06m95k38j91N4q8p0L24K30J94R0K10J80N13j92M30n0k89K0N5k76n64
3389a59k37J39k35k49l46J88P8j37L13J14N54o0L51K71J27L75l27J46k32k6qo85
3411d5k85j00l85N5Mm50K97Q3%O87j1K62K36K67J62l5J3o6q6J44l44k18j54m36
3435d05N1n60L02j97k32J41J46M66K70P9K72J87L82k24K66Q5j64j97l50j92l49
3456b23L5k11j07j26k07J14r0P1O30J14PM79J00J41J14K41l42l7j60l16p7m54
$$ plain form
3299 594 725 429 203 -259 -643 -657 -1228 -1071 -954 -1130 -653 -375 -157 58 134 637 705 968 1132 871 1092
3320 1092 594 561 274 -123 -455 -629 -682 -838 -857 -1115 -595 -607 -598 -200 26 273 556 833 744 889 1130 908
3342 908 706 131 218 -171 -537 -531 -720 -956 -917 -920 -946 -781 -584 -340 326 285 357 505 834 972 758 700 759 11
3366 11 300 -6 -501 -739 -930 -876 -964 -1034 -710 -480 -286 -196 14 194 707 515 945 895 606 626 681 405 -159
3389 -159 -396 -257 -492 -741 -1087 -899 -821 -958 -645 -531 23 -37 314 585 712 1087 760 906 674 648 640 -45
3411 -45 -330 -430 -815 -760 -756 -1206 -909 -826 -826 -139 -150 112 348 615 777 742 755 689 603 747 403 185 31 -405
3435 -405 -354 -914 -612 -809 -1041 -900 -754 -288 -18 61 333 520 902 678 944 1029 865 668 318 126 -223
3456 -223 -188 -399 -506 -632 -839 -725 -815 -744 -114 0 7 486 586 727 841 1082 740 703 543 227 150 -304
3478c04p0p2l13L7Q0L8j20M01K61LM8Q2L77o9L18M79m99j93J36j10m41k90k29
3501d50J74j86j10j24k71L88L5K69J15K15L47P9Q8NL65k90j00J22nn86k78j38
3523c36j86j27J47j54j82K69p6N15Q6L10l3K32J98j4J17L9k28k6p7m88q3m9m97
3546f43K50l31j04Q1QK89J83K02L19j69N30K8L05k37L76o37K57n42K0l07j40q4
3568c46j63k09K16j74k4L27J25J74j2N82q5j3J15n3L35k33j83R4k07k64j60O2
3590i6k92o5j38r9J32K91j95M40K3J09L88k6P8K28l11J7k28O6k19k78m7j74K3
3613c73l12L30k87K93j28O37k56K48K53l59L07K49N2k64o9l1j81j3k67J48m50
3634d73k0J2j90K51O5K38K62k03L1N14j37J42j53Q1k87j0J07n3r1k02l31K24j60
$$ plain form
3478 -304 -374 -446 -759 -722 -642 -604 -724 -323 -62 -59 -11 71 448 379 697 1176 677 484 620 510 69 -221 -450
3501 -450 -276 -462 -572 -696 -967 -579 -544 -275 -160 55 402 481 569 574 939 649 549 671 666 80 -198 -336
3523 -336 -522 -649 -502 -656 -838 -569 -645 -130 -44 266 233 465 663 649 766 805 577 551 474 -14 -97 -146 -643
3546 -643 -393 -724 -828 -747 -739 -450 -267 -65 254 85 615 643 948 711 1087 450 707 165 185 -122 -262 -346
3568 -346 -509 -718 -502 -676 -700 -373 -248 -74 -86 496 411 398 513 460 795 562 379 473 266 2 -158 -96
3590 -96 -388 -453 -591 -690 -558 -267 -462 -22 1 110 498 472 550 778 467 484 256 322 103 -175 -222 -396 -373
3613 -373 -685 -355 -642 -349 -477 160 -96 152 405 46 353 602 654 390 321 290 109 96 -171 -23 -473
3634 -473 -493 -481 -671 -420 -355 -117 145 -58 -27 487 350 492 339 420 133 123 230 177 86 -116 -447 -223 -383
3657c83j72Q8J13J57k43L24R1L14K71j87J90j16L07k48l81j23R4k2n54K65j10
3678c25k69Q4Q7n8K30J70M6j6J41K03K65k32oJ32J08l33J69m15k27P6l27M8k0
3701d69j26L16l5J0L75k37K52L57j23L51k9mk65k38N8m08L1%j99k47L58l45L06
3724c11K80l07K74K4K69J89j46J80M0m1o9M3j0m88o0J11l29K3j04l1k87K14M51
3747h5m08M03K74p3K00J53R9P7j93K9n3l42J25k88k70kj21R8j18rJ9J38M0J12
3771a95J30L07k31N72p7j72K54L4l75L5j65n26L22l93J50m01K99j36J22P8K01
3792a67K03q9O70j33N9K08k20M7J99l23Q5l89k12j16l47m3J27k85k16M07j0J90
3814c55M41Q0p6N05l47N70l37K06kk83Lj84j59m68o7k62J70J10m74M69K68j43
$$ plain form
3657 -383 -555 -467 -354 -197 -440 -116 -25 289 560 373 563 447 754 506 125 2 96 74 -480 -215 -325
3678 -325 -594 -510 -423 -481 -251 -81 -35 -51 90 293 558 326 320 452 560 227 396 -19 -246 -170 -497 -449 -469
3701 -469 -595 -279 -314 -304 71 -166 86 443 320 671 642 638 373 135 193 -215 -184 -184 -383 -630 -272 -617 -311
3724 -311 -31 -338 -64 -40 229 418 272 452 492 451 382 425 415 -73 -133 -22 -351 -328 -432 -463 -750 -536 -85
3747 -85 -493 -90 184 111 311 464 563 640 447 476 423 81 206 -82 -352 -354 -475 -377 -495 -504 -485 -347 -307 -195
3771 -195 -65 242 11 583 506 334 588 622 247 282 117 -409 -87 -480 -330 -731 -432 -568 -446 -368 -167
3792 -167 36 -53 617 484 543 751 531 578 777 454 539 150 -62 -178 -525 -568 -441 -726 -942 -535 -545 -355
3814 -355 86 166 90 595 248 818 481 687 685 402 405 221 62 -406 -473 -735 -565 -455 -929 -460 -192 -335
3836c35K89L19Q0j20M85o7O4q0o6L0l88jl07k51l92J79j53j18Q4K18m2J83K80
3859a09J98J36K89J19M7l5K33j48r5m59J56l15k21k28n32M11l26K39Q2N4L88L1
3881h5j0L48K47q3M01J78k25k17L9l72J8p0n07l2o8r0l06K60k26J79J14L52K47
3904I2J1N31o2J08J55J85j69k09pk32l44j87k30k16j08Q2l55O31j43O7J90j3M39
3927B16Q1O60k47L88m04K03l27j89l27L1m23j87K69m99k37N34j00j15K84L5K70
3948h4L33K30J79J84J84k41Rn20K31k36J20m74j99j10k48qk17K71k19K60J80K24
3970a51O86L68m69L03P8J73l67R8l70n7k88m15J28k81j63k52K39m2j21L86L35
3991a82jJ56M33J48K04k92j97L06K10l07k84j41m02n3L40m45j01q4L9k11M59J93
$$ plain form
3836 -335 -46 273 353 233 718 651 715 635 569 599 211 210 -97 -348 -740 -561 -714 -832 -748 -530 -572 -389 -109
3859 -109 89 225 514 633 680 645 878 730 635 176 332 17 -204 -432 -964 -553 -879 -640 -558 -504 -116 -85
3881 -85 -95 253 500 417 818 996 771 554 593 221 239 169 -338 -370 -438 -528 -834 -574 -800 -621 -507 -155 92
3904 92 103 634 572 680 835 1020 851 642 635 403 59 -128 -358 -574 -682 -600 -955 -324 -467 -400 -210 -223 216
3927 216 297 957 710 1098 694 897 570 381 54 85 -338 -525 -256 -755 -992 -458 -558 -673 -389 -354 -84
3948 -84 249 479 658 842 1026 785 794 274 505 269 389 -85 -284 -394 -642 -650 -867 -596 -815 -555 -375 -151
3970 -151 535 903 434 737 815 988 621 719 349 292 4 -411 -283 -564 -727 -979 -740 -782 -903 -517 -182
3991 -182 -183 -27 406 554 758 466 269 575 785 478 194 53 -349 -402 -62 -507 -608 -692 -653 -864 -405 -212
4013b12R5J50N53k2K70J16k32p8k44M9j11N2q09J33m47r8P1L70k19L49q4p1N04
4036H5M43k30K78J20p3K10l04j53r8j99l65N4l43l2J23l1l21r4L03lO95K4m0M02
4060D51P2K09j26j9J5o6o2l33j24l75O8k80m09L49l6K1M8M2M39K80J34K76K8J6
4084F18L41m31L5O7k2k97m12j87N7j70k64N9k13M11l2m2N06r8L82L4K37J34J7
4107G30q7o1m2j28m35K92m92k71O3l25J75k36J03J86k9K94K60O8J30K04P6R2K12
4130G79k54J34m23m40J05j69j37Qm41j37K17J61K66J81K26j9J02K02M62Q4l12
4151E95K84l33l46k1l62Q9k21j75k77j24K12j97O0M00q1M21N7N33o4J12J22K6
4173G10L7J06j3n53r3k95k30ml86L7j51j48M38J21J08J93K57P4L11J09L98m26
$$ plain form
4013 -212 -117 33 586 564 834 950 718 640 396 445 334 386 -423 -290 -737 -835 -764 -394 -613 -264 -348 -419 85
4036 85 528 298 576 696 623 833 529 376 278 79 -286 -232 -575 -607 -484 -515 -836 -930 -627 -630 65 89 49 451
4060 451 523 732 606 587 602 536 474 141 17 -358 -290 -570 -979 -630 -666 -645 -597 -555 -116 164 298 574 602 618
4084 618 959 528 563 630 608 311 -101 -288 -231 -401 -665 -606 -819 -408 -440 -482 24 -74 308 342 579 713 730
4107 730 643 582 540 412 -23 269 -223 -494 -431 -756 -581 -817 -714 -528 -557 -263 -3 65 195 399 475 567 779
4130 779 525 659 236 -204 -99 -268 -405 -397 -838 -975 -758 -597 -331 -150 76 57 159 361 823 907 595
4151 595 879 546 200 179 -183 -94 -315 -490 -767 -891 -679 -876 -816 -416 -497 -76 -19 514 450 562 684 710
4173 710 747 853 840 287 194 -101 -331 -335 -721 -684 -835 -983 -545 -424 -316 -123 134 208 519 628 1026 600
4195F00K52l37m9o0l09j74l11k31Ql78J90N2l3K80J39K31K8O64RP8j55J70J66
4218H30j8j10k3n13k91Lm62J53o9l74J96K36n2L65J05j18M33K51j73N26K87m74
4240G08L5j40k00k24j78j33n69l3j55j2k2J79K69L03J64N6J07O12o7r3J10p6J82
4263H23q2l32k23k30M9n56k30J27q7K16Q7J04M6n8L24M32K14O6J42k32M33k46
4285G87J63o29k61n3k68k56j6j42j60P6j18P3O9O49J61K22J3K51L31m11M01j54
4307G28k16O2n04k02r4j15p6m46P5j55K09K19J33K75J87K05K66J56J34J4j74J50
4329H31k40j77l16k61j44L7m17p7l9P6Q4j0R2L11L36J31J30M03j36KK08%p8m98
4353B48K3k52j84k03k29k65K79m14K30Q8P8M32P1M42l8M50j33K14j44J35j65k68
$$ plain form
4195 600 852 515 466 406 97 -77 -388 -619 -611 -989 -799 -747 -780 -500 -361 -130 -102 562 571 649 494 664 830
4218 830 812 702 679 166 -125 -122 -584 -431 -500 -874 -678 -442 -494 -129 -24 -142 291 542 369 895 1182 708
4240 708 743 603 403 179 1 -132 -701 -734 -889 -901 -923 -744 -475 -172 -8 48 155 767 700 607 717 641 823
4263 823 741 409 186 -44 5 -551 -781 -654 -741 -525 -438 -334 -288 -346 -22 410 624 690 832 600 1033 787
4285 787 950 321 60 7 -261 -517 -533 -675 -835 -759 -877 -804 -735 -86 75 297 310 561 892 481 882 728
4307 728 512 574 70 -132 -226 -341 -417 -863 -788 -943 -734 -515 -382 -107 80 285 551 707 841 855 681 831
4329 831 591 414 98 -163 -307 -270 -687 -764 -803 -727 -643 -653 -561 -250 86 217 347 750 614 616 824 824 746 248
4353 248 271 19 -165 -368 -597 -862 -583 -997 -767 -679 -601 -169 -98 344 306 756 623 837 693 828 663 395
4375C95k29r5l18l31m8l53K54K8J81J8LL04J09K26K35K54j3K64k08J11k11j14
4397D62j16l59k15k57N7m44K36j15k31L40J36K77M73k82M13P8K95J38k00J68j8
4418H36l80m34J18k08k99l09j0k02J72j21K31M11j77K91L12nK09q4J98K92l66
4439D75N6j12k10k9k8n61K76m28l08P5j39J78M61O5n1M59K34O3L83j16K05n70
4461C78J40l7k99P6l44j76q8l59J24n0m6j25M52M6J59N34k01M53k9K4K31R6l42
4484F17l35k36k6l9o49J99j94n7n1J99M11k05M56r5J47K65o3L28J34n0J18k69
4506F05k77J59p35O1j85j14l81K22j0J64K51MK9K49K88j69J47L57o5J08R6m70
4528C34j71J59m64j23k49j78K1K1k28P8K17M18q9L51K46K21n6N0K70l27j1j16
$$ plain form
4375 395 166 71 -247 -578 -626 -979 -725 -697 -516 -498 -495 -191 -82 144 379 633 620 884 676 787 576 462
4397 462 346 -13 -228 -485 -428 -872 -636 -751 -982 -642 -506 -229 244 -38 375 453 748 886 686 854 836
4418 836 456 22 140 -68 -367 -676 -686 -888 -716 -837 -606 -195 -372 -81 231 226 435 351 549 841 475
4439 475 531 419 209 180 152 -409 -133 -561 -869 -794 -933 -755 -294 -229 -280 179 413 476 859 743 948 378
4461 378 518 481 182 258 -86 -262 -350 -709 -585 -635 -681 -806 -354 -308 -149 385 184 637 608 632 863 959 617
4484 617 282 46 20 -19 -668 -469 -663 -720 -771 -572 -161 -366 90 -5 142 407 344 672 806 756 874 605
4506 605 328 487 -248 -187 -372 -486 -867 -645 -655 -491 -240 -236 -207 42 330 161 308 665 600 708 804 334
4528 334 163 322 -142 -265 -514 -692 -671 -650 -878 -800 -583 -165 -254 97 343 564 508 558 828 501 490 374
4550C74j48p5k22k26j37k04n0r2K10J0K11j80O5L24M93J95k70N27m29N22l59n1
4572D88m17L0j87m1k15k49P5l7N1p7J26K6L16QJ83P7K81L32k9r5j35N3k6n15m6
4597b3l02j22Kj18j45L0ML96j35M24q2K11L13o3L08J10q4l4k13Pl84j30j67K5
4621a72l41n9J49j83K11J4j6L70M4J83J13L13O1J00J69l51K6n25q6j48o1l00o
4644d95j10O5j86N0K54K4J86K15L03L3j83M71j20J19p8j31J0m12%J3l16m27p3
4667g88J15l60M01K37m7K62M36qJ69l0N8K4K9J09k65j94K85k06j96l62j43j36
4689f10l79J16P2M20L4K43n9L22L42O4j06K3n5K07J02o15o7R8j27m79n8P0j87
4712f29o7J60J77J03J68j09M73J55l0L77k02J8j83Q5j75J45p93N74p79J50j34
$$ plain form
4550 374 226 151 -71 -297 -434 -638 -688 -780 -570 -560 -349 -529 -464 -140 353 548 278 805 376 898 539 488
4572 488 71 101 -86 -127 -342 -591 -516 -553 -502 -579 -453 -427 -111 -103 80 157 438 770 741 646 511 564 538 23 -23
4597 -23 -325 -447 -445 -563 -708 -678 -674 -278 -413 11 -71 140 453 390 698 808 724 690 477 484 100 -30 -197 -172
4621 -172 -513 -572 -423 -606 -395 -381 -397 -27 17 200 313 626 687 787 956 605 631 106 20 -128 -189 -489 -495
4644 -495 -605 -540 -726 -676 -422 -398 -212 3 306 339 156 627 507 626 548 417 427 15 15 28 -288 -715 -788
4667 -788 -673 -1033 -632 -395 -442 -180 256 248 417 387 445 469 498 607 342 148 433 227 31 -331 -474 -610
4689 -610 -989 -873 -801 -381 -347 -104 -163 159 501 565 459 482 427 634 736 121 54 152 25 -454 -512 -442 -629
4712 -629 -696 -536 -359 -256 -88 -197 276 431 401 778 576 594 411 496 321 466 -327 247 -532 -382 -516
4733e16k23L41l40J61J85L34J03K53J28O8K82k97J73r9N3k53k04m71K43o05K4
4754f60j5j15j54M26K03Q8J04J93J97K70o2M02n33M06Rm84q8k99J06j43l65o1
4776e75J53j80J35k11J74J94K03K70J92k49L68O3K52j43K83m92l04J34n32J52
4796a13l56J03p1j99O4J65k58J05L05N66j98j8M07K24k32l3lj50k82J90j33M2
4818A25n26j07n8k13N20k82K64j24K07J29K28J70K53k42N60l58k54L34j01m11
4838A14M7l78k48R9m12M16k67J98j75J67M00Q0L45O2j53L07J72o03L71k00K85
4859F27p51L35o49J51k81J31k94j6L69m8Q6J28J54J19L52J12o3J72l2J26l73m1
4881C14l84j63j20M6l21j11K56j10R0j03N68j99J03K38M53j54K28k63J84M1k1
$$ plain form
4733 -516 -739 -398 -738 -577 -392 -58 45 298 426 494 776 479 652 553 606 353 149 -322 -79 -684 -660
4754 -660 -675 -790 -944 -518 -315 -227 -123 70 267 537 475 877 344 750 759 275 187 -112 -6 -149 -514 -575
4776 -575 -422 -602 -467 -678 -504 -310 -107 163 355 106 474 537 789 646 929 437 133 267 -265 -113
4796 -113 -469 -366 -437 -636 -572 -407 -665 -560 -255 311 113 95 502 726 494 461 458 308 26 216 83 125
4818 125 -401 -508 -566 -779 -259 -541 -277 -401 -194 -65 163 333 586 344 904 546 292 626 525 114
4838 114 161 -217 -465 -366 -778 -362 -629 -431 -606 -439 -39 41 386 448 295 602 774 171 542 342 627
4859 627 -124 211 -438 -287 -568 -437 -731 -747 -378 -426 -340 -212 -58 61 413 525 462 634 602 728 355 314
4881 314 -70 -233 -353 -307 -628 -739 -483 -593 -503 -606 -38 -237 -134 104 557 403 631 368 552 593 572
4902E72m10j94K52l01j57l35o1k1J53J00p3K01J86J1J87N64j90K69l41J56j6j36
4924D16m00J66k98L9j90p6l03j79MM35J10J8J04O9L25l57N99N7o4K72k69R9j71
4947D06l45pj54j4k03l4p5m72J99K12R4M0K95N96J40j12j01J49N3r1M1k87l19
4970A1j63k59Qj71k86L8J70J47kL19k12L81L0K79K4O12nj88l18O9j74q9j77j27
4994h3k19l15j18J52k02K59J0O1K75PM97k02P08k43N1j08R4k28j53m76J53N2m58
5017d86n0J02m41L60k13N47j70L2L47K44P2P3J91QJ33O4l09q2k10l50R5m95J1
5040e27L5k24J51J1K75j98N07o0J3M46J73j41j42M76k0j02j78l06k05l76J32n22
5062g82M31l2m03R2K53L45j43KL76J87J96J18N7l03K59j22k53j84r0j19j71l46
$$ plain form
4902 572 162 -32 220 -81 -238 -573 -634 -655 -502 -402 -475 -274 -88 -77 110 674 484 753 412 568 552 416
4924 416 16 182 -116 -77 -267 -343 -646 -825 -821 -386 -276 -258 -154 -85 240 -117 482 539 475 747 478 577 406
4947 406 61 54 -100 -114 -317 -351 -426 -898 -699 -487 -393 -353 -58 538 678 566 465 614 667 576 617 330 11
4970 11 -152 -411 -403 -574 -860 -822 -652 -505 -507 -188 -400 -19 11 290 314 926 921 733 415 484 310 221 44 -83
4994 -83 -302 -617 -735 -583 -785 -526 -516 -455 -180 -173 324 122 830 587 638 530 624 396 243 -233 -80 -28 -486
5017 -486 -536 -434 -875 -515 -728 -181 -351 -319 28 272 344 417 608 616 749 813 504 422 212 -138 -43 -538 -527
5040 -527 -492 -716 -565 -554 -279 -477 30 -30 -17 429 602 461 319 795 775 673 495 189 -16 -392 -260 -782
5062 -782 -351 -383 -786 -694 -441 -96 -239 -237 139 326 522 640 697 394 653 531 278 94 4 -115 -286 -632
5084f32m6j55M1L02J78J2j7K75M67j28L53J21j29j71K25N3m84N1k42n04Q3l7l84
5107g68J76j78J98P9P8J32L37J59K92J9j27O20k66j39K20n60j50k49L8j98k79
5128e66O4Nj31J19k5K25J60J52K39K7M39j47J91k61J41O4k87j60k43p0k34Q7l77
5151e88j32l2K17k46L52J47K07J69L95r8L31M8k1j2p1k57l6m49J53m00m90P3L2
5174g08J77p1j32L53J10K26J42M37k8K9J01M52n34J42k52p22K21k83L9m96J20
5195f77M9j68J34L11K6K74L10m7K11q3L11J43MJ7j02m25n9k91j34k52J29n23J45
5218f97J8K2P7mL60K62L89o3Q2K03M2J64j10q1j13m01Ok43j24k54j08p4k01k11
5242a059L40J94L98J0K07O24l1o5J16lj44o7k51k62J20k26m35p7j39n6r6N7Q5
$$ plain form
5084 -632 -678 -833 -792 -490 -312 -300 -317 -42 425 297 650 771 642 471 696 749 265 316 74 -430 -347 -384 -768
5107 -768 -592 -770 -572 -493 -415 -283 54 213 505 524 397 1017 751 612 832 272 122 -127 -89 -287 -566
5128 -566 -502 -497 -628 -509 -534 -309 -149 3 242 269 708 561 752 491 632 696 409 249 6 -64 -298 -211 -588
5151 -588 -720 -752 -535 -781 -429 -282 -75 94 489 391 722 770 749 737 666 409 373 -76 77 -323 -813 -740 -708
5174 -708 -531 -602 -734 -381 -271 -45 97 534 506 535 636 1088 554 696 444 -278 -57 -340 -301 -797 -677
5195 -677 -628 -796 -662 -351 -325 -51 259 212 423 340 651 794 798 815 713 288 229 -62 -196 -448 -319 -842 -697
5218 -697 -679 -657 -580 -584 -224 38 427 364 446 649 691 855 745 664 551 150 156 -87 -211 -465 -573 -647 -848 -1059
5242 -1059 -719 -525 -127 -117 90 714 683 618 734 731 587 520 269 7 127 -99 -534 -611 -750 -806 -902 -845 -760
5265g60L17K94R9K12J23L53R7O8o8L9k51p8j04o31p3j56k10k8N9j72M55j94J5
$$ plain form
5265 -760 -443 -149 -50 162 285 638 735 803 735 774 523 445 341 -290 -363 -519 -729 -757 -698 -870 -415 -609 -594
$$ [...]
8191a67
##END NTUPLES=NMR FID
##END=
