##TITLE=1H_Pr Wat
 200.13MHz, D2O,
 8 sc
 
 7.5.2025
##JCAMPDX= 6.0         $$ Bruker NMR JCAMP-DX V2.0
##DATA TYPE= NMR FID
##DATA CLASS= NTUPLES
##ORIGIN= UXNMR, Bruker Analytische Messtechnik GmbH
##OWNER= pz
$$ XWIN-NMR		Version 3.5
$$ Wed May  7 16:32:43 2025 Russian Standard Time (UT+4h)  she@DPX200
##.OBSERVE FREQUENCY= 200.1313
##.OBSERVE NUCLEUS= ^1H
##.DELAY= (6, 6)
##.ACQUISITION MODE= SIMULTANEOUS
##.ACQUISITION SCHEME= undefined
##.AVERAGES= 8
##.DIGITISER RES= 18
##SPECTROMETER/DATA SYSTEM= spect
##.PULSE SEQUENCE= zg30
##.SOLVENT NAME= CDCl3
##.SHIFT REFERENCE= (INTERNAL, CDCl3, 0, 14.3821)
##AUDIT TRAIL= $$ (NUMBER, WHEN, WHO, WHERE, WHAT)
$$ ##TITLE= Audit trail, XWIN-NMR		Version 3.5
$$ ##JCAMPDX= 5.01
$$ ##ORIGIN= Bruker BioSpin GmbH
$$ ##OWNER= she
$$ F:/spectra/data/she/nmr/H-C/1/audita.txt
$$ ##AUDIT TRAIL=  $$ (NUMBER, WHEN, WHO, WHERE, WHAT)
(   1,<2025-05-07 16:31:19.18 +0400>,<she>,<DPX200>,
      <created by zg, POWCHK disabled, PULCHK disabled
       configuration hash MD5:
       00 E9 B6 7A A2 85 ED C7 34 08 36 98 17 FE 4E 26
       data hash MD5: 16K
       14 EE 4C B1 5C 82 32 93 6E B9 65 8F 59 C1 5A C7>)
$$ ##END=
$$ 
$$ hash MD5
$$ C1 62 88 70 03 B0 08 05 EA B4 7B 30 61 5C CA 80
##$RELAX= 
##$RELAX= 
##$RELAX= 
##$RELAX= 
##$RELAX= 
##$RELAX= 
$$ Bruker specific parameters
$$ --------------------------
##$DU= <F:/spectra>
##$EXPNO= 1
##$NAME= <H-C>
##$PROCNO= 1
##$TYPE= <nmr>
##$USER= <she>
##$AMP= (0..31)
100 100 100 100 100 100 100 100 100 100 100 100 100 100 100 100 100 100 
100 100 100 100 100 100 100 100 100 100 100 100 100 100 
##$AQSEQ= 0
##$AQ_mod= 1
##$AUNM= <au_zg>
##$AUTOPOS= <>
##$BF1= 200.13
##$BF2= 200.13
##$BF3= 200.13
##$BF4= 200.13
##$BF5= 200.13
##$BF6= 200.13
##$BF7= 200.13
##$BF8= 200.13
##$BYTORDA= 1
##$CFDGTYP= 0
##$CFRGTYP= 5
##$CHEMSTR= <none>
##$CNST= (0..31)
1 1 145 1 1 1 1 1 1 1 1 1 1 1 1 1 1 1 1 1 1 1 1 1 1 1 1 1 1 1 1 1 
##$CPDPRG= <>
##$CPDPRG1= <>
##$CPDPRG2= <>
##$CPDPRG3= <>
##$CPDPRG4= <mlev>
##$CPDPRG5= <mlev>
##$CPDPRG6= <mlev>
##$CPDPRG7= <mlev>
##$CPDPRG8= <mlev>
##$CPDPRGB= <>
##$CPDPRGT= <>
##$D= (0..31)
0 0.7 0 0 0 0 0 0 0 0 0 0.03 0 0 0 0 0 0 0 0 0 0 0 0 0 0 0 0 0 0 0 0 
##$DATE= 1746621078
##$DBL= (0..7)
120 120 120 120 120 120 120 120 
##$DBP= (0..7)
150 150 150 150 150 150 150 150 
##$DBP07= 0
##$DBPNAM0= <>
##$DBPNAM1= <>
##$DBPNAM2= <>
##$DBPNAM3= <>
##$DBPNAM4= <>
##$DBPNAM5= <>
##$DBPNAM6= <>
##$DBPNAM7= <>
##$DBPOAL= (0..7)
0.5 0.5 0.5 0.5 0.5 0.5 0.5 0.5 
##$DBPOFFS= (0..7)
0 0 0 0 0 0 0 0 
##$DE= 6
##$DECBNUC= <off>
##$DECIM= 32
##$DECNUC= <off>
##$DECSTAT= 4
##$DIGMOD= 1
##$DIGTYP= 9
##$DL= (0..7)
0 120 120 120 120 120 120 120 
##$DP= (0..7)
150 150 150 150 150 150 150 150 
##$DP07= 0
##$DPNAME0= <>
##$DPNAME1= <>
##$DPNAME2= <>
##$DPNAME3= <>
##$DPNAME4= <>
##$DPNAME5= <>
##$DPNAME6= <>
##$DPNAME7= <>
##$DPOAL= (0..7)
0.5 0.5 0.5 0.5 0.5 0.5 0.5 0.5 
##$DPOFFS= (0..7)
0 0 0 0 0 0 0 0 
##$DQDMODE= 0
##$DR= 18
##$DS= 0
##$DSLIST= <SSSSSSSSSSSSSSS>
##$DSPFIRM= 0
$$ [...]
##$SUBNAM0= <"">
##$SUBNAM1= <"">
##$SUBNAM2= <"">
##$SUBNAM3= <"">
##$SUBNAM4= <"">
##$SUBNAM5= <"">
##$SUBNAM6= <"">
##$SUBNAM7= <"">
##$SUBNAM8= <"">
##$SUBNAM9= <"">
##$SW= 18.0517328524113
##$SWIBOX= (0..15)
0 0 2 0 0 0 0 0 0 0 0 0 0 0 0 0 
##$SW_h= 3612.71676300578
##$TD= 16384
##$TD0= 1
##$TE= 0
##$TE2= 300
##$TE3= 300
##$TEG= 300
##$TL= (0..7)
0 120 120 120 120 120 120 120 
##$TP= (0..7)
150 150 150 150 150 150 150 150 
##$TP07= 0
##$TPNAME0= <>
##$TPNAME1= <>
##$TPNAME2= <>
##$TPNAME3= <>
##$TPNAME4= <>
##$TPNAME5= <>
##$TPNAME6= <>
##$TPNAME7= <>
##$TPOAL= (0..7)
0.5 0.5 0.5 0.5 0.5 0.5 0.5 0.5 
##$TPOFFS= (0..7)
0 0 0 0 0 0 0 0 
##$TUNHIN= 0
##$TUNHOUT= 0
##$TUNXOUT= 0
##$USERA1= <user>
##$USERA2= <user>
##$USERA3= <user>
##$USERA4= <user>
##$USERA5= <user>
##$V9= 5
##$VALIST= <valist>
##$VCLIST= <CCCCCCCCCCCCCCC>
##$VD= 0
##$VDLIST= <DDDDDDDDDDDDDDD>
##$VPLIST= <PPPPPPPPPPPPPPP>
##$VTLIST= <TTTTTTTTTTTTTTT>
##$WBST= 1024
##$WBSW= 4
##$XGAIN= (0..3)
0 0 0 0 
##$XL= 0
##$YL= 0
##$YMAX_a= 473599
##$YMIN_a= -474050
##$ZGOPTNS= <>
##$ZL1= 120
##$ZL2= 120
##$ZL3= 120
##$ZL4= 120
##$ABSF1= 10
##$ABSF2= 0
##$ABSG= 5
##$ABSL= 3
##$ALPHA= 0
##$AQORDER= 0
##$ASSFAC= 0
##$ASSFACI= 0
##$ASSFACX= 0
##$ASSWID= 0
##$AUNMP= <proc_1d>
##$AZFE= 0.1
##$AZFW= 0.1
##$BCFW= 1
##$BC_mod= 2
##$BYTORDP= 1
##$COROFFS= 0
##$CY= -3
##$DATMOD= 1
##$DC= 2
##$DFILT= <>
##$DTYPP= 0
##$F1P= 0
##$F2P= 0
##$FCOR= 0.5
##$FTSIZE= 0
##$FT_mod= 4
##$GAMMA= 1
##$GB= 0.15
##$INTBC= 1
##$INTSCL= 1
##$ISEN= 128
##$LB= 0.25
##$LEV0= 0
##$LPBIN= 0
##$MAXI= 10000
##$MC2= 0
##$MEAN= 0
##$ME_mod= 0
##$MI= 1.114404
##$NCOEF= 0
##$NC_proc= 0
##$NLEV= 6
##$NOISF1= 3.799351
##$NOISF2= 2.8
##$NSP= 1
##$NTH_PI= 0
##$NZP= 0
##$OFFSET= 14.38212
##$PC= 1
##$PHC0= -1556.167
##$PHC1= 16.19222
##$PH_mod= 1
##$PKNL= yes
##$PPARMOD= 0
##$PSCAL= 0
##$PSIGN= 0
##$REVERSE= no
##$SF= 200.129724274929
##$SI= 16384
##$SIGF1= 3
##$SIGF2= 2
##$SINO= 400
##$SIOLD= 16384
##$SREGLST= <1H.CDCl3>
##$SSB= 0
##$STSI= 0
##$STSR= 0
##$SW_p= 3205.1282051282
##$SYMM= 0
##$S_DEV= 0
##$TDeff= 0
##$TDoff= 0
##$TI= <>
##$TILT= no
##$TM1= 0
##$TM2= 0
##$TOPLEV= 0
##$USERP1= <user>
##$USERP2= <user>
##$USERP3= <user>
##$USERP4= <user>
##$USERP5= <user>
##$WDW= 1
##$XDIM= 8192
##$YMAX_p= 0
##$YMIN_p= 0
$$ End of Bruker specific parameters
$$ ---------------------------------
##NTUPLES= NMR FID
##VAR_NAME=  TIME,          FID/REAL,        FID/IMAG
##SYMBOL=    X,             R,               I
##VAR_TYPE=  INDEPENDENT,   DEPENDENT,       DEPENDENT
##VAR_FORM=  AFFN,          ASDF,            ASDF
##VAR_DIM=   8192,          8192,            8192
##UNITS=     SECONDS,       ARBITRARY UNITS, ARBITRARY UNITS
##FACTOR=    0.0002768,     1,               1
##FIRST=     0,             0,               0
##LAST=      2.2672688,     0,               0
##MIN=       0,             -474050,         0
##MAX=       2.2672688,     473599,          0
$$ Real data points
##PAGE= N=1
##DATA TABLE= (X++(R..R)), XYDATA
0 0 0 0 0 0 0 0 0 0 0 0 0 0 0 -6 0 -8 8 -8 8 -8 14 -16 16 -24 24 -28 35 -36 45 -51 57 -66 74 -86 94 -108 120
37 120 -135 152 -166 187 -207 227 -254 279 -309 342 -373 413 -453 500 -553 609 -673 743 -825
56 -825 918 -1023 1152 -1301 1483 -1713 2002 -2394 2946 -3787 5205 -8092 16341 -94228 -415727
71 -415727 -472338 -386920 -198327 67277 346562 473599 421733 222206 -66455 -344046 -460878
82 -460878 -399965 -224033 27626 305715 464516 419266 221990 -30568 -278091 -431839
92 -431839 -419118 -247964 9172 270654 429336 411166 241227 4851 -235737 -407571
102 -407571 -421670 -261845 -11834 230468 390554 407757 268626 34743 -208318 -380263
112 -380263 -409671 -276256 -43787 192463 360222 401609 288695 65106 -178573 -355114
122 -355114 -397591 -284588 -72840 151745 327767 396985 307019 87820 -151042 -319883
132 -319883 -379162 -302801 -106890 125585 304525 377425 312087 119155 -116234 -292780 -362783
143 -362783 -311757 -139333 95952 286541 359607 305352 145747 -71783 -265215 -357157 -315842
154 -315842 -155434 64711 254031 342246 309559 169160 -40082 -239870 -343052 -312856
164 -312856 -170769 30273 220496 328905 315316 184795 -16601 -211584 -321639 -309570
174 -309570 -188820 -809 191806 314050 315115 196847 7279 -181333 -299280 -307126 -205642
185 -205642 -27129 166219 295543 308264 207719 35428 -150553 -281753 -305537 -214913
195 -214913 -47876 137542 272555 302432 218588 58223 -122416 -260774 -301112 -225199 -66637
206 -66637 112109 248560 293899 228876 79477 -97601 -238974 -291869 -233084 -86425 87768
217 87768 226633 283382 235983 98948 -74339 -217701 -280088 -237692 -105873 63184 206162
228 206162 272884 239502 115316 -51479 -196107 -267028 -240165 -123452 39924 186453 261597
239 261597 239711 129601 -28724 -174482 -254959 -241060 -136587 19026 165348 247762 239025
250 239025 142893 -7203 -154969 -242723 -239317 -147117 -1097 144016 234147 237926 154010
261 154010 11745 -135312 -229197 -235820 -156419 -20675 123355 221182 235448 161755 29065
272 29065 -114453 -214272 -232950 -165282 -37403 104087 207019 231201 168772 45181 -93971
283 -93971 -198869 -229076 -172807 -52689 85506 191460 225655 175583 60658 -75561 -183664
294 -183664 -223438 -178837 -67426 67279 175866 219055 181002 75156 -57930 -168658 -216046
305 -216046 -182456 -81380 49299 160484 211672 184770 88340 -40384 -153512 -208191 -185181
316 -185181 -93735 32121 145496 204298 186753 99388 -24563 -138151 -199633 -186799 -104578
327 -104578 16136 130290 195576 187362 109268 -8970 -122935 -190676 -187415 -114116 1439
338 1439 116050 186237 186854 118480 5982 -108305 -181786 -187003 -122552 -12836 100925 176605
350 176605 186176 126666 19956 -93317 -171626 -185338 -130320 -26707 85904 166328 184591
361 184591 133536 33296 -78762 -161057 -182857 -136910 -39672 71632 155794 181553 139637
372 139637 45481 -64679 -150455 -179627 -142235 -51635 57706 145048 178036 144432 57313
383 57313 -51012 -139542 -175750 -146448 -62685 44228 134284 173578 148110 67762 -37537
394 -37537 -128514 -171356 -149917 -72715 31548 123285 168522 151031 77312 -24481 -117492 -166012
406 -166012 -152544 -81803 18686 111705 162899 153308 86612 -11975 -106114 -160345 -154301 -90604
418 -90604 6268 100053 156743 154746 95145 -14 -94779 -153683 -154816 -98626 -6021 88445
430 88445 149945 155573 102651 11616 -83014 -146419 -154901 -105905 -17923 76762 142728 155237
442 155237 109483 23152 -71162 -138267 -154384 -112624 -29230 65245 134759 153782 115356 34415
454 34415 -59094 -130082 -152608 -118420 -40048 53054 126221 151522 120606 45203 -46903 -121293
466 -121293 -150447 -123417 -50144 41714 116863 148464 125171 55306 -35255 -112490 -147206 -126861
478 -126861 -59295 30009 107645 144818 128248 64222 -23830 -103010 -143180 -129996 -68061 18529
490 18529 97984 140576 130913 72440 -12945 -92951 -138076 -131816 -76661 7048 88317 135563
502 135563 132296 80264 -1462 -82698 -133101 -133366 -83782 -3573 77571 129656 133639 87700 9025
515 9025 -72440 -126602 -133427 -90767 -14264 67187 122978 133607 94024 19464 -62109 -120010
527 -120010 -132747 -96478 -24742 55850 116018 132982 99492 28996 -51157 -112205 -131660 -102015
539 -102015 -33973 46106 108362 130638 104336 38560 -40832 -104253 -129223 -106329 -43610 35793
551 35793 100926 127888 107329 47099 -29870 -95969 -126272 -109774 -51820 25569 92590 124461
563 124461 110288 55518 -19675 -87795 -122728 -111681 -59241 15116 83778 120222 112206 62933
575 62933 -9492 -78965 -118582 -113045 -65739 5203 74111 115777 113932 69608 -754 -70204
587 -70204 -113084 -113730 -72206 -4295 65220 110165 114168 75354 8544 -61069 -107642 -113663 -77666
600 -77666 -13081 56173 104531 113506 80148 17584 -51637 -101431 -113128 -82403 -21400 47194
612 47194 98026 112098 84520 25547 -42541 -94615 -111085 -86512 -29455 38059 91343 110222
624 110222 87950 33185 -33639 -87384 -109055 -89906 -37006 29392 84290 107452 90686 40307
636 40307 -25049 -80626 -105818 -91923 -43863 20618 77181 104168 92579 46771 -16520 -73103
648 -73103 -102522 -93534 -49963 12372 69532 100497 94260 52642 -8221 -65839 -98365 -94534 -55270
661 -55270 4465 62327 95932 94414 57984 -377 -58484 -94276 -94488 -59869 -3081 54680 91601
674 91601 94369 62266 6988 -50757 -89526 -93905 -64061 -10342 47053 86664 93909 65933 13815
687 13815 -43216 -83841 -93365 -67474 -17097 39621 81648 92463 68968 20323 -35749 -78638
699 -78638 -91675 -70729 -23220 32422 75770 90778 71879 26176 -28947 -72941 -89742 -73085
711 -73085 -29066 25379 70159 88506 73943 31596 -22088 -67332 -87206 -74689 -34283 18598
723 18598 64180 85826 75499 36876 -15148 -61371 -84344 -75865 -39040 12089 58416 82804
735 82804 76518 41634 -8773 -55487 -81389 -76589 -43570 5559 52664 79614 76864 45463 -2545
748 -2545 -49582 -77851 -76799 -47438 -433 46955 76127 76858 48958 3147 -43711 -74351 -76713
761 -76713 -50481 -5798 40998 72519 76319 52141 8449 -38159 -70357 -76026 -53214 -10866
773 -10866 35271 68535 75716 54651 13514 -32709 -66482 -75206 -55886 -15797 29742 64300
785 64300 74861 57296 18434 -27123 -62180 -73902 -58327 -20683 24104 59917 73162 59103
797 59103 22882 -21402 -57696 -72316 -60037 -25432 18787 55520 71435 60935 27508 -15931
809 -15931 -53179 -70336 -61603 -29744 13260 50871 69425 62024 31902 -10586 -48562 -68247
821 -68247 -62530 -33504 7833 46233 67096 62849 35240 -5264 -44042 -65832 -63162 -37011 2858
834 2858 41641 64525 63352 38585 -592 -39327 -63263 -63603 -40237 -1746 37004 61855 63379
847 63379 41477 4110 -34590 -60317 -63551 -42902 -6407 32326 58932 63364 44227 8671
859 8671 -29832 -57463 -63177 -45520 -11187 27391 55727 62917 46815 13271 -25153 -54169 -62656
872 -62656 -47772 -15078 22683 52216 62294 48887 17461 -20491 -50684 -61711 -49933 -19538
884 -19538 18091 48951 61156 50841 21435 -15741 -46840 -60587 -51611 -23493 13457 45080
896 45080 59867 52206 25191 -11021 -43076 -58881 -52872 -27222 8649 41190 58141 53527 29128
909 29128 -6194 -39022 -57347 -53870 -30609 4007 37003 56249 54351 32278 -1573 -35009
921 -35009 -55016 -54683 -33981 -744 32836 53974 54863 35404 2905 -30723 -52615 -54877 -36834
934 -36834 -5255 28379 51288 55040 38200 7221 -26425 -49988 -55053 -39491 -9187 24186
946 24186 48462 54769 40498 11232 -22095 -47090 -54456 -41611 -13207 19864 45702 54327 42807
959 42807 15317 -17717 -44039 -53945 -43549 -17269 15466 42301 53375 44655 19020 -13281
971 -13281 -40743 -52820 -45420 -20912 11285 39005 52123 46017 22860 -8877 -37204 -51336
983 -51336 -46746 -24481 6706 35338 50785 47181 26132 -4605 -33496 -49726 -47606 -27792 2440
996 2440 31520 48861 47989 29202 -191 -29564 -47641 -48158 -30697 -1761 27667 46719 48252
1009 48252 31809 3843 -25542 -45533 -48354 -33181 -5558 23695 44218 48117 34426 7817
1021 7817 -21712 -42884 -48381 -35500 -9574 19580 41597 47732 36321 11297 -17695 -40232
1033 -40232 -47639 -37234 -13125 15686 38546 47121 38373 14838 -13715 -37278 -46531 -38782 -16530
1046 -16530 11586 35549 46181 39736 18186 -9841 -33878 -45392 -40368 -20044 7735 32483
1058 32483 44923 40691 21202 -5822 -30629 -43983 -40939 -22976 3977 28934 43144 41394
1070 41394 24417 -1751 -27145 -42261 -41446 -25493 -16 25411 41039 41569 26782 2042 -23654
1083 -23654 -40266 -41766 -27677 -3536 21778 38998 41722 28952 5266 -20076 -37993 -41431
1095 -41431 -29688 -7147 18093 36814 41654 30690 8705 -16529 -35337 -41020 -31580 -10176
1107 -10176 14721 34218 40965 32227 11456 -12567 -32802 -40409 -32860 -13034 11357 31509 39740
1120 39740 33322 14349 -9589 -29907 -39163 -33909 -15740 8143 28399 38627 34372 17156 -6326
1133 -6326 -27297 -37845 -34599 -18308 4620 25612 37115 34957 19332 -3412 -24506 -36214
1145 -36214 -34811 -20800 1581 22855 35554 35106 21419 -14 -21546 -34493 -35111 -22493 -1803
1158 -1803 20063 33765 34816 23339 2869 -18538 -33064 -34983 -24139 -4355 16906 32077
1170 32077 34784 24696 5912 -15457 -30986 -34622 -25558 -6961 13942 29816 34350 25988 8305
1183 8305 -12449 -28867 -34004 -26686 -9342 10991 27631 33764 27295 10658 -9786 -26509 -33255
1196 -33255 -27484 -11543 8239 25192 32936 28081 12765 -6900 -23953 -32215 -28436 -13789 5704
1209 5704 22890 31682 28644 14720 -4312 -21699 -31238 -28850 -15619 3394 20675 30459 28895
1222 28895 16659 -1911 -19583 -29919 -28883 -17173 905 18290 28998 29024 18107 357 -17302
1235 -17302 -28496 -29027 -18695 -1434 16136 27741 28882 19399 2561 -15083 -27021 -28857 -20048
1248 -20048 -3814 13888 26263 28681 20614 4752 -12633 -25573 -28514 -20959 -5654 11812 24671
1261 24671 28281 21613 6462 -10625 -23946 -28242 -21697 -7408 9444 22952 28111 22253 8498
1274 8498 -8405 -22215 -27715 -22508 -9116 7378 21591 27341 23240 10184 -6478 -20716 -27049
1287 -27049 -23354 -10777 5376 19526 26690 23577 11911 -4486 -18875 -26117 -23868 -12600 3470
1300 3470 17943 25977 23936 13159 -2361 -16863 -25090 -24177 -13971 1381 16249 24792 24356 14699
1314 14699 -433 -15086 -24177 -24331 -15363 -483 14243 23691 24397 15911 1605 -13232 -23152 -24377
1328 -24377 -16630 -2430 12498 22716 24269 16966 3282 -11306 -22051 -24467 -17534 -4233 10421
1341 10421 21607 24283 17718 4937 -9603 -20781 -24049 -18271 -5912 9032 20368 24137 18868
1354 18868 6529 -7947 -19611 -23815 -19070 -7322 7163 18917 23883 19591 8279 -5996 -18231
1367 -18231 -23383 -19942 -9151 5137 17500 23222 20459 9818 -4251 -16812 -22884 -20391 -10540
1380 -10540 3152 16024 22560 20731 11329 -2427 -15068 -22243 -21049 -11952 1641 14326 21849
1393 21849 21343 12829 -414 -13615 -21322 -21353 -13367 -336 12857 21083 21671 13989 1227 -11702
1407 -11702 -20521 -21468 -14456 -2125 11121 20153 21741 15085 2845 -10238 -19589 -21688 -15629 -3679
1421 -3679 9390 19024 21673 16107 4537 -8307 -18412 -21405 -16714 -5587 7634 17861 21489
1434 21489 17019 6351 -6881 -17218 -21346 -17438 -6988 5853 16528 21276 17759 7819 -5052
1447 -5052 -16125 -20977 -18174 -8814 4068 15286 20654 18424 9190 -3148 -14548 -20255 -18646 -10088
1461 -10088 2378 13709 20172 18951 10872 -1402 -12959 -19685 -19160 -11243 571 12215 19507
1474 19507 19340 12030 202 -11397 -18936 -19544 -12747 -1116 10667 18596 19661 13263 2160 -10018
1488 -10018 -18066 -19559 -13638 -2850 9195 17524 19649 14212 3605 -8198 -16982 -19462 -14576 -4569
1502 -4569 7387 16410 19483 15158 5130 -6668 -15814 -19339 -15500 -6004 5851 15172 19165 16021
1516 16021 6964 -4865 -14600 -19012 -16260 -7455 4051 13874 18899 16650 8169 -3110 -13381 -18435
1530 -18435 -16907 -8823 2281 12589 18174 16926 9542 -1671 -11785 -17770 -17202 -9965 728 11164
1544 11164 17707 17342 10509 161 -10507 -17302 -17467 -11208 -939 9728 16762 17338 11667 1623
1558 1623 -9067 -16477 -17614 -12111 -2272 8362 15927 17346 12484 2990 -7437 -15416 -17399 -13064
1572 -13064 -3874 6612 14816 17278 13504 4594 -6005 -14352 -17080 -13763 -5287 5188 13715 16942
1586 16942 13956 5918 -4515 -13131 -16835 -14243 -6496 3727 12577 16627 14575 7017 -2956 -11800
1600 -11800 -16345 -14619 -7761 2299 11283 15998 14881 8252 -1474 -10670 -15853 -15048 -8601 992 10021
1615 10021 15512 15005 9219 -160 -9505 -15107 -15120 -9717 -372 8747 14828 15279 10106 1334 -8074 -14361
1631 -14361 -15231 -10583 -1753 7501 14032 15194 10881 2519 -6604 -13443 -15118 -11274 -2930 6169 13175
1646 13175 15006 11472 3607 -5543 -12601 -14833 -11611 -4235 4973 12104 14681 11907 4746 -4236 -11555
1661 -11555 -14651 -12048 -5132 3873 11224 14467 12336 5717 -3075 -10685 -14225 -12483 -6227 2506 10162
1676 10162 13986 12739 6600 -1695 -9665 -13618 -12767 -6910 1272 9123 13520 12751 7246 -570 -8577
1691 -8577 -13012 -13037 -7822 224 8044 12824 12977 8066 361 -7474 -12589 -13090 -8667 -843 6996 12244
1707 12244 12911 8855 1413 -6472 -11799 -12982 -9027 -1884 6096 11662 12936 9272 2318 -5483 -11207
1722 -11207 -12822 -9591 -2705 4931 10870 12721 9801 3133 -4368 -10425 -12594 -10014 -3604 3934 10309
1737 10309 12459 10059 4019 -3684 -9808 -12372 -10294 -4270 3104 9395 12308 10453 4833 -2712 -8951
1752 -8951 -11983 -10485 -5166 2281 8761 11895 10570 5489 -1833 -8414 -11719 -10750 -5847 1114 7786
1767 7786 11411 10869 6109 -792 -7331 -11367 -11020 -6462 369 7245 11173 10880 6536 5 -6579 -10784
1783 -10784 -10770 -6968 -553 6310 10691 10895 7251 627 -5912 -10441 -11078 -7630 -1112 5479 10066 11082
1799 11082 7829 1528 -4995 -9774 -10844 -7927 -1917 4587 9566 10916 8212 2560 -4365 -9299 -10772
1814 -10772 -8340 -2713 3834 9014 10799 8624 3135 -3379 -8806 -10841 -8693 -3454 3080 8358 10571
1829 10571 8662 3785 -2559 -8222 -10599 -9033 -3897 2368 7855 10445 9159 4516 -1901 -7646 -10419
1844 -10419 -9211 -4842 1533 7217 10295 9341 4997 -1124 -6842 -9998 -9417 -5369 629 6607 9966
1859 9966 9522 5819 -231 -6067 -9854 -9781 -5783 -149 5831 9582 9758 6056 336 -5631 -9455 -9882
1875 -9882 -6401 -851 5130 9293 9755 6735 1206 -4776 -8829 -9574 -7009 -1494 4514 8793 9683 7234
1891 7234 1690 -4258 -8550 -9757 -7560 -2384 3591 8276 9684 7554 2699 -3419 -7995 -9621 -7918
1906 -7918 -2877 2868 7657 9673 7943 3474 -2469 -7432 -9627 -8082 -3830 2199 7219 9563 8215
1921 8215 4067 -1723 -6935 -9275 -8380 -4367 1440 6490 9397 8512 4479 -727 -6122 -9224 -8747 -4815
1937 -4815 578 5811 8967 8870 5336 -50 -5520 -8890 -8913 -5448 -87 5272 8395 8862 5796 390
1953 390 -4925 -8389 -9087 -6080 -929 4658 8332 8960 6119 1364 -4270 -8137 -9011 -6566 -1632 3929
1969 3929 7926 9006 6827 1882 -3565 -7724 -8788 -6990 -2322 3135 7332 8966 7120 2709 -2737
1984 -2737 -7031 -8589 -7251 -2903 2305 6923 8683 7521 3225 -2010 -6542 -8585 -7577 -3584 1679
1999 1679 6354 8527 7611 3952 -1334 -5958 -8274 -7766 -4176 895 5550 8297 7851 4576 -347 -5071
2015 -5071 -7947 -7818 -4762 129 4737 7972 7853 5048 237 -4566 -7627 -8020 -5307 -624 4072 7622
2031 7622 7914 5298 1123 -3953 -7292 -7973 -5652 -1259 3639 7109 8034 5778 1599 -3175 -6819 -7907
2047 -7907 -6063 -1838 3028 6710 7729 6196 2035 -2601 -6249 -7670 -6177 -2326 2316 5986 7701
2062 7701 6528 2705 -1796 -5736 -7621 -6627 -2923 1615 5571 7355 6380 3125 -1381 -5166 -7357
2077 -7357 -6686 -3506 1080 5019 7087 6863 3585 -644 -4667 -6973 -6704 -3950 315 4393 6751 6842
2093 6842 4087 -179 -3961 -6676 -6660 -4302 -213 3827 6506 6712 4536 533 -3463 -6238 -6746 -4616
2109 -4616 -829 3400 6018 6690 4734 1075 -3060 -5748 -6659 -4734 -1462 2608 5700 6631 5086 1568
2125 1568 -2320 -5378 -6413 -5108 -1845 2071 5235 6498 5144 2084 -1728 -4886 -6238 -5419 -2374
2140 -2374 1538 4752 6283 5514 2545 -1387 -4588 -6137 -5402 -2672 898 4225 5996 5341 2895 -796
2156 -796 -4059 -5939 -5338 -2868 455 3992 5772 5532 3234 -221 -3507 -5546 -5442 -3204 -31 3529
2172 3529 5271 5421 3324 279 -3165 -5281 -5321 -3471 -397 2878 5017 5385 3591 487 -2839 -4959
2188 -4959 -5333 -3671 -783 2388 4799 5146 3825 876 -2348 -4495 -5143 -3792 -1101 1889 4416 5066
2204 5066 3959 1255 -1917 -4217 -4872 -3925 -1440 1552 4020 4715 3964 1549 -1248 -3915 -4869 -4106
2220 -4106 -1658 1362 3730 4711 4108 1757 -1021 -3463 -4755 -4018 -2017 961 3299 4519 4201 1915
2236 1915 -659 -3292 -4483 -4065 -2106 533 3247 4343 4079 2274 -325 -2951 -4243 -4048 -2345 363
2252 363 2693 4184 4142 2415 -228 -2466 -4008 -3929 -2478 -140 2369 3913 4021 2641 388 -2085
2268 -2085 -3812 -3929 -2703 -423 1914 3676 3802 2588 624 -1972 -3534 -3834 -2917 -808 1725 3460
2284 3460 3654 2721 849 -1618 -3250 -3867 -2823 -787 1415 3214 3861 2809 946 -1288 -3167 -3551
2300 -3551 -2893 -957 1113 2912 3699 2808 1228 -1027 -3018 -3638 -2920 -1156 931 2773 3489 2913 1318
2317 1318 -851 -2683 -3513 -2959 -1286 599 2457 3430 2816 1449 -689 -2405 -3277 -2892 -1454 347
2333 347 2352 3263 2858 1589 -376 -1973 -3200 -2781 -1666 347 2077 3069 2824 1768 77 -1923
2349 -1923 -2951 -2871 -1743 -43 1882 2867 2831 1815 240 -1649 -2872 -3041 -1854 -342 1555 2721
2365 2721 2839 2005 211 -1416 -2776 -2841 -1990 -361 1190 2373 2844 1926 356 -1136 -2236 -2800 -2044
2382 -2044 -603 1235 2251 2866 2156 662 -1102 -2372 -2583 -2163 -838 923 2195 2586 2229 878
2398 878 -592 -2025 -2691 -2182 -991 656 2009 2617 2028 1030 -564 -1815 -2522 -2172 -856 217 1745
2415 1745 2477 2074 1174 -299 -1693 -2142 -2160 -1245 260 1495 2297 2113 1252 -101 -1509 -2347 -2179 -1318
2433 -1318 86 1275 2336 2260 1201 154 -1280 -2111 -2190 -1288 -124 1178 2105 2119 1559 123 -1076
2450 -1076 -1888 -2133 -1528 -457 961 1772 2063 1495 555 -844 -1753 -1976 -1725 -424 615 1599 1890 1539
2468 1539 617 -699 -1656 -1833 -1637 -515 398 1530 1872 1605 737 -281 -1308 -1821 -1651 -708 406 1392
2486 1392 1742 1509 711 -445 -1086 -1777 -1617 -812 158 1085 1511 1534 819 -71 -945 -1604 -1513 -937 38 793
2506 793 1477 1441 948 118 -802 -1413 -1401 -1024 -45 842 1424 1428 1020 103 -633 -1178 -1476 -913 -301 670 1036
2527 1036 1395 934 308 -392 -973 -1231 -1014 -443 421 1018 1112 1150 460 -189 -898 -1435 -1024 -650 198 817
2547 817 1194 920 674 -17 -725 -1046 -1137 -374 101 599 894 1059 640 93 -576 -1014 -1076 -693 -31 485 703
2568 703 1101 374 39 -383 -868 -921 -699 -287 280 700 844 757 260 -132 -680 -684 -586 -141 129 671 864 783
2590 783 517 -12 -473 -805 -795 -469 8 513 673 696 443 139 -215 -573 -801 -525 -162 159 446 603 411
2611 411 135 -293 -734 -757 -714 -383 149 546 872 722 267 -35 -562 -743 -659 -394 -151 286 659 819 397
2632 397 137 -218 -451 -601 -532 -248 70 598 643 512 296 77 -531 -627 -736 -318 7 415 726 543 288
2653 288 29 -308 -731 -708 -482 -198 297 535 622 455 148 -302 -725 -739 -721 -325 5 397 826 606 309
2674 309 -193 -480 -759 -784 -329 -45 482 774 669 395 66 -460 -746 -757 -567 23 527 743 733 558 133
2695 133 -201 -608 -833 -629 -407 323 762 632 787 303 -259 -552 -810 -776 -365 155 453 891 753 477
2715 477 -93 -585 -876 -903 -509 1 371 936 938 689 144 -435 -900 -1009 -743 -76 461 817 1020 830 199
2736 199 -481 -921 -963 -749 -386 309 994 1191 631 192 -133 -883 -892 -681 -401 143 923 1036 1098 510 -181
2757 -181 -977 -1234 -1097 -432 126 844 1011 995 324 -160 -789 -1258 -1097 -573 137 660 1095 1122 752 -29 -703
2778 -703 -1144 -1128 -826 -41 702 1199 1139 776 58 -628 -1264 -1207 -886 -192 563 1106 1306 887 236 -489 -963
2799 -963 -1405 -796 -218 608 1054 1420 1000 387 -333 -1197 -1236 -1052 -487 395 1166 1348 1292 580 -415 -950 -1281
2820 -1281 -1170 -649 211 964 1134 1301 726 37 -1041 -1297 -1141 -802 118 872 1397 1441 857 74 -1090
2839 -1090 -1294 -1487 -940 -141 836 1398 1365 954 154 -785 -1303 -1474 -923 -162 885 1308 1383 985 189 -650
2859 -650 -1484 -1459 -1130 -247 502 1202 1439 983 343 -589 -1443 -1777 -1008 -317 411 1252 1390 1203 460 -515
2879 -515 -1460 -1429 -1351 -634 477 1186 1531 1324 627 -253 -1322 -1714 -1392 -643 475 1352 1627 1480 533 -283
2899 -283 -1140 -1661 -1521 -941 217 1068 1664 1448 758 -168 -980 -1664 -1519 -848 -9 1071 1626 1542 804 -59
2919 -59 -1026 -1740 -1763 -1083 50 839 1664 1589 1143 85 -739 -1688 -1646 -1082 -170 880 1482 1700 1093 290
2939 290 -876 -1677 -1657 -1342 -590 678 1594 1755 1276 515 -659 -1567 -1774 -1483 -315 750 1536 1881 1391
2958 1391 603 -407 -1569 -1833 -1621 -440 622 1510 1740 1470 574 -507 -1543 -1912 -1666 -559 366
2975 366 1351 1912 1668 797 -438 -1277 -1973 -1659 -912 340 1203 1970 1583 787 -379 -1212 -1862 -1824 -1035
2994 -1035 45 1363 1879 1765 921 -168 -1234 -1843 -1834 -1218 124 1099 1868 1828 1112 -19 -1237 -2050
3012 -2050 -1752 -1287 -43 1180 1898 1986 1366 39 -1123 -1812 -1906 -1439 -327 951 1961 1999 1508 209
3030 209 -1176 -1840 -2016 -1416 -339 948 1834 2080 1526 420 -886 -1788 -2098 -1683 -626 693 1875
3047 1875 2088 1575 532 -965 -1950 -2046 -1597 -455 768 1640 2169 1766 586 -756 -1743 -2145 -1949 -853
3065 -853 628 1706 2394 1944 874 -650 -1716 -2230 -2078 -911 548 1457 2190 1734 1059 -382 -1618
3082 -1618 -2276 -2100 -1079 442 1598 2378 2216 1223 -314 -1502 -2330 -2156 -1198 183 1326 2307 2204
3099 2204 1397 73 -1462 -2158 -2190 -1414 -2 1302 2300 2239 1413 68 -1323 -2304 -2498 -1419 -351 1321
3117 1321 2230 2363 1794 268 -1127 -2059 -2374 -1723 -433 1037 2353 2350 1770 258 -1245 -2298 -2446 -1866
3135 -1866 -365 985 2028 2599 2012 652 -992 -2231 -2552 -2047 -761 706 2076 2554 2280 813
3151 813 -600 -1900 -2827 -2169 -1026 784 1986 2454 2385 936 -670 -2055 -2733 -2292 -1072 547 1985
3168 1985 2624 2357 1233 -414 -2084 -2658 -2420 -1265 413 2005 2709 2396 1262 -220 -1757 -2662 -2471
3185 -2471 -1486 75 1665 2682 2532 1548 -144 -1631 -2743 -2710 -1675 -171 1500 2608 2864 1520
3201 1520 191 -1662 -2555 -2972 -1870 -161 1408 2566 2783 1899 441 -1368 -2603 -2708 -2063 -418
3217 -418 1392 2323 2852 2125 658 -1066 -2642 -2815 -2118 -700 1105 2349 2895 2101 936 -836 -2406
3234 -2406 -2850 -2388 -1007 872 2348 2691 2445 1200 -874 -2309 -2771 -2593 -1140 694 2167 2991 2563
3251 2563 1198 -544 -2060 -2935 -2484 -1379 540 2123 2713 2602 1365 -245 -2013 -3027 -2870 -1406
3267 -1406 177 2007 2670 2752 1564 -87 -1748 -2769 -2713 -1778 -149 1600 2733 2626 1846 37 -1717
3284 -1717 -2778 -2893 -2058 -75 1480 2651 2927 2012 325 -1543 -2822 -2806 -2004 -455 1355 2675 2872
3301 2872 2091 413 -1348 -2496 -3005 -2218 -552 1222 2592 3030 2106 784 -933 -2360 -2936 -2401 -965
3318 -965 878 2422 2979 2384 1047 -732 -2383 -3045 -2348 -1058 668 2357 2918 2455 1055 -772 -2173
3335 -2173 -2759 -2548 -1297 361 2027 3040 2685 1374 -525 -2010 -2782 -2700 -1408 268 1877 2871 2804
3352 2804 1431 -119 -1860 -2705 -2695 -1533 10 1796 2907 2797 1692 52 -1648 -2745 -2860 -1959
3368 -1959 -158 1508 2784 2904 1969 272 -1335 -2705 -2832 -2005 -237 1323 2633 2854 2124 573
3384 573 -1312 -2595 -2880 -2099 -559 1215 2504 2989 2132 653 -1148 -2426 -2884 -2381 -823 1022 2436
3401 2436 2774 2236 877 -861 -2364 -2872 -2492 -892 878 2287 2872 2341 866 -815 -2228 -2737 -2507
3418 -2507 -1094 739 2108 2809 2591 1229 -448 -2078 -2879 -2548 -1214 416 1902 2907 2364 1346
3434 1346 -229 -1771 -2869 -2605 -1382 180 1744 2576 2507 1705 -74 -1868 -2595 -2775 -1630 72 1622
3451 1622 2706 2777 1734 61 -1519 -2638 -2608 -1718 -207 1513 2367 2570 1655 427 -1140 -2466 -2714
3468 -2714 -1851 -541 1284 2468 2711 1874 620 -1115 -2330 -2737 -2064 -495 1152 2314 2579 2079 544
3485 544 -1146 -2141 -2733 -1998 -647 983 2327 2726 2227 761 -769 -2259 -2705 -2186 -968 743 2136
3502 2136 2574 2380 908 -662 -2066 -2644 -2159 -923 679 2178 2653 2313 1234 -382 -1874 -2472 -2347
3519 -2347 -1024 468 1923 2491 2279 1222 -276 -1708 -2727 -2411 -1359 209 1728 2521 2408 1424
3535 1424 -89 -1708 -2562 -2364 -1511 112 1671 2708 2420 1432 -82 -1411 -2243 -2446 -1549 -180 1541
3552 1541 2237 2371 1505 101 -1319 -2255 -2385 -1676 -344 1209 2388 2499 1820 329 -1354 -2232 -2499
3569 -2499 -1886 -450 1126 2307 2522 1722 348 -1111 -2375 -2449 -2061 -599 964 2157 2509 1930 534
3586 534 -793 -1903 -2453 -2061 -760 978 2230 2732 2045 815 -682 -2035 -2547 -1996 -836 644 1830
3603 1830 2532 2056 1051 -520 -1839 -2494 -2184 -1093 583 1824 2488 2359 938 -366 -1773 -2280 -2278
3620 -2278 -1174 240 1693 2355 2416 1157 -187 -1693 -2295 -2219 -1424 223 1533 2244 2266 1405 -87 -1752
3638 -1752 -2456 -2252 -1389 84 1645 2444 2408 1564 80 -1304 -2280 -2348 -1549 -22 1283 2394 2344 1688
3656 1688 135 -1216 -2146 -2420 -1671 -335 1096 2269 2502 1694 477 -1045 -2257 -2512 -1560 -533 958
3673 958 2098 2459 1977 713 -981 -1960 -2531 -1907 -755 935 2139 2386 1832 824 -774 -1949 -2456
3690 -2456 -2104 -621 620 1825 2309 1988 894 -631 -1908 -2470 -2182 -1054 428 1697 2449 2101 1180
3707 1180 -370 -1644 -2375 -2184 -1278 307 1579 2568 2266 1179 -228 -1738 -2449 -2249 -1101 -25 1547
3724 1547 2433 2270 1371 -73 -1356 -2332 -2366 -1490 154 1444 2408 2367 1414 78 -1174 -2288 -2486 -1621
3742 -1621 -197 1097 2169 2372 1810 287 -1023 -2121 -2347 -1763 -430 1053 2172 2356 1745 642
3758 642 -896 -2076 -2424 -1816 -745 779 1951 2417 1924 711 -797 -1855 -2454 -1963 -782 876 1976
3775 1976 2522 1995 812 -549 -1776 -2343 -2045 -963 528 1766 2482 2111 1035 -278 -1541 -2528 -2070
3792 -2070 -965 207 1585 2365 2198 1088 -56 -1517 -2217 -2109 -1307 157 1501 2307 2163 1334 -26
3809 -26 -1466 -2208 -2179 -1344 -141 1226 2164 2302 1572 167 -1254 -2214 -2127 -1453 -222 924 1971 2267
3827 2267 1694 404 -955 -2264 -2356 -1819 -390 986 2063 2419 1590 562 -802 -1914 -2186 -1817 -821
3844 -821 756 1860 2260 1806 711 -559 -1807 -2233 -1786 -767 585 1732 2201 1756 924 -455 -1594
3861 -1594 -2341 -2037 -963 270 1636 2246 1902 1063 -238 -1494 -2077 -2104 -942 195 1379 1989 2128
3878 2128 991 -49 -1357 -2056 -2104 -1329 92 1195 2207 1874 1325 141 -1190 -1906 -2014 -1382 -43
3895 -43 1150 1859 1985 1371 381 -957 -1865 -2097 -1342 -330 798 1744 2033 1525 590 -892 -1766 -2201 -1563
3914 -1563 -776 650 1845 1976 1623 428 -542 -1557 -2106 -1622 -639 663 1654 2097 1574 740 -449 -1463
3932 -1463 -1993 -1665 -1019 361 1445 1940 1750 868 -312 -1303 -1966 -1914 -843 139 1310 1936 1809 1083
3950 1083 -189 -1394 -1618 -1733 -1016 29 1185 1733 1885 1071 11 -1095 -1786 -1734 -1048 -4 1189
3967 1189 1884 2025 1203 -53 -985 -1806 -1608 -1285 -169 1028 1588 1817 1168 214 -741 -1654 -1826 -1316 -222
3986 -222 941 1774 1818 1326 335 -696 -1560 -1682 -1343 -475 749 1497 1856 1315 459 -611 -1433 -1642 -1459
4005 -1459 -621 452 1270 1661 1423 796 -423 -1480 -1595 -1613 -794 423 1226 1691 1637 657 -424 -1217 -1738
4024 -1738 -1501 -904 296 1206 1603 1622 845 -143 -1045 -1636 -1597 -802 257 1114 1768 1701 888 -79 -859 -1460
4044 -1460 -1496 -1060 84 1070 1531 1515 1033 179 -905 -1535 -1493 -1037 -370 875 1422 1484 1119 229 -823 -1489
4064 -1489 -1633 -983 -374 685 1566 1545 1148 484 -624 -1372 -1555 -1303 -513 530 1300 1629 1170 370 -473
4083 -473 -1260 -1479 -1304 -553 275 1219 1666 1232 455 -464 -1123 -1527 -1272 -580 453 1111 1507 1186 733 -379
4103 -379 -1183 -1543 -1290 -637 251 1063 1477 1615 714 -14 -1089 -1251 -1476 -838 145 839 1471 1442 864 -31
4123 -31 -896 -1472 -1596 -898 -7 812 1533 1277 1045 162 -742 -1251 -1426 -1031 -260 770 1198 1303 992 200
4143 200 -569 -1317 -1540 -1080 -344 474 1213 1538 1070 249 -588 -1189 -1363 -1317 -496 353 1073 1388 1244 524
4163 524 -493 -1090 -1281 -1165 -601 353 1063 1347 1161 444 -246 -1012 -1429 -1351 -613 149 1168 1415 1190 743
4183 743 -198 -941 -1452 -1117 -704 247 823 1281 1351 678 -52 -681 -1158 -1332 -859 -43 832 1247 1423 1094
4203 1094 -12 -700 -1221 -1254 -824 -136 678 1204 1303 1021 352 -468 -1352 -1327 -991 -378 640 1069 1287 1066
4223 1066 330 -441 -1056 -1354 -1063 -482 366 985 1165 1051 552 -326 -1261 -1118 -1209 -406 224 989 1410 1038
4243 1038 590 -217 -897 -1213 -1191 -583 131 673 1338 1335 757 -54 -950 -1385 -1323 -805 70 645 1402 1180 793
4264 793 -77 -694 -1191 -1271 -860 -137 528 1128 1330 920 274 -540 -1197 -1310 -1086 -191 373 1009 1357 894
4284 894 224 -359 -1045 -1284 -972 -451 435 1099 1341 1040 317 -106 -1002 -1163 -1127 -378 406 934 1277 1173
4304 1173 511 -92 -865 -1249 -1200 -695 107 892 1134 1068 663 15 -936 -1219 -1143 -686 -11 711 1160 1205 814
4325 814 -104 -558 -1113 -1080 -862 48 658 1233 1271 914 192 -550 -1135 -1349 -1037 -156 414 1014 1209 832 281
4346 281 -127 -810 -1281 -1127 -281 244 878 1147 1143 457 -178 -759 -1217 -1107 -600 91 769 1178 1151 530 -179
4367 -179 -711 -1059 -1028 -589 59 877 1162 997 533 -78 -628 -1083 -1209 -663 -67 481 1131 1315 775 157
4387 157 -568 -1023 -1089 -1008 -288 543 1142 1117 914 377 -293 -849 -1286 -1050 -285 234 1046 986 911 332 -175 -722
4409 -722 -1125 -992 -450 388 1013 1152 1047 548 -298 -880 -1171 -1026 -645 57 674 1097 1188 604 -161 -894
4429 -894 -931 -1000 -838 -14 696 1210 1147 874 58 -582 -1042 -1077 -823 -174 571 1038 960 726 178 -598 -1086 -1217
4451 -1217 -800 -271 461 960 1067 808 169 -168 -957 -1127 -902 -465 422 869 994 1127 479 -406 -1032 -1261
4471 -1261 -1040 -692 350 533 1282 1138 454 -187 -934 -1044 -1025 -685 170 663 856 1116 712 -42 -570 -1065
4491 -1065 -1147 -713 -68 597 993 1061 637 -45 -502 -1092 -966 -933 -159 708 860 1156 919 7 -745 -1035 -1020
4512 -1020 -852 -308 363 1012 1217 934 310 -452 -855 -1235 -785 -426 306 911 1025 995 311 -351 -702 -1158
4532 -1158 -966 -319 31 768 1140 1190 374 -178 -686 -1136 -877 -504 88 768 1202 874 795 12 -708 -1050
4552 -1050 -1067 -442 97 639 1099 1015 656 47 -696 -1264 -1116 -686 -367 470 1157 1007 727 164 -564 -1109
4572 -1109 -1166 -719 -88 566 937 1096 775 199 -486 -894 -1079 -831 -173 351 1059 1134 845 346 -421 -976
4592 -976 -1008 -965 -355 287 1037 1051 924 367 -377 -929 -996 -927 -490 53 732 1007 1015 627 -309 -837 -1014 -973 -625
4615 -625 256 1039 1054 1017 536 20 -609 -924 -1024 -661 231 751 1086 1055 719 7 -760 -1102 -970 -742 -53
4636 -53 563 947 1109 679 22 -679 -850 -1014 -808 -145 480 1017 1198 807 81 -632 -1052 -1093 -842 -131 470
4657 470 922 1063 922 324 -352 -1035 -1297 -821 -464 453 962 1027 826 345 -333 -995 -1226 -1015 -294 263
4677 263 807 1171 1130 521 -182 -883 -1204 -899 -385 250 747 1158 973 448 -252 -888 -1011 -1016 -537 -52 708
4698 708 1102 994 639 -68 -868 -1084 -1304 -665 -226 725 1044 1093 766 -16 -663 -1145 -1151 -709 -112 654 987
4719 987 1023 850 78 -664 -1098 -1140 -878 -2 556 1021 1101 780 319 -515 -1020 -1209 -842 -137 550 1027 1246
4740 1246 865 276 -337 -960 -1030 -938 -395 350 976 1230 786 307 -325 -809 -1116 -854 -403 121 945 1049
4760 1049 1418 407 -299 -864 -1124 -1173 -544 371 802 1149 1136 536 -189 -743 -1174 -1142 -683 157 774 1161
4780 1161 1180 735 -4 -735 -1186 -1041 -621 99 709 1311 1161 705 32 -687 -1005 -1183 -857 -170 586 1237
4800 1237 1313 796 251 -476 -1192 -1311 -960 -386 538 902 1057 1080 222 -499 -1051 -1263 -911 -47 466 1138
4820 1138 1203 990 359 -414 -905 -1225 -1070 -438 455 1068 1209 1075 367 -230 -1002 -1346 -996 -594 139 837
4840 837 1191 1158 474 -234 -806 -1050 -1085 -585 48 823 1100 1294 671 44 -664 -1207 -1295 -672 98 752 1224
4861 1224 1269 847 89 -793 -1176 -1201 -710 -66 743 1145 1158 855 121 -577 -1111 -1211 -929 -249 615 1257 1316
4882 1316 1008 188 -637 -983 -1346 -984 -202 434 1038 1071 896 282 -543 -946 -1245 -893 -356 282 887 1156
4902 1156 1004 289 -278 -938 -1300 -1119 -586 211 1047 1144 1224 514 -153 -876 -1099 -1187 -656 230 851 1064 1242
4923 1242 628 -23 -604 -1226 -1114 -482 57 669 1232 1233 876 20 -688 -1012 -1281 -805 -67 677 1163 1032
4943 1032 944 -110 -685 -1115 -928 -939 -118 654 1147 1287 1101 407 -573 -915 -1168 -821 -298 331 960 1144
4963 1144 923 246 -506 -854 -1077 -1002 -381 319 1049 1146 886 395 -406 -972 -1196 -867 -373 281 739 1112
4983 1112 901 358 -434 -863 -1198 -1049 -565 -179 686 1154 1031 566 -116 -712 -1052 -939 -574 15 721 1073
5003 1073 1017 623 46 -690 -972 -997 -559 -2 596 930 1089 600 205 -573 -900 -907 -675 15 607 1034 1033 675
5025 675 149 -626 -953 -1211 -857 -280 463 908 1032 609 360 -347 -896 -1034 -855 -276 331 889 1084 618
5045 618 322 -367 -789 -924 -779 -448 328 800 1060 769 372 -315 -687 -961 -876 -311 117 744 1039 912
5065 912 494 -156 -642 -964 -987 -486 -50 654 1090 898 449 -241 -637 -983 -869 -333 -14 598 824 1035
5085 1035 520 -17 -389 -891 -991 -500 -85 473 930 1032 444 -40 -507 -756 -821 -633 -210 187 844 913
5105 913 636 123 -365 -823 -792 -722 -234 240 672 882 354 271 -452 -738 -944 -677 21 322 673 1024 726
5126 726 316 -122 -785 -857 -786 -127 269 457 819 828 262 -264 -766 -877 -696 -471 226 712 771 639 316 -185
5148 -185 -675 -735 -704 -324 167 554 856 639 184 -189 -540 -767 -694 -321 24 494 655 693 253 -39 -448
5169 -448 -612 -729 -342 51 379 803 633 354 -32 -442 -759 -664 -348 20 352 675 743 390 25 -386 -739
5190 -739 -807 -469 -168 331 725 800 563 135 -297 -623 -747 -447 -60 203 600 658 595 80 -355 -553 -664
5211 -664 -472 -164 201 723 830 600 174 -368 -753 -769 -325 -171 250 561 551 554 221 -92 -586 -767 -610
5232 -610 -183 197 549 666 495 275 -190 -482 -649 -850 -218 124 321 619 530 167 -52 -539 -605 -541 -283
5253 -283 -74 383 528 594 368 -46 -537 -636 -649 -321 165 431 719 482 200 -121 -278 -592 -512 -446 31 312
5275 312 587 677 434 -168 -383 -566 -523 -502 55 262 484 430 389 95 -197 -519 -627 -293 -101 216 489 588
5297 588 410 85 -235 -597 -604 -465 -194 282 435 616 494 210 -289 -590 -712 -469 -150 182 545 552 491 172
5319 172 -56 -417 -693 -408 -331 104 547 522 266 390 -101 -344 -455 -566 -328 0 425 499 354 211 -69
5340 -69 -367 -408 -491 -324 83 320 692 601 300 -19 -317 -458 -447 -387 -28 372 577 499 346 98 -194 -403
5362 -403 -559 -320 31 175 538 518 456 230 -299 -461 -441 -313 -91 209 567 515 392 172 -343 -412 -351 -366
5384 -366 -135 74 359 532 202 286 -28 -430 -369 -395 -222 75 98 302 385 222 7 -257 -524 -353 -259 81
5406 81 219 388 332 73 99 -296 -431 -439 -318 -38 257 482 405 295 -82 -266 -373 -294 -324 193 194 318 429
5429 429 259 4 -104 -352 -439 -366 -239 177 250 323 198 104 -130 -260 -377 -350 -47 67 339 337 333 198 -217
5452 -217 -320 -298 -266 -184 72 267 278 196 85 8 -270 -96 -257 -86 -24 317 375 265 277 -67 -179 -254 -372
5475 -372 -127 -98 120 394 228 173 -159 -94 -268 -308 -306 -279 135 253 291 333 -145 -135 -434 -160 -265 -60 199
5498 199 176 382 132 38 -170 -195 -156 -324 30 186 142 172 60 -36 -125 -248 -177 -163 -108 76 133 248 70 4
5522 4 7 -99 -225 -154 -142 78 121 98 145 52 -69 -61 -140 -122 -170 -11 -14 116 97 296 39 53 -207 -187 -250 -13 42
5549 42 96 119 237 64 -122 -82 -133 -139 -109 -22 126 25 -128 84 -25 -27 -57 -106 57 -42 -15 96 18 80 195 68
5575 68 -21 -7 61 -64 86 100 174 60 1 -121 -108 -174 -74 -82 36 17 146 141 35 220 -98 -147 -174 -63 -147 13
5601 13 6 -51 152 31 -135 -101 -106 -123 -188 -123 20 130 111 40 1 -74 -21 -92 83 -33 -236 127 177 51 30 -8
5627 -8 -21 27 -96 -203 -15 52 204 194 172 -30 -102 -218 -9 -119 72 68 48 169 213 10 -139 -94 -233 -110
5651 -110 -34 94 73 131 290 68 -129 -331 -328 -219 64 -76 177 87 22 173 -19 -238 -116 -212 -70 -14 294
5674 294 159 168 141 -157 33 -165 -101 -197 187 153 193 217 235 77 -84 -342 -156 -181 -7 0 103 130 212 -5 -149
5699 -149 -164 -177 -63 -139 303 270 330 317 -110 -61 -247 -349 -192 -136 3 85 212 273 -99 22 -61 -329 -322 37
5723 37 94 309 383 232 192 -142 -312 -302 -295 -234 53 318 208 100 56 -283 -333 -325 -153 -77 197 244 353 171 54
5748 54 -116 -33 -115 -299 -274 -89 187 377 443 254 -132 -182 -144 -116 -169 -79 116 100 246 -18 36 -26 -288 -445
5772 -445 -210 54 522 262 357 142 22 -96 -321 -334 -235 -27 137 218 378 338 -73 -156 -172 -339 -288 -98 -4
5795 -4 130 210 274 71 -239 -486 -352 -287 -88 180 346 574 259 -67 -144 -367 -397 -285 -133 -49 275 328 329 52
5819 52 -46 -245 -239 -518 -171 27 432 526 438 142 -24 -442 -426 -308 -133 77 283 430 446 327 -81 -189 -305
5842 -305 -429 -379 43 199 552 482 161 -95 -359 -316 -581 -225 -34 253 333 603 414 -3 -108 -419 -618
5863 -618 -416 -14 197 495 539 271 99 -249 -427 -570 -142 -126 324 410 398 399 -48 -259 -283 -597 -416 -61
5885 -61 201 406 501 475 149 -145 -404 -639 -460 -138 272 526 494 364 37 -52 -308 -355 -536 -142 247 393
5907 393 329 439 414 -103 -416 -422 -366 -169 68 438 713 322 236 -166 -350 -478 -518 -480 -2 368 456 426 278
5930 278 24 -500 -632 -464 -300 121 403 537 587 276 64 -432 -571 -679 -275 -147 516 627 767 341
5950 341 42 -406 -512 -660 -318 -77 379 563 696 338 -30 -329 -588 -660 -382 21 76 595 707 416 100
5971 100 -239 -591 -788 -725 -283 189 593 664 531 89 -322 -676 -661 -674 -78 252 531 805 626 253 -315
5992 -315 -804 -733 -679 -269 113 583 684 632 257 -185 -597 -662 -749 -379 46 746 716 768 285 -97 -629 -390
6014 -390 -633 -384 225 592 928 693 450 -9 -424 -600 -681 -391 -3 386 639 709 475 118 -507 -768 -793
6035 -793 -546 -272 367 691 798 466 14 -426 -810 -698 -443 -24 354 633 797 490 -16 -273 -955 -685
6055 -685 -586 -131 311 610 1005 662 312 -395 -695 -770 -644 -116 302 608 815 916 251 -172 -708 -792 -661
6076 -661 -306 139 642 859 574 342 -114 -792 -711 -692 -486 412 497 788 716 365 -327 -604 -936 -892 -341 84
6098 84 533 930 684 445 -129 -599 -887 -787 -316 -2 643 865 807 549 -90 -599 -713 -770 -648 -164 472
6119 472 918 945 563 130 -472 -942 -915 -708 -196 474 656 708 724 91 -487 -686 -1008 -443 -119 453 652
6140 652 861 566 167 -200 -742 -835 -867 -235 273 666 920 712 56 -370 -750 -890 -747 -270 222 852 893
6161 893 826 236 -182 -484 -963 -866 -348 202 639 851 764 535 -67 -562 -806 -738 -440 187 615 915 860 434
6183 434 -82 -676 -738 -748 -346 33 669 759 756 737 65 -403 -781 -845 -522 30 515 907 873 546 71 -571 -751
6206 -751 -865 -599 -184 510 858 767 469 252 -383 -835 -776 -657 -108 593 775 798 731 156 -284 -686 -909
6227 -909 -688 -118 169 752 1018 724 267 -291 -509 -1019 -657 -219 420 813 819 832 236 -274 -843 -982 -681
6248 -681 -360 30 739 947 673 445 -361 -818 -897 -800 -214 224 619 937 790 348 -147 -568 -872 -845 -405
6269 -405 12 693 718 808 432 45 -727 -917 -775 -381 36 604 970 1011 554 -167 -623 -768 -846 -442 -27
6290 -27 537 925 954 637 130 -529 -795 -928 -567 -65 436 913 672 581 104 -445 -619 -874 -741 -272 341
6311 341 843 906 677 254 -392 -904 -970 -667 -156 452 719 854 789 367 -280 -779 -849 -703 -244 271 934
6332 934 838 869 312 -329 -630 -961 -888 -278 320 503 967 807 420 -219 -720 -862 -615 -454 282 731 822
6353 822 584 248 1 -564 -971 -825 -266 41 511 897 718 436 4 -538 -709 -956 -436 -77 603 912
6373 912 933 483 48 -499 -785 -866 -536 -6 343 844 823 449 -31 -417 -850 -936 -573 60 469 956 1027 519
6395 519 -115 -405 -797 -813 -559 -191 381 920 978 612 206 -553 -841 -719 -648 -153 152 711 1049 726 263
6416 263 -334 -706 -958 -686 -268 365 738 928 794 463 -312 -694 -948 -814 -323 191 780 1077 811 545
6436 545 -324 -756 -976 -917 -283 348 779 928 852 385 -23 -587 -895 -902 -469 147 608 934 887 481 -15 -652
6458 -652 -756 -951 -523 132 587 884 768 451 221 -488 -844 -919 -682 -26 470 813 975 633 61 -494
6478 -494 -879 -1013 -625 -168 418 900 812 688 98 -309 -894 -1155 -687 -439 398 757 963 795 341 -483
6498 -483 -828 -798 -710 -64 517 739 1008 751 68 -331 -771 -1039 -684 -223 236 809 990 832 230 -417 -720
6519 -720 -987 -737 -439 151 885 882 720 406 -13 -794 -987 -860 -405 101 855 910 908 448 -241 -747 -1112 -836
6541 -836 -644 7 602 1016 725 568 -22 -570 -834 -839 -446 -37 607 787 912 543 71 -518 -890 -913 -689
6562 -689 -120 666 844 884 608 -6 -493 -764 -987 -647 -70 491 886 958 670 139 -465 -825 -830 -730 -300
6583 -300 312 788 963 706 209 -381 -722 -885 -695 -203 417 765 872 906 391 -165 -768 -969 -816 -359
6603 -359 385 695 1087 810 295 -113 -802 -811 -659 -283 187 680 1010 765 442 -264 -573 -824 -760 -431 87
6624 87 537 726 907 420 76 -723 -878 -911 -313 11 548 902 855 569 46 -540 -850 -811 -507 109 534
6645 534 795 938 443 77 -417 -834 -983 -630 -73 529 947 940 679 124 -352 -794 -1121 -658 -7 498 668
6666 668 952 730 189 -525 -640 -880 -562 -269 435 811 820 709 259 -333 -788 -1040 -550 -306 322 716 736
6687 736 847 80 -72 -595 -848 -736 -537 282 697 973 863 502 -258 -709 -917 -964 -353 340 528 846
6707 846 781 401 -183 -650 -726 -656 -401 14 581 905 883 638 -56 -671 -922 -782 -570 -9 619 807 836 516
6729 516 -4 -382 -860 -649 -545 6 543 758 921 581 -73 -491 -823 -910 -565 -131 453 747 772 652 51
6750 51 -480 -483 -693 -810 -149 469 770 900 504 140 -418 -760 -621 -669 -156 312 734 936 724 224 -367
6771 -367 -803 -859 -725 -191 226 628 816 754 255 -325 -568 -807 -620 -252 445 630 924 610 398 -109 -536
6792 -536 -731 -614 -369 157 542 731 646 472 -123 -512 -763 -817 -442 223 313 696 837 283 -105 -590 -729
6813 -729 -668 -590 -3 587 685 793 399 57 -469 -860 -839 -390 -176 577 711 972 461 -28 -237 -734 -666 -547
6835 -547 -102 386 557 724 656 78 -393 -868 -668 -593 -178 388 614 797 543 230 -358 -680 -623 -510 -27
6856 -27 289 602 751 550 307 -203 -553 -897 -571 -211 94 705 721 543 182 -225 -652 -703 -503 -358 175
6877 175 553 661 603 336 -167 -751 -821 -634 -309 136 405 580 712 285 -67 -367 -740 -720 -462 72 372
6898 372 729 799 459 -152 -460 -770 -830 -441 13 506 697 798 585 -95 -480 -695 -760 -510 3 476 594
6919 594 665 422 65 -465 -670 -860 -519 -49 485 662 769 536 62 -366 -620 -701 -443 -146 302 675 559
6940 559 552 301 -238 -506 -704 -522 -298 315 703 736 694 312 -227 -586 -692 -444 -288 244 520 695 635 172
6962 172 -336 -426 -858 -656 -314 81 699 709 536 145 -154 -497 -625 -659 -308 74 508 715 653 365 -84
6983 -84 -381 -658 -771 -445 -79 462 624 618 452 78 -450 -663 -730 -463 44 328 575 644 376 -32 -333 -522
7005 -522 -723 -562 -177 389 623 826 563 62 -208 -522 -630 -483 -156 211 563 716 556 145 -263 -708
7025 -708 -752 -655 -307 229 435 784 479 243 -277 -613 -596 -548 -331 28 449 723 542 48 -233 -718 -665 -663
7047 -663 -330 78 383 753 517 174 -177 -231 -612 -616 -238 -52 461 504 601 236 -192 -329 -682 -536 -367 -54
7069 -54 476 689 580 320 -129 -465 -490 -605 -391 90 371 664 679 398 -170 -282 -728 -610 -463 -157 245
7090 245 746 583 359 25 -353 -473 -706 -584 -81 296 584 742 293 98 -257 -692 -691 -391 -122 280 574
7111 574 547 422 214 -70 -346 -688 -449 -59 130 712 704 510 286 -247 -566 -592 -494 -181 89 395 695 470
7133 470 300 -199 -561 -623 -495 -204 87 247 603 658 212 -64 -152 -625 -510 -510 73 428 490 546 354 -113
7155 -113 -316 -542 -438 -305 -73 356 545 585 401 87 -340 -399 -570 -349 67 235 539 389 443 -52 -372
7176 -372 -506 -545 -323 -40 289 557 448 572 197 -234 -382 -613 -413 -86 261 563 391 293 143 -108 -458
7197 -458 -478 -409 -79 163 308 351 446 170 -147 -498 -404 -594 -226 119 465 623 516 188 -146 -424 -605 -256
7219 -256 -376 204 364 570 419 288 -67 -302 -605 -373 -349 52 305 359 334 244 26 -31 -604 -513 -232 -73
7241 -73 429 565 681 324 162 -336 -556 -527 -437 -48 128 459 516 229 7 -134 -437 -364 -403 -142 201 419
7263 419 473 214 -27 -221 -570 -542 -237 -248 313 431 367 438 -4 -179 -253 -476 -276 -160 81 375 404 465 105
7286 105 -99 -321 -628 -518 -149 332 422 376 339 265 -65 -407 -582 -276 -154 82 251 494 317 13 -239
7307 -239 -450 -581 -299 -242 -62 313 447 372 224 -180 -291 -356 -313 -295 180 340 437 396 90 -218 -296 -295 -521
7330 -521 -315 -185 265 306 283 242 35 -304 -276 -358 -156 4 297 440 289 259 -74 -221 -393 -377 -367 -21 305
7353 305 399 361 354 -1 -176 -375 -436 -274 -199 173 459 250 404 -6 -179 -487 -361 -307 20 251 353 490
7375 490 346 44 -232 -274 -355 -339 -91 101 416 403 391 293 -295 -229 -166 -279 -155 76 363 394 222 308 38
7398 38 -331 -367 -323 -108 146 303 395 409 135 -195 -235 -375 -323 -81 173 249 561 232 203 -160 -321 -358 -243
7421 -243 -197 -116 237 462 364 169 -150 -270 -239 -367 -177 45 183 452 405 162 -39 -238 -256 -330 -305 54 298
7444 298 371 493 472 3 -117 -414 -224 -322 -10 74 391 500 368 48 -253 -361 -395 -257 -27 264 214 285
7466 285 250 204 -235 -399 -280 -400 -65 239 233 343 315 115 -95 -306 -279 -434 15 186 188 335 74 187 34
7489 34 -396 -408 -266 -183 111 368 442 445 56 -62 -321 -529 -315 -55 66 304 246 359 337 66 -167 -505 -423
7512 -423 -217 30 410 299 468 147 99 -158 -545 -285 -130 82 210 264 285 191 55 -207 -393 -387 -102 -100 45
7535 45 267 431 219 -127 -242 -131 -302 -201 -107 103 297 315 405 3 -171 -349 -498 -190 -209 248 329 373
7557 373 232 70 -108 -580 -383 -295 -163 13 385 350 253 134 -87 -197 -290 -276 -205 30 108 336 315 16 -85
7580 -85 -317 -397 -223 -90 160 259 358 394 190 -4 -310 -251 -336 -185 54 231 290 362 226 -119 -164 -485 -349
7603 -349 -116 -58 171 252 363 224 29 -245 -151 -355 -170 -44 56 400 363 57 74 -218 -482 -158 -245 26
7625 26 329 364 415 71 193 -15 -303 -402 -385 -73 61 365 375 282 -41 -71 -255 -320 -194 -40 68 249 520
7648 520 285 56 -173 -356 -388 -183 -23 112 279 256 305 22 -113 -277 -197 -322 -245 83 203 460 311 41
7670 41 -85 -140 -286 -288 -177 148 194 418 300 5 -35 -74 -365 -455 -170 -89 391 244 310 214 -96 -353 -295 -323
7694 -323 81 86 201 255 449 194 -91 -159 -339 -417 -232 12 293 310 291 225 178 -185 -363 -264 -215 -22 86 435
7718 435 372 128 60 -76 -278 -236 -252 93 111 337 172 392 -36 -275 -364 -374 -220 -68 77 526 467 167 18
7741 18 -144 -300 -309 -365 -282 109 321 408 359 93 55 -277 -434 -176 2 -26 361 437 426 271 -240 -337 -334 -356 -229
7766 -229 133 483 320 291 206 -97 -476 -264 -218 -214 -41 187 207 142 312 71 -224 -377 -265 32 49 179 356
7789 356 361 388 90 -321 -433 -237 -117 -46 191 343 424 290 57 -139 -348 -224 -188 -73 294 336 451 84
7811 84 -36 -208 -315 -286 -342 -88 206 357 308 328 97 -77 -333 -372 -267 -25 239 285 430 375 -31 -79 -330
7834 -330 -408 -251 -221 81 440 329 323 56 -131 -316 -310 -315 -138 98 171 311 353 162 -178 -438 -548 -355 -99
7857 -99 105 248 305 499 132 7 -177 -423 -409 -97 84 287 358 233 227 -106 -271 -381 -435 -317 -82 363
7879 363 383 369 224 32 -83 -218 -344 -275 -86 216 334 260 394 84 -53 -401 -272 -174 -93 296 341 303 240
7902 240 142 -289 -536 -325 -195 46 154 415 452 311 4 -103 -404 -550 -253 5 165 258 413 240 -30
7923 -30 -80 -341 -520 -394 -141 214 299 257 443 91 -83 -371 -410 -257 -133 8 278 427 262 74 -195 -258
7945 -258 -406 -428 -191 165 483 352 492 126 -64 -281 -502 -355 -220 87 423 368 466 245 14 -177 -556
7966 -556 -284 -195 85 377 496 419 316 -23 -88 -356 -468 -128 -35 291 477 430 278 -59 -240 -424 -249 -245
7988 -245 61 385 460 316 215 -25 -65 -483 -580 -342 -17 186 340 581 298 92 -51 -373 -525 -405 -116
8009 -116 182 357 676 364 82 -61 -420 -375 -448 -153 124 405 391 263 319 -118 -607 -570 -439 -196 141 347
8031 347 355 464 217 -149 -417 -490 -451 -365 17 385 451 599 148 -66 -265 -468 -421 -275 81 349 466 510 202
8054 202 35 -212 -608 -451 -425 -109 310 618 296 306 73 -319 -670 -636 -370 -78 261 437 486 445 105 -224
8076 -224 -524 -354 -367 -184 328 480 454 552 91 -396 -301 -513 -357 -214 86 581 652 549 97 -64 -358 -640
8098 -640 -309 -337 29 454 460 385 199 -118 -370 -482 -531 -100 264 286 518 380 348 -119 -350 -449 -524 -74 60
8121 60 344 553 288 290 16 -235 -521 -510 -167 -115 282 613 468 316 -157 -338 -617 -597 -245 -49 224 367
8143 367 579 421 -7 -151 -484 -458 -292 47 361 427 423 317 -35 -201 -486 -531 -336 -221 156 457 464 499 275
8166 275 -393 -629 -604 -445 -40 216 477 529 459 25 -301 -571 -497 -399 -104 347 366 509 362 227 -227 -561
8188 -561 -386 -501 -66
8191f6
$$ Imaginary data points
##PAGE= N=2
##DATA TABLE= (X++(I..I)), XYDATA
0 0 0 0 0 0 0 0 0 0 0 -8 1 -8 8 -9 16 -16 24 -26 33 -41 45 -58 67 -78 94 -107 127 -143 166 -193 218 -252 283
33 283 -320 362 -406 459 -513 574 -642 711 -792 878 -972 1078 -1187 1314 -1446 1594 -1757
50 -1757 1933 -2134 2350 -2595 2868 -3173 3526 -3927 4395 -4947 5608 -6425 7453 -8799
64 -8799 10645 -13343 17693 -25874 46795 -224201 -362936 18026 218864 421679 458943
75 458943 350611 59805 -209012 -424891 -474050 -343890 -60245 196208 384536 454073
85 454073 365868 97795 -192037 -387475 -436773 -348388 -118524 155414 368941 443255 358703
96 358703 124173 -150279 -350285 -418992 -355056 -152943 121592 345563 423418 350896 153910
107 153910 -102822 -319975 -412159 -357839 -171310 86515 309454 404200 352787 180152 -62841
118 -62841 -287438 -400055 -361241 -189463 55523 274732 379950 351337 207572 -23075
128 -23075 -259895 -386902 -355038 -202407 15111 234259 367223 356220 218369 4179
138 4179 -220317 -362856 -356218 -219311 -16150 196233 347725 361989 230787 22102 -184486
149 -184486 -327289 -353373 -245084 -44185 171750 324061 351411 243302 52125 -150661
159 -150661 -303437 -349266 -258809 -66314 144218 295175 338525 258420 82184 -123833 -284320
170 -284320 -339076 -263105 -88559 111890 267218 328622 269744 105951 -98233 -261914 -325048
181 -325048 -266452 -111494 80102 242363 319486 275762 123816 -71595 -234144 -309651 -273393
192 -273393 -134030 55444 220887 303768 275562 142772 -43404 -208841 -295011 -274981 -153303
203 -153303 28956 198948 289837 272807 157555 -16081 -183498 -280994 -274582 -166985 4160
214 4160 174050 274821 271165 170381 8278 -158415 -265968 -272378 -177730 -18246 148112
225 148112 257740 269388 182053 29328 -134749 -249074 -268176 -186993 -39014 122890 239864
236 239864 266228 191698 47515 -112574 -230315 -261838 -195519 -57926 100793 222564 259393
247 259393 198150 65114 -89789 -211785 -255560 -202705 -73932 80770 204109 250483 203641
258 203641 81821 -68561 -194031 -247928 -207103 -88283 60834 184979 241209 208331 97170
269 97170 -49901 -176608 -237245 -209529 -103021 40620 167415 231933 210567 110002 -31574
280 -31574 -158958 -226340 -210457 -116488 21596 150637 221890 210318 121498 -12599 -141014
291 -141014 -215778 -210826 -127680 3400 132677 211178 209863 131284 5135 -123101 -205031
302 -205031 -209836 -136608 -12927 114886 199011 208463 140621 21211 -105784 -193167 -207894
313 -207894 -144894 -28224 97664 186460 205674 148382 35964 -89386 -180817 -204413 -151268
324 -151268 -42553 81237 174238 202008 154544 49456 -73488 -168022 -199828 -156995 -56097
335 -56097 65219 161952 197650 159296 61591 -57719 -155209 -194798 -161587 -68311 50277
346 50277 149113 191941 163063 73681 -42363 -142463 -189191 -165064 -79593 35146 136105
357 136105 185740 166396 85113 -27602 -129356 -182515 -167368 -89961 20279 122882 179040
368 179040 168364 95047 -13450 -116498 -175552 -168668 -99269 6599 109692 171780 169272
379 169272 103941 -36 -103368 -167726 -169236 -107850 -6472 96778 163847 169288 111612
390 111612 12643 -90481 -159387 -168833 -115278 -18776 84369 155648 168453 118081 24645 -77885
402 -77885 -150897 -167838 -121626 -30597 71847 146884 166534 124217 36026 -65157 -141972 -165705
414 -165705 -127522 -41749 59444 137688 164219 129771 47141 -52570 -132874 -162938 -132244 -52190
426 -52190 46786 127753 160950 134298 57567 -40636 -123103 -159495 -136224 -62237 34376 117564
438 117564 157204 138126 67457 -28255 -113083 -155074 -139245 -71772 21951 107389 152875 141003
450 141003 76437 -16275 -102217 -149968 -141560 -80740 9856 96605 147499 142870 85147 -4237
462 -4237 -91420 -144069 -143192 -89221 -1854 86052 141601 143650 92197 7446 -80020 -137790 -144272
475 -144272 -96296 -12589 75108 134598 143844 98953 17997 -69055 -130644 -143756 -102747 -23439
487 -23439 64118 127394 142900 105262 28556 -58435 -123492 -142201 -108016 -33739 52375 119406
499 119406 141697 110726 38396 -47382 -115123 -140213 -113379 -43817 41793 111263 138963 114757
511 114757 48462 -35803 -106800 -137538 -116841 -52683 30377 102130 135591 118483 57176 -24910
523 -24910 -97860 -134151 -120076 -61202 19950 92826 131286 121202 66190 -13903 -88850 -129526
535 -129526 -121951 -69537 8499 83716 127190 122727 73143 -3311 -78923 -124607 -123075 -76303
547 -76303 -2017 73653 121934 124045 79799 6008 -69019 -118315 -123474 -82976 -11880 63809
559 63809 115812 123975 85697 15728 -59198 -112047 -123195 -88539 -21074 54184 108971 122853
571 122853 90729 25033 -48978 -104698 -122116 -93819 -29800 44773 101540 120518 95255 34511
583 34511 -39392 -98308 -120077 -96992 -37971 34416 93944 118400 98822 42141 -29815 -90392
595 -90392 -117098 -100117 -45718 25267 86116 115160 101387 49648 -20379 -82304 -113288 -102324
607 -102324 -53031 15811 78560 111566 102802 56062 -11117 -74259 -109273 -103495 -59418 6758
619 6758 70007 107154 104052 62348 -2548 -65822 -104612 -104048 -65008 -2029 61708 102292 104404
632 104404 67373 6025 -57372 -99512 -104035 -69819 -10026 53053 96750 104221 72157 13805
644 13805 -49222 -93856 -103109 -74142 -17818 44758 91021 102933 76126 21502 -40986 -87883
656 -87883 -101716 -77643 -24979 36761 85000 100839 79192 28078 -32556 -81445 -99928 -80713
668 -80713 -31594 29164 78443 98443 81386 34430 -24852 -74995 -97106 -82865 -37530 21385
680 21385 72074 95483 83338 40397 -17773 -68699 -93896 -84060 -43267 13747 65278 92067
692 92067 84904 45611 -10051 -61915 -90379 -84909 -48218 6449 58543 88606 85307 50549 -3262
705 -3262 -55257 -86456 -85108 -52572 -379 51923 84444 85377 54435 3429 -48557 -82256 -85191
718 -85191 -56137 -6733 45228 80006 84821 57966 9845 -41772 -77881 -84474 -59614 -12639
730 -12639 38665 75534 84009 61154 15632 -35275 -73118 -83410 -62546 -18401 32097 70548
742 70548 82615 63773 21124 -29015 -68176 -81865 -64849 -23563 25981 65617 80842 65695
754 65695 25998 -22884 -63050 -79625 -66387 -28539 20243 60797 78798 67253 30702 -16949
766 -16949 -58274 -77577 -67812 -32857 14417 55876 76347 68210 34916 -11724 -53467 -75274
778 -75274 -68692 -36753 8713 50829 73535 69039 38616 -5907 -48191 -72267 -69335 -40302 3110
791 3110 45541 70834 69358 42228 -375 -42803 -69224 -69430 -43990 -2247 40121 67482 69451
804 69451 45390 4942 -37625 -66000 -69416 -47020 -7340 34840 64097 69337 48515 9914
816 9914 -32184 -62378 -69088 -49788 -12289 29514 60525 68596 50898 14287 -26997 -58446 -68197
829 -68197 -52029 -16675 24539 56766 67669 53270 18765 -22117 -54838 -66918 -53945 -21016
841 -21016 19759 52953 66363 54897 22867 -17454 -50985 -65604 -55540 -24732 14837 48895
853 48895 64671 56319 26899 -12439 -46980 -63682 -56966 -28690 9927 44783 62855 57320 30647
866 30647 -7409 -42827 -61887 -57782 -32432 5222 40643 60774 58207 34064 -2887 -38623
878 -38623 -59553 -58445 -35596 394 36260 58386 58730 37126 1726 -33808 -57027 -58788 -38616
891 -38616 -4277 31616 55716 58890 39986 6414 -29474 -54397 -58852 -41447 -8697 27144
903 27144 52746 58774 42568 10678 -24875 -51157 -58538 -43956 -12994 22571 49783 58295 44954
916 44954 14996 -20383 -48024 -57835 -45927 -17195 18044 46452 57171 46866 19118 -15685
928 -15685 -44563 -56849 -47846 -21044 13240 42888 56098 48636 22825 -11173 -41064 -55580
940 -55580 -49287 -24703 9117 39118 54750 49777 26181 -6769 -37251 -53932 -50529 -28186 4573
953 4573 35327 52858 50735 29830 -2250 -33383 -51943 -51080 -31169 164 31356 50853 51241
966 51241 32648 2039 -29387 -49841 -51497 -33930 -4127 27373 48605 51594 35363 6338
978 6338 -25241 -47454 -51429 -36844 -8150 23143 45814 51458 37810 10306 -20955 -44448 -51073
991 -51073 -38988 -12399 18722 42898 50984 40052 14199 -16598 -41357 -50453 -40980 -15956 14612
1004 14612 39818 50081 41868 17906 -12683 -38032 -49442 -42413 -19581 10608 36489 49058
1016 49058 43070 21149 -8469 -34803 -48293 -43806 -22874 6310 33160 47335 44288 24307
1028 24307 -4334 -31109 -46692 -44321 -25678 2372 29413 45580 44650 27171 -226 -27788
1040 -27788 -44689 -45082 -28414 -1736 25617 43421 45046 29741 3578 -24068 -42461 -45077 -30867
1053 -30867 -5390 21860 41247 45198 32149 7249 -19950 -40082 -44646 -32922 -8948 18052
1065 18052 38537 44686 33949 10856 -16117 -37164 -44438 -34888 -12428 14444 35639 43763 35588
1078 35588 13929 -12268 -34365 -43513 -36301 -15522 10569 32884 42784 36625 17253 -8446 -31237
1091 -31237 -42030 -37247 -18610 6799 29569 41234 37783 20007 -4856 -28193 -40462 -37834
1103 -37834 -21378 3248 26408 39723 38193 22570 -1574 -24980 -38944 -38440 -23591 -398
1115 -398 23304 37951 38110 24757 1904 -21575 -36897 -38209 -25621 -3369 19945 35767 38085
1128 38085 26395 5077 -18412 -34951 -38064 -27156 -6437 16685 33759 37948 28053 8050
1140 8050 -15144 -32737 -37809 -28607 -9174 13522 31267 37388 29220 10521 -11865 -29962 -36870
1153 -36870 -29819 -11782 10208 28541 36624 30533 13078 -8868 -27352 -35808 -30962 -14308 7272
1166 7272 26315 35293 31198 15355 -5974 -24866 -34707 -31654 -16445 4689 23731 33925 31620
1179 31620 17486 -3083 -22139 -33276 -31818 -18534 1592 21115 32360 31941 19578 -237
1191 -237 -19713 -31802 -31727 -20292 -1319 18321 30916 31936 21158 2459 -17137 -29999 -31883
1204 -31883 -21785 -3799 15938 29275 31721 22434 4854 -14423 -28386 -31649 -22896 -5940 13102
1217 13102 27544 31189 23417 7114 -11801 -26456 -31149 -24146 -8046 10443 25579 30788 24422
1230 24422 9205 -9318 -24488 -30363 -25001 -10136 8197 23431 30003 25145 10984 -7132 -22599
1243 -22599 -29691 -25420 -11991 6093 21568 29112 25975 12775 -4799 -20604 -28625 -26179 -13533
1256 -13533 3873 19618 28109 26125 14431 -2625 -18515 -27619 -26388 -15153 1601 17635 27123
1269 27123 26320 15740 -535 -16757 -26374 -26535 -16625 -233 15665 25738 26366 17223 1365 -14938
1283 -14938 -25303 -26332 -17661 -2275 13839 24542 26419 18306 3503 -12680 -24027 -26144 -18788
1296 -18788 -4237 11754 23227 26141 19302 5241 -10539 -22598 -26016 -19606 -6293 9494 21836
1309 21836 25849 20160 7142 -8576 -21147 -25762 -20488 -8040 7738 20361 25430 20935 8720
1322 8720 -6758 -19744 -25093 -21168 -9420 5616 18838 24988 21774 10109 -5085 -18056 -24608
1335 -24608 -21844 -10806 3979 17250 24099 21984 11713 -2923 -16397 -23916 -22253 -12191 2077
1348 2077 15551 23275 22469 13064 -1200 -14866 -23106 -22573 -13805 312 14053 22565 22602 14375 628
1363 628 -13079 -21981 -22736 -14824 -1766 12405 21725 22826 15569 2318 -11525 -21182 -22818 -16026
1377 -16026 -3556 10508 20577 22594 16465 4161 -9600 -19988 -22602 -17004 -5066 8822 19473
1390 19473 22653 17704 6018 -7977 -18711 -22517 -17987 -6660 6942 18030 22345 18378 7603
1403 7603 -6134 -17537 -22268 -18812 -8361 5068 16842 21964 19202 9127 -4236 -15857 -21761
1416 -21761 -19436 -9842 3371 15280 21536 19621 10567 -2541 -14516 -21205 -20013 -11191 1663
1429 1663 13660 20888 20081 12021 -731 -12756 -20373 -20357 -12647 -156 12090 20044 20394 13210 1242
1444 1242 -11520 -19644 -20362 -13758 -1947 10588 19106 20510 14285 2672 -9734 -18677 -20585 -14722
1458 -14722 -3648 8909 18091 20589 15358 4365 -8064 -17492 -20402 -15657 -5334 7221 17054
1471 17054 20559 16428 6068 -6211 -16384 -20133 -16629 -6897 5495 15579 20014 16826 7679
1484 7679 -4588 -15057 -19888 -17164 -8448 3756 14478 19732 17594 9078 -2724 -13604 -19362
1497 -19362 -17912 -9700 1998 12838 18972 17978 10288 -1075 -12051 -18603 -18319 -10947 367 11425
1511 11425 18421 18383 11607 630 -10679 -17937 -18340 -12231 -1342 9875 17485 18476 12685 2279
1525 2279 -9172 -17107 -18580 -13300 -3028 8294 16279 18376 13665 3838 -7492 -16103 -18467 -14096
1539 -14096 -4603 6750 15278 18149 14466 5348 -5915 -14868 -18194 -14787 -6068 4991 14316 18138
1553 18138 15071 6710 -4426 -13537 -17799 -15518 -7258 3568 12843 17682 15796 7718 -2634 -12139
1567 -12139 -17566 -15948 -8477 1967 11673 17111 16119 8955 -1265 -11002 -16850 -16134 -9592 328 10268
1582 10268 16350 16362 9986 236 -9610 -16096 -16395 -10815 -1163 8877 15505 16350 11176 1854 -8374
1597 -8374 -14911 -16405 -11575 -2621 7500 14677 16321 11966 3012 -6789 -14155 -16345 -12354 -3592 6151
1612 6151 13600 16239 12635 4354 -5482 -13167 -16003 -12882 -4993 4566 12597 15829 13124 5563 -3885
1627 -3885 -12154 -15677 -13307 -6283 3187 11642 15631 13770 6728 -2558 -10965 -15180 -13747 -7077 2037
1642 2037 10309 14940 13834 7604 -1256 -9817 -14563 -13977 -8172 575 9263 14241 14036 8458 -78
1657 -78 -8477 -13910 -14021 -8934 -410 8105 13592 14128 9310 1022 -7471 -13204 -14010 -9745 -1705 6786
1673 6786 12845 13984 10029 2283 -6258 -12484 -14074 -10199 -2813 5681 12061 13914 10694 3234 -5239
1688 -5239 -11576 -13600 -10633 -3871 4656 11307 13632 10979 4057 -4197 -10708 -13487 -11192 -4619 3476
1703 3476 10428 13229 11317 5298 -2967 -10009 -13082 -11405 -5534 2461 9374 12847 11453 6046 -1833
1718 -1833 -9258 -12742 -11548 -6107 1379 8489 12574 11680 6672 -814 -7953 -12443 -11895 -6836 537
1733 537 7653 11961 11809 7121 33 -7335 -11752 -11833 -7573 -510 6658 11699 12017 7936 955 -6275
1749 -6275 -11184 -11897 -8009 -1230 5919 10907 11888 8307 1778 -5600 -10689 -11944 -8660 -2240 5038
1764 5038 10237 11808 8825 2522 -4567 -9992 -11771 -9037 -3088 4019 9484 11569 9298 3160 -3682
1779 -3682 -9403 -11542 -9432 -3648 3238 9136 11542 9547 4253 -2986 -8917 -11261 -9536 -4618 2399
1794 2399 8481 11249 9890 4842 -2025 -8057 -11011 -9966 -5076 1817 7602 10845 9987 5552 -1220
1809 -1220 -7465 -10629 -10012 -5739 799 6985 10715 10099 6057 -480 -6605 -10374 -10078 -6246 27 6271
1825 6271 10147 10285 6405 343 -5850 -9956 -10275 -6674 -852 5636 9728 10381 7056 1216 -4867 -9481
1841 -9481 -10304 -7334 -1540 4746 9210 10229 7536 1891 -4473 -8981 -10418 -7751 -2140 3954 8649
1856 8649 10365 7962 2645 -3726 -8622 -10141 -8007 -2887 3344 8346 10034 8270 3076 -2988 -8032
1871 -8032 -10001 -8368 -3623 2465 7666 9864 8569 4030 -2194 -7357 -9941 -8824 -4238 1667 6991
1886 6991 9858 8775 4570 -1393 -6869 -9660 -8907 -4831 912 6643 9553 9085 5196 -604 -6298
1901 -6298 -9356 -9102 -5574 41 5738 9335 9090 5720 154 -5410 -8916 -9224 -6099 -613 5096 8917
1917 8917 9365 6277 925 -4492 -8687 -9371 -6366 -1367 4337 8530 9452 6768 1697 -3919 -8205 -9295
1933 -9295 -7122 -2080 3549 7870 9242 7149 2418 -3176 -7534 -9424 -7505 -2907 2864 7518 9323
1948 9323 7601 3060 -2271 -7285 -9178 -7866 -3366 2230 6925 9031 7877 3713 -1898 -6655 -8976
1963 -8976 -8000 -4092 1486 6190 8925 8105 4161 -885 -5874 -8788 -8173 -4677 603 5714 8483 8462
1979 8462 4972 -247 -5418 -8317 -8481 -5385 -276 4828 8347 8310 5421 492 -4755 -8154 -8463 -5617
1995 -5617 -970 4121 7837 8693 5994 1111 -3855 -7540 -8482 -6127 -1551 3675 7350 8375 6470
2010 6470 2057 -3366 -7084 -8551 -6427 -2336 2892 6761 8264 6635 2493 -2651 -6569 -8385 -6889
2025 -6889 -2839 2047 6274 8270 7094 3071 -1674 -6047 -8049 -7219 -3479 1541 5810 8005 7090
2040 7090 3928 -940 -5508 -7850 -7297 -3954 719 5147 7635 7427 4231 -411 -4880 -7493 -7386 -4418
2056 -4418 39 4665 7388 7394 4664 87 -4215 -7091 -7342 -4993 -734 3853 7124 7344 4973 930
2072 930 -3532 -6954 -7255 -5294 -1277 3241 6522 7340 5475 1612 -2967 -6166 -7124 -5430 -1746 2488
2088 2488 5966 7189 5539 2090 -2424 -5716 -7282 -5803 -2302 2079 5423 7177 5888 2640 -1678
2103 -1678 -5305 -6751 -5809 -2767 1484 5042 6784 5970 3032 -1205 -4747 -6717 -5871 -3109 625 4597
2119 4597 6443 5985 3422 -440 -4363 -6308 -5926 -3488 253 3950 6154 5951 3609 83 -3931 -6122
2135 -6122 -6123 -3986 -391 3368 5980 6094 3928 538 -3097 -5788 -5923 -4076 -774 2944 5619 5963
2151 5963 4169 1078 -2860 -5533 -5929 -4239 -1295 2484 5166 5794 4307 1212 -2167 -4858 -5585 -4480
2167 -4480 -1527 1953 4683 5653 4672 1638 -1762 -4573 -5568 -4650 -2037 1442 4404 5479 4845 2173
2183 2173 -1120 -3976 -5297 -4936 -2316 1071 3885 5328 4593 2537 -783 -3677 -5265 -4762 -2654 540
2199 540 3659 5069 4691 2672 -281 -3360 -4849 -4827 -2793 185 3126 4880 4668 3080 100 -2918
2215 -2918 -4660 -4540 -3200 -64 2618 4556 4716 3019 342 -2522 -4528 -4485 -3082 -507 2319 4353
2231 4353 4642 3121 820 -2144 -4105 -4350 -3293 -781 2064 3910 4571 3262 1095 -1709 -3757 -4409
2247 -4409 -3535 -1002 1688 3648 4391 3442 1251 -1483 -3677 -4423 -3316 -1288 1196 3508 4032 3558
2263 3558 1428 -1176 -3186 -4011 -3344 -1504 1105 3090 4085 3532 1842 -934 -2881 -3849 -3587 -1627
2279 -1627 661 2767 3885 3415 1737 -541 -2738 -3678 -3400 -1795 301 2617 3790 3210 1961 -178
2295 -178 -2387 -3495 -3561 -1992 196 2191 3518 3331 2168 -174 -2067 -3397 -3346 -2298 -86 2068
2311 2068 3340 3451 2397 203 -1771 -3144 -3249 -2351 -316 1753 3196 3241 2284 428 -1700 -3053
2327 -3053 -3307 -2420 -495 1650 2994 3342 2471 643 -1267 -2827 -3261 -2378 -669 1180 2717 3206 2416
2344 2416 920 -949 -2712 -3089 -2460 -808 1083 2548 3077 2468 987 -954 -2448 -2948 -2578 -1052
2360 -1052 850 2318 3005 2530 1037 -713 -2167 -2823 -2463 -1240 565 1836 2728 2648 1167 -615 -2032
2377 -2032 -2722 -2580 -1290 315 1855 2519 2525 1398 -191 -1901 -2459 -2433 -1548 -70 1638 2555 2506 1696
2395 1696 -78 -1349 -2554 -2608 -1571 -204 1440 2478 2513 1791 166 -1249 -2194 -2392 -1725 -294 1174
2412 1174 2197 2421 1661 384 -1020 -2214 -2459 -1709 -442 1040 2083 2211 1808 578 -881 -2105
2428 -2105 -2385 -1908 -537 936 1974 2355 1728 683 -727 -1906 -2337 -1862 -656 566 1587 2257 1875
2445 1875 757 -441 -1549 -1981 -1775 -1085 471 1626 1903 1650 924 -278 -1369 -1995 -1885 -1099 282
2462 282 1364 1788 1857 913 -217 -1077 -1712 -1779 -1062 164 1228 1835 1797 1067 215 -1104 -1714 -1645 -1214 -233
2482 -233 890 1665 1847 1163 145 -799 -1503 -1819 -1310 -248 606 1466 1766 1209 544 -651 -1345 -1587 -1199
2501 -1199 -554 448 1462 1577 1353 605 -339 -1079 -1484 -1304 -624 323 992 1696 1407 545 -198 -951 -1506
2520 -1506 -1235 -566 324 1016 1392 1244 688 -79 -886 -1328 -1320 -756 43 653 1123 1131 844 240 -569 -1155 -1238
2541 -1238 -746 -198 767 1186 1286 798 221 -483 -1064 -1197 -709 -199 363 827 1188 879 299 -269 -851 -1080
2561 -1080 -1104 -353 163 835 997 981 337 -127 -637 -896 -858 -446 27 649 1003 901 520 87 -425 -890 -908
2582 -908 -572 -278 265 703 624 688 -19 -307 -760 -934 -393 -193 289 670 836 918 352 -227 -493 -713 -706 -292
2604 -292 404 643 824 623 477 237 -334 -637 -773 -533 -51 285 459 684 556 242 -234 -457 -612 -512
2624 -512 -177 87 725 589 417 246 -154 -555 -696 -561 -270 132 419 615 615 333 16 -393 -519 -725 -472
2645 -472 23 288 662 799 587 175 -182 -431 -635 -450 -371 211 443 662 607 370 -110 -428 -539 -539 -404
2666 -404 23 436 658 571 529 29 -370 -733 -636 -420 -176 336 693 792 655 270 -227 -451 -862 -506 -348
2687 -348 371 493 798 637 466 -351 -508 -829 -619 -324 -27 674 756 686 440 30 -439 -785 -1000 -638 24
2708 24 526 791 938 762 165 -323 -949 -1022 -650 -221 190 754 718 797 163 -125 -666 -993 -895 -476 357 765
2730 765 872 823 406 -219 -778 -828 -870 -335 143 550 1085 908 575 -193 -776 -928 -1051 -796 61 797 1084
2751 1084 1018 804 17 -570 -1146 -1065 -692 -166 558 1004 1162 797 52 -474 -861 -996 -880 -265 212 857
2771 857 1036 985 344 -413 -841 -1283 -1047 -405 382 1181 1050 1073 432 -360 -813 -1157 -1092 -730 197 843 1367
2792 1367 1009 719 -213 -795 -1219 -1160 -713 19 532 1255 1182 726 27 -787 -1214 -1343 -751 52 778 1306
2812 1306 1497 886 -15 -727 -1110 -1263 -956 -55 649 1204 1301 883 187 -685 -1025 -1488 -1041 -341 605 1264
2832 1264 1390 1268 149 -588 -1220 -1548 -1084 -421 490 1199 1447 1186 505 -522 -1237 -1455 -1146 -698 437
2851 437 1137 1626 1164 664 -299 -1093 -1419 -1291 -587 250 1174 1635 1371 710 -173 -1081 -1650 -1376 -849 34
2871 34 1009 1483 1480 990 -72 -1007 -1525 -1554 -888 -42 888 1485 1527 1118 97 -1093 -1465 -1594 -884 -148 878
2892 878 1418 1655 1140 208 -696 -1372 -1516 -1125 -258 697 1450 1609 1118 320 -648 -1474 -1576 -1191 -411 698
2912 698 1412 1728 1292 520 -528 -1348 -1821 -1538 -446 549 1394 1512 1403 605 -508 -1388 -1791 -1599 -782
2931 -782 411 1194 1821 1491 729 -316 -1290 -1609 -1554 -760 392 1376 1745 1570 912 -206 -1240 -1610 -1635
2950 -1635 -933 255 1319 1833 1655 1147 -129 -1186 -1686 -1895 -1062 46 1026 1639 1841 1047 29 -1161
2968 -1161 -1800 -1828 -1177 -14 968 1664 1972 1310 138 -896 -1802 -1807 -1180 -229 1010 1573 1879 1431 308
2987 308 -932 -1770 -1933 -1297 -552 733 1672 1941 1419 285 -862 -1675 -2010 -1569 -341 686 1768 1986
3005 1986 1626 479 -706 -1638 -2004 -1548 -694 602 1500 2133 1712 809 -664 -1575 -2089 -1848 -742 325
3023 325 1721 2028 1827 819 -406 -1375 -2015 -1900 -857 408 1450 1944 1956 1133 -179 -1469 -2086 -1969
3041 -1969 -1051 218 1574 2068 2000 1135 -223 -1378 -2062 -1908 -1094 -12 1226 1851 1999 1274 -28 -1305
3059 -1305 -2106 -1800 -1446 -103 1306 1990 2278 1504 43 -951 -2182 -2143 -1541 -247 1294 2070 2307 1555
3077 1555 223 -969 -2072 -2212 -1450 -506 818 2120 2344 1495 452 -839 -2039 -2271 -1799 -681 808
3094 808 2057 2235 1870 765 -825 -2019 -2305 -1921 -628 715 1854 2492 1851 729 -729 -1882 -2306
3111 -2306 -2033 -714 547 1856 2527 2013 1096 -462 -1754 -2414 -2267 -931 444 1829 2481 2243 1162
3128 1162 -370 -1633 -2471 -2354 -1221 421 1685 2471 2239 1307 -216 -1625 -2436 -2468 -1289 -34 1298
3145 1298 2481 2525 1578 -157 -1437 -2423 -2501 -1571 -77 1487 2257 2460 1658 42 -1481 -2521 -2815 -1747
3163 -1747 -100 1199 2322 2619 2011 419 -1433 -2436 -2591 -2056 -481 1209 2358 2651 1827 533
3179 533 -1120 -2361 -2758 -2169 -591 1190 2195 2645 1995 526 -922 -2153 -2662 -2083 -940 745 2157
3196 2157 2706 2326 892 -828 -2136 -2753 -2325 -898 574 1944 2845 2605 1242 -426 -2107 -2850 -2399
3213 -2399 -1299 515 2030 2958 2495 1352 -499 -1878 -2726 -2428 -1445 318 1857 2808 2671 1627 -139
3230 -139 -1542 -2601 -2733 -1842 -69 1729 2785 2853 1651 111 -1536 -2769 -2620 -1606 -344 1437
3246 1437 2762 3032 1886 217 -1308 -2608 -2910 -2088 -384 1358 2717 2950 1968 491 -1094 -2594
3262 -2594 -2872 -1992 -650 1191 2736 2871 2272 666 -999 -2395 -2846 -2298 -963 970 2418 2911 2363
3279 2363 1067 -886 -2384 -2751 -2478 -884 837 2198 3087 2476 1084 -597 -2067 -2981 -2523 -1181
3295 -1181 564 2131 2792 2663 1340 -252 -1815 -2884 -2594 -1470 315 1946 2816 2667 1573 -86
3311 -86 -1905 -2732 -2830 -1671 164 1841 2903 2740 1759 90 -1566 -2819 -3052 -1896 -188 1612 2906
3328 2906 2905 1855 181 -1493 -2705 -2767 -1872 -274 1249 2636 2830 2110 428 -1330 -2486 -2925 -2242
3345 -2242 -644 1389 2547 2775 2326 659 -1170 -2335 -2956 -2221 -769 1050 2252 2960 2322 1003
3361 1003 -981 -2279 -2962 -2412 -1094 730 2216 2882 2472 1013 -711 -2133 -2896 -2614 -1076 550
3377 550 2231 2839 2500 1239 -578 -2143 -2776 -2571 -1127 332 1938 2961 2663 1505 -268 -1884
3393 -1884 -2841 -2683 -1508 99 1871 2896 2628 1720 -5 -1831 -2774 -2831 -1614 -74 1846 2625 2671
3410 2671 1719 163 -1593 -2675 -2778 -1984 -145 1521 2525 2838 1933 357 -1509 -2573 -2959 -2078 -237
3427 -237 1491 2369 2872 2121 557 -1288 -2318 -2716 -2087 -526 1124 2513 2903 2240 601 -998 -2368
3444 -2368 -2786 -2259 -720 1007 2302 2723 2390 857 -805 -2196 -2607 -2275 -955 872 2140 2791 2338
3461 2338 1037 -679 -2042 -2897 -2474 -1102 568 2010 2522 2331 1262 -346 -1877 -2657 -2373 -1441 428
3478 428 1984 2632 2605 1314 -348 -1831 -2684 -2424 -1366 272 1629 2709 2387 1359 -101 -1658 -2547
3495 -2547 -2561 -1551 7 1593 2456 2587 1447 -67 -1547 -2310 -2611 -1553 -204 1405 2380 2595 1708
3512 1708 125 -1331 -2322 -2552 -1898 -367 1262 2310 2533 1839 484 -1244 -2320 -2491 -1931 -550 969
3529 969 2301 2540 1904 634 -1056 -2276 -2569 -1980 -675 828 2161 2499 2009 917 -938 -2209 -2532
3546 -2532 -2126 -805 793 2205 2459 2106 868 -771 -1937 -2476 -2182 -1033 485 1803 2536 2185 964
3563 964 -581 -1913 -2468 -2407 -1157 553 2039 2506 2256 1135 -268 -1872 -2521 -2361 -1342 332 1697
3580 1697 2454 2410 1344 -167 -1617 -2431 -2231 -1349 49 1582 2414 2510 1441 90 -1426 -2320 -2495 -1359
3598 -1359 -35 1451 2167 2496 1590 187 -1420 -2315 -2409 -1629 -219 1158 2443 2538 1873 264 -1141
3615 -1141 -2504 -2438 -1715 -404 982 2261 2652 1684 499 -1076 -2221 -2454 -1933 -496 923 2147 2442
3632 2442 2006 744 -982 -2125 -2301 -1925 -649 827 2109 2444 2102 836 -701 -2048 -2503 -1938 -817
3649 -817 676 1884 2457 1999 1134 -752 -1905 -2547 -2246 -974 693 1598 2354 2262 1045 -479 -1794
3666 -1794 -2509 -2064 -1182 370 1613 2499 2171 1382 -277 -1670 -2416 -2294 -1329 208 1487 2323 2118 1336
3684 1336 44 -1520 -2243 -2165 -1379 -79 1366 2346 2486 1486 60 -1455 -2247 -2485 -1558 -116 1185
3701 1185 2042 2371 1557 158 -971 -2305 -2287 -1744 -390 1058 2265 2453 1740 647 -1018 -2145 -2442
3718 -2442 -1896 -603 806 2214 2472 1973 590 -1014 -2020 -2247 -1840 -696 749 1942 2308 1836 829
3735 829 -700 -1990 -2390 -2084 -888 601 1792 2457 2021 1019 -453 -1723 -2460 -2211 -1036 282 1754
3752 1754 2501 2177 1196 -440 -1507 -2457 -2219 -1209 245 1480 2201 2278 1332 -146 -1343 -2307 -2311 -1292
3770 -1292 44 1355 2289 2385 1406 86 -1286 -2186 -2230 -1558 -138 1190 2219 2259 1613 348 -1249 -2045
3788 -2045 -2494 -1770 -267 948 2071 2390 1652 431 -997 -2014 -2411 -1958 -581 1009 2009 2341 2049
3805 2049 766 -816 -2034 -2197 -2001 -769 736 1617 2443 1938 1000 -559 -1991 -2339 -1890 -915 617
3822 617 1530 2309 1936 822 -322 -1650 -2257 -2137 -1250 271 1583 2114 2055 1357 -323 -1601 -2128 -2048
3840 -2048 -1372 189 1335 2177 2338 1314 -103 -1456 -2307 -2057 -1428 -86 1376 1999 2106 1368 35
3857 35 -1038 -2053 -2248 -1456 -376 1106 2076 2240 1482 352 -1066 -2023 -2238 -1744 -441 933 1912 2275
3875 2275 1744 586 -878 -1767 -2212 -1611 -652 481 1685 2138 1816 710 -708 -1566 -1950 -1822 -800
3892 -800 346 1616 2116 1725 709 -375 -1682 -1915 -1770 -864 363 1518 1948 1975 984 -246 -1356
3909 -1356 -2020 -1853 -1264 311 1361 1989 1885 1037 -99 -1265 -2010 -1846 -1179 34 1254 1764 1928 1033
3927 1033 21 -1095 -1815 -1942 -1188 -41 1097 1890 2119 1420 222 -1076 -1909 -2021 -1365 -368 891
3944 891 1749 1979 1467 413 -731 -1842 -1895 -1543 -265 812 1515 2070 1532 458 -799 -1629 -1916 -1542
3962 -1542 -686 587 1465 1805 1458 613 -457 -1445 -1979 -1500 -725 266 1439 1939 1477 871 -280 -1240
3980 -1240 -1897 -1579 -816 120 1162 1782 1594 822 -395 -1251 -1774 -1793 -969 150 1083 1797 1534 992 85
3999 85 -1289 -1630 -1753 -1167 -77 1172 1702 1709 1045 -80 -924 -1728 -1758 -1128 -195 838 1567 1744 1186 183
4019 183 -896 -1470 -1581 -1154 -367 649 1499 1646 1248 338 -587 -1361 -1710 -1262 -500 585 1300 1625 1273
4038 1273 420 -481 -1262 -1610 -1353 -465 545 1301 1732 1438 591 -287 -1477 -1691 -1296 -430 320 1192 1631
4057 1631 1378 793 -89 -968 -1587 -1396 -647 251 1149 1424 1255 910 -164 -1160 -1549 -1447 -769 115 989
4076 989 1428 1432 786 -216 -963 -1476 -1388 -964 -132 824 1434 1542 1031 -1 -776 -1430 -1648 -1048 -23 581
4096 581 1348 1576 1050 178 -832 -1340 -1534 -1058 -198 640 1302 1613 1075 323 -673 -1328 -1409 -1123 -573 607
4116 607 1420 1492 1151 490 -500 -1240 -1336 -1173 -480 445 1084 1475 1297 544 -372 -1054 -1451 -1268 -507 410 1162
4137 1162 1502 1277 673 -116 -1011 -1397 -1395 -767 322 851 1409 1166 724 -159 -924 -1310 -1319 -760 17 856 1316
4158 1316 1300 921 83 -881 -1325 -1242 -972 -20 861 1189 1343 912 229 -666 -1362 -1326 -901 -212 682 1302 1523
4179 1523 1117 112 -772 -1129 -1394 -1236 -314 625 1148 1348 971 511 -579 -1265 -1386 -1162 -422 424 1010
4198 1010 1379 1242 585 -316 -1152 -1266 -1346 -497 179 1230 1259 1256 745 -275 -975 -1314 -1192 -570 86 1011
4218 1011 1241 1128 700 -101 -782 -1352 -1338 -805 136 790 1117 1223 773 81 -801 -1241 -1350 -964 8 746
4238 746 1264 1358 895 164 -833 -1209 -1142 -1076 -328 411 1181 1260 888 449 -419 -1005 -1496 -1062 -430 461 1168
4259 1168 1283 1155 502 -270 -1047 -1340 -994 -396 242 947 1233 1196 577 -318 -959 -1245 -1273 -624 370 922
4279 922 1334 1178 779 -72 -791 -1163 -1231 -535 110 808 1358 1189 885 -127 -811 -1259 -1042 -791 -66 727
4299 727 1163 1205 884 314 -470 -1293 -1292 -877 -184 382 1065 1327 1004 346 -365 -868 -1156 -975 -432 343 1045
4320 1045 1169 1158 515 -240 -857 -1244 -1176 -365 332 947 1323 1057 469 -235 -713 -1213 -1194 -558 -17 857 1206
4341 1206 1006 792 80 -682 -1173 -1315 -695 -171 725 1125 1184 902 196 -609 -1067 -1235 -755 -155 682 1009
4361 1009 1240 831 414 -423 -1040 -1209 -928 -383 612 1003 1260 1002 446 -263 -926 -1318 -951 -395 387 896
4381 896 1235 1065 514 -253 -795 -1146 -985 -525 149 741 1254 1094 660 -142 -791 -1065 -1157 -721 -117 753
4401 753 1287 1244 691 131 -640 -991 -1094 -814 -94 607 1053 1056 772 107 -480 -1062 -1195 -668 -343 412 1105
4422 1105 1197 809 387 -647 -1004 -1089 -932 -286 537 951 1248 910 394 -267 -834 -1308 -932 -472 284 974
4442 974 1017 1169 525 -247 -877 -1195 -1181 -577 135 860 1206 1120 664 -114 -854 -1068 -1043 -597 -109 597 1067
4463 1067 1121 541 -23 -683 -1129 -1153 -803 -88 601 1162 1180 854 7 -539 -1116 -1004 -855 -357 413 1037 1138
4484 1138 1016 273 -339 -918 -1277 -815 -364 273 818 1134 1118 292 -292 -843 -1105 -1032 -511 158 828 1139
4504 1139 835 569 -129 -737 -1125 -1122 -596 227 923 1021 1085 634 -89 -707 -1085 -982 -592 27 591 1021 1079
4525 1079 579 60 -794 -989 -1057 -508 -9 601 957 1109 792 189 -456 -1159 -1150 -780 -74 483 970 1211 854
4546 854 91 -474 -1061 -1309 -956 -319 344 884 1197 970 296 -231 -827 -1224 -965 -533 297 783 1232 1000
4566 1000 465 -141 -995 -1070 -991 -465 200 834 1259 1034 381 -173 -860 -892 -977 -366 195 752 1141 1139 666 -229
4588 -229 -685 -1151 -998 -477 -72 692 978 1137 696 -56 -715 -1054 -1077 -709 78 466 1134 1064 745 317 -598
4609 -598 -975 -1004 -891 -165 519 1000 1156 916 191 -449 -918 -1089 -861 -119 354 940 1074 848 452 -264
4629 -264 -977 -1155 -945 -252 285 887 1195 947 390 -335 -951 -1194 -955 -440 16 783 1107 932 448 -292
4649 -292 -834 -1134 -997 -479 306 809 1047 902 572 -201 -751 -1252 -987 -441 85 630 989 1016 581 -42
4669 -42 -726 -1154 -1080 -705 -41 700 1050 1216 639 -69 -603 -1002 -1086 -635 0 547 1250 1237 684 181 -456
4690 -456 -1048 -954 -885 -101 521 867 1186 722 65 -596 -979 -1205 -891 -174 392 1127 1280 923 309 -337 -897
4711 -897 -1156 -964 -433 398 945 1300 951 367 -147 -854 -1270 -907 -584 286 983 1061 754 485 -167 -837
4731 -837 -1114 -994 -747 146 795 1082 1024 714 -319 -706 -1187 -1189 -609 -4 696 1095 1178 644 37 -819 -1158
4752 -1158 -1285 -820 -41 726 1216 1264 786 53 -438 -1277 -1435 -979 -61 610 1024 1100 787 275 -542 -935
4772 -935 -1291 -739 -201 567 1164 1220 943 386 -443 -993 -1183 -1070 -427 317 1015 1268 884 435 -448 -917
4792 -917 -1333 -946 -495 258 929 1242 949 599 -198 -1052 -1260 -1208 -477 386 837 1090 1047 384 -95 -893 -1117
4813 -1117 -1197 -420 156 813 1155 1018 629 60 -899 -1204 -1232 -705 44 714 1076 1220 750 223 -745 -1106
4833 -1106 -1178 -781 -62 584 1062 1174 709 237 -539 -1086 -1210 -931 -290 446 1175 1322 1058 95 -304 -1164
4853 -1164 -1448 -861 -411 468 965 1232 1050 507 -331 -1078 -1114 -1223 -542 251 1017 1324 1082 611 -216 -936
4873 -936 -1160 -1135 -581 264 988 1246 1027 553 -174 -850 -1227 -1013 -629 191 864 1225 1212 709 -200 -812 -1098
4894 -1098 -1223 -618 -25 693 1215 1065 772 81 -607 -978 -1250 -863 -230 692 998 1264 918 284 -462 -1057
4914 -1057 -1278 -1033 -188 365 1225 1251 919 292 -451 -1127 -1071 -910 -365 433 1148 1222 1114 436 -494 -866 -1199
4935 -1199 -900 -540 334 936 1236 1113 417 -315 -833 -1177 -1044 -546 69 807 1306 1050 504 -53 -805 -1081
4955 -1081 -1001 -569 124 722 1236 1089 574 -187 -737 -1240 -1133 -765 176 647 1247 1185 813 -72 -641 -1111
4975 -1111 -1148 -576 79 582 894 1176 658 225 -588 -1050 -975 -781 -18 479 1067 1309 837 396 -324 -1077
4995 -1077 -1177 -859 -201 504 964 1214 1006 343 -332 -862 -1265 -842 -265 282 1096 1049 861 584 -221 -953
5015 -953 -958 -892 -466 -37 853 1045 1046 323 -214 -673 -1194 -897 -483 153 809 1085 900 572 15 -660 -1089 -911
5037 -911 -426 221 504 945 966 583 97 -681 -917 -947 -562 43 647 814 1057 566 -81 -353 -1015 -891 -787
5058 -787 -74 685 950 1035 641 -15 -471 -971 -877 -692 -190 581 809 1059 775 33 -357 -825 -962 -815 -298
5079 -298 416 902 981 667 374 -375 -686 -935 -850 -339 446 612 814 755 353 -276 -682 -1012 -747 -388 338
5100 338 806 957 678 352 5 -809 -897 -818 -518 202 663 993 757 508 -58 -595 -857 -780 -445 100 367
5121 367 738 798 622 -101 -583 -848 -739 -569 19 462 771 856 532 -88 -516 -688 -712 -664 47 458 586
5142 586 878 508 130 -226 -808 -812 -549 64 593 830 714 482 27 -416 -707 -829 -630 -193 431 646 623
5163 623 577 167 -378 -672 -893 -407 -83 298 604 658 651 43 -356 -799 -867 -590 -108 230 638 609 675 443
5185 443 -192 -642 -728 -744 -443 218 551 643 641 250 -68 -471 -784 -883 -356 275 475 623 670 361 -40 -460
5207 -460 -604 -703 -322 5 640 620 700 178 78 -584 -646 -599 -290 7 433 698 554 388 -37 -331 -719 -679
5229 -679 -303 114 477 398 652 382 -5 -513 -654 -637 -300 14 202 741 751 512 212 -184 -601 -801 -340
5250 -340 -112 365 592 583 470 160 -207 -474 -693 -223 -110 344 644 599 437 236 -100 -351 -562 -432 -128
5271 -128 320 415 509 452 183 -58 -578 -547 -572 -189 83 855 598 585 336 -43 -513 -617 -390 -254 216 354
5293 354 463 556 219 -202 -355 -607 -488 -285 120 268 660 368 208 -145 -373 -590 -554 -183 -136 247 577
5314 577 367 210 -117 -449 -490 -557 -406 56 187 551 445 262 -105 -287 -408 -738 -457 -86 394 460 591
5335 591 430 215 -322 -409 -370 -388 -142 337 384 553 419 135 -293 -409 -394 -304 -12 253 411 513 371 205
5357 205 -129 -435 -503 -540 -105 137 383 626 310 249 -252 -547 -535 -495 -264 114 411 448 456 180 101 -388 -456
5380 -456 -518 -348 156 516 422 497 307 -79 -351 -341 -558 -442 -77 413 406 523 124 170 -250 -364 -463 -338 -98
5403 -98 185 506 433 280 -14 -172 -158 -412 -408 -115 275 461 477 73 72 -139 -443 -507 -318 -217 -78 254 480
5426 480 360 207 -313 -338 -374 -358 -327 106 297 297 406 -3 -115 -374 -419 -212 -225 79 245 372 355 208 -13
5449 -13 -193 -457 -346 -268 -78 241 287 306 159 -77 -258 -250 -504 -379 -65 198 256 363 218 120 -12 -222 -248
5472 -248 -195 -177 124 372 282 173 93 -112 -285 -214 -86 -65 135 209 389 166 320 59 -160 -271 -364 -45 0
5495 0 96 259 223 122 94 -200 -199 -158 -176 -217 70 225 156 276 -59 -127 -211 -236 -25 57 86 117 146 370 179 -131
5521 -131 -258 -79 -223 -212 -67 36 220 160 165 53 -106 -137 -28 -5 -100 137 70 251 52 25 -41 -131 -150 -321
5545 -321 -4 100 109 218 148 -122 -172 -122 -267 -140 -11 31 115 223 60 138 -140 -214 -62 -97 -70 106 165 175
5569 175 194 121 59 -70 -214 -124 -133 -152 98 147 116 121 -21 -18 -192 -159 -15 -209 101 88 230 25 163 -169 -171 -77
5595 -77 -125 116 -126 115 192 124 22 43 -120 -168 -8 -15 227 123 85 299 234 44 -44 -35 -169 -39 7 74 273
5620 273 124 118 125 -80 -62 -253 -41 -224 2 -12 139 136 62 99 -109 142 -196 -232 -53 68 100 45 257 -10
5644 -10 -2 -84 -208 30 -12 -91 142 134 57 1 -26 -68 -184 -251 -214 17 17 149 100 89 43 -95 -233 -234 -162 39 -30 156
5672 156 217 227 -53 -240 -110 -78 -98 -73 67 201 293 307 -15 95 -69 -207 -268 -99 85 309 180 138 106
5695 106 -133 -313 -198 -212 -155 104 241 255 405 207 16 -102 -302 -150 -138 55 164 269 96 187 -34 -188
5717 -188 -225 -271 -125 54 44 168 211 243 110 -175 -411 -192 -24 -14 111 239 76 46 -20 -31 -176 -161 -76 23
5741 23 34 282 484 145 -77 -187 -265 -456 -238 22 287 75 310 289 153 -246 -321 -254 -259 -7 127 283 301
5764 301 261 268 -158 -354 -245 -301 -243 131 -6 279 302 -9 10 -380 -251 -121 85 -167 114 296 481 288
5786 288 -257 -223 -364 -253 -378 -155 197 367 305 174 112 -355 -370 -512 -213 36 215 239 176 219 -109 -242
5808 -242 -449 -328 -183 32 179 514 406 117 51 -180 -364 -512 -234 63 93 228 396 247 194 -291 -392
5829 -392 -287 -235 27 58 350 412 284 178 -141 -308 -386 -256 -105 73 205 509 134 147 -87 -393 -537 -283
5851 -283 -333 94 244 395 388 -23 -59 -446 -530 -272 -51 133 272 362 449 233 -111 -391 -437 -333 -341 59 322
5874 322 506 484 100 -67 -472 -628 -494 -95 -11 418 602 400 255 -164 -448 -671 -560 -241 55 279 440
5895 440 527 510 -10 -241 -433 -677 -437 -11 270 446 480 406 -21 -258 -533 -555 -353 -38 411 534 762 408
5917 408 -106 -307 -707 -491 -452 -185 250 627 647 367 39 -144 -448 -556 -480 -346 11 500 794 502 98
5938 98 -269 -546 -628 -430 -20 125 604 667 416 133 -185 -619 -666 -529 -175 419 493 761 535 270 -254 -509
5960 -509 -640 -544 -241 220 624 661 551 361 -67 -401 -749 -673 -424 195 474 732 637 290 22 -375 -638
5981 -638 -560 -345 80 634 615 644 376 -113 -408 -846 -745 -442 -40 431 986 816 506 80 -486 -716 -696
6002 -696 -484 -126 504 712 702 569 43 -393 -621 -769 -646 -311 295 607 754 495 85 -343 -688 -858
6022 -858 -525 -282 192 470 975 741 302 -240 -627 -838 -650 -196 242 426 720 617 275 -193 -643 -758
6042 -758 -705 -412 32 600 865 814 377 -75 -809 -888 -917 -373 266 479 953 677 477 -16 -578 -904 -746
6063 -746 -467 39 517 594 818 617 103 -481 -853 -609 -376 -189 464 824 968 546 187 -393 -826 -803 -552
6084 -552 52 471 885 947 718 -16 -330 -804 -833 -474 -166 437 793 834 685 44 -190 -745 -978 -627 -162
6105 -162 355 655 817 581 185 -132 -854 -658 -732 -163 419 570 791 605 228 -122 -702 -872 -719 -162
6125 -162 390 708 780 812 336 -134 -611 -885 -783 -362 226 516 981 920 630 -135 -645 -851 -812 -514 -112
6146 -112 493 832 966 654 27 -585 -885 -722 -588 65 411 756 824 556 -37 -392 -776 -951 -549 -39
6166 -39 414 847 921 677 131 -497 -836 -965 -584 -92 149 743 1095 634 300 -454 -912 -871 -618 -60 449
6187 449 650 817 617 331 -340 -716 -1015 -711 -245 295 666 817 672 247 -337 -747 -770 -959 -250 172
6207 172 840 903 705 352 -47 -540 -1021 -664 -340 0 821 946 879 536 -128 -423 -814 -724 -413 108 700
6228 700 858 811 639 -33 -659 -887 -898 -520 71 520 863 892 574 46 -603 -910 -953 -582 -110 417 903
6249 903 953 535 -40 -382 -768 -880 -655 -138 616 800 887 640 10 -255 -930 -869 -650 -210 479 805 1035
6270 1035 734 147 -300 -943 -896 -748 -389 302 793 810 772 307 -416 -612 -928 -710 -341 260 755 982 749
6291 749 182 -224 -703 -846 -726 -337 311 661 917 788 346 -301 -727 -927 -626 -448 257 755 983 961
6311 961 400 -223 -630 -933 -702 -539 94 664 890 949 666 -58 -649 -738 -866 -485 12 524 1008 822 589
6332 589 129 -621 -735 -793 -639 -143 436 953 1128 688 72 -468 -894 -980 -635 -161 493 778 827 599 114
6353 114 -636 -855 -977 -475 -88 438 1007 955 583 341 -324 -716 -895 -550 -149 316 785 1075 781 198
6373 198 -172 -638 -937 -583 -436 281 825 868 823 344 -138 -745 -1059 -817 -385 178 842 930 867 379 -380
6394 -380 -626 -772 -814 -223 12 667 883 859 415 -18 -636 -977 -791 -480 143 566 839 905 457 -77 -570
6415 -570 -758 -936 -494 138 522 1006 804 362 47 -552 -1013 -876 -503 11 418 866 994 600 32 -527
6435 -527 -685 -904 -499 -54 599 1047 964 738 11 -406 -733 -869 -613 -247 371 711 845 722 276 -354
6455 -354 -761 -861 -677 -134 294 774 1186 547 328 -257 -836 -790 -796 -277 171 750 892 781 300 -177 -658
6476 -658 -854 -819 -464 241 746 800 826 347 -173 -565 -1018 -614 -370 146 697 867 899 552 -79 -696 -939
6497 -939 -875 -558 247 676 845 791 486 -52 -620 -862 -809 -529 -82 628 745 977 382 -33 -499 -906 -913 -717
6519 -717 -39 479 858 858 684 117 -400 -911 -948 -617 -192 497 816 1023 665 159 -382 -869 -998 -742 -184
6540 -184 488 913 848 603 262 -382 -761 -843 -623 -342 167 854 1042 883 302 -416 -785 -940 -632 -195 263
6561 263 839 975 761 292 -219 -569 -956 -906 -296 70 555 811 782 322 -123 -662 -1020 -827 -485 60 603
6582 603 876 849 450 -180 -488 -1006 -746 -501 42 647 878 1070 433 -180 -457 -944 -1095 -620 39 581
6602 581 912 897 593 99 -433 -705 -866 -679 -132 375 836 882 675 120 -395 -891 -1021 -723 -104 482 797
6623 797 964 662 276 -404 -828 -796 -720 -187 291 730 1014 700 172 -445 -707 -1084 -896 -431 353 781 862
6644 862 862 388 -246 -761 -849 -845 -417 183 642 916 682 440 -229 -665 -860 -718 -233 32 655 784 795 473
6666 473 -28 -623 -744 -799 -385 144 668 933 833 308 -126 -434 -814 -950 -507 -37 699 847 696 738 -133
6687 -133 -596 -791 -1063 -477 -43 352 753 940 409 -21 -420 -791 -953 -594 50 285 709 919 617 154
6707 154 -257 -670 -924 -673 -149 283 782 751 716 215 -528 -852 -873 -601 -227 167 651 860 575 63 -218
6728 -218 -835 -766 -539 -255 112 793 813 552 226 -294 -633 -757 -603 -92 245 595 949 735 257 -119 -507
6749 -507 -879 -785 -290 98 470 757 824 221 -320 -616 -765 -716 -483 96 378 773 724 426 -207 -506 -846
6770 -846 -841 -388 180 508 726 791 479 -65 -456 -840 -809 -506 -31 588 807 789 492 -31 -410 -818 -692 -543
6792 -543 -32 386 683 748 515 141 -288 -885 -782 -583 67 285 695 748 689 144 -325 -580 -725 -667 -344
6813 -344 327 613 870 577 237 -328 -597 -772 -617 -352 254 645 808 596 301 -296 -643 -759 -558 -462
6833 -462 65 717 876 685 431 -118 -753 -812 -672 -506 25 561 763 618 410 -2 -647 -684 -529 -432 -48
6854 -48 373 765 534 507 54 -721 -883 -707 -184 -103 317 787 721 476 -52 -459 -755 -737 -450 -96 328 752
6876 752 679 466 35 -345 -855 -773 -522 4 373 876 739 548 120 -426 -565 -925 -531 -62 385 649 872
6897 872 515 112 -244 -461 -668 -566 -210 306 546 549 580 223 -259 -646 -831 -632 -151 198 559 660 651 370
6919 370 -329 -710 -913 -731 -337 185 542 776 751 351 -157 -695 -782 -687 -386 295 590 631 614 300 40 -432
6941 -432 -734 -750 -342 -51 301 668 552 430 -59 -475 -562 -706 -244 97 386 783 662 527 -47 -330 -757
6962 -757 -683 -447 -60 421 635 783 680 -167 -420 -601 -875 -433 -64 309 875 673 348 173 -403 -620
6982 -620 -524 -525 -88 244 507 794 506 143 -226 -531 -585 -609 -230 256 613 772 613 251 -320 -383 -683 -610
7004 -610 -307 25 370 790 455 328 -85 -424 -721 -698 -476 96 573 730 543 151 -74 -572 -661 -655 -467
7025 -467 83 425 744 623 348 -83 -340 -672 -676 -463 -7 448 585 626 319 94 -510 -757 -570 -448 23
7046 23 458 632 601 378 -120 -351 -526 -525 -418 -168 442 397 731 368 204 -243 -708 -539 -401 -188 202 554
7068 554 701 415 70 -196 -499 -669 -483 -100 143 432 659 633 80 -287 -408 -451 -573 -105 292 384 672
7089 672 426 365 -130 -404 -633 -594 -314 166 492 719 540 241 -156 -607 -634 -596 -110 217 405 608 632 350
7111 350 -60 -476 -476 -503 -307 58 394 669 612 324 22 -257 -446 -676 -419 51 267 711 556 405 -21
7132 -21 -215 -604 -569 -310 -33 189 402 601 436 41 -494 -424 -383 -328 -300 263 462 521 303 98 -144 -429
7154 -429 -562 -473 -62 272 544 615 342 175 -206 -487 -581 -511 -292 119 426 602 538 156 -128 -243 -488 -491
7176 -491 -303 147 375 499 550 263 -236 -235 -478 -404 -247 -13 254 591 509 273 -1 -459 -601 -514 -355 79
7198 79 353 460 375 496 -209 -223 -491 -564 -119 -101 185 426 464 294 -57 -316 -358 -385 -325 -149 200 246 447
7221 447 421 66 -201 -293 -543 -391 -135 294 442 497 356 -156 -268 -505 -570 -411 -99 308 463 517 358 267
7243 267 -289 -415 -440 -304 -194 51 301 444 369 125 -172 -409 -661 -523 -212 -37 359 648 370 265 -37
7264 -37 -276 -358 -452 -282 0 364 499 587 226 18 -396 -547 -248 -287 -46 292 473 563 276 -142 -393 -434
7286 -434 -375 -283 9 137 322 240 129 33 -408 -455 -321 -383 -27 174 336 235 168 63 -266 -568 -408 -395 -50
7309 -50 216 280 364 422 125 -260 -343 -431 -423 -210 327 426 438 126 36 -261 -403 -556 -232 -23 182 614 367 411
7333 411 204 -258 -381 -441 -241 -123 120 404 457 340 77 -122 -316 -448 -204 -72 83 453 459 402 49 -201
7355 -201 -193 -428 -344 -270 -6 363 290 606 175 -102 -274 -409 -453 -125 32 333 414 385 236 2 -329 -341 -301
7378 -301 -237 -169 228 308 469 93 35 -358 -477 -373 -401 -34 272 289 427 308 22 -45 -517 -481 -285 107 300
7401 300 369 464 145 125 -125 -268 -396 -236 -99 166 199 397 192 1 -292 -349 -536 -210 -27 145 327 149
7423 149 246 -35 -122 -514 -609 -108 -147 274 303 361 246 69 -80 -244 -534 -484 -84 177 288 372 270 130 -135
7446 -135 -363 -365 -480 -131 110 299 366 217 228 46 -402 -454 -289 -258 48 402 437 342 23 -116 -349 -406 -447
7469 -447 -234 162 223 417 287 23 98 -238 -329 -266 -240 -62 115 298 488 160 112 -216 -124 -428 -283 -62
7491 -62 222 316 438 163 -26 -383 -391 -341 -259 -120 387 341 497 404 10 -104 -369 -361 -341 2 122 288 423 320
7515 320 156 -230 -289 -190 -144 -13 265 254 271 251 77 -117 -420 -327 -402 -304 -124 406 424 219 98 -84 -325
7538 -325 -324 -340 -72 70 283 324 240 301 -140 -198 -290 -239 -45 173 101 415 431 393 -189 -270 -337 -186 -210 31 230
7563 230 486 314 144 131 -182 -329 -262 -393 23 245 295 430 170 -222 -267 -265 -223 -252 72 263 314 480 -62
7586 -62 108 -300 -329 -429 -174 -10 145 154 368 149 -71 -146 -133 -433 -459 -75 169 204 190 246 -62 -101 -384 -502
7610 -502 -151 -67 26 198 346 201 68 -225 -238 -267 -342 -206 7 261 415 279 148 -17 -280 -403 -354 -256
7632 -256 261 317 303 427 192 -96 -117 -224 -293 -345 -74 255 215 322 73 71 -218 -324 -236 -207 34 149 258
7655 258 399 187 22 -205 -459 -455 -327 -14 197 302 306 252 78 -97 -277 -386 -204 -128 130 457 173 63
7677 63 -21 -283 -379 -243 -191 -4 298 339 451 327 201 -215 -248 -319 -105 0 165 505 241 261 202 -119 -268
7700 -268 -232 -79 -141 109 333 391 141 194 -50 -354 -260 -327 -173 79 209 254 273 183 -46 -231 -415 -366 -78
7723 -78 53 299 207 372 -23 -141 -247 -130 -320 -30 -84 438 306 284 36 -74 -164 -262 -303 -258 88 134 227
7746 227 374 294 -112 -422 -232 -321 -204 83 226 301 209 238 -115 -174 -253 -342 -103 -134 274 268 398 350 -109 -195
7770 -195 -348 -398 -161 131 67 342 373 406 -51 -192 -211 -368 -272 -192 236 293 415 176 -32 -209 -401 -336 -245
7793 -245 -221 217 197 302 320 111 10 -329 -363 -248 -318 342 580 380 327 92 -260 -332 -538 -381 -198 111
7815 111 335 293 357 1 -134 -263 -474 -192 -16 104 291 325 248 108 -137 -310 -349 -402 -25 80 352 322
7837 322 432 142 -25 -262 -501 -333 -354 -5 80 295 415 300 -26 7 -275 -479 -148 13 188 527 430
7858 430 159 122 -44 -447 -388 -375 -96 188 325 409 231 64 -310 -381 -371 -484 -22 205 210 530 314 31 -44
7881 -44 -303 -587 -306 -35 191 282 307 417 216 -123 -313 -414 -315 -244 106 216 400 401 152 -79 -388 -371 -346
7904 -346 -45 80 200 426 466 194 -93 -281 -336 -579 -144 137 141 498 461 283 -141 -108 -402 -455 -175 27
7926 27 223 413 334 129 10 -382 -346 -457 -287 127 204 261 589 222 63 -194 -637 -341 -130 -40 211 419
7948 419 543 290 -20 -241 -411 -386 -401 39 337 260 453 308 72 -148 -227 -307 -423 -49 229 430 383 373
7970 373 43 -199 -377 -292 -259 -115 373 505 521 286 169 -187 -234 -512 -394 -183 188 392 419 448 8 -82
7992 -82 -228 -574 -256 -250 -44 263 475 388 370 -94 -397 -552 -462 -168 213 345 508 484 165 -74 -526 -522 -403
8015 -403 -311 90 431 446 522 376 94 -249 -433 -386 -275 -337 265 534 461 308 -169 -203 -407 -534 -275 -34
8037 -34 236 570 591 274 -12 -192 -601 -521 -168 -71 224 473 391 405 175 -219 -422 -497 -421 -231 48 411 430
8060 430 512 289 -127 -368 -569 -319 -135 18 503 543 451 146 -143 -374 -597 -456 -318 31 491 519 367
8081 367 85 -47 -218 -654 -431 -172 -1 277 458 372 254 -51 -213 -487 -339 -420 12 220 476 591 288
8102 288 -10 -192 -544 -611 -332 116 285 556 410 364 -6 -269 -504 -684 -387 -82 345 442 584 415 3
8123 3 -329 -509 -546 -417 -180 298 458 615 253 119 -157 -290 -481 -382 -57 125 434 459 277 73 -220 -364
8145 -364 -522 -478 -182 15 392 625 479 86 72 -419 -636 -366 -300 26 470 434 436 147 -159 -427 -260 -434
8167 -434 -134 58 449 558 524 374 -5 -403 -543 -676 -367 -127 127 597 606 490 60 -423 -604 -533 -380
8188 -380 47 225 467
8191D67
##END NTUPLES=NMR FID
##END=
