##TITLE=1H_Pr Ust
 CD3OD
 8 sc, 
 10.4.2023
##JCAMPDX= 6.0         $$ Bruker NMR JCAMP-DX V2.0
##DATA TYPE= NMR FID
##DATA CLASS= NTUPLES
##ORIGIN= UXNMR, Bruker Analytische Messtechnik GmbH
##OWNER= root
$$ XWIN-NMR		Version 3.5
$$ Mon Apr 10 14:27:27 2023 Russian Standard Time (UT+4h)  she@DPX200
##.OBSERVE FREQUENCY= 200.13135
##.OBSERVE NUCLEUS= ^1H
##.DELAY= (6, 6)
##.ACQUISITION MODE= SIMULTANEOUS
##.ACQUISITION SCHEME= undefined
##.AVERAGES= 8
##.DIGITISER RES= 18
##SPECTROMETER/DATA SYSTEM= spect
##.PULSE SEQUENCE= zg30
##.SOLVENT NAME= MeOD
##.SHIFT REFERENCE= (INTERNAL, MeOD, 0, 15.7039)
##AUDIT TRAIL= $$ (NUMBER, WHEN, WHO, WHERE, WHAT)
$$ ##TITLE= Audit trail, XWIN-NMR		Version 3.5
$$ ##JCAMPDX= 5.01
$$ ##ORIGIN= Bruker BioSpin GmbH
$$ ##OWNER= she
$$ F:/spectra/data/she/nmr/H-F/1/audita.txt
$$ ##AUDIT TRAIL=  $$ (NUMBER, WHEN, WHO, WHERE, WHAT)
(   1,<2023-04-10 14:26:34.37 +0400>,<she>,<DPX200>,
      <created by zg, POWCHK disabled, PULCHK disabled
       configuration hash MD5:
       00 E9 B6 7A A2 85 ED C7 34 08 36 98 17 FE 4E 26
       data hash MD5: 16K
       EF E7 7A 68 FF C0 B3 29 8F E0 0E 5E DC C2 43 9D>)
$$ ##END=
$$ 
$$ hash MD5
$$ FE DF 91 EB 6A 33 C2 02 8D 42 4E 22 38 A4 E1 FB
##$RELAX= 
##$RELAX= 
##$RELAX= 
##$RELAX= 
##$RELAX= 
##$RELAX= 
$$ Bruker specific parameters
$$ --------------------------
##$DU= <F:/spectra>
##$EXPNO= 1
##$NAME= <H-F>
##$PROCNO= 1
##$TYPE= <nmr>
##$USER= <she>
##$AMP= (0..31)
100 100 100 100 100 100 100 100 100 100 100 100 100 100 100 100 100 100 
100 100 100 100 100 100 100 100 100 100 100 100 100 100 
##$AQSEQ= 0
##$AQ_mod= 1
##$AUNM= <au_zg>
##$AUTOPOS= <>
##$BF1= 200.13
##$BF2= 200.13
##$BF3= 200.13
##$BF4= 200.13
##$BF5= 200.13
##$BF6= 200.13
##$BF7= 200.13
##$BF8= 200.13
##$BYTORDA= 1
##$CFDGTYP= 0
##$CFRGTYP= 5
##$CHEMSTR= <none>
##$CNST= (0..31)
1 1 145 1 1 1 1 1 1 1 1 1 1 1 1 1 1 1 1 1 1 1 1 1 1 1 1 1 1 1 1 1 
##$CPDPRG= <>
##$CPDPRG1= <>
##$CPDPRG2= <>
##$CPDPRG3= <>
##$CPDPRG4= <mlev>
##$CPDPRG5= <mlev>
##$CPDPRG6= <mlev>
##$CPDPRG7= <mlev>
##$CPDPRG8= <mlev>
##$CPDPRGB= <>
##$CPDPRGT= <>
##$D= (0..31)
0 1.2 0 0 0 0 0 0 0 0.06 0 0.03 0 0 0 0 0.0002 0 0 0 0 0 0 0 0 0 0 0 0 
0 0 0 
##$DATE= 1681122393
##$DBL= (0..7)
120 120 120 120 120 120 120 120 
##$DBP= (0..7)
150 150 150 150 150 150 150 150 
##$DBP07= 0
##$DBPNAM0= <>
##$DBPNAM1= <>
##$DBPNAM2= <>
##$DBPNAM3= <>
##$DBPNAM4= <>
##$DBPNAM5= <>
##$DBPNAM6= <>
##$DBPNAM7= <>
##$DBPOAL= (0..7)
0.5 0.5 0.5 0.5 0.5 0.5 0.5 0.5 
##$DBPOFFS= (0..7)
0 0 0 0 0 0 0 0 
##$DE= 6
##$DECBNUC= <off>
##$DECIM= 32
##$DECNUC= <off>
##$DECSTAT= 4
##$DIGMOD= 1
##$DIGTYP= 9
##$DL= (0..7)
0 120 120 120 120 120 120 120 
##$DP= (0..7)
150 150 150 150 150 150 150 150 
##$DP07= 0
##$DPNAME0= <>
##$DPNAME1= <>
##$DPNAME2= <>
##$DPNAME3= <>
##$DPNAME4= <>
##$DPNAME5= <>
##$DPNAME6= <>
##$DPNAME7= <>
##$DPOAL= (0..7)
0.5 0.5 0.5 0.5 0.5 0.5 0.5 0.5 
##$DPOFFS= (0..7)
0 0 0 0 0 0 0 0 
##$DQDMODE= 0
##$DR= 18
##$DS= 0
##$DSLIST= <SSSSSSSSSSSSSSS>
$$ [...]
##$SUBNAM2= <"">
##$SUBNAM3= <"">
##$SUBNAM4= <"">
##$SUBNAM5= <"">
##$SUBNAM6= <"">
##$SUBNAM7= <"">
##$SUBNAM8= <"">
##$SUBNAM9= <"">
##$SW= 18.05172834244
##$SWIBOX= (0..15)
0 0 2 0 0 0 0 0 0 0 0 0 0 0 0 0 
##$SW_h= 3612.71676300578
##$TD= 16384
##$TD0= 1
##$TE= 0
##$TE2= 300
##$TE3= 300
##$TEG= 300
##$TL= (0..7)
0 120 120 120 120 120 120 120 
##$TP= (0..7)
150 150 150 150 150 150 150 150 
##$TP07= 0
##$TPNAME0= <>
##$TPNAME1= <>
##$TPNAME2= <>
##$TPNAME3= <>
##$TPNAME4= <>
##$TPNAME5= <>
##$TPNAME6= <>
##$TPNAME7= <>
##$TPOAL= (0..7)
0.5 0.5 0.5 0.5 0.5 0.5 0.5 0.5 
##$TPOFFS= (0..7)
0 0 0 0 0 0 0 0 
##$TUNHIN= 0
##$TUNHOUT= 0
##$TUNXOUT= 0
##$USERA1= <user>
##$USERA2= <user>
##$USERA3= <user>
##$USERA4= <user>
##$USERA5= <user>
##$V9= 5
##$VALIST= <valist>
##$VCLIST= <CCCCCCCCCCCCCCC>
##$VD= 0
##$VDLIST= <DDDDDDDDDDDDDDD>
##$VPLIST= <PPPPPPPPPPPPPPP>
##$VTLIST= <TTTTTTTTTTTTTTT>
##$WBST= 1024
##$WBSW= 4
##$XGAIN= (0..3)
0 0 0 0 
##$XL= 0
##$YL= 0
##$YMAX_a= 251271
##$YMIN_a= -555288
##$ZGOPTNS= <>
##$ZL1= 120
##$ZL2= 120
##$ZL3= 120
##$ZL4= 120
##$ABSF1= 10
##$ABSF2= 0
##$ABSG= 5
##$ABSL= 3
##$ALPHA= 0
##$AQORDER= 0
##$ASSFAC= 0
##$ASSFACI= 0
##$ASSFACX= 0
##$ASSWID= 0
##$AUNMP= <proc_1d>
##$AZFE= 0.1
##$AZFW= 0.1
##$BCFW= 1
##$BC_mod= 2
##$BYTORDP= 1
##$COROFFS= 0
##$CY= 11.3945322036743
##$DATMOD= 1
##$DC= 2
##$DFILT= <>
##$DTYPP= 0
##$F1P= 2.36226072786647
##$F2P= -0.459571619588291
##$FCOR= 0.5
##$FTSIZE= 0
##$FT_mod= 4
##$GAMMA= 1
##$GB= 0.15
##$INTBC= 1
##$INTSCL= 1
##$ISEN= 128
##$LB= 0.24
##$LEV0= 0
##$LPBIN= 0
##$MAXI= 10000
##$MC2= 0
##$MEAN= 0
##$ME_mod= 0
##$MI= 1.114404
##$NCOEF= 0
##$NC_proc= 0
##$NLEV= 6
##$NOISF1= 3.799351
##$NOISF2= 2.8
##$NSP= 1
##$NTH_PI= 0
##$NZP= 0
##$OFFSET= 15.70392
##$PC= 1
##$PHC0= -19471.82
##$PHC1= 8.2008
##$PH_mod= 1
##$PKNL= yes
##$PPARMOD= 0
##$PSCAL= 0
##$PSIGN= 0
##$REVERSE= no
##$SF= 200.130013532006
##$SI= 16384
##$SIGF1= 3
##$SIGF2= 2
##$SINO= 400
##$SIOLD= 16384
##$SREGLST= <1H.CDCl3>
##$SSB= 0
##$STSI= 0
##$STSR= 0
##$SW_p= 3612.71676300578
##$SYMM= 0
##$S_DEV= 0
##$TDeff= 0
##$TDoff= 0
##$TI= <>
##$TILT= no
##$TM1= 0
##$TM2= 0
##$TOPLEV= 0
##$USERP1= <user>
##$USERP2= <user>
##$USERP3= <user>
##$USERP4= <user>
##$USERP5= <user>
##$WDW= 1
##$XDIM= 8192
##$YMAX_p= 0
##$YMIN_p= 0
$$ End of Bruker specific parameters
$$ ---------------------------------
##NTUPLES= NMR FID
##VAR_NAME=  TIME,          FID/REAL,        FID/IMAG
##SYMBOL=    X,             R,               I
##VAR_TYPE=  INDEPENDENT,   DEPENDENT,       DEPENDENT
##VAR_FORM=  AFFN,          ASDF,            ASDF
##VAR_DIM=   8192,          8192,            8192
##UNITS=     SECONDS,       ARBITRARY UNITS, ARBITRARY UNITS
##FACTOR=    0.0002768,     1,               1
##FIRST=     0,             0,               0
##LAST=      2.2672688,     0,               0
##MIN=       0,             -555288,         0
##MAX=       2.2672688,     251271,          0
$$ Real data points
##PAGE= N=1
##DATA TABLE= (X++(R..R)), XYDATA
$$ [...]
1766f53L91P30k74m84J16p1L53L19l32n72N48K18j60j17r7l94N16K17j20m04M1
1787b29L48j96P4Rl8k19L76p0o92L60N00j40J83k88j32PL21r6m59K31L22k60k6
1810a14m6j4J02L15l43l67K75O58k76k35j3j84M08L80n77k20J48P01k59m27O8
1831b0r9K18N4n69P6N60j80J12Q7o65k35J143q7q93L53J01k24N84K64p48p1N85
1853C46l48m93P21l61j92Q25p4j010L90O79q58L79L16m68k7Q92l77j186J050K08
1873D12o96M75P7p09N39O08j070r6R01Kq70L68K76o48O00L76j250J87J036o53
1893a35j35N13j69n92R64k41q12M25N59n57L46M46j001L67P32p20o53P43o2l54
1913c36M70j46o72N88O81q96L7M92k69J65M94n49o32R07J41q96N06J64o72M17
$$ y = [-653, -262, 468, 194, -290, -174, -245, 108, 427, 95, -477, 71, 289, 129, 12, -85, -479, 37, 254, 134, -270, -229, 119, -77, -3, 6, -32, -251, 125, 55, -637, -277, 223, 83, 266, -22, -154, -147, 174, 78, -381, -150, 172, -88, -114, -160, -174, -72, 243, -100, -467, -192, 466, 190, -45, -58, -242, 166, 546, -31, -251, -103, 598, 339, -88, -20, -119, 99, 153, -416, -340, 220, 40, 152, 239, -426, -661, 482, 395, -498, -145, -44, -268, 316, 580, -168, -239, 346, -2, -495, 226, -135, -327, 498, 424, -586, -196, 483, -375, 4, 320, -148, -175, 717, 340, -846, 204, 412, -284, 191, 268, -441, 98, 706, -364, -460, 441, 443, -427, -59, 217, -431, 169, 545, -705, -518, 518, -135, -270, 243, 74, -518, 446, 205, -607, -182, 377, -180, 166, 612, -389, -22, 710, -10, -663, 80, 18, -336, 134, -12, -684, -96, 585, -311, -274, 218, -51, 114, 608, 59, -573, 334, 475, -421, 85, 249, -423, -6]
1933fO61j235N7J166o05l30O08l98n01P98M6r30N28J019r00k88P23m25j55P35
1953E68k49q71N48N26q92N23K89r44L10J062r70o69J092M5m58L02k6n64K30J004
1973H56j114M3L98j56PM92r95J46O83j73m32L1J72k15M47kq48M53L95k20m7J76
1995I7k23JM90k45p08O13O26o83K94k03m52K83P09n68l88O03k24k81N43M4q92
2016e64O84M40q87P2N69l29j02K80n4k89M09Q5m52M8J22k21L02p6l11o2M42q2
2038B4k97L7M11K6j6q5k78K98J60o0j40L1l84K53J77k06l74N30J53l89J32j41
2060a38j18N97L0l10k22J74m0K31J14m40j27O19p5n72J79L02l32M2K69m46L5N02
2082B74q2l02M9J30m92M98L40n11N9kK79l19K3L88j76l4k3m09J62M13l35J14J12
$$ y = [-6, 655, -580, -523, 643, 38, -292, 316, -82, -583, 215, 261, -669, -141, 878, -22, -310, 413, -12, -167, 568, 319, -552, -4, 522, -370, 153, 442, -502, -192, 870, -100, -769, 323, 368, -90, 212, 186, -378, -148, 856, -258, -215, 183, 27, 34, 526, -469, -323, 360, 187, -245, -214, -42, -257, 190, 188, -660, -207, 188, -32, -79, 97, -126, -125, 365, 120, -588, 25, 651, -32, 262, 59, -393, -110, 599, 31, -357, 246, 22, -259, 284, 328, -564, 120, 560, -327, -255, 314, -15, -117, 163, 109, -180, 229, 314, -138, -90, 32, -189, 113, 37, -274, -336, 106, 24, -273, -236, 175, 201, 185, 100, -178, 120, 280, 220, 80, 111, -273, -20, 157, -49, -423, 107, 260, -129, 3, -138, -256, 341, 371, 61, -161, 13, -27, 204, 318, -122, -249, 370, 295, -277, -98, 204, -128, -86, 183, -263, -228, 274, 192, -110, -61, 69, -423, 75, 415, -96, -37, -39, 240, -79, -56, 332, 156, 122, 99, -310, -148, 265, -70, 44, 156]
2105A56j34j94J94k05l6j6K55r2m20M38J08L28p1m80oM51k12l6K57k72k2Q8Q9
2128A68k72J92J7k22J5L4j12K69L64l19m53K54K10k40K90k15l51K64O10l76M8
2149A75L7k00j63M81n81k09M99M18k53j01L3l98R0Q29n09m54K79K93l68PK29k38
2171a04j12L89m34j17N02P3k81J20L5l71O2M18l74J90n4K9l03J67K45j92K56o
2193A38o44O91K94m27j50J71k63lL45j87J33k04L5P3J11k92l9J55J82l25k44O86
2215B36l03q8J75j01n17Q04M8m12M5K56k45O3M19p09J2O10N2m73J14M0k41M13
2237A98J9m28R3J71q3k32O21l66m32N36K17p37K85M11m22j31M04k52k42N50l0
2258A50o03O54l3m39L44L02o41J60L64k72j56K22k9j88L69j38j47J87L50p28J19
$$ y = [156, 22, -172, 22, -183, -219, -235, 20, -72, -492, -54, 54, 382, 311, -169, -175, 276, 64, 28, 285, 13, -9, 79, 168, -104, 88, 105, -117, -102, -68, -180, 89, 453, 134, -319, -65, 145, -95, 195, -20, -371, -107, 503, 127, 175, 212, 12, -151, 330, -251, -460, 39, 457, 204, 103, 136, -262, -172, 657, 148, -306, -27, 266, -102, -95, 134, -104, -216, 173, -261, -378, 124, 197, -84, 36, 71, -300, -238, 180, -194, -4, -58, -29, -332, -165, 80, -112, 144, 138, -506, 185, 479, 52, -98, 73, -190, -193, 152, -35, 98, -106, -71, 2, 113, -179, -218, -63, 119, -206, -450, 236, -67, -155, 20, -81, -598, 206, 254, -158, -113, 143, -102, -39, 380, -329, -317, 293, 345, -128, -14, 26, -215, 198, 217, -211, -118, 53, -30, -262, 359, -7, -439, 97, 314, -423, -138, 273, -149, -280, 124, -128, -370, 180, 150, -453, 201, 168, -271, 73, 375, -266, -106, 258, -14, -170, 52, 23, -165, 204, 66, -81, 106, 456, -272, -153]
2279a53N49k03j32k2l42J2N13j75k90J8K05j8pK46k96J29L37k72l66K51m6k70
2301c32N60O9p52L38M46l19k47N18n43J37L14J8m58K98K17n54L65J79m35q9O86
2322D16l25l82M42P8n27L67O4j15l5L76m58j17K55j78J20P3k83o6N24K9l45N5
2344c2J57p4q3J45j81J77J72j42n03L66j46J02Q8o6j75M12O2m24m8J00K42k36
2366h7J67k52n2L32q3J29k84O2M1J03p6j68pJ27JQ6J71k64j39J63J17k28p5K62
2390D6K26l85K33j58k41L92J52l36j12K36L9p3p1J3r7M71l43j16j73M05o0j08
2412f0K21j30k41k8L81k75J48J42j60J75n4k05j3PL51l13K35K17l54r0j88L74
2434A40k51J49N8j03k49L93p7k20Q8J93K01j16m42K59q1K57j24p9r3j11q7L02
$$ y = [-153, 396, 193, 61, 39, -303, -291, 222, 47, -243, -225, -20, -38, -45, 201, -95, 34, 371, 99, -267, -16, -62, -332, 228, 297, -455, -117, 329, 10, -237, 281, -262, -125, 189, 207, -251, 47, 264, -290, 75, 254, -181, -270, 416, 91, -291, 151, 229, -298, 69, 133, 18, -17, 359, -99, -216, 39, -139, -19, 54, -229, -295, 229, 258, -87, -32, 125, 51, -32, 113, -68, 109, 281, 139, -364, 2, -144, -42, 46, -20, -195, 217, 279, -145, -193, -93, 149, -87, 80, -172, -224, 108, 25, 154, -130, -68, -27, 76, 0, -168, -175, -48, -47, 39, 210, -54, -193, -30, 87, -141, -216, 46, 272, -113, 120, -38, -279, 113, 265, -71, -183, 53, 92, 19, -52, -39, -136, 335, -8, -124, -297, 108, 48, -60, 161, 31, -210, -238, 143, -132, 16, 158, -2, 173, 119, -86, -99, -92, 259, -54, 181, 398, 44, -46, -234, 140, -111, 38, 96, -7, -256, 137, 60, -160, -72, 121, 322, 206, -236, 23, -58, 199, 75, -4, -97, -208, -295, 7]
2456GJ46j59j0L12l50K27j93m0l3L77j71j00J58k94J56j45J94k04K70J55m14K64
2478A53Q6k66L25r8k10k13L80k37p1J84J15k54R3L77m12J50r4r3m7N80k30m63
2500b45L06j14O5q9L32k54j52J64j3j56K59J59n42J20L16k24k20M79K6m4k9j67
2522b3k17M28q3j22j15J21j21R0K84l34j63M99l23o6K82j29j24K70l12J82N7l5
2544D6l1J39q7Ol58K48k6l0o9j2k6O4K24k70K59j28j23j5L7J72l77L09J61q2k57
2569b26K73j2j18L30k29l1j30j72K02L01j21j5q1L6j47L64j9j55j87L47j35k23
2591a48L26m3O6l5j72q0k32M90j09n8K70l73k28J57J46N7k44M34k90q7L79j34
2613I2k9L3j4j21K0j98J31M55l18k97J47rO1k2p6J44j19L8k4l08L98L7N1j06k4
$$ y = [7, 153, -6, -16, 296, -54, 173, -20, -60, -93, 284, 113, 13, 171, -123, 33, -112, 82, -122, 148, 303, -111, 153, 239, -27, 298, 200, -10, -223, 157, -80, -151, 33, 148, -106, -13, 364, -48, 102, 8, -85, -132, 448, 218, -245, 61, -53, 12, -77, 255, 1, -151, 13, 0, -156, 103, 262, -280, -160, 156, -68, -288, 191, 217, 173, 144, -23, -240, 188, 105, -17, -132, -11, -132, -42, 242, -92, -255, 244, -79, -145, 137, 8, -116, 154, -158, 24, 81, 46, 15, 154, 67, 73, -285, -37, -63, -93, -162, -174, -200, -136, 88, -182, 77, -51, -174, -189, -152, 20, -357, -48, 113, 31, -226, 47, 35, -83, 247, 18, -13, -143, -315, -113, 188, 67, 52, -29, 7, -140, 224, 205, 50, -137, 210, 75, -148, 178, 135, 201, 166, -6, -86, -318, 172, 63, 5, 275, -98, -326, -169, -23, 34, -210, 224, -66, -153, 226, 92, 63, 96, 82, -39, -19, -217, -86, 369, 51, -246, -99, -108, -47, -69, -145, -1, -120, -82, -106, -414, -16, 21, 72, -34, -58]
2638e8J17j56R2l3n2J80%K1k14q2J90r3J8q0j8K33k48O6K46k31o4K94k65j86L99
2663G6N1R5l25L38l47P5L59l57k77L00L48N1l5l38j29M4L14q5j50K5k43rK53K12
2687B46m00J52L9MJ1m0O4r5k0j6K42k25O7kk79L54j05j81O8L01n51K71J22q0o
2712e9P8j73K45Q0j69J2n2j9l6J38m1nR0J19k99J41j53P1L5M1J4m6K7k17k0J15
2738h3J65j65K87k48q9J69r6k13K05j48J97M1m9J38k40L03j4j79k03K64k27J52
2760c3j5j19L5K1K38o6q9N4q4m0O0R9O0j54P8k57J13O6j49M22k2n4j92J35l9J24
2786A92l23p9L76k53J6R4J51m24L45j75q6o5K12mj69q0J97Q5jj12M0j02K90q0
2810D5K03l98J78l26K40K76k87J36j74M6L3L6r8L50k11r1j4M63m66k4N4Rj38L77
$$ y = [-58, 59, -97, -5, -38, -90, 90, 90, 111, -103, -185, 5, -88, -70, -150, -168, 65, -183, -117, 129, -102, -166, 128, -137, -323, 76, 127, 222, -103, 235, -112, -37, 322, -35, -312, -12, 336, 387, 352, 14, -115, -71, 243, 158, 8, 33, -210, -219, 34, 246, -154, -2, 37, 41, 52, 12, 76, -19, -39, -55, 187, -38, 29, 27, -252, 102, -3, -184, -116, 185, -366, -95, 27, -53, -59, 19, -154, 91, 171, 2, 14, -38, -57, -93, 45, 4, -1, 89, 208, -91, 50, -103, -32, 3, 44, 58, 12, 39, -178, -198, -83, 82, -83, 204, -44, -133, 36, -60, -273, -68, -216, -19, 22, -27, 111, -129, 174, 160, -19, -222, 42, -185, -33, -48, -167, -132, -111, 127, 61, -28, 26, -58, -98, -38, 61, 121, -33, 45, -212, -99, -33, -182, 240, 218, 164, -28, 107, 68, 192, -131, -210, 166, -87, -71, 23, 174, -250, 95, -80, -166, -231, -19, -23, -192, -272, -75, 10, 9, -103, -63, -165, 125, 45, 248, -150, 28, -298, -58, 218, -69, 67, -107, -61, -28, 8, -90, 260, 49, -42, -56, 407, -59, -83, -29, -20, -158, 219]
2834B19j56k23L07l5j78o3L28j33j18J34p9j83K84j50r8L47m47J41L32j5j89J8
2856D3l0J58k39l3L6k07L68k36R2J70j02P1j35M02l88o5J04q7j14K51o4j50K02
2879D7L8Oj57L58j22k13J16Mj12J56n2j18K8R0k96M88N3m03o0J90l9r9r4P0j75
2904b96K53M8n5Q0O2Nl1k4k95M07j49j4k58J42L27k27J66M2o7q5L45l18j5J72
2928B15l69J76k5j40m1oM33k97O1J96j92rj6J13k61p4L73r9J28p0J4k65K31m4
2952C2k80L02p1k0q0J61j51O8J42l15J14J96k9m4J41j30J44l38L44k50r8K06j95
2975a51%J30j23o9L83o3J3n16M17j6k60M49r4N6k28J91k7O3pp3J30j95j30n2K82
3000A10q1j82K18l8l69M95j79J38l1mk46J31k6k1n3P5PK60k70j43K14J05j49j39
$$ y = [219, 63, -160, 147, 112, -66, -129, 199, 66, -52, 82, 3, -180, 104, -46, -144, 203, -244, -103, 229, 214, 25, 43, 13, 171, -68, -101, -65, -272, 96, -140, -48, 122, 20, 91, -44, 358, -30, -95, 9, -78, -192, 59, -5, -155, 47, 85, 91, -66, 292, 170, -43, 73, 77, -35, 121, 69, -49, -21, 69, -227, 261, 314, -89, -149, 41, 2, -97, -191, -121, -296, -43, 5, -50, 30, 92, 97, 66, 42, -253, 154, 5, -9, -267, -125, 202, -25, 141, 183, 116, 31, 376, 58, 43, 215, -154, 22, -3, -143, -184, -190, 243, -54, 7, 203, 11, 2, -14, 99, -162, -236, 137, 38, 166, 96, 110, -155, 76, 32, -248, 54, -17, -37, -117, 44, -107, -39, 103, -212, -98, 98, 69, 25, 166, 36, 180, -158, 186, -64, -162, 44, -151, -151, -21, -144, -213, 170, 107, 120, -396, 21, 5, -255, 194, 100, 156, -72, 119, 92, 155, 148, 75, 205, 10, -120, -172, 110, 29, -153, 65, 27, -342, 153, -26, 112, 81, 77, -169, -38, -64, -85, -138, -63, -56, 204, -66, -209, 5, 110, -39, -178]
3024a78J18J24j23j26M69k92j58m3L36j32jJ46j89P8J26m01K41Q2p8j54K90j01
3046C4q3j10Q9J45l4K38k22j68O4K0j42K19j20P9j37K74j85j79J45J38m7J09r8
3069B9J69k40J51j4k58K92p2j30J58r0Q7j18K4p8J69Rk83M1L0m0J31J13K42l4
3093B88m35M12n03K95lM6k94L18k36J61J49j66K04k50N7q6O3O1k4N1j55P6K1K95
3117C45l74j10K24n3l1p4J06l5m9J07r0o4K04j29n0j19K42l44L52J49m28O3L93
3140B35l86mK95j35k33K51n3j0k91N01k58J53j0k07P8Lj57L68j48nr2K26j51j56
3164a86L89k3R5m41K2J48K71k90J72j12N4j65j47L82lm37L82j43N1L1j6K7n30
3187d69J80N62m74L1K20j97R7R0j15OP5M2Kr8n9k2Q3K43j81kp3J2J32Ol25J0K37
$$ y = [-178, -60, 64, -59, -185, 284, -8, -166, -209, 127, -5, -6, 140, -49, 29, 155, -246, -5, 77, -1, -155, 135, 34, -49, -159, -70, 75, 41, 279, 57, -111, -47, -27, -169, 50, -70, 9, -128, 146, -39, -218, -73, 65, 18, 127, 29, 198, -42, 109, 95, -163, 129, 57, -73, 85, -5, 82, -36, -12, -90, 79, 88, -195, -154, -124, -164, -33, 80, 322, 288, -147, 265, -238, 57, 54, 100, -194, 124, -112, 49, 198, 32, 236, -14, 43, -43, 20, 81, 57, 108, -47, 29, 50, 345, -29, -139, 85, 32, 1, -73, 33, -2, -51, 56, -34, -98, 106, -23, -73, -192, 50, -294, 58, 207, -221, -158, 235, -151, -155, 140, 5, -228, 23, -30, -40, -331, 170, -88, 65, 55, -152, -74, -71, -228, 140, -8, -13, -105, 121, -30, -186, 203, 180, 275, -166, -144, 4, 275, -15, 157, 45, 99, -66, -213, 169, 166, -271, 111, -32, 19, 50, 34, 61, -469, -289, 273, -201, -170, 50, -147, -50, 40, -75, -69, 6, 48, 50, -48, -107, -129, -46, 197, 16, 14, -59, -47, 85, 91, -234, -224, 13]
3214A3J63k48N8J18k23K26j8j50J34q2NJ72l33J78j84L01O9k11L20l83j06J19
3236f2J93j98J65p2o3R4j00J72k02R0K21m66J51L78j47j04P4l16K14J29r0o3o4
3259f6M7k56L63L8q5j74L51l50K10j36K67k31J53k23K13j07J65n7o9j8N8O0l23
3282a70K27K0j32J04PK25m65J05l2R3J9K51n1k16K30k75K4k3%J6R0m5k02J85M9
3307C4qJ00j32K61j10R4k20J11k9q3q5R3J22j30J09r5j38K57Ql11q0KK84MJ66
3332B24n40N50j08l07K13m5K07j05J24m26M31j89k59JK51N0k50K58j14j21K75
3353A20J13m10K75Rj06L2j07o8K6K03o4p0J71J1k44qM1j66K56r5K12n3j5j15m6
3378i8J48j07j33K46j73L37j77j06K28l71J19K59n4j02J40l61L96j95kj30J8L0
$$ y = [13, 176, -72, -14, 104, -119, 107, 89, -61, 73, -9, -4, 168, -165, 13, -171, 130, 199, -12, 308, -75, -181, -62, 131, -67, 98, 26, -37, 57, -43, 129, -73, 17, 238, -228, -77, 301, 154, 50, 124, -192, 22, 151, 61, -2, -66, -19, -275, 88, 126, 41, -133, 218, -132, 78, -58, 209, -22, 131, -92, 121, 14, 179, 122, 53, 35, 93, 153, -170, 57, 77, -55, 49, 56, 281, -184, -79, -111, -18, 1, 252, 201, -15, 215, -60, -36, -59, -59, -43, 47, 2, -200, -15, 34, 26, 126, -6, 255, 145, 239, 19, 130, 101, 18, -67, 26, 148, 18, 127, 32, -106, 151, 159, -152, -232, -230, 54, 58, 224, -316, 234, 126, -181, 32, -13, 194, 89, 213, -213, 218, 29, -230, -229, 22, 72, -178, 80, -34, -155, 120, 233, -177, 98, 107, 1, 33, -74, -142, -116, 87, 23, -47, 124, 135, -109, -117, -76, -242, 14, -81, 131, 78, 63, -52, -98, 50, -57, -190, 56, -117, 220, 43, -63, 165, -206, -87, 172, 118, 16, 156, -205, 191, -4, -6, -136, -118, -88]
3400h8L8J15q9k2k8P9p9L0J43j23k38K94j05J42l7j29K9J01mm6L0Q4j06J66j07
3425E0k32K79J21k66K3L64j97j69N6m7m5J28P6l9j80ln7p8K46n7l6K33K6j40J32
3450A88J27k42K81l18m5k89K93k32K36j5N2q5R4k08J97o2J6j68J53K1q1K39j35
3473A7k5j82J65j32J35L01l29kJ00q4n4M0K40j30r5l1k31L26j24J06j79%L03j78
3497d3J80K15m43o6L2qk23M41K9%O1P2l23K32k55J64m25N82k54K15l11J45k48
3520b31J54O7P5k01M04l25J49k2j20o8L25k74j62L96j80k87L69J34j76m9M8l07
3542b81M13p2j88k39N56k02r5M8lQ3l02N90k81m0R1j39j38M64k10J90j43k01k13
3565c12K61K03l36J01J54o5l06N06j69k8J40k7j89P8O3j70j19J19J62j20J57r3
$$ y = [-88, -50, 65, -24, -46, -74, 5, -74, -44, 99, -24, -262, 32, -73, 69, 32, -97, -68, 33, 29, -17, 13, 97, -9, 157, 50, -182, 97, 218, -48, -25, 339, 142, -27, 29, -18, -63, 65, 141, 102, -78, -81, -138, -216, 30, -27, -63, 170, 196, 56, 188, 315, 73, 354, 36, -9, -298, -5, -237, -1, -16, 36, -49, 45, -163, 34, -28, -12, -180, -27, -6, -87, 152, 17, -8, -190, -25, -157, -22, 279, -50, -52, 48, -36, -90, -50, 190, 60, -35, -66, -297, 29, -95, 11, -168, -168, 135, -43, 137, 352, -91, -157, -125, -133, -356, 85, 114, 114, 175, 247, -76, 156, -99, 65, -360, 222, -32, 183, -128, 17, -231, -77, -10, 65, -136, 268, -57, 92, 70, -50, -118, 207, -67, -229, 167, -13, -300, 69, 203, 27, -22, 26, -281, 132, 60, -128, -367, 189, -13, -108, -60, -63, 20, -282, 308, 27, -13, 78, -61, -199, 265, 55, 245, 102, -99, -312, -51, 152, -184, -83, 71, 6, -300, 206, 37, 9, 149, 122, -67, 11, 74, -96, -215, -96, 66, -54, 103, 10]
3587A0J60l63J27L3L2P6j81ON3J91p4m1j38j63K98j47M1K52j60o1J1K24k25j37
3611a76Q9L09m74L75k64K50j96J91N8k34l3j06J37J33J17j81J75r3q9j17K11j05
3633b3R8j80K22r1m8Q6j51R8K0k76K55j4J26l70K47J44r9M5o1KK3q8j5J16K13
3658B79k49k70L46m43M09m4n6PM8J10k36r0K82r7L3j1j3l4k45M74l24K0M47l94
3682e1J65L7j73K74k14k43L84J19m32K55P3l03L63l12l9R3k5L6k67K68J22j10
3704B0j60M3N5j48Q7O2J15q6J73j14J31K9rk48K9R3M7L7l44J17q2L71k81J64l04
3729b03L86l33K90j48l2J53j15Q7k38K38l31L40K04k53j15j5j37K92Kl32K90K10
3751B40k64M6n9qq6K18l36L9L53l6k09j2K45q0j79R8k5O4P2J14N8k50l40L70j59
$$ y = [10, 170, -193, -66, -33, -1, 75, -106, -100, -47, 144, 70, 29, -109, -272, 26, -121, -80, 172, 12, -49, -38, 186, -39, -176, -87, 222, -252, 123, -141, 109, -87, 104, 162, -72, -105, -211, -74, 59, 176, -5, 170, 77, -12, -129, 82, -23, 75, -105, 117, 26, -22, 64, -87, 11, 31, -245, 10, -4, 122, -248, -1, 143, 44, 89, 28, 30, 53, -35, -50, 66, 279, 30, -240, 106, -337, 72, 28, -28, -21, 27, 137, -99, -189, 93, -4, 29, 18, 5, -29, -274, 200, -124, -104, 343, -51, 114, 151, -22, 252, 38, -205, 179, 298, -134, 121, 194, -109, 254, -58, -97, -4, -29, 7, -260, 8, 130, 20, -140, -97, -42, -190, -103, -41, 74, -12, 161, 47, 178, 207, 198, -50, -21, 72, 119, 156, -188, -71, -153, 218, -63, 101, -203, 183, -150, 140, -8, -40, 113, -2, 85, -153, 85, -246, 94, 298, 45, -70, -85, -222, 70, 72, -260, 30, 240, -24, 22, -37, -45, -131, 87, -249, -210, 143, 107, -102, -114, 131, 51, -128, -30, -55, 9, 81, 195, 253, 3, -337, 33, -126]
3776a26R8j48J6O6J7L0q8l5kJ45J41L4j55N5m8p0k0L15l97J78K47k24j64M5r9
3801a89K58r7J31R3k20p7K63Pk23k29J72K25oJ50j23j57N5k34J26J06k46L68O
3824A59k92K04j00Q0K3k14MK30r8o4Q7k6j53J56N1k17L33l14P6J3R4j57K76l69
3848b18O8K48k03P2L24m50J78J25p8j66O3L63k47j04j01L41j18j49J88k07K51
3869A80j50J77n0l80n4M04j10j83L44k33l2K56j86l1j29L02j68J08O1k7k6R1n4
3892A10j27j83L73q7j17L9n0J33j67K17j92K80l41J75j02P4N3o4q9J84j78J86
3914A27J1N6j74q3J32k24M25l55nL13j72K09j72k13K63l70J03L47m04J90K9N2
3936H5O1k64K82j2m47N69l03L6q0J1J86J0J0k2o8R4P6k68K76k6j21k08L8K6K19
$$ y = [-126, -28, -176, -160, -94, -77, -47, -135, -170, -172, -27, 114, 148, -7, 48, 0, -70, -90, 225, -172, 6, 253, 29, -135, -90, -189, 69, -28, 103, 196, -24, -101, 162, 169, -54, -283, -111, 114, 108, 258, 135, -22, 33, -201, -75, 31, -215, 153, 159, -133, 71, -29, 51, 74, -140, -136, 94, -4, -68, 19, -7, -160, -4, 47, -170, 163, -151, -75, -62, 32, -125, 151, -218, -150, 98, -105, -33, 291, -159, 19, 144, 66, -100, -37, 326, 79, -25, -126, 215, 97, -52, 136, -71, 180, 30, 207, 157, -223, -277, 127, 17, -166, 178, -55, -87, 169, -17, -48, -177, 125, -43, 65, 126, 99, 73, 164, 110, -17, -200, 173, 86, -31, 8, -42, 91, -76, 141, -51, 229, -112, 63, -39, 35, 88, 24, -65, 119, -59, 127, 138, 194, 20, -63, 69, -155, 270, -85, -90, 223, 51, 260, 88, -125, 138, -232, -129, 218, -186, 4, 33, 85, 146, -118, 164, 152, -295, 274, -29, 7, -73, -62, 124, 134, 144, 122, 54, 148, 224, -44, 232, 206, 85, -123, -85, -59, 160]
3961A60m1k41J24L5j10J47j28J11N2J13j96j92J23P9m5o0K39k11J14l41M03j24
3983A1j03K37j86O9R6k16J51r6p7N1J12r6p5J21J14r8J0oj66L49Q7k0j85j91K50
4008A43O5j48J09j50J9J54m52J83J03J61j60l52M34l63J67K2L1p1K35j01j09P3
4030gp4n3N3L34k95K72j90J6J13rj98QK6J25j58K01k91O6Q3j37O6Jj47K95j21
4055b1J2K34l20O5M1j10J45n7p4Q3M80l88J45k32j60K37J93m78J00J0M8j93K27
4078a3J02k15K7N8k02K40o1J39j54L0j49J88L13l99n5K03J10J21k89P0K0j78P8
4101a6L0J17q9P0K0j90N6K02m02L66l46Q2J06N6n8j64J26n6j6K84k3k39qN0n9
4126a01J5L2r9K0J9K7J10J25j01j45K59j55o6j1J48L8k3j8J27k08K70q2k25K43
$$ y = [160, 119, -122, 2, 37, -73, 74, -54, 57, 109, 222, 26, -166, -43, 36, -9, -69, 170, -41, 73, -268, 135, 11, -92, 145, -41, 28, 124, -92, 59, -37, -114, -63, 49, -47, -122, -1, 113, 15, 25, 19, -147, 202, 289, 269, 84, -107, 143, 208, 60, 169, 19, 38, 192, -260, -77, 26, 187, 27, -325, 109, -254, -87, -65, -34, -105, 130, 29, -80, -7, -81, -134, -81, 253, -42, 230, 40, 56, 169, 160, -38, -30, -4, 121, -37, 164, -127, -61, 22, -115, -49, -48, -195, 100, -21, -9, 225, -95, -30, 11, -99, 46, -11, -85, -2, 478, 90, 235, 3, -157, 80, 273, -205, -105, -95, -47, -240, -13, 89, -126, -99, -41, -243, -3, -64, 75, -79, -49, -198, -10, 303, -96, -151, 52, 162, 283, -6, 64, 84, -94, -16, 14, 131, 42, 112, 132, -58, -2, 200, -202, 164, -182, -100, 6, 62, 4, -160, -34, -90, -106, 178, 155, -84, -92, -42, -101, -86, -54, -153, -133, -114, -87, 23, 148, 47, -98, 161, 6, -60, -71, 77, 115, 92, 74, 201, -7, 263, 181, -44, 199]
4150A99j61O0J05k74J60kL0J06k24n6m5O3O2K65m07K30J7j46J80k8l06M4k11J98
4174a41k4J20O0P2P9k6m24L21K67m35K35J18k46o3m0L18j08M6n6QJ24j72kj52
4198a21K58k63J39R4k2k13j00J05K56l35P0j1o2L07j92J75l7j88n9L23l7j63R
4221f7q1j64N10l03j59L61j23q1M23m34l1J30K01j51J68l74P7J82j75k08J70K42
4243A13k41j6K92m6j14q7J17pl0m2j6Q4R1j72J98k18j58K11o3j34M55l51j18K62
4267A0K6j14M5K31k84K30k54o0J17J07O4mj79J08j00P3l2M9l6j06K00p8M4N7M3
4292A57k19j25J61M6K24m19L51j22P0k51J43j53M4J29k45J27Q1R0OP2k26o6K93
4315A68k87J23O8m6J11rPl36J25J89M8k15Q9n3k55L54k9k29P7J14J02j55J94l3
$$ y = [199, 38, 98, 203, -71, 89, 87, 117, 223, -1, -57, -102, -39, 23, 288, -119, 111, 128, -18, 162, 134, -172, -128, -339, -141, -165, -45, 15, 87, 166, 140, -284, 37, 304, -131, 104, 222, -24, -87, -127, 191, 83, 129, 73, 81, 205, 33, 31, -121, 137, -126, 13, 107, 85, -128, -228, -123, 133, -202, -132, -143, -205, 102, -90, 85, 48, -140, -199, 124, 87, -76, -67, -148, -312, 198, -105, -264, 97, -26, -107, 316, -118, -149, -19, 182, 31, 199, -175, -98, 84, -91, -299, -129, 113, -128, -144, 148, 102, -12, -99, 18, 11, -19, -61, -77, 7, 98, -74, 124, -94, -252, -41, -104, -238, 217, -134, -252, 10, 36, -78, -33, 198, -86, 144, -110, -170, -53, 54, 118, 114, -65, 43, -57, 16, -16, 33, -3, -109, 91, 13, 57, 114, 157, -62, -187, -26, 20, 244, -175, 176, 54, 124, -127, 16, -137, -93, 36, -209, -82, -1, 89, 95, 167, -59, -125, 168, -119, 4, 72, 26, 137, 128, 135, -201, -76, 113, 161, -54, 35, -18, -273, 81, 52, -177, -100, 14, 116, -39, 155, 122]
4339A22j51j64L33Rj84L52k38k39J76K7L0j77Q4pN9n4M2M3j87Q4J67j5j26K55
4363B41k26J14ok08o4J32rQ9J1q6J64l16R2j14K43j12K06k1P2j20k61L12j86L2
4387b1o5L63m31L06r4j27j66J43O3j25j38J53J07j34L40j05L3k10M22l45R3k64
4409b02J5J33p6J87p7j27J40J67k71J81j35o9J78k16M84l59J90q8j84K38n6k08
4431a55J36n1j47M18k31M2K37k79Q9M1j71J40l5k4p6J06l8M7P1j76kj85K84J7
4455E8K8R0k75L41k65J14k56K16J29j74JP2N8P2o2r3j71J45n6K6k7j04q6M38k65
4480d6On7K5j94L73k39j4N99o42K68j42K38l76K64O0j1k55K75m5j89J47k51J29
4503g7J21r5K45j72p8K05Ll6l4J08k47J14ll2j40l4K14o4J33l67J46j55L98K16
$$ y = [122, -29, -193, 140, 149, -35, 317, 79, -160, 16, 43, 73, -104, -20, -27, 32, -22, 20, 63, -124, -40, 127, 112, -14, 241, 15, 129, 123, -85, -149, -17, -26, 63, 74, -12, 152, -164, -72, -186, 57, -55, 151, 130, 202, 82, -179, 133, -53, -21, -86, 277, -154, 152, 58, -69, -235, -92, -29, -154, -292, -139, -32, -166, 174, 69, 102, -108, 314, -31, 62, -202, -187, -54, -130, 57, -20, -147, -7, 160, -111, 70, -65, -134, 44, -172, 312, -47, 143, 55, -129, 109, 53, -155, -19, -70, -217, 201, -30, 12, 249, -30, 59, 100, -71, 69, 34, 10, -66, 40, 2, 49, 120, -56, -58, -243, 41, 58, 86, 176, -99, 242, -23, 91, -165, 51, 180, 6, 7, 79, 137, 209, 147, 54, -117, 28, -28, -2, -29, -133, -219, 219, -46, -40, -97, -72, -266, 107, -132, -146, 453, -189, 79, -63, 175, -201, 63, 123, 112, -143, 132, 87, -102, 45, -206, -77, 44, -51, 194, 22, -56, 149, 152, 116, 82, 190, -57, 57, 54, 22, -118, -152, 62, -2, 131, -236, -90, -245, 153, 369]
4527C69m8k79Q6o0j25M6K66j35k03j24o5L64k25J99o2PJ54r8j47J83j38j1Q0k56
4551b22M11l13J81j6j68L12J68m40Q1O1l3m7l3J5P2M7p5ll12K66Q8o2j44J10K51
4576A95l23Q3N9J74k22j64Q6Q7p5k51J47J63J39l82K87m3O7J66k62J75J47o7q8
4599I8n9K12k94M2K%k48M05q5J96l57n5l8J24R9J3Q6k17j04N4J61j56nL6J1J61
4625H2j33K21l42j56M28j30J87l26R4QL8Q9o5l6J27j68n3P0K10k33L76m84R2J83
4649G9k75L68m4J00j99p2q3M14l63J64j16K2J7L7r1O7J16k27J00K31l92K09j67
4672a05Q7K02k62K70j62mj56K11Qj54J00m8j25J21j30N35n92J37J09j46K98q9
4694A05O9k38m3k67O20l69K41o0K23k49O6o6m9j67J98K7Lj16m7K35O2k10M6o7
$$ y = [369, 321, 42, 128, 68, -57, -11, 255, 120, -83, -207, -272, 92, -133, 66, 4, 11, 165, 67, -80, 103, -35, -46, 34, -222, 189, -124, 57, 41, -127, 185, 353, -87, -6, 55, 22, -25, -58, -43, 29, 76, 1, -2, -314, -48, 40, -22, -166, -56, 195, -128, -45, 14, 188, -34, -198, -112, -25, -100, -351, -204, -41, 98, -284, 3, -40, 27, 193, -69, 106, 253, 186, 98, 39, 251, -43, -1, 1, 1, -247, 158, 73, 269, -88, -143, -181, -57, 42, 55, 141, -76, -180, -126, 35, -121, -126, -90, -79, 82, -51, 170, -172, -328, 100, -30, 157, -169, -75, -67, -29, 60, -5, -41, 86, -82, -135, -65, 145, -88, 288, -196, -104, 79, -196, 172, 128, 228, 29, -43, -126, 288, -75, 89, -27, -5, 12, 49, -42, 25, 141, -86, 14, 245, -147, 62, -105, -18, 184, -78, 192, 30, 26, -130, 81, 89, -65, 35, -13, -138, -17, -147, 388, -204, -67, 42, -104, 194, 105, 174, -64, -107, -374, 246, -123, 118, 58, 281, 32, 98, 32, -17, -184, 14, 41, 44, -72, -119, 116, 178, -32, 14, -53]
4718e3kj34j46K95j87J26K33m37M30o5n4m0J9k43J93K10j81P7K2q0o3k7N2M2L14
4743C01l20L5K0j45K03j78K44l32RL81r9Rj01k23L46k71J24K19k40j58K22r2j5
4766f1j3P9m5L5j03k8O6J64l7j41L8J47M7k00Q4m7k54K95OR1k41L5J29N4j70n3
4792a23K22q7q6L1k60K01J99j08jJ68l89J48J08J30J6j04p0K58l5pj74J27k36
4815g2m7K71l59L50m8l3Jp9r3L31l11q1K14q9j00K82j21J89q1q6N9k2L5j02Q8
4840I6k11J64RJ35k97R1J29K3q5Qj25l1K77k52N9J18K24j93j75l6m0K00o7K44
4864B65l87K15j29Jj47R0K38k01L3J62r5j14J9J81k37L60l74P0J52rk16P4k7K11
4888A35j59K0J5k06K17K5OJ9j21j09J87J24l20J11K88j90k05R4l6r0K82n7l2j7
$$ y = [-53, -55, -189, -335, -40, -227, -101, 132, -305, 125, 60, 6, -34, -15, -258, -65, 145, -36, 41, 63, -17, -80, -107, -55, -13, 301, -19, 16, 36, -109, 94, -84, 160, -172, -163, 218, 119, 128, 27, -196, 150, -121, 3, 222, -18, -176, 46, -46, -61, -74, 5, -40, -5, -108, -136, -70, 94, 57, -84, -46, 101, 148, -52, 32, -15, -269, 26, 32, 123, -118, -83, 46, 100, -70, -123, 99, 12, -74, -43, -303, -102, 97, -11, -12, 156, -233, -85, 23, 153, 169, 65, -5, 253, 218, 211, 37, 164, -72, -119, 152, -207, 143, 95, 62, 63, -16, -109, 222, -89, -170, 44, -45, -145, 137, 16, 205, 124, 38, 97, 75, 110, 8, 96, -115, 49, 58, 193, -104, -13, 116, 139, 54, 62, -63, -94, 183, -69, -10, 108, 332, 139, -36, -72, -112, 88, 21, 265, -122, 93, -36, -35, -182, -92, 146, -55, -22, 140, 45, -69, -50, 131, -106, 254, -120, -50, 102, 93, -123, -49, -76, 135, -24, -4, 11, -195, 22, 47, 53, 72, -49, -158, 29, 153, -167, -56, 232, 42, -163, -69, -105, -195, 87, 30, -2, -19]
4912a9j08R3M5K71l30J31k10j7J50J9L3K68l49j66J37K77k73p2J51j26K07n5k1
4935C6J76j39j53Q7J04j04L7k9j86L22m21J57O8k9J72k67K37L0J8k37J55J57j19
4958G2P2m88L48k4r6L84k19K31l73o5J52j28j69L20p5N5k5K29k06m9r8J33l0J61
4982A12j07R5ql53L49l0j69L78j57p9j56Q0R4k53K55k1l62J81L33j45K6j38pJ37
5006E5k1l39L32L15j86p9j54R7O6J77k84j01K9K34n76K89K15k38J28j24L23k13
5028e5r8M39k09l5J82k20j25J88j96J2j50L07K5N7j36j44K03J39l01RK81j50j55
5051a32r9L64l12J31p2J46K7j56Q6L4nK8Mq0l0j9J41l9Pj13K7L5K01k48K97k88
5077f5J72l12N8K1O7j4J28m4j79J84m3K1K8j81OR9Q8j50K72j73K54l42J73P6k76
$$ y = [-19, -127, -34, 11, 282, -48, 83, -127, -144, 6, 25, 58, 326, -23, -189, -52, 225, -48, -120, 31, -95, 112, 57, 36, 212, 73, -80, 7, 111, 7, 44, 15, -171, 151, -270, -113, -45, -74, 98, -169, 68, 98, 116, -121, 34, 191, 72, 144, -344, 4, -20, -116, 268, 49, 280, -93, -158, -6, -134, -303, 17, -58, -3, -28, 201, -5, -54, -152, -19, -49, 112, 5, 100, 92, -261, 88, 58, -111, 267, 110, 31, -125, -45, 49, -204, 51, 30, -332, -151, 182, 37, 63, -75, -82, 55, 34, -305, 27, 342, 156, 77, -77, 20, 86, 263, -21, -122, -93, 141, -435, -146, 69, -169, -41, -165, 158, -55, -153, 286, 77, 42, 224, 4, -121, 67, -129, -117, -267, 40, 65, 122, -14, -158, 45, 184, -117, -108, 173, 23, -132, -231, 133, -179, -48, -120, 26, 53, -103, -17, 17, 12, 40, 44, -36, -66, -85, 56, 17, 24, -89, -62, -27, 174, -74, 223, -65, 107, -205, -147, -126, -59, -73, 55, 11, -168, 16, -27, -6, 22, -159, -153, -54, 34, -116, 156, -17, 237, -105, 68, 144, -132]
5102a32R7p3J63k88J82J70k8j39p0K11j34R2Q2k30j27L09p1Q6j73L1oK8L5r4j36
5127b15L14p1K0k28M15j31j48J21j32o0k0m7J79J80m46M50k22M4p9j1L1J83n03
5150c76M23J57j64j02K04m4j23Pk32J05J01N9R3Qj04QL3K55l61q7p7R7p9J22j21
5175a98L01k57K67k90k9R7q9J62P6o4K5k15J17L0Oj33K64j93k2K43j45j25J68
5198dr6R1r3RJ86j66M5M3J43j79J09q9j07%J12j60K15j58J91k9J28l39o8K13j19
5223a22J00J69k13J38k5P8qj30R2J71k28L2r6r5R8j08Q8j35M60k86j75J56o8Q6
5247b1J2k21K90j05j55J43J54j52p4j9J78q4K36j91l9L64j12k21p5J93k71M62
5269B92m57K23j53P9L9J05k89J66J64j1j16k2j21l0j10L48k76K31p5l6J3k8l3
$$ y = [-132, -35, -108, 55, -233, -51, 119, 91, -48, -118, 93, -41, 51, 133, -97, -224, 85, 14, 100, -73, -42, -48, -20, 15, -79, -215, 99, 28, 48, -180, 235, 104, -44, 77, -55, -115, -135, -182, -3, 177, -269, 181, -41, 3, -76, -87, -56, 127, -376, 47, 204, 40, -62, 142, 98, -25, -18, -250, -145, -44, 15, 108, 116, 12, 20, 53, 308, -53, -140, -217, -120, -199, -77, -198, 103, -154, 113, -177, -206, -109, -198, -36, 40, -24, 1, -214, -97, -67, -61, -194, 70, -123, -145, 98, -47, -172, -4, -100, -9, -102, -93, 93, -73, -28, 15, 158, -21, 88, -1, -108, -108, 4, -156, 59, -99, 92, 63, 191, -148, -216, -3, -122, -22, 147, -66, 72, 47, 125, 117, -13, 79, 250, 22, 54, -42, -137, -39, -147, -59, -194, 266, -20, -195, -39, -107, -21, -9, -230, 60, -45, -200, -57, 97, -55, -129, -148, 30, -54, 182, -9, -48, 316, 204, -17, -92, 101, -170, 292, -165, 58, -95, -16, 23, 128, -161, 5, 169, 158, 42, 20, -101, -131, -241, 107, -169, 62, -13, -49, -36, -64, -97]
5292i7K14L6j01N8j61j12L19Q2k33J1o0o2k8R8J92J67l32j2k68K61M7J7k47L8
5316a73O1K42n3r2J22m23L69L20l03M6K15n30L00j2Pk8J4n5k31M10l38L93l43
5339h2J62M3k09J98k98K7J33J17oM9J46k25l7k1J35o4m2j23N9j12L04j26pj14
5363i3j22K83k90L35j67J31K1j40k8j24J90o5K27j21K3l30L23q5K25k75J27j38
5385i3QL42j82m01K93n8Qjj68L48k27J55O5k18K80k57J90j60j3J60k32N3L05j19
5409G8r9J66j60K02j58R7M3l16J48j44N4P5k2j72Q1K47m7o1J90k22l12J09K29
5432Fq9j12L06k03n9P8P5k7Ok33M3J40J10k4o4m6J45N5j66Q0K5q1n9P4J2j17J48
5459B3j9J54r8K53m00Q9o5n3l7K8P9J02K7k89J33J01m3J54j97l7k4R1M5O8j81
$$ y = [-97, 117, 153, 52, 110, -51, -163, 156, 238, 5, 16, -44, -106, -134, -36, 156, 323, -9, -21, -289, -28, 19, 36, -211, -173, -112, 130, 77, -15, 107, -316, 53, 373, 70, 116, 331, -199, 101, 89, 96, 68, 82, 27, -204, 206, -132, 261, -82, 80, 123, -86, 112, -186, -159, -26, 91, 85, 134, 280, 55, 18, -3, 132, 68, 26, -97, -38, -150, 154, 28, 21, -93, -215, 68, -222, 113, -54, 77, 98, -42, -70, -194, -4, -69, 158, 37, 60, -270, 53, -32, 193, -82, 45, -93, -85, 257, 75, -326, -33, -91, -83, -84, -252, 96, -131, 24, 89, -129, 151, -106, 84, -76, -89, 71, -161, -108, 197, 78, -21, 145, -15, 187, 29, 126, 169, -147, 1, -143, -89, -14, -36, -208, -127, 120, 73, 12, 202, -20, -332, -223, 6, -83, -195, 111, -92, -151, -73, 2, -25, -19, -252, -209, -69, 41, 17, -47, -93, 52, 107, -59, 21, 46, -35, -94, -20, -8, -125, 23, 4, 158, 60, 313, -87, 2, -63, -116, -153, -125, -46, 56, 83, -206, -73, 28, -15, 139, -58, -95, -119, -28, 17, 85, -96]
5484i6J44l11J43p4J65k4m1J07r4p4L58j05l49M26k78Q1q4L5l05N13J09kj40m
5508A00o4m4J73k26J17n8O7k80K77j52K44j7k98Q5M2P5%J14m7o1K18l57Q4P7k01
5533a32J11j65L51Nq4k59j21L38Q6J15k72J36j5J8j99L5j0m4%J0K91l56L27k11
5557d5n7K92m02J14Q7P9o7k21L52n6P6j80m9P4J21j15J34L1j05j29J54j89K7p8
5581a52p5L85j05%j87R6j04J55J89k66J16K6k87k8P6P0L11p1J7k11q9K18L4J5
5605A33n5l61L75k09K44q2K9j71m0K12j42OJ16k78L19mkk82M3L06k16K55l53K56
5629I9j56J9k51K96R4Jj04l9L87l54k7k7j02J8k8K50l3K85k48j36J5K8Q6q3J4
5654Do6j01J40N0j40K11p3k61K78L4P0j85k34K99k67K92K16l02j3j10J81o5J16
$$ y = [-96, 48, -263, -120, -194, -29, -53, -94, 13, -81, -155, 203, 98, -251, 175, -103, -22, -106, -71, -376, 137, 246, 244, 104, 100, 36, -8, 165, -61, 56, -2, 65, -215, 62, -90, 154, 137, -161, -76, -34, 41, 41, 155, 108, 47, 265, -92, -8, 69, -132, -21, -186, 165, 170, 86, -173, -294, 44, 130, 245, -27, 109, 94, 112, -87, -52, -62, -106, -106, -96, 195, -161, 166, -45, -102, 190, -212, -98, -11, 68, 1, -220, 132, 76, 152, -28, -77, -3, 118, 3, 137, 168, 63, -66, 88, -101, -74, -152, -227, 158, 53, 53, -134, -38, -142, 13, 202, -64, 52, 78, -209, -237, -161, -91, 220, 149, 166, -45, -134, 84, 118, 133, 78, -283, 92, -117, 127, 45, 74, -97, -137, 75, -67, -61, 55, -223, 96, 92, 90, -192, -149, 157, -59, 196, -157, 99, -57, -38, -289, 7, 101, 102, -2, -41, 346, -8, -35, -62, -164, -146, -174, 76, 43, 328, 80, -56, -41, -13, 73, -10, 4, -62, -163, -23, 27, -113, 98, 25, -236, 42, 76, 146, -39, -273, 26, -241, 51, 267, -35, -48, -158, 23, -42, 74]
5677G4j73k13K96PL12l05N3j1k8n4k6J98j39J41k7k14K7J65j63P9j21P3O1k5k06
5702b19J55o9m5J83J50oM2l48L24j27j74J23o1K19j66k29L30k25J8QJ1j13K85
5725F6N9l47M07k41J07K28k03j64J25J53j57O8k01K51k94L30k45J63Q2k23k30
5746b66J61J20q4J10j59M6L8J36j16P5k52M06k49J14l9k34J74J15M5L4k18K5n0
5769f8r2K40j62RL92k99k29J55R3n2k9L9n8n6MK62k07L4nq4M03j75j12j09J42
5794C6M9j61O0K6k11J49k39K46K46j96p8J95j01M4j24K65l13P5j25J52j47K71
5816A19j69K52l08N6K46k66K85j37o6k17P2p1J61L0J41j01j55K30L2o1l2R2m0
5839I3p5K29m50N25l12K71k34q7MQ9j62J01q8L18k07p7K01J10j12J6l7Pj93J08
$$ y = [74, -99, -312, -16, -9, 303, -2, 51, 40, 12, -42, -68, 130, -9, 132, 105, -109, -82, 83, -80, -1, -122, -49, 12, -13, -219, -64, -133, -178, 5, 155, 149, 191, -157, 167, 40, -134, -11, -72, 147, -19, -248, 82, -143, -125, -117, -106, -219, 66, 125, -222, 185, -56, 51, 279, 76, -88, 37, 190, 33, 101, -100, 151, -143, 187, -58, 105, 187, -36, -266, -105, 15, -69, 41, -118, -72, -34, 102, -14, 61, -191, 215, -34, 80, 41, -193, -19, 96, 141, 175, -43, -18, -68, -160, 80, -82, -73, 319, 20, -209, -54, 39, -13, -42, -3, -61, -117, -113, 149, -58, -24, -29, -113, 290, 115, 3, -106, 36, 85, -76, -16, 10, -201, -52, -291, -45, 201, 5, -73, 122, 21, 65, -59, 206, -107, -32, -157, -5, -152, 119, -50, 202, -106, -50, 196, -70, 215, 78, 12, -205, -133, -204, -43, -13, 128, 27, -128, 102, 134, 73, 41, 133, 93, 18, 247, -203, 322, 10, 281, 47, -40, -36, 53, -109, -8, -96, 222, 15, -62, 139, 249, 137, 153, 116, 123, -70, 38]
5863C8qo9K6j36K41o3M4j89J86kN8l01J84Q9j58K76l22J76m6p4j46L87k61j14
5887a84J14j06K28j00R7l2nj59J73m4R4n7n7j45K71J4m5j83j1L18j74n0k5J7J26
5912G5Q2K8j14j28J46j91J3M2K06q4j41N5L9j56K81l29J55L6J30j52J09k54N7
5935i5J5j56L14r6J01K0J1j69J07Q4j55j11K53j4j87K94j82j27J89J38k74J93
5957A53j41k47K69J23k46kJ85j07J13j9k38l6L8N8J59l38Q0K39m5o3J65k6q3k8
5981c7k10L02P2j89J59j6j84L26j06k87L25l23N3nJ74Q5n8k15K73l10J16jN1N1
6005D6rQ2K1l58J75J07j33K3LJ00l72K12K4K68j37n7j4m9O5J4q9j4j9J8L92n47
6031b48L01Pm9k39J36J40N3j18J54q3n3N9j24l5jJ64n0j22Q7O3K0j49R0l0m2j07
$$ y = [38, 30, -39, -13, -149, 92, 29, 73, -116, 70, 68, 126, -175, 9, 98, -60, 216, -106, 70, 24, -50, -196, 191, -70, -184, -70, -176, 52, -48, 49, 17, 12, -147, 26, -18, 76, 19, -38, -183, 88, 102, 57, -126, -137, 181, 7, -43, -68, -51, 75, 157, 185, 71, -57, 89, -102, -89, -47, 159, 75, -66, -11, 28, -128, 153, -176, -21, 15, 145, -7, 102, -152, -95, -80, -236, 78, -18, 83, 103, 114, -55, 52, 136, -19, -130, 123, 109, -78, 216, 34, -93, 96, 234, -40, 153, 12, -235, 34, 157, -89, -91, 94, -13, 100, 81, -157, -193, -155, -97, 62, -276, -196, 43, -2, -65, 100, 74, -9, -37, -247, 55, 127, -62, 97, 81, -103, 223, 117, -170, 155, -168, -115, -120, 54, 139, 81, -134, 139, -171, -55, -56, -5, 46, 37, 119, 140, -218, -43, 64, -69, -46, -43, 57, -315, -103, -79, 189, 52, -5, -19, -68, -3, 11, -78, -92, -111, -93, 299, -248, 53, 60, 11, -228, -92, 48, 101, -17, 137, 54, 1, 60, -64, -99, -100, 64, 14, -108, -21, 42, 62, -87, 3, -27, -69, -176]
6057a76L52q8L8j66m5NJ28k8q6K02j86L2J70j31l9J36n4l28M74k30Nj66L41r3
6081F7Pql46K37J20P2l6j93r4J75J55k1m5k2j43J12J91k91K08j86k74M74k7j11
6105B1k3M3n6rL10m54K5J13J5k22J76L90m90K04J0j58O3R5q2J99q5l6r5J06J5
6130G5j32K9j86K43O2p3J72l77L03j54j86K55k35K87o1j44J12O9j45J5J06K1l4
6153B2N0k44K66O5p0J51n23J29L00j05j62M9J22j31L2J21L5k13oK85m4j28q6J54
6177F9oJ27j02j95J54k25K22r4Oo9J88j02J29l42K92N7P6m63K58O8M2O3J36n41
6201b52K02J52J62k93J25j35J07J03j83N3j46J05j6J69k08J66o6k25M3J63j19
6222i3k08L15M1R4o4j60J26k6j06J20OJ58k26k6O1l3O8M8l31K90j71JQ7j34L13
$$ y = [-176, 176, 88, 126, -40, -85, -80, 48, 20, -66, 136, -50, -18, 152, 21, -18, 118, 64, -264, 210, -20, -15, -181, 160, 67, 74, 66, -280, -43, 77, 149, 113, -80, -174, 1, 156, 135, 90, 68, -75, 37, 228, -63, 145, -41, -315, 159, 132, 21, -2, 41, -15, -24, 286, -168, -143, -30, -15, -237, -61, 329, -161, 43, 53, -105, -42, 53, -29, 170, 85, 49, -46, 60, 75, -57, -28, -214, 29, 91, 18, 190, -187, 116, -38, -224, 31, -204, 83, 22, -122, -10, 59, -86, -71, 35, 56, 22, 72, -172, 94, 159, 89, 240, -283, -154, 146, 41, -121, -72, 50, -81, -49, 72, 107, -106, -112, 173, 129, 1, -85, 69, 63, 190, 88, -107, 47, -178, 44, -50, -44, -113, 75, -27, 102, -240, 52, 109, 185, -278, -20, 48, 90, 153, 289, -252, -50, 102, 264, -29, 96, -39, 68, 171, -12, 41, -105, 0, -16, 153, -55, 111, 45, -180, -137, 26, -93, -301, 14, 55, 149, 85, -75, 51, 25, -81, 39, 45, 203, -23, -49, 12, -21, 47, 95, -236, 54, -117, -116, -29, -163, 150]
6247A50J0j42l8Kr3M5K60j3j49j93J96m1k20L32j75J14RK6n0N6k63J52P4R0k61
6272a22J82J08j42Q5j0j21o1k8N6J98k29N7J88K10n43M5j80N3R0J13j18K82MO9
6296A86m12J60J09k0J21r5p4j26RK22k29J53P5K76l21J3p0K5K27l33Q4L60l01
6319C9k9q6J15k23K88j88K40j72K12j61K10k69K5r0J92j3l18J59J61j29K2K06
6341A91j53J77k92m2j7J08m1J2N7Rk5j91K49j29K7N2j14K06m45L51l8L06k81J00
6365G7j34K59j80r2J89k71K36j9j40O1K64l35o2J06O5j0j03k12J76K27j17J26
6387A11k05K93k77N0j09L35l16K18k64N2m7M6j5OK32l55Q7N4K41j21j58R7Q4j37
6411i8Q1o0n2O0P4M6j23kJ00l1J61j01PJ1M9l3j90J01J9P3k01J27K8l9p2P9N1
$$ y = [150, 160, 18, -20, -18, -111, -66, 194, 181, 32, -161, 35, -6, -226, 106, -69, 45, 54, 80, 30, 86, -177, -25, 49, 139, -122, 60, 168, 26, 111, 101, -20, -81, -109, -53, 145, -84, -27, 161, 371, -172, -127, -307, -254, -164, -51, -169, 113, 117, 186, -226, -66, 43, 23, 144, 49, -25, -151, -142, 80, -149, 4, 79, 355, 34, 47, -23, 2, 229, -104, -20, 340, 39, 10, -76, 39, -184, 104, -84, 156, -16, 196, 35, 245, -24, 1, -89, 103, 90, -228, -69, 92, -37, -15, 191, 38, 215, -77, -119, -136, -28, -69, -57, 0, 9, -16, -207, 42, -87, -60, -8, -122, 84, -361, -10, -48, 258, -23, 77, -57, 202, 22, -70, 119, -152, 84, 65, -75, -14, 250, -85, -147, -41, 24, 14, -89, -301, -125, 102, -15, 111, -94, 199, -78, -28, -137, 198, -118, 100, -164, -112, -159, -113, -128, -122, 110, -245, -158, -104, 137, 16, -142, -45, 39, -98, -17, -77, -129, -69, 5, 51, -72, -74, 26, -5, 156, 55, 62, 73, 122, 89, -101, 0, 19, 92, -109, 18, 46, 7, -65, 14, 65]
6438F5j92L72k05J04l13J66j35J81j37LJ13j5q6J22J35k38j5K07j7M3j27j16J45
6461F0J00j8k75J56j42Q4K3m13K76O9K40L5k89Q7n2q8j62J73L42m54M26l45J93
6484B6j25l9L90k19n6l64J92K38j43j00K75K6l6mr5O5k27J23j4m6K98j7k4Lj9
6509A08k28n7K71O0k03J26k23J28J53k10L31m71K80L6O7k61p9L47mj45j14J42
6531E4r7J21n3j26J38lK9q7J92j98j4j7O1j71K64j03K6r2l1K6L30r6j71P3k12
6556a57L41k63K9J08m2j8Kk23K56j74L07l36N4K67j90J76j3k4k22K13j15J79m06
6579b51N27l13j6J88j93M04k27l71J55j8L53O8l36J96k27M1M3l23K35l2m1k1K89
6602A30J04l52Q4J63r8j34Q6m4l9j8K47j18j44N0rK88n6m69J98J00l3J28M2l51
$$ y = [65, -127, 245, 40, 144, -169, -3, -138, 43, -94, -91, 22, 7, -79, 43, 178, -60, -75, 132, 115, 158, 31, -85, 60, 160, 142, -133, 23, -119, -35, -12, -425, -149, -80, 160, 195, -94, -7, -59, -147, -309, -136, 206, -248, 178, -167, 26, -99, -138, 252, 33, -23, -387, -195, 43, -100, -200, 75, 101, 65, 61, -34, 31, -196, -73, -87, -133, 165, 148, 124, 127, 108, -120, -177, 94, 154, -49, 77, -146, -18, 135, -75, 256, -215, 65, 101, 168, -93, -172, 175, 171, 26, -88, 54, -43, 78, 25, -101, 37, 34, 63, -24, 168, -30, -44, -61, 0, -171, 93, -10, 16, -76, -107, -81, 249, 153, -18, 55, -157, 184, -79, -50, 58, 16, -2, 0, -223, 33, -141, 166, -170, -116, 151, -39, 137, 124, 100, -122, 91, -24, 155, -251, 276, -37, -53, 135, -58, 346, 119, -252, -97, -115, 238, 306, -30, 166, -61, -20, 23, -300, -65, -97, -138, -159, 130, 234, -118, -34, 129, 31, -103, -17, -61, -100, -118, 129, 11, -133, -83, -92, 196, 140, -329, -131, -31, -64, 64, 106, -245]
6626b45J41J07k28M20M3n5o6j82r9L99k21J23k65q9J54J19M3L7j59Jj19N0L20
6649B29l11K96j12j87J7K87k10J18k47L54k40LM5oQ5J9k61J13r6M3J78k28M0J18
6673D7NJ03j56j77K21P7k55j26K56M1p2J1n8rj37K28J8j69L13k46K14o1j8j81
6697a31J32l08M6J22K65k50N9M7n4m5K38M7k79j41RK57j01K02k42K83k55l8K35
6720I8j25Qj58J81J5k93L79Q3k15k1j1J02m6k29P4J97j97J93N7n2J17J38k85M5
6744E5K3j77J24m4J22k30Q5K46l9l25K48J21M1j45j35J92j58k81J69QJ25M3n6
6767A2J08j11q3k4J72K5k7kN6k18J23n8j77L95k63J29p5j13l4J49j8j60L54o5
6791I5n6j86K67k24K82k07Jq3K29j03O2j87j31M37j46k25Q8P9lJ58j96J72k09
$$ y = [-245, -104, 3, -225, 195, 238, 183, 117, -65, -164, 235, 14, 137, -128, -217, -63, 56, 99, 136, -23, -22, -141, -91, 229, -82, 214, 102, -85, -68, 219, 9, 127, -120, 234, -6, -3, 42, 36, 121, 140, -121, -8, -104, -61, 117, -111, -71, 47, 52, 155, -1, -178, 43, 120, -135, -261, -5, 36, -36, -25, -83, -92, -229, -1, 17, -152, 161, -85, 129, 68, 50, -131, 1, -307, -261, -139, 126, -124, -65, -18, -72, -117, 121, 168, -111, -252, -243, 14, -87, 115, -127, 156, -99, -137, 98, -27, -19, -177, 4, 19, -274, 105, 188, -27, -48, -59, 43, -3, -232, -158, 39, -158, 35, 92, 40, 157, 295, 10, 55, 78, -99, 25, -19, 103, -127, -42, 204, 165, -160, 88, 209, 250, 105, -30, 162, 4, -277, -108, -100, 25, 68, 12, 120, 9, -74, -98, 74, 99, 72, 70, 126, -92, 31, -27, -204, 191, -72, 57, -18, -131, -165, -16, -34, -194, 160, 95, 39, -147, 120, -104, 178, -29, -28, -111, 118, 15, 77, -110, -241, 196, 50, -175, -87, -8, -11, 147, -49, 123, -86]
6814h6K30j77K77k21N3o0Lo1n5N1J51j27J1J59k12K04j21J16j14M3mm1l3J02j56
6839f8r8J32Q0k7j5j10J30J34o6q8l4K30j82J86q7k5O6k22P8J14j06O1k41K2J51
6864A5J27j97r4M32m30K27P4k4k89J35r1j75N00j40k87L09k48K48k53K33o4MQ1
6887I3l95L34r2n3L82k62P8k20K41K4k64L47j91r9K76j70J8j73M6K51k78m7j8
6910a72M42k89J88j42k01J27P3L0k18J92nn3j06K27j80L12k33J76n3m9K11m74
6932a97J47J13j79L17j29l06L32m7k05Q8J17k35K71l13J74M7j01R0j04R9m1j3
6954g5Q5O3J1J2j46l8J73n0j5p1Q8q0r8J36n9J39j01r7R1M2%p7j01J66j39K87
6980A46O5k18p4N9P1l7K44m29kK20j39K7m2L05j33J28o6k33P2j04J9K58r0n0J61
$$ y = [-86, 144, -33, 244, 23, 76, 16, 19, -42, -97, -46, 105, -22, -11, 148, -64, 140, 19, 135, 21, 64, 60, 19, -14, 88, -68, -166, -34, 46, 19, 4, -106, 24, 158, 92, 4, -30, 200, 18, 204, 117, 92, 158, -64, 14, 128, 22, 83, -158, -136, 15, 142, -55, -149, 283, -147, 80, 154, 130, -159, -24, -115, -290, 210, 70, -217, 92, -156, 92, -161, 72, 8, 12, 93, -302, 32, -60, -113, 269, 7, 85, -135, 106, 130, -134, 213, 22, -77, 199, 29, 47, -126, -80, 171, -107, -154, -172, 270, -19, 169, 27, -174, -47, 26, 56, -162, 30, 25, -28, -134, 93, -87, 225, -8, 168, 115, 66, 277, -197, -50, 63, -116, 201, 72, -234, 98, 51, -154, -66, 51, -184, 87, -226, -52, -5, -106, -16, -120, -21, -62, -75, 10, 73, 84, 96, -50, -88, 85, 35, 20, -51, 37, -43, -141, -5, -64, 75, -26, -123, -32, 10, 10, -67, -168, -2, -141, 146, 211, -7, -81, -22, 49, 12, 256, -173, -175, 45, -94, -67, -109, 196, 63, 191, 125, -108, -36, -140, -121, 137, 47, -3, 158]
7005A58j07r9r3J57m5j0n7J47k40K43j12l6rJ30K7j81K87k36K06j74o4M4RrpR
7031f2M22n85M09j65Qj36L3O4N9p8r1O1J06k11K04O7j38K60m25N6K90k32j26p0
7055b80j5L96p2r5M1p3j8N9K1K41k93j15K66rqJ92q9pK0L9k5O4m04J50Q5j17K25
7082A79l78O3J01N8J42Q0j19J4l52L69j15k17L16k01o1k33J70K61j24Q1j86L8
7104a14J92K7p5m1K6j39j1m4J78Q4j76J59k13J7J85n4j29J48J37m11L29k01J99
7127G3R0l19K19R6k04J12j00J95k59k3n1K39J13k94k7K48k15J30O8k54K76j43
7149c0k2J08k07K87m9o4k73K79Q2j41J04j37o8K74l77J5L12o0N9k82L29j76K11
7172A74j13j78K59k53L3K30j26J04j74j53kM35l01M1K7J13j07q1RQ2N1j6M7k85
$$ y = [158, 51, -48, -141, 16, -29, -39, -96, 51, -189, 54, -58, -94, -103, 27, 54, -127, 160, -76, 130, -44, -108, -64, -55, -64, -71, -62, 360, -225, 184, 19, 27, -109, -76, -12, 47, -31, -122, -61, 45, -166, 38, 105, -33, 227, -198, -142, 148, -84, -210, -280, -295, 101, 29, -66, -25, -98, -116, -57, -36, 205, -88, -203, 63, 54, 46, 238, 149, 142, 162, 201, 176, 240, -164, -14, 71, -46, 179, -199, -136, -35, 23, 165, 245, 126, 140, -212, 157, 42, -175, 141, -60, -121, -354, -184, 77, -47, 34, -152, -114, 78, 105, 30, -11, 15, -124, -135, -179, -1, 83, -93, 66, -147, -130, 55, 1, -128, 20, 157, -254, 75, -126, 73, 163, -156, 63, 159, -45, 67, -33, 162, -97, -120, -171, 68, 181, -113, -140, 108, -107, 23, 91, -163, 113, -30, -52, 56, -151, 136, 87, 23, -250, 29, 111, -30, 74, -63, -131, 143, -234, -219, 93, 33, 92, -190, 139, -37, 174, 61, -117, 142, -111, -78, 152, 26, 130, -44, -197, -199, 236, -65, -24, 3, 116, 9, -72, -63, 19, 70, 54, 101, -184]
7196a84M59m45m5J00J6QJ58k17K58j43J33J31q2j34j88K62k01K51j50nk9O1R6
7219A10j85k09L78m2o7NmK11k58J48j37J18p4J29o3L3r1j2N5O2RM0k52J35j91
7244a52j2P2J46L8l00J54P9O5j69J82j86N4k2J93L7j55r1K4O1J15j82o5N3j14
7268a75K91j71RJ07j56J86O4k95o8MR7K35k42j80K14J75N9q6j01J22Q7j03K0l92
7292b99P7L86%j07Rp7N7M4j44N3M0J15J6q9J55m15k2K67k3J48j71Q0M9L3j13J56
7318B25k66J7K00j18j07J83l14JQ9J27q3J70q3j1k02J69l2l8J14j41P7j66J61
7341b8Ol2J65j39J2rQ7K1k45J05K89r3k42M7J08r4rK6J90j9j97j16Q2R9k9n8R1
7368A8K05o7l32J31m4Q4R2K0p0Q7o7l4l0K9q6J52j30K11k70o5J62o9J71K3l68
$$ y = [-184, 275, -170, -215, -115, -99, -91, 67, -150, 108, -35, 98, 229, 147, 13, -175, 87, -114, 137, -13, -18, -47, 14, 110, -75, -284, 94, 52, -15, -10, -14, 197, -61, 87, -50, 68, -6, 123, 60, 93, 2, -10, 45, 107, 116, 156, -96, 39, -152, -164, -92, 54, 92, -208, -54, 25, 90, -79, 103, -83, -29, -51, 142, 179, 24, -67, -43, 18, 133, -49, -114, -61, -175, 116, -55, -46, 61, -95, 91, 155, -140, -208, -204, -107, 128, -114, -294, -80, 95, 154, 68, -33, 89, 176, 73, 93, -299, -222, 164, 164, 57, 66, -11, 46, 90, -54, -1, 39, 154, 170, 81, 236, -179, -201, 66, 43, 191, 20, 100, 149, 182, 69, 225, -41, -24, 176, 58, -49, 134, -180, -179, -90, 37, -46, 124, 41, 30, -172, -3, -35, -73, 41, -100, -23, -189, -28, -22, -54, 111, -28, -16, -25, 62, 83, -162, -57, 232, 139, -103, -56, 52, -42, -51, -25, 165, 146, -51, -167, -85, 14, -15, -73, 18, 223, 156, -176, -45, -89, -5, 87, 107, 37, 124, 57, 23, -7, 22, -64, 88, -42, 169, -101, -166, -4, -73, 98, 121, -247]
7393b47k7J08Q4J77r0j83J95J35m6j77O9L7j20M5q4P0j04O3O6J39q3m4L6M7J08
7418A74k65P5n6Jq5K09p0J13j15J42j69J94k83K27j85K43k02K35n3M6l05K7L8
7441f4L7j12J46p6J09K33m43M1P6k37N07K4j28j71m3j6J23k5l3Q3k36J2K00p3
7465f6J50r4p4J05j02o7L58k65K83l16J34j68K3J66J5j85M0R6k69L56m3l46K23
7488d6p6MM1L7J34K38j89m7j4k1l2j41Q7q2J5P2OK17k03j67O7O0K1j10L70j04
7514A37P7j10r9j79J48J83Q2r8m19K57M8k32M61k71q5J37MJ75k05j18j67K90j21
7537a05K25j39K29l24K11j29l2j44J41m3J83K08k34p2M4k63L57j13N8K88n30M1
7559a43N3J2j01N8J19j01J41ROk99J64M2j10J09J19J19m46K30k09K44n0N1J57
$$ y = [-247, -274, -166, -82, 95, 5, -178, 17, 152, 106, -71, -2, 35, -85, -40, -124, -54, -158, -95, -29, 110, 27, -17, 19, 66, 174, -91, -16, -72, -71, -156, 53, -17, 96, -19, 123, -46, 148, -135, 92, -93, 150, -52, 183, 130, 176, -129, -102, -64, -27, -139, 7, -69, 40, 273, -170, -129, -53, -290, 217, 241, 113, -58, -101, -117, 6, -19, -52, 31, -205, -193, 7, -66, 84, -10, -84, 21, -81, -148, 210, -55, 228, -88, 46, -122, -99, 67, 82, -103, -63, 33, -236, 120, 77, -269, -46, -122, -118, -77, -40, 94, 332, 143, 96, 82, 61, 29, -112, -25, -107, -92, -20, -14, 203, 0, -167, -100, -40, -19, -129, 241, 137, 214, 104, 5, -174, -26, 157, 239, 141, -278, -21, 27, -205, 256, -15, -100, 37, 41, 216, 11, -107, -274, 16, -105, 120, -19, 210, -114, 97, -32, -64, -208, -67, -110, 73, 281, 47, -25, 19, -244, 113, 0, 58, 346, -184, -143, -90, -78, -179, -121, -2, -103, 38, 47, 53, -246, -82, -40, -150, -41, 78, 197, -249, -19, -228, 16, -34, 17, 174]
7582A74L1k5n0l4L3k78j8j7P9J94j18O5K3r2j46K65j6r0k27j34J94J97p8L5K0
7607a3n3J70Q5l21K4J14J7j58j9M16o6J50l25M0k3k79Q0K07q0l2J9P6j5N5j32
7632f3k2l8M6L9K02m4k32L9K10j0l86K41n9J09n8J00l2k31J01j62J21n0J65l0
7656d4J40j59q2O8M2l5J64j52j14J16O5m6J91J4k22K93j52j92J09m1P5j58R6J04
7680H0k73K66K11n44r7O66k13o3j27M4Q6j98J46J31L0k17p4J08K13j71K4l8P5
7703F5J22k09P9l2j06PK00j81J5n1K64j65J78m34J89j3K5P6n0r3P0J94j8l22K2
7728a68L15l5J61j35k88q1K18q0%M1J11j10m3N2J43j05l8Q5N6r2M8j16k6j60J59
7753h8L0J61l01J02K21q5r9J06L4j20j93L22N4k7k1j39j17J21J03j70K7J46r0
$$ y = [174, 205, 180, 130, 96, 129, -149, -167, -184, -105, 89, -29, 36, 59, -33, -179, 86, 70, -20, -247, -381, -187, 10, -68, -33, -13, -66, 104, 189, -132, -108, 6, 23, -135, -154, 262, 196, 346, 21, 61, 38, -241, -161, 46, -34, -66, -47, 29, 14, 69, -63, -85, -123, -77, -38, 164, 120, -112, -73, 137, 127, -259, -18, -77, 32, -26, 74, 42, -189, -88, -250, -129, -179, -14, -44, 96, -63, -145, -77, -35, -70, 94, -58, -172, -56, 9, -37, 154, 168, -54, 239, 87, -105, 4, -37, 38, -120, -24, 80, -193, 73, 284, -260, -357, 309, 96, 33, -94, -50, 36, -162, -16, 115, 145, -72, -146, -38, 175, 4, 28, -10, 65, 187, -22, 57, 25, -81, -74, 126, -55, -40, -91, 173, 8, 186, -248, -59, -72, -47, 29, -21, -114, -44, 150, 132, -190, -168, 147, 112, 273, 138, -150, -231, -13, -93, -93, -52, 59, -51, -94, -42, 101, -4, -42, 43, 99, 7, 55, -61, -87, -247, -88, -58, 103, -198, -96, 125, 40, -59, 47, 81, -39, -232, 90, 144, 117, 96, -43, -160, -39, 64, -106, -79, 67, -23]
7776b3J15l27L46j5j23J11o0j8R2j05J90o1l40K60r0n6K16l4r5j9p1K8l2J79o5
7801Cmk4p9K04J7k35j2K31J59j96j11LM21o83M14J00o48M95Jq9R6k85K89l75J41
7826a67O6J2J66K3k39J19J74j48K97n75J3M66k66L5J68J16p3k26K10k16j96J49
7848i2J00j37j55K32J39k23J11j6J29r4J9q5K85Jk72J35l13J77M9L04m17K42K3
7871A42k98j55L41k07o2L27J6j41J81L7j22L4j42r5K9K99k04J10J51k39k18n2
7893b68L86j77l0K40j31R1L8j89j24J33r2R0k8J01L36m08k7JK74l8kK9l05K29
7917A29l8j33J06k43L87k13o7p8J0J35J60n2r6O6K4k26O8L7k3Q0r4K6j14L27j52
7942B6k49K46j93J91k01N5L0l5K1L89l17J4j41j51J20R1J99j86L5J48n8m2N3Q7
$$ y = [-23, 92, -235, 111, 96, -27, 84, 24, 6, 98, -7, 183, 122, -218, 42, -48, -104, 112, 78, -17, -36, -107, -79, -111, 68, 3, -1, -25, -104, 100, 117, -118, -130, 101, 260, 64, -47, -44, 377, -306, 108, 208, -440, 55, 56, -33, 63, -222, 67, -308, -167, -101, -89, 77, 100, -139, -20, 154, 6, 303, -272, -259, 207, -59, -24, 144, 260, 187, -39, 171, -45, -241, -92, 8, -129, -284, -52, 87, -136, -25, -41, 88, -6, 13, -72, 213, 214, -58, 77, -236, -59, -10, 294, -123, 119, 142, -156, -311, 30, -177, -239, 88, 104, -37, 144, 181, 59, 93, -49, -144, -115, 184, -20, 90, 241, 2, -216, -268, 118, -59, -89, 151, 20, 111, 149, -40, -164, -31, -123, -33, -61, 40, 376, -32, -59, -58, 216, 178, 176, 205, -100, 129, 91, -42, 64, -179, 208, -5, -72, -150, -140, -5, 155, 103, 7, 73, 97, -129, -61, -24, -47, 33, -61, -35, -149, 178, 26, -223, 23, -170, 21, -180, -125, -95, -130, -109, 280, -37, -23, -164, -315, -195, -104, 95, -91, -56, 92, 34, -8, 45, 132]
7966A32k55J74J72m77K38k%r1mJ35m4j28J55J39O3k50L00r9j63o7j62J72p2M4
7990i0Q4j18M16k15k15K70k91J52j4M8m8j52RK9Q0j07R2j99l2K74K98l34K42j03
8014G6o2n1j13J30k2R3j88Q7R0j73K05K4o0j0j23M82l90j0L2j49K58k8r8J37k04
8039f7K7P4P7J61j73j55K42J22l06J36J3j22N6l8K4J09l77K74m1j60J94k99l6
8062b65K87k10J48j46J87J76k86RK3N0j63m3K28o8K42l69K61R9k12L6j61J66K67
8085B56k83k4L9j54K20J3k39L00k81N3J48p5N9j6J53q8m2j17K71Q7p9p9k76J32
8109b2J65k27K37m39J7L36N4j58j15L58k00p4o8K62l20L26j8k26J52k25J25j13
8131a73M04j88L1Ok97J39L03j66p2m0q3M6K52j92PJ51Pk45NK1O1R5J01k53K38
$$ y = [132, -123, 51, 223, -254, -16, -18, -18, -109, -113, 22, -22, -150, 5, 144, 207, -43, 257, 158, -5, -72, -234, -62, -134, -90, -6, -124, 292, 77, -138, 132, -159, -7, -21, 27, -21, -173, -164, -135, -55, -162, -70, -269, -301, -27, 271, -63, 179, 76, 14, -37, -150, -20, -42, 51, -137, -50, 40, -133, 72, 96, 36, 26, -97, 385, -5, -15, 17, -132, 126, 98, 0, 137, -67, -40, 34, 111, 272, 99, -56, 186, 308, 2, 138, 151, 29, 85, 47, 71, 180, -197, 77, 36, -124, 70, -229, -265, 22, -188, -40, -186, 1, 177, -109, -100, -77, -27, -190, -233, -5, -73, 169, -200, 61, 160, -52, -16, -177, -11, 256, -27, -51, -12, -166, 54, 67, -172, 128, -153, -100, 48, -27, 32, 16, 169, 81, 39, -78, 193, 280, 201, 122, -154, -22, 143, -84, 153, -286, -269, 67, 121, -37, -152, 206, 6, -68, -136, 126, -194, 132, 114, -112, 40, -185, -60, -173, 231, 43, 74, 80, -217, -78, 225, 59, -13, -53, -136, -90, 162, -30, -23, 128, 135, -110, -105, -84, -23, 72, 173, -80, 158]
8156A58k15N9P2j36J44j21J89k94k0N9K80j37J17j52k16L52k86K47j73K4J03N
8178E9k39M2Q8q0Q1J09k58R9M9K29j62J24j53
$$ y = [158, -57, 2, 74, -62, 82, -39, 150, -144, -164, -105, 175, 38, 155, 3, -213, 139, -147, 100, -73, -49, 54, 59, -180, -138, -50, -130, -49, 60, -198, -99, -50, 179, 17, 141, -12]
8191a2
$$ Imaginary data points
##PAGE= N=2
##DATA TABLE= (X++(I..I)), XYDATA
0@%%%%%%%%%%%qJ6j6J6j6K4l2M0m8N6o9P7q8J04j23J47j70J94k23K54k91L31l73
34a98M20m74N35o00O69p43Q27r20J021j132J251j379J523j680J850k038K244k474
52a298K728l010L327l684M090m558N104n748O522p475Q681j0262J2432j5603K0695
67A1941l0175N3641k18033l72662L67690K47407O7496P5843o1708r8935J82218
78B24723j7427l20680l5544K07932k1770p283Q8882q6966m3705J55671p5159k08342
90a39668M8182N1766j04573P4342J22558o1882L4116J31154q8971j14890J6725
101c1141q5633n2206J89094R4816q5765L9009M1250j30725n9651N876q0093N2022
113a03147J69374l5817q5322R7621L0421q6108J1167m031n6574Q5059N4417j26401
$$ y = [0, 0, 0, 0, 0, 0, 0, 0, 0, 0, 0, 0, -8, 8, -8, 8, -8, 16, -16, 24, -24, 32, -37, 40, -48, 56, -67, 80, -90, 104, -119, 135, -156, 175, -198, 222, -252, 283, -317, 352, -391, 436, -484, 537, -595, 656, -723, 800, -880, 970, -1068, 1176, -1298, 1430, -1580, 1747, -1937, 2153, -2405, 2699, -3049, 3473, -4002, 4679, -5583, 6849, -8754, 11941, -18234, 35407, -182626, -555288, -187598, 59809, 127305, 203148, 141440, 42505, 224723, 207296, -113384, -148928, 59004, 37234, 29951, 118833, 31867, -11838, 143833, 68674, -139668, -91486, -39720, -144293, -69951, 52607, -9275, 24841, 155995, 67024, -47866, -31141, -116774, -168980, 20114, 114930, 29165, 68174, 109424, -21301, -80952, -75076, -155169, -103147, 66227, 30410, -54912, 42709, 73130, -12978, -1811, -5842, -62416, 22643, 77060, -49341]
125d9341J9782J90337J0043j07388m0223p6757l5929R5085k0650j00677J24955
136I237J60406q4941j28942n0276n0147O3374J25889n9145q1282J21178R2949
147A18300n9264l8510l9993o3803O9238Q9954o7188m1975P2008J1273k2413K2555
159E0182n5152q3220M5550M5007n0436o589M2102J5430N1318K8602j03474q0514
171a01194N4569M9390J619K1120K429K696N4740j0808j08827l3305O1383K5971
183A9783o955j0283k6289K4329N8327l5033p5094J3045L3981j5170p721K417N622
196a9041N4274L8711n6120m9425K2547P509j9564J300K583J6072N3164M059o6811
209a0742k9231J9555n78m205R086l153J7962M4990l869m8133j5385J4252J3873
$$ y = [-49341, -29559, 160778, 170821, 63433, 23210, -53547, -89476, 5609, -15041, -115718, 9237, 169643, 84702, -44240, -94516, -144663, -81289, 44600, -14545, -95827, 25351, 118300, 59036, 20526, -19467, -83270, -14032, 75922, 8734, -33241, 38767, 50040, 27627, 50182, -4970, -88190, -42640, 2367, -48069, -54658, -12556, 2874, 54192, 82794, -20680, -101194, -46625, 2765, 4384, 25504, 27933, 30629, 85369, 74561, -34266, -67571, -6188, 19783, 12828, 2545, -23744, 585, 58912, 23879, -51215, -38170, -4189, -19359, -27080, -24663, -19041, 35233, 73944, 17824, -31601, -9054, -1545, -21109, -19809, -17226, -1154, 52010, 56069, -10742, -39973, -20418, -20996, -25201, -16115, -19268, -1306, 43684, 39815, -8318, -23703, -9451, 4422]
222D422J3879r001k7406J3752M5403R141k9786k7725r265J3762J1977k4354k4722
235c9923K4487M4975J2356k9722m4447r290L3711J6199k5289j3887K4124L4493
247B7787J5572k6801m3981J238L6816L395k5924n668J4696K3970J6825k3656l8607
260b4338P550K7297q597k0067J07J2096K5002J7148k6005l1965J1311J7332j0943
273d072j0986Q80R811K6036J2428k9055k6582J1334J4377m163j0411n747J1853
286d297K7968K983k7993j5325J0622J1686o43j4619j2967J7181L0344O0k5436
299d36j4586N114J6502L680k3939j4011K5496K8034n463j9004j2814K14J7896
312F683N544k6108j1815K6469K2417n050j5250j5495m62K1963L207k8062p459
$$ y = [4422, 18301, 9300, -18106, -4354, 41049, 50190, 20404, -7321, -16586, -2824, 9153, -15201, -39923, -15436, 29539, 41895, 12173, -32274, -41564, -7853, 8346, -16943, -30830, -6706, 27787, 43359, 16558, -27423, -26185, 10631, 14026, -11898, -17566, -2870, 21100, 37925, 14269, -24338, -16788, 10509, 1912, -18155, -18048, -5952, 19050, 36198, 10193, -21772, -10461, 6871, -4072, -15058, -14178, -4367, 21669, 34097, 5042, -21540, -10206, 4171, 8, -10403, -16150, -4297, 23671, 26654, -1339, -16664, -6042, 5644, 5001, -9618, -22585, -5404, 24940, 25000, -436, -15022, -9908, 6594, 10274, -13665, -27676, -2180, 25854, 20391, 1387, -11427, -11213, 6683, 12227, -13881, -25696, 773, 23190, 18140, 2890, -12605, -13067, 8896, 12103, -15959, -23418]
325b3418K5412J6374l564j0496j4743o15K0674R88k4452m575K1948J4089j742
338A5880j1806j4699L347J7066l185k1825l074J9647J4511l466j3823j1141N913
351f655J3903k520j8905m139J9235J6963n522j5594o476Q222J1872k610j9747
364a1973n590K1597J6616r651j5209l012O841J0394k186k1040o151K2678J6133
377A9447r838j4199n004O215J3494l337k2906l306K2418J2123q275j0841p785
390a1794N888J5834m194k0873m1J7955R952k514j1939j0175J2094J6943j1564
403E572j8584L788J1820P673M120j3801j2891J4268J2434j6091j1437N991O621
416e17J1145M831k1789r756K2562O688j7590l186M490q98J3389M215k3799l725
$$ y = [-23418, 1994, 18368, 14804, 4308, -10435, -11050, 9624, 10612, -13840, -18415, 3533, 17622, 15880, 4074, -10625, -7278, 9788, 6603, -15222, -18296, 1351, 15862, 12396, -1427, -12568, -6655, 7248, 4728, -14177, -18316, 919, 17882, 12360, -3234, -9710, -1488, 10384, 7774, -11973, -17563, 4034, 20650, 10999, -4210, -7222, -381, 10013, 7827, -13213, -19364, 3314, 19447, 9609, -4590, -9594, -3379, 10115, 6778, -16128, -19434, 2984, 15107, 6832, -4009, -11794, -5906, 9928, 5734, -15139, -15180, 2775, 12727, 10213, -1726, -11901, 193, 17136, 5572, -13012, -9224, 2596, 10269, 14389, 588, -12303, 1965, 14399, -1692, -13129, -7138, -517, 10628, 15459, -6330, -16086, 6476, 13164, -4426, -7612, -3122, -4020, 9369, 13584, -10215, -13940]
430a3940K3156j643j6557J187m69L26J8747j327k5771N519K3461o512j1011K695
444b139o672L817K3067n964k2893R043J4443j0073n460j544q890J3120K0181j7466
458B570k1476J1683J0939k204K663q445j0826J8782J3653j7751p570J3629M456
471A0103J057j048j8220l653K5171M883j9490l442L940j402P035k761k0201K106
485a5922K0342m272j0079N064j958j092J3344n945j7862J2222J8834o793m651
498A232J849q858N322J8816r041j7094R900O454q568L182R84r289J1641J2551
512A9081k0877j5468J5421R937r62J442q922q479J4951O802j8135m806J2502J273
526C760l924k982j0064R68J7051j394k0211k332J1489N046J752m005p518O316
$$ y = [-13940, 9216, 7573, -8984, -7797, -8266, -7940, 10807, 9480, -16291, -10772, 12689, 6177, -4834, -2139, -8811, -4994, 18073, 12109, -10784, -1741, 12702, 2629, -2831, -4375, -13265, -145, 20036, 2570, -18906, -7223, 3716, 1512, 4175, -4270, -15096, 3686, 17339, -412, -7982, 5647, 10103, 11160, 10112, -8108, -11761, 13410, 18293, -1197, -4639, -699, -2101, 4934, 2173, -18028, -15922, 4420, 148, -9931, -4867, -6825, -7917, 5427, -518, -18380, -6158, 12676, 5883, 1232, 3081, -5777, -455, 18361, 9320, -7774, 2126, 8580, 12, 3194, 4178, -5111, 6530, 19081, -1796, -17264, -1843, 8094, 7132, 8574, -348, -8827, 6124, 12926, -5209, -10015, 2487, 3760, -164, -3146, -13210, -12242, 4809, 3415, -16796, -19128, -7639, -2593, -841, -4846, -12364, -6048]
540f048J3740j758o431L559L539J287J867l500k429Q836O055p156q847n305j318
555c909P695N589p279p997L29M38P15R65m534q82Q950J702r655l384P840Q160
571D743L525o669j1787J988J2955J793r671l522N152N626p69q338n467P062R051
586E672k995q965K83J0230Q169m970j0097j116P345N468q71n741j558O045N40
601G439r243l236N856J081j253j133p446l226J0177N051n526n51j14n794L437
616d481Q541l268k370Q904n22o868J645k515m799J0857O585j5117o506J0991K391
631C468l771l53p553k496J4485J625j4085K572J1774k054k763K0n904N493J4002
646A4460p917j4516P109R169k173R5m033r077N699O550j0681j382J1542r89o420
$$ y = [-6048, 7692, 5934, -497, 3062, 6601, 7888, 9755, 6255, 3826, 12662, 18717, 11561, 2714, -2591, -3909, 3786, 9375, 2096, -5901, -5572, -5134, -4419, -3454, -7988, -8870, 80, 1782, -7873, -11257, -3417, 4743, 8268, 1599, -10188, -8200, 4755, 6548, -3123, -6645, -1493, 4133, 3364, -4974, -10441, -3379, 5672, 2677, -6288, -6005, 4225, 12394, 7424, -2673, -3789, 3556, 9024, 8153, 2412, 854, 6899, 7439, -1804, -5040, 816, 1897, 644, -489, -7935, -11161, -984, 4067, -1459, -2010, -2124, -7918, -4481, 4060, 792, -1578, 7326, 6804, -64, 1581, -934, -5733, 5124, 11709, -3408, -9914, 1077, 3468, -303, -656, -8209, -10705, 3780, 5405, -8680, -6108, 5666, 3612, 849, 869, -5035, 458, 14460, 6543, -7973, -864, 8305, 6132, 6227, 2194, -6883, -1184, 5366, -5315, -6697, 4845, 3856, -2564]
661b564J772n437m123J2416L930j0489K279N030o933L210Q111q946l982J0027
675D301l896o040R007r55q831R855M307j4995N06J1711m381k471O244p485k751
690e874J6664j185j7133M483Q770o806K508M900r688K056J2647j0785j3225J0708
704a960O425n831K784j531r972Q920R567j1803m812J0780q96m852N404k732m280
719d789R881K450j1101J220N802m997J206M960o903j619R467k949o517M458r44
734c75m853P093K815q402J480O205m589m53L695o325L38J0743m100r736N787M426
750C749m717K562P59q153M074R142p884n944Q370R35l575L792l411o795Q304N760
766F968r949j614P998k133k871L713m278l551Q792J604q229J020M627l138J295
$$ y = [-2564, -792, -6229, -10352, 2064, 5994, -4495, -2216, 2814, -4119, -909, 7202, -1744, -5726, 4301, 405, -5635, 3372, 2417, -6414, 3441, 7748, -7247, -6741, 4970, 589, -1882, 4362, -3123, -5874, 10790, 9605, -7528, -3045, 5725, -1081, 1427, 6327, -3361, -1305, 11342, 557, -12668, -1960, 4465, -1366, 1418, -113, -10085, -1165, 8402, -3401, -8213, 2567, 1671, -3181, 2223, -509, -4789, 5092, 7542, -3559, -2339, 3463, -1534, -328, 4632, -2271, -3890, 5577, 2628, -3889, 569, -375, -5228, 1865, 4680, -3722, -2242, 3963, -626, -1079, 2616, -3709, -3371, 7372, 3272, -6464, -677, 3749, -968, 1594, 2353, -5800, -1726, 7416, -468, -6412, 1958, 2893, -682, 3110, -301, -7096, 1208, 6968, -2981, -4595, 3403, 1270, -1601, 2112, -2166, -5717, 3075, 4679, -3550, -2530, 2097, -1041, 254]
781B54L006n324j198P044j180n392K219J725k022L011N65n284N87M631j601j755
797g14O20j164J118L309k267m428K201K770n07k39j406j527L280K295m012k172
813b843K681J227L60l20l218p94M990P14m077o47J720K87J255n47l486Q49M771
830B922p66l489M43P52L47J641r35l510J449L620p54k603m64N59J398J352j847
847A15k029J080K138l58j393p96P98J466K39j203j563K98K521Q80k588j838K061
864a72J674q46j017o21j45K060J572l057j525K278R51p54j80j182p75L166Q27
881B254l683r35L124M94j281J14j435k86L020J174l626m00K205K80m11K2k087
898a457M45L315l68l470q9J860K70j6p43j585O39K380l35k194L06O70Q43N14j128
$$ y = [254, 3260, -2064, -3262, 3782, 2602, -2790, -571, 1154, -868, 2143, 2708, -2576, -1989, 2642, 1041, -714, -94, -1258, -140, 3169, 902, -3526, -1325, 1445, 938, 699, -707, -2234, 1046, 3341, -671, -2843, -162, 1065, 1425, 1105, -2113, -2907, 2083, 2797, -1280, -1927, -207, 80, 1335, 788, -2698, -1849, 2922, 2156, -1333, -890, -138, 209, 1850, 915, -2595, -1146, 2474, 1720, -883, -1347, -788, 610, 1962, 115, -1914, -834, 1304, 946, -447, -1243, -445, 1021, 1260, 57, -1506, -1208, 1313, 2193, -395, -2233, -172, 1502, 656, -361, -982, -1127, 933, 2505, -552, -2077, 201, 1152, 398, 218, -964, -1739, 1427, 2254, -1429, -2364, 760, 1254, -27, 87, -1348, -1634, 1386, 2560, -1066, -1466, 739, 1019, 608, 630, -1457, -1012, 2303, 1935, -1535, -1624, 236, 506, 490, -253, -1838, -1199, 1181, 846, -1348, -1042, -372, 471, 985, -143]
917a43j323J555K071j154j671k99L78J959L90k293j368J595J204n06m69p63j97
934a034K162n8k506nK815L77o00n97j727M10L099k7l298R7J581p49n41L47j368
953a622j68K387q21l582J056K714m29j16k98j393R75L131m19k205R06J392q83
970F25N12J177k118J64K527j255l148J403K198j069n20j59k564N65L144j33k419
987a070Q99J06q09Q39M59j532J018K177k282k522J292J246M85L22j164k314Q66
1004a984K092r75k89Q67O6L26O76j319k10K822N60j797j41L61J34K063k52l014
1022a4m36K223n88o53Q19j883r92J795p66k579K275J833k021l82M35k024J145
1039a813M724j697k983K123l82j767K712J242l176J088K198l365j505L450r7j095
$$ y = [-143, -1466, 89, 2160, 1006, -665, -964, -586, 1373, 1763, -530, -1898, -303, 901, 395, -74, -837, -1034, 1128, 1070, -1436, -1441, 1374, 1751, 1151, 554, -1173, -763, 2336, 2309, -989, -892, 689, -60, -601, -254, -1622, -1790, 597, -224, -3806, -2750, -36, -465, -581, -879, -2272, -1297, 1834, 1415, -790, 116, 1508, 625, 1137, 2314, 196, 360, 2887, 1632, -1516, -113, 2085, 1016, 496, 337, -2227, -1662, 1482, 1349, -1070, -171, -65, -874, -35, 424, -1108, -90, 2087, -195, -2717, -1425, -179, 306, 628, -536, -2850, -1984, 108, -867, -1156, -289, -223, 103, 779, -540, -750, 2072, 2632, 835, 694, 1055, 1189, 3252, 3000, -14, -450, 1773, 1185, 532, 1351, -532, -1524, 271, -495, -3074, -799, 1034, -987, -1369, -934, -2958, -1813, 2911, 1214, -1769, 354, -28, -1795, 917, 2159, -1017, 71, 2269, -1096, -2601, 849, 752, -343]
1055c43K030j559l597K835K948k768K75J796k536J39L465j816k204L315J85k920
1071g55L98J056r19J605K21l936k04L291l44j209J072j469j266K502N70k125J817
1088C05J560k576o71R20q22K242K450k635k916J782O1j022K791q3l035J569M71
1105C91k298N99K722j297n54J965k046j810L786J042k451Q67J9k442J936K685
1121C114l281j180K724o42j694J519n78j475K196N8l870J470L405j240j101M87
1137h8j881M1L523n40k394J906N95j786J00Q07r97J638R50k687q82J949K01j3
1155D42Q58j324j004J320p3j316J789M86j298O38O73k579M66J944j107l62J362
1172I15r94j017K646n87k972J207J514j534J002J082k731N54L159k056k353K568
$$ y = [-343, 1687, 128, -3469, -634, 2314, -454, -179, 1617, -919, -780, 2685, 869, -1335, 1980, 2165, -755, -357, 699, -220, 1385, 1606, -2330, -2534, 757, 413, -796, 276, -1193, -2459, 43, 613, -1512, 305, 1865, -711, -1382, -462, -1284, 958, 3408, 773, -2143, -361, -300, -1322, 1469, 1386, -1649, -80, 391, -1907, -1308, 1414, 117, -437, 1528, -518, -2328, 1458, 2500, 49, 916, 935, -1507, 429, 3114, -167, -1347, 1377, 735, -959, 560, -18, -1493, 703, 761, -3109, -1639, 1766, 526, -575, -88, -1969, -1928, 1595, 1055, -1339, 567, 1162, -624, -524, 283, -714, 924, 1874, -813, -1695, 254, 455, 442, 1300, -24, -1028, 292, 219, -1097, 692, 1178, -120, 518, 1191, -1388, -922, 1022, -85, -447, 915, -79, -1096, 1550, 963, -2009, -802, 712, -822, 180, 1262, -1469, -915, 2244, 188, -2165, 403]
1188D03P14j247O93k93k421K322K687l141j176K009q37l84J772j735p89L314M3
1205A934l503N43J317j263J499Q30k370N89K028j896p29J654m92j140K419p70
1221F50k237J938J098j801M20J008k558N28K992k221j239K779j271j175K404o17
1237F98l219K511J962l458J96L162j954m15K295k888j921M577O11m050J503J864
1253A474k847J544J953l416m91M355j925k970K915L71k160K732l01l933K028L085
1269B414k910p00K576j724o16K408r80k758K823J091k945J560J056k401J171K165
1285B230l141r01L175n89j608J818q89k161K691R66l049P30J905k205M98K153
1301A623k605n96L739j346k979K544N70k300K252Q90l628J100L544k781j571K725
$$ y = [403, 1117, -130, 563, 270, -2151, 171, 2858, -283, -1459, 550, -287, -671, 1101, -634, -1423, 1891, 1934, -1569, -1026, 291, -972, 527, 1357, -1013, -424, 1604, -292, -1021, 633, 141, -999, 1420, 650, -1587, 351, 1449, -352, 68, 1076, -1482, -954, 2038, -183, -1422, 1357, 86, -1089, 1315, 698, -2521, -10, 1952, -1506, -1310, 1852, -102, -517, 1778, -1110, -3031, 1546, 2157, -1893, -390, 1474, -1373, 171, 2124, -1292, -1783, 2572, 647, -2323, 592, 963, -1197, 1535, 1234, -2699, -671, 2414, -496, -1196, 1380, -344, -960, 1448, 468, -2290, 533, 1624, -1321, 239, 1295, -1106, 65, 2230, -911, -1812, 1363, 774, -834, 984, 95, -2066, 625, 1591, -1458, -728, 1177, -1028, -530, 1623, -982, -1578, 2161, 815, -2164, 380, 950, -1350, 902, 1792, -1836, -736, 2808, 27, -1544, 1181]
1317A181j296j174K726p83l219K790K449m059J98K483j837k32K745j861k455L619
1333A275L96k635R83R53k139J276J453k486o27L012j120j529J582m40j563K305
1349F96M32k484P24J648j167K6J166j709l27K309o08j675J028O07q62Q02j23j948
1367a465J090J880j798r01J699p51m60J908j147j795J933J318j986k64J154p11
1383b96L88J249j880q03K421j7j768O47M42j190J071J079k020o05K065r3j158
1400d68Q91k43r42J480K9j814M72J672q18m89O00m88m68J389j0j829N29J225o78
1419D0m34K84l38m2J149n17j243P74O91n55L29k06m18L31J188n77q96N31J29L14
1439E34M2n32n09J005Q9p89l38L17k59N97L11r16k85R50l8n40J26K24j62L35N81
$$ y = [1181, -115, -1289, 1437, 654, -2565, 225, 2674, -1385, -1187, 1296, -541, -773, 1972, 111, -2344, 1275, 1671, -964, 19, 972, -1167, 109, 1562, -924, -1551, 1461, 341, -1188, 394, -46, -1609, 696, 1128, -1356, -632, 1016, -151, -125, 1041, -668, -995, 1314, 706, -969, 59, 666, -196, 606, 483, -1465, -375, 1505, -293, -1194, 505, -246, -706, 1202, 55, -1740, 193, 1511, -475, -739, 415, -296, 92, 1341, -539, -1342, 1079, 1062, -706, -59, 383, -807, 264, 1343, -677, -1282, 783, 690, -468, 423, 180, -762, 718, 747, -1067, -595, 1077, 259, -230, 370, -118, -586, 803, 793, -1036, -507, 718, 40, -394, -110, -448, -490, 659, 142, -1101, -327, 364, -191, 138, -68, -486, -155, 1033, 456, -440, 91, 220, 534, 576, 44, -465, 540, 629, -160, -498, -181, -440, 157, 468, -448, -733, 217, 179, -361, -235, -11, -173, 162, 743]
1460G43j349J6J683k84j093L4J93m48R88M45j750K95J116n43o21O52k64j50R35
1479E98k30j289P69R84m41m80M85p41J31J252k97j629P96Q48j139K89L74o35K62
1498i3J114j350q01J263N31o78L58k41r87J134Q49j173m99R17j69m55N43m05j74
1517c16J036n22j248L22Q91k39K08J88j245M4J208m4J6j96l8j42Q50o31o70J162
1537F34L02j086LM48q55O68J223j301j074J216q5m53O99J8j060R43M75j465NJ546
1557H01m60n10O98j135n73J874L87j618K05M69n66J80J081j511J38J317l91j572
1575a186J164O39m25K98j78j515R28J055n00m07L36l69k0Q43o72r03J342K13j238
1594e95J14M50m04R60O14j809k25J384l82k06R11r78o81J350K94j486P60R19j244
$$ y = [743, -606, -590, 1093, 809, -284, -250, -57, -505, 483, 928, -822, -527, 589, 46, -575, 77, -187, -337, 598, 368, -921, -152, 832, 391, -89, 396, -345, -214, 1038, 741, -888, -92, 756, -383, -94, 280, -355, -93, 1021, -329, -1130, 133, 664, -14, 344, 103, -884, 250, 1099, -74, -573, 344, 175, -280, 263, -142, -316, 720, 198, -1050, -728, 163, -76, 132, 320, -925, -881, 327, 283, 299, 103, 65, -77, 773, 142, -528, 634, 936, -150, -147, 301, -554, 114, 1337, 36, -1038, 178, 93, -360, 339, 357, -703, 240, 715, -750, -745, 801, 341, -169, 529, -606, -1179, 695, 1082, -536, -331, 138, -428, -248, 833, -678, -540, 777, 386, -1186, -22, 617, 192, 490, 312, -1203, -275, 780, 280, -127, 209, -160, -180, 663, -9, -912, 430, 643, -595, -481, -31, -435, 525, 1139, -670, -895, 489, 107, -99, 812, -166, -847, 503, 797, -689, 71, 990, -254]
1613b54N5P09j387Q5J889m67j606R55J39r55J196N56j526L43J370j124r67J315
1631C26j53n56R72n55j095J224J274j844J79O33o97q1J280r84o82J285J78j496
1649g92O24L71n34Q13J50j514K18J391n66k60M62o91l86J267j89r36R18L65j155
1668d44J46N45p96M27J202j124p01J124m38l53J224m67j496J057J092j430PJ029
1686F04n74o7R65j152j207K107K70j671L02R77r94O78R85j647l95J598l23r54
1704d98O26R3m79O12J84j414M54J226p43k51L80m50k49J190m57j048O79O30n99
1723a14k49M74m39K91P50j154k50Q00k0l25M72j60l78P52nn48O3N1m92N61K00
1744B80o10l83J133P4j006K48J42O3N8L83r02L13P34Oo88K58n67J85P35k15o55
$$ y = [-254, -199, 510, -877, -792, 1097, 630, -976, -21, 118, -837, 359, 915, -611, -268, 1102, -22, -989, 326, 173, -383, 589, 34, -1061, 163, 1437, -407, -228, 405, -292, -373, 907, -77, -759, 526, 704, -792, -168, 203, -331, 482, 632, -882, -664, 727, 161, -99, 363, -328, -714, 553, 364, -572, 346, 711, -444, -298, 247, -549, -122, 1080, -44, -745, 379, -59, -412, 812, 345, -1151, -94, 998, -432, -425, 604, 30, -37, 928, -224, -1431, 676, 946, -725, -423, 554, -440, 238, 1223, -424, -819, 779, 456, -498, 128, 221, -258, 354, 538, -876, -422, 804, 61, -190, 190, -260, -509, 681, 224, -824, -145, 485, -114, -363, 111, -328, -37, 713, -441, -691, 109, 89, -236, 236, 76, -302, 450, 445, -103, -40, 11, -481, 80, 280, -330, -713, 420, 494, -512, -264, -122, -59, -1, 382, -520, -207, 527, 533, -155, 103, -464, -279, 456, 241, -414]
1765d14K56O27m15n74M43p5j01M55o3p27O22N26n26j19Nm4J47M10l06l58K01M12
1787C82m52l6qj4p8K16J3j65J30L58j40l55J6j12J86N7L76p79J99M77j09m67M24
1810A19k63J04K83j75o31N74N49l29m82j65j33M09N30l11o86O03N32o68J74k22
1830a88l22P44pq1p04R52j2n20R9m73r1J085m2r41L28K75k46K46J23m78j89R54
1852E12k54n79P28l38m06O41K1q64K98P66n99l13N90l13j93P64k39n34L58O35
1872F81j048Q8N97n67PR06q32o89J087J50o74M56L58q19N25P13j365j1R58k84
1892B37p26O49l14j58M93N8o27J67O11n27o1M57j90l74Q75n29n88O13N2k71L79
1913B26K6q21O23M42p00j91M60j74k44O41l53n15P68L45p54J7P80q13O1P64n00
$$ y = [-414, -158, 469, 54, -520, -77, -152, -253, 202, 139, -588, 34, 560, 34, -85, -80, -124, 23, 433, 127, -231, -30, 382, -70, -106, -114, -128, -206, 10, 23, -142, -12, 346, 206, -149, -133, -245, -59, -2, 374, -405, -206, 271, 162, -305, 119, -144, -40, 243, 68, -563, 11, 560, 231, -251, -416, -549, -140, 390, 79, -607, -4, 528, -140, 34, -188, -510, 234, 227, 146, -558, 394, 382, -138, -39, -512, -603, 482, 440, -501, -173, 102, -144, 102, 225, -253, -442, 512, 258, -321, 407, 69, -337, 304, 325, -539, -241, 525, -74, -387, 203, -110, -303, 461, 222, -312, 46, 681, -367, -279, 318, -249, -242, 664, -168, -857, 230, 380, -294, 162, 520, -299, 226, 939, -426, -437, 521, 237, -489, 160, -154, -312, 181, 239, -388, -221, 390, -137, -198, 259, 69, -305, 570, 41, -547, 66, 118, -153, 226, 252, -569, 54, 496, -204, -395, 65, -109, -353, 288, -65, -580, 188, 533, -221, -204, 576, -237, -176, 588, 88]
1934H8n39R99k81p66P98j71o79L37P31j259N77P29p04l12N37j92l80Q72J04j010
1954e21O38M37o22k44M84j37j78O56p90l36P52J99p50K52K37n64M15N71n19r6
1974a16nQ5J57J41j59k83N81n7n81J92K17l21L82J42o66j78J044o74j39K61k06
1995a83m4L99O6p68N13M29o51k0L24k07K23L57j52o05K32L59k91L27j78n60L87
2016d3M15n66n02Q48J5m51N85j48n22N60K01n16J30J85k98K6M61k41k58K68K42
2037C91o93J12N17l90P8k85Q3o9M94r7m99M51j96J84J50j79l11N26j07j08j35
2058h3j21K59K92j04l79j97L58J06j8j1j61j64M21j72k73M5M68k43k94K51p1N4
2080c7L35p8n29O8J70j87M17M4l65q7M81j92m37L81J08o1K1k43l6K46K94l06r
$$ y = [88, -451, 548, 267, -499, 299, 128, -551, -214, 517, -742, -165, 564, -140, -452, 85, -107, -487, 385, 489, -521, 117, 554, -68, -312, 172, 35, -143, 513, -277, -613, 139, 338, -412, -160, 77, -487, -72, 499, -20, -116, -121, -36, 121, 262, 103, -180, 401, 344, -237, -45, 172, -149, 233, 375, -291, -469, 575, -99, -238, 23, -183, -227, 172, 238, -530, -17, 412, -239, -259, 65, -142, 81, 438, 286, -319, -87, 272, -19, 308, 130, -430, -43, 372, -194, -696, 152, 167, -284, 301, 153, -369, 191, 392, -124, 6, 191, -107, -81, 380, 139, -119, 149, 391, -302, -190, 327, -63, 15, -270, -187, -256, 238, 141, -358, 93, -103, 81, 231, 52, -259, 267, 160, 52, -83, -204, 55, 347, 243, -136, -333, 25, 131, 113, 102, -59, -223, 198, 26, -247, -202, 266, 23, -271, -20, -91, -37, 298, 220, -309, -241, -71, -258, 159, 203, -162, -249, 232, 40, -397, -16, 92, 31, 52, -191, -227, 19, 313, 7, -2]
2103bK9j09n4N26j01m03J26j30L4q6K40r2M00j15o86K17L87L3k08J06j98Q4L23
2126C21k90j30lK77p9M7j32J2J35Q9j20k58O0K24l10K95Lm98L32K59Pq93P85m6
2150H7j39P8qk16L89M90o64j72K40l08R2L44j65k48J34L75n29Q0M37k99P3J58
2172B29m40O4M42ml92K5R3l56J20M29k91N6K52k08j33Q2J63k63J57J86l51j24
2194b64N07j52k71K82mo1k8M09p79L91M12o22O5M04m28K70J24k58k57J55K62k64
2216a07K33l44j7L77Nl27K05K35m97K81J51m22j6M66kn12L72M06o12J86K32m83
2238a90k05Q54m10j02K50j10n07M02M58q48L87N77n53l15P16l34k38J01K31m02
2258b38L11pl31R3M98j09m46M61l79p9L49lk49J31P0l23L56K10l45l24P99l20
$$ y = [-2, 27, -82, -136, 390, 289, -114, 12, -118, -84, -170, 70, -22, 378, 263, -423, -206, 181, 214, 6, 112, -86, -2, 321, 31, -99, -102, 175, 96, 143, 11, 23, 158, 247, 127, -131, -71, 153, -157, 138, 141, -357, -25, 234, 241, -652, 133, 87, -52, 26, 18, -198, 191, 681, 17, -155, 85, -223, -131, 213, 48, -200, -66, 309, -220, -140, 297, -2, 71, 229, -211, -147, 295, 291, -101, -76, 17, -339, -219, 210, -81, -25, 227, 19, -114, -32, 131, -132, 25, 211, -140, -264, 243, 91, -180, 102, 98, 37, 9, 418, -361, 30, 442, -180, -115, 289, -139, 131, 255, -3, -260, -105, 157, -107, 126, -218, -235, 142, 147, -180, 25, 260, -237, 44, 195, -227, -243, 223, 221, -291, 81, 487, -125, 61, 293, -190, -395, 459, 49, -53, 197, 87, -420, -18, 440, -408, -21, 556, 3, -312, 404, 70, -168, -67, 164, -238, 73, 66, -265, -172, 326, 217, -229, 232, -147, -226, 123, 120, -129, 2, 72, -251, 105, 315, -30, -354, 445, 125]
2280A25k17J80j34j06L47O6n11p9O79o19J61K24l89N5M10N3o45J90J22j27J21
2301i4J90l88J16N95k51m68M43L6l94N49j12n44J66M86o66K16M08l47k12M71p
2322A93n66L97R8l97J27L42l38K76N15q12m8K82R8m37L77P5l89M65l90Q1l8P2
2344a7k9k27L32q5j36K85n9j45R6K41k29J77J02k63j27M39l17J25J08m79O8K20
2366H0M3l08K20L29m81q7J83k14J31r3L77m31J63J96k07J44J43m40J49M27n30
2387b06P6K93Jk33p3l4K2J50K42l47J45O6j77L51k54K40m01K36J33o5j1k05L05
2410B54l21j69M06j72j95J38J18k25J12r4J31P6R9k96J97M0jk17J02Q1J17j75
2432Fj55J63N4l09K09J91J0Q0k55Q5k4j98L24q0j23J45j64J59k39P1J95k65J25
$$ y = [125, -92, 88, -46, -152, 195, 261, -250, -329, 350, -269, -108, 116, -273, -218, 192, 245, -400, -210, -88, -215, -94, 96, -292, -176, 419, 168, -300, 143, 179, -215, 334, 222, -322, -156, 330, -336, -120, 288, -59, -271, 200, 193, -373, 24, 122, -275, -148, 194, -144, 132, 647, -165, -213, 69, 167, -270, 107, 182, -207, 258, -132, -51, -89, -17, -46, -273, 59, -26, -162, 123, 64, -81, 15, 256, 27, 204, 306, 43, -84, 355, 38, 163, 271, -208, -140, 80, 123, -185, 35, 364, -117, -204, -21, -235, -104, -197, 180, -251, -88, 108, -99, 45, 188, -252, -103, 324, -206, -130, 163, 164, -69, -142, -176, -154, -4, 238, -109, 36, 102, -75, 276, 22, 262, -139, 97, 230, 165, 154, -51, 254, -67, -236, 170, -2, -197, -59, 59, -166, -54, -148, -17, 59, 158, -138, 59, 99, 98, -119, -17, 64, 181, 6, -149, 14, 68, -241, -32, 159, 169, 249, -6, 79, 55, -143, 181, 101, -22, 123, -41, 118, -121, -50, 145, -120, 5]
2455EQl2N6K76J88l43j80J4o9M05l17l70L04J55j76L13l74J51J72j47k72J20K26
2478A13J46l85J98j02k31O36k10k77N6M93o30L20j0k78r5M49j14l46K13Q1j38
2499a11L37o3k69L70J5l03k16L05l1k04L20m3m4N5m3j39J30K51l57k74L99k25
2521a40k04L68L22m27J56k37j11K99J21j83o7L2r7L3J72J82k66j81J64j55J63
2542e6L90j41j5N0l60J60K79P4m01J79l60L3L47p8j90j71M93l83k35M36ml38N46
2565B55q4j34o5p5rq7K94P1l65J88ml9P1J25l09J49J50k39j5M24m48q8J98p0p5
2590a81M14k44k12MK38K37l77k6L91k97N7n1L3O4j0m1j2q0K91l04J21j90J46n7
2614h6K35p0r7L67k19k61N3n6p1O34k42j69m8J30l5o3J15l6J60k07j59n0J90J3
$$ y = [5, 13, -19, 37, 313, 501, 158, -22, -8, -77, 328, 11, -359, -55, 100, -76, 237, -137, 14, 186, 39, -233, -113, 113, 259, -126, 72, -30, -261, 375, 165, -112, -56, 437, -193, 127, 117, -161, -256, 193, 79, -267, -54, 27, -111, 226, 163, -106, 264, 279, -24, -240, 65, 34, -170, 150, 107, 63, 118, 75, -64, 66, 317, -40, -314, 85, -140, -344, 24, 346, -81, 75, -162, -273, 26, 147, -36, -103, -71, -168, -135, 37, 219, -47, -228, -64, -219, -56, 334, 193, 178, 228, -132, 28, 307, 381, -20, 159, -201, -168, 179, 101, -89, -260, 233, -150, -385, 51, 47, -291, 255, 171, 37, -28, -103, -112, -199, 95, 166, -199, -11, -15, -54, 17, 142, -167, -18, 132, -107, -122, 302, -146, -234, -36, -106, -181, 233, -11, -223, -219, 19, 256, -121, -147, 244, -53, 4, -47, -14, 50, 40, -1, -13, -93, 198, -106, 15, -175, -29, -86, 149, 79, -18, 349, 130, -131, -78, -134, -205, 429, 187, 18, -30, 100, 65, 2, 117, 81, 241, 34, -125, -175, 15, 28]
2638B8L0l6j33q8L91k63j3K58l10l4m6L15j13k18K38K28o10N76k38J68n5L65m89
2661d9j34L73ll12J95N5k30O7L29l12j4L06k41j01L29K2m77J63Q9j52j94N35k58
2684a4L3j67R3J07Nj09P3J1N5r2K18k16p8K81j81J69l26o0K00j2k24N12l35J7
2708d0k8j23K35j06P9k75K83j41P8R0j51P0ml10N61k74Q0n7K6J06j69O5J23j16
2732Bk52L86j41k4K93k88P1L4k92j4K74J79n3l14j2J61l2J29pj06j71K47m7J8
2756D1Q7n8L8q6m5p0R4J91j9m09K17j99Q0n7J64J40j50k50K70j1K5Q2j33k28M50
2781A64l63L69k41p3j10K90K96m10O9J01m3O6l09K07P1nk63O4r7K95j92o6K42
2804F2j44J30j45K20j63J01j06j70J52K99k52q2J20L15n09L61j40J39k57K25l32
$$ y = [28, 58, 22, -111, -199, 192, -71, -84, 174, -136, -170, -216, 99, -14, -232, 6, 234, -376, 200, -38, 130, 75, 440, -49, -183, 190, 187, -125, 70, 125, -105, -38, 291, -21, -35, 271, 30, -71, 258, 280, -197, -34, 55, -97, -291, 244, -14, 19, -148, -55, 52, 57, -52, 21, 32, 87, -5, 213, -3, -81, 200, 19, 188, -138, -198, 2, -10, -234, 278, -57, -40, -68, -191, 44, -62, 17, -258, 25, -116, -38, 52, -99, -29, -33, -343, 218, -56, 24, -33, -7, 99, -70, -5, 118, 2, -250, 136, -5, -29, 264, -24, 47, 81, -211, -225, 49, 228, 175, -139, -151, 10, -22, 107, 100, -6, -177, 70, 23, 41, 128, 70, 108, 22, -23, -93, 1, 192, 173, -236, -19, -218, -138, -195, -31, 109, -41, -291, -21, -32, -7, 75, -58, -286, 164, -199, 170, -71, -144, -254, 36, 332, -78, -9, 92, 49, 115, -194, 13, 84, 79, -184, -120, -217, 78, -114, -180, 62, -82, 48, -97, 123, -40, 61, -45, -215, -63, 236, -16, -98, 22, 337, -172, 189, 49, 188, -69, 156, -176]
2825a76P1P3N2j87p1L25j37K59l16R3j18J96j71j4L20n3m99O27m33RJ7K24k58
2848a67L75n0l86K11K78k34p8J01N9k83M38k26k25J5L91r7l36K96j97J17J40l51
2870b09N3K35L65p22M22m4k31J21R4o9k2j1J12k1j35J99m38L6O6J08j5L77j62
2893A09k39K11j36O6m0L66m07J59P8k92%J08j93J58K63k18q8m6lJ29L4R9k43J28
2917CK29k21L29k70j07o8J7J39k89L41k11K0J91j07j05L29k28j4J17r6M7l23L86
2940A09r8k62M22K87o03J16Q4j16m30N47M4o3P5ol91K08N7m7r1L33j81j42P1J39
2964F2k83J53K65k0n01L81L9k04K70j28j29K58k1m6j62J39J1j24J95j15k40Q5
2986a15L32l55k6J37J6j85J34N2R0J24k71J20N5n2J4J19m98M57q2Q6l15Q5J27
$$ y = [-176, -105, -32, 20, -167, -238, 87, -50, 209, -107, -14, -132, 64, -107, -121, 199, 146, -353, 274, -159, -150, -133, 91, -167, 208, 158, -228, -17, 261, 27, -51, 50, 109, -174, 264, 38, -187, -172, 219, 122, -214, 82, -115, 2, 142, -209, -156, 79, 444, -278, 144, 100, -131, -10, 84, 15, -7, -18, 94, 73, -62, 137, -301, -265, -199, -91, -106, 271, 109, -130, 81, -55, 11, -29, 337, -70, 89, 167, -125, -125, -17, -210, -52, 211, -7, -95, -141, -144, -15, 19, 118, -125, 3, 232, 11, 340, 70, -37, -105, -88, 51, -238, 103, -108, -88, 103, -4, -109, 220, -8, -22, 95, -1, 46, -277, 109, 11, -251, 171, 458, -145, -29, 55, -61, -491, 56, 100, 37, 112, 106, -285, -77, -20, -67, -158, 175, -6, -148, -77, 62, -221, -68, 197, 177, -324, 57, 96, -108, 162, 34, -95, 163, 142, 96, -66, 73, 84, -40, 155, 40, -200, -115, 217, -138, -164, -27, -11, -196, -62, -10, 80, 204, -67, 53, 108, 56, 70, 189, -309, 148, 66, 152, -163, -78, 49]
3009D9q0q0K30k38kJ33Ll2J00m4p5j14M88l87k6OJ45j74K88m5k76J22Q4j99k7
3034a51L67j13r2M4L1o1j38L32j13l06P3J97j36M3r4J8K26m4J02k62J92p9P5J37
3058B48l53k5P8L61j75Oj5j65J95k59M3J51o5p9j14K11j50l3K11R8j38m2J78k53
3082h6J55j64j62J87O2k9j8M68l97N3j16J33k24J28K4L8l07M50j75J17j3l42K10
3105hL7r9J20L6P1k19n2L23r5k91L29K0l13j35L68P6j2J09k45j44J81q4QJ29k41
3130a31j19J27L06m29L74J57m38n7L32k07k8K21j97o7j7L49j91j86J70k26Q4M04
3152B31l18J32K29j19l22K48N6k03j12J28M6%l3k16K05m9K80k50J59k13J77J6
3174G2M7j29j5K86m25K62p8O8K6N4q7m12J53K24O8l38K52r9O8K67n23K87K93m42
$$ y = [49, -31, -111, 119, -119, -121, 12, 15, -17, 83, 39, -36, -150, 338, -49, -75, -69, 76, -98, 190, 145, -131, -9, 75, -124, -151, 216, 103, 11, 55, 86, 25, -113, 219, 106, -200, -127, 70, -66, -23, -117, -99, 127, 83, 185, -77, 115, 36, 111, 248, -105, -130, -52, 309, 134, 140, 125, -40, 155, -104, -61, 90, 25, -54, -168, 43, -107, -140, 71, 169, 31, -11, 167, -86, 69, -95, -257, -70, -8, -37, -55, 413, 16, 69, -47, 86, -138, -10, 14, 52, -255, 195, 20, 137, 124, -218, -8, 29, -70, 50, 86, 157, -62, -114, 209, 114, -177, 152, 172, -141, -276, 92, 168, 156, 265, 20, -124, 57, -27, -19, 110, -131, -250, -123, 183, -246, 128, 285, -153, -210, 122, -85, -113, 108, -89, -156, -173, 176, -15, -201, -31, -257, -173, 231, -87, 45, 274, 155, -167, 81, 137, -66, -178, -50, -4, -4, -37, -253, -48, -97, 183, -67, 92, -121, 56, 72, 119, -10, -25, 261, -164, 98, 20, 88, 114, 168, 81, -331, -178, 46, 114, -224, 28, -71, -3, 264, -259, 28, 321, -121]
3198a21J40j02K28J6m7L6Mk50M9J6j9O2p4n5K62o6j17k19K92j06j9K40k81Q3K01
3223A53j85J0j07K83K7k86j19n9M29Pk19p7K19m2k03K18K3Mj31J55k02m9M10k95
3247c6%L1r9l8K26q9L4j20O4j35RP0J56p8J11J91j66j22j32L25j85J68j81Q5k87
3272a98L33q0J01j93MJ5J41j78p1L11j82p2q1L05j91K48k95K32k58M8O4O6j36
3295f7r7J20p1mJ43N4j68K69l02MO8K91k27q7j00K55p9L4n9j43L75p8l3mJ85m49
3321a70RL51p0j29l8M7j6N8m2J41M0k05r2j48K83j66K91k85K86l69L56j16m7k7
3345e8O7o6J5j7M06l48j31L7J18p9j69K03Q4J18k50N6R2L2K5l82J12R6P6J61l00
3370a02K75o3j86J01K4o2l7J75q8j27j6J11P6o4K39k83j28J20j12K64k9M9j84
$$ y = [-121, 19, -83, 145, 161, 114, 150, 154, -96, -47, -31, -50, 12, -62, -117, 145, 79, -38, -257, 35, -71, -90, 150, -131, -48, 153, -32, -22, -129, 154, 181, -105, -224, -283, 146, 153, -66, -143, 76, 34, -169, 49, 72, 76, -55, 100, -102, -151, 259, -36, -36, -5, -104, -142, 84, -5, 29, -91, -27, -162, -153, -83, 73, -5, 106, 297, 131, 9, -123, 202, 17, 185, 4, 89, -198, 135, 55, 156, -37, -33, -18, 123, -55, -126, 185, 3, -69, -150, 155, -36, 212, -83, 149, -109, -61, 3, 69, -67, -164, -44, -115, -119, 24, 78, -90, 179, -123, -119, -51, 240, 13, -74, -174, 81, 2, 36, -23, -166, 209, 131, 98, 94, 279, -170, -161, 190, 120, -9, -47, 0, -16, 42, 0, 141, 181, -24, -116, -264, 19, -147, 144, -141, 145, -224, 132, 16, -31, -58, 9, -57, -42, -59, 347, -1, -132, -95, 23, -56, -225, -22, 62, 180, -70, -14, 78, 110, 135, -247, -135, -39, 37, 198, -102, 173, 110, -76, 25, 49, -13, -50, 125, 37, -90, -106, 5, 81, 17, 256, -27, -155, -35, -147, 117, 88, 137, -47]
3393d7n5L79k83p6J01jM9k66L2K31j79L02j52K43l89J82po0J0K50j60j05k5l8
3417f4QK51j64j01j97L12J6m79M07j5K17k57L5J90j23j12J19k01PJ58j83O6O0
3440e0P3o9J49o3kj37L22l58N1n9M4o7O0Q9k26K51J65j40K31k19K2k41K41Q1O0
3465B08k24J2L9P5j28o4K11p4j71M8J12k54Q4J7k38K00L25j73l92N91N7m67J61
3488d5k25R9M0K29q1j75K31j87kJ14m9k90L51K75n00K00O6O6o4k04J71j62J96
3511E4j95o7K87N4k32J89j35K49l55J45k03K38k04K48O5r5K6l34L33N5j65K25
3533A83J23k16K2p6M7k45M72l65J47k10L33k95M3J58l11K22K1o5r1M32l31l29
3555c31M79K1l27j60M66l91j04K42R6j05L00l99j06N17j08k52k5L20l10J71J66
$$ y = [-47, -102, 277, -6, -82, 19, 18, 67, -199, -167, 64, -115, 187, 35, 278, -111, 71, 64, 4, 14, 264, 104, -1, -26, -64, -56, 195, 31, -70, -267, 45, 61, -418, -11, -26, 191, -66, -31, 159, 36, -76, 43, -158, -151, 7, -176, -110, -50, 23, -46, 103, 40, 38, -99, 223, -135, -84, -143, -99, -166, -106, -17, -243, 8, 173, 33, 264, 45, 67, -174, 67, 148, 208, -16, -4, 35, 110, -18, -82, 129, 55, -116, -68, 44, -210, -126, -109, -347, -147, 178, 5, -387, 204, 261, -206, -45, -270, -171, -131, 98, 17, -158, 73, -114, -116, -2, -51, -341, 10, 285, -215, -15, 51, 117, 53, -151, 20, -142, 54, -141, -208, 79, 133, -99, 90, -45, 204, -151, -6, -209, 29, -175, 73, 138, 43, 69, -265, 68, 123, -42, 183, 306, 90, 112, 36, 83, -162, 310, -55, 92, -118, 215, -80, -37, 121, -190, 32, 53, -12, -103, 329, -2, -331, 148, 169, -158, -318, 148, -243, -347, -105, -9, -114, 186, -213, -319, 198, 90, -162, -187, 133, -177, -6, 160]
3576A60J4J7r7j15J5J4L34m51L21j44l27K48K20j46l1J18j66j43K04K20l69K18
3598A14j33R8j26M60l26j94J93J05k42O9K4j85K53J47j15pl6k55L3J42j33p6K42
3621E2J09l07j31M53k30j53K24l9M2Rl42J26L54j59o7K6k58J83K4L79j76oj14
3644aJ70k26J60J02k35K95k72k8K21j90j87K65n1K5m05K98j21J66O0j79J93j86
3666a26M33m67J82q1M3L0K1j2k8M9k19L81k65L3L28j79k79ol0J04J76Q1M0Q0m17
3691a28L2P6M6l4k42K83k27J62k8K39k0L8p4l4j37l1O1kK8j10R1n5J79k0kl12
3717b21q7K47l38K87J07j0l4l7J56k84L58m4Kj06J28j10j30K10k5k9J39j24j35
3740h0K87K0j84j18L73l08j4J92o9O7j25J80l75K15R5j60j57K56k16o2J12ON6
$$ y = [160, 174, 191, 94, -21, -6, 8, 342, -109, 212, 68, -259, -11, 209, 63, 32, 150, -16, -159, 45, 265, -104, 114, -19, 79, -47, 413, 87, -107, 86, 191, -51, 18, 42, -143, 110, 257, 142, 135, 99, -156, -123, 19, -114, -190, 52, 161, -146, -277, 176, -54, -207, 17, -22, 20, 29, -313, -187, 167, 8, -59, -33, -291, -108, -84, 295, 119, 113, -1, 169, -57, 103, 205, -30, 265, -7, -35, 186, -4, -191, 74, 23, 48, -357, -59, -180, -14, 46, -133, 60, -126, 307, -160, 22, -59, -16, 14, 35, 23, -5, 44, -175, 206, -59, -26, 302, 123, -156, -162, -192, -88, 88, 169, 209, 289, -128, -96, -20, 26, -8, -250, 33, -194, -32, -60, 179, 159, 197, 123, 89, -48, -79, -18, -20, 8, -102, -11, -66, 113, 93, 91, -221, -308, -61, -399, -112, -5, -15, -49, -86, 70, -214, 144, 100, 102, -4, 124, 14, -116, 94, 69, 40, 179, 55, -80, 207, 227, 43, -75, 298, -10, -24, 168, 99, 166, 41, 221, -154, 61, 156, -4, -161, 95, -121, -183, -71, -65, -9]
3763ip0N9K22l85J78J71j9n0k9l62J89J71q9Nl0J04j01K0mJ13j10k8k13M98l37
3788a06J36N1k23j79K98K17j46j90J12J06R6K0m34L00q6j00L7k3qL03j88k0J95
3811A68k53N4J70k31J63p3p5o6J80j7j52J80J2j81K86j64j40j8J49J41j17O4k4
3834E6j34R2j5j48J51K71Jj32k01K01l23J00J18j35J55J41r0k29J08j70J78N6
3856E1M8j2q9J81m5P9j00k76K18J06k30L8L2L21l30l8J64P4j6k66kO0K26m49R2
3881a63K92Q5j32j97J02p8J65J64k91K32m4j47J34j00P9k41Q1K69j55p1nK67k07
3904C9k61L42O3r4k42K71k07k4j12K86l9oJ76j18j9R4k95K11Q0j66J5J07K8q7
3928D2q7N8q1m9m2J50Jp1J91j07j41J34r4J16Q0j63M9M0K3q7J96J4m0j55J28M9
$$ y = [-9, -79, -20, 202, -183, -5, 166, 147, 97, 68, -294, -105, 66, -23, -18, -48, 56, -45, -25, -29, 84, -26, -54, -267, 231, -106, 30, 81, -142, -321, -23, 194, 48, -142, -30, 76, 172, 192, -242, 58, -28, -128, -91, -114, -122, 181, -7, -27, 168, -85, -31, 139, -92, 71, -2, -77, -143, 37, 20, -132, 48, 60, -121, 165, 1, -139, -157, -8, 133, 16, 80, 56, -78, 14, -1, -149, 2, 273, 274, 142, -59, 142, -181, -81, 37, -98, 57, 198, 108, -121, -13, -183, -5, 51, 99, 87, -2, 179, 134, 213, 113, -163, 55, 161, -69, -31, 1, 322, -8, -46, 118, 192, 176, -90, -92, -32, 194, -255, -163, 129, 214, 82, -115, -13, -91, 74, 238, -53, 179, 135, -12, 122, 22, 101, -140, -59, 210, 55, -16, -21, 246, 39, -222, 120, 183, 89, -153, 118, -89, -113, -225, 61, 22, 16, 192, 74, 55, 149, -146, 65, 145, -21, -6, 101, 129, 42, -45, 13, -68, -117, -159, -9, -8, -79, 112, 5, -136, -2, -96, 20, 100, -63, -14, 26, 49, -38, 158, 172, 132, -23, 105, 154]
3954A54k95K09K2k35j23L77j23L97m10o6LL7m6j61K40J43n9q4J04j13j53O0p6
3977a98R3L7k4M0J25j50j50L52K18l54k33K80r1o6K18j01K50j58o3K8j85J29j79
4000a82K19j48Q4J69pj15J40j03k64J26m1L48o7R4j40k7L9J30qk28m3qO1Kk08
4025a77M48k02j78L96q5j57r6J07m6K35k35P1L1k6k63L80n29K48j11K31l2j82
4047a72L97j7p7l56K65k35J09K9o8Q1k16K90j77K43j23k20K98K6P1P0mj12j95
4070i3M05q1l08K1J97l87L85M3m68J57J37J31k8K2l22J67M0J48k91J79J2QK15
4093B89k58m9j9j34RK08m15M57K8j62J82j56lj22J80j33J38M6r2jm7J25J61l04
4117g2j40K47K54j95j46j03L28Nk69J67n4k3R4j45N4O6k37N6j37J48L11l7l93
$$ y = [154, -141, 68, 90, -145, -268, 109, -14, 383, -27, -93, -90, -53, -99, -260, -20, 123, 64, -20, 84, -29, -182, -122, -198, -105, -68, -92, -52, 73, -77, -227, 125, 343, -11, -244, 36, -55, -121, 97, -4, 246, 88, 25, 53, -132, -3, -182, 37, -111, -27, 142, 135, 20, 160, 57, -207, -81, -122, 226, 159, 253, 113, 86, 125, 255, 247, 19, -24, -32, 29, 31, -177, 271, 69, -109, 287, 202, 45, -51, 56, 10, 245, 10, 81, 112, 86, -177, 203, -326, -78, -189, 42, 10, -172, 225, 208, 131, -225, 40, -195, -86, -57, -125, -44, -260, 30, -147, 96, -27, -247, 51, 77, 148, 218, 214, 102, -93, 312, 231, -77, -56, 141, -246, 139, 182, -286, -129, 8, 139, 111, 133, -189, -22, 18, 166, -125, 54, 66, 74, 289, 31, -18, -37, -171, -162, 46, -369, 88, 116, -46, 136, -20, -23, -145, 35, -98, 40, 86, -6, -7, -54, 71, 232, -72, -212, 35, 289, 94, -52, -155, 173, 178, -91, 76, 22, -1, 93, -52, 2, 68, -169, -113, -250, -102, 209, 172, -221]
4140b21N3L19k32n1L46j36j49J28n6N3k27J85J2J41k63j0j78L76k40m3J57M7j03
4163i2K12N0j69r0j76M98l38j36M64j11k11K98k28p7J86k39J96M7J04j05r4j32
4185a43J62J98q9j31j05J53j54L48j77q0J28j49N6J60k64j27j65N72j27J53k26
4206gO5j8J2j76J02q0J20J3k1J55l6m5k54j6J83K9o7k9J64l2k14L69k68n2RP1
4232b3l9K76j83Mq8p1L0p5K54P0j05l9j32j18K74j2j31K58l79K13L95k31J15o0
4256B03j32j99o7K56k58L4L22j31r9O9q3n8R2qRo6Q2J16LJ83m34l89K80J26K5
4281a24K83M4l71K27l4mN5j03J18j43J18P1m2j99o2L51j07k7jj09jj8J09l0P2
4306G3j95L53k83J9j54R5OJ25J8k49K79k33L47l46J77J46k57L09j91r9q3K8K71
$$ y = [-221, -168, 151, -81, -132, 214, 78, -71, 57, 1, 54, -173, 12, 24, 165, -98, -108, -286, 90, -150, -193, -36, 11, -92, 120, 170, 1, -89, -265, 233, -105, -241, 223, 112, -99, 199, -29, -106, 80, -159, 37, 84, 188, 83, -11, -143, 19, 217, 128, -3, -108, 45, -109, 239, 62, -18, 110, -39, 17, 177, -87, -214, -379, 193, 66, 219, -7, 58, 40, 52, -124, -22, -102, 18, 31, 10, 165, 129, 84, -170, -186, -3, 26, -41, -70, 94, 62, -152, 217, -51, -103, -94, -23, -62, 214, 31, 35, -53, -124, -94, -169, 85, 155, 50, 11, -121, -239, 35, 23, -108, 150, -229, -16, 379, 148, 263, 203, 71, -128, -195, 61, -197, -163, 159, 28, -71, -2, -85, -143, -51, -59, -50, -116, -34, 82, 85, 268, -166, -555, -275, -149, -124, 159, 203, -168, 59, 25, 21, 76, -27, 91, -52, 66, 137, 95, -104, -166, 185, 78, 51, 50, -59, -60, -78, 31, 1, 73, -122, 231, -52, -33, -187, -92, -86, 39, 57, -192, 87, -146, 201, -145, 32, 178, -79, 230, 39, -60, -143, -115, 156]
4329A56k55J88n2J8k62Q8K81k50n5k7L68k32o8J76q4k44J77O3K8L1j42J56j3j22
4353g6j23M75j41k51K36l1k14m6J62r2P0p5R4Qj34J08j35J49L3J40k10J84j4m6
4377G1j74J78lJ86l87M01k52K53l90J74n9J14k14j96L17K0J5km9J70k50O5J10
4400I8j54J01j34J75N8j41j61P1pL50j55j7j74J25k00L86l03J44K2J32j07j92
4422h3K35k98J54j35N2j22J06Q6P7J0N4k26J76p9j62M1J00Q7J49l27K22K5l8j62
4446e8j6N3k3nP0r1j01N9K39j58K4k5j52L27l55J31K31j67l1K28l6j83k03O4L18
4471A40J26j20J5j27J26k23R0O9r9q1j64M40j39j74K60j74j41k4K92m5k26K45
4493F6M2q2j26K42j46J29j30L9mj55J57P3n5k20k8L09k10m8J31j6R2j94J36l4
$$ y = [156, -99, 89, 37, 55, -207, -119, 162, -88, -143, -170, 198, -34, -102, 74, -10, -254, -77, -14, 14, 45, -97, 59, 46, -76, -199, 276, 135, -116, 120, 89, -125, -171, -9, -101, -31, -106, -12, -4, -138, -30, -165, -16, 17, 157, -53, 131, 117, 71, -103, 75, 72, 258, -129, 272, 20, 273, -117, 57, -2, 112, -102, -298, 19, 39, 54, 52, 3, 173, -77, -12, 98, -56, 45, -89, 86, 144, 3, -158, -87, -94, 256, 101, 84, -90, 35, -165, 221, -82, 62, 84, 216, 109, -83, 152, -146, 8, -127, -75, -197, -91, -5, 72, 82, 136, -90, 86, 7, -155, -114, -14, 73, 222, -105, 117, 142, 104, -58, -74, -21, -44, -49, 21, -70, -171, -112, 127, -31, -7, -32, -184, 143, -212, -81, 150, -17, -48, 180, 144, -39, -242, -178, 140, 266, 146, 161, 34, 160, -63, 27, 96, -3, -84, -248, 192, 53, -121, 139, -35, -176, -200, 92, 47, -179, 66, 108, 26, -100, 142, -4, 125, -5, 34, 30, -125, 32, 105, 50, -170, -198, 111, -99, -147, -16, -32, 60, -134, 2, -32]
4517c2Q4j45K60m9j45J43O0l56K63q4k4k7J21N0r3NK2l3J4j76L91k18j55J67k43
4542b00J85J90p7pJ70k47j38K75l1m0j10J20j5k47L99j15l45J12J56o3J47j07
4564A2m6Q7L0m03K47M67l37j59J09o7J36n8m1M2j84P9K22j74J67j27j05p2K24
4587D9p2K60k89NkJ83PP2k01L0L1p2J80j54k24n7N9K54r0q6J64p3qL2K71k35j39
4614a05n8K09l00J65K51j90o4M9J42k02J14j0l00L24J44k52J76l6q7J04j56M4
4636c8K16l37M07m16K63l2j22K7K35l80J20j2k1O9l2oK49m15K74q5J18j20q6p5
4660a99K37k25K85p4n9ll07K13M2m1K41l09M76j83l62K85j20K86j78K01l08n4
4682a56J64j52J05N0J08L9j45J42l7j24j77K38m40M56m5p8n0K04J28k74L7J50
$$ y = [-32, 52, -93, 167, 118, -27, 116, 176, -180, 83, -1, -25, -52, 69, 119, 26, 31, 53, 20, 34, -142, 249, 31, -124, 43, -200, -15, 175, 98, 91, 261, 14, -124, 151, 120, 80, -30, 90, 75, -172, 227, 112, -233, -121, 35, -28, 119, 12, -34, 53, 83, -320, -73, 394, 57, -102, 7, -60, 76, 18, -23, 19, -165, -86, 136, -38, 129, 2, -103, -175, 49, -23, 237, -52, -47, -49, 134, 141, 213, 12, 42, 73, 1, 181, 27, -197, -254, -195, 59, -31, -117, 47, -26, -34, -2, 269, 34, -105, -163, 46, -254, -89, 162, -28, -92, -43, 99, -103, 11, 1, -299, 25, 169, -83, 93, 57, -30, 74, -82, -38, 178, -159, 248, -168, 95, 63, -59, -32, 203, -177, -57, -69, -90, -21, -53, -59, 190, -225, 49, -36, 82, -38, -124, -199, 38, -187, 98, 24, -35, -38, -345, -132, -90, -131, 110, -199, 277, 94, -268, 17, -103, 183, 5, 206, -102, -156, 8, -144, -39, 11, 119, 158, 13, 155, 118, -6, -183, 55, -385, 71, 26, -52, -102, 102, 230, -44, -7, 143]
4704A43j09On4K6o2k25K18N0%j49K58k7m7N5k49N8M1M1P9j68o5K17O0k94o2N6
4730b03Q1j13K28M4j0k52Q9j0O9J87kr9j22M7K17r0J26l50J44j94L04j76L2J53
4754A00j56K23j41k43J21K09r2j1j73K78l71L20l2o3L72k29k37Q6q9J62Mj61k5
4777a48P6o7L58k93J39l3m5q0J78N1L6rj94K06k84K1R9q3J76j48J07J59k26L6
4801C2j69J69%j46Pk5P8J17j51L74k75m4J3k66K13J70o9j05K7J32m9n8K59m10
4825a76K32l0J19k64J06j5l6K12j08n2jJ40K8m68L53P1l12L60o8j67J17Jj03m8
4849a09L72k92J31n0j41M8J46Qk6l6j71L09K4l14q2K70k12Q5J62l25K34P0n7j58
4873a14nn5J25O2L2N6l10L44J6j1M2n74N59k08p3mK26k60J65j22L6j90L46k39
$$ y = [143, 34, 40, -14, 12, -50, -275, -57, -7, -7, -156, 102, 75, 28, 83, -166, -108, -67, -26, 53, -115, -180, 37, 97, -197, -259, -203, -122, -235, -7, 37, 27, -225, -136, -146, -77, 110, 108, 9, -113, -66, 151, 61, 187, -163, -19, -213, 91, -85, -53, 100, -56, 167, 26, -217, -96, 113, 21, 10, -163, 115, -256, 64, 32, -31, 341, 112, -125, -39, -128, 34, 38, -123, -148, -72, -139, 219, -74, 65, 32, -13, -93, 85, 136, 172, 163, -31, 175, -109, -88, 11, -72, 104, -44, 63, 222, -4, 32, -137, 32, 32, -114, -107, -132, -54, 63, -88, 286, 11, -33, -20, -286, -73, 97, 28, -77, -50, 82, 33, -25, 234, -176, 56, 26, 145, -119, -13, -28, -64, 148, 40, -12, -13, 127, 155, -313, 40, 111, -201, 159, 91, -76, 41, 42, -61, -109, 263, -29, 102, 52, -89, -41, 105, 113, 87, 51, -120, 189, 213, -101, -183, 87, -125, -40, 122, -203, 31, 101, 44, -114, -119, -174, -49, 13, 45, 101, -209, 135, 151, 140, 182, -392, 167, -41, -114, -118, 108, -152, 13, -109, -73, -263, 83, -156]
4897a56R0K3J56l67K93J4O2k16J1L30m14K24q6J46lj17K5L7L5k04P2J99k69R5
4921b0k82K15K58L8k26L57m40K14j73j7q3J33j0J59p8j42Q9l6K15%k49P0K46k44
4945fj38J45l4n8J37k39K38q0O7J35m54k7L04nM4j07P8M6j39N5Q8n7q9J39J47
4970A90l15M4L0R2j30M0n0J62j09J07J74k46kq1j17L7J66l9L6J04j19M6j66m2
4994a88K92O1n5L3k30J26%r7n0J32r5K27j0J28m30R5J69Qp4P8p5m1K37k45J59
5019A55k88O9K56j61K8J41l37J71K50j37j89J03j81J95r1J91k24L0O8j15J74k88
5041a80Q4J28K25m11oL0K59j36p8J94J46k43k24L90l30K08j59J83o1J9j79KK25
5064H6j49j14K36k60J92Q2j50J71j66P1O0j19M7J53J34M3l82L14j58R7l15r8J24
$$ y = [-156, -66, -43, 113, -254, 39, 53, 115, -101, -90, 240, -174, 50, -36, 110, 107, -10, 15, 52, 87, -117, -45, 154, -115, -20, -302, -87, 171, 209, -17, 340, -100, 114, -59, -76, -159, -26, -36, 123, 45, -97, -8, -44, 171, 171, -78, -8, 238, -6, -144, 1, -33, -91, 46, -193, 45, -35, 32, 167, -287, -314, -10, -15, 29, -78, 0, 46, -93, -38, 50, -7, -96, 43, 190, -125, -81, -51, 41, -89, -49, -99, 63, -46, 61, 235, -11, -13, -94, -211, -174, -8, -47, -11, 93, -26, 20, -146, -188, 104, 165, 110, 143, -87, 39, 39, -58, -108, 24, -71, 156, 146, 274, -156, -61, 108, 116, 42, 120, 45, 4, 241, -4, 155, -133, -64, 192, 31, 59, 200, -137, 34, 284, 147, -42, 61, -120, 75, -16, 175, -49, -19, 49, -66, 108, -180, -96, 32, 257, -154, -160, -130, 129, -7, -85, 109, 255, 12, -212, 178, -152, 56, -103, 80, 19, 38, -141, -139, 86, -63, -177, 59, -201, -9, 73, -77, 94, -72, -1, 59, -60, -13, 140, 274, 317, -65, 249, 91, 188, -127, -225, -101]
5087a01N31n25R1j62J43N4J11k99K92j76MJ54l12P4J36j32K12j26N2K58k46N6
5109H9l19L70m4l3j59j91L89k44p3K36Q4J02k52K08j98K12n5j52J50J20l18R7
5131A9O0l4k44j46L90j13J59k49J41L3j08m5K07M1J7l0N2l40J85j13K47j49m1
5154f1K55R4l16J69j28J9Rj97N0k0J39K8j55K20k65L68l78J60m5Ln5J83j67K30
5178A40k00K3J51k27P7Q3J00j51p0p0K18L6j03M0m9l1N6Q2J4j47J54j68R4q8P5
5203C9j02l1J36k94J30M0L8J23k55q0J83J07j5k3N7O5k59L9L7N5N1Q7Q0l39J36
5228EM6J9j90K0J04j34J71j35J02p7J45n1L9k33J36j26L50k47J4j53J47n6J5p4
5252a63Q1N5j92K03N5j1m2J12qj39j51O1j08L30j51J75m6j45J70O1l2k7k77J62
$$ y = [-101, 430, -95, -4, -166, -23, 31, 142, -157, 135, -41, -37, 117, -195, -121, 15, -117, 95, -31, 21, 279, 33, 89, -230, 140, 96, 63, -96, -287, 102, -142, -215, 21, 105, 207, -45, 163, -35, 177, 122, -30, 120, 240, -78, 19, 79, 45, -199, -345, 45, -68, 91, -158, -17, 16, -92, -137, 70, 111, 128, 98, 150, -190, -5, -118, 129, -20, -61, 194, 288, -28, 141, 13, 32, 41, -156, -106, -126, 13, 41, -114, 106, -159, 209, -169, -9, -54, -51, -106, 77, -90, 140, -60, -37, 114, -113, -36, 47, 147, -4, -74, -144, 74, 110, 7, 47, -2, -33, 23, 105, 119, -28, 126, -42, 52, -36, 39, -63, -94, 42, -252, -122, -82, -44, 79, -176, -256, -73, 34, 19, -4, 53, 118, -141, -102, -65, -10, 41, 128, 208, -131, 5, 51, 70, -120, -100, 4, -130, 41, -94, 8, -69, 76, 25, 64, -169, -33, -159, 191, -56, -42, -195, -48, -104, -89, -163, -82, -27, -219, -16, 39, 28, -14, 98, 90, -49, -200, -139, -247, 83, -68, 107, 61, -84, 86, 147, 115, 88, -189, -27]
5276b7k6J28q1rJ25r0j38L58l29O8K32j32p6l75L98j82n0J71J51k50K64n4n4K57
5300B79l51J80k70K62j58j73L33P4k10K6MJ0M0OJ43l76J90Q3j24J30j91K35j14
5323B8Lj48J70j10Q6K89m19j85L10j32K88l68P2J51j28L5J58j74J96m0m0j97m4
5346a99K88k92K78J90l01k39M90l05O5P1j83J40o3K5J26r8j84J35J32k16L10j88
5368a8n5k68N25k25m3J91L1j15j13P8p2J45O0j34j5J07j8j73q4R1K0K50j20P5
5392A20m72N05k25K30k08l6j40L4R4J8J67j76J54J5M2j6j10j73K67j3k3r0m5k61
5416c42K83P5j10J48r6j2N0K2N2lj57%N9j24J40p7J39m4Nj53O1O6J89j63J38n1
5442I5l55K35K4J52j11j97P0K21j86J19O5l04J12J30j19l1J92o8q7L26k53o5J92
$$ y = [-27, -53, 75, -6, -15, 110, 20, -118, 240, -89, -21, 211, 79, 3, -372, 26, -156, -206, -35, 116, -134, 130, 76, 22, 279, -72, 108, -162, 100, -58, -231, 102, 176, -34, -8, -4, 6, 46, 52, 195, -181, 9, 92, -32, 98, -93, 142, 28, 31, -117, 53, -57, 29, 318, -101, -286, 24, -108, 180, -188, -116, 35, -93, -58, 100, -74, 122, 82, 42, -155, -199, 89, -203, 75, 265, -36, -275, 215, -90, -25, 46, -137, 3, -60, -35, 91, -7, -191, -56, 76, -140, 170, -18, -73, -341, 184, -41, -84, 107, 138, 23, -90, -12, -84, 61, 121, -13, -28, 79, 61, -112, -196, -105, -85, 165, 45, 120, -352, 153, -72, 158, -50, -86, -226, -192, -98, -80, 87, -89, 65, 80, 122, 106, -4, -177, 90, 77, 54, -36, -81, -342, -59, 16, -94, 54, -42, -54, -4, 18, 70, 67, -90, -90, -31, -155, -15, -92, 47, 3, 8, -145, -84, -18, 171, 8, 146, 95, -260, -25, -1, 151, 40, -157, -87, 134, -52, 67, 132, -172, -60, 70, -49, -80, 112, 44, -43, 283, 30, -35, 157]
5465A57k21O8j20J41m2K69k22j2L3r0j18K20Q1k33L28j10j10k62M41j67q4N5m0
5488c8j1j6K04j27j14j33J45m1k7R4q6J75ml30L84m0k27J77R5k05q1jJ72J48J1
5513A24N5k05J44j41O3j25j61L54k77L02l68O1L86k86K19j51j57L49j0m62J95
5534i1J39j53L58m52J22J47j41K16J10l72L31j44J00L9k21KL6l10M76l32K55O0
5556A75j56Q1q2pJ32m8j30J06j45K14k73K63k46K07k25Q4J65j61K94k99J30r2
5578a3q1K07j27nl6Q4n5J33J08l24kR5K7J42J5K84l46m9j66J57J03l3q9n8M3j07
5604i3J21Q8k83J53J69k06j99L49K3j21l6P1r4p8L88l22J52k2r5Q5l1J3MR0J15
5629B41m35J90j39J5K13oJ46j40j56J77Q0l06J51R8j85n5K26j95l7K32j1J78j10
$$ y = [157, -64, 4, -116, 25, -17, 252, 30, 18, 51, -39, -157, 63, 144, -89, 239, 129, 19, -243, 198, 31, -53, 2, -38, -49, -65, 139, 12, -102, -235, -90, -131, -158, -64, -150, 25, 21, -309, 75, 35, -192, -15, 80, -125, -206, -207, -35, 113, 124, 179, -26, 118, -23, 40, -85, -246, 108, -169, 133, -235, -174, 212, -74, 145, -6, -163, 186, 176, -286, -91, 48, -105, 253, -199, -77, 70, -71, 145, 255, -117, 214, 70, 170, 209, -12, -10, 26, -284, 192, -140, 115, 175, 19, 100, 18, 11, 143, 95, -35, 71, -74, 140, -133, 130, -116, 91, -134, -50, 115, -46, 248, -51, 79, -13, -94, 113, -14, -19, -55, 29, -26, 107, 215, -109, -111, -16, 11, 153, 168, 452, 106, 57, -109, 48, 151, 118, 29, -29, 14, -93, 28, 116, -167, -14, 155, -51, -250, 99, 122, 1, -35, 36, -58, -136, 252, -70, 82, 60, -35, 50, 19, 32, 36, 126, 241, -194, -4, -143, -128, 85, 79, 225, 85, -71, 106, 186, -120, 31, 129, -56, -111, 115, -80, -117, 115, 104, 282, 172]
5652A72r4m03L57L6l47K16J38l16P3L13l39j5J57m1J44r9J66p4j9J97j16k46J31
5675ik3O5J67k80K36k42J11m8r5l1j07L07M1j96J23M4j10M03K2l18q3o3L6J89
5699A39j11j39J45J33l85K00L7j22N3J95p4n6J78j98p1Rl7K72J4j44J17l54J79
5722b0j2j29J43r2M2L84n39K64q1j11M33n35K07k41K47P8m2K93l73M5J19k69J64
5745b5r3m6K40kj60J50k04J79J76l13Q0J5j81K10k07r2J46K5K0J80J23k74r1L8
5769a06L6r6J38J41k35K5K46q9m25M99j26%k53L18p5N8m2p0J12q4K24m25L62l26
5793a93L15m7l6j22J15k7o0j62L87j56L6j35K72J02m27k3J10J67j44K4j33K5r1
5816b03K28j43K37J45k99K73Q2l61n2J30k07J79k2nJ9j05JL59k18m7n4L0P7k11
$$ y = [172, 78, -325, 32, 68, -279, -63, 75, -241, -168, 145, -194, -209, -52, -93, 51, -48, 118, 44, 25, 222, 106, -140, -9, -32, 33, 200, -80, 156, -86, 25, -23, -118, -149, -256, 51, 92, -104, 19, 63, -47, 356, 378, 60, -23, -86, -50, 139, 28, -111, 34, 167, -218, -18, 19, -103, -50, 145, 71, 15, 193, -5, -76, -67, -104, 168, 182, 38, 155, -199, -20, -32, -161, -18, -110, -68, 316, -223, 41, -40, -151, 282, -253, -46, -287, -40, 38, -4, 289, -84, -39, 80, -189, -25, -118, -164, 76, 74, -86, 64, -140, 39, 215, -98, -18, -3, -184, 26, -181, -273, -127, -102, -82, 98, 221, -53, -144, -106, -70, -166, -28, 113, -122, -97, 149, 60, -365, 134, 8, 8, -245, 73, -2, 56, 14, -56, 56, -28, 196, -229, 133, -193, 122, 75, 39, -83, 32, 5, -55, -217, 170, 14, 50, -85, 187, 289, -138, -161, -51, 116, -28, -4, -137, -112, -203, 25, -118, 119, 264, -35, 238, 320, -41, -93, 37, -170, 9, -13, -18, 1, -104, -103, 256, 38, -9, -63, -33, 44, -167]
$$ [...]
8191B94
##END NTUPLES=NMR FID
##END=
