##TITLE=1H_Pr Urea
 CDCl3
 8 sc, 
 3.10.2024
##JCAMPDX= 6.0         $$ Bruker NMR JCAMP-DX V2.0
##DATA TYPE= NMR FID
##DATA CLASS= NTUPLES
##ORIGIN= UXNMR, Bruker Analytische Messtechnik GmbH
##OWNER= root
$$ XWIN-NMR		Version 3.5
$$ Thu Oct  3 14:01:55 2024 Russian Standard Time (UT+4h)  she@DPX200
##.OBSERVE FREQUENCY= 200.1318
##.OBSERVE NUCLEUS= ^1H
##.DELAY= (6, 6)
##.ACQUISITION MODE= SIMULTANEOUS
##.ACQUISITION SCHEME= undefined
##.AVERAGES= 8
##.DIGITISER RES= 18
##SPECTROMETER/DATA SYSTEM= spect
##.PULSE SEQUENCE= zg30
##.SOLVENT NAME= DMSO
##.SHIFT REFERENCE= (INTERNAL, DMSO, 0, 15.7039)
##AUDIT TRAIL= $$ (NUMBER, WHEN, WHO, WHERE, WHAT)
$$ ##TITLE= Audit trail, XWIN-NMR		Version 3.5
$$ ##JCAMPDX= 5.01
$$ ##ORIGIN= Bruker BioSpin GmbH
$$ ##OWNER= she
$$ F:/spectra/data/she/nmr/H-F/1/audita.txt
$$ ##AUDIT TRAIL=  $$ (NUMBER, WHEN, WHO, WHERE, WHAT)
(   1,<2024-10-03 14:00:45.12 +0400>,<she>,<DPX200>,
      <created by zg, POWCHK disabled, PULCHK disabled
       configuration hash MD5:
       00 E9 B6 7A A2 85 ED C7 34 08 36 98 17 FE 4E 26
       data hash MD5: 16K
       57 4D 50 44 95 75 40 D5 41 E8 5F 33 B8 14 BB 84>)
$$ ##END=
$$ 
$$ hash MD5
$$ 50 57 38 0A B8 49 25 B6 BA CE CC E3 40 61 30 23
##$RELAX= 
##$RELAX= 
##$RELAX= 
##$RELAX= 
##$RELAX= 
##$RELAX= 
$$ Bruker specific parameters
$$ --------------------------
##$DU= <F:/spectra>
##$EXPNO= 1
##$NAME= <H-F>
##$PROCNO= 1
##$TYPE= <nmr>
##$USER= <she>
##$AMP= (0..31)
100 100 100 100 100 100 100 100 100 100 100 100 100 100 100 100 100 100 
100 100 100 100 100 100 100 100 100 100 100 100 100 100 
##$AQSEQ= 0
##$AQ_mod= 1
##$AUNM= <au_zg>
##$AUTOPOS= <>
##$BF1= 200.13
##$BF2= 200.13
##$BF3= 200.13
##$BF4= 200.13
##$BF5= 200.13
##$BF6= 200.13
##$BF7= 200.13
##$BF8= 200.13
##$BYTORDA= 1
##$CFDGTYP= 0
##$CFRGTYP= 5
##$CHEMSTR= <none>
##$CNST= (0..31)
1 1 145 1 1 1 1 1 1 1 1 1 1 1 1 1 1 1 1 1 1 1 1 1 1 1 1 1 1 1 1 1 
##$CPDPRG= <>
##$CPDPRG1= <>
##$CPDPRG2= <>
##$CPDPRG3= <>
##$CPDPRG4= <mlev>
##$CPDPRG5= <mlev>
##$CPDPRG6= <mlev>
##$CPDPRG7= <mlev>
##$CPDPRG8= <mlev>
##$CPDPRGB= <>
##$CPDPRGT= <>
##$D= (0..31)
0 1.2 0 0 0 0 0 0 0 0.06 0 0.03 0 0 0 0 0.0002 0 0 0 0 0 0 0 0 0 0 0 0 
0 0 0 
##$DATE= 1727949644
##$DBL= (0..7)
120 120 120 120 120 120 120 120 
##$DBP= (0..7)
150 150 150 150 150 150 150 150 
##$DBP07= 0
##$DBPNAM0= <>
##$DBPNAM1= <>
##$DBPNAM2= <>
##$DBPNAM3= <>
##$DBPNAM4= <>
##$DBPNAM5= <>
##$DBPNAM6= <>
##$DBPNAM7= <>
##$DBPOAL= (0..7)
0.5 0.5 0.5 0.5 0.5 0.5 0.5 0.5 
##$DBPOFFS= (0..7)
0 0 0 0 0 0 0 0 
##$DE= 6
##$DECBNUC= <off>
##$DECIM= 24
##$DECNUC= <off>
##$DECSTAT= 4
##$DIGMOD= 1
##$DIGTYP= 9
##$DL= (0..7)
0 120 120 120 120 120 120 120 
##$DP= (0..7)
150 150 150 150 150 150 150 150 
##$DP07= 0
##$DPNAME0= <>
##$DPNAME1= <>
##$DPNAME2= <>
##$DPNAME3= <>
##$DPNAME4= <>
##$DPNAME5= <>
##$DPNAME6= <>
##$DPNAME7= <>
##$DPOAL= (0..7)
0.5 0.5 0.5 0.5 0.5 0.5 0.5 0.5 
##$DPOFFS= (0..7)
0 0 0 0 0 0 0 0 
##$DQDMODE= 0
##$DR= 18
##$DS= 0
##$DSLIST= <SSSSSSSSSSSSSSS>
$$ [...]
##$SUBNAM2= <"">
##$SUBNAM3= <"">
##$SUBNAM4= <"">
##$SUBNAM5= <"">
##$SUBNAM6= <"">
##$SUBNAM7= <"">
##$SUBNAM8= <"">
##$SUBNAM9= <"">
##$SW= 24.0689170037331
##$SWIBOX= (0..15)
0 0 2 0 0 0 0 0 0 0 0 0 0 0 0 0 
##$SW_h= 4816.95568400771
##$TD= 16384
##$TD0= 1
##$TE= 0
##$TE2= 300
##$TE3= 300
##$TEG= 300
##$TL= (0..7)
0 120 120 120 120 120 120 120 
##$TP= (0..7)
150 150 150 150 150 150 150 150 
##$TP07= 0
##$TPNAME0= <>
##$TPNAME1= <>
##$TPNAME2= <>
##$TPNAME3= <>
##$TPNAME4= <>
##$TPNAME5= <>
##$TPNAME6= <>
##$TPNAME7= <>
##$TPOAL= (0..7)
0.5 0.5 0.5 0.5 0.5 0.5 0.5 0.5 
##$TPOFFS= (0..7)
0 0 0 0 0 0 0 0 
##$TUNHIN= 0
##$TUNHOUT= 0
##$TUNXOUT= 0
##$USERA1= <user>
##$USERA2= <user>
##$USERA3= <user>
##$USERA4= <user>
##$USERA5= <user>
##$V9= 5
##$VALIST= <valist>
##$VCLIST= <CCCCCCCCCCCCCCC>
##$VD= 0
##$VDLIST= <DDDDDDDDDDDDDDD>
##$VPLIST= <PPPPPPPPPPPPPPP>
##$VTLIST= <TTTTTTTTTTTTTTT>
##$WBST= 1024
##$WBSW= 4
##$XGAIN= (0..3)
0 0 0 0 
##$XL= 0
##$YL= 0
##$YMAX_a= 70172
##$YMIN_a= -79857
##$ZGOPTNS= <>
##$ZL1= 120
##$ZL2= 120
##$ZL3= 120
##$ZL4= 120
##$ABSF1= 10
##$ABSF2= 0
##$ABSG= 5
##$ABSL= 3
##$ALPHA= 0
##$AQORDER= 0
##$ASSFAC= 0
##$ASSFACI= 0
##$ASSFACX= 0
##$ASSWID= 0
##$AUNMP= <proc_1d>
##$AZFE= 0.1
##$AZFW= 0.1
##$BCFW= 1
##$BC_mod= 2
##$BYTORDP= 1
##$COROFFS= 0
##$CY= 11.3945322036743
##$DATMOD= 1
##$DC= 2
##$DFILT= <>
##$DTYPP= 0
##$F1P= 15.6554695791079
##$F2P= 12.8336369535428
##$FCOR= 0.5
##$FTSIZE= 0
##$FT_mod= 4
##$GAMMA= 1
##$GB= 0.15
##$INTBC= 1
##$INTSCL= 1
##$ISEN= 128
##$LB= 0.24
##$LEV0= 0
##$LPBIN= 0
##$MAXI= 10000
##$MC2= 0
##$MEAN= 0
##$ME_mod= 0
##$MI= 1.114404
##$NCOEF= 0
##$NC_proc= 0
##$NLEV= 6
##$NOISF1= 3.799351
##$NOISF2= 2.8
##$NSP= 1
##$NTH_PI= 0
##$NZP= 0
##$OFFSET= 15.70392
##$PC= 1
##$PHC0= -26158.76
##$PHC1= 16.18747
##$PH_mod= 1
##$PKNL= yes
##$PPARMOD= 0
##$PSCAL= 0
##$PSIGN= 0
##$REVERSE= no
##$SF= 200.130013532006
##$SI= 16384
##$SIGF1= 3
##$SIGF2= 2
##$SINO= 400
##$SIOLD= 16384
##$SREGLST= <1H.CDCl3>
##$SSB= 0
##$STSI= 0
##$STSR= 0
##$SW_p= 3612.71676300578
##$SYMM= 0
##$S_DEV= 0
##$TDeff= 0
##$TDoff= 0
##$TI= <>
##$TILT= no
##$TM1= 0
##$TM2= 0
##$TOPLEV= 0
##$USERP1= <user>
##$USERP2= <user>
##$USERP3= <user>
##$USERP4= <user>
##$USERP5= <user>
##$WDW= 1
##$XDIM= 8192
##$YMAX_p= 0
##$YMIN_p= 0
$$ End of Bruker specific parameters
$$ ---------------------------------
##NTUPLES= NMR FID
##VAR_NAME=  TIME,          FID/REAL,        FID/IMAG
##SYMBOL=    X,             R,               I
##VAR_TYPE=  INDEPENDENT,   DEPENDENT,       DEPENDENT
##VAR_FORM=  AFFN,          ASDF,            ASDF
##VAR_DIM=   8192,          8192,            8192
##UNITS=     SECONDS,       ARBITRARY UNITS, ARBITRARY UNITS
##FACTOR=    0.0002076,     1,               1
##FIRST=     0,             0,               0
##LAST=      1.7004516,     0,               0
##MIN=       0,             -79857,          0
##MAX=       1.7004516,     70172,           0
$$ Real data points
##PAGE= N=1
##DATA TABLE= (X++(R..R)), XYDATA
0@%%%%%%%%%%Qj6J6j6J6k4L2l2M0m8N6o4P2q8J04j20J36j52J70j94K21k47K76
33A46l11L50l90M33m82N36n94O59p30Q07q95R91j097J218j354J508j685J892k133
52a131K422k778L228l817M622n802P720j1505L1172q3702q70J27595m8918p2316
66e4080L5243O3210l8390l9282L4794K1391k2130m656p397K0908R465l9150L485
79a6589M2558j6116l6996J1780M4009k1406m7682M6249L9308n4328j8463L8077
91A0401J1140k7388j7054K5634J1804k1819j809P035J0949L008k6017Q525K5644
104B0053k2191j0284J8676P31j1322k878J0542l489j0266J5251l75r145J3365
117H668r596o732K1407r372j8768J1895J3007j0568j6475J7296J5960k3832j723
$$ plain form
0 0 0 0 0 0 0 0 0 0 0 0 8 -8 8 -8 8 -16 16 -16 24 -24 32 -32 40 -48 56 -64 72 -80 90 -104 117 -130 146
33 146 -165 185 -205 228 -254 282 -312 347 -383 424 -471 520 -577 641 -713 795 -890 1002 -1131
52 -1131 1291 -1487 1741 -2076 2546 -3256 4464 -7041 24131 -59571 -60441 67154 18236 -54080
66 -54080 -18837 44373 5983 -33299 1495 22886 756 -3900 -11297 9611 19076 -20074 -16589
79 -16589 25969 9853 -27143 -15363 28646 7240 -40442 5807 45115 -9213 -27676 10401
91 10401 21541 -5847 -22901 2733 14537 -7282 -9091 -2056 8893 11901 -14116 -5591 20053
104 20053 -2138 -12422 6254 6985 -4337 -7215 3327 -162 -10428 4823 4448 -4697 8668
117 8668 -928 -7660 13747 4375 -14393 -2498 10509 -59 -16534 762 16722 -7110 -8833
130h833J7466p002j398J622n925O450L710p417r387P524J6799j8217j1351K8868
144A2909m110k3400J6236J3481j6921j0149J6261O363k1647L062J8674j1765n075
157f081Q582l747L592J579q507L969P743m015j1269L510J5136j0722j1894J5410
171C286K344j0518L034N229N11m921j526O342l330l450L679j777J269k2m191N911
187A870J234o818K698N112r76o138p04Q854k550p951M612J755j622Q43k666K837
203C90L691n297j153M771O74n080j617P830k192r137P885M832r942P18P845j251
219B967o091J93O943o43o609K092K586r23q28k861L296L762o124j156O135J99
235B938m780r91O424j86q907M420O973p751k807O563J222m903k615O412K491p243
$$ plain form
130 -8833 8633 1631 233 1855 -4070 2380 6090 -1327 -10714 -3190 13609 -4608 -15959 12909
144 12909 8799 -14601 1635 15116 -1805 -11954 4307 10670 -10977 -7915 10759 -1006 -6081
157 -6081 2501 -1246 2346 3925 -4582 -613 7130 3115 -8154 -4644 10492 -230 -12124 3286
171 3286 5630 -4888 -1854 3375 3886 -1035 -2561 3781 451 -2999 680 -1097 172 150 -4041 1870
187 1870 3104 -3714 -1016 4096 3120 -3018 -3722 5132 2582 -5369 -757 998 -624 219 -2447 390
203 390 4081 -1216 -2369 2402 3076 -2004 -3621 4209 2017 -7120 765 5597 -4345 -3627 4218 2967
219 2967 -3124 -2931 4012 3369 -3240 -1148 1438 515 -313 -3174 122 3884 -2240 -3396 2739 2938
235 2938 -1842 -2833 3591 3405 -5502 -1082 5891 -1860 -4667 1896 3118 -1785 -4400 2012 4503 -2740
251b740O81M609j138j701k210K794L572o525q98O248j487l305N91L626K85n846
267c444L433M653o734p3M523j647j647j755K940K556n461J250L898k534nm98J546
284A001J962n703J748M296n330j21K951j56q70k899M855K247p890L445N105m888
300b47j477P70K663m02n998M654L406n875J100J987J341L08n915M538M283q035
316b899L94M469p50k623l025O626J568r126M821N533m843j254O1L746m9p737M559
333e29M268n929k44J483L074J78o776N313M735p641M92L277L2j889m594O012K217
350C479q685L859M722l298k41j273L821J055p085L677K965m579K77q97L058J260
366B115o878N124M083o397J495K009J92o89m573M815J282p073L667K083k206J176
$$ plain form
251 -2740 -2059 2550 1412 -289 -2499 295 3867 -2658 -3556 2692 1205 -2100 -1509 2117 2402 -3444
267 -3444 -11 4642 -2092 -2165 2358 711 -936 -2691 249 2805 -2656 -1406 2492 -42 -47 -545 1001
284 1001 2963 -2740 -992 3304 -2026 -2147 804 648 -222 -3121 1734 3981 -3909 -464 4641 -247
300 -247 -1724 -954 1709 1307 -4691 -37 3369 -2506 -1406 581 1922 2230 -3685 853 5136 -2899
316 -2899 -2505 1964 1214 -1409 -4434 2192 3760 -5366 -545 4988 145 -1109 -1048 2698 2649 -5088 -529
333 -529 3739 -2190 -2434 -951 2123 2301 -4475 838 5573 -2068 -1576 1701 1733 -156 -4750 1262 3479
350 3479 -5206 -1347 3375 77 -164 -1437 2384 3439 -3646 31 2996 -1583 -1306 -2203 855 2115
366 2115 -4763 361 4444 -1953 -458 1551 1743 1054 -3519 1296 2578 -4495 -828 1255 -951 225
382B25k092L564J404o023M095J775m055J018j503K215O89n968M874K553n188K324
398i3J253M94k91l961M893K31o382L859P84k112R86k079L600R66n275M468J543
415B884l266P02j169K512o67n407N087J228n075K429J273Q48o78l078N179O5n837
432b970L412Q95j740l55j984M049k36m817M538J607k669M15n39L062j261n197
448c790N049Q68n024J534J288J148j298k674N429P7m772K752Q78o09j222k265
464b631M188o00m838L846J704j995k36j65L403j254m100M145N19l650O32N56J320
481H44j388k405M425J90l483K286Q27k57p82j749L161p95l728K628J066j456m11
498a027J46K830j301k617L790J03l167R33Q05K70j733j269L497n70k896K339J184
$$ plain form
382 225 -1867 1697 3101 -2922 1173 2948 -1107 -89 -1592 623 1312 -4656 218 2771 -2417 -93
398 -93 1160 1654 1363 -2598 2295 2526 -3856 3 787 -1325 -339 -2418 1182 2148 -3127 1341 2884
415 2884 -382 320 -849 1663 996 -4411 676 1904 -3171 -742 531 1379 701 -2377 2802 2867 -2970
432 -2970 442 1337 -403 -758 -2742 1307 1071 -3746 792 2399 -270 145 -394 2668 1407 -3790
448 -3790 1259 2127 -2897 -1363 -75 1073 -225 -2899 2530 2607 -2165 587 1465 856 -366 -2631
464 -2631 1557 957 -3881 -35 1669 -326 -562 -727 2676 1422 -2678 1467 1986 -1664 -1032 -476 844
481 844 -544 -2949 1476 1666 -1817 469 1296 1039 257 -1492 1669 874 -2854 -226 840 -616 -1027
498 -1027 -881 1949 648 -1969 1821 1924 -1243 -310 495 765 -968 -2237 1260 690 -2206 133 1317
515A317r03q07PK623j792k799L039O23k361k96Q74J863j599k073L721O87l321
532a197M36K151J74k558j123L765m78l886J872K549j279j934Q04L215j453l583
548b525K831K105k846j355J565J656j660k125K988J165k809l5J900P37j531j852
564a791K496J178l254LK272k75j569l55K539J99l319J417K502j880j138P88J107
581I20n83j976J902J157k838O33J805q54m01k37J127J07j791J417M28j817R07
598i4L21l25L99j495J259J072j976O54Q79l72k47j224K032Q04l777J256K717j782
616A01j415M41K568q41l748L586K275m679J94K824K33j984j968L454Q22l890J273
633g54J755n31n57j599K883J356m646Q74L147q90j907j379L443R53n137J956L699
$$ plain form
515 1317 414 -393 -386 2237 445 -2354 685 1308 -1053 -1349 -475 1388 -211 -2284 1437 2124 -1197
532 -1197 -761 1390 1564 -994 -2117 1648 1170 -2716 -844 1705 426 -1508 -704 2511 1058 -2525
548 -2525 306 2411 -435 -1790 -225 1431 -229 -2354 634 1799 -1010 -1045 855 1592 61 -1791
564 -1791 705 1883 -1371 -1368 904 629 -940 -1295 1244 1443 -1876 -459 2043 163 -975 -187 920
581 920 337 -1639 263 1420 -1418 -785 1020 166 -235 -472 655 762 -1029 388 816 -1001 -94
598 -94 227 -98 301 -1194 65 1137 -839 -185 694 322 75 -1149 883 1687 -2090 -834 1883 101
616 101 -1314 -873 1695 854 -2894 692 2967 -1712 -1518 1306 1539 -445 -2413 1041 1863 -2027 -754
633 -754 1001 470 -87 -1686 1197 2553 -2093 -1219 1928 1038 -869 -2248 1195 2148 -2989 -1033 2666
650B666k660j543Q45L014p40m759L188K964m204k83J645O00m87k484K752J801
666B315l756R00J551l47J13k333J529J638l174R46J021q47R35j646J205K419l613
683a144M13K241j301k30q36R97N77k958K612J070l486K207J060j576R94o41P68
700G67m96j785K975j189k622K791l19n01O56j115K018o27j437K420j389m98P60
717D09k137K544J42l635K480J481j247o08p2K960j574l344M406l8l757J024R39
734b7J127j502k263M128J57l237J917P97l7j258j497L485q13l685K395Q02m01
751H8l62j387L256j20l428K611J150j743r38m29K894r65l718L107J490k246J27
768f13O16J892j500k445L999k84l731J676P05l27m00j098K192j35j549J860l03
$$ plain form
650 2666 6 -1537 -692 2322 1582 -3177 11 2975 -1229 -1512 133 733 246 -2238 514 2315
666 2315 -1441 -541 1010 663 776 -1557 -28 1610 -1564 -618 403 -444 491 -1155 50 2469 -1144
683 -1144 -731 1510 209 -21 -857 140 717 -2241 371 1441 -2045 162 1222 -354 640 -1 767
700 767 271 -1514 1461 272 -2350 441 122 -379 277 -838 1180 553 -884 1536 147 -351 409
717 409 -1728 816 958 -2677 -197 1284 37 -571 -643 2317 743 -2601 1805 1767 -1990 -966 -27
734 -27 1100 -402 -2665 1463 1620 -1617 300 1097 1060 -198 -1695 1790 977 -2708 -313 489 88
751 88 -274 -1661 1595 1475 -1953 658 1808 65 -873 -1302 1592 627 -3091 16 1506 -740 -613
768 -613 3 1895 395 -2050 1949 1665 -2066 -390 315 -12 -412 -1510 682 547 -1002 858 555
785E55r0J69j742K144j4l030J668Q60r88n1j96J860p69j797K893j30k392J158
803A08K30q7p83p94K111r85j335K415l31p94O24m90J198o28j475J508l19j071
821h98M41J0R46r29q27K698n73j691J325J24k87n09o34J564j014j202J673L22
839E39p83k55L83J645j165j419J990j43j620M28N26M5j101k04K258p75j333J371
857C87M35n10m55RR76j054r50J394o3p52m9M23J103p50r85J702K34j821M93J032
877G99m92j371J89J850r32j415J674P24j143k49O59P95j064j143J649K73j645
894h42l5J025N18j050q06K123J50k038P47J379p33j240P2J777n88k070J382J342
912A113j418m48P84J108p82j617J722R34j958l04R85O00r42j228J960P38k327
$$ plain form
785 555 465 634 -1108 1036 1022 -2008 -340 520 -468 -519 -715 1145 376 -1421 1472 1342 -1050 108
803 108 338 251 -532 -1326 785 -200 -1535 880 549 -245 379 -111 1087 459 -1016 492 173 -898
821 -898 -457 -447 499 -430 -1257 1441 868 -823 502 626 339 -170 -804 760 -254 -1456 217 539
839 539 -244 -499 -116 1529 364 -1055 935 792 -828 -400 126 171 -930 -1134 1124 349 -984 387
857 387 822 312 -143 -134 842 -212 -1162 232 169 -583 -632 -209 894 144 -841 861 1095 -726 -233 799
877 799 307 -1064 -875 975 43 -1372 302 1026 -117 -366 293 1088 24 -1119 530 803 -842
894 -842 -877 148 666 -384 -1190 933 1083 -955 -208 1171 438 -802 -730 1047 459 -1611 -229 1113
912 1113 -305 -753 31 1139 357 -1260 462 1396 -562 -866 119 719 -223 -1451 509 1247 -1080
929a080N49J561m55r88l67J665j5k286J134J187j102l11P5J123j56j853J377J330
947A388j805o3N31N32k36j581J473Q54k141P11Q84l61j37q20J294M81k140J191
965E5P64j189L04l32P04K37j787J362P77j544N74K01J89J10j411J522M52k128
983a140J175M17o75K67q01J142K34j750J402N12j262O03k98N46J43j841J716M22
1001H12j920J115P1O1J38j269J721K02k083J461K64p02K24r57J477j76j985J986
1019D40K72j421Q51l35R15j26j873K020R6j880R99N6J42k04j296K154M4k074J685
1038D65J72m98K1j008J742l62k231K006J26j069M68l54J442m92j710K205L8j754
1056g93R26j93M64m27j544K330j57j858J469K07j24m4r06J815m73k075J781nr05
$$ plain form
929 -1080 -531 1030 575 -413 -780 885 870 -1416 -282 905 -197 -508 -433 690 534 -1319 58 1388
947 1388 -417 -480 51 583 347 -1234 239 1093 -1048 -337 547 186 49 -771 523 1004 -1136 55
965 55 819 -370 -66 -398 306 543 -1244 118 895 -649 -75 126 315 425 -986 536 988 -1140
983 -1140 35 452 -223 44 -757 385 619 -1131 271 783 -479 124 -174 372 515 -1326 390 812
1001 812 -1108 7 78 139 277 -992 729 931 -1152 309 573 -129 95 -862 615 439 -1546 440
1019 440 712 -709 142 -193 722 596 -1277 743 839 -1041 -42 14 156 -48 -1344 810 854 -1220 465
1038 465 637 139 160 -848 894 532 -1699 307 433 -636 -168 -522 920 428 -1282 923 961 -793
1056 -793 133 -60 404 -23 -1567 763 606 -1252 217 424 300 256 -650 1165 692 -1383 398 393 -512
1075e12K59n69J545m41j595K160m2j249P33l08O23n19j377K003m51j523J334o6
1093EK14j28q29J874n37j580J670k59p05Q5n35J301o85j263K071k14j072R33k75
1112G1P59p09j052J927p30j499J244j47J03l48m21J915p37j254J739j64p17j76
1130a96k65J223r99j120J846l46q53O15J74P84p50p89J853p25j171P93p0P0o53
1149e79l44J707p69r92J525Nl98j65j42J069r63j007J389k35p90L51J86Q33p16
1168c5o04J691m88j025P39q7m6n93k10J151p07p68J319K8l32l2R8P31p88n39J074
1189E77m21q50L85J69L39n64l10J392l05q18P51K04l47m21QQ08q36p96J172J99
1209C36o75j2M18P36q30m60J241k43j104L18N09j66o89r8J288l16r69Q69N57n52
$$ plain form
1075 -512 -253 -822 723 282 -1313 847 805 -444 289 -19 604 85 -1292 711 260 -1263 71 5
1093 5 219 91 -738 1136 599 -981 689 430 -275 -190 -725 576 -109 -1372 699 485 -587 346 71
1112 71 830 121 -931 996 266 -1233 11 -136 -33 -381 -802 1113 376 -878 861 697 -20 -196
1130 -196 -461 762 -237 -1357 489 143 -710 -95 79 863 113 -676 1177 452 -719 74 4 74 -579
1149 -579 -923 784 15 -977 548 553 155 -10 -152 917 -46 -1053 336 101 -689 -338 -152 681 -35
1168 -35 -639 1052 564 -461 278 191 145 -448 -658 493 -214 -982 337 365 33 1 99 830 42 -497 577
1189 577 156 -694 -309 -140 199 -365 -675 717 412 -406 345 549 202 -219 -211 597 -239 -1035 137 336
1209 336 -339 -351 67 803 -27 -487 754 511 -593 -275 234 68 -621 -719 569 253 -716 153 710 158
1229A58l93K54O68n48j106J087K79q57J4M00M96l21o95J006L61j278K66O94j37
1248C48o55m82J187m3j283Q71O29o23j09J89O09k69j135Q37L93r12J61J13L35
1267A61j15p18R77K24r29N01L38k47j16p33R28J17j209P33M88p05J70N9N99k52
1287B71j083J324J21j249O22J4k6L4o70J051L6j294J012L99n66k7l18Q34j61j154
1307h30J179Q5r31M81k63O58j14j278J369L18j222N62R2J97k63q79J413n3j639
1326a118J111L90l03j56o41J389k05j463J365K27r84L04j13O85k46j241J363P0
1344D34q73N74m13O85n8j225J529k2j476R24J68l5j75r12J331n0j293J319q6m77
1364a31K82m66J032m99j209J598l16r51Q84m80M30rq54J319l25q38R11l56J67
$$ plain form
1229 158 -235 19 687 139 -967 120 399 -458 -444 -44 452 131 -564 442 803 -475 -209 485 348
1248 348 -307 -789 398 355 -928 -57 572 -51 -160 29 638 369 -766 71 464 -448 -287 -174 161
1267 161 46 -672 305 529 -400 101 439 192 76 -657 271 388 -821 -88 400 -305 -135 -76 523 271
1287 271 -812 512 633 -616 6 20 -6 28 -642 409 445 -849 163 562 -4 -31 -349 485 324 -830
1307 -830 349 434 -497 -16 -279 379 265 -1013 356 674 -548 14 106 303 40 -839 574 521 -1118
1326 -1118 -7 383 80 -76 -717 672 467 -996 369 596 -388 -84 -197 488 242 -999 364 434
1344 434 -439 135 -278 407 349 -876 653 631 -845 79 247 212 37 -875 456 406 -887 432 346 -131
1364 -131 151 -315 717 218 -991 607 291 -660 224 -256 174 165 -689 630 305 -533 378 22 189
1383A89m8r08J296m42r97J374m04l90N11n42J014l84j054J423k99p97N61l86N85
1402C02n96n28J732q45q67J324l60O6j31n69J123o76p12J172m69l25K16k05J201
1421H53q50p28J548n66m34M10m66O33n63p42J546n81r23R95Q4K10n40k16J311
1440I81r43o36J122o68j65J06k98J075o95o12J406l52m29K90j54N00p58l92J229
1459F07p89n24P32j30L87m06k33J214o76n33R70l72l51j74m8Q34q92k98J129l26
1479A21k78K92MM97p63k26J135p52o92O81k4j11k60K8R05o45k04Q15k70m9l72
1500a68K3O73r11l73J047l37l77L29K35K21m07r0Q62n42n12L59J14l9o31J78P77
1521D31o27j91Q03m7l44p1J56M15o30l85O54j17m35J06L64J71m99R9Q93m30n77
$$ plain form
1383 189 141 -767 529 87 -910 464 60 -330 181 -361 653 269 -785 638 339 -458 103 -283 302
1402 302 -294 -822 910 65 -802 522 162 228 97 -472 651 -25 -737 435 -34 -359 -143 -348 853
1421 853 3 -725 823 257 -177 233 -233 400 -163 -905 641 60 -863 132 216 426 -114 -330 981
1440 981 38 -598 524 -144 -309 -203 -501 574 -121 -733 673 321 -108 182 28 528 -230 -622 607
1459 607 -182 -706 26 -104 283 -123 -356 858 182 -351 619 247 -104 -278 -326 508 -384 -682 447 121
1479 121 -157 135 139 636 -127 -353 782 30 -662 19 -5 -116 -376 -348 557 -88 -292 523 253 204 -168
1500 -168 -145 528 -383 -756 291 -46 -423 -94 141 362 -45 -135 727 185 -327 32 146 107 -524 -346 431
1521 431 -196 -387 416 369 25 -46 110 525 -105 -490 164 47 -388 -282 82 253 -246 -147 746 316 -261
1542b61M50P2k14l46k9M85l72l58P16J23l74m6M07K50n25k76P22k55o03L04J38
1563Hp4k14m6P69j69o34N33K60l80k38R1L35l67m39O40Q5m51J71K21L03l04l30
1585b30O18j2p80L20K86l22j75j08O81j44o58O87J94m00K7n5M59l28o97Q35L8
1606B36o92L36J69J21j52m19Q59r1q05O49L4l10p1l43Q00k99o98Q21R8l80J96
1627E9j13M98k48p23Q80p5p55M50l8J91j48n34R47j16q17P79Jj41m6m50Q30l34
1649I7p91Q46K2m42L03k83P07l11p43J077j88o50N00k21K64j46o58J002k38p33
1669e86P15m3k2k7l92R27m37p32R30k23l22K21l04O98l90o56J131k77n32M72k69
1690a18L98k33n53J076m07o93P90l08J79j18m62J005m35o53R40k94j62J07l17
$$ plain form
1542 -261 189 261 47 -299 -328 157 -215 -573 143 266 -108 -154 253 503 -22 -298 424 169 -434 -130 8
1563 8 -66 -280 -326 443 274 -360 173 433 53 -185 -94 241 -126 -565 75 160 -291 -120 101 404 100 -230
1585 -230 388 376 -404 -84 202 -120 -295 -403 278 134 -524 163 357 -43 -16 -71 388 60 -637 198 236
1606 236 -456 -120 49 170 18 -401 458 367 -438 211 245 -65 -136 -479 321 22 -676 145 243 -137 59
1627 59 -54 444 196 -527 353 278 -477 -27 -65 126 -22 -556 391 275 -542 237 238 97 51 -399 431 97
1649 97 -694 152 174 -268 35 -248 459 148 -595 482 294 -356 144 -77 187 41 -617 385 147 -586
1669 -586 129 86 64 37 -355 572 135 -597 333 110 -212 9 -295 403 13 -643 488 211 -321 151 -118
1690 -118 280 47 -506 570 163 -530 260 -48 131 13 -449 556 121 -532 408 114 -48 59 -258
1709b58P35n01o02J086m05m48M84k27M95l84m63J093m80n66O85l15J61k15l69
1728d94R71n64m31Q83l17r4J14k99P72n63n18J052m63l34K69k05O02m99l47J139
1748F74o99k43O44m01K99l76j98Q12o84l82Q38l01qm3j99Q57p01k05Q90m85k16
1769a27J12j51M09n37j84J028o41k27O13k05K36m43j14P62o69l17O81l26l1j22
1789b53n2P91o13j52P80l87j51O8k2K98o51p5Q62o21k32M24L9K24m44J33O85o80
1811b9j68M71k57j10k32J00N48n94o6P92l36j66J11J05J96n50LN91n88j87K73
1832i3M1J32k73J25N73m41k50M54j0k08l24J59L11n46k8N96j33k54K17J81J34
1853C63m95P7N28m91k61K81l2o8j87P5M92k88j39N28o6k02k22J65J90m70j36M59
$$ plain form
1709 -258 477 -24 -626 460 55 -393 91 -136 359 -25 -488 605 125 -441 244 -71 90 -125 -494
1728 -494 477 -87 -518 365 48 -46 68 -231 541 -22 -540 512 49 -285 -16 -221 381 -118 -465 674
1748 674 -25 -268 376 -25 274 -102 -300 512 -172 -554 284 -17 -25 -68 -267 590 -111 -316 574 89 -127
1769 -127 -15 -166 243 -294 -478 550 -91 -318 295 90 326 -117 -231 531 -138 -455 226 -100 -131 -253
1789 -253 -305 486 -127 -279 501 114 -37 31 9 307 -344 -419 443 -178 -410 14 53 277 -167 -34 651 -29
1811 -29 -197 274 17 -93 -325 -225 323 -271 -337 455 119 -47 64 169 365 -185 -182 409 -179 -366 -93
1832 -93 -52 80 -193 -68 505 64 -186 268 258 50 -274 -115 196 -350 -378 218 85 -169 48 229 363
1853 363 -132 -55 473 -18 -279 2 -30 -98 -285 -210 282 -6 -145 383 317 115 -107 58 248 -222 -358 101
1875A01j69k09J78K23N9k82N9M58k81m21L55O2k39k21J73L00l52j04N47l2k26
1896b1L3J55N7l10j59M46k29l92K71J46J8j19k4N17j49m77L95J08l58n7j4L53
1918A90l45l50O79J2l19J77J45J03j93l96O16k18n05L89P6j86q0j05N03l2l97
1939b36M87Ml04M9r5L22k02n41O48Nm16K22N0K26k02k65O48j65n81M36Qj62o4
1962a28k48O21k31l93O19p4k36J72j26L81l21m19O37k14l65K84j22L13j30l47
1982c27P80l36m40N69j43p9l4l49O49k84m50O49j55j80J74j77N81l65m93P92l06
2003G6l39K77j53K24j81l13Q29m49l02O00k10Q0j41k89O28l42l09N78l70M0N5
2024a1j96N72l51m72Q53k65k48K52k08K88l40k82Q89n70k31N04k16J57j81k53
$$ plain form
1875 101 -68 -277 -99 124 183 -99 -40 418 137 -284 71 133 -106 -327 -154 146 -206 -310 237 205 -21
1896 -21 12 167 224 -86 -245 201 -28 -420 -149 -3 15 -104 -128 389 240 -237 158 266 -92 -149 -163 190
1918 190 -155 -505 174 186 -133 44 189 292 99 -297 319 101 -404 -15 61 -125 -205 -310 193 161 -236
1939 -236 251 255 -49 0 -95 227 25 -516 132 137 -279 -57 -7 219 17 -248 400 235 -346 90 98 -64 -128
1962 -128 -376 245 14 -379 240 166 -70 102 -24 357 36 -383 254 40 -325 -41 -163 150 20 -327
1982 -327 453 117 -323 246 103 24 -10 -359 290 6 -444 205 50 -130 44 -133 448 83 -410 382 76
2003 76 -263 14 -139 85 -96 -409 420 -29 -331 269 59 139 -2 -291 337 -5 -314 264 -106 -66 -11
2024 -11 -207 365 14 -458 395 130 -118 134 -74 214 -126 -408 481 -89 -320 184 -32 125 -56 -309
2044c09P09m57j96N31k52o1J1j88N68n25k38P99l77q6J72j74L67l47k46O70m41
2065g0k10M06j69J88l03j39P17m69k27N93l20M8k5j41N81o20j50O18m01j1J67
2086F3j52L07k71j27N79m78l8L16k41K99m39p8N19l56j58M58k03j7o8Q2M30o15
2108a88p7O18m38p8L3qL42m15Q2N21m78k6K67j37K62l88l8N01n35j4K90j62L7
2131b9j05J30L83n38MN20l55l2k5l7K28m24J19M05m18O2J51J05K9k73Q7M35m85
2154f3j67L56j84m3j27K63K03m11M1L57j53m2o0J2J92m42O1M05l97n0J64J44O7
2177A26k43J51L12l77l5J18j9j02j45J50J50l01P7L31j22j09J89K3l0j91r6L26
2199A83k65j58J18J67r9n9J35K51k47j05K98j02j39j33J20J81l64j00L71n9j33
$$ plain form
2044 -309 400 -57 -253 278 26 -35 -24 -212 356 -169 -407 392 15 -71 101 -73 294 -53 -299 371 -70
2065 -70 -280 126 -43 145 -158 -297 420 -49 -276 317 -3 45 20 -121 460 -160 -310 308 -93 -104 63
2086 63 -89 218 -53 -180 399 -79 -117 199 -42 257 -182 -260 259 -97 -255 203 0 -17 -85 -3 427 -188
2108 -188 -265 353 -85 -163 -130 -138 204 -211 -129 392 -86 -112 155 18 280 -108 -146 355 -180 -194 96 -66 -29
2131 -29 -134 -4 379 -159 -155 365 10 -22 -47 -84 144 -280 -161 244 -174 -112 39 144 173 -100 -13 422 -63
2154 -63 -230 126 -58 -101 -228 35 238 -173 -132 225 72 30 -30 -18 174 -268 -207 198 -199 -249 -85 59 126
2177 126 -117 34 346 -31 -66 52 33 -69 -214 -64 86 -215 -138 193 71 -38 151 174 144 -47 -143 183
2199 183 -82 -240 -122 45 -54 -113 22 273 26 -79 219 117 -22 -155 -35 146 -218 -318 53 -6 -139
2220a39K20J47r8j55N9J37j33k26J55ol8j30M9L35j72j79M07Jk59K2J19M4k97
2243a37q4K47n0k84L11K2L8n5oL38j59l72L04k3j78l5m0K63j00k69M62Jk28J21
2267H7M1Q6k19j35K85k06k22K33P1o5J0j24M16j13k48L21o9q5p9j24K60k52j88
2290c19M61r8j53J41J6J77j85j71M42k59k99K41p5Q0j36j46N32k43k56N06j23
2311A33o2L4j87L46l07k63M88j85k41K78j07K90k55j30N60l76j52K74k08J61j56
2332f5j33M50l32j45M62k53Q7j7j54L86l65j69M83k21j87K30k06L09l13p3N28
2353C02l35q3K60k03J25j39r9M91m18j33M37k64M2m1j0L85l61j65N77m11j9J08
2375D6q6J61k89o4N76m34j6K36k17K19j91j75N10l89r2L66l07J60j05jL27l80
$$ plain form
2220 -139 81 228 130 -25 34 171 38 -188 -33 -39 -77 -207 -158 177 5 -174 233 234 -25 -3 116 160 -137
2243 -137 -221 26 -24 -308 3 25 63 8 2 340 181 -191 113 90 -88 -123 -163 100 0 -269 193 194 -34 87
2267 87 128 214 -5 -140 145 -61 -283 -50 21 -44 -34 -158 258 145 -103 218 149 64 -15 -139 121 -131 -319
2290 -319 142 44 -109 32 48 225 40 -131 311 52 -247 -6 -81 -1 -137 -283 249 6 -250 256 133
2311 133 71 105 -82 264 -43 -306 182 -3 -244 34 -73 217 -38 -168 392 16 -136 138 -70 91 -65
2332 -65 -198 252 -80 -225 237 -16 71 54 -100 286 -79 -248 235 14 -173 57 -149 160 -153 -226 302
2353 302 -33 -116 144 -59 66 -73 -172 319 -99 -232 205 -59 -17 -58 -68 317 -44 -209 368 -43 -62 46
2375 46 -40 121 -168 -232 344 -90 -106 130 -87 132 -59 -234 276 -113 -205 161 -146 14 -91 -92 235 -145
2397a45m4M49l20J07m9o7K90l37q5M50l77qK38k29K20j80n4M47m61P3K44j90J2
2420a6l8q1M27m52LM44l79Q4nL4K54m24O4L56l80Q7P1p5J54l30J10L46l89J4K70
2445A49j72J63k24j0L53l85MK23j26l0rL6J84l60J01M01l34K1J02n7R4k26lK80
2469A75l85R0J43k4j2r6J47J87l41Q6K53k31o9K5n8K75l17N5K61k11K9Q6K5O6
2493A59j86R0Q7l05lK54r1k7j70J94J84k45J2K90j73r8J5J7O1k47L4K86j79j25
2517a66K25j4K7q7P3J27k12n1Q0k6j01J5Q5J27j92L1J99p1l4j4J29l4j73o4J52
2542C1j05j01J48P9m0j39J76J69k30m9K28p7j28o6J11J0j65K8K51p6j09J18L9
2565A03J3j83J7J98j63k62J99R8p0k4M6J98j83n1K96j70j54P0O3M4k18n8K50m4
$$ plain form
2397 -145 -189 260 -60 47 -2 -69 221 -116 -201 249 -128 -136 102 -127 93 -87 -141 306 -155 -82 162 -28 -16
2420 -16 -54 -135 292 -160 -157 287 -92 -8 -13 21 275 -149 -85 271 -109 -22 49 -26 128 -202 -92 254 -135 -121 149
2445 149 -23 140 -84 -94 259 -126 -122 101 -25 -55 -64 -28 156 -204 -103 298 -36 -15 87 30 124 -102 -105 175
2469 175 -210 -120 23 -1 -13 -109 38 225 -116 -30 223 -8 -77 -52 -110 165 -152 -97 164 -47 -18 68 93 159
2493 159 -27 63 150 -155 -158 96 5 -22 -192 2 186 -59 -47 243 70 -28 -13 4 65 -182 -148 138 -41 -166
2517 -166 59 45 72 -15 58 185 -27 -78 2 -24 -125 -110 -25 102 -90 -59 140 69 35 21 150 116 -57 -121 31
2542 31 -74 -175 -27 52 12 -127 49 218 -12 -61 167 90 -38 -104 7 17 -148 -120 131 55 -54 64 103
2565 103 116 -67 -50 148 -15 -277 -78 20 -50 -74 -28 170 -13 -64 232 62 -92 -22 41 85 -133 -191 59 15
2589A5j73K02LPl4l4K58j99j88J83o7n0n6M6J95n6j84L36o9j29O6J0M5j46j41
2614a60K51j34j86K40K0k8j8n7L83k76j76K79p1j17Jk0J51j58j06L41j41n3J36
2637A01j03K30j74j44K91k79j17K64j21j3k3j4L07j55j69K60j7j13n5j13K79j91
2659f9j57L53j27o8J25j04K65j92j19L61k94p1J69j48Q8j92n3M16k63j26L79j77
2681dM7J4j32L29l54q0L40k14p9J09j06L07k13q8L82l12k7K02j62J67j77j13M04
2704B40l23j03K63j31J19m3k9K83l31j01L64k45L4mj26K61k38j09M47k77J6J62
2726A29j47J03j61q7M25l46mJ54j61J57j06K4K45k75kK79j96k8m6l0K54l10l4
2749a63L50l33J02J18j34J93k77J6L72k76j6J43j46J09j30N3K37m11J63J89j61
$$ plain form
2589 15 -158 44 47 54 20 -14 244 45 -143 40 -27 -77 -133 -87 108 52 -132 204 135 6 72 82 127 -19 -160
2614 -160 91 -43 -229 11 31 3 -15 -72 311 35 -141 138 67 -50 -49 -69 82 -76 -182 159 18 -35 101
2637 101 -2 228 54 -90 201 -78 -195 69 -52 -65 -88 -102 205 50 -119 141 124 11 -44 -157 122 -69
2659 -69 -226 127 0 -68 57 -47 218 26 -93 268 -26 -97 72 -76 12 -180 -233 183 -80 -206 173 -4
2681 -4 43 57 -75 254 -100 -180 160 -54 -133 -24 -130 177 -36 -124 258 -54 -81 121 -41 126 -51 -164 240
2704 240 -83 -186 77 -54 65 22 -7 276 -55 -156 208 -37 -3 -7 -133 128 -110 -219 228 -49 -33 129
2726 129 -18 85 -76 -163 262 -84 -88 66 -95 62 -44 -20 225 -50 -52 227 31 3 -43 -73 181 -129 -163
2749 -163 187 -146 -44 74 -60 133 -144 -128 244 -32 -48 95 -51 58 -72 -19 218 -193 -30 159 -2
2770bN6mo1K00k73L4K34k31J3P4j10J79k67J12J95k78J35Q3m9J2p1M3J97m18J04
2795i3K75j83j9l4O9P9k29J61J05j47N2n8rJ71k85K4K92l11R1R3k7J7r6R7O9j78
2821g4mK89k58Jk3QJ41k07Q6J16q2M6rM6k9r4m6K01k08Q3K5j0m1j9R8J50k24j0
2849d8J44n7p5m8M7O8j17L3J15p4k2N2j4N5j31O4Q4r4r3N1N6j3n5Q5J34j66K5
2876FJ18n9n7K4J3qj54L0R6j19nJ19jOJ3K4P9r5j15J42q3j02O9J2J11q8p7J87
2904H6j05k1J13%m7o8o0K71k58l9J66m7j8K5M2R6r0j16J68jj68J3L4R2j62l7J81
2931E0l4q5J31k0N2l0j51K77j82j09J31j1j20M5k6J74n5o4K14o6j35O5o6P8j37
2956g4p9K55j37p9J82r8R3ro2K20k18p4J87j58l4pm2J59j6j57K78o2k5K1j19J56
$$ plain form
2770 -2 54 50 -11 189 -84 -50 184 -47 -34 40 -70 109 -158 -46 149 -129 6 89 40 52 -19 24 221 -197 -93
2795 -93 182 -1 -20 -54 15 94 -135 26 131 -16 36 -22 -31 140 -145 -121 171 -140 -49 44 17 34 -62 35 104 -74
2821 -74 -78 211 -47 -46 -69 -61 80 -127 -41 75 -7 39 30 76 47 -47 -93 108 -100 -17 8 -2 -43 -62 36 186 -38 -48
2849 -48 96 39 -36 -84 -37 31 -86 -53 62 -12 -34 18 4 59 -72 -8 76 -18 -111 -60 -4 -17 -72 13 147 -19 6
2876 6 124 65 8 32 45 37 -117 -87 9 -110 -115 4 3 9 22 46 125 30 -85 57 -26 -128 -59 -47 64 -24 -101 86
2904 86 -19 -40 73 73 26 -42 -102 169 -89 -128 38 -9 -27 -2 40 136 46 -70 98 97 -71 -58 -24 68 -94 -131 50
2931 50 16 -69 62 42 94 64 -87 190 8 -101 30 19 -101 -56 -82 92 37 -27 187 121 -14 51 -15 63 -74
2956 -74 -153 102 -35 -114 68 -30 63 54 -8 212 -6 -80 107 -51 -85 -92 -134 25 9 -148 130 68 43 64 -55 101
2982A01j21r7K34j33j42J53n6M9L2o7L04k07j05K01j62L5o7k7J95j63r7K24j89
3005a05P1J44j24J85j61q5K79k44%Q0j26L6k7pL18l13k7K36j75O1m3p9K80k89
3029a15l9K96k57N5O7q0K27k43j1L37k66MO6j53J63j76j5L02k61M3N8k7J08m6
3053C7p4J92k74PK26j76N2n8J3J92l13J33K70k70N8K6o9J28k11P2J32k56J42K3
3077Bn7J44k01Q2J81k07J4J19j31O3n2k3J35k06Q7J53k08J44NrK6j16L6J42k72
3102a49J13P1r3N3n9J2J32k01P3J23m8N5l4j2M1k60P4K25j79M0O3p3R7p1J6O3
3128G2j21O4J30k00J43j98Q3J38k23J13L8n9M9o7N4N6j41J5J15j33M0N6k1J7n0
3153c0L2Q7j31N6R3r7R4j96Q4P8j96R7R7m6qr1P0L0l3NM9k0l3l6M4N0j31KJ51
$$ plain form
2982 101 -20 -117 117 -16 -158 -5 -61 -12 20 -47 257 50 -55 146 -16 19 -48 -75 120 -43 -140 84 -105
3005 -105 -34 110 -14 171 10 -75 204 -40 -40 40 -86 -50 -77 -84 234 -79 -106 130 -45 16 -27 -106 174 -115
3029 -115 -154 142 -115 -60 7 -73 154 -89 -100 237 -29 -25 41 -112 51 -125 -140 162 -99 -56 2 -25 83 37
3053 37 -37 155 -119 -112 114 -62 -10 -68 -55 137 -176 -43 227 -43 15 41 -28 100 -111 -39 93 -163 -21 2
3077 2 -55 89 -112 -30 151 -56 -42 77 -54 9 -43 -66 69 -137 -50 103 -105 39 44 35 61 -55 -19 123 -149
3102 -149 -36 35 -58 -5 -64 -52 80 -121 -48 75 27 82 48 36 77 -183 -109 116 -63 -23 40 -33 64 -7 9 72
3128 72 -49 15 145 -55 88 -110 -27 111 -112 1 39 -20 29 -38 16 72 -69 -54 61 -72 -32 24 3 20 -30
3153 -30 2 89 -42 14 107 10 104 -92 -8 70 -126 -29 68 22 14 -77 -7 23 -10 -5 44 24 -9 -45 -1 49 -82 -80 71
3182G1j26J0oP3K9j07L3J07o1o5J19o8r2J0J04j13k4J16Q2k9r2J01j3j5n0j2R8
3209H0j32K0O6Mm1o2Q8N1j07L6Q5j06m4J21o5K8q7K2N4p5M6Q5K1l9m6m7J44j18
3237a8p8R8Ll6j9Q0L1q3l5J28k3o9L2kK1n9KO2j23qJ13J8p0kL2R4j09J1M3r4K9
3268c1Ml0Q3m7q0J67m4nRrJ6m0L2O6q1j10J39m5M3lo0J71j05l7J37j03o8P4p2
3297b9L6p4j1M0K4m5J12l4J7jn5J22j77pQ8q7O2k4r3K20j47J0J74r8l3k3l7J78
3325A08j15m8J11j41J5Q2oJ14j68J4J85j86RP3j20J33j18K7J65j95NJ92k03P6
3349Ij5K2J38k24L2Q1j05K7mmJ25j16j1J15j22P0Qo2Q9k18J65R6j47m5R7n0J07
3376E8l6p1J81j69l7J47j87J28q0J2M7j30J18J26j69Q0J17j35P5j10%Q4j40N3
$$ plain form
3182 71 -55 -45 -51 22 51 -56 -23 84 23 -42 77 9 -83 -73 31 -82 -106 10 92 63 -29 72 59 44 -6 -18 80
3209 80 -52 -32 34 38 -3 -65 23 74 -33 3 88 -18 -62 59 -6 22 -65 -43 11 -64 -18 67 88 49 3 -44 100 -18
3237 -18 -96 2 5 -31 -50 30 61 -22 -57 71 48 -21 11 9 30 -29 -27 35 -88 -96 17 35 -35 -37 -5 89 -20 -9 34 -60 -31
3268 -31 -27 -57 26 -21 -101 66 22 17 26 17 33 -7 25 91 10 -100 39 -6 37 34 -26 145 40 3 140 37 -31 43 -29
3297 -29 7 -67 -78 -38 -14 -59 53 19 36 35 -20 102 -75 -82 6 -81 -19 -43 -136 84 -63 -53 121 23 -10 -33 -70 108
3325 108 -7 -55 56 -85 -70 12 6 120 -48 -34 151 -35 -26 47 -73 60 -58 -31 134 -61 -56 136 -67 9
3349 9 -6 16 154 -70 -38 43 -62 -35 -39 -43 82 -34 -45 70 -52 18 26 -36 53 -165 0 96 -51 -96 1 -49 58
3376 58 22 -49 132 -37 -74 73 -114 14 -66 -54 -7 -137 -19 107 -62 18 135 0 75 -35 -35 49 -91 -38
3400c8J15r7J22j19l3J99j19K9P6j93J36j01n6J26j17L8O3j49R9Q7r8J24q0Q8
3424A02m5j87J07J27q4Rj34L1J23o0PJ06j70J00N0Nm8j53J07M5j36N7L7m5J13
3449F4j05J39l8p3M0M8q1L5r0R8Q4k59J07N2q8J09k0j0O8j89J64mp0Ml3L0l0o7
3477a15J10N4p7N4K6j14N0lk2J06j21m1J51r1L2LL2o8l6O1Q8q6l5O3K5m4q0M6
3505c2Q0j60J18k3QJ00j15J39m0m7j8J9k3k2P6k1j4j04J11K2j05O6PN0o7n4N7
3532HN9r1j9M9l0K2m6N7N9j37N2lN5n2ML8pp7J7R1p3l8R9l9N8rl0j3Qn3P1K8r1
3565c3L8k0J6l6L3J12o4l7J6MJ1p7k8R0n1k9M2L9j30O2M3K6k5j5J14l2r3N2o8
3594d0j3N8m4Q0o1m9L1N1K3m0j9J10n4m5P2j06mK7J4N3m4q2J51j2K6o8L4j4n5
$$ plain form
3400 -38 77 -20 102 -17 -50 149 30 59 135 -58 78 -23 -79 47 -70 -32 31 -118 -19 68 -30 94 14 102
3424 102 57 -130 -23 104 20 29 -105 -74 49 -11 -4 102 -68 32 82 87 39 -114 -7 38 -98 -41 -4 -49 64
3449 64 -41 98 60 -13 27 75 -6 29 -61 37 121 -138 -31 21 -67 42 22 12 80 -109 55 51 -19 -15 -48 -18 -48 -115
3477 -115 -5 49 -28 26 52 -62 -12 -15 -37 69 -52 -93 58 -33 -1 2 34 -34 -70 -9 79 -7 -42 21 46 2 -78 -32
3505 -32 48 -112 6 -17 -9 91 -24 115 75 28 10 29 6 -16 60 39 25 -79 32 54 -51 15 22 72 5 -49 8
3532 8 67 -24 -43 6 -24 -2 -48 9 68 -69 -17 -20 35 -17 -13 25 18 -59 -42 49 -24 -62 37 -2 56 47 17 4 12 -41 30 58 -33
3565 -33 5 -15 1 -35 -2 110 46 9 25 29 40 -37 -65 25 -26 -55 -13 26 -104 -42 1 27 2 -13 101 69 -24 28 -40
3594 -40 -53 5 -39 41 -20 -69 -38 13 36 -4 -23 87 33 -12 60 -46 -50 -23 -9 44 0 -82 69 57 83 15 49 35 -20
3623b0j06J19qm1J62j04L7Mm2J12q3n9J51j62JK8o0J00K5j30J44k1k8M6p6J12
3649A01n5p4O2p9p3J83j48R9p2K1J12j30O2Q6j21R3l9o9J38j88L5R8j48J28L4
3674E6n8Q8p6k1J63k37J7P7l9P9n4k9J57j28l6J54r4L2n6K0Pn5pJ40j74K4P3p1
3702d8Q7n1n7K43j96N0k0m2J14j29m1R7m4l6R3o0J08r4P6N3j52N7K4j45J30k5
3728ho7J70j61J0J08n1m7J30j01J01j17J8J64k89Q8M8k3J8JL1J06j47N0L6p6N6
3754D8on9pl8JP7j0L1j8l1Q3j2o6J01r6p3J22j06O8o7Q5M2j59J68qo8N9p6M3J7
3784D5j17O1Q9j21J9Q6m8O3j04R6l8r6O7M5j03M8k3K8j7m5LJ66j26L6m5mM5o2
3812e2M6J7k0j1Mj3Pl9Q2M8j08N9On2kOk4J02j53O5L2n2Q1n4Q0Ko7LJ8o9M3M6
$$ plain form
3623 -20 -126 -7 -15 -56 106 2 39 43 1 113 30 -29 122 -40 -39 -11 -71 29 54 -76 68 47 19 65 -11 101
3649 101 46 -28 34 -45 -118 65 -83 16 -56 -35 77 -53 9 95 -26 67 28 -41 97 -91 -56 42 -106 22 56
3674 56 -2 86 10 -11 152 -85 -68 9 -30 49 -5 -34 123 -5 -41 113 19 51 -5 15 22 -33 -40 100 -74 -50 23 -48
3702 -48 39 -12 -69 174 -22 28 8 -34 80 -49 -90 7 -37 -73 20 -40 68 -26 50 103 -49 8 32 -113 17 -8
3728 -8 -75 95 -66 -56 52 1 -46 84 -17 84 -33 -15 149 -140 -52 -4 -27 -9 -8 23 129 -18 32 68 -8 48
3754 48 42 -17 -24 -62 -61 16 6 37 19 -12 71 59 -7 94 -2 -75 47 -59 9 -58 27 69 -90 78 70 2 61 -15 28 45
3784 45 -72 -11 78 -43 -24 62 14 77 -27 69 31 -65 2 47 -56 -8 -31 -3 -20 -65 -62 104 -22 14 -31 -35 10 -52
3812 -52 -6 11 -9 -20 -16 -29 -22 -61 21 69 -39 20 26 -26 -28 -22 -46 56 -97 -32 0 -52 29 -25 55 57 -10 -7 11 -58 -15 31
3844C1J2l1n4K3Jk7M1L6o8P2j02L0R7p7K6J8l3M6lJp0p1J11M9l5m8mN7J4l1J1
3875B2l9M2rN3Oj12JQ7L8q6K9M6p2l1jK5l2lkQ4o3oO5m6J0j9JQ4m2j14O7j3k4
3908e4O2%M1j0n2P9o4l8J7K3L4kp0K9Mo0J36j21N8Kk2O0j4p4K4mn3N4ON1q9kQ7
3941C8q1N9kN4m2m4J5J9j9m7R6j27Q6J6L5Lp9j8J08n6QK2j00L6MJ2K2j25J48l1
3971A0NL0m0L8l4k3j3L0Jj1k6J7N4j10L7P0n7M9Ql2L8p1k3N9r2M0P5q6O5J3k0
4002AM8n2K4Mp6R8n9m1J25j61Q5Q1j29O8K3oK9n2rL3j8j9m1K8Q2j04kJ63j48M6
4032B1O3j00L9Pj37J40j37P8N9k5J8o8O6LJ5n5R5j05Ml3K5j2K3m4P4q7J2J50j37
4061d8J32j46Q2P1j13K5O0j15O4L9p6J8oL1J4q1O6L1q8J02j31KJ07j76J36M4k8
$$ plain form
3844 31 43 12 -42 -19 -18 -45 -4 32 -36 36 -66 -36 61 -16 10 28 -5 41 38 39 -31 -102 9 58 23 -25 -29 28 42 11 22
3875 22 -17 25 16 69 75 -37 -36 51 89 3 32 78 6 -25 -26 -1 -33 -36 -38 46 -17 -23 42 -4 6 -13 -12 72 30 -84 -17 -30 -54
3908 -54 8 8 49 39 -13 66 2 -36 -19 4 38 36 -34 -5 -1 -61 75 -46 12 14 -8 52 38 -36 -12 -16 -69 -15 -9 42 -47 -49 38
3941 38 -43 16 14 68 26 -18 -3 16 -3 -50 46 -81 5 21 56 59 -20 -38 70 14 22 44 -56 -20 -16 -4 18 -107 41 10
3971 10 15 45 5 43 9 -14 -27 3 4 -7 -33 -16 38 -72 -35 35 -22 27 35 3 41 -30 -53 6 -86 -46 29 -57 8 21 1
4002 1 49 -3 21 25 -51 47 -12 -53 72 -89 -4 77 -52 16 39 33 62 10 1 34 16 -3 -44 -16 66 -38 -40 123 -25 21
4032 21 84 -16 23 30 -107 33 -104 -26 33 8 26 -42 24 27 42 -13 82 -23 -19 -52 -27 -39 -16 -60 14 -73 -61 89 -48
4061 -48 84 -62 20 91 -22 3 63 -52 12 51 -25 -7 -13 18 32 -49 17 48 -40 62 -69 -67 40 -136 0 44 16
4088A6j8pL0J22k07P7j4m0P3q0L1Lj03J90Rj37N0k6P0l4j8Q0l9r4N3k8L2J7m4
4117c6K6M2r4N6Q4j22M1k1l8P8o8P6M3p2M0Kj24J15o5K9K6m5Q8n2k0N6q0N3j9
4146akJJ1j9L2j0M6o2k2Q1K8n6o4RL1Mo6O1N6l2l4N5q3N3l9N5rp4LJ1qQ7r8J18
4180F3q0rRO0r3J6L0M3k9m3K0N9j1l3mP5k5p5J08k0m7r0P0J0J9k0K8m6j5j3R5
4211E2m9j7J4n4M8pQj10J01j5N1L5r2J11r8M0k1L0j4M8l1k0J0m7O6k5L7k8L0o0
4241gj3J6j2M4k4m6P2O3j13pL7l0l2L8l7J00p5L5k5L2K5j24J11j1M6q9N1LRo0
4271b3l6J21j11kP7m0oO6m0k0o9P5L8nk0J9n7R9j24k5J14m5l8Q6k6L8rq8J12o5
4301dl5J11k3o3K9m2mk6K2O2n8mP9o2RQ1j16N1k1l1M1l4J1Jl1J63j13K8L6j3n1
$$ plain form
4088 16 -2 -9 21 143 -64 13 -1 -41 32 -48 -17 -14 -117 73 82 -55 -5 -31 39 5 -13 67 28 -66 -13 -41 -9 8 -36
4117 -36 -10 32 -62 -6 78 -44 -3 -24 -62 16 -52 24 67 -5 35 37 -87 28 -37 -8 18 -27 61 9 -11 45 -35 18 -1
4146 -1 -3 -2 9 -10 22 12 58 -4 -26 55 83 27 -37 -28 3 7 -59 2 58 26 -8 47 -36 17 -22 33 24 -50 -47 -36 -44 43 -55 63
4180 63 -17 -26 -17 43 -50 -34 -4 39 10 -33 -13 46 35 2 -2 73 48 -27 81 61 14 -76 -6 4 23 3 31 -15 -30 -43 52
4211 52 3 -14 0 -54 -6 -13 -5 -115 -14 -29 22 57 -35 76 -22 18 -3 27 13 61 30 10 20 -27 39 14 51 23 53 -7
4241 -7 -20 -4 -16 28 4 -42 30 93 -20 -27 10 -20 -52 -14 -51 49 -26 9 -16 16 41 -83 28 17 63 -26 25 28 37 -23
4271 -23 -59 62 -49 -51 26 -14 -20 46 6 -14 -83 -8 30 25 5 24 -33 66 -58 -83 31 -14 -52 34 8 46 37 -51 61 -4
4301 -4 -39 72 49 -14 15 -27 -31 -57 -35 27 -31 -35 44 -18 -9 72 -44 7 -14 -45 -4 -38 -27 -26 -57 106 -7 21 57 44 -7
4332gJ2j6k5oO6l8L7Kj2o3M4l8O4K0m1m5J1k7N3LK5mq4NQ4k5J8RnM8q3Q2q2o2
4366h0N4Q0p4K6j0O9oq3%J20j10K0j0qM3j11Q3M6n7j2nK4O2j01P1k7j9k2L8j3
4396a2O5l2j1jm4O8m1l0P2m5j9N2o3m2M2P3k9n4R9k7j8O5Mq2L4K5Rk8r4J11J7
4427F4j8p0Q1n6O0k6Rl1l8N0nn6m6K9L3lm3M8kL2mRm4N9o5O8l5p8P8O0p8lJN3
4461C3K6p3M8l3k9j4K2R8Pq1mM7%q0L7O1m4qN2p9n3J44p7k4K4j3P0K5n7lL4j09
4493e3J30r3Q5p7nqM1n4Q7n6pK7n1M4J9m7j4M7J0q7P9N2m2ok9J1Ml3j5K4O7n0
4525@M1p9l6K6K5M0p8N9JP5p7OM2l4l1P1l5L6j3o7N0Q9r8q4Q7O8m1o9mL8k5M2
4557B5Nl3K7p0NN8J4J3nj2m7o4R9k0M2l3kk2k4N1l8JO1P1j45R6j1o1M2j5m9J43
$$ plain form
4332 -7 5 -11 -36 -42 24 -14 23 25 13 -50 -6 -44 20 40 -1 -46 -35 -62 -9 -6 19 15 -69 -64 20 -5 13 22 17 65 -18 64 -18 -80
4366 -80 -26 54 -20 6 -4 65 59 -24 -24 96 -14 6 -4 -12 31 -80 3 49 -8 -20 -25 -1 61 -40 31 4 -15 -37 1 -12
4396 -12 53 21 10 9 -35 33 -8 -38 34 -11 -30 22 -41 -83 -41 32 3 -51 48 21 3 68 72 -10 24 49 58 30 -64 47 64
4427 64 46 -24 57 1 61 35 44 13 -25 25 20 -36 -82 -53 -20 -23 -66 -18 -20 12 8 17 -27 32 -33 35 0 -78 0 60 -18 -21 -20 33
4461 33 59 -14 34 1 -28 -42 -20 78 85 4 0 47 47 -33 4 65 21 13 65 -14 -67 77 0 -24 0 -13 57 82 25 22 56 -53
4493 -53 77 -16 69 -8 -13 -21 20 -34 53 -3 -10 17 -34 10 29 -18 -32 15 25 -62 17 69 27 21 -8 3 7 -26 -41 -17 50 0
4525 0 41 -38 -74 -48 -23 17 -61 -2 -1 74 -3 3 45 11 -20 51 16 52 39 -28 22 111 13 -71 16 84 43 -26 -30 8 -17 25
4557 25 30 -3 24 -46 -41 17 31 44 39 27 -20 -84 15 -5 37 4 2 -20 -44 7 -31 -30 31 102 -43 53 42 -19 23 8 -41 102
4589A02j23%j8L2l4NP0j4K8l3R0m1o5K5n9N6k3k9O2J0l5L4n4K0j7l3P2K7j28J13
4619D0q9QK2j6L1l1j4J0K1N4o3L5k9j1M4OmL1k1p9qL4O8M7j30PN3K0j4l9J5J4
4651A2j08P2M4m3J8N4J5k8j7k2LPk0J1m8O0q0O3O8q7MR2o6k7n0O9M0k9k9l1J5
4682c8K3K8m1J12o0k9J9l1KN0o4j0L3l8J36j06N6j4q0N4QJ2LL2o7O2p6m0R9k1
4712A4M8j08M6P6o1n7L1ok6LR5m7q8L2P4m0N3o0O0j9m9K1R7j12L6K8q0ol8O4N5
4743C6n9P8l8k0N6o2j7lJ2Jm6M8K7jk4O5j04R2M3o0K8m6n1J32q6n5O3k7J1O9n1
4774A1J3j6PJq9R9l3qK7n4J2N3pl4J05j36Q4k5k0L1l6O7j5j6K2k5n2P1o8P9K1
4805F9k4n0K6kk9J4r5J33q8Q1r5J07k8j8j5O4m0l6J36p1n4M2k1ml2M6K0m4N5k6
$$ plain form
4589 102 -21 -21 -39 -7 -41 -36 34 20 48 15 105 64 -1 24 -35 21 -2 -31 31 41 6 40 -14 6 -11 -44 28 55 -73 40
4619 40 -49 -41 -19 -35 -4 -35 -49 -39 -18 36 -27 8 -21 -32 12 18 14 45 24 -55 -63 -29 39 86 -44 -37 16 36 22 -17 -2 12
4651 12 -96 -24 20 -23 -5 49 64 36 19 -3 0 7 -13 -2 -50 10 -70 -7 61 -26 -22 70 4 -23 -73 -4 36 7 -22 -53 -38
4682 -38 -15 13 -28 84 24 -5 14 -17 -15 35 -29 -39 -6 -44 92 -14 42 28 -52 2 10 22 25 57 -10 52 -24 -64 35 14
4712 14 62 -46 0 76 15 -42 -11 -17 -43 -40 55 8 -80 -48 26 -14 39 -21 39 20 -29 -8 89 -23 13 41 -39 -45 -83 -19 36
4743 36 -23 55 17 -3 53 -9 -26 -29 -17 -16 -62 -14 13 12 -12 53 -51 41 84 24 52 6 -45 87 1 -54 9 -18 -7 62 11
4774 11 24 8 15 16 -73 26 -7 -15 12 -42 -30 23 16 -18 87 -49 35 10 -10 21 -15 52 37 21 43 18 -34 37 -31 48 69
4805 69 45 -5 21 19 -10 4 -91 42 -46 35 -60 47 19 1 -14 50 10 -26 110 39 -15 27 6 2 -30 16 36 -8 47 21
4835B1lm2j1M2o7M5K9J3m6l7ML3K4L1L3q7l3P7k1l4M1m5O4m4LJ0PK3QK4rp2K1
4868Bl2K7%M5q4J0J1K6PK9PKlm5j8OJ1K9o5QN3j1M6r6Q1o2L8o4M4L7l6p3P7LO0
4903G0q5nN4j9K3l2n6Q9k7k9m0R1K7p0j6L1N4n4QK4%m5r1P8M1n0M1m0L6oJ7K6
4935D5K0Rl3m3l1N1j6M2q5M1O3j24Q6k8L9nl4m7J13k5l4jm4M5jjQ1n9m1PJ8L2
4967D0j7k0M8k3j2j9l5NP1l4N4p0ON7J0n4P5j49J19r3Q7o7J6L2l3Ql4j7j2P6n1
4998c6O5J0j5o0N2j5N3o4MOJ7Ml3mM1Pj16J12l6n5J07m8Ml5M2J1r5J01Kl5l0N0
5030A1m5J24q8L1m9n9nP3J5Nk4M5J9o1JL9j8M4rk0m2Q4j36N7m7O3J6lK1l3j6M5
5062C8m5K3n9K1P8p5o3P1l3Q8k0n6O6mL0l8k3L9j23N2O4o4ON7rk4M9p7k9R3o1
$$ plain form
4835 21 18 -24 -35 7 -60 -15 14 27 -19 -56 -52 -19 5 36 69 -18 -51 26 5 -29 12 -33 31 -13 -10 0 7 30 38 62 53 -19 2
4868 2 -30 -3 -3 42 -42 -32 -21 5 12 41 48 50 47 2 -16 -10 1 30 -35 -27 26 15 61 -35 46 -16 22 -42 2 39 3 -70 7 10 70
4903 70 -15 -20 34 15 38 6 -50 39 12 -17 -57 34 61 -9 -25 6 60 6 14 38 38 -7 -98 -20 21 -29 12 -28 8 2 19 45
4935 45 65 74 41 -2 -33 18 2 44 -41 0 63 -61 25 -3 36 31 -3 -50 63 38 4 3 -41 4 3 2 83 24 -17 -10 8 40
4967 40 23 3 51 28 16 -3 -38 -33 38 4 58 -12 -6 51 61 7 82 -67 52 -41 46 -21 -5 27 -6 2 -32 -49 -61 15 -36
4998 -36 29 39 24 -36 16 1 54 -10 -6 0 17 21 -12 -16 25 32 -84 28 -8 -63 44 -4 0 -35 7 18 -77 24 26 -9 -39 11
5030 11 -34 90 2 33 -16 -75 -80 -7 8 13 -11 34 53 -8 -7 32 14 58 49 29 -13 71 -65 -8 -55 8 24 21 42 9 -7 38
5062 38 -7 16 -43 -22 56 -19 -82 -11 -44 44 24 -32 34 30 60 22 -1 38 -85 -33 31 -33 -27 30 21 -3 46 -31 -60 33 -28
5093b8j9M1NpknM7l3PPJ3k1n8L3M2n5mJ0p4R1Po5J35j29M9K8nMj3JJ0l7M8r9R4
5128A8J8k8MP6p0j1K5m9Q9q9P0qo7jM5JN7n8J3m8M6J7qJ6n5o9M5N9p1N5l4K5m6
5161c3O2qJ1j0o1N6J6p4L7Pm4k0O8K4k4J6Oo8Oj5L8J0k1K5J2q8J01m0K9j9j2J
5193a2J20j09k2Q5r9O8q0L3k1Q1p3K7j9MK3J8L6o5J4LK8m2j6M3ll4P9q6R0m9q
5224A4N4q3j8J5N0j9QNj0l6N9oo5K9M1l8j0N2k1Jq6P3k3K3Om2P2n3k5K5K0m4k5
5257e7M2J7Rk7K2l6J41l8j03M3J5p8N5m3M7K2m4J21j62JO1m4j0J07j12R0oq7J15
5286F1l4m7K4P2l5n3j3L2K3o1N5o3O1Qq2N3j1m5Q6j1k1o3QP1ln8J9Q2q2L2l0J4
5318a1M2o1K9L7n5M0p2P9r0K1P4o3k2O6m0Q8j1j02O2O2q5K1k7M1M4j05Q0o8J8
$$ plain form
5093 -28 -47 -6 -1 -8 -10 -15 32 -1 6 13 26 5 -53 -20 22 -33 -37 -27 -101 -10 -3 -68 67 -62 -13 15 10 14 1 2 12 -25 23 -76 18
5128 18 36 8 12 88 18 7 32 -17 72 -17 53 45 -22 -23 22 23 80 22 35 -13 33 50 42 58 3 -66 -21 38 -33 22 -12 13 -33
5161 -33 29 21 32 22 -39 17 33 -41 -4 3 -41 -61 7 31 7 23 29 -39 -33 -48 -10 0 -21 4 16 -72 29 -11 18 -1 -13 -12
5193 -12 108 -1 -23 62 -37 31 -49 -16 -37 44 -29 -2 -21 -17 6 24 60 -5 9 12 40 -2 -18 25 22 -12 67 -19 71 22 14
5224 14 68 -15 -33 -18 32 13 21 26 16 -20 39 33 -32 -3 38 0 -10 42 21 22 -64 9 -14 9 15 -27 45 -8 -33 -8 12 -32 -57
5257 -57 -15 2 11 -16 6 -30 111 73 -30 13 28 -50 5 -38 9 31 -13 108 -54 -53 8 -36 -46 61 -51 39 33 -54 61
5286 61 27 -20 4 76 41 -12 -25 7 30 -31 24 -39 22 30 -52 1 -10 -55 31 20 -1 -64 -56 15 12 -46 -27 55 -27 5 -25 -11
5318 -11 31 -30 -1 36 -19 21 -51 28 -62 -41 33 -30 -52 14 -26 62 51 -51 11 73 -12 9 -18 23 67 -38 42 -26 -8
5347hN7r2lP8n5P6r9l4J03j9Nmk4M4rl1KN0j9l9L9o6J2N8Mj9j5N3j8m1J4P0m2
5380B8L6m8J8Pk8pl3P5mo3Q8p8k6N4j9K9j4n5O6J3m0Q2q4kj5L3M6o5k4M7o8kO8
5413A5k0M8o0J5N3n9KM8j8%o7K4N7n7O2j5K9k3o7Q2n4J0l1L7p8PN6kJp0J06l8
5445glM6J8j05K1Q1r6L5j3J7j6K6N6j17K2M6m2j2N8j9k0k2jN7n8J7O8OJ0m5J7
5476B5rj0J0jj5l9M1P5l1q3L2K7j3k4O4j4o0P1r2P8%n3kN3K5j05O6qL3lj8j08
5508h8M6P2kPl7l6L5J0J5k7On8M4k7Mk2O6m6O5k0k5j1L8rk6L9j4j4m8O3m2M1j5
5541a6J5J0o8L8K9pk1%k5K9N3n8K1M6n3K0P9o6Jkk8koj2k7jOQ4kMo6M4r8O5J7
5576Cj8Mj9l1N6J1Po3M5j9opN9nNr0Q3L6q3j5L8Mk7L4m9O2LnK1k0Ll7j4K3L3o
$$ plain form
5347 -8 49 -43 -46 32 -23 53 -46 -80 23 4 9 5 -19 25 16 -15 -13 37 18 -21 18 -48 -36 22 26 7 -8 45 27 -14 0 70 28
5380 28 64 16 34 41 13 6 -27 48 44 -19 69 -9 -35 19 0 29 15 -40 26 39 -1 81 -3 -5 -20 13 59 -6 -30 17 -51 -53 15
5413 15 -5 43 -17 -2 51 -8 -6 42 24 24 -43 -19 38 -19 43 28 57 34 -33 49 -5 5 -26 11 -67 -60 -4 -6 -5 -75 31 -7
5445 -7 -10 36 54 -51 -30 51 -45 -10 -23 -6 -22 4 60 -57 -35 11 -31 -43 15 -4 -24 -46 -47 10 -48 -31 37 43 53 8 25
5476 25 16 6 16 15 0 -39 2 77 46 -37 -5 22 9 -15 49 35 -25 46 -46 32 32 -21 -23 30 55 -50 16 8 41 38 20 -88
5508 -88 -42 30 28 35 -2 -38 -3 7 22 -5 1 -57 -13 -40 -36 -58 8 -38 27 7 -18 -29 9 0 -26 13 -1 -15 -63 0 -42 -1 -16
5541 -16 -1 9 -59 -21 8 1 -20 -20 -45 -16 37 -21 0 46 -7 13 92 26 27 25 -3 -5 -11 -23 -50 -51 -45 39 37 41 -25 19 -79 -14 3
5576 3 -15 -11 -30 -61 -5 6 13 -50 -5 -24 -30 -37 22 17 22 -68 15 51 -32 -47 -9 -5 -32 2 -47 15 18 13 34 14 17 -20 -34 -11 22 16
5612A6qj5kL7q9J01p9N4RJ3k0qm4N8j6k6%M6j1j1L2l9Oj3J7L2j02Q3m2o3J16n8
5644b6Q5j4n2N2o1J9L5L0Pj13J2P4q3L5L4m9P4l8n5M1P9p2L5k8j8J5j6k9N1n5
5674c1M1MO1l9q8J14r8L4L7l5%K0m2RL8j6l5K5n0Q4j36R9J3p4Q6p3nL8m8RJ3M4
5706aj6K2k7O0n0PK6o7N4J9p7QO1nl0K8k4M6n6K1k0K7L0Lm7O8q8k1J04j6M5j18
5738c4N0J4Pl6k9PN6j6k0Q0p4m6Q1p9O6J7r0J3RK9k3K5k2P3k9p2L0J3L8j2Mp1
5770d1M2pn5J21m3qK0k4k2L0j2M8K2r2k5Q4n4M1po4J09r5N6o1JJL2K9j3l9JM9
5802B4pk0k1k0L4KN5n6j3kM9j9K6n0M5m9J2J1l0L2l5Q6n3j5P3o8j1O8p1K3K1L2
5834E3j46J43l7J6K4m6M2k9K9n8R3k0N6n5q0N1pRk2j6k7L3ormR8j09J8k0m5M9
$$ plain form
5612 16 8 -7 -9 28 -61 40 -39 15 24 37 17 9 -35 23 7 -19 -19 27 16 5 37 -2 4 -9 8 40 -62 21 -21 -84 32 -26
5644 -26 59 45 -7 45 -16 3 38 68 75 -38 -26 48 -35 0 34 -15 59 21 -34 7 86 14 49 21 3 18 2 -27 24 -31
5674 -31 10 14 75 36 -52 62 -36 -2 35 0 0 20 -22 -13 25 9 -26 -1 -51 33 -103 -4 9 -65 21 -52 -57 -19 -67 -58 -45 -1
5706 -1 -17 5 -22 38 -12 -5 21 -46 8 27 -50 -42 19 14 -16 12 -12 34 -22 -1 -21 6 36 39 -8 60 -28 -49 55 39 84 -34
5738 -34 16 30 37 1 -28 -21 35 19 -1 79 5 -41 40 -39 27 44 -46 -33 -24 5 -18 7 -15 58 29 -43 -13 0 38 26 30 -41
5770 -41 1 -6 -61 60 17 9 29 5 -17 13 1 49 71 -21 -46 38 -16 25 18 -46 63 -32 24 -37 -36 -35 -3 26 13 -26 -25 24
5802 24 17 -3 -24 -44 -10 -8 47 -9 -22 -24 25 6 32 -18 27 -22 -10 1 -29 3 -32 54 1 -14 59 -9 -20 48 -23 0 21 53
5834 53 -93 50 13 29 53 7 49 20 49 -9 84 64 120 65 -15 36 29 38 16 0 -27 6 0 -9 -13 85 -24 -6 -26 -71 -22
5865b2k5k7J30K3j29J0l6L8RJ8L3l5Lk1J9Qj0L3J2n1J0k0P4k3o3R6p8J8ql1N0
5896Ej4m6Q4Kp6N8k7r4J33n4nj7P7q1K9J4L1Jj6N2q3P5k6l1K7m1M5j5r2R2%ok1
5929b0mk6PN6%L3n3L5m4KL0q9O1K2m4M7R6j32K3Rj4rM5QJ8m6kjL9l7nL%L5L3j6
5965F0o0ko0Q1j9p9J75r0m3L3J4kJ5j3L8p2J7L0l8kO0r6O3K0r1O7n2J2O6j17Q1
5996dQ1j42R1n9L9k8J2J6L9n9jM6l4K5q8J32m0n3N4n5J8R2m5j1K8p9M4Jl5M0%
6027B5qMk1k6J4j8M6q0O8J0m8Q4mn7M0n3rM7l3NK0j8J6m5M1Okl5K1M1l4K5q3L6
6061b5prO9J7l1j1Kk2RK3j6M0k6Q3j20PK6Kj9l3J32p7N4p1Rl9R6n6L1m1m9O3m2
6094c1o7Q9Jm6P0k1M4p6L6L8n9L3Jn1M5p9N4jP5j30J54j08O7l7l4O1j9Jm0M5O
$$ plain form
5865 -22 -47 -74 56 79 -50 -40 -76 -38 -29 -11 22 -13 -10 -31 -12 -4 -14 19 31 -20 -10 -30 44 21 -42 54 -24 -6 -14 -45 5
5896 5 -9 -55 29 31 -45 13 -14 -108 25 -29 -34 -51 26 -55 -26 -12 19 20 4 56 -27 48 22 -9 18 -23 22 7 -85 7 7 1 -20
5929 -20 -24 -50 -43 13 13 46 -7 28 -16 -14 16 -73 -12 10 -34 13 109 -23 0 9 -5 -14 31 39 57 11 9 8 47 10 5 8 8 43 76 60
5965 60 0 -2 -62 19 0 -79 96 6 -37 -4 10 8 23 10 48 -24 -7 23 -15 -17 43 -53 10 30 -61 6 -46 -34 32 -85 -4
5996 -4 77 -65 26 -33 6 -22 -10 6 45 -14 -15 31 -3 22 -66 66 26 -27 27 -28 -10 82 37 26 54 -25 19 20 -15 25 25
6027 25 17 21 0 -26 -12 -30 16 -64 4 14 -34 50 46 -11 29 -24 -33 14 -19 -14 6 -12 4 -41 0 6 4 -31 -10 31 -3 22 -61 -25
6061 -25 -32 -41 28 45 14 3 5 -17 -8 15 -1 39 13 96 -24 -17 9 11 -8 -41 91 14 68 -3 6 -33 63 7 38 -3 -52 11 -31
6094 -31 -98 -9 -8 -54 16 -5 39 -37 -1 37 -22 11 12 -39 6 -73 -19 -20 55 -75 79 -29 38 1 -33 28 9 10 -30 15 21
6125B1Mj3L5o2k4mP7p8N5j01Q5k5P1p3O6k7J4K1l8m4J3rJ3L1K0m7L9o0j9k6J22
6156C7n1o1J41q0L4l4LPn3k7M9L8mm8J13q9L3j9jO9K2q1J5K5j00K7Q8n9L3K9n7
6187aK0jO5p4l4L6l2j3%P0n2j2O7k1J3j4RJ5Pm6%K4l2rK7K6q0N3NKM0p1Qm6M5
6222fJ2l4k0K3MrLk0O0M4k8k3L7j9m1oO7np2M1n9L6P5r6K0N2k0q7J17j11O1m8
6254e2j1J62n2l7l5O8l9Jj7kk0L1l2nK4j7K1n4J01l5k5N8n6J3L5pj8Qll2J00q6
6286a3M1l3K2m2N5nl6M0m3j8k6L9K7p8k5J13q4O5M0mM4r2L9l2O6k7p7L4K5j8o
6317iO3n4J1l2K3LM7n1k8mL3j3J0N6n4l2O7l4K0l6L6lk4J9J9k9M0o1J6M1q6J20
6349G4p9n6Q7oRK4k5pj1l2K8K2l2K6L6p5J0k9l7L5k7J4N2k1k7rK5J6K8p8P3J0
$$ plain form
6125 21 25 12 47 -15 -39 -43 34 -44 11 -90 -5 -30 41 -32 34 7 21 42 4 -40 -27 -36 -23 8 28 -19 20 -40 -59 -85 37
6156 37 -14 -75 66 -14 20 -14 -11 -4 -57 -84 -35 3 -1 -49 64 -25 8 -11 -12 57 79 -2 13 38 -62 -35 53 -6 27 56 -1
6187 -1 19 18 83 9 -25 11 -21 -34 -34 36 -16 -28 39 18 31 17 26 41 48 2 2 26 -6 -15 12 38 -42 11 16 18 58 -13 -5 -51 -6
6222 -6 6 -28 -48 -25 -21 -30 -27 -47 13 57 29 6 43 24 -17 -23 44 39 -33 8 -51 -15 60 -36 -16 36 16 -71 46 -65 -4 -52
6254 -52 -63 99 47 10 -25 43 4 5 -12 -14 -34 -3 -35 -40 -16 -33 -12 -66 35 0 -25 33 -23 -10 25 18 0 8 5 -27 73 -13
6286 -13 28 -5 17 -25 30 25 -11 29 -14 -32 -58 -19 8 -70 -95 18 -66 -1 39 35 79 -13 26 -6 60 33 -44 -10 15 -3 -9
6317 -9 54 0 11 -21 2 5 52 1 -27 -31 2 -11 -1 55 1 -31 36 2 22 -14 22 19 -5 14 33 4 44 -17 -1 40 -46 74
6349 74 -5 -61 26 20 29 53 28 21 10 -22 6 28 -4 22 58 -17 -7 -36 -73 -38 -65 -51 1 -20 -47 -56 -31 -15 13 -65 8 18
6381A8lk0K1j3p2O4lJ5J3r0P1O1j03J5P7p8O7Mp2J4J4L1j6l5M7J6l2K1qk8K0K8
6413D4n6L1q5J42p3m0M4k4mM6n0K4l3N8n6L9o5J02p9O0Qj26Q4P9j11O8p2K4K5
6442Dn8K7l1J1P2l0nJ9n1Q4J0qj5q6J20k7l3O0r1nO9k0L9m1N6k2k2m1J3Rj2nl4
6475d4P4m5j3Q1mp2N3o8OQ4l6oj9N1l9nm6mN2k4k2O5K3k1L9K1n1j1J7m7Lk1j9
6508d8R8K6j0n3K4k4j7L2n6qL7L3n2loO5l2K9p6J1Q2m3Jk1L5M2q4K9l2nM4Kj4
6541Fj6L4j2j8M7m7N3r2KQ4o7k2qN0j8J6K6n3L9k6L5J4rn7L1k0mL6m7O8Ok5L0
6574C6l5J0j6M3o5L7QPK2l6L7k7K8k6p9J09m7J1K8q8O4l1n6L8ooR6l4J9J0l5j3
6606Cr5J12J4l0k8k7QK7RK5n2M8kK2n5rM1m0L8L4q4J24rr1J5P1p9J9rM7k6k8j2
$$ plain form
6381 18 15 -5 16 3 -69 -5 -8 7 20 -70 1 62 -41 -26 51 -27 40 44 -28 -14 0 31 15 -20 27 43 11 32 24 -4 16 44
6413 44 -12 19 -66 76 3 -37 7 -17 -21 25 -25 -1 -34 24 -32 7 -58 44 -35 25 33 -93 -9 70 -41 27 -45 -21 4
6442 4 -54 -27 -58 -47 25 -5 -10 9 -42 42 52 44 29 -57 63 36 3 63 -28 -33 36 16 55 14 70 48 26 -15 -2 7 -5 -10 -44
6475 -44 30 -15 -28 53 49 -23 30 -38 -32 52 16 10 -9 42 3 -2 -48 -52 0 -24 -46 19 42 21 60 81 30 19 36 -11 -8 -29 -48
6508 -48 50 76 66 13 37 13 -4 28 -28 -36 1 34 -18 -21 -27 38 6 35 -41 -30 52 9 10 -11 24 66 -18 11 -21 -26 18 20 6
6541 6 -10 24 12 -6 41 -6 47 -45 -43 41 -26 -48 -56 -6 -24 -8 18 -35 4 -22 13 27 18 -39 -8 -28 -32 4 -43 25 31 6 36
6574 36 1 11 -5 38 -27 10 18 25 47 11 48 21 49 23 -56 53 6 17 45 -43 21 -10 -66 -28 -34 -40 56 22 41 51 16 3
6606 3 -92 20 34 4 -24 -51 -43 -16 -7 18 -34 14 12 34 -21 -30 11 -29 9 43 -41 83 74 -17 -2 69 -10 9 0 47 21 -7 -19
6639a9M6RnJ2k4l4j3OP6m0l1l5M3K0p5kP3k0j5JL9m5J2J9J6p7O8j1q3J00o1M3
6671gJ2j21J92p1o6N4p2P0n5J14m4K8p3N5R7q6o6P3J5j13P6K0p3L8K2J1Q5j55
6699d0N0Pn1L2j3M0k9Q7j19K7K8q4M7%M3n3L1M0o2LN3l9J4J3J9p8j0NQ1p3J0M8
6731B7l4J2k2rJ5N6k3o8J4L5L0m5Q3q5J0J02p8k6K4j8J00j07k4M8k7N1ok0K3K
6761D0o1J7k1RM3o4l1L7J1M2j09P4P4n7K4M0q6M3l8NN4j9m8K7N8o4kr2O5l6M2
6792b3M4n1M6J2k0K2q1M5L2n7P7l1m8J4k3OO2m3K5Qj2mK3L3j05K0M0k4n9M5L6
6823Ik7K0L9p9Q8n5L4n4K4ol2J0k8J09l3k4P6l1p2P9m2o5J50q6J6q4Q8k5K9p0
6853d2N0M9j04Kk1P0l0M1j2Q4j22N3j3j2m8K6L1J2L5l9J1p1N7m2M4Nk3N7p3L4
$$ plain form
6639 -19 27 36 31 43 19 -15 -28 -22 54 14 -17 -52 -9 11 -64 -66 7 -13 -28 -27 12 -33 -21 -2 14 -63 5 -6 -89 11 -50 -7
6671 -7 5 -116 76 5 -61 -7 -79 -9 -64 50 6 34 -39 16 113 27 -39 34 49 -64 12 32 -41 -3 19 30 115 -40
6699 -40 10 17 -34 -2 -15 25 -4 83 -36 -9 19 -65 -18 -18 25 -28 3 43 -19 -16 37 -2 12 25 44 -34 -44 -39 42 -31 -21 27
6731 27 -7 5 -17 -26 -11 45 22 -46 -32 3 33 -12 71 -14 -4 98 20 -6 18 0 100 -7 -31 17 -10 41 35 15 38 40
6761 40 -21 -4 -25 -16 27 -37 -68 -31 -20 22 -87 -13 61 4 28 68 -18 25 -13 -8 46 27 -21 6 64 0 -2 -94 -29 -65 -23
6792 -23 21 -30 16 28 8 30 -51 -6 26 -31 46 15 -33 -19 -42 -36 26 -17 8 16 4 0 23 56 -49 -29 11 -13 -72 -27 9
6823 9 -18 2 41 -38 50 -5 29 -25 -1 -7 -39 -29 -57 52 19 -5 71 40 -32 47 5 -60 90 4 20 -64 24 -1 28 -42
6853 -42 8 57 -47 -45 -66 4 -26 15 3 87 -35 18 5 -7 -55 -29 2 14 49 10 21 -50 7 -35 9 14 -9 48 -25 9
6883In4k3J33n1j7L5j7Pj07O3Mk8N9RNj4N2n9M0K3m8m9L5Opk1L7PL3mj4q3Q1k8
6917A4m8O0l7RK8l4M5JJ6j35P8M3j05Q0o1N6l3n0P8O0m2p9K6K1K2Ll7L1K2l9k9
6948c6m3J36l2l3k5n9J00J5m9j4P1jj5m6j6R9p1L5k8pRn1Q2J0o9N8n9L0O1m4M0
6979D8q6MR2r2QO9k5K7r5J5J04l4k1Jm1L5j6j6kJO3m1J2l2M3Rn5M2n2R4n6L7m1
7012aJ2O4q3j7N7m2JL9l3L6M4j39J21m3l4O1k7ML4q1N7jqN4j13M3%n2P4l8r5J44
7044C8p9jQ7m1m3L8k4%J2qroP7qj00K8O2j03M9L5o1J03j08M5Pk0M4j1j5j0R0m7
7076B1l8j2M0m9L2N3q0M1K3j3m0k5N8L6q0k3O0n4K0O0q4K9K3j1J9j1K1mJ3J1j8
7107A8J0L4j17NL7n3R2jk7Nl6M5l2K9qk9J4K0r0P2j6J2N5m0L5q3J13j00M1j5R1
$$ plain form
6883 9 -45 -68 65 14 -3 32 15 22 -85 -22 -18 -46 13 22 27 13 65 6 46 69 21 -28 7 13 6 -15 22 29 62 58 44 -39 42 14
6917 14 -34 26 -11 -2 26 -8 37 38 54 -81 -3 40 -65 15 -46 10 -23 -73 5 65 23 -56 -30 -9 13 16 -21 10 32 -7 -36
6948 -36 -79 57 25 -8 -33 -92 8 23 -26 -40 31 30 15 -31 -47 52 -19 16 -12 -19 -10 -61 21 31 -38 20 -39 -9 52 8 48
6979 48 -38 -34 58 -34 -26 43 18 45 -50 -35 69 35 14 15 -26 9 -7 -23 -25 -24 39 -2 10 -22 21 30 -25 17 -35 59 3 40 -1
7012 -1 11 75 -8 -25 32 -10 -9 30 -3 33 77 -62 59 16 -18 43 16 20 54 -27 30 29 21 75 -38 5 5 -47 27 -11 -106 38
7044 38 -41 -42 45 4 -39 -1 -25 -25 -13 -21 -30 -36 41 33 -67 -39 23 -80 -31 4 -57 46 -62 -17 -10 -30 14 3 -12 -22 68 21
7076 21 -17 -29 11 -38 -6 47 -33 8 31 18 -22 -47 11 47 -33 -56 4 -50 -30 30 -54 -25 -2 -13 6 -5 16 12 25 36 18
7107 18 28 62 -55 -50 -13 -66 26 25 -2 3 -33 12 -20 9 1 -28 -14 6 -84 -12 -28 -16 39 -1 34 -49 64 -36 5 -10 81
7138H1qk0Qn8j8O3n6J1Jj9K7lK2M6j4q2L1l3pO1n4Q4n0k9Q5k2n8j1J6J7jk3M9
7171C6qj7r9N7L7J0m1J2k3M0l6L8m6R4k3n5k7N2K2o6P9o6K8k2O7k4k9j0P3k3l2
7202bL1k2q5J32Qr7J2lO9Jn6J9J0JQN5j8r6k3QQ9n7qN9l0K1J5j5M6k9p8L7Lo1
7236e6P3l7L3M5m2l4M5J8q0pJ2J8l2O9K2o5Q3n6nP9r5M6p3RpL3K2J9k6n2J4j1
7268c8L9K1K6m3K1J6po9J1J7ql9m9J52J7l4l2j7N0k2o1Q9n8n2K6P9m0K5nJ3Ro4
7300b7Km3P8jq6Q5Pq0R1l2j5R3o3N5n4J4l3M7j4R5j57N6l1j1K4mn9J03p5J2O3
7331D0j14J05l8O1n8q0R5L7j12N3M2o4M0J3k6j6n5J45p8n9J75q2J8m6MJ6j2J7
7359B1J3o6M8m0K6N9p5k8P7p0R4l7J8J9n6m0M7l2l9J20n1l1qj3J35j8j11J16l8
$$ plain form
7138 81 73 53 61 3 -15 48 -8 3 4 -15 12 9 31 77 63 -19 12 -21 -28 33 -21 63 13 -16 69 47 -11 -22 -6 11 10 -13 36
7171 36 28 11 -88 -31 6 16 -25 -13 -36 4 -32 6 -40 54 31 -24 -51 1 23 -43 36 -30 -2 -24 43 19 -10 -20 53 30 -2
7202 -2 29 7 -78 54 62 -35 -23 -26 43 44 -12 7 17 18 26 81 63 -33 -56 -48 41 -16 -24 35 5 26 41 26 72 43 -35 2 5 -56
7236 -56 17 -20 13 58 16 -18 27 45 -35 -42 -30 -12 -44 25 47 -18 65 9 4 83 -12 34 -39 -30 -37 -4 18 37 11 -41 -27 -38
7268 -38 1 22 48 5 26 42 35 -34 -23 -6 -14 -53 -102 50 67 33 1 -16 34 12 -49 40 -18 -70 -44 35 -5 20 15 28 37 -27
7300 -27 -25 -68 10 9 -77 8 15 -65 26 -6 -21 72 9 64 10 24 -9 38 24 119 -38 18 -13 -24 0 -4 -63 40 -35 -23 40
7331 40 -74 31 -7 54 -4 -84 11 48 -64 -11 31 -33 7 20 -6 -22 -77 68 -10 -69 106 24 42 -4 0 16 4 21
7359 21 34 -32 16 -24 2 61 -14 -42 35 -35 59 22 40 59 3 -37 10 -22 -61 59 8 -23 -31 -44 91 73 -38 78 40
7388D0j6m2J3L8n2p9Q6l4l4J13o3N2MJ5p1J8m2j2KL4J5j9M5nN9l1k0k6O3Qk0o0
7420b1L5K3o8K7k1K1l8O7l7J2J7J2J4km6J0J6l3M2k4r5P5ML7q5O3Jj0Q8j16QO
7452a8j3K4m3L6L8m4Nj6K2P9m3n1Q8j12K1N4r2Q1o0M3k2KP3k8o6M2q1J19J0r8
7482e0L8J0J1M6l4L9M0j17k6N9nJ3k4J4l2j2L6k0J4j5j1N6n9k8M0L6o8M3M1m5
7512a0j4L2m3K3J0K1Mp3O4j0J0jJ3m7k7L0J0K7k4Qp1j8J45k8J6j4j2L2j3n4M6
7543C2J4k9%l9k7K4L7L3l6M2k2K0pL3j11K1Oj2k1N4j6n6J9l2N9p2O8J7J2j3n0
7574e2L6QoJ3M6Ml8jL6l7M7m2m2J9k6K6k4Pj5KO2m3NJ4q2N7L5P8q4l3J7J8l8N8
7608B5p0L5M5Pl0J3m7M6n8M5k6pK4j4M0p4R2p3K4L6m2L0m9J27r1m4M0m8K3n6R9
$$ plain form
7388 40 24 -18 -5 33 -19 -98 -12 -46 -80 33 -30 22 26 41 -30 -12 -54 -66 -64 -30 -15 -34 11 6 65 34 14 -12 51 59 39 -21
7420 -21 14 37 -31 -4 -25 -4 -42 25 -12 0 17 29 43 41 -5 5 21 -12 30 6 -89 -14 -10 27 -58 5 6 -4 84 -32 -24 -18
7452 -18 -31 -7 -50 -14 24 -20 -15 -31 -9 70 27 -24 64 -48 -27 27 -65 16 -44 -1 -23 -21 52 24 -42 0 -81 38 48 -50
7482 -50 -12 -2 9 55 21 60 100 -17 -43 16 11 24 0 14 -18 -30 6 -14 0 -15 -26 30 -29 -57 -17 19 -49 -6 35 -10
7512 -10 -24 8 -35 -12 -2 19 23 -50 14 4 14 13 26 -21 -48 -18 -8 19 -5 3 -68 -86 59 31 47 33 21 53 40 -14 32
7543 32 46 17 17 -22 -49 -25 12 45 9 51 29 49 42 75 -36 -15 -9 -21 -42 12 -4 -60 -41 -73 -14 -86 -18 -1 11 -2 -52
7574 -52 -16 -8 -14 -1 45 49 11 10 46 9 56 14 -28 -9 -35 -9 -33 -26 -41 -39 23 -20 -15 -1 -83 -26 9 87 3 -30 -13 5 -33 25
7608 25 -45 -10 35 42 12 25 -22 24 -34 11 -15 -22 2 -12 28 -46 46 -27 -3 33 -9 21 -28 99 8 -36 4 -44 -21 -77 22
7639B2o4Q0k1j3j4J8J8k5L3K0o6l5P7k8kjmR8j22N7M3j01n1J34q9K6J2qJ6Oo3
7670d7R9J3j33R4joj2Lk8M2l8l5K3K2o9J52o9o1O1l5m3M2R9j21L6lL5m9mR9q1
7701a5L3K9l1n1Q9n9N0p8j9M5M4nJ%p2Q6o4j2K8o1M0m3O9pM4%l3l6P3n0L4K8r6
7734c9N9K1n2j1o3J06n2J4L5m4j7J15l5n4%%K3Kj5l4J02n5L2r7Q6k1m0P2o4KN3
7765B9m3L5j6jL0K6p3O3l4MPn2M0o0Pl8N8k6L1L8j4k7K7J8m1P1o4m7M9o5N3k4
7797c9N1l6P6m7lOl4L7m0K6m3J9K6L9n6L4n1J09l8m5%J9pJ7J9r1J10p5M3M3n8
7828A1o6R4j3p9oP3j4J4k3J9p7M9M1m4M9j16P5Lo2Q1k4O1n3p0N9plR0j13R0j0
7859B9n0o0J03k5K4q1Q2l5l9N0k3J6J6n8Q2n3L6m0N2k0Q1n0Lj4n2J19j28J04j18
$$ plain form
7639 22 -42 38 17 4 -10 8 26 1 34 54 -12 -47 30 2 0 -1 -5 93 -29 28 71 -30 -81 53 -36 -10 2 -6 10 16 -47
7670 -47 52 65 -68 26 25 19 7 10 -18 24 -14 -49 -26 -4 -73 79 10 -51 10 -25 -68 -26 73 -48 -12 -15 20 -29 -33 66 -15
7701 -15 18 47 16 -35 54 -5 45 -33 -52 -7 37 32 33 33 -39 47 -17 -29 -1 -62 -22 -65 4 -3 41 41 8 -28 45 -5 29 57 -39
7734 -39 20 41 -11 -22 -85 21 -31 -17 18 -26 -43 72 37 -17 -17 -17 6 8 -7 -41 61 6 38 -59 27 6 -34 38 -26 -24 29
7765 29 -14 21 5 4 34 60 -13 50 16 20 27 -25 15 -45 -38 -76 -18 -44 -13 25 11 -16 11 29 -12 59 -5 -52 -3 -68 -15 -39
7797 -39 12 -24 52 5 2 8 -26 11 -29 -3 -46 -27 -1 38 -18 16 -35 74 36 -9 -9 10 3 20 39 -52 58 -17 26 69 11
7828 11 -55 39 26 -53 -59 14 0 14 -9 10 -67 -18 23 -21 28 -88 -13 -10 -72 9 -15 46 -7 -77 -18 -25 -28 62 -51 39 29
7859 29 -21 -81 22 -3 21 -60 22 -13 -52 -2 -25 -9 7 -51 31 -22 14 -26 26 6 87 37 40 26 -26 93 -35 69 -49
7888d9L9l9P4K5on1M8Jk5j4k0M6p8J0N6p9Q3j8%qk3L3M1l7n4opjP2q8M7M4JL5
7922E2j22J07k3k3k7O6o9J9k4%O4l4O2kr3M2K5J8J0o8R5p9K2l6j9LR8j53Q1J0
7952Bl9Q5n9NR8j36o2J38p9M9K4p2J17r3J1K7jn3R6o6M0kj00R0j08L5O2K0k7N0
7982E2q1N0Lm4N7j2l2n6O2Rm3R5N3p7m4mQP3j36J30n8Oj7o5P2M8q1rR7n3lNl7
8015c2N2l7N6l3k0M5j00N4L2m3m3R0J4mj0q8J29r5m2Q9j9l9P3j6j06P0J5N8o5
8044a5L2J9j08J05j10J2J18j7m0rk3M4QM7q0L6K0o9j4O4j7Kj5L9rj6J8k1J4qJ5
8075B2n9l3J05r9N4m4J14n9kK0nL8r2O7m3P2j34Q7J3k8M4k9n1M2k1L6O1m7r5J05
8105C9r9M1J9l0M9j4K7Om3LL6n8J6k3QN5m6K2P4m8oL0q7L3K5J0j8n2Qn7O8k0K0
$$ plain form
7888 -49 -10 -49 25 50 44 -7 41 42 17 3 -17 29 -49 -39 17 -62 21 3 3 -5 -28 5 46 9 -45 -51 -58 -59 13 -75 -28 16 17 52
7922 52 -70 37 14 -9 -36 30 -39 -20 -44 -44 20 -14 48 46 -47 -5 20 38 48 -20 75 -4 18 -18 -37 -34 64 -89 -8 2
7952 2 -37 48 -11 -6 92 -44 -106 32 -47 2 26 -46 71 -22 -11 16 15 -38 58 -8 32 30 -70 20 -88 -53 9 29 2 52
7982 52 -29 21 24 -20 37 25 -7 -63 -1 8 -35 60 113 36 -8 -12 -4 69 -67 63 5 11 -6 -71 1 49 -32 -41 56 3 0 5 -32
8015 -32 20 -17 39 6 -14 31 -69 -15 17 -26 -69 21 35 31 21 -67 62 -33 -75 14 -5 -44 29 13 -93 -23 -8 50 -15
8044 -15 17 36 -72 33 -77 -65 53 36 -4 -13 -36 8 16 63 -17 19 39 -30 -44 20 3 5 -10 29 20 4 22 1 15 7 22
8075 22 -37 -70 35 -64 -10 -54 60 1 -1 19 14 52 -40 27 -16 56 -78 9 22 -6 38 9 -42 0 -21 15 76 29 -66 39
8105 39 -60 -19 0 -30 19 5 32 38 -5 -2 34 -24 -8 -31 -23 32 -14 8 82 34 28 58 -29 4 29 39 21 -31 -23 -80 -12 -32 -12
8138a2l3J8O1K8r5N5k6plK1qk5L1N2Kn5jK2n3J0Q4r3L6j0%M1m9Ool7M9jMj6JK5
8174A6%j7L0K9o5L1oL4m8oMK5j2pq0P1K5
$$ plain form
8138 -12 -45 -27 34 62 -33 22 -4 -11 -14 7 -1 -26 5 57 59 4 3 25 -28 -18 66 -27 9 -1 -1 40 -9 -3 -9 -46 3 2 6 -10 -9 16
8174 16 16 -1 29 58 -7 24 18 52 4 -2 2 27 15 8 -72 -1 24
8191B4
$$ Imaginary data points
##PAGE= N=2
##DATA TABLE= (X++(I..I)), XYDATA
0@%%%%%%%%%%qJ6j6J6j6K4l2L2m0M8n6O5p3Q8j04J20j36J52j69J92k17K42k72
33a44L05l42L81m23M71n22N78o41P10p86Q70r65J070j186J320j474J655j868K121
52A130k432K824l332M024n024O595r437J6106n7104l3207J50029l8846q9608L9197
66a9085P0531l8799m9202L4908L2641l3424q736M779J0973J0731l0454n129M4207
79B3941j2595l8087J4044M0101j3939m6571L3353M6007n4694k8772M6965J2366
91B2119l1370j3872K5832J6703k4954n212J5426M040J60j9324L73K8477j7202
104A196j8757K2188L567j4408j364J0168J575j1050J0413O478j4976Q282r1j2954
118i733J7288k068k1671J2398J5124j0476j3777J3065J8069k1500r588K2561m717
$$ plain form
0 0 0 0 0 0 0 0 0 0 0 0 -8 8 -8 8 -8 16 -16 16 -24 24 -32 33 -40 48 -56 64 -72 80 -89 103 -114 128 -144
33 -144 161 -181 200 -223 248 -274 304 -337 373 -413 457 -508 562 -624 696 -778 877 -991 1130
52 1130 -1302 1522 -1810 2214 -2810 3785 -5652 10454 -46650 -79857 70172 31326 -58282 -19085
66 -19085 51446 12647 -36555 -1647 30994 -2430 -11166 -6387 4586 15317 -15137 -20266 23941
79 23941 11346 -26741 -12697 27404 13465 -33106 247 46254 -8440 -37212 9753 22119
91 22119 -9251 -23123 2709 19412 -5542 -10754 4672 8712 8872 -10452 -10079 18398 1196
104 1196 -17561 4627 8194 -6214 -7578 2590 4165 -6885 3528 10006 -4970 3312 3221 -9733
118 -9733 7555 5487 -16184 -3786 11338 862 -12915 150 18219 -3281 -12869 9692 4975
131D975r410N548m239K988M703p795n317O700J4019j1587j5803K5007M099k7972
145a4084J1544J7687j7759j1247J5738R005j8862k353K2102q243j2356J2078p71
158B479k387L667p433J554P902m711q941L056J3709o515j4465J4274P452j3824
172d183J561P331j820m659j957N841q04n594M484M16j451K035l446L287L334p148
188b773J209N888k549n206m53P630o46r208M255N136l634N55o20O68L706m649
204f91k499N155M05m503j610O336L24q960N272P575r482j729R173j520o593O02
220b745O303k31p294J484M757k010j106r60J664M068n018k526O588J97n308n23
236b660N153P53q038K060Q577o530m801P626J561n430j848N514L031p285j014
$$ plain form
131 4975 -4435 1113 -3126 -138 4565 -3230 -8547 -1847 12172 585 -15218 9789 13888 -14084
145 -14084 -2540 15147 -2612 -13859 1879 10884 -7978 -10331 11771 3528 -8828 3250 2479
158 2479 92 3759 -3674 -2120 5782 1071 -7870 -4814 8895 2380 -12085 2189 9641 -4183
172 -4183 -2622 4709 2889 -1770 -3727 2114 1310 -4284 200 616 -835 1200 -2246 1041 4375 -2773
188 -2773 -1564 4324 1775 -3431 -3884 3746 3100 -6108 -1853 3283 -351 204 -416 252 3958 -691
204 -691 -3190 1965 2370 -2133 -3743 2593 2917 -6043 -771 6804 -2678 -4407 4766 3246 -3347 -2745
220 -2745 3558 3327 -3967 -2483 2274 264 -842 -1802 -138 3930 -1088 -3614 2974 3171 -2137 -2660
236 -2660 2493 3246 -4792 -2732 5845 -685 -5486 2140 3701 -1729 -3577 1937 4968 -2317 -3331
251c331O257j575k808m40J608L535m885k508P064n51m576J289K903L18m866J181
267a385N804n655k462O041j514k685K26J841K935m399r07N372k609j621J110R
283A01J799l875n23N743m136k128M738n83j327j342K397L414p000M50O999n170
299d43k936L019J280L80m781K420N710o076o79M347p97pm068J506N892p152j873
316d258O741j319k790j099M243L425q576J606P991n883k987K530J583Q30o405
331d368K071O940o020j564M073R90L69n417K132O589p619j975N852j306j753k594
347c600L614M639q054J086P403m489j653Q05J161J987o309J190N634n154o14K103
363b51Q14K255n380J735O462o844r74M370j778n49k880K356L876o829J690N347
$$ plain form
251 -3331 2926 1351 -1457 -1897 -289 3246 -1639 -4147 2917 2366 -2210 -921 1982 2300 -2566 -1385
267 -1385 4419 -1236 -3698 2343 829 -1856 -1630 211 3146 -1253 -2160 3212 603 -1018 92 101
283 101 1900 -1975 -2498 3245 -891 -3019 1719 1136 -191 -1533 864 4278 -2722 -2272 4727 -443
299 -443 -3379 -360 920 1300 -3481 -1061 4649 -1427 -2106 2241 1444 1437 -2631 -1125 4767 -2385 -4258
316 -4258 2483 1164 -1626 -2725 1518 4943 -3633 -2027 5964 81 -2906 -376 1207 2037 -4368
331 -4368 -2297 4643 -1377 -2941 1132 2122 2491 -2926 -794 5795 -1824 -3799 2053 747 -1006 -3600
347 -3600 14 4653 -3401 -2315 5088 599 -1054 -249 912 2899 -3410 -2220 3414 -1740 -2354 -251
363 -251 563 2818 -2562 -827 5635 -1209 -2183 2187 409 -140 -3020 -664 3212 -3617 -1927 3420
379C420l815O24j89O20K739n710J195M332n266L17J177N6K213m662K235N244n921
396a391N92L309j837Q5l018K264K650o627K301L984l670J204j68J078K457n262
412b049J965L764m886L3P31L37J152m777L154M091n840J516L201j362j31k670
428a771K848K057o607J972L497l267K98m50K123J786n030K873L370m285J0N52
444b4R98J72n026L334L433n670J188L072l62m82k433L410J804n991J685K733k382
461e41l26j372K656J532n106K830L579l435j83M61J498k6m514K764K478m501N25
478a681K040K01l58k182L236J634m480J381K048j807l76j262J887Q01l907K163
494f62K547k251k45O75J581l84l204K630J505m084P67J748n70q62r56K835O48
$$ plain form
379 3420 -395 229 40 660 3399 -2311 -1116 3216 -2050 -1733 -556 -500 1713 -2949 -714 4530 -1391
396 -1391 -799 2510 673 758 -2260 4 2654 -3973 -1672 2312 -1358 -154 -322 756 3213 -2049
412 -2049 -84 3680 -1206 -1173 -442 -105 1047 -3730 -576 3515 -2325 -809 2392 1030 899 -1771
428 -1771 1077 3134 -3473 -1501 1996 -1271 -973 -1423 700 2486 -2544 329 3699 -586 -576 -24
444 -24 974 1146 -3880 -546 2887 -2783 -1595 1477 1115 633 -1800 1610 3414 -2577 -892 1841 -541
461 -541 -867 -2239 417 1949 -3157 -327 3252 -183 -366 95 1593 1567 -2947 -183 2295 -2206 -1681
478 -1681 359 560 202 -1980 1256 2890 -1590 -209 1839 32 -344 -1606 281 1082 -2825 -662
494 -662 1885 -366 -611 64 1645 1261 -1943 687 2192 -1892 -1125 623 53 -809 -1765 1070 1718
511A718l497J829K028j875p53R4J663p96l079K577J812k865j89J641J123r86k078
528a633K710J328l818J33K566l78k150q46L155N74m004J414L279j737j884Q69
544d22K508j035l738K203K906l092j484K158J428j382j878K309J892l179m89K421
560A126J42j585j387J754J812l064n81L011m14j779J48J911N13l033N23L076j919
577B54j803J371R51m83j658J148J827k542j67K503r75r48L36N21M35j645O12J283
595A020j993M87J181q66L38o67K75J631j909j78J601q63k44n46R78J270l200L23
613a362L473j797j908J164J887l07l402K202L266m571r22L926l86k070j280K691
629F04J747m016L68K976j310o16o65J434J922m194l35M279j380k263j71K323J718
$$ plain form
511 1718 -1779 50 2078 203 -550 -456 1207 411 -2668 -91 1721 -1144 -1333 308 1431 445 -1633
528 -1633 1077 2405 -1413 -1280 1286 908 -1242 -2088 1067 1641 -2363 -949 2330 593 -1291 -422
544 -422 2086 1051 -2687 -484 2422 -670 -2154 4 1432 50 -1828 481 2373 -806 -1295 1126
560 1126 1268 -317 -1704 50 1862 -1202 -1783 1228 814 -965 -817 1094 1607 -1426 -903 2173 254
577 254 -1549 -178 773 290 -1368 -220 1607 -935 -1102 1401 426 -522 -186 335 770 -875 -263 1020
595 1020 -973 -486 695 -171 167 -500 -225 1406 -503 -681 920 57 -187 -733 245 1515 -1685 -1362
613 -1362 2111 314 -1594 -430 1457 1150 -2252 -50 3216 -1355 -2277 1649 1263 -807 -2087 604
629 604 2351 -1665 -1297 1679 369 -247 -912 522 2444 -1750 -2085 2194 814 -1449 -1620 703 2421
646B421m491L72M921k758k353J812J801l96m170J806M270m192j347L129k7n63
662B35j637J427K649l714k66K828j217l56j141M34K408k656k33K489j415M20l63
679a08k22K608k885j021L235j508r81L87J64J265k291J018K629l635R15K501k442
696c71L66K27m76M97j792K003N69l447K664J163j986J168p45P35M67k211J770
713F01j39j867J575j076P33J760l652J578K867k243p02L48J518l39l737L172J734
730B131m540J097K099j18n17k055K966J538m226J328J897j447o99j136K428O54
746A400m152K052K355j646N4q09J797R80l854J552K115k618n07L28J794K59l794
763b694K399K832k885l41J274P02p48k683K820J237m451J413K120j174j4n67J421
$$ plain form
646 2421 -2070 -1698 3223 465 -1888 -76 1725 1329 -2841 -1035 3235 -957 -2304 825 798 235
662 235 -1402 25 2674 -1040 -1306 1522 305 -51 -1192 -758 1650 -1006 -1239 1250 -165 255 -108
679 -108 -330 2278 -607 -1628 1607 99 -882 -495 -331 934 -1357 -339 2290 -1345 -430 2071 -371
696 -371 -5 222 -254 243 -1549 454 1023 -2424 240 1403 -583 585 -160 575 1042 -1169 601
713 601 462 -1405 170 -906 -173 1587 -2065 -487 2380 137 -565 -217 1301 962 -2775 397 2131
730 2131 -2409 -1312 787 669 152 -1903 1063 2601 -1625 -297 1600 153 -546 -1682 746 1400
746 1400 -2752 -700 1655 9 63 -746 1051 2031 -1823 -271 1844 -774 -1281 -953 841 1100 -2694
763 -2694 -295 2537 -348 -689 585 1287 539 -2144 676 1913 -2538 -1125 995 -179 -193 -760 661
780F61O49k194J408L97j345O80j307R22J181k987J040K181j576R2K13R27R0k277
798a245J917R71l268R82J161q20j40o16J674J41j989K068N56j891O87j07J77Q8
816C46j781J305O38j485O44M69K94j35j115J961J52k473J104P90j039j13m55J055
834A62Q7j548J649P69j282j5K71R76o07j884J596N89k000N99R46j61o34k22J951
853A242k97j925J201P84j111l55M2O90m24j057J417M01j126L33N07M95l60j241
871g84J252N54k003L31J306n75j112K55J774m41j853J645J075j599l12O19N75
888G07q37j174J491P70j794p1J414K55q58o87J501N71k181L03J673q93j224L13
906g21J521k05k010J018J865j504o41R77O69o92j501J170J344k037m84J546L13
$$ plain form
780 661 1310 -884 524 921 -424 256 -1051 -129 1052 -1935 -895 1286 -290 -198 15 942 1032 -1245
798 -1245 672 1643 -1625 -643 518 -302 -442 -1058 616 757 -1232 836 1392 -499 188 81 258 346
816 346 -1435 -130 508 -977 -333 136 430 295 -820 1141 1293 -1180 -76 714 -325 -438 -893 162
834 162 249 -1299 350 1119 -163 -178 93 1069 462 -1422 174 763 -1237 -638 308 147 -487 -709 1242
853 1242 945 -980 221 1005 -106 -461 -419 271 -153 -1210 207 608 -518 -185 322 817 457 -784
871 -784 468 1022 -981 -650 656 81 -1031 -776 998 557 -1296 349 1424 -175 -487 132 707
888 707 -130 -1304 187 957 -837 -908 506 761 -97 -784 717 1288 -893 -590 1083 190 -1034 -721
906 -721 800 595 -1415 -397 1468 -36 -677 300 969 277 -1224 -54 1290 -747 -1231 315 628
923F28p71r65J472J124k337R0J928p49r95m9J148L50k139N29K021j398n80O71
941b2N67J16j608O93J756j853n19J145M1k04j101Q77J394k089J45J597p69k66
959a00k96N16Q88j922M09J543j444q7M65Q4N47j418N58J524j870J42R74m88L13
978C38r43N40J181k050M17J360j179K50j85L37Q74j793P25J335j738L82L11k26
996f4N56j485Q69J374k130N73J031q47M79r45Q69Q86k253P98J218j381K22k33
1014d63N67P47k099J159J477k108O60L72j07M11j789J171J154k314P17R58o55
1031a42L89j077J261R37k556J153J155j432K53n93P30O62k253J372J316j827N94
1048e8K25L67L23k053J462J093k415O66O65l98K02j256J475R28k306J000J125
$$ plain form
923 628 -143 -1108 364 1488 -849 -759 1169 420 -575 -624 524 874 -1265 -736 1285 -113 -693 -22
941 -22 545 661 -947 -254 1502 -351 -870 275 316 112 -989 -112 1282 -807 -662 935 166 -100
959 -100 -396 120 1008 -914 -505 1038 -406 -493 -28 56 603 -815 -257 1267 -603 -461 513 25 338
978 338 -605 -65 1116 -934 -517 843 -336 -86 -271 66 940 -853 -128 1207 -531 -149 162 -64
996 -64 492 -993 -124 1250 -880 -307 724 -123 356 -589 280 1166 -1087 -289 929 -452 -230 -463
1014 -463 104 851 -1248 -89 1388 -720 -60 312 205 616 -1173 -2 1152 -1162 -445 513 -142
1031 -142 247 -830 431 1368 -1188 -35 1120 -312 -59 -652 78 740 -1513 -141 1175 -652 -58
1048 -58 167 534 857 -1196 266 1359 -1056 -390 275 -123 79 -1177 298 1226 -1080 -80 1045
1065A045j079K23p67R34M61k357J290J121j615N23M8O43L51j849J419Q95k021
1082g35O19K71k77J53j264J453N88k050J299O56o30K79q20J139J65k114J348N65
1100F45j451M87r2O94K27j624J694N96j771Q26J46k06o5j171J328K22j834J273
1118g6N40n72K59n54J253j4j798J350M06j376K02j14P40j39j387J716M66j484
1136e82P42L30N7k53j116J415Mj845J014M43m14k0l48J333p7j465J309M22j117
1155a68Pj59O42k98j274J361L86j118N39M55K04k93q50J231R6j527O70K73l93
1174b16j98k07J025o6j149J240L92r45J68M0L86m66q82J006R2r97N78L93O3k50
1194Gl61J072o5j173O41L64o75l01R9P25m76p76J166M78r62J31N01K43n91o44
$$ plain form
1065 1045 -34 189 -578 356 817 -1540 -250 871 -744 -221 -173 470 821 -1028 391 1286 -735
1082 -735 -116 155 -122 31 -1233 220 808 -1242 57 713 83 362 -458 681 846 -1268 80 645
1100 645 -806 -319 -411 283 510 -1114 580 1176 -595 231 377 171 106 -1065 263 485 -1349 -76
1118 -76 464 -108 151 -403 850 836 -962 388 794 -582 -380 -494 246 107 -1280 436 902 -582
1136 -582 160 490 547 294 -822 593 597 -1248 -234 209 -205 -225 -573 760 683 -782 527 949 -168
1155 -168 -161 -320 322 24 -1250 111 497 -621 -82 373 577 284 -566 665 761 -766 -96 177 -216
1174 -216 -414 -621 404 338 -811 429 821 -124 44 84 470 4 -878 128 220 -777 -199 194 257 7
1194 7 -354 718 653 -520 121 485 -190 -491 -392 333 -143 -919 247 725 -237 -106 395 638 47 -597
1214e97J019K0j294L37Q33k69n64Q6J112k9j178O41P09q09m00K05N35l71r94Q59
1234a49Q75j096p2P65J85k70p29P44N66j358oR05k11n95l08J022L97j331N28J000
1254H62q74j94L43J40o4j011O47P75j087L7M92K0J21n31M95O18j264L24P11o58
1274i8k8l48M13O82j260K81J028q91P2M24P6k4j018P57P51j476L40O47n08K72
1294I2m28M48N89j378O36Q63r93KL2K98L01j296P78O70j137L86K38J6L25j181
1314g39P56R93j622K62P03k75n8o73R10M88j710P66J005r18%k65P35L76j695R96
1334C5Q28j513M04L59k4K37j176Q89P85j347N13J33j4M24j261P89Q92j875O83
1353b39Q60p74J81n31O59O89j624Q55O02j038M67k17K79K52j419J138N92j464
$$ plain form
1214 -597 422 442 -852 -515 318 49 -515 -429 683 654 -524 117 826 17 -383 -178 357 -14 -1008 -149
1234 -149 726 -370 -442 323 508 238 -491 253 819 -539 -545 360 149 -446 -754 268 665 -666 -138 862
1254 862 -12 -206 137 277 213 -798 -151 624 -463 -426 66 86 207 -324 171 789 -475 -151 560 -98
1274 -98 -126 -474 -61 621 -639 -358 670 -221 -149 275 351 327 -691 66 817 -659 -319 328 -180 92
1294 92 -336 112 701 -677 -41 822 -171 -169 -137 161 462 -834 -56 614 -523 -137 101 117 442 -739
1314 -739 17 1010 -612 -350 353 78 20 -653 257 745 -965 -199 806 -112 -112 -377 358 734 -961 35
1334 35 863 -650 -246 113 89 326 -850 39 824 -523 -10 123 109 533 -728 61 953 -922 -239
1353 -239 621 -153 28 -503 156 845 -779 76 678 -360 107 -110 169 421 -998 140 732 -732
1371g32Q45J02l16M77q35P15L80j335Q31J93n09L20p48P09L58j344J182L30j122
1390d99Q24k51J87J34j216J051K66j214O36P1o9K07p77J324l4j567J319K28q66
1409b46L77o55O62J15j203J208O6p85O07j12N24j62j196J305L1j150P10k74O5
1428a13K50r74J204K11j377J054L80m85j10n16J068l38j230J272j44p08O07l02
1446b51O91j00r76J231K8j025N29q9Q9k00o88J146k82r81J059O2n7N2n62R31l05
1467C02j083J019l6o78L09o8O07l59o29J149j26n63M99l22K75l42n12R89l67r74
1487i10R31J85k30o3m1P48l74o46P94j60m86K1j8M73m37n74J110O9p48N18J69
1508C31N6m37k29P82m41p06N44J82j39k48L2Q49l79n73Q17M0o31qK04J81m02m41
$$ plain form
1371 -732 113 215 -101 376 -459 256 636 -699 132 325 -184 136 -612 97 455 -889 293 623 -499
1390 -499 325 74 261 395 -821 230 496 -718 -82 -11 -80 127 -650 674 640 -927 392 620 -246
1409 -246 131 -524 138 253 -950 258 324 -461 146 34 558 396 -800 505 536 -614 96 -178 -113
1428 -113 137 -837 367 578 -799 255 635 150 40 -476 592 254 -976 296 152 -556 51 -251
1446 -251 440 340 -636 595 623 -402 127 38 127 -73 -761 385 103 -878 181 243 186 238 -324 607 302
1467 302 -781 238 202 -476 -167 -235 372 13 -616 533 407 -156 343 21 296 -46 -558 431 64 -910
1487 -910 21 206 -24 -87 -128 620 246 -400 394 234 -252 -231 -249 224 -213 -787 323 392 -356 162 331
1508 331 387 -50 -279 503 62 -644 -100 82 -57 -305 -273 576 197 -376 441 481 -150 -158 46 227 -175 -616
1530f16O49J49m92K10L40J11m10j62Q04l15p59M37K62l84j82J20M05p0n32P12
1550B77K38n10j28L29K60n34m07N26J29p53L50M06q9j72n0N82kp35L08M37n75
1571a13j81J13K81j81m27O31L05o43K49L58j08j88l90M14K56q92K55N06l61j03
1591b19M0M32J05p59N57M11o33L8n0J47k4o92N66N32q99K90M06r8J1m26M78K90
1613E03j013M38L55m96K8j28M28K74r36N70O33q94K40P1Q3k0o41N69L51j023M16
1634a92K91o2J21n70O10L51j021M82M17n97J59l00M33K64j043P20L88p55L75l3
1654C8J79J20q95P11L56j038N43J07j83J30n93P65K35j007O78K27m82K73m86M88
1674A66J81r63O94L16p47L40q0K60J38q38Q70J57r94N82Mm0Q5o31O83K21j044
$$ plain form
1530 -616 33 182 -310 -100 240 351 -59 -221 583 268 -491 -54 208 -176 -358 -238 167 97 -435 277
1550 277 515 5 -123 206 466 -68 -475 51 180 -573 -223 183 94 -78 -128 454 452 -283 25 462 -113
1571 -113 -294 -181 100 -81 -508 123 428 -215 34 392 284 96 -294 120 376 -516 -261 245 -116 -219
1591 -219 -179 253 358 -401 156 567 -66 -28 -78 69 45 -647 -81 451 -448 -158 248 150 161 -265 213 503
1613 503 -510 -72 283 -213 -185 -313 115 389 -547 23 656 -238 2 73 156 136 -505 64 415 -608 -192
1634 -192 99 37 158 -412 198 549 -472 10 427 -170 -11 -311 122 386 -657 63 451 -304 71 38
1654 38 217 337 -558 153 509 -529 14 121 -62 68 -525 240 475 -532 146 373 -109 164 -322 166
1674 166 347 -616 78 394 -353 -13 -93 167 305 -533 337 494 -500 82 86 46 131 -500 183 404 -640
1695f40P23J32l99L88n15N86O3r54Q73J41p53M39k45L36k3q16R03J26q42O55r1
1716H7J0M5o00Q40M8j069Q36j4l51K39m32O60j8q37Q61M7n82M02l69M35p5q21
1738f58J000j25p41N97o8Q5J1n61R45j44q54P67j39j90J21m79P34j58p97R72j02
1759B16m31K93j59M71k35o83R17k79n87M91r2K41k21m13J026l35o10P29j40j09
1779I0j09l11O56l57o44R17q1k94J28j36N94k86n33Q32k62n64L83j08J28k27l16
1800e00R44l45n36P19k9r2j46j99O00l96n56O69n2k97N5O9M61k97m00P75j80m23
1822a56K40k9O1m34j20O88k72m15N29R7r0o9p4N06l65n02O11j34l34m3J63L68
1844B26l95j06O17o2l92K84R6q3l07j66N56l17l57L69J02q2j14J44M03k53l41
$$ plain form
1695 -640 83 215 -184 204 -311 275 338 -616 257 398 -355 84 -161 175 152 -664 239 365 -477 178 87
1716 87 97 142 -458 382 430 -639 197 183 -168 71 -361 299 281 -556 305 352 -230 172 -197 238 163 -658
1738 -658 342 217 -524 73 5 90 101 -460 485 341 -513 254 115 -75 46 -433 301 143 -654 318 216
1759 216 -215 78 -81 390 155 -528 389 110 -477 14 -78 163 -58 -471 555 220 -390 339 199 90
1779 90 -19 -330 326 -31 -675 242 161 -133 -5 -141 453 167 -366 466 204 -360 23 -85 43 -184 -500
1800 -500 444 99 -437 282 253 161 15 -184 416 20 -536 133 81 -216 -161 -92 369 72 -328 447 267 -156
1822 -156 84 55 116 -318 -438 250 -22 -437 92 189 99 30 -44 462 97 -405 206 72 -262 -305 -142 226
1844 226 -169 -275 342 280 -112 172 268 185 -122 -288 268 -49 -406 -37 65 -17 -131 13 416 163 -178
1865a78M09J4l11j62J05J77k43j90N69m0l42K84L01k03k05j79M66j52n22L49J25
1886G2k72l8J82L35k74k19N63J03n18M7J52o2j51l10M08P8m23K65K73n0j74j0
1908b3L86q8n28K18J94m35K5J74J51q0l82N95K29n06K2K75o2k02l19M25R0o45
1930d86L92K79k45O9j01L54N0n40K93K26n30J27N5Q1M3n27M97K44n38L16K04p0
1952A93l6l95M85J05p94M19K28l42Rr5M21P2n32M48K32n04R6K1JJ07n73N32J37
1975B35o12L63J81j47J78m15L97J42p33M96J27l61R7k88M35J51p17N89K07m70
1995a45L01j50J95j09o18O92Q8p26M80l7L1J34l75M82oo66O54o9k41J38l52N26
2017B27r5o03O88l8l50K91k08K65l5n66O86N6o44L80j03J15p9l99P11j28o32P22
$$ plain form
1865 -178 231 245 -66 -228 -123 54 -189 -379 190 150 -192 92 393 190 -15 -194 272 120 -402 -53 72
1886 72 -200 -238 -56 279 5 -214 349 452 -66 -19 133 71 -80 -390 18 96 -327 -62 211 161 -13 -23
1908 -23 363 275 -253 -35 159 -276 -251 -77 74 -6 -388 207 436 -70 -48 227 165 -37 -356 69 159 -486
1930 -486 -94 185 -60 9 -92 262 312 -228 65 291 -239 -112 -57 24 67 -460 37 281 -257 59 263 193
1952 193 157 -238 247 352 -442 -23 205 -137 -128 -223 198 270 -262 186 418 -86 10 31 32 139 -434 98 235
1975 235 -377 -14 167 20 198 -217 180 322 -411 85 212 -149 -52 -340 95 246 -471 118 325 -145
1995 -145 156 6 201 92 -526 166 254 -472 8 -29 2 136 -239 243 237 -429 225 156 -85 53 -299 227
2017 227 132 -471 217 179 -171 120 -88 177 142 -424 262 318 -326 54 -49 66 -13 -412 299 171 -461 261
2039B61j28j11Q1l63N08r6n26N53q8l56K88j43K89n9n04P03j68m01M64k43J44
2060A05jm24N97j55n32N99j12j05O8l08N75o8o18O63j53k24J58k49M36k40m64
2081d52P66j71m63L93r7K09j03l16N64k75l96M91j64L5j00j98N64k04m21N15q0
2102I7j74J01p3L42l64l74O26j52k96K64j03K30j33k47O82l30l47M67j85j8o2
2123d9k21M58k46j93M19j37j07O0%L82l71k71N32k34k58K06q0J90k14k9M69l20
2145a4j47L52n6k8k42n4M78m02k47M32j26m9J08l4L36l33j40N23k28k67J18n6
2167g6J38k17j16M50j91j89K80Q2m6r4o3L14k31l00L28m0j65j7R1L27k71p3L81
2190C02j33j66O7Pj2k20m3L70k46k58L50J23m2j55N2L12k76j80K51n3k86M6K25
$$ plain form
2039 261 133 22 103 -260 248 152 -374 179 91 -265 23 -120 169 110 -394 309 141 -260 204 -39 105
2060 105 104 -320 277 122 -410 189 77 -28 40 -268 307 239 -379 284 131 -93 65 -184 252 12 -452
2081 -452 314 143 -320 73 -24 185 82 -234 330 55 -341 150 -14 21 -79 -277 287 83 -338 177 97
2102 97 -77 24 -49 293 -71 -445 181 29 -267 -3 -106 124 -9 -256 426 96 -251 216 31 13 -49
2123 -49 -270 188 -58 -251 168 31 -76 -16 -16 366 -5 -276 256 22 -236 -30 -110 80 -134 -163 306 -14
2145 -14 -161 191 135 107 -135 -189 289 -113 -360 72 -54 -103 5 -29 307 -26 -166 357 129 -138 -20 -76
2167 -76 62 -155 -271 179 -12 -201 79 161 115 21 -42 272 41 -259 69 29 -136 -153 -62 265 -6 -79 302
2190 302 169 3 70 77 65 -155 -198 172 -74 -332 18 141 99 -56 -4 308 32 -148 103 50 -236 -190 35
2213C5K4k51KL66P3l33J53J53j41j50l0K38j35k66J39J77j36K1j2L58j45k22K93
2236B11k0l24RN0M3j81k3L27P6k92J75J74j10j05l7K76j48l76K83J14k74k1J73
2259@Q6l8j95K82J28l21M8J08r7l8k43L55km02L64P0j51N2m7K53J8m91L62O3l16
2284a52L5l9J36O5l03M22J13m06K45j3l1M0l12L11Qn05L45M9j07J77j61L24m8
2307A93m15M26L6l34M9p6J48p3k59M52j4l20K90j6MRl29M45r5m42M55j49j50J76
2331A1k59L82L9m84M75M8k57J52j36J19l9m27N22l6m57L82n2R3J02m21N82j33
2353B06m61M33j71r4O4j72L68q8m74O08j13j47J88k08K28p5m26M89r7l31L62k15
2375a26J39l3k16O00k15l92M39k13nL1k63M87k01l69N10k37n9J37q5K42j65l70
$$ plain form
2213 35 59 -192 -190 176 249 -84 69 222 81 -69 -99 139 4 -262 -123 54 -82 -61 -73 285 140 -82 211
2236 211 191 -133 -124 -74 -31 -212 -235 92 168 -124 51 225 115 10 -27 249 101 -275 8 122 -152 -173 0
2259 0 86 48 -147 135 263 -58 -10 98 1 -37 -280 75 73 -329 35 105 -46 6 -41 212 230 -261 101 164 -152
2284 -152 -117 -156 -20 45 -258 164 277 -129 116 103 72 112 -200 111 119 -386 -41 8 -99 78 -83 241 193
2307 193 -222 204 240 -94 -45 -121 27 -46 -305 147 133 -187 103 87 91 100 -229 216 121 -321 134 -15 -165 11
2331 11 -248 134 173 -311 164 212 -45 107 -29 90 51 -376 146 110 -347 35 -17 76 178 -243 339 206
2353 206 -255 178 7 -87 -23 -195 173 85 -389 219 106 -41 147 -61 167 92 -334 155 58 -273 89 -126
2375 -126 13 -20 -236 364 149 -243 196 -17 -22 9 -254 233 32 -337 173 -64 -123 14 -71 171 6 -364
2397c64O33k12k30K49j91K19j65j93M98k13k55L17j49M2Mj51M94k95k87L53q7
2418A7p9P4j81L64k60j97N49k75r6K02j40J81j63j22L42k44j59L00k06J15m0j32
2440a50L32j83j64M20k61n2N5j33K93k01k22M80k33j30K52j44K13j17j77M28k72
2461C4j81K52j27P2j11n0K29j00j41L22j79K3L6j23K42k47j20L02k32l2J25n4
2483f0J33j90k5M13k08r8J44j28O6j63p6L19k56j3J80n8O2p3O0J91k40r4K59j32
2507A3j86J03N5K5j37M6K80j18k13K19L6o6p5j0J88l23l1J76Ll8k8J44J40k25
2531b2n7K86r9k12M5LP3j03m6K04r8q4J78N7j29jL2J09j00k24K10Pj74M6J25L3
2557E9j41l1K60k3j95P6R1l8j79NJ96r4k15K29N0q9K3J06J04j02k40K79k1k38
$$ plain form
2397 -364 269 57 -173 76 -115 104 -61 -254 244 31 -224 93 -56 -14 -10 -161 333 38 -249 104 17
2418 17 -62 12 -169 195 -65 -262 287 12 -84 118 -22 159 -4 -126 216 -28 -187 113 -93 22 -18 -150
2440 -150 182 -1 -165 255 -6 -58 -3 -136 157 -44 -266 214 -19 -149 103 -41 172 55 -122 306 34
2461 34 -147 105 -22 50 -61 -111 118 18 -123 199 20 43 79 -44 198 -49 -169 133 -99 -131 -6 -60
2483 -60 73 -117 -142 271 63 -35 109 -19 47 -116 -192 127 -129 -142 38 -20 42 -31 29 220 -20 -114 145 13
2507 13 -173 -70 -15 10 -127 -81 199 81 -132 87 123 57 -18 -28 160 -163 -194 -18 -15 -53 -81 63 203 -22
2531 -22 -79 207 108 -104 -59 -56 17 -86 -132 72 -26 -110 68 125 -4 -5 27 136 36 -188 22 29 -145 -99 26 59
2557 59 -82 -113 147 124 -71 5 96 58 -121 -116 80 -14 -229 0 50 -39 -16 90 194 92 -148 131 110 -128
2581a28M0N6K0p6j59L25j7j98K43R1r7r8n2J41r1l33L90j9k28J71nJ38M6k58K42
2606A44K3k52P2j2K2l1j78K33N9k80K81j8o8R3j18K38l6l86K66J0k07K6P7R0j8
2631C0j53K82N3k47Q4l4J07p8k82K63K6l13K74L2p6J20r8K37j03l09L43o6k32
2654a40J34j66K19J9l07L85k8k59K77n3N9n7k41K75p7k64K43q2k9Q7k16M51j66
2677F4k55M44k22p3J49k29K21j26k98M85j12j53J85j20K48j46j83L20j64k59L12
2698H8j29mqr9K81m9k17L26j24j02J48k06K08j38k06L85j86j34J76r9J94l9k46
2721a80L87j48j87L82l03J09j8k15L96k38k18M21k14K1R9k00K81j65j95L96j65
2742D6j17Q9q4J36j04j57L33j38q5K68k21J23j59m8K51j27j36K56j79K7O9r5K04
$$ plain form
2581 -128 -88 -32 -12 -88 -247 78 61 -137 106 197 100 2 -50 91 0 -333 57 38 -190 -19 -24 114 160 -98 144
2606 144 167 -85 -13 -25 -3 -34 -212 21 80 -200 81 63 -5 88 -30 208 172 -214 52 62 -145 -119 -42 48 30
2631 30 -123 159 212 -35 49 15 122 44 -238 25 51 -262 12 44 -32 88 -10 227 124 -185 158 92 -140
2654 -140 -6 -172 47 66 -241 144 116 -143 134 81 140 83 -158 117 40 -224 19 -63 -92 -5 -221 230 64
2677 64 -191 253 31 -42 107 -122 99 -27 -325 160 48 -105 80 -40 208 62 -121 199 35 -224 88
2698 88 -41 -45 -53 -152 129 80 -137 189 65 -37 111 -95 113 -25 -231 154 -32 -166 10 -89 105 66 -180
2721 -180 207 59 -128 254 -49 60 42 -173 223 -15 -233 188 -26 -5 94 -106 175 10 -185 211 46
2742 46 -71 18 -66 70 -34 -191 142 4 -81 187 -34 89 -70 -118 133 6 -130 126 -53 -26 43 -52 152
2765A52j89j08L49j29l5K5j44J74j55j55M70k78q2J88j00NM4j04K48j35j55K24
2787A10j28M1m9l7K10k04j18L79k52j3O8k2J14j41l2K66k37j2J13p3N8r2J6J99
2811A64j94j7J92j73N1Rq4J54j96l2J89p3k5MO6O9p8o4K76k63n7R9%j4j00L7J22
2838F2j02n4J16l8rRM3J32j90L2J28r8j62N5J09Oj29R2J38q5j01J08O7j16p0L5
2864b2Q7j50r0J56j8N8l8O3O8j02n1J32j3j73K3N9j8j08R9J55n6j13J29l2l5j4
2890dqP9p9j16J03j0o1R2M3J3k8l1P5ol8oRlp2J5J9K3j72J83Q5q9Pk6N8K5j39
2921e9J49n3j16J9O6nn8o2J73R4j96J02P1q3l3j33J32m3j30J93j1q5L3L9J20l0
2947I4k13J81P6l00J05L7Qj6j68K63J3j33J51l6n0N3r7Q2l1j55J67j7p8O1j03
$$ plain form
2765 152 -37 -145 204 75 40 65 -79 95 -60 -215 255 -23 -105 83 -17 -12 32 -72 176 41 -114 110
2787 110 -18 23 -26 -63 147 -57 -175 204 -48 -61 7 -15 99 -42 -74 192 -45 -57 56 -17 41 -51 -35 164
2811 164 -30 -47 145 -28 23 32 -52 102 -94 -126 63 -10 -35 -31 35 104 26 -38 238 -25 -82 17 17 3 -97 -60 62
2838 62 -40 -94 22 -16 -25 -16 27 159 -31 1 129 31 -131 -76 33 39 -90 2 140 55 -46 62 129 13 -57 -22
2864 -22 65 -85 -175 -19 -37 21 -17 46 114 12 -39 93 80 -93 -70 -11 -29 -137 -38 117 61 -52 77 45 10 -4
2890 -4 -12 67 -12 -128 -25 -35 -96 -4 39 52 24 -7 68 62 24 18 27 24 -48 -33 -14 9 -163 20 105 16 23 -3 55 80 -59
2921 -59 90 37 -79 -60 6 1 -57 -119 54 148 -48 54 125 42 9 -124 8 -35 -165 28 17 -68 -35 4 124 94
2947 94 -119 62 138 -162 -57 -20 -12 -28 -196 67 80 -53 98 62 12 65 -32 50 19 -136 31 14 -64 -3 -106
2972a06J48P1k22K06%r2Q4j79R7j6j51K68j18j53K02K4m1O4p1Q8ok93K58l0j21
2997h9O0m4J11l7j97L30o7j08J17p4R4j01j16K49r4k13K65j61M6J00j68K55j21
3020C7j56K22j67L0O4j40J98j61j19L30j00o6J09m4J08q9j54K44j47j75K09o4
3042c1J8L2j33K96j82q2J76j62Q5O6j79K05j05j66K60j68j5J66j41J79p6q0K33
3065A96j60p4J37j50L0J2j65L04j76L0J90j81N4n6q0K36j73o3K25j77n2J92j75
3088g6J81j65n1K93j96k7R8r2Q0k2j19K29k46O7J39j10Q3q9n9K10k09RJ49j41
3112f4L9K9o3J07q2m6K00j30J5M7q1J39j79M9J36j72m0J57j20J08o1n9J62j51
3136f0K4J05j70J40l6o5P9j6p7R5Qo6O7l9R6j28rJ50q2m8P8j1J6j02j4R5q6m5
$$ plain form
2972 -106 42 113 -109 97 97 5 89 -90 7 -9 -160 108 -10 -163 39 63 22 86 15 103 97 -196 62 32 -89
2997 -89 -29 -73 38 1 -196 134 67 -41 76 2 96 -5 -121 128 34 -179 86 -75 -29 71 -97 158 37
3020 37 -119 103 -64 -34 30 -110 88 -73 -192 138 38 -28 81 37 145 56 -98 146 -1 -176 33 -31
3042 -31 -13 19 -114 182 0 -82 94 -68 17 83 -96 109 4 -162 98 -70 -85 81 -60 119 43 -37 196
3065 196 36 -38 99 -51 -21 -9 -174 130 -46 -16 174 -7 47 -9 -89 147 -26 -89 136 -41 -93 99 -76
3088 -76 105 -60 -111 182 -14 -41 57 -35 45 23 -96 133 -113 -46 93 -17 66 -23 -82 128 -81 -72 77 -64
3112 -64 -25 4 -59 48 -34 -80 120 -10 5 52 -29 110 -69 -20 116 -56 -96 61 -59 49 -12 -71 91 -60
3136 -60 -36 69 -101 39 3 -62 17 1 -76 19 27 -39 28 -11 85 -43 -52 98 16 -32 46 35 51 -51 -65 30 -56 -101
3164a01J50m5r5R7j5Q5j08l9K01j59n8Q1j1Oq8J16P0j23J2J14op7l3k2R4l7n4
3191d5J11p3k9N3j1N0j31k6K19q8p4lL2K1m9K0m5qj4J53J6r1K1L9j3l5l3R3rj00
3221d9PNK6op7J11Q2j04K4L8k1j8jq8L6r8J07M9j36J10J7J6n6j5J4R2j62K7N8
3250a2K4k2j08K03j00j3K8M5Mn4J7L6p5j19J30m3j6O4jM2Pp7J20N1j33L1o9N0
3278A0n5l4J34%j39J76q8J4K5QK5j1j25J59q5j30R2l0L8nj02J91m2r6J33%p0J03
3306I6j75J37p4j09J69m6m0K7l7J32Rj05J50q8j03L5m1Q8p6m0J66j13PJ23o2m
3332B6nq8K33j55j62K35j75L7P4j08J84l5r8J39j5n5jj28J06m6j05J61l4q3J16
3357A8OK2%m5J39j80pJ07j02k7L3o7J41o9n1J59Rj09J37j48M8N1j46J57j19n1
$$ plain form
3164 -101 49 4 -91 6 -9 76 -32 -71 130 -29 -87 -6 -17 -11 -99 17 87 -36 -24 90 84 7 -26 -48 46 9 -45
3191 -45 66 -7 -36 17 6 56 -75 -101 118 30 -44 -47 -15 6 -43 -23 -68 -76 -90 63 79 -12 9 48 35 0 -33 60 51 -49
3221 -49 -42 -37 -11 -17 -94 17 99 -5 19 57 36 18 17 -71 -35 -133 -26 23 -113 -3 14 30 -26 -41 -27 65 -97 -70 -12
3250 -12 12 -10 -118 85 -15 -28 0 45 49 -5 12 48 -27 -146 -16 -59 -75 -11 -12 30 37 -40 80 131 -2 29 -40 10
3278 10 -45 -79 55 55 -84 92 4 18 43 51 76 65 -60 99 14 -116 -24 -54 -16 -21 -123 68 26 -70 63 63 -7 96
3306 96 -79 58 -16 -125 44 -2 -42 -15 -52 80 89 -16 134 46 -57 -22 -63 25 -51 -91 75 -38 -31 92 30 26
3332 26 21 -67 166 11 -151 84 -91 -54 20 -88 96 61 -37 102 87 32 31 -97 9 -37 -142 19 -15 -98 18
3357 18 24 46 46 1 140 -40 -47 60 -42 -69 -36 -103 38 -31 -82 77 86 -23 114 -34 14 65 -81 76 -43 -94
3383i4K15j69J08m7k8J25j09jN8q5M5n9j6R4j07o4K33q3p6J22r7J54o2j09J46
3408I4j02j5J00j89J38r3jK04j30n1O8p4J05n2l6J10j90J3J14j26Q1N8m9J53j75
3433d5N7J57j89k2M0o1J01l3q7J29j13QR0lL5p7o3J58j24jR9o0J2m8j4J10j02
3460d6M0pj6Q5Jn3M5j13L8J20j67j9J54l3K3j18R5Nm1q0J71r7kO3k2J03j81P0
3488A8M6n7m7P9l2pm5P7l3Qo5J23m9JrmN4q8K2R3k9o5j3O0J3q3NP5q7QP3K2o7
3521cl0J8J05q4J2K6J7j05k2J64r6o9k1J25j8p7J07L6n6n2N4P1r5l3K6N7k4km
3550B7J0j9o4J20l2p7Q3O4r9k5n8J07m2l3Rj3N0K3K0o1N3r7R1K7j04M6n9L9l0
3579d4l4Q0OpM0lM0o8j9K2J1j06L0L6k5%PJ38n5p2J67j38l1N5p5L4Pn0L6O7j11
$$ plain form
3383 -94 121 -48 60 13 -15 110 1 0 58 -27 18 -41 -57 37 -70 -134 99 16 -60 62 -35 119 57 -52 94
3408 94 -8 -23 77 -112 26 -67 -68 136 6 -45 23 -51 54 2 -34 76 -114 -101 13 -113 -32 26 -23 130 -45
3433 -45 12 169 -20 -42 -2 -63 38 5 -82 47 -66 -58 32 29 64 -13 -76 82 -42 -43 56 -4 8 -40 -54 56 -46
3460 -46 -6 -13 -29 56 57 4 49 -64 -26 94 -73 -92 62 29 52 -66 29 34 -7 -87 84 -13 -15 48 26 129 -52 18
3488 18 64 7 -40 39 7 0 -45 32 -1 7 -58 65 16 17 8 4 58 -30 -8 85 56 -9 -22 38 51 -32 -27 48 -39 -31 42 64 -3
3521 -3 -33 -15 90 6 18 44 61 -44 -66 98 2 -67 -88 37 19 -58 49 85 29 -23 31 102 7 -26 0 57 33 31 27
3550 27 37 18 -46 74 42 -35 48 112 13 -12 -70 37 -5 -38 -29 -42 8 31 51 -10 43 -54 37 64 -40 6 -53 -14 -44
3579 -44 -78 2 8 1 41 38 78 10 -9 13 24 -82 -52 -16 -41 -41 -34 104 49 -23 144 6 -25 30 -45 -11 -4 -54 -18 49 -62
3610f2L5J1L8R7j98J79k6j12j0J5oP0j20R1jj10J78j35J17n4J1O0k9p5R0r5j5
3637e6Q8m1%j7n0J96m2j24J10q8R6j01q1J74n4j03P8P3o7J7LP5l4p0J25k05O1
3664c7N1oM5k6r6J31q0rP7k7J14j78m1J49q9r7J88r6nP4j03J45o5r1J77j02l9
3691c6L3j07J10n1p9J89j42M3J18j20J07l8j6R7j78N9N5j09M6k1M2O8n8p8J65
3716I9r4O9J4r1Ro3p4J76r0J6j1L3Jo6M6J02j07l3N2m6O3j6K8k6p7O0P7p9N9M
3746C5p9J18r9M7Ro0K4nl4Q7p3k1J66k13J25N0q8P7l5p9J52k64J26J55j58J9K9
3773A1n8J14j%O6j74M8l5QK9l8K3J00j38N2N5n5Ml9k6P9n4k4J03r2N6n5J05K9
3802I3j57M8J09j57K2M7r3O6l3R6K5r7J6j0N9l0j4K0k0j4l1J19k9k1q5L6J02q7
$$ plain form
3610 -62 -27 -16 22 119 -79 100 74 -38 -48 -33 -39 31 -89 2 1 -109 69 -66 51 -3 8 68 39 -36 54 -41 -56
3637 -56 32 -9 -9 -26 -76 120 78 -46 64 -24 72 -29 -110 64 10 -93 -15 58 -9 8 11 86 52 -18 107 -98 -37
3664 -37 14 8 53 27 -69 62 -18 -27 50 23 137 -41 -82 67 -22 -119 69 -27 -32 42 -61 84 19 -72 105 3 -36
3691 -36 -3 -110 0 -51 -130 59 -83 -40 78 -42 65 27 11 108 -70 -11 44 -65 -19 -40 2 70 12 -66 99
3716 99 5 74 88 -3 6 -57 -131 45 -45 -29 -40 -7 -6 -72 -26 76 -31 -64 -12 -58 5 -11 17 -9 -86 -26 51 -28 31 35
3746 35 -44 74 -25 22 31 -29 -5 -10 -44 43 -30 -51 115 -98 27 77 -11 66 31 -48 104 -160 -34 121 -37 -18 11
3773 11 -47 67 66 66 132 -42 6 -29 -21 8 -30 -7 93 -45 7 62 7 11 -28 -54 25 -29 -53 50 -42 14 -41 64 93
3802 93 -64 -16 93 -64 -42 5 -88 -22 -55 41 66 -31 -15 -25 34 4 -10 10 -10 -24 -55 64 35 14 -71 -35 67 -20
3830b0K1K8o6O5L7j0n5l9mP2o6oM2pr%l9Q9m3mQ4k7j8j2NJ2j19N8L1l4O1l5L8
3863C0lo1K7R6j11Rj1l1M3m9J07l9q4M3M1jl%n9K8O5l4N5q1K9n8J5M3l4O3m0O0
3895E5j25P5K5j3M0n9j3Jl5J02m1n5J59j72N1j7j7Q4o6j1R3r3k2O3l0N5kj37J05
3924@KK9MK5o5L5o9N5L4j09O5Lj6M7j00J27l3l4K7l0Om0MM1n7r5J20J6o7P6OJ3
3956B0L3j10J45Oj39O7l0O1l0j10J67p6J5M0n9n4P8l8M2l2q6J39j27M0J6j5J08
3983G1p1k6J19q3j5K8m0jP0r4M7j24N0J40m2K9n9k6Q8m9j4K3p8L1N4q4R0r3J0
4012d9J02p5OR1j19RL5o3J21n4m2N5n0J4J5K2L5q3J4O6p6m1J1JJ43j72k6J94j07
4041b3M2O4r2Q8k6r0J34j49N4P1o2n9K7m3Q2j1q4J15r7Q0j5n1J51q9j8nl5J8P6
$$ plain form
3830 -20 1 29 -37 28 65 55 0 -39 -43 29 -37 -43 -1 -8 -17 -17 -56 33 -10 -14 70 43 25 13 18 30 -89 -31 0 -34 27 -8 30
3863 30 27 -34 -7 89 -22 -13 -24 -55 -12 -61 46 7 -77 -34 7 6 3 3 -56 -28 37 3 58 -23 6 -52 -37 6 -28 35 -5 55
3895 55 -70 5 30 17 57 -2 -15 -14 -49 53 12 -43 116 -56 -5 -22 -39 45 -21 -32 61 -32 -54 9 -21 34 32 -105 0
3924 0 2 31 35 60 -5 30 -39 16 50 -59 6 9 -7 40 -60 67 34 0 27 -3 3 -37 -33 8 -49 -144 -24 -8 -75 1 7 20
3956 20 53 -57 88 94 -45 22 -8 53 23 -87 80 4 19 59 0 -54 24 -14 28 -4 -90 49 -78 -38 -22 -37 71
3983 71 0 -26 93 10 -5 23 -17 -18 52 -42 5 -119 -69 71 29 58 -1 -27 61 12 -2 21 -57 -26 28 -56 34 -59 -49
4012 -49 53 -22 -16 75 -44 -35 0 -63 58 4 -38 17 -33 -19 -4 18 53 -30 -16 50 -26 -67 -56 -55 88 -84 -110 84 -23
4041 -23 19 83 -9 79 53 -37 97 -52 2 73 11 -48 -21 -64 18 7 -77 38 -59 21 6 -45 106 17 -1 -6 -41 -23 53
4070E3n7K9K4n0P9j32J0L5l9J23o5n7J25q9n1J04o0L4M0q0P6r7PJ08j81P8L7r4
4098i0J04l0lnM6l2N8k7k6k1O1k6l3J7j9K4N4l1K5l9J4k5M6j04M1N6l0Nn2lJ09
4129F4l0l9J5J3l5o1O9k4k3N0L1l3jj0k9Q4n4P9o2n9O2k6k8RL5pN7j9J4k3K8k4
4161B3p0N9O4j08L5Jn8Q7k8oJ2r4J07p9J08p4L7k6jkL8k5n9Q6mn6L7m8Q6k3p2
4192e3O4k9ML5JNk8j6N1Rn3ml4R5q9P9j0On5j4Q0p6MP2l3j5m1k9R9j1L2QK5p1
4226Hp6P0Rm6%j2J6O0k5l9R9j10J11r9P0k6l1M7k9J1p3N3K9Mjn7J6J2njK4n3N1
4259GM2j36R3k9M0j4j9j4J04j37N4N9n1k0mpL5K5o9LJ4K5K4K8l8n4lL8M3m7Ok8
4291c0j7O8j8K4K1k8l5M0o2j3O7J8n4L3j6J7m3p5J10j7K2K7m6k9ol0J84o8o6m6
$$ plain form
4070 53 -4 25 49 -1 78 -54 -44 -9 -48 75 10 -47 78 -11 -62 42 -18 16 56 -24 52 -45 -38 70 -111 -33 4 -90
4098 -90 14 -16 -19 -24 22 -10 48 21 -5 -26 35 9 -24 -7 -26 -2 52 21 46 7 21 -4 42 -62 -21 35 5 10 -42 -45 64
4129 64 34 -5 10 23 -12 -73 -4 -28 -51 -1 30 -3 -4 -14 -43 41 -13 66 4 -55 7 -19 -47 -38 -3 -10 47 28 42 19 47 23
4161 23 -47 12 76 -32 3 4 -54 33 5 -1 11 -83 24 -55 53 -21 16 -10 -11 -13 25 0 -59 27 23 -33 4 -44 42 19 -53
4192 -53 11 -18 -14 21 22 27 -1 -17 34 43 -10 -14 -48 47 -42 37 27 33 -22 -36 44 -32 -28 44 11 -4 -45 -74 25 14 46 54 79 8
4226 8 -68 2 11 -35 -35 -47 -31 29 4 -35 64 -46 65 -34 36 10 -21 26 -3 8 -65 -12 17 21 20 -37 -21 -9 -14 -15 9 -44 7
4259 7 49 -87 6 -23 17 3 -16 -30 74 -63 -9 50 -1 -21 -25 -32 3 28 -41 -38 -24 1 25 53 15 -39 -42 -4 39 -8 -2 -30
4291 -30 -47 21 3 27 48 20 -15 25 -37 -50 17 35 -19 14 -2 15 -28 -103 7 -10 12 39 -7 -36 -42 -72 112 44 -22 -68
4321f8R8j3j4k4J01o1o1Q4k7o9P3r3L7J29k11J35j6J1L6l4L0Lo0N4m8K7J8j4n2
4350b9P9r5O2K9j07J76q7o8R6p1P0q5j9M9kl7M0n4L0K6m4J56j45nL1j8n3L7K2
4379a6N%%nkQP9p6M4m0k9L2p8R7Pp3J30p5o9J12Nq0P4j34P9k5nM4r8M2M6pML7
4413C3L2n1n5N6L1j21L4J03j26Q2n9M5j5m1pQ4j4O7o3r3J34j04L1M6r3M3N5j3
4441B1j1N3p6M9o3K3MN9q4n3M1Q6m6J6J5j7%J7k7L4j15O6L6j08Q8O0j10O0m7m
4471c3P1j8J2QMj0q9L5K9m5%L6k6P4jm6J3l1M0J9o7M8p8K0J2mJ3J6PK3pk2n1L2
4505a6J3Q1j26K4L3n7P6p6M7JK1l9K2J4l4MP1m7K0J0k6n2l4J35n6n9L3L6l2J1
4535bK0m7K3Lk7k4R3n1K1N6m9n6J8K0J6k2p6Q5m0j1N1J8m2K6k4KN4m5J2N5m9p4
$$ plain form
4321 -68 30 17 3 -21 80 19 -42 42 15 -54 19 -74 -37 92 -119 16 0 11 47 13 43 46 -14 40 -8 19 37 23 -29
4350 -29 50 -45 17 46 -61 115 28 -40 56 -15 55 -30 -49 0 -2 -39 1 -53 -23 3 -41 115 -30 -35 -4 -22 -75 -38 -16
4379 -16 -11 -11 -11 -16 -18 -10 69 -7 37 -3 -32 0 -78 19 26 -47 83 8 -61 51 56 -24 50 -84 -5 -30 -35 9 -89 -47 -1 -8 -4 33
4413 33 65 14 -41 15 46 -75 -41 62 -64 18 -41 4 -11 -52 -59 25 11 78 15 -78 56 -48 -17 29 -64 -21 34 21
4441 21 10 63 -13 36 -27 -4 0 59 -25 -78 -37 49 3 19 34 17 17 34 7 41 -74 -8 28 -80 8 68 -42 18 -29 -33
4471 -33 38 20 32 40 44 34 -55 -20 9 -36 -36 0 -26 48 47 1 14 -17 23 42 -25 23 -55 -35 -23 -27 -14 2 9 32 25 3 -48 -16
4505 -16 -3 78 -48 -24 9 -48 28 -48 -1 0 21 -18 4 18 -16 -12 59 12 32 42 16 -36 -70 65 9 -50 -17 19 -13 -2
4535 -2 18 -29 -6 -3 -30 -54 39 -12 9 65 16 -40 -22 -2 14 -8 -84 1 -39 -50 1 19 -23 3 -21 -19 35 -10 2 57 8 -66
4567f6P7K1l2n4Q4k9RJ7J0lK5o7k9O5l2j3L0q0L5O0o3L1JM3Nk6j1l1O2n3JJ0L0
4600B7m4L6k1l5J6kQ3mj07O0%J9o5J1J3N3r8J02l7nk4Km8R2k6%M8m5M6j36N5P1
4632C7p2P2m2nMMK3p5O2L3j6q7J07q2L2N0qn7J2P5n0j1lK3m9J8M6m3kj8k3P7n2
4665b0J5M0j1Mn7J5JK2l8L9m2O2l1j1L5rj2N1o3L1K7o4Q7l1n3J7j1Kjk0P0k5o4
4698d5P7o5N3%k1J7j3n3R7j25jM1l6J09Qj28J04n5M2j8J3k4M1p1R8j2p1N6n7O2
4728B3O7j04N0p1K0J9j3jJ8J2j8K5mR7j41jN4q4N0j5N2ko0J9oM5q6J03n3K2J8
4759C5k0J1k8j2n0O8Rm6k9N5qQ5l8r2L8R1j06L6o5M1O5o0L2k3k0J1M1k8K0J9k9
4790Cj5J4L0p2rJ09r4M0K8l7RL7n8N5p7M2j1K9Np2Q4lj4pj1m3M9K2K2l3q4J00
$$ plain form
4567 -66 11 32 0 -54 30 1 10 27 37 34 59 -8 -37 28 -4 -17 13 -67 -32 28 -35 -4 -3 40 45 19 8 -23 39 -14 -13 -3 27
4600 27 -17 19 -2 -37 -21 -23 60 56 -51 9 9 28 -37 -26 -13 40 -58 44 7 2 -22 -20 -68 24 -2 -2 46 1 47 -89 -34 37
4632 37 -35 37 -5 -10 -6 -2 21 -54 8 41 25 -62 45 -37 -5 45 37 -20 -8 67 17 6 3 26 -23 -5 41 -2 -4 -22 -45 32 -20
4665 -20 -5 35 24 28 -29 -14 -13 9 -29 10 -32 30 -1 -12 23 14 2 53 -10 21 48 -16 71 40 -13 4 -7 -5 -6 -26 44 19 -45
4698 -45 32 -33 20 20 -1 16 3 -50 47 -78 -79 -38 -74 35 43 -85 19 -36 6 -12 1 -23 18 -53 45 33 -38 18 -39 23
4728 23 90 -14 36 -35 -15 4 -9 -10 8 20 2 27 23 120 -21 -22 32 -52 -2 -17 35 33 -27 -8 -14 31 -55 48 -5 17 35
4759 35 15 26 -2 -14 -64 4 13 -33 -62 -7 -15 70 32 -60 -22 69 -37 -1 -66 -25 40 -20 12 -11 -31 -20 21 -7 13 32 3
4790 3 -12 2 32 -40 -49 60 -34 6 34 -3 6 43 -15 40 -37 5 -6 23 28 -44 40 37 23 16 5 -38 11 33 55 22 -62 38
4822C8n1l0l9P8qL7j0j5M5j8l6k0l3N9M1j06P6K2n6O8o1k1P9l5K2jo8N4LJl2N6
4854C9l6jK0j2jk1O1m2j7L0m6K2M3r7P8J1n4K0N9n6P7o0Pm3M8p3N9l5M4J0l9N8
4886E3m2ML1or5J45q3pn0j1Q9p0Q4Km4l3K2RKK1k2J4k6k1M6j3L4Oo1KN1J3r3J13
4920F4m1j6j4J5p4Q4K3n0J1Nj1J7l2M2j6k2O7r4O1j40P2J4O5mj4m8M2J2rk3O1
4951D7o7M5o6N3N4m8j1N6j27R4l4L4On2J2J3Rl4O1p8J08p2K2m6J2K5lm7M2J1L1
4982E0n3JJ2m6ON9l9L5O9o2L%j9j0L2n5J7N6j39jO5N8K2l5Nn3NP2m5NloN5p9L2
5017A4n3Lk8J04rL0l3j7jj5J6qo4L5J0l0R3p4M2LJ2m0J7l7N4m2K7Kl9OK7p0M9
5050a6k8mM6Ql7K6m6P7N9n2j3j6qJ5n5J3N9l4P1j02L3rJ9K7m8lL4j05Q0j0K6L5
$$ plain form
4822 38 -13 -43 -82 -4 -12 25 15 0 45 27 -9 -29 -62 -3 38 -68 8 30 -26 42 -19 -40 39 4 26 25 -43 11 14 15 -17 39
4854 39 3 2 22 10 9 -12 49 7 -10 20 -26 -4 39 -58 20 31 -23 -3 56 0 77 17 24 -19 29 -44 15 -20 24 34 -5 53
4886 53 11 15 46 40 -55 90 7 0 -50 -61 28 -42 42 44 0 -33 -11 -2 0 21 -1 13 -13 -34 12 -1 33 39 -22 -20 31 44 -49 64
4920 64 23 7 -7 8 -66 18 41 -9 2 7 -4 13 -19 23 7 -15 52 -42 19 -121 -49 -35 30 26 12 -36 6 18 9 -14 47
4951 47 -20 25 -41 12 66 18 7 63 -64 30 -4 30 36 -16 -4 9 18 -16 45 -33 75 3 25 -21 -9 16 13 -34 8 19 50
4982 50 -3 -2 10 -36 -30 29 -10 25 94 32 35 35 16 6 38 -17 0 56 -83 -84 -19 39 61 26 31 -22 -17 55 10 15 12 6 61 -18 14
5017 14 -39 -36 -64 40 31 61 28 11 10 -5 11 3 -61 -26 -16 -46 47 -27 15 18 30 -10 7 -30 24 -18 9 11 -28 -22 5 -65 -16
5050 -16 -44 -48 -2 6 -31 -5 -51 26 85 33 20 4 -4 11 -44 -31 28 -6 65 -37 -4 -13 6 33 -15 -18 16 -89 -9 -19 7 42
5082D2q7J8Q3m1m1L7L9m0k7J1J2K9j8k3J4M1l6pM7j4n1L5l8k6J6Q4m2mk4O1m7
5113CQL8p0K5l1kJ06p2k9O5o9m1L0R1q5Q8m6k7l6M5J0j1J5l3O2n9J5O5n4N1qn0
5145fRK5o7lK9j4L8l2L8o8N2k1O5k4j5o4KQ4j21J58j8p5k9%k1J05k2l7MQ0n9K0
5177A3o7k0P4M9j7n6k9O2Mkl5R5q7k4K1%K5l7NN2k5mk1O6k5qK8l4ORj0M6j16O3
5211AM9q2M3K0j1n1Q8n6L9r7J02j28J25p3K5J0J2j1K1K3k5l5nM8o5L0j0K8l8Q
5241a5N7k7Jj3L5j7O5p5K3J8p6N6j05M1M0m1M0K6qk3J6m0J5L3j2l2K0%JL2J5l2
5273A8k2Krn8Q1NN9p2l6P5q5K6M2l8N9q7k0J21q8J2k4l6J10nk2k8jJ1j8O0l1k6
5305b5l5O1J2k9K4J7l4JqKoM7k9OM6q8N9J1n8OL0oK1L1n3K6l7PR3j03k5O0m5M
$$ plain form
5082 42 -45 -27 56 15 -26 11 50 10 -17 -6 6 35 17 -6 8 49 13 6 53 39 -12 23 -15 -41 -25 59 17 13 -11 50 3
5113 3 11 49 -21 4 -27 -29 77 5 -24 41 -28 -69 -39 52 -33 55 9 -18 -54 -9 1 -10 5 -28 34 -25 -10 55 1 52 44 -6
5145 -6 3 28 -39 -42 -13 -27 11 -21 17 -51 1 -20 45 21 6 -58 -56 28 -93 65 47 -28 -57 -57 -78 27 5 -32 -28 52 -7 13
5177 13 -54 -74 0 49 32 -24 -53 9 13 11 -24 71 -16 -40 -19 -19 6 -31 -26 26 1 -3 -24 42 17 9 37 3 9 18 8 54 -62 1
5211 1 50 -32 11 31 20 -31 57 1 40 -57 45 -83 42 -31 -6 4 16 5 26 49 24 -11 -16 32 -33 -3 -13 15 -23 -15
5241 -15 42 15 16 3 38 21 86 11 34 52 -24 32 -73 -32 8 -33 7 33 25 2 18 -22 -7 26 14 -18 2 2 3 35 50 18
5273 18 -4 -2 -11 -69 12 17 76 4 -32 43 -42 -16 26 -12 47 -40 -60 61 -27 -15 -39 -75 35 30 8 -20 -21 -10 -28 32 1 -25
5305 -25 -60 1 13 -16 8 25 -9 -8 -16 -14 -20 27 -2 4 50 -38 21 32 -26 -20 10 4 25 56 3 29 -8 -1 92 -11 -36 24 -21 -17
5339a7N2l4J7o3M4M6m0ll1l8J14j4p5Q2m6N6mO9j27n6jN9k1O6Pj5l8k2K4Q4m9
$$ plain form
5339 -17 35 1 18 -45 -1 45 5 2 -29 -67 47 33 -42 40 -6 50 46 115 -12 -68 -69 -10 -31 35 42 27 -11 -33 -9 75 26
$$ [...]
8191D2
##END NTUPLES=NMR FID
##END=
