##TITLE=1H_Pr Ur-72
 CDCl3
 8 sc, 
 3.10.2024
##JCAMPDX= 6.0         $$ Bruker NMR JCAMP-DX V2.0
##DATA TYPE= NMR FID
##DATA CLASS= NTUPLES
##ORIGIN= UXNMR, Bruker Analytische Messtechnik GmbH
##OWNER= root
$$ XWIN-NMR		Version 3.5
$$ Thu Oct  3 13:53:11 2024 Russian Standard Time (UT+4h)  she@DPX200
##.OBSERVE FREQUENCY= 200.1318
##.OBSERVE NUCLEUS= ^1H
##.DELAY= (6, 6)
##.ACQUISITION MODE= SIMULTANEOUS
##.ACQUISITION SCHEME= undefined
##.AVERAGES= 8
##.DIGITISER RES= 18
##SPECTROMETER/DATA SYSTEM= spect
##.PULSE SEQUENCE= zg30
##.SOLVENT NAME= DMSO
##.SHIFT REFERENCE= (INTERNAL, DMSO, 0, 15.7039)
##AUDIT TRAIL= $$ (NUMBER, WHEN, WHO, WHERE, WHAT)
$$ ##TITLE= Audit trail, XWIN-NMR		Version 3.5
$$ ##JCAMPDX= 5.01
$$ ##ORIGIN= Bruker BioSpin GmbH
$$ ##OWNER= she
$$ F:/spectra/data/she/nmr/H-F/1/audita.txt
$$ ##AUDIT TRAIL=  $$ (NUMBER, WHEN, WHO, WHERE, WHAT)
(   1,<2024-10-03 13:51:42.48 +0400>,<she>,<DPX200>,
      <created by zg, POWCHK disabled, PULCHK disabled
       configuration hash MD5:
       00 E9 B6 7A A2 85 ED C7 34 08 36 98 17 FE 4E 26
       data hash MD5: 16K
       B8 D6 50 64 56 48 28 78 85 7B BC 33 E9 68 E2 0E>)
$$ ##END=
$$ 
$$ hash MD5
$$ DE C2 62 D1 20 E7 BF BA E5 4A FB B9 0D 1E 25 7C
##$RELAX= 
##$RELAX= 
##$RELAX= 
##$RELAX= 
##$RELAX= 
##$RELAX= 
$$ Bruker specific parameters
$$ --------------------------
##$DU= <F:/spectra>
##$EXPNO= 1
##$NAME= <H-F>
##$PROCNO= 1
##$TYPE= <nmr>
##$USER= <she>
##$AMP= (0..31)
100 100 100 100 100 100 100 100 100 100 100 100 100 100 100 100 100 100 
100 100 100 100 100 100 100 100 100 100 100 100 100 100 
##$AQSEQ= 0
##$AQ_mod= 1
##$AUNM= <au_zg>
##$AUTOPOS= <>
##$BF1= 200.13
##$BF2= 200.13
##$BF3= 200.13
##$BF4= 200.13
##$BF5= 200.13
##$BF6= 200.13
##$BF7= 200.13
##$BF8= 200.13
##$BYTORDA= 1
##$CFDGTYP= 0
##$CFRGTYP= 5
##$CHEMSTR= <none>
##$CNST= (0..31)
1 1 145 1 1 1 1 1 1 1 1 1 1 1 1 1 1 1 1 1 1 1 1 1 1 1 1 1 1 1 1 1 
##$CPDPRG= <>
##$CPDPRG1= <>
##$CPDPRG2= <>
##$CPDPRG3= <>
##$CPDPRG4= <mlev>
##$CPDPRG5= <mlev>
##$CPDPRG6= <mlev>
##$CPDPRG7= <mlev>
##$CPDPRG8= <mlev>
##$CPDPRGB= <>
##$CPDPRGT= <>
##$D= (0..31)
0 1.2 0 0 0 0 0 0 0 0.06 0 0.03 0 0 0 0 0.0002 0 0 0 0 0 0 0 0 0 0 0 0 
0 0 0 
##$DATE= 1727949101
##$DBL= (0..7)
120 120 120 120 120 120 120 120 
##$DBP= (0..7)
150 150 150 150 150 150 150 150 
##$DBP07= 0
##$DBPNAM0= <>
##$DBPNAM1= <>
##$DBPNAM2= <>
##$DBPNAM3= <>
##$DBPNAM4= <>
##$DBPNAM5= <>
##$DBPNAM6= <>
##$DBPNAM7= <>
##$DBPOAL= (0..7)
0.5 0.5 0.5 0.5 0.5 0.5 0.5 0.5 
##$DBPOFFS= (0..7)
0 0 0 0 0 0 0 0 
##$DE= 6
##$DECBNUC= <off>
##$DECIM= 24
##$DECNUC= <off>
##$DECSTAT= 4
##$DIGMOD= 1
##$DIGTYP= 9
##$DL= (0..7)
0 120 120 120 120 120 120 120 
##$DP= (0..7)
150 150 150 150 150 150 150 150 
##$DP07= 0
##$DPNAME0= <>
##$DPNAME1= <>
##$DPNAME2= <>
##$DPNAME3= <>
##$DPNAME4= <>
##$DPNAME5= <>
##$DPNAME6= <>
##$DPNAME7= <>
##$DPOAL= (0..7)
0.5 0.5 0.5 0.5 0.5 0.5 0.5 0.5 
##$DPOFFS= (0..7)
0 0 0 0 0 0 0 0 
##$DQDMODE= 0
##$DR= 18
##$DS= 0
##$DSLIST= <SSSSSSSSSSSSSSS>
$$ [...]
##$SUBNAM2= <"">
##$SUBNAM3= <"">
##$SUBNAM4= <"">
##$SUBNAM5= <"">
##$SUBNAM6= <"">
##$SUBNAM7= <"">
##$SUBNAM8= <"">
##$SUBNAM9= <"">
##$SW= 24.0689170037331
##$SWIBOX= (0..15)
0 0 2 0 0 0 0 0 0 0 0 0 0 0 0 0 
##$SW_h= 4816.95568400771
##$TD= 16384
##$TD0= 1
##$TE= 0
##$TE2= 300
##$TE3= 300
##$TEG= 300
##$TL= (0..7)
0 120 120 120 120 120 120 120 
##$TP= (0..7)
150 150 150 150 150 150 150 150 
##$TP07= 0
##$TPNAME0= <>
##$TPNAME1= <>
##$TPNAME2= <>
##$TPNAME3= <>
##$TPNAME4= <>
##$TPNAME5= <>
##$TPNAME6= <>
##$TPNAME7= <>
##$TPOAL= (0..7)
0.5 0.5 0.5 0.5 0.5 0.5 0.5 0.5 
##$TPOFFS= (0..7)
0 0 0 0 0 0 0 0 
##$TUNHIN= 0
##$TUNHOUT= 0
##$TUNXOUT= 0
##$USERA1= <user>
##$USERA2= <user>
##$USERA3= <user>
##$USERA4= <user>
##$USERA5= <user>
##$V9= 5
##$VALIST= <valist>
##$VCLIST= <CCCCCCCCCCCCCCC>
##$VD= 0
##$VDLIST= <DDDDDDDDDDDDDDD>
##$VPLIST= <PPPPPPPPPPPPPPP>
##$VTLIST= <TTTTTTTTTTTTTTT>
##$WBST= 1024
##$WBSW= 4
##$XGAIN= (0..3)
0 0 0 0 
##$XL= 0
##$YL= 0
##$YMAX_a= 246629
##$YMIN_a= -282139
##$ZGOPTNS= <>
##$ZL1= 120
##$ZL2= 120
##$ZL3= 120
##$ZL4= 120
##$ABSF1= 10
##$ABSF2= 0
##$ABSG= 5
##$ABSL= 3
##$ALPHA= 0
##$AQORDER= 0
##$ASSFAC= 0
##$ASSFACI= 0
##$ASSFACX= 0
##$ASSWID= 0
##$AUNMP= <proc_1d>
##$AZFE= 0.1
##$AZFW= 0.1
##$BCFW= 1
##$BC_mod= 2
##$BYTORDP= 1
##$COROFFS= 0
##$CY= 11.3945322036743
##$DATMOD= 1
##$DC= 2
##$DFILT= <>
##$DTYPP= 0
##$F1P= 15.6554695791079
##$F2P= 12.8336369535428
##$FCOR= 0.5
##$FTSIZE= 0
##$FT_mod= 4
##$GAMMA= 1
##$GB= 0.15
##$INTBC= 1
##$INTSCL= 1
##$ISEN= 128
##$LB= 0.24
##$LEV0= 0
##$LPBIN= 0
##$MAXI= 10000
##$MC2= 0
##$MEAN= 0
##$ME_mod= 0
##$MI= 1.114404
##$NCOEF= 0
##$NC_proc= 0
##$NLEV= 6
##$NOISF1= 3.799351
##$NOISF2= 2.8
##$NSP= 1
##$NTH_PI= 0
##$NZP= 0
##$OFFSET= 15.70392
##$PC= 1
##$PHC0= -26158.4
##$PHC1= 16.18747
##$PH_mod= 1
##$PKNL= yes
##$PPARMOD= 0
##$PSCAL= 0
##$PSIGN= 0
##$REVERSE= no
##$SF= 200.130013532006
##$SI= 16384
##$SIGF1= 3
##$SIGF2= 2
##$SINO= 400
##$SIOLD= 16384
##$SREGLST= <1H.CDCl3>
##$SSB= 0
##$STSI= 0
##$STSR= 0
##$SW_p= 3612.71676300578
##$SYMM= 0
##$S_DEV= 0
##$TDeff= 0
##$TDoff= 0
##$TI= <>
##$TILT= no
##$TM1= 0
##$TM2= 0
##$TOPLEV= 0
##$USERP1= <user>
##$USERP2= <user>
##$USERP3= <user>
##$USERP4= <user>
##$USERP5= <user>
##$WDW= 1
##$XDIM= 8192
##$YMAX_p= 0
##$YMIN_p= 0
$$ End of Bruker specific parameters
$$ ---------------------------------
##NTUPLES= NMR FID
##VAR_NAME=  TIME,          FID/REAL,        FID/IMAG
##SYMBOL=    X,             R,               I
##VAR_TYPE=  INDEPENDENT,   DEPENDENT,       DEPENDENT
##VAR_FORM=  AFFN,          ASDF,            ASDF
##VAR_DIM=   8192,          8192,            8192
##UNITS=     SECONDS,       ARBITRARY UNITS, ARBITRARY UNITS
##FACTOR=    0.0002076,     1,               1
##FIRST=     0,             0,               0
##LAST=      1.7004516,     0,               0
##MIN=       0,             -282139,         0
##MAX=       1.7004516,     246629,          0
$$ Real data points
##PAGE= N=1
##DATA TABLE= (X++(R..R)), XYDATA
0@%%%%%qJ6j6J6k4L2l2M0n6O6p4R3j17J36j60J92k24K59k99L44l97M57n20N88
29C12o67P56q51R56j071J197j336J487j654J837k038K258k501K769l064L393l761
46a978M174m636N162n769O475p307Q304r528J1072j3091J5858j9908K6480l9424
60b4116J03441k88510j1042M60254j56906k75285J05495K26482j09303j22163
70i1653R2386O3072m7770k7706m3554R4695K5127j51771M3670J51169j03798j15056
82a11189J18464J20056j71285r7264K37839K4865k35803N2915J61454n3102j17223
93g0273J2972J03881j1008q3606J5064N0282L7229n1676o7760J05760K5577j28369
105f1927L5020P1172n5149k3892L8196J8750l5329j601M0652k5231K941R689n1067
$$ y = [0, 0, 0, 0, 0, 0, -8, 8, -8, 8, -16, 16, -16, 24, -32, 34, -40, 53, -64, 72, -88, 104, -120, 139, -160, 184, -213, 244, -276, 312, -355, 401, -450, 506, -565, 632, -704, 783, -871, 966, -1072, 1186, -1315, 1454, -1610, 1783, -1978, 2196, -2440, 2722, -3047, 3428, -3879, 4425, -5103, 5969, -7122, 8736, -11172, 15308, -24116, 79325, -209185, -220227, 240027, 83121, -192164, -86669, 139813, 30510, -91653, 733, 63805, 16035, -11671, -55225, 39470, 64597, -87174, -43504, 107665, 3867, -111189, 7275, 127331, -43954, -141218, 96621, 121486, -114317, -61402, 100052, 46950, -70273, -57301, 46580, 35572, -48034, -32970, 17312, 54541, 2865, -64895, 40865, 66442, -61927, -26907, 44265, -10884, -34776, 3420, 22170, -13159, -14760, 25892, 661, 3602, 13291, -37776]
118c7776O0516K9598j15128K7390J00093n5263p5028N3142P8734o7968n9918R5702
130C4094Q417o6860K2773j525RK7035m4057j8508N3038K1859n7774k3554R9103
143E4050j2314j14962Q2336O6654j19235q308R7544j7875q1633K6042Q2770m8785
155F284n3549O4781Q014k7605L342k0387L0221J9232o0557J753N1657n038m7190
168b9042L780O7421k6383n9801O1340J9720n7405N774K5893r35k5784o739M0389
181A8228j2681k8061K8310P440n866j1390r564L7850j1306m4018K8058J9028j9183
194c155j2479P234K5688j7461j3737L1352j3570j0532J7881j5489L971M274j7815
207a3838J4120K587r834M066K767J3183j6074q552L7318k1705k7608L4471k098
$$ y = [-37776, 22740, 52338, -62790, -35400, 64693, 9430, -65598, -12456, 66278, -1690, -61608, 34094, 42511, -24349, -1576, -3101, -3092, 23943, -20114, -38622, 14416, 36275, -21499, -45053, 54050, 41736, -73226, 9110, 75764, -43471, -51779, 45765, 27890, -53743, -27701, 55069, 6284, -47265, 17516, 25530, -2075, 1267, -19120, 11101, 30333, -30224, -28471, 23186, 18148, -29042, -25262, 42159, 15776, -44025, 17315, 37035, -20370, -14596, 11297, 10362, -15422, -22161, 18228, 5547, -22514, 5796, 13236, 7370, -4020, -13584, 24266, 12960, -31058, -3000, 16028, -3155, -15634, -8400, 17288, -173, -13910, 17442, 3872, -6660, 11221, -4268, -297, 3977, -13838, 282, 2869, -6965, -2899, -132, 13051, -3023, -11575, 25743, 4038, -23570, 10901, 8803]
220H803j9746K499N457J0997j3530q29J8377j5376O217Q931k1095J3082K921j6433
234i725R784k865q71K691m999J5103j0895o789K7838j7054j3314J9967o918l385
248a432l471l410J4785j0856k038J2221r245J0104j880j2582J9941q881j3028
261i772J4136p231M41R32o573J3588p653j696J5457j4914L872Q207j3086Q640
275D348o024o763J4065j0912O81O634q158J3980n794q019J7124j1006j377P287
289F066j4484J0133L58j1987J0651l302L763K654j2264J8755k671j8177J8330
302G825l642r121M743p016J1254m348j2170J9601m934n982R956p927Q940l719
316C460j4366J9936o116j4958J1202J71M470p905n963K5221j2012j3848K0790
$$ y = [8803, -10943, -8444, -2987, 8010, -5520, -6349, 12028, -3348, 2869, 11800, -9295, 3787, 6708, -9725, 59, -2806, -3677, -986, -5985, 9118, -1777, -8566, 19272, 2218, -11096, 8871, 1953, -1432, -4903, -8313, 6472, -4384, -6422, 5799, -3446, 6658, 4778, -7804, 12137, 3256, -9772, 4364, -2867, -2426, -1494, -8067, 5521, -2132, -3828, 11629, -3285, 587, 8794, -4292, 4348, -1676, -8439, 5626, -5286, -4605, 2029, -6129, 7851, 2057, -5962, 11162, 156, -1221, 6066, -8418, 1715, 2073, -9914, 737, -2565, 1198, 3852, -8412, 10343, 7672, -10505, 7825, 4183, -4938, -195, -7211, 4043, -305, -12475, 7126, 2192, -3790, 6166, -1761, 7179, 3460, -10906, 9030, 2914, -12044, -842, -671, 3799, -4106, -10069, 15152, 3140, -10708, 10082]
329A0082n949n647p5m166J4023j2428q945K0147o445l196L332k715J4293j3248
343i37q247K2619j3274r681J0994k853L158r223J626J9349j8093k087J8230j0191
357A390n05k282j092J1675j6614p54J5094j1712K837K307j871J0635j3894L211
371a575J5534j9431J237R371p953K337o318N950P546j6887J1535Q572j4608P461
385B771j128m99N133j5204Q210O382j4845Q754J157k918N822q568J0414K548j6780
400h751J3049J742j1239M639l441N966j562j1574J7186j165j2068J2121k348o83
414A872R42q615J1348m407j1339J3185k744l688K664k845J2010o786r480J7577
428I694o092r282P538k739K705o127l566J5858r151o226J2963l587L34j949k597
$$ y = [10082, 4133, -1514, -1589, -5755, 8268, -4160, -13105, 7042, 597, -2599, 733, -1982, 12311, -937, -9184, 13435, 161, -9520, 1474, -1379, 1779, -7444, -5818, 13531, -4562, -6649, 11581, 1390, 885, -1397, -2489, 9186, -7428, -8182, 6912, -4800, -1963, 344, -1527, 9108, -4786, -1575, 13959, -5472, -4235, 5136, -2817, -480, -6798, -848, 6698, -10189, 1346, 9918, -4690, 2771, 1643, 1144, 6277, -8927, -717, 5665, -9180, -426, 731, -2187, 3635, -4933, 5481, 8029, -8751, 4298, 6040, -5199, -560, -4001, 1965, 403, -11171, 6015, 4850, -7218, 4903, 2555, 1872, 2814, -5801, 5547, 1140, -10199, 2986, 242, -3446, -782, -3627, 8383, 1597, -7883, 9694, 3602, -5680, 1858, -881, 1824, -4303, -7869, 7989, -1162, -7388, 5575, 1988, 2322, 373, -2224]
443b224J0744j1290m645J3746q341l001L331K68Q315j0753j028J6238j0934m206
457c780P292l367J713o974J137J0401j2168J115J0020o472K863j685K12P685j2496
472d504J597R817j1107N62K883p03M416q283N011Q435j1683M144M436o126K912
487A807m986K351M174j0765O751M049q197O889m23j076L441p303O298J750j1273
502f513O305J199l410J891m252P698L63r475J1165J48q654N316j299J371k564
517g11p077J1677k117r811R580J306k204o94j936R718o287r018J2060k634o035
532d183K180j352P479m786o687J4175k842p871N755n5K122o344m107J2929o959
547e46p824J0306m31r25k404P1J1053r876n773J3362n952n002K813r61M951o523
$$ y = [-2224, 8520, -2770, -7415, 6331, -2010, -5011, -1680, -1412, 6903, -3850, -4878, 11360, 426, -3780, 3512, 145, 1858, -5116, -3979, 6422, -5746, -4631, 5389, -1083, 1780, 95, 307, 7992, -4504, -2907, 6910, -4197, -3635, -752, -1455, 2961, -5322, -311, 8124, -3559, 585, 5021, -1105, 1807, -3179, -828, 3346, -7419, -668, 3381, -4816, 2073, 1650, 574, 4015, -3288, 3010, 4760, -6513, -208, 991, -2419, -528, -4780, 2918, 3281, -6194, 4971, 5119, -3535, 1781, 482, 1853, -711, -7788, 3889, 1772, -8039, 1541, 2847, 643, -51, -1987, 7731, 1444, -7574, 4486, 1852, -4183, -2003, -3355, 4124, -662, -7349, 6826, 3984, -3887, 1868, 1813, 3935, -2409, -6516, 6413, -546, -8370, 1936, 1505, 580, -1824, -1753, 9300, -576, -6349, 7013, 1061, -3941, -1128, -2089, 2862, -3661]
563c661r10J1056p338j149N881l635L295m989j853Q931q979j205P354n742L086
578A42l65j408P567p703L67Q040q343L95J668j814L352p591M296P329j1990N428
594f30P243p931J684j40K473L27j0514Q717L244j1722O483K382k010J854n177
609c717P834J157j0563P300M57l868K026o648P600K874j3080Q560O235o775q26
624a434J80Q547n137j2086J5012K9j3589P194K546Lk413m609J2309k213j0230
639e891Q657k29j871p42n538R167k327q719R441n66j845J445m204R360k803j0448
655g113J0660n58o302K252j713N297l092n309J1078l650m746O489l060K260j945
670E48n016Q411n255l099P923p199K288N627o716L381J269j360J073n330O277
$$ y = [-3661, -4571, 6485, -853, -2002, 3879, 244, 3539, -1450, -3303, 5628, -3351, -4556, 2798, -2944, 142, -223, -1631, 5936, -1767, -1400, 6640, -1703, -1308, 360, -1454, 1898, -5693, -1397, 5932, -6058, -630, 6613, -1318, 366, 226, 2699, 3026, -7488, 1229, 4473, -7249, -766, 1616, -394, 1460, -3717, 4117, 5274, -5289, 2011, 2468, -1400, 626, -6022, 1578, 4452, -8628, -68, 6167, -608, -1434, -1254, 7293, 2156, -9930, 5082, 5111, -8478, -1284, 1262, 1265, -1148, -5757, 6552, 4339, -5891, 2766, 2537, 666, -76, -5614, 3553, 1226, -7493, 1948, 1382, -463, 982, -3222, 6138, 3335, -7113, 3547, 2989, -3313, -1061, -2774, 2523, -569, -5878, 5200, 1550, -3196, 3293, 233, 2493, 548, -4468, 3943, -1312, -4411, 3512, -3687, -1399, 4228, -2488, 893, 2162, 802, 1875, -3455, 2822]
685B822m32r672R013j64n746O052l692K245L623o927M793N38l697K838n259M454
701G89K813j1179O496O177o546m38Q42O815l241j0554J2999J174j4208O684M236
716B859k671k135l510R386L54r099N784J708q83j534n107R291j850j1440R446
731E99L501n985m67O5Q329l094r994J0540J905q924J183K511L470o266m890J3057
747E540j983r540O654K382m81l184k892Q750m596p060Q614j169l492J439p92N516
763C706k949m159P025k056k232R99k146M832m557m462J0202l153n525N693K06
778A424J94k046k87N257o705n83O977o568j82L420k424K599j982Q45L592n610
794b079K737K624n221K628j692q54M443n502J091M270m031K367K64o85K252n210
$$ y = [2822, 2390, -7282, 1731, 1567, -4179, 1873, -1819, 426, 4049, -2878, 1915, 2453, -1244, 1594, -3665, 789, 3602, -7577, -1081, 5096, -1450, -1888, -1046, 5769, 2528, -8026, 4973, 6147, -8061, -1377, 2859, 188, -1947, -5457, 3929, 4283, -4816, 968, 2676, 1793, 259, -4848, 4443, 2593, -8847, 599, 4100, -1885, -2352, -2287, 6042, 2948, -7046, 3494, 5399, -3525, -2342, 169, 3639, -2627, -7517, 5540, 3557, -5983, 671, 3053, 2572, -612, -3504, 5246, 650, -6410, 2204, 1035, -2457, -1018, -1810, 3706, 757, -3402, 3623, 1567, -665, 334, -1812, 3020, -1537, -5999, 4203, 1050, -4475, 1218, 1424, 1618, -428, -715, 4542, -2163, -2746, 4231, -2337, -2519, 901, -1523, 1076, -906, -61, 3531, -2079, 658, 3282, -1939, 689, -1003, -1857, 2586, -2916, -1825, 2445, -1586, 781, 1045, 360, 2612, -2598]
810b598L351L314q247K477L406k869P43j988L927J510o931N447K714o003J560
825a87l12J341M23o282N361K412o537L882J898j285k76k400N610j420p103O199
841A324O1l843K199j819L521j09n336O894M39n571K773j0J306j997m225O915k088
858D34n154O610p53j805O57o69N423m558m585Q351l175m087L564j269J929k302
874a389j199O976m333k502N034j863P00k430j641O520n854k275P505l834j332
889a917K106L86L250n823M7P136o021j637L085j218J562m105J640O279p378P34
905a874N814l763M80j501P81L505p067J693N298n789Q65J565P50J999n988L875
921F43M427p769K156K181k731J470l567L257K853p123M285L055m112K053j440
$$ y = [-2598, 753, 4067, -4180, -1703, 1703, -1166, -423, -2411, 1516, 3026, -3905, 1542, 4256, -1747, -187, -499, 842, 1265, -5017, 344, 2756, -3781, 101, 1999, 714, 438, -1962, 3648, 2228, -4875, 1324, 1385, -2458, -259, -2078, 1443, 1334, -4002, 2892, 3331, -2240, 533, 523, 1829, -168, -4393, 2522, 434, -4720, 1890, 1137, -668, -11, -680, 4743, 185, -4400, 3951, 776, -3311, 253, -1016, 913, -1389, -2588, 4388, 55, -2447, 2587, 724, 1424, -1006, -2647, 3873, -1981, -4256, 3249, -585, -1917, 189, 575, 3825, -1998, -1951, 5185, -836, -2473, 612, -606, 956, -3149, -1509, 4770, -2608, -1874, 3940, 177, 657, -844, -63, 3442, -3625, -1932, 3366, -2423, -1558, 7, 757, 2756, -3232, 643, 5070, -2699, -543, 1638, -1093, 377, -3190, 67, 2920, -4203, 82, 3137, -975, 1078, -362]
936c62J641R55o242N160J022o399M241J12k43J321m125N421M62o149N129m64k842
953a362J765k645L585j175m728P156j439l474M291j902J499o34l558N923l153
968A49m269N663j861m59L54j554N551l472k821O776l581j901K198j794K676l482
984a827j439O762m709j267M859k173J036j716j55M858o190p73N387l853J14JQ5
1001a000L975n111R80N728n537J22K349j481J229m132J835M114o356J856L638
1016B209k845J446j558J765K605o719K670L479n209J344j72P05J809m682L829
1031F76K758n637K748J272j433M94l563L553R54o045M355J440l173J997j082K588
1047A902J77m971M641M65m600K433o07M57j0l088N280n47m452M697r6j628N13
$$ y = [-362, 1279, 2234, -4008, 1152, 2174, -4225, 16, 128, -115, 1206, -2919, 2502, 2964, -3185, 1944, 1480, -1362, 403, -2242, 1343, 168, -4560, 2596, 1157, -2317, 1974, 72, 1571, 937, -2621, 3302, 149, -4120, 1543, -318, -777, -423, -1977, 3574, 102, -2719, 4057, 476, -1425, 773, -1021, 1655, -1827, -3266, 3496, -1213, -2480, 2379, 206, 1242, -474, -629, 4229, -1961, -2734, 2653, -1200, -1086, -1085, -1000, 2975, -2136, -1156, 4572, -965, -843, 1506, 25, 1254, -2878, -1043, 3071, -3285, -1429, 2209, -636, 810, -748, 1017, 3622, -3097, -427, 3052, -2157, -813, -985, -280, 1529, -3153, 676, 3434, -2203, 545, 1817, 384, 878, -2685, 868, 1822, -4223, 132, 1572, -1601, 396, -686, 1902, 2079, -2892, 1749, 2214, -2386, 47, -560, -103, -113, -3201, 2079, 1532, -2920, 1777, 1681, 53, 566]
1064E66j931L340j676m104N336j140k700K530n03K044j400k321N155k314l070
1079b188L593j673k25m62j095M290l055j937N529j940j336J226p51K209l273j171
1095b259M789l599j422L155r95J242j724P9M353m259p77M001k906l93k38Q1K666
1112A794m222O37M806l611J3J775o32J328l484J073L393n150M59K872j904R09
1128E6j325J469K685m599J757K928l817N28k7L41Q93m001K679K742m508K150J489
1145A440j148J018k430K140J207n042K551J451k835J363q82J682Q44l659L962
1160A662P60m215K553q8o00k5k700L578q9m041M155M8j642J526j308K536j227
1177H83l557M441j108l035K452q96J277p18k017N218j930l359M248r28q76m90
$$ y = [566, -1365, 1975, 299, -3805, 1531, 391, -2309, 221, -282, 1762, 362, -1959, 3196, 882, -2188, 1405, -268, -493, -955, -2050, 2240, -815, -2752, 2777, 837, -499, 727, -24, 2185, -1088, -2259, 2530, -1069, -2491, 664, -331, 911, -813, -734, 3619, -640, -1417, 2584, -322, -715, -953, -872, 1794, -2428, -1791, 3015, -596, -583, 1192, 560, 1888, -1596, -523, 2870, -2280, -1821, 1051, -853, 56, -1269, 200, 2885, -1714, 43, 2971, -846, -318, -345, -4, 889, -3112, -433, 2309, -2199, -49, 1440, 292, 1310, -1120, 1020, 2227, -2815, -264, 1187, -1648, -285, -1167, 515, 1359, -2300, 1662, 2422, -1793, 760, 672, 72, 47, -2653, 925, 836, -3205, 950, 998, -644, 882, -426, 2110, 883, -2674, 1767, 659, -2376, 76, -820, 457, -261, -2278, 2940, 1010, -2349, 1899, 971, 95, -395]
1193c95j361L834k902k487N268j900j295J821n69K547k928j409N067l535j923
1208b167K777j345R81j693j15M828m192q79M593k371m1p49l97L093m228j79M173
1225B089l424K52J475n45K250l341Q38L955m866L16K250k162R93j848J143K855
1241B230m686K098L073l412J367m84k6J580l996K189J481m127K676L59j017J892
1257A197k606K436J414m454K913N71k759J383j425J721J20l785M499L31l238K881
1273A199p91M11Q9k882L838j297l929M377o79j498J175j137L226j498k582M613
1289B635j811k172J820j231J758k004k052N374k138k296L466j015N69n41j355
1304i93L572l124j877M008j871p55J02Q5L214l282n36M675l300p44J983j341R97
$$ y = [-395, -1756, 2078, -824, -3311, 1957, 57, -1238, 583, 14, 2561, -367, -1776, 3291, -244, -2167, 610, -735, 246, -1447, -1562, 3266, -926, -1805, 2788, 417, 376, -373, -770, 2323, -1905, -2084, 2089, -1335, -1083, 392, -153, 2097, -1244, -406, 3549, -1317, -1001, 1249, -913, 80, -1768, -625, 2230, -2456, -358, 2715, -697, 670, 186, 160, 1740, -2256, -67, 1414, -2713, -37, 322, -695, 1197, -1409, 1027, 2441, -2013, 900, 1471, -1288, 95, -1330, 391, 511, -3274, 1225, 1556, -1682, 1199, 408, 819, 908, -1974, 1864, 567, -3362, 1015, 336, -1162, 13, -1124, 2102, 604, -1978, 2635, 824, -1348, 472, -759, 999, -1005, -3057, 2317, 179, -2117, 1349, 334, 903, 362, -993, 2579, -545, -2422, 1586, -285, -1040, -938, -853, 2361, -921, -1457, 3218, -82, -826, 1157, -184, 813]
1321H13k365j27L776l445k29K908j537R98p94J33K299l805P09K600l324Q31m3
1338f02k74K287l013J234L027l570Q91J573j492M28k011J479J405l886K193J364
1354A033k356J952m04L83Q29l023K654Q71l867J662K19n90O84j815K544L56k941
1371a809L114J90j883Q73j239J860n92l411L511%k596K226j9N21l90j565L581
1388B372j330l148K764k17r63k11r14L076j489k120M069p81j800J358m93J126
1404A299j738j463L428j940j637K431n41N66o39n14L477k476j851L244j268j085
1420g07O3k19J897k280m42L677k083n33J573n21R54k074k12K875l371k18K710
1437A089j860K71J72L68J928k703L45K545k362q6R9k59J178k670J190K642l451
$$ y = [813, -1552, -1679, 2097, -1348, -1577, 1331, -206, 792, -2, 131, 2430, -1375, -666, 1934, -1390, -559, -602, -876, 1411, -1602, -368, 2659, -911, -20, 1553, 61, 489, -1522, -43, 1362, -2524, -331, 1033, -1323, 629, 225, 608, 1437, -1586, 1068, 1939, -1928, -266, -47, -637, 47, -1768, 776, 1132, -1809, 1305, 1495, -388, 485, -754, 1106, 514, -2897, 614, 614, -1982, 244, 225, 746, 356, -1209, 2372, 1042, -2106, 658, 441, -522, -733, -1647, 1429, -60, -2180, 1889, 1108, -692, 666, 173, 1299, -439, -1902, 1526, -414, -2051, 380, -161, 405, -234, -748, 2729, 253, -1598, 1646, 378, -707, -644, -863, 1034, -1246, -1688, 1989, -94, -627, 946, 425, 1379, -695, -907, 1968, -1403, -1621, 1089, -771, -500, -328, 40, 1968, -735, -390, 2155, -207, -293, -194, -453, 725, -1945, -755, 1887, -1564]
1454a564J084K014j391O97j242P21J346l386J117J572k265O82PJ004P07k891K724
1471I36J364l494J623K19j008O89k086J763R88l279K257J302j531O66o19J626
1487A416l63k960L020l85k631J946o39N75L30k239L413M4l032K616j27j067j6
1504i9j065K162j377k083L531r12r81J443r28J913j001k102L572j880k133K583
1520F43j046j7k71n73L055j847r74K874j534k6j5j054K319k743p75L748k653m56
1538a345K045q16J236j351r2K665k999j75J926j827N11q88M77K275l272J132K777
1555B279k805P91M70o82J138k608Q55K006l235R97J282p21Q72j592J780J234l609
1572a548K007J026k557J000p54N91R14k765K346J256k617J627J27qJ65k279K345
$$ y = [-1564, -480, 1534, 143, 840, -402, 319, 1665, -1721, -604, 968, -1297, -615, -608, 396, 1103, -1788, 936, 2300, -1194, 429, 648, -360, 329, -1757, 6, 994, -2285, -28, 1274, -257, 409, -210, 1416, 1053, -1907, 1113, 728, -1903, 43, -596, -21, 309, -1930, 1483, 1527, -1505, 1111, 984, -83, -99, -1164, 998, -379, -2462, 1069, 157, -824, 619, -309, 1604, 603, -1499, 2073, 193, -1940, 643, -403, -420, -691, -1264, 1791, -56, -1030, 1844, 310, 284, 269, -785, 1534, -1209, -1984, 1764, -889, -1345, 700, -116, 1120, -231, -323, 2342, -657, -832, 1094, -733, -222, -1110, -633, 1642, -1630, -498, 2279, -526, 265, 735, 53, 1191, -1417, -562, 1444, -1791, -794, 488, -233, 639, -953, 827, 2061, -1548, 459, 1485, -1072, -72, -826, -235, 679, -2086, 260, 1516, -1101, 526, 653, 645, 810, -1469, 876]
1589H76r0l056K354R7r76R56j128K193j14k600K993m08k089J182n63O67o13j778
1607b097L188p27j815K471o66J38j9j214K385j575j951K841j119r22Q23l49J783
1624A175j374q02L184j950r05J576r73M82j312m94K669k089n37K507j136J67K7
1641B15o7J637k526j05K293k223j33Q34l64J021j609P88K291k653L38J627j271
1658I3J98j136N17J320k682J017J609j652P44J72K99Q23k287J289J212k684O49
1675d99O24o09L99j104J528R08k484J668J002j502L61o79Q66O9k385J887N89j929
1693a290J258L08J91J09j347J981o7k458J588O7r79J67o20J730m32j726K548M8
1711A076j436Q33k76N77o81j566K208p17j688J876n2k11O2m48K009j080j520K186
$$ y = [876, 786, -2270, 84, 181, -795, 161, -967, 1226, 1112, -1488, 1505, 1097, -992, 190, -373, 294, -319, -2097, 1091, 364, -1451, 1020, 354, 492, 473, -741, 1644, 69, -1882, 959, -160, -1082, -259, -608, 1175, -199, -1001, 2183, 233, -672, 904, -69, 413, -899, -1393, 1276, -813, -1350, 1157, 21, 188, 215, 148, 1785, -741, -846, 1447, -776, -909, -75, -439, 582, -1027, -239, 2052, -601, -263, 1364, 93, 291, -845, -328, 992, -1690, -673, 936, -716, 28, 200, 499, 1322, -965, 324, 1536, -1148, -499, 125, -484, -85, -1189, 339, 1247, -1237, 431, 1433, -69, 292, -387, 479, 548, -1837, 50, 639, -1290, -32, 276, 467, 576, -771, 1210, 1143, -1315, 273, 340, -639, -472, -1092, 638, 206, -1520, 1028, 1076, -360, 473, 197, 774, 93, -1473, 735, 18, -1670, 206, 154, -57, 5, -443, 1566, 486, -1034, 1152]
1729A152q94j046M95l14J145j156q01K704r61r76J432l22K03p65m80J767j836
1746f53q49K194r65j68J74J13J488j637k02K190j736n58Q57n54O07j442K57K172
1764A288j967l3J859r59L01n70K31J161k512N29J599j852K81M47J61R18j740J039
1782A81J606k408N79P37q21K54j321R73J102k391J227J298j338O71l39P02K73
1799I85k221J541N77k223R94J62P2L71j347J786M90k209J658J82r49K68r80J223
1817C80k03j968K250K0j439J331k08P08l67j438K120o96j809J607m65j39O0p27
1835i83J976p60j292K350p15p34M83o89J098j196r40K374j368o92J625m79N68
1852F26p30k81K051j836o77J757j279J3j78j19J612j784J04K202j563j7O54m90
$$ y = [1152, 258, -788, -293, -607, 538, -618, -1419, 1285, 324, -652, 780, 458, 661, -104, -584, 1183, -653, -1502, 692, -273, -441, -267, -154, 1334, -303, -505, 1685, -51, -609, 248, -306, 301, -1141, -884, 1288, -679, -712, 1147, 188, 489, -81, 150, 1311, -1201, -672, 927, -925, -644, -197, -36, 882, -858, 181, 1787, -621, -42, 695, -126, 128, -1193, -220, 882, -1509, -282, 1016, -322, 349, 10, 712, 985, -1236, 305, 882, -1341, -347, -185, -113, 258, -1089, 697, 1187, -1022, 636, 818, -131, 137, -843, 380, 177, -1791, 459, 479, -960, 371, 163, 871, 504, -934, 1186, 490, -1319, 288, -177, -316, -256, -983, 993, 233, -1059, 1291, 576, -158, 325, -364, 734, -462, -1402, 972, -396, -1088, 537, 58, 626, -104, -385, 1666, -170, -847, 910, -369, -356, -534, -653, 959, -825, -721, 1481, -82, -99, 555, 65]
1870F5P16j551K09J665k199K10J369p16N41p10O62J259k305O75J193j623L50k19
1888d09J35P53j835J202J359j893Q70M36k80K78j419J196L65k273J322O36j012
1905e69N68n26J088L78j928J721K80j654Q41l18J92j65j293J868n7j485J532L1
1923E04k66J48q36J476p41j738K005m21r87P09k30R07m01q72J981p34j136J161
1941E29m70P7n65o23J869j161q57K018o81k69L63j64J049j344m95J652j135n71
1959g78O42j93N78p34J60J673j518j93J424r27l0m94j5J104j524j2J577j017p8
1978c55N48J76M39j402O26J222j911J70O36m98K59o76P26R68j694O72J287j148
1996D5k4j39L22K82j532Q27Q26j507N98N72RJ41r88J088N20j712O90M15r59L04
$$ y = [65, 781, -770, -561, 1104, -1095, -885, 484, -232, 309, -401, 261, 1520, -785, -110, 1083, -540, -190, -409, -274, 479, -1356, -154, 1205, -688, 182, 618, 338, 616, -803, 393, 758, -1515, -193, 443, -569, -1, -527, 561, 939, -989, 732, 1012, -642, 199, -119, 73, -92, -1385, 483, 426, -1059, 473, 504, 238, 386, -450, 1026, 285, -1453, 552, 131, -856, -147, -377, 530, 129, -743, 1238, 504, -632, 529, 59, 136, -429, -1052, 817, -344, -1201, 817, 136, -133, 230, 66, 1115, -229, -724, 928, -207, -778, -136, -329, 249, -485, -325, 1348, -170, -363, 1061, 134, 104, -390, -405, 699, -825, -837, 740, -277, -355, 193, 369, 808, -594, 32, 1254, -657, -487, 149, -349, -90, -766, -40, 928, -766, -94, 1193, 45, 21, -118, 204, 486, -1046, -219, 607, -900, -302, 270, 279, 420, -568, 520, 1040, -672, 18, 433, -526, -222]
2016b22l14P11O7j299J453N30j175L89L5K54j88j155J317j58j559J327L22n10
2034a75J81l51J232k48j318J209r7r89N16j77M17n16p77J842l31j092J024Q8r7
2053C41k99n91J337q79j049J569m33m87L67j08J030p72n54J613q92p21Q06k87
2071iO5o55j25J629j153m59J377m80J03k42p2R09j377j95J471j154k72O07j28
2090a60O46q26K46J201j449O2R21o50l4o99N02J042j672M09J195r95L74O3L5M98
2110G09j358O71Q54j634L77L42j07M02r86J014O20j677J114M73r85K49n62O31
2128A47L20j717J185O54j134O74N2K03P1j051J300k01j479J120j98k45K41o09
2146f67J158r6j341J726j55r58M19k83O89n46r49J453m86n84Q52l06L73k51m56
$$ y = [-222, -536, 175, 242, -1057, 396, 926, -249, 140, 175, 429, 241, -914, 403, 245, -1314, 13, 335, -175, 6, -345, 887, 639, -679, 530, 433, -556, -40, -217, 200, -316, -1093, 749, 418, -674, 350, 438, 341, 42, -549, 788, -91, -1140, 429, -4, -491, -124, -232, 798, 26, -528, 1085, 193, -528, 278, -9, 56, -599, -724, 905, -248, -707, 670, 190, 293, 51, -21, 888, -489, -684, 787, -367, -639, -32, -160, 486, -340, -94, 1107, -342, -280, 641, -9, -43, -742, -240, 802, -870, -461, 734, -261, 113, 176, 211, 709, -649, 22, 876, -758, -381, -39, -146, 256, -730, 284, 904, -773, 341, 814, -171, 78, -484, 147, 467, -1250, -65, 589, -545, 129, 181, 384, 455, -596, 704, 503, -976, 144, -54, -299, -58, -667, 491, 395, -946, 780, 625, -333, 86, -197, 492, -54, -1003, 450, -36, -620, 232, -74, 299, 48, -408]
2165d08J532r55j026J497o52m22K74l50J033q66k51J550q21m01O35l03O48j188
2183d74j67J499j355k45J161o58L22j53M0J077j363oJ190j069r6L8N8N51j204
2202h54O17J193j401L13O99m97M13r57M30P82j583M79P53q35L07j66O08L32j242
2221f09R42N30j337M67J4l9J56j014J047L37j325Q47M28l18J16n58P44q7j256
2240i15J139L8j007O68j24N57j87p94J325j27j156Q56j15j52j47n20J104m94r13
2259i64J298j07l24K61j44O59p25n68J283o39p09O06q6L27m40j60J271p35n84
2278d80J124m31k44j70j42P85q56k92J232o46j94M58K0L40p54QJ140j189k91P96
2298B14l53N0l48K45Q38r94J40J051p58j45oR1L83j053K69R37j043J82N75j55
$$ y = [-408, 1124, 169, -857, 640, -12, -434, -160, -510, 523, -343, -594, 956, 135, -266, 369, 66, 714, -474, -641, 858, -497, -742, 419, -239, 83, -70, -30, 1047, -316, -322, 868, -201, -297, -259, -201, 350, -854, -237, 956, -445, -132, 567, 70, 483, -474, -44, 738, -845, -366, 387, -448, -141, -307, 301, 633, -609, 333, 863, -474, -7, 7, -32, 124, -890, 157, 494, -831, 16, 444, 126, 242, -316, 428, 341, -915, 224, 262, -745, -77, -201, 356, 169, -625, 700, 573, -583, 273, 158, 6, -141, -661, 443, -51, -964, 334, 227, -97, 164, 20, 679, -46, -614, 669, 30, -679, -73, -159, 168, -272, -432, 839, 104, -480, 644, 213, -31, -201, -343, 442, -414, -706, 526, -120, -314, 144, 164, 504, -250, -242, 898, -291, -582, 214, -139, -89, -437, -192, 646, -348, -208, 843, 85, -60, -66, 25, 408, -645, -376, 561, -482, -300, 275, 120]
2318A20J78n75N08N72j244J67P37p21J1j22M19K99j038P45O87r63K80J27PK0q64
2339f50O90L68j207O34M90m29P9k08O61P9j068P87K61q88K86m7K61o9p71J135
2359C94L4r61P92K6j51K1n21P47k90r86J050Kn40L57j29O55l11p43J203l58q20
2380e29O82j94K1k33l60J152n76o04J122k21j96ok20O90p17m61J140o45k98M77
2400B4p3M67n87j62J203r08l22Q32n45L2l65N4Q84j043J05J106q16J10K04p9M40
2421E61j009K13R39j254J05N04j58K92o19M77P76j274M49O36p49J86m03L08L14
2440B94j170Q02O49j002M32J75N7J71r23Q33K05j240O09K37m14K66m26P25J82
2459D62j100J008J88q53M21k79L40j18q73J142o3r72Q49p6J42j12m59R35l13r66
$$ y = [120, 298, -277, 231, 803, -441, -274, 463, -258, -247, -369, 50, 349, -689, 56, 743, -220, 60, 187, 194, 214, -650, 40, 408, -799, -165, 325, -104, -25, -233, 428, 507, -561, 226, 487, -401, -115, -162, 99, 30, -741, 394, 428, -533, 259, 285, 134, 155, -366, 381, 91, -895, 155, 157, -383, -26, -155, 500, 189, -554, 649, 291, -529, 153, -41, -20, -253, -613, 539, -37, -641, 481, 260, 64, 58, -162, 528, -189, -650, 490, -155, -453, 24, -49, 418, -169, -331, 872, -36, -358, 474, -71, -39, -404, -350, 534, -509, -404, 702, -114, -4, 200, 121, 561, -448, -235, 704, -550, -445, 59, -99, 193, -426, 51, 827, -447, 2, 638, -111, 75, -328, -20, 294, -876, -74, 575, -427, 5, 180, 237, 408, -515, 318, 523, -717, -108, 129, -285, -19, -445, 280, 462, -638, 370, 558, -295, 126, -153, 187, 69, -804, 338, 275, -697, 152, 76, 218, 106, -353, 582, 269, -697]
2479f97J028l66k85J96k27P60m64n46J249m04m94N89l58L21m49m58J166p73m97
2498g09J038l64P5k7r9P84q10l40J053p85JJ68j69M58p33K13R32q71qO60m51K07
2520B23n46J76O59j023J82O70n53J41r7K69M79r42L87O28j026J63K84j77J53o45
2540e95N47N95j072N14M58m63K02l75M20J03j044P10L11q38L60Q5K30J37p54Q15
2560C46K29r81N68j9k03k5m47P82j04p69Q69O0m12K74j38L52k16p75R16j09p18
2581e20M89QJ16j39k50Q69l38o46P86j61l40L0j88N41m32m30R61k33l88L72J4
2602A21K35l48l00Q36o38l95O29j78q6q0N4O60o26j62Q69m86k95K31n9L20o94
2623c92K2Q47p11q8O02j52K1k57J59N05q66K8O48n52k6LJ71M56q22K83P76q17
$$ y = [-697, 331, -35, -320, -124, -351, 409, -55, -601, 648, 244, -250, 339, -19, 302, -147, -605, 561, -212, -709, 329, -35, 40, 13, -86, 698, -112, -452, 601, -184, -183, -15, -184, 274, -459, -246, 686, -185, -193, 467, 16, 223, -323, -147, 512, -511, -329, 341, -212, -71, -168, 101, 580, -362, 25, 653, -373, -210, 74, -103, 50, -595, -48, 547, -525, -11, 447, -16, 186, -189, 231, 334, -710, 0, 311, -527, -167, -82, 148, 285, -469, 346, 575, -406, 162, 143, -60, -85, -532, 250, 146, -623, 246, 306, -106, 168, 30, 382, 166, -609, 307, 198, -520, -31, -23, 93, -46, -296, 573, 235, -411, 375, 214, -126, -96, -284, 257, -175, -605, 356, 123, -265, 107, 121, 356, 8, -292, 544, -94, -489, 140, -38, -124, -204, -150, 510, -116, -278, 591, 105, -190, 41, -18, 302, -392, -370, 477, -234, -322, 280, 128, 149, -108, 51, 556, -310, -282, 366, -186, -212, -209, -38, 418, -404, -121, 655, -162]
2645a62R9K77j57P3n28K93M93r12K48N90l78J44r1K44J93q47M01M21q03K68L8
2666i6Q1J16o27O64L48q28M42K39l18J6l76O42j05q36P09Q0m09K24p6M10q6o37
2688d23Q64q3p76M43jq7o5l51P77j54o04P83q0k55Q5j91N00m50o06J048l34m73
2710d33N05r0K27j97k30P96n47l79O14l55N4k41m7P37o82j48R65n37r8K58k39
2731f7M67o30j24Q13p36n5M51k30K89m03K26N51q05J74O25p03J47j63qN21q26
2752d86K26P74q36K70K52qJ35o08L95L44r22L37K47m23M08m01M77K19q64O54L91
2773E81q18K80r4J19O3o94O31K17p67N37J38q9P7m80P12r5r19O99pm19K93j99
2795b34M81j38n64Q67r4n71M58k34J28k51l37Q05l46n20P94j19p8M8j84O34m37
$$ y = [-162, -63, 214, 57, 130, -398, -105, 388, -524, -276, 314, -64, 80, -11, 233, 426, -421, -20, 401, -402, -134, -96, -15, 101, -526, 138, 486, -342, 100, 339, 21, 37, -339, 303, 198, -638, 71, 151, -258, -34, -110, 300, 214, -423, 441, 358, -418, 25, 24, -63, -128, -479, 298, 144, -460, 323, 243, -12, 73, -118, 382, -68, -674, 374, 40, -433, 72, -18, 209, 12, -218, 578, 31, -348, 266, -89, -35, -276, -323, 414, -268, -416, 549, 12, -86, 172, -67, 400, -230, -354, 459, -277, -332, 119, -111, 178, -225, 1, 552, -253, -79, 546, -157, -10, -173, -181, 340, -486, -260, 514, -322, -52, 200, 192, 327, -281, 114, 458, -464, -127, 120, -303, 105, -296, 181, 400, -464, 190, 581, -237, 43, -51, 68, 131, -563, 68, 285, -482, 55, 193, 104, 181, -299, 413, 318, -601, 98, 91, -328, -35, -234, 247, 109, -455, 412, 318, -253, 205, -29, 99, -152, -489, 316, -30, -550, 244, 125, 47, 95, -89, 545, 108]
2816A08n60Q28m11l14L52j48K68l67o3Q56n13j49M75l03P9k69l6N63p84l5O80
2837B57l60mM7Q7M52o66N1O94p73M3J82j32Q8l65K67N92p61K26N19m03K2q7J42
2860A18J89p94L33M31n96J97J55J2J96m82M70J78o44K15K63l09l5k95M62J87p23
2881d72N81K56l95Q8l8K90j44o14N47J17n90J60K02Q9p4j82N67j15n65N16l3l48
2903a57R1j78M22k68m50P07O8l61K50N4J11l21j83N50l20l97M14j12K2n5p5N61
2925C73k93l57P23k69l25K15p0J63l83j97P32m21j82N62j76P2j97L8M25n89j22
2946b78N10m25j0J08j8L11m09J12O28n66j24K80j7ol58P8N21o57P5M47k32M3J1
2969B4J22K68o30J02M98o10lJ88o6J28l91M39L61n91J90K93l25J01l54K75J55
$$ y = [108, -452, 376, -35, -349, 3, -145, 123, -244, -307, 549, 36, -113, 362, 59, 138, -131, -167, 396, -388, -423, 257, -103, -107, -60, 27, 479, -187, -136, 558, -215, -172, 10, -122, -34, -399, -132, 460, -301, -75, 444, 41, 63, -24, 118, 307, -487, -154, 277, -319, -122, 33, 45, 241, -241, 229, 407, -237, -22, 241, -68, -103, -398, 64, 251, -472, 109, 365, -30, 58, 20, 310, 166, -448, 99, 216, -374, -214, -12, 77, 3, -179, 388, 273, -292, 224, 191, -157, -66, -244, 178, -90, -540, 167, 235, -126, 124, 178, 289, -32, -215, 335, 15, -382, 32, -80, -58, -113, -188, 373, 80, -277, 446, 177, -148, 67, -3, 160, -223, -420, 312, -109, -291, 271, 95, 167, -30, 8, 433, -156, -278, 232, -193, -203, -95, -113, 198, -211, -99, 529, -37, -161, 119, 102, 96, -262, -184, 337, -320, -245, 202, -30, 13, 24, 146, 414, -216, -114, 384, -226, -229, -41, -107, 21, -370, 69, 430, -161, 29, 322, -3, 98, -256, 19, 174]
2990A74o70M46K73m19J59P0J26J25n29M48R8o34K63N6l5p5k91O40L4p07O38J18
3012C08l64J72k22L00j71n38O84r8l88L60nJ20p6k24N50k56n05N26j82j32n2r6
3034b89N25l08k70O16j32j92K13j04K29l62k66O53m52k45M53r7J45k08j2N39n49
3055a13m1N17m04j11M6qK45n27J70O77m87n6L21j19J07m36J46M73p43R9L89l48
3077b03J38o8J51M00o60L42L77o40J15K0pR5n42N10K12n76L41K05j63J43l27L43
3099B06N6o99M18J17l61J31p6L39M1m42N88Om94L15n3lq6l80N74j62m31M86Oj39
3123d3N1o3M75l11m22N81j95l44J77p3K41j64k15O88k33l59M25q0J0k02j58M53
3145B39m11k14N88k27j30K25J6K50m21j05N21l41k25K23j70J87k74J04N01m23
$$ y = [174, -496, -50, 223, -196, -37, 33, 159, 284, -245, 203, 301, -333, -70, -14, -49, -124, -415, 225, 259, -448, 190, 308, -56, 116, -106, 194, 23, -515, 169, 71, -317, 43, 38, 158, 82, -142, 408, 152, -353, 173, -9, -141, -193, -289, 236, -72, -342, 274, 142, -50, 163, 59, 288, -74, -340, 313, -139, -384, 69, -28, 117, -91, -103, 436, -113, -154, 363, -41, -152, -106, -114, 131, -396, -226, 451, -36, -92, 229, 110, 217, -219, -73, 400, -343, -244, 145, -203, -65, -133, 18, 418, -242, 100, 477, -163, -48, -28, -35, 60, -482, 28, 240, -336, 5, 210, 47, 190, -137, 206, 262, -437, -19, 98, -263, -132, -208, 131, 172, -270, 318, 324, -170, 145, 92, 89, 3, -377, 197, 35, -396, 90, 96, -43, 8, -55, 420, 109, -313, 268, 73, -271, -94, -167, 74, -90, -305, 383, 150, -209, 216, 136, 146, -56, -214, 239, -172, -386, 202, -25, -155, 70, 86, 336, -85, -190, 331, -10, -235, -12, -182, 5, -269, -165, 336, -87]
3165h7M4L60k20p6n3Q6J66n36P6M31l67j9K17L3J86l44K19K85n98N7K93j76j11
3188a34j17J82J61m01K95L32l07N3o4J60k0m43L00K52n88J41K01m5O1j76L02Q4
3210B29m30L21J10k96Rl7J06n3l29L89K03l78K22Q9L2p2k58K82m2n26M39Q8k46
3233a48N4%L31j44k57M87j20k54O2m0N2j36k22M82q9k99L46P7j24L7j32L47l15
3256ek54M13j66j63O4O4J39j19k11N81k31k13K72r7r0j78KL29l42n7M63k01l3
3279c3R2nK71m00n9M13l73j70K68m2O9k31K06L42l91oL37j84j32j00M8K20m41
3302c01J44L46l01kJ89P5O1l30K12J98n43J82Q1j21R6k29L31J63n27L16K31k66
3324EK3j9M6M0m00K95R6m41L15J02K1K5k66M09L9n20L06L1k94J17j74L37r1m12
$$ y = [-87, -43, 317, 97, 21, -32, 54, 220, -316, -240, 191, -176, -195, 22, 55, 241, -103, 116, 401, -197, -140, 153, -23, -134, -251, -69, 92, -309, -14, 318, 11, 64, 0, 160, 140, -303, -3, 249, -339, -198, 3, -42, 19, -157, 145, 229, -201, 120, 230, -66, -57, -94, 12, -41, -370, 19, 222, -156, 66, 155, 187, 115, -143, 139, 97, -429, 10, 98, -148, -94, -94, 237, 93, -164, 323, 203, -51, 11, -29, 23, -113, -335, 147, 58, -241, 105, 182, 58, 95, -37, 310, -5, -259, 154, -12, -175, -111, -47, 92, -27, -238, 343, 112, -101, 171, 74, -16, -194, -192, 137, -205, -262, 201, 0, -33, 59, 54, 325, -75, -134, 279, -94, -264, 4, -38, 31, -200, 6, 348, -43, -49, 288, 104, -28, -128, -80, 140, -301, -157, 189, -112, -114, 75, 150, 211, -119, 93, 291, -252, -70, 11, -110, -14, -243, 88, 251, -276, 40, 271, 5, 28, 9, 55, 95, -305, -10, 86, -355, -40, 62, 83, 108, -158, 251, 290, -230, 76, 107, -187, -70, -244, 93, 2, -410]
3348d10N71J6k83K92j56J86j86l72N23k59k78L98j29O5m5j07M95j90l31M52j73
3369G9j09K7o4J75k89n7M90k56p9L02j35O2k31%M13m88j21L72j47l2N2J2L32m41
3393a33Q2L83m54J21k7n9J38l40J71L66m78P3L29j61J47j91J45K01n71K15J47
3414A04k59j1K0K03J53m69L26K34m44K08P4j38l6j77K49P0m95K99J89p1r7K2K66
3437B20j11l21L17nk65J04n7J63o7j93L66j6k68K93l9q9q5n0L04k64k68M31j04
3460do2N9K4K20k13j54L70j25k67J65k3%r8m9L26k28j8K97j49p5ML6J35l49o3
3485b41L69j94j26K27%L8j17P4K33k81j04K25q1m7j68J30J36l22J64L42k31j9
3507GJ17m2K4k82J23K26l56j6K53o0M5j26J62J44l05J26J68k24m1n2M1J04k95
$$ y = [-410, 161, 177, -106, 186, 30, 216, 30, -342, 181, -78, -356, 42, -87, -22, -67, -174, 321, 131, -200, 252, 79, -30, -3, -67, 108, -181, -238, 252, -4, -83, 219, 84, 146, -85, -85, 328, -160, -281, 91, -56, -88, -36, -24, 308, -133, -51, 332, -122, -1, -28, -87, 51, -289, -118, 248, -230, -157, 172, 11, 158, -33, 112, 313, -258, -43, 104, -155, -166, -146, 57, 210, -259, 67, 301, -143, 65, 139, 1, -35, -212, 37, 107, -388, -89, 100, 29, -68, -46, 220, 109, -212, 105, 100, -165, -61, -118, 45, -22, -215, 151, 135, -133, 160, 121, 32, -53, -103, 201, -63, -331, 100, -4, -66, -7, 17, 237, 24, -130, 240, 115, -152, 13, -10, -10, -108, -157, 169, -59, -77, 220, 71, -4, 0, 36, 171, -178, -241, 128, -66, -192, 35, 35, 73, -44, 30, 263, -18, -122, 103, 22, -25, -193, -63, 73, -249, -85, 257, 26, 7, 124, 82, 106, -176, -53, 173, -183, -199, 54, -6, 39, -87, 75, 219, -86, 40, 208, -16, -57, -109, -68, 36, -259]
3530b59K35K59l89J98J11j8Qk70K15P8l90J07K08k26J39q7K12L1l20L15N7k97
3552h3P7L1m4j6j93K67O3l13K59O3n4J8j31K36q2k58J94L7k14K9oK33j91j04M53
3577B71j68j91K10l1j19m4q8K38k06j11L46q1k6JM4J89j94j32L22k54j45J96q6
3600e9J53k26K0M48l44j40L29q9p7r5K6K32l89N5L19k79K7J37m9J69k27M6K46
3623B33l60JJ85j67M9j15J31K18l21R6K76k76J27o7k0J39l68J88K48m46J81P1
3645Cl8J81k61K42J37l76J63N9j74J4p8J34O2l21L10J77l24J75n5L5lk37K61%
3669H6l52K08L4kK0j13L66j02l12L09p1k03J07j29J65m5k51L79j9k42K21j8M4
3692H0p7j11L62l49j05L14j61k1j4l4K43j12j24M27k82j10J55j80J18j40l9L77
$$ y = [-259, -24, 235, -154, 44, 155, 137, 145, -125, 90, 168, -222, -115, 93, -133, 6, -81, 131, 162, -158, 157, 214, -83, -6, 25, -19, -35, -228, 39, 102, -211, 48, 111, 57, 75, -56, 180, 98, -160, 34, 71, -143, -114, -120, 113, -78, -182, 271, 103, -88, 122, 91, -28, -72, -160, 78, -128, -239, 107, 26, 0, 1, 45, 234, 40, -92, 230, -24, -169, 27, -59, 94, -132, -112, 336, -8, -148, 181, 92, 15, -80, -54, 178, -211, -156, 163, -116, -89, 48, -1, 168, -59, -13, 233, -127, -126, 59, -108, -59, -174, -43, 175, -146, -50, 226, -50, 77, 10, -10, 129, -239, -51, 197, -249, -68, 3, -35, 146, -115, 127, 264, -112, 51, 110, -64, -50, -128, 6, 68, -253, 57, 234, -90, 85, 30, 65, 62, -175, 86, 86, -266, -58, -24, -26, -6, -119, 247, 145, -167, 142, 71, -132, -25, -154, 11, -34, -285, 94, 75, -167, 54, 36, 80, 3, -108, 254, -95, -200, 114, -47, -68, -82, -116, 127, 15, -109, 318, 36, -74, 81, -99, 19, -121, -160, 217]
3714B17l15n9L09j17L1p6MK71l34p5L53l09r0J33oJ81k26J18K36k67M6Q1p8j0
3738A8k49L06J36m75K03J82j99Q7j8R1J31m23K67R7l85J53mK4O5j39J96J59l17
3761i4J53O1j21M8j69J97o4k49K72rk02J47R3L4k2j84L13l2l30J32K7N9j33j14
3785a87L38q4j95L03k3j66O0k4J42j63j85K39m7j34J18K5N3r9k8K62j65j67J96
3808F9l5lj81N9K64k66M4J83r9q1L7K1R9j66j16K93k88J3J69oK6j01J21K04k94
3833c4J1J81k10L1J9o4J22k67J42K42k07K9Q7J0kj66J5K79l66KK65k14N0L0lR2
3859G4j93J37J92k69M1R4kr6k20K06Q2j84R6J08l5Lp1J90K7l10J55O0k33M5K9
3884g4J53q1j01K26P5k30R3O4j28o6j02K18l0k21K47K8j20N2mJ36q6k16L42j00
$$ y = [217, -98, -157, 152, 35, 66, -10, -6, 265, -69, -144, 209, -100, -190, -57, -63, 118, -108, 10, 246, -21, 25, 106, 28, 18, -231, 75, 211, -264, -61, 121, -78, 9, -9, 82, 213, -210, 57, 154, -231, -78, -82, -58, 7, -132, 64, 223, -94, 59, 120, -1, 47, -122, 75, 11, -238, 34, 25, -177, -30, 63, 97, 75, -109, 204, 172, -158, -26, 1, 60, -73, -187, 151, 67, -128, 175, 152, -14, 46, 22, 164, 1, -184, 55, 8, -126, -8, 17, 70, -29, -57, 205, 40, -127, 69, 34, 31, -150, -91, 173, -93, -49, 134, 35, -46, -9, 12, 111, -55, -171, 122, -166, -153, 16, 10, 36, -65, 56, 260, -34, -23, 158, -52, -21, -2, -66, 56, -211, -69, 173, -34, -5, 82, 92, 90, -76, -61, 218, -148, -146, 119, -95, -45, -15, -18, 74, -119, 18, 210, -59, -18, 76, 74, -22, -242, -36, 46, -138, -42, 66, 31, 34, -37, 153, 180, -130, 25, 85, -148, -103, -74, 79, -2, -103, 123, 198, -32, 61, 125, -3, -69, -171, 47, 17, -204, 43, 71, -49, 3, -1, 135, 49, -167, 175, 75]
3908G5j91P4L3J7r6q0K84q4j07K30j20qK8p6J72k51q1K60n2j56J14J01O5j99J4
3933c4K61k29j60K28j32jk0nK76j88q5L34k07l2k0k0J43l11R4K08k73R1J37l3
3957B2J14k22J39K04l44O0R0j71O1o9J32J31l50J81J68j31L5J6RM0l33K22J03
3980A07k98R8J23r9Q4j53K65K7l00K82n0j96L3J6%J8r6J91Rj81J33l1Q7N0k15
4005i6K24n2l25L16Mj19L9r0K66j35j83L48n6l04J80n2P1j13j03K93k03j07L02
4028A05p2o8K9LK34k28j70K29m5q9N7K4J00j84J7K71j89q1J65p1l7p9Q2L0j64
4053a31J12J29m0m4K3k2J15j89M3J46k25L3K7K8K6j90K00R5j80P1L3oj9r9J28
4078F4l8k29J26J87j66O4J7J01l8j92J33O7j55N8J8p7j9o8J88m2j51K52M3j44
$$ y = [75, -116, -42, -9, 8, -88, -168, 116, 32, -75, 155, 35, 27, 55, -21, 151, -100, -181, 79, 27, -129, -15, 86, 151, -48, -34, 227, -2, -162, 66, -66, -67, -87, -92, 184, -4, -89, 245, 38, 6, -14, -34, 109, -202, -108, 100, -173, -82, 55, 22, 136, -86, 53, 257, -87, -27, 63, -108, -47, -116, 16, 147, -203, -22, 146, 15, 50, 66, 75, 115, -218, 4, 107, -191, -93, 30, -69, 15, -138, 127, 154, -146, 136, 86, -110, -77, -61, -61, -43, -139, 52, 61, -120, 13, -18, 69, 119, -96, 128, 76, -249, 67, 71, -48, -9, -99, 167, 32, -151, 197, 141, -163, 17, -35, 36, -77, -180, 113, -90, -197, 105, 33, -35, -6, -3, 231, 3, -167, 62, 17, -72, -15, 9, 109, -75, -58, 213, 24, -57, 108, 37, 0, -79, 3, 33, -131, -19, 110, 70, 26, 49, 27, 142, -47, -4, 142, -83, -50, -23, 5, 31, -159, 41, 136, -44, 27, 60, 54, 35, -64, 64, 26, -203, -77, 110, -56, 8, 25, 126, 88, -104, 29, 96, -59, -1, 17, -60, -79, -147, 41, -1, -152, 100, 143, -1]
4102aM6n3Q2q5k03K45mj61J11N5M0j02q4K92j10j48J08k9k9L4q5J34n9j43K27
4127G8j6o7J9O9K1j18o5J88j29j51J77M0o6J3n8J71j9j91K45r4j20M0k5Q7q3m7
4153a01K21j42j10K36q3N6j06L9J16j73n4J96r6p9J0J34M8j75M8J68j76o5J15
4176B7k1m9r7N6K20k34M3K05j63%N5pQ9k30K4J86j49k0pJ20K3j37R1J54k82J17
4202A4K5kq2n9O0M9j66R5J86j30n8J16J18j04k31K54K4j93JN3O7k0j45K01O8k93
4228a52K13M5q7K8r7R3j04o8K28l9j40P7L8N4p8n6J80j19j54J32k8Jm7JK52j86
4254a3r3K27l4j30K2L9N0j23o9K33j20p4J07o4P4m1QK17k07j41K50j16n3k8L1
4279d8Q8j20j6K59j81l2J22oj4j36PK41k89L6J26p5R9j13Q2J48k75Q2J41j36K9
$$ y = [-1, 45, -8, 74, -11, -214, 31, 27, -134, -23, 32, 72, -30, -114, 178, 68, -80, 28, -1, -30, 4, -81, 53, -6, -149, 78, 62, -5, 14, 83, 104, -14, -79, 109, -20, -171, 6, 46, -20, -7, -65, 106, 87, -104, 141, 47, -73, -33, -58, 29, -54, -101, 120, -22, -132, 104, 21, 77, -29, 10, 126, -47, -101, 95, -1, -80, -70, 64, 112, -63, -15, 153, -23, -88, 27, 6, -43, -140, -84, 136, -98, -55, 150, -13, -13, 42, 35, 124, -106, -82, 104, -45, -65, -72, 48, 71, -66, 25, 179, -103, 14, 39, 37, -45, -104, -44, 5, -161, -66, 120, -10, -68, 48, 166, 62, -169, 85, 109, -84, -83, -30, 37, 17, -128, 73, 141, -152, 61, 106, 19, 47, -50, 43, -61, -129, 99, 60, -80, -3, 35, 89, 11, -45, 135, 16, -138, -6, -34, -33, -80, -79, 173, -13, -106, 121, 87, -43, -21, 18, 68, -55, -124, 109, -11, -85, 22, -42, 32, -9, -1, 216, 9, -132, 118, 2, -51, -79, -48, 40, -80, -96, 163, -18, -50, 72, 66, 52, -84, -77, 164, -125, -89, 37, -38, 61, -52, 30, 178, -97, -15, 126, -10, 19]
4304A9j09Q8L0j86J53R5k00J64L3Qr2o0J39l7j91J47j2o5P5q4K05r4j24J61K7
4329I0k30J70m8P3j18j83L04k7k01J61Q6J3jj05J61j57q9J48k6r6M1J02J3j65
4353h4j3K10o9r6J15o2J6r6OJ32j40PJ26jkm1O8L0j59J3J03j38k3J03J9l5j22
4380a33J22J75j95K6R7l5o2l7k0K03k59J38M2j25K8M8MJ00j34k3J91k39P4O2J5
4405F3p8q7J28N3p3J6J10j71N7N2M9j32r9Q0R2j42N6M7rJn5J08J0j17K0N5j18
4432h4j9M5J52o2j37J74K8j45P5K7jl6p7Q4o0j11J48L7q6K9n1K27n2j44J20l9
4458D2j38K2J9Q0r2m9K41j16n5R3N7r1o0L5J00j32q0K14r9m6O7LJ13j15m0K02
4484A75r1j36N2L2j9q5M5J19r6o0J14Rl1l1P5N9j96J1J62q9j10J23m5Q0j63Q1
$$ y = [19, -90, -2, 28, -158, -5, 90, -110, 54, 87, 95, 3, -57, 82, 45, -146, 1, -11, -76, -1, -85, 120, 26, -98, 63, 90, -140, 30, -18, 55, -63, -246, 58, 31, -170, -9, 77, 90, 89, -16, 145, -12, -101, 47, 21, -75, -34, 68, 81, -84, -97, 113, 44, -52, 63, 1, 17, -79, -73, 59, -81, -74, 52, 51, 49, 8, 76, 106, -53, -40, 63, -75, -98, 5, 24, -11, -133, -11, 164, -31, -5, 92, 57, -5, -42, -62, 141, -118, 20, 62, -63, -35, 13, 17, 117, -17, -40, 151, -88, -14, 48, 63, -15, -102, 26, 79, 6, 22, 132, -39, 18, 70, 119, -13, -112, -32, 60, -82, -26, 21, 12, 13, -42, 66, 76, -41, -21, 34, -84, -103, -58, 94, 32, -105, 69, 97, -48, 27, 54, 53, 17, -60, 24, -36, -147, 1, 38, -48, -19, -70, 157, 105, -39, 81, 42, -96, -74, -55, 25, -67, -116, 125, 9, -46, 47, 104, 13, -47, -12, 88, -44, -124, 90, -9, -55, 12, 15, 128, 13, -27, 175, 84, -52, 0, 32, 13, -72, -27, 92, -4, -64, 50, 59, 28, -3, 72, 131, -65, -54, 108, 19, -91, 32, -13, 67, -96, -15]
4510a5J95j63m6J37o2j32m6K5J84j84P1J38n3LJ0q1J82k42R0Q1k24R0M1L3j3q8
4536f9J25P4j71N8J17j06m8J7K8J2k60K15N8j49J50%NL4j89K26p1j62J21k2o6
4561g3P7r2J70l5j40J35R8j16j3J5pn8j04J46Lj35J60Pl3l8L1J54j04j11R2l9
4587a0p0M2qJ78j85j7K30j17n5N8k8R5j32m7J86k35O2P8l1k4ok9K13k11M4J71
4613A52j84%n6M2P0j17OJ84j08RN4M1p7OK%k00J43K4n3N3j5M2J3j16J43L7j77
4641h2R1L9l3n3p0J03M6q9Q8p4J13l2o7J27r2j38J17k2n4L9J7J21p7j32J99l6
4667D9q1MQP1j03j29K34j06j30K01j2K7O9L9l7j29j04K14p8p3R2K3m0o4M0J05
4693I0j21j9J00J3%J6r2O8j09p1J43n6J3M7N7k2q7oJ59j96lR4j5k3n4M2Q6j20
$$ y = [-15, 180, 17, -29, 108, 46, -86, -132, -107, 77, -107, -36, 102, 49, 52, 62, -19, 163, -79, 11, 92, -132, -42, -1, 32, 19, -69, 56, 130, -41, 17, 134, 28, -20, -3, 25, 37, -223, -8, 50, -99, 51, 51, 56, 90, -99, 127, 56, -106, 15, -7, -73, 4, -88, 82, 47, -93, 42, 140, 24, 11, 26, 19, -39, -143, 3, 6, -129, 31, 38, 5, -33, -2, 152, 48, -63, 29, -10, -80, -38, -46, 132, -53, -70, 160, 43, -12, 46, 18, 113, -19, -66, 120, -115, -53, 25, -6, -30, -36, -65, 148, -63, -19, 152, -32, -32, -88, -46, 24, -93, -87, 97, -11, -2, 52, 93, 16, 22, 24, 24, -176, -33, -9, -62, -9, -24, 18, 31, -85, 58, 95, -82, 9, 48, 15, -38, -108, -5, 41, -48, 40, -34, 79, 47, -20, 107, 15, -123, -6, -28, -82, -43, -26, 95, 18, -114, 85, 49, -32, -28, -20, 51, -52, -181, 53, -53, -183, 18, 6, 33, 102, 141, 104, -25, -129, 85, 7, -66, 26, 49, 9, -55, -15, 90, -31, -50, 50, 63, 63, 79, -13, 55, -54, -125, 18, -38, -25, 22, 79, 57, -30, -36, 123, -73, -76, 18, 3, -20, -74, -32, 54, -66]
4721f6j4K19p6q2L2L1n9r6O9J24j76J7J06P2j09k8M2Q0j57N5N3m2j24M5J17l3
4747@o1Q9J02j79J07j5j4Nr2J00n3j38J27K9m3Q0J6j5O0j60J05M6j30m3R0qkj68
4775a65K22J0q4L0N5Mj08j0J93j27j56J09k3k3J3L4J17k8q4J37k4j22K4J2k5J
4801a8j10J81p0n7J55K9r3O6j29L5pk4N4lp0M3mNO0n0J63j45l4M8M1o1o0n7J54
4830D2j30k4J78p1k2K4Q0N3j65K8J38j98K2R9k3jj55K07O0j85RJ45q8J7p2O2L
4857C3j53M1J16o6K2N8k1O1o5N7J8k18R1M5p9KJ6O2j1j16J54K3m7k2k5K0N9j64
4885a09O0N5j36K24j06M4k3m9J38m6j55J65j8p9R3p1L5k6p6J54n4n9K8l6J15o6
4911Bl1O5o5q6J25K5o0P0k3J07j80M6J08o6j37mQ2Nrk8J53j51O0J03p8K8j02O1
$$ y = [-66, -80, 139, 63, -19, 13, 44, -15, -111, -42, 82, -94, -77, 29, 101, -8, -36, 6, 86, -71, -16, 37, -5, -129, -84, 33, 0, -61, 28, 130, -49, 58, 43, 29, 34, -58, 42, -11, -149, -22, 7, -36, 44, 60, 45, 105, -55, 50, 96, -34, -77, 13, 5, 3, -165, 57, 67, -17, 13, 68, 72, -36, -46, 147, 20, -136, -27, -50, -73, -60, -26, 91, 63, -21, 116, 92, -30, -6, 6, -19, -18, -128, 53, -17, -74, 81, 110, 17, 83, -46, -11, -18, -42, 12, 9, -61, -18, -22, -17, 43, -7, 156, 11, -23, 25, 66, 5, -55, -112, 42, -88, -112, 66, -5, -27, -3, 77, 130, -35, -7, 131, -67, -45, 54, 31, 30, -125, 82, 142, -43, -34, 111, 23, 40, -32, 30, 33, -120, -79, 37, -29, -7, 51, 30, 91, 26, 83, 101, -117, -26, 19, -60, -58, -42, 20, 9, -107, 47, 70, 23, 1, -24, -4, 55, -109, -49, 6, -130, 94, -12, 32, 9, -40, 98, 52, -103, 62, 44, -35, 58, -13, 22, -4, -80, 74, 20, -39, -11, -47, 68, 2, -29, 36, -29, -115, 10, 35, -25, 45, 22, 129, -51, -5, 103, 37, -100, -104, -22, -17, -26, -54, 99, -52, 8, 111, 33, 61, -41, 20]
4939B0P6k36L2J15p4K5k5N9O2j26N0J41j24QK9k5k1j00P7O4r1O8M6Kk0k6M9j5
4967D0j18R2J6j28N1L4M7%j10J53k3o0M2M7j02n7R1L2l4j57J75j6Mj3j4J11r4
4994Iq3J57k7j87J12N3l2n3qJ70p1r2Q5K2j4r5J1J04j52LJ10l3k4N4k5J73j12
5021E5l3K6m8%oj0m1j5M7J30j21O0O9Po8l2L0J8j86O4J17j09r2J59o3P3r8K8J61
5050A22j73P4j3k4n6N9j4K7n8L0P7l4l9N3M0r1J9m1J07j77N5J16o8j3p5J21M9
5077G3p9jL7l4j3L2L1rj37J55N5j69J22rn7L0n2O9J2j70Q3N7n7k9k9J26J3j6n
5106B9P6j57N1j3Ok8j9R6n5l8P5L6m2n2K1M2l2r8P9K3q0N3L0M4p5kQ9K0j36J23
5136F6k2n4pl4M8p1j8J30n3rO6M9J9j07k8J56j64n3P5m0P4p1rJ59j04Q4M4r0j4
$$ y = [20, 96, -140, -108, 7, -67, -42, -67, -8, 54, -72, -22, 119, -5, 3, 32, 7, -14, -114, -37, 27, -64, 4, 50, 52, 32, 6, 55, 40, -78, 14, 30, -98, -47, -13, 34, 34, -76, 77, 54, -6, 36, 83, -19, -76, 15, 47, 13, -144, 31, 15, 19, 6, -8, 103, 9, -74, 83, 56, -131, -19, 34, 2, -51, -59, 111, 40, -52, 33, 55, 41, -54, -43, 61, -91, -88, 22, -11, -35, 19, -6, 167, 55, 22, 48, 0, 0, -6, -16, -57, -72, -25, 105, -16, 44, 113, 120, 52, 20, 50, 68, -118, -54, 63, -46, -138, 21, -42, 31, -67, -39, 122, -51, 23, 10, -14, -70, -11, -25, 2, -56, -26, 51, 17, -22, 31, 71, -20, -1, -42, 65, -112, -57, 59, -9, -22, -97, 24, 73, -6, -7, 30, -4, -17, 15, 46, 37, -100, 55, 110, -59, 63, 54, -3, 27, -25, 44, 56, -114, -31, 26, -31, -60, -89, 37, 50, 34, 29, 105, -52, -1, -14, -8, -36, -55, 41, -14, -52, 23, 59, 17, -35, -14, 28, -4, -102, -23, 0, -80, -27, 3, 47, -28, -30, 59, 79, -57, 66, 44, -10, -17, -51, -3, -74, -92, 38, -15, -24, 42, 91, 110, 3, -25, 131, -33, -86, -11, -51, 23, -48, -57, 102, -2, 82, 126, 36, 22]
5165B2k5l8N5j12M7R4m0k8MJ05m9q6J22J9q0k0N8m9l7l5P3L3m1K6N3m9Nj0P7n1
5195D3j16N6lq7Q6L9PK6q0O4K2j43J56Jj21M0n3Q1j2p5P9J23j27P7p4J9ro3R7
5224E3m4l6Q2n4j0qM8L8Jj01R7m4m2j0L2qp2k6J02J3m7N4k9J0Pm0J18j39n0Q7
5254a8j9L4n0M7J08j30L6J44j11o6M1rl6j4J6J13p5r0J12j8M2m2L3pj25R1j0o3
5282f6Q7k8QM7j08J66m4r2N6L3k4q5n2J12L1j65Q0M6l5K3l6J58o0q3O5l5k8oK9
5311fN9j69K5J11L2j15J23op4L9k3N5n5pm6O5k3L1L4n3Nm2J13j1j60R9l6oLn1
5341h9J12Ln1K7J7m0NN8Oo2K4K6n3o3J12k2o1J05o7J20j07mM2or5J9K7N6q7K4
5371b4R7p6M0pn1J06j21J6nM0mo5M8nl5Q8P9r7k0RMr6J18q3N9j21J38O8j04k2
$$ y = [22, -3, -41, 14, -98, -51, 43, 3, -25, -21, 84, 35, -51, 71, 90, 10, -10, 48, -1, -38, -73, 0, 33, -8, 18, 71, 22, 27, 17, 94, 43, -73, -17, -20, -107, -21, 18, 25, 51, -29, 35, 57, -86, 70, 71, -50, -10, -63, 18, 6, -69, 10, 133, 6, 83, 9, 28, 19, -44, 53, 9, -27, 55, 1, -9, -17, 31, 69, 70, -31, 66, 22, -20, -30, 2, -6, -78, -104, -2, 11, -36, 18, -11, -1, 6, -34, 84, -55, -105, -18, -37, -3, -53, -6, 102, -28, 8, 152, 41, -25, 16, 7, -29, -43, -27, 86, 11, -79, 33, 15, 57, 15, 48, 41, -84, 7, -3, -66, 21, -7, 1, 48, -60, 106, 62, -30, 26, 59, 35, -50, -102, 10, 41, -124, -44, 2, -33, -10, -46, 112, 52, -31, 34, -1, -29, -35, -6, 53, -116, -91, 20, 52, -63, 60, 54, -20, 19, -4, 51, -4, -11, -57, 8, -15, 16, 50, -3, 2, -40, 73, 62, -98, 1, -35, -41, -38, -89, 23, 26, -25, 2, 19, -21, -16, 42, 48, -14, 10, 36, -17, -80, 32, 10, -51, 54, -13, 107, 0, -4, 38, 32, -63, -44, -17, 39, -48, -24, 73, -3, 37, 30, -21, 85, -36, -20, -25, 15, 11, -54, -6, -11, -46, 42, 121, 24, 4, 13, 17, -79, 39, -44, 15, -106, 32, 100, -4, -26]
5401b6M5K2J3m7J2Jj13N6Q0j16N0K0m0Q8o1N1j7k6k3N7m9Lj9M5L2j13J09qm0P4
5431F0k1J4m0o4Q5o3p0P5J7m0K6l2R4N8j64R1K4k2m4K1j7J5m9Q1J6m9m8J03pm2
5461Hk8O3m5p5J06q4O8q6M3R6pj28J44m4J5j13M0M4m0q5J22J3LJ0l6R3j19N3J8
5490D9l6k9J00n2n1o7Q5K4m0RM0n3%J0K0M1p6jN8j22N7O5j8qK8LM3j26L5O2r6
5521d6M2k8J7L3p4M6J19j33j7P9nK0j01L0M0j44J24m2K8M9j9K8j5l7P2n0J5j06
5549g5N4K5j3j9N0j4j8P7p9J3N2n7J0K0j30J27j8m0oK7O9J6r0J02p1n7K4J5q2
5578h8K1O4oKOk2K6M0n2P6M0j07m6Q2p8rR2n6Q6o0lJ16j28l4J9L7%n9Q5K6j11
5609d1O5j2o9O5RLL0n1L7j5p7kR0l7jq1P1O8o4N3n4M2l4mJ8j6l6m3J18p0k0P2
$$ y = [-26, 19, 41, 54, 7, 19, 20, -93, -37, 43, -73, -23, -3, -43, 45, -16, 35, 18, -8, -31, 26, -23, -20, -39, 6, 38, -75, 34, 26, -14, 60, 39, 53, 13, -51, 34, -29, -99, -24, -7, -47, -21, -53, 41, 99, -65, 26, 50, 28, -16, 5, -12, 3, -46, 35, 51, 2, -46, 57, 50, 8, -20, 43, -2, -77, 29, -55, 13, -73, -30, 66, 59, -69, 75, 31, 46, -67, -27, 17, -23, -108, 14, 27, 30, 40, 4, 97, -22, 31, 49, 13, -16, 84, 32, -19, -86, -1, 23, -17, -8, 32, -21, -21, -11, 9, 50, -26, -27, 31, -91, -34, 31, 13, 5, 33, 36, 79, -47, -12, 50, -46, -4, -32, -15, 18, -56, -10, 109, -24, -41, 38, 33, 53, -48, -18, 22, -122, 2, -40, -12, 37, 18, 46, 31, -6, 66, 16, 31, -75, -21, 4, -9, -28, 22, 8, -10, 67, -12, 1, 53, -4, 6, 26, -104, 23, 5, -35, -41, -14, 55, 71, -19, 83, 12, -45, -21, -6, -88, -67, -3, -9, -7, -1, -23, 3, 43, -9, 67, 107, 0, -46, 36, -42, -51, 41, -15, 71, 11, 8, 124, -4, -38, -19, 18, 18, -41, 44, 70, -41, 24, 12, -57, 8, 17, 20, 50, -1, 36, 21, -56, -58, 32, -5, -6, -87, -16, 52, -12, 41, -13, 29, -5, -9, 9, -7, -43, -86, 32, -38, -58, 14]
5641A4LqK6M9j1q8KjN4k9q3J08K5j71J21N9q7L3l1J11oj10M5j3m4k3N4k5MO1m5
5672fL5p1L9J8q0N3l7N3m4J8P8j2q0J07m9k9m2K0N0l6OJ9J2k0NJ4L8p2n4J23l6
5703B0l5K6J4o2K6k8J51p8lk0jj7PK3J6j9k5Q3l9j7o1O1L8o9J6M9n0l6k6K3M9
5734A6k1MR5j84M8N3kLL9j2Kq9N9M6j59P0J6k4J6N3J3K6j05P5Nj0n2k7J00j0j39
5765i5N3P2J2k7l9O7M4j44P2P9j50O3J1J5k2l9M3n0J9K7M6p0j2mQ5j05l7J08n1
5794b9O0n9L4l1Q8p7P7n7J2J2j00K4j2L2K1l3J5O6j2m5N4o7M0n4L8O2n8J3M7m8
5824A3O0o0j5N9p2L8K3m5j4oJ8o6P7m2R8Lr6J6l0R2j01N4N3j40R4%n8L2k2J4J01
5855G8j17J08l2l3n3L0N4n8q5J25jl0J7J8lK0K0k5rj06P9j7%L6j8L4J6q2N8J2
$$ y = [14, 17, 9, 35, 84, 73, -15, -13, -14, 40, 11, -72, 36, 61, -110, 11, 70, -17, 16, -15, 96, 90, -20, 25, 12, -32, -55, -1, -26, -22, 39, -6, 29, -42, -3, 15, -65, -12, -49, 4, -40, -22, 56, 44, -36, 71, 22, -7, -49, -29, 21, -15, -9, 10, 22, 2, 7, 21, 59, -13, -67, 56, 20, -15, 11, 25, -37, -11, -39, 112, 34, 31, 11, 10, -7, 0, 23, 39, 20, -5, 78, 39, 22, -39, 22, 60, -9, 7, 56, 6, -30, -56, -33, 16, -5, -1, 94, -90, -42, 11, 9, 12, 51, 39, 41, -48, 11, 57, -102, -32, -16, -40, -24, 29, 42, 68, -37, 38, 43, 33, -19, -46, 54, 44, -95, -42, 30, 42, 15, -24, 43, 87, -57, 15, 94, -56, 7, 18, 33, 11, -28, 15, -35, -16, 11, 57, -13, -25, -29, 56, -49, -86, 22, -29, 31, -28, 6, -25, 63, -14, 63, 6, 18, 30, -70, -46, -58, -26, -5, -38, -23, 43, 31, -14, 40, -27, 13, -41, -3, 59, 1, 14, 61, 13, 73, 13, -2, 57, -15, 23, 46, 1, -13, -19, -1, -67, 10, -32, 66, 69, -27, -11, -41, 51, -50, 4, 57, -83, 11, 11, -47, -15, -37, -23, 78, -39, 69, 37, 4, -49, -19, 35, -23, -108, 17, 16, -14, 3, 21, 18, 38, 58, 33, 24, -82, -3, -20, -20, 16, -2, 32, 48, -34, 24, 36]
5885C6q2P8J7m7l1q2J32n3m8L2P8p2K8QPm2J4L9j2p4J9O4O9m5o6J09j1j54J23
5914C4j6l6O9j03N8o0J0l1R1rl9K0L5J8r4P2o7K6M3Jm3j5O5oj4K2O5n2J4j05M
5945d3J20j03l9J09Mj37O4J09p9j7L9OJ1m0k0J1qJ5pQj0k2P7mj24R0m8R4q7L9
5975HK1k9J0%Ro9QJ05J2j27J07k1n9L6K9p9P8p3N6J4m6K0j1J7j4k2K7lm8N5k7
6006a6L8o3M4J1j9j6%P5m5Jm1O3j0n8K1JpK1k2l5L3J4K5n9m1J18p6m4R1L0Op2
6038c2lO8lq8N8K5Np7l8J11l8rL7K3l6l5L5N4q6J5Q8n5K9q7K7P2q7P1L3p8mK6
6070B1k6k7j2J3M7m9m6J31l2K4o7N0j8l7K7Lm2J2O2j5o2QJ8N4k9rP7j4o2M2j6
6101B6oo8L6K0l8O7l2K1LpP6n6j08O0L9p8kN0No3LL2R0n9l6O2j6n7j0K3qj8O4
$$ y = [36, -46, 32, 49, 2, -29, -111, 21, -32, -80, -48, 30, -42, -14, -6, 1, -41, -27, 12, 0, -74, -55, 9, 78, 33, -33, 76, 65, -89, 34, 18, -18, 51, -52, 6, -54, -44, -75, 16, 7, -32, -12, 23, 41, -53, 19, -48, -22, 21, 22, -21, -36, 29, 23, 9, 31, 96, 44, 58, -47, -43, 77, -26, -65, 44, 48, -89, -25, 84, 5, -12, 27, 33, 44, 4, -16, -5, -13, 2, -5, 3, -7, -29, 48, 44, -80, 10, -38, 56, -31, 8, 29, 0, 10, 10, 19, -50, -42, 63, 75, -52, 55, 34, -25, 11, 40, -39, 39, -34, 22, 36, -10, 10, -1, 16, 2, -20, 7, 4, -44, 11, -16, 22, -41, 3, 14, -5, -21, -21, 54, 9, 10, -31, 32, 22, -36, -15, -14, -21, 0, -22, -57, -24, -10, 15, -44, -85, 33, -43, -87, 4, 34, 40, -32, -35, 33, 30, -58, 0, 25, 30, -47, -85, 26, -12, -21, 16, 39, 3, -32, 3, 57, -29, -14, 74, 19, 48, -39, -12, 60, -27, 44, 77, -1, -5, 21, -5, -32, -44, -31, 16, -33, -79, 52, 20, 44, -23, 27, 9, -28, -1, 2, -40, -28, 34, 19, -43, -35, -17, 37, 8, -1, 76, 62, 0, 42, 26, 20, -48, -12, 8, -30, 37, 5, 26, 29, 22, 98, 42, -66, -6, 33, -45, -47, 3, 8, -55, -52, -20, 70, 11, -25, 37, 21, -36, -46, -23, -31, -49, 15]
6134A5n1O4k5j2N4j4j10J53n1l7J1n5J13n5k9J05q2k2M2M1k5m9qM3q%L3p5j0j
6164d5P3J3j0L4m3l5J7M7Q9j19q9L8M8n9N7j2k6R7j42N8O0k7m1Ppm7P2J6J9m8
6194ek5O3n3J1L7l9l1JO9j4o2K1P4m2m4J3P1m2j05R7K0o6kM5O7m8kJ8k7J0l6J04
6226G8r8k4K5M0mk3Q0pmp4nJ0P4j20P5o5O8l2l0%K6p9J08Ol4J5j7K1KjK9m9q4
6259i3J09Pq6J00M7n4pqP9j15m9P0L4p9N0Mj0o7Q1Q5j12L2J4kqr5R3Lq1J4O5k1
6291@k6N1Ml0j1lM2k1q2R4J4m3k9J0J25p8%J0kom3K8K3n7l5N1J0J2L7r5k1O3K1
6324A3N9m6o8J1k3L7M5j8k0N7k3Q7o7k8L1l0k6n3K2J15r4L3Jj6K7j01K23j56J4
6353Fq3O8k0lL2L1j0l0Q6l3pl6M0M7q8l5J9M1%l1j9K1j5K8J1%n1J22j0q6n3K2
$$ y = [15, -36, 28, 3, -9, 45, 31, -79, 74, 23, -14, -3, -58, 55, 0, -29, 76, -6, -28, 14, 55, 30, -19, -27, 16, 8, 8, 41, -34, -44, -45, 28, 41, 31, 65, 22, -13, 4, 51, 140, 21, -68, -30, 18, -41, 16, 4, -22, 75, -67, -9, 51, 24, -17, -10, -17, -64, 8, 24, 43, -5, -30, 33, -20, -9, 28, -11, -42, -41, 28, 14, -48, -27, 47, 5, -39, -26, 45, 3, -102, -5, 15, -51, -53, -8, 59, 11, 9, 27, 0, 10, -26, 78, -20, -44, -19, 21, 17, -6, 74, 67, 63, -11, -16, -6, 68, -52, 23, -42, 26, -6, -36, -36, -10, -89, 19, 25, -9, 6, -11, 10, 12, 11, 40, -9, -93, 16, 23, -63, 37, 84, 30, 23, 15, 94, -21, -70, 0, 34, -45, 5, 9, -1, -68, 13, 98, -14, 18, 32, 30, 22, -73, 20, 23, -58, -44, 21, 0, -26, 25, 29, -1, -12, -15, 27, 6, -76, 18, 32, -11, -40, -30, 95, 17, 17, 27, 25, 19, -24, 4, 27, -30, -65, -14, -4, 8, 45, -50, -71, -8, 13, 72, 26, -42, -31, -54, -17, 28, 10, -10, 47, 24, 111, 44, 16, 47, 17, -9, -62, -40, 75, -19, 14, 15, -1, 26, -75, 148, -8, 6, -77, -9, -29, -32, 0, 31, 21, -9, 77, 44, 37, 1, 41, 88, 0, -35, -16, 25, 25, -6, -25, -4, -19, 9, 20, 20, -31, 91, 81, -5, -58, -36]
6385c6N5k4o3N7J2m6N6K5%j01L5N0l6p1K9L9k5l3N4J36r0m1L0QM1m7l7j1oRQ6
6416E5j06J2j7L4P7j46R3L5j19R2l4OQ2j08N7km6j0P5n4M4K6Pk8p7P8j9KM7m0
6446A6k9j1j0J06o4o0Q7l1l5N3k6L2o0K5P3k1m8JJ1K7K6p4RJ6Ll7J7m4L3MN5o2
6478a8J2M8j2o5J02j22J1N3K2j8n7m2J06m8P9p7M0J8o6K6n0N9N0n6n1J16j07L2
6506a5J00p0m9N1p7O3k6J4K9p0l1M4M1R3q3L6q4ML9j1n9M4Qo8N4j5M4K6J9n3K0
6537A8L2p7ORP4j00K1L3l1J2jN7o2k8M4K8j22M6M7L5o4%L0Km7N6M0k2k4j7L5O7
6569I7j12M9k7n6M3k6kM5o2J31nj34J13r1k8Q2j11M1j0K0Q6L6q4M9Kn3Pj04P7
6598b7j9K0M7m4k8K8P1l1oJPO1p1j1k3P2j08nJ22Oj10Q8M5p5m7K3N8o1K2K5p6
$$ y = [-36, 19, -5, -68, -11, 1, -45, 11, 36, 36, -65, -30, 20, -16, -87, -58, -19, -44, -77, -23, 113, 23, -18, 12, 20, 61, 14, -23, -34, -40, -31, 55, -51, -39, -56, -22, 55, -91, 2, 37, -82, 10, -24, -18, 64, -44, 13, 11, -35, -45, 30, -24, 20, 46, 53, 25, -52, 26, 7, 9, 56, 16, -13, -24, -34, 72, 8, -52, 35, 4, -31, 22, -4, 28, -32, -7, 66, 45, -3, -2, 9, 36, 62, -12, -3, 13, 16, -21, -4, -48, -15, -11, 44, -18, -6, 42, 30, -35, 67, -55, -44, 9, 31, 13, -44, -86, 20, -28, 51, -26, 14, 32, -34, -8, -58, 1, 51, -5, -56, 60, -47, -15, 85, 15, -34, 17, -60, 3, -23, -9, 20, -50, -81, -37, 4, 97, 14, 50, -34, -30, 9, -2, -61, -17, -9, -77, -23, -38, 6, 32, 51, -2, 18, 50, -27, -21, -12, 62, -38, -17, 16, -15, -3, -4, 53, -9, -37, 7, 35, -87, -41, 6, 41, -23, -23, 7, 9, -38, 18, 58, 36, 12, -5, 30, 97, -15, 34, 7, -49, -6, -32, -34, 11, -51, 80, 75, -59, 54, -37, -65, 17, -94, -53, -63, -43, 43, 79, -5, 44, 46, -7, 0, -104, -27, -46, -26, 21, -23, -51, -23, 48, 17, 11, 12, 19, 80, 9, -2, -25, 47, -61, -66, 56, 62, -48, 40, 85, 10, -37, -14, 44, -17, 5, 30, -46]
6629d6jN0nJ3p4%J14o7MO8p5M3j37K4J31r4j1P4J00p5ln0P2q6R5l4m3m3K3O5m4
6660a2J4N7nr7N7M0k1Lpm1L6o5L1O7r3O8J0q5P1j3L7n8l2oR7o0k4J5J05n6m3O1
6692E1j8l7lK6j00N4J3R7r0q6P8qP0r8O4k5L2k3m6RQM3o5J23o7j7O3jm0K2n5J06
6724H0j40j9Q4L2o9O3o0J8L2l3P3m9j1J2j7j3l9P0nJ3k6L9k0poP8pj28O8k6l2
6755d5l8J16%M9j45J03O8j30K1J4o7K5j1M1Rm8M2j9J7n4P7j8L0m8O6l9o3J0M5
6784Hql2pM2m4qJ06J5p9j4n6J20n0q3J24n2j8N3M3k2n1M2O8j28j6lL5L3j4j3L4
6815B5jl1O4k3m5J03n7k2k3o7R4q2J2P1Jj8j7J5L4l4N0l2j3q4M0n7Q9J6l1K0O
6846CLP4l1l1m4l9Q9j06J3J4N0L9k8L4k7mj1O1r5M7l3qj4L7p2J09n8O2o2P4k6
$$ y = [-46, -47, 3, -2, 11, -63, -63, 51, -16, -12, 56, -19, 24, -113, -89, 42, -52, -63, 11, 111, 36, 33, -17, 55, -31, 64, 30, -13, -56, -33, 32, -12, 2, 59, 54, -43, 14, 54, 33, 36, 29, -12, 24, -41, -10, 57, -36, 32, 42, -43, 28, 15, 52, -6, -38, -44, 53, -7, -31, -16, 89, 33, -10, 51, 33, -4, -7, 19, -81, -27, -14, 83, -7, -93, -15, -23, 47, -51, 13, -12, 20, -3, -49, -40, -32, 11, -54, 69, 2, -15, 48, 47, 7, 29, -26, 80, -60, -79, 5, 37, -32, 31, -29, -11, 21, -12, 61, 12, 1, 13, -4, -17, -56, 14, 9, 22, -4, 35, 15, 8, 2, 80, 73, -55, 13, -13, -45, -83, 33, 33, 82, -63, 40, 108, -22, -1, 13, -54, -29, -40, 1, 10, -38, 4, -15, 2, -52, 25, 7, 37, -11, 55, 16, -47, -37, 8, 0, -32, -39, 3, -41, -49, 57, 72, -7, -21, -77, 43, -7, -90, 34, -18, -36, 17, 60, 38, -13, 29, 97, -31, -47, -50, -15, 18, 4, -9, 25, 24, -7, 57, 34, -11, 92, 35, 13, -10, -77, 17, -65, -53, 18, 19, 1, -16, -1, 33, -1, 49, 17, 4, -80, -40, -97, -8, 8, -23, -3, 3, 6, 80, 49, 18, -26, -65, 24, -82, -69, -55, -5, 34, 6, 40, 13, 9, -2, 59, -36, 11, -22, -30, -44, -7, -79, 30, -28, 34, -28, 46, 20]
6877B0Qk0op6N6J9n1K1KP3n4r4J21m3Jl1K4mK8om3P2p2M0L9J1l2O8j13J26j56
6908g2O8J9n9M5jP4j3p0L9n1K2MK3o8m3J04l2P7j28P6p1k6P9K5l3P8q4J29j01
6937A0n1L7K2j12P5k1R5pl7MP6j09J3j1L7m2l4K5k5J2M5j6Q3k7j0k6mm0O5m2k1
6968c6L9p4R9o5P9J1p9O7k3lQ4j51jQ0m3j7L6j1j8K2qJ18j70R0j6p0O3o9N6j7
6998b7k8O1Q3r4nR9q7L7k0k6mk8N0l4P2p4NQ7O6j19J2k5M4k1k2K1k6o3J35m7j7
7029EK9J9j9l5j3O0m0r2J59q9K4m8pJ06j14J11lp0k4O2L7j10N6p6J05p3n4J41
7057D7n5K4j5N8K6r7k0J05r9%J5O2k3m0M0L3j1qm2P2j05O0K3n0m3L6L7oq3Q2j3
7088A0k4P4k7K4p6j9K3l0L2j0J6N1r0M6P8n0l8k5J2j6j9O1J4m4oL5k7j8R9k5K1
$$ y = [20, 28, 8, 2, -74, -18, 1, -50, -29, -27, 46, -8, -102, 19, -24, -23, -54, -30, -34, -6, -12, -55, 17, -55, -15, 24, 35, 3, 71, -42, 84, -72, -4, 15, -44, 1, 0, 74, 61, -9, 30, -21, 1, 5, 28, -40, -83, 21, -11, 66, -62, 14, -57, -83, -4, 21, -12, 66, -18, 111, 10, -41, -4, 18, -94, -19, -40, 55, 48, 11, 15, 91, -18, -5, -16, 21, -21, -55, -30, -55, -43, 2, -14, 69, 42, 32, 6, 2, -38, 27, -15, -36, 3, -71, 28, -37, 42, 53, -26, 41, 18, 15, 99, -52, -53, 27, -16, -33, 3, -8, -26, -4, -12, 106, -64, 26, 10, -60, 3, -66, -10, -27, -55, 6, 89, -5, -10, 89, 2, 39, 19, -7, -11, -39, 11, -23, 49, -25, -20, 67, 133, 14, 26, 1, 45, 24, 2, 23, -3, -66, 69, 22, 5, 34, 53, 34, -1, -14, 46, 6, -86, 73, -16, 8, -40, -47, 59, -55, 56, 53, -17, -41, 21, 58, -52, 4, -72, 33, -40, -94, 47, -8, 16, 1, 59, 85, -12, -32, 73, -26, -26, -11, 51, 28, -12, 28, 61, 50, 42, 0, 72, -33, 27, 50, 0, -43, -7, 30, 24, -59, 23, 10, -14, 60, 33, 57, -19, -38, -15, -45, -13, -23, -7, 44, -46, 0, 78, 28, -10, -35, -23, -39, -58, 3, 17, -27, -33, 2, -25, -43, 56, 31, 52]
7119E2m9j06J18l6p4P8pJ1M7Pl7n2L6k6N1j9l2O4rk7J5rK7m7L0N8r5K1J8J9q4
7150e7M6qM1m4J2N6n7rnJ8n3P3k4k4N0r0J50p2j6rL0K8kj8j2l6Q5m3k7Pk9M1L
7183Eno7P8nK5qM5o6k1RN2%m3J2K0J0o2O7J2l8j02J15k6nLJ7j9j1K8M3q9mO0k1
7217IK7Qn0l7M4jK3L0p0N2l6L2o9L2%l0J9nL2m9mQ4n5k0J07m0pk3J6K0k0p4N2
7250cl8P6j33J42n3k2J23q8QqnJ8rk9JL7K9j05P8nj6Pn7R1K0m5m5j8pJ6J9M4k0
7283Cn5J26oj10O5Oq0J5k0R4o1n8R7n5J03o9M2L4q3K7K9l7nj1O0qn9k3P4p6L4
7314gM1j4k1k3J7j8K7Q4p7m4K1O1koo5OP7j50J13Ml8k1m8J18K4k3j0Nl6L7j3K1
7346D0k2r6N0N0m2PJ3KL4o0M5n3J9M4k9Nn4j2N3N6m5L8o4J24n6o3M4Qp6j3R2o8
$$ y = [52, 3, -103, 15, -21, -95, -17, -24, -13, 34, 41, 4, -48, -12, -38, 13, -6, -38, 26, 17, -10, 5, -4, 23, -24, 6, 64, -31, -10, 8, 27, -57, -11, -19, 22, -22, -10, 46, -11, -20, -25, -7, -60, 13, -11, -35, 15, -75, 75, 3, -13, -22, 8, 36, 34, 16, 4, -32, 53, 10, -17, -10, -39, 2, 5, 0, -67, 11, 6, 31, 23, 68, 2, -19, -10, 42, 42, -1, 11, 31, 41, -21, 46, 58, 20, -82, 33, 7, 2, 5, 22, 3, -8, 20, 63, -26, -30, 30, 9, 36, 44, -6, -43, 1, 0, 23, 53, -17, 35, -1, 31, -38, -6, -6, -36, -17, -22, 10, -39, -43, 41, -14, -34, 73, 33, 26, 3, 19, 39, 19, -55, -3, -41, 35, -98, 44, -9, -31, 92, 4, 12, 4, -1, 17, 8, -21, -20, 17, 46, -59, 19, 14, -2, 5, -52, 39, 59, 14, -31, -49, -56, -40, -21, 23, 3, -52, 74, 68, -42, 23, 29, -51, -36, -56, 38, -23, -81, 16, -39, 64, -5, 37, 71, -12, 15, 44, 7, 2, -9, 51, 43, -16, -39, 35, -41, -7, 34, 20, -1, -24, -7, -25, 2, 86, 9, -35, -14, 47, 45, 39, -26, -20, 57, -93, 20, 24, -14, -35, -83, 35, 59, 36, 26, 31, -5, 32, 19, 40, 18, -78, -28, 22, -20, -13, 0, 2, 36, -24, 21, -32, -13, 31, 2, 7, -47, -59, -6, 50, 5, 43, -21, 103, 47, -16, 28, 36, -40, -53, 39, -29]
7378b9P2n1PK8k5P2l4k3M4m7J0l1n5P1r2O4L0J8m9K0M5Jp9P4K4j04m7N8J7J9q5
7409g7Q1O3p6OJ7K4l1L2k9l7n1J04qp7J1P5K0k6j2P4r6k6K5Po0R3k4Om3k0R9j7
7441B7lNk1j7L4o7J3R0p0k1P1n7L4l9O5j4oL2Qn9l5K2NJ5k5m5O7oK7L2l0m0L7
7474B9l8m4mJ7L7n7P8M0l2M5p3R6n9k8j3l7Q2r0k9M7L5N2l2K4n7M8j2k4rp6O5
7505a9j5PQ2N6j69P3k8O8n6j0j4m1K6M4kqqj9O5NJ6jQn0j3J6K3m4JrKJ5J5lO1
7540G4p0nP7q0Pq5O2j4M1j3L8q8J07jn1J6m4N4k0j34K06j50L6P3r2P9Mn7K8N2
7570E0j08L4L6j5r%j7M4J8l0N0k2l6o2R9k3k0K9J3q6Q2o5R3l3m2J00p7m5O1oM0
7601E3p6k8Q7r3N7K9j7m0R6m4K3o4m7J18o2j0j5L8L1m3J0P2p2l0JOO2j5j03J8
$$ y = [-29, 43, -8, -1, 27, 2, 74, 40, 17, 61, 14, 24, -7, -62, 9, -83, -19, 11, 29, -20, 0, 45, 46, -33, 41, 65, -39, -86, -28, -11, 8, -77, 4, 67, -9, -3, 14, 38, 7, 39, 10, -27, -78, 26, 18, -59, -48, 27, 47, 21, 9, 83, -13, -39, -14, -7, -67, 26, 2, 8, -35, -55, 44, 27, 24, 29, 8, -9, 25, -42, -29, 61, -9, -30, 41, -16, 18, -21, 44, 30, 24, 56, 64, 5, -30, -8, -3, 12, -13, -58, 9, 3, 30, 62, 32, -8, 29, -9, -53, -57, -40, -3, -60, 18, 58, 26, 71, -2, 94, 35, 7, -6, -43, 39, -51, -80, -33, 2, 54, 22, 46, -11, 37, 25, 1, -8, -84, -19, -34, -27, 55, 111, -58, 15, -13, 55, -1, -11, -25, -66, -40, 4, 2, -6, -14, -33, 32, 37, 53, 52, 60, 10, -3, 13, 36, -8, -7, -16, -14, 1, 16, 13, 74, 4, -1, 76, -4, 3, -82, -20, -34, 7, -6, 32, -56, 51, 50, -1, 15, -29, 25, 5, -129, 77, -73, -37, 36, -56, 23, 27, -30, -2, 50, -58, -24, 12, -3, -12, -12, -29, 15, 33, 3, 53, 31, -5, -67, 32, 9, -11, 18, 31, -55, 27, -38, 55, 22, -20, 80, 3, -42, 19, 13, 53, -23, -51, 36, -57, 0, 29, 12, -28, 68, 24, 47, -17, -64, 54, -8, -18, -33, 5, 36, -7, 3, 75, 3, -27, -26, -20, 42, 27, -76, -58]
7631e8N6m1O6n0J0O6o7R8m6j4l3K3p6L0P0k5p7J59j03o7P7N7n5k2k7R4m9p2Q8
7660A2j0l4L9nJ4j5j0M6n9m7N3L3n6l7P0J5k9jOJ02p1L1n9L4j6m7J03r0K1K6L1
7691E0O7r0l6R2o0n2L4kk1N8p5J28j45J8J26q6Nl1N8n9R1q8J7j0k3M0nrj7M1K8
7722D4q6M8K2l5j7M4q4K4l5O8j4k5J02m6P0k0o7J02p9j12J1J34n1k5J7K8M8p9
7750a3PJ21j43L4K4l4j3l7K4Pm2P0L6n3j2M8M6l8l1n6K0j0M8K9rn0J5k2R3p8K8
7781IM9qn4nM0j0o9O7Mm8P3j8K4p8k4K2Q1j02J2M3L0j6l7O2nl8Q9p1m4l7N1k2
7813c0N5j40J50n0l9O7L1N5r4k1N5L7j12Q6o8K2o0K7M4n2P5j6j5q5L8K6L4k0n5
7842e5Q9r7j2J10l9L2o8K5pK8L0j2j5k3pj1j9kJ03Qp6P0l5n0O3L6o3M9j16P1J3
$$ y = [-58, -2, -43, 23, -27, -17, 49, -18, 80, 34, 20, -13, 10, -66, -36, 34, 9, -68, 91, -12, -79, -2, 55, 0, -22, -49, 45, -4, -76, 12, 2, -32, 7, 2, 16, 1, -9, 37, -22, -69, -16, 17, -39, -76, -6, 9, -20, -21, -15, 87, 16, 47, -12, 22, 6, -41, 62, -28, -7, 19, 50, 117, 27, -9, 83, 23, -29, 5, 3, -18, 40, -35, 93, -52, -34, 92, 6, 11, -20, 38, -21, 70, -18, -1, -11, -34, 6, 1, -8, -25, 16, 44, -42, 6, 28, -7, -24, 20, -64, -40, -75, -7, -21, -46, 56, 10, 80, 60, -7, 95, 16, -96, -85, 49, -2, -27, -10, 18, 66, -13, -6, 115, -28, 6, 30, -4, -17, -54, -30, -23, -65, 5, 41, -12, -24, 24, 70, 32, 1, -55, -35, -45, 3, 32, 23, -27, -12, -34, 59, -19, 9, 58, 50, -4, -9, 31, 21, -48, 19, 23, -25, 48, 30, 54, -24, -48, -26, 55, -47, -35, 8, 38, 22, -15, 47, 42, 4, 93, 22, -22, -59, -8, -30, 25, -115, 35, -15, -54, 13, 44, 99, 5, -16, 39, 76, -36, 50, -18, 4, -56, -29, 15, -37, 38, 22, 7, -78, -40, -14, 20, 0, -55, 34, -63, -75, 35, -4, 28, -40, -15, -22, 6, 36, 24, 9, -14, -21, -32, -51, -53, 50, 58, -18, 52, 17, -33, 30, 66, 3, 52, -64, 7, 20]
7873B0p6J1L8L4k4m9M3N1l8m3L9on0j4J39n3q8O7Pm7L5Oj9Kk4P2k4p3J14j10O3
7904Ck6L7J4K4o1M5J1k1K2q4K9k7n4R6M8o1L7J0m1n4J22lq1n0M1MM4l3P4n0J8
7935C3l9J4O9q7L1o1O5o2J5N9q0PJ07K4p7k%J5j5LOq4O5p6R8l5L9No0O4p0L2M7
7968E0m1l8Q1j17N4J7kJ0Pp5J24rr9L3pjr0%J02J9m0N7N0q0N2n5j0Lj6O6nm1O7
8001F6m3Jm1oQ8l0o8L1Ol5kM6J4m3N1j4Mn1Q7o3M1n6P3j9m5o2M8j8N6p7Q3k1J4
8034A5m2J11Qj28J10n0k4m2j1O4J9p2R4%r1O1O9Pj20J1l0J6k2N0M8J5p6J1O2m9
8064A4n7K6L4jp8Q5L1q3MN2O7j20N7m6J0m8P0rn7pM0J2n8R8l1n7N6M9m4k5k6K2
8096b0M8N3j44N5J2k3L6qN8j4p4Q3n8m1loK2n3J22Rj0m7j3J20j0o4l1P%r4P1k5
$$ y = [20, -56, -45, -7, 27, 3, -46, -3, 48, 10, -33, 6, 0, -50, -64, 75, 22, -66, 1, 8, -39, -4, 2, -17, -15, -39, 33, 9, -64, 50, -60, 3, -23, 14, 28, 52, -9, 36, 47, 26, 48, -36, -7, -34, -88, 8, 56, -5, 32, 42, 1, -53, 69, 66, -15, -65, -24, -20, 24, -9, 65, 15, 33, -6, 8, 77, -10, 21, -40, 25, -37, -22, 37, -43, -36, 71, 95, 18, 16, 16, 31, 16, 19, 25, -59, 6, -70, 28, -7, 32, 37, -23, 41, -29, 3, 50, 9, -29, 52, -65, -11, 6, 4, 14, 21, -54, 70, 61, -38, -5, -12, -13, -103, -103, -1, 18, -22, 35, 85, 5, 57, 2, -8, -5, -21, 45, 40, -1, 66, 23, 24, -17, -23, 65, 35, -33, -2, 4, -31, -33, 13, 27, -16, 35, 21, 25, -26, 61, -2, 39, -17, 56, 37, -8, -70, -22, -40, 16, -61, 22, 1, 15, -27, 84, 92, -36, 74, 24, 0, -42, -53, 11, 30, -42, 52, 52, -39, 22, 91, 98, -22, -11, -41, -25, -47, 3, 51, 66, -10, 1, 63, 14, -43, -17, 17, 16, -62, 23, 54, -29, -25, 27, 94, -26, 31, -15, -5, -53, 17, 8, -49, -56, -16, -4, -62, 36, 5, -52, 4, 53, 9, -16, -42, -20, 28, 81, -63, -8, 4, -19, 17, 9, 67, 53, -21, 62, 4, -37, -40, -46, -24, -77, 45, 54, 44, -3, -16, 104, 94, 30, -1, 6, 6, -88, -17, -42]
8128d2n8Q5N6k8M1o7K9L1j07O6n0m3M0LJ00q9kJ7j9M0Mj08J13m8K4L9m6J7n1P2
8158A9j7kj3P6k1m6J4j0m7K2LM9n9M2M0j10J29q1plm3L8L5m4M0k9m1N1j4%R7p0
$$ y = [-42, -100, -15, 41, 13, 54, -13, 16, 47, -60, 6, -44, -87, -47, -44, 56, -33, -35, -18, -37, 3, 7, -101, 12, -36, -12, 27, -19, -2, -53, 19, 2, 0, -13, 63, 42, -4, 10, 0, -47, -25, -22, 27, -32, 10, 50, -60, 69, -12, -19, -22, -65, -27, 8, -36, 4, -25, -66, -15, -29, -29, 68, -2]
8190bO7
8191F5
$$ Imaginary data points
##PAGE= N=2
##DATA TABLE= (X++(I..I)), XYDATA
0@%%%%qQqJ6j6K4l2L9m7N6p2Q8j04J20j36J60j92K24k56K96l44L92m45N06n76
29c07O53p34Q23r21J031j152J283j427J584j758J949k157K386k641K926l243L597
46A892l997M451m972N580o294P149q200R522j1241J3582j6967K2304l1968N4711
60C5552j94489j23202N28768j22288l35652J22708K62409j13593j65882R4884
70a0785R6396q6200k9977q947N7596M3619j25973L788J63175q2677j27706J09670
82A979J17198j40174j13932K06529O7656k50941K0857J99748o2783j33501L2684
93e4680J08842n133r6732J9387O6008O813m3720o1223P5176N3976j27963P263
105e1986J05622n1560m0816M8369J9368l2684j3726M1516j3813k5366K5417l2930
$$ y = [0, 0, 0, 0, 0, -8, 0, -8, 8, -8, 16, -16, 23, -24, 32, -40, 48, -56, 64, -72, 88, -104, 120, -136, 160, -184, 208, -237, 269, -307, 346, -388, 435, -486, 545, -607, 676, -751, 833, -925, 1024, -1133, 1253, -1388, 1538, -1705, 1892, -2105, 2346, -2626, 2954, -3340, 3809, -4391, 5131, -6110, 7472, -9495, 12809, -19159, 35552, -158937, -282139, 246629, 124341, -211311, -88603, 173806, 60213, -105669, -10785, 85611, -589, -30566, -39513, 18083, 61702, -64271, -60483, 102692, 20015, -107691, 1979, 119177, -20997, -134929, 71600, 139256, -111685, -90828, 108920, 46137, -87364, -54680, 54162, 49029, -47703, -28316, 37692, 44505, 785, -60438, 14738, 68714, -59249, -51986, 53636, 2076, -38740, 9629, 28997, -3687, -17413, 24103, 10290, -15076, 10341, -22589]
117b2589K1234M9465r5656o16J14684m6918q3503N5259P5707n6186p5097Q4582
129B0366L5472r0774J3038L1574j7766K1743k3848k3124N3404J8201n1177k5324
141c8215P5853J1773j15356M6333R6648j09356l4682J12450r095q5377K1784Q3382
153E6142l4980p3103O1621K9432n2647M050n53R828K5817m9730p651N9677n785
166B2118m5195K913N7119j1361o9660M5613M0947o6166k849M0688o145k0773n265
179a8016L5001Q4l7660K4790J6168k0479n273o657K4047J737m6001K2919L2632
192B3292k6078j0938J1379J9854r284k4033K7217q61k5268J9849n921q628J4052
205D632j4545P159J2560j4297M712M629M065o542j5856K8269o120l7652L2162
$$ y = [-22589, -1355, 48110, -47546, -48162, 66522, 19604, -63899, -8640, 67067, 10881, -64216, 20366, 55838, -34936, -21898, 9676, -8090, 13653, -10195, -33319, 20085, 38286, -12891, -38215, 37638, 49411, -65945, -19612, 77036, -32320, -67002, 45448, 36353, -49024, -27240, 56142, 21162, -51941, 9680, 39112, -13535, -9485, -10038, -210, 25607, -24123, -31774, 27903, 22118, -23077, -20164, 36955, 25594, -44066, 1547, 42494, -23672, -26521, 14167, 8022, -12751, -18016, 16985, 17069, -20591, 4199, 20367, -112, -5385, -12042, 12005, 13742, -32259, -9340, 23292, -2786, -13724, -2345, 17509, 8225, -15808, 11409, 10548, -14720, 5129, -792, -9420, 4632, -9913, -2754, 9806, -4491, 221, 4850, 8915, 2373, -13483, 14786, 8666, -28986, 3176]
218C176J1573k9237O964J0336N980p082r056J9418q929q573J5465j8124K113J4330
232H354j8974O558P211o835P187m502P221m49j5221K2013n980k4558K2027L53
246D405j2429M994l029J1877k451j0563J5656n831j743O452j6135J2426K173k0559
260a4757J5188J508p741Q070o118Q475J191j0822J4879q642p935J4621j2659P76
274c966N268j1218J3778k454p942J3048p075M725L047j5111J4109k784j2312J2488
288C601r664J772J0171j4139Q545M841n351O875j0939P897P032k3100J2591O984
302G116j6967P997q88L284M863j4792J4735M437j5725J0913l758k005M880j5882
316a1792J3452N169k0491J2662O475l799l63q480J8384k034k3504J9418J887j5325
$$ y = [3176, 14749, -14488, -7524, 2812, 8792, 1710, -7346, 12072, 3143, -5430, 10035, -8089, -5976, 8354, -10620, -4062, 3149, -3686, 3501, -1001, 6220, 5771, -9450, 12563, 6583, -17975, 4052, 4405, -8024, -3030, -6059, 5818, 3367, -7196, 8460, 2629, 886, 7338, -8797, 3629, 5802, -14757, 431, 1939, -5802, 2268, -3850, 4625, 5816, -5006, 9873, 1231, -6704, 7917, -4742, -3966, 1302, -9916, 3862, 1408, -6534, 6514, -561, 4164, 7211, -7900, 6209, 3425, -8887, 3601, -6063, -4291, 5880, -8259, 286, 5127, -224, 6651, -4288, 3609, 10641, -12459, 132, 7116, -9851, -1854, -2742, 542, 5405, -9387, 5348, 9785, -5940, 4973, 1215, -790, 4090, -11792, 1660, 6829, -13662, -1000, 5475, 1676, 1313, -7167, 11217, 9183, -14321, 5097, 6984, -8341]
330h341O159k553Q366k128j4305K0147O07j3028Q486l175O032l818j5524K0511
344G436l585j8305J5788J021k899n51l726J7501j0254j3059K1349p292r760N882
358d54m114R298p660q333J9856p258n723R878n753O483o130o914J7792j4126q072
373a1230J7115p759j469J882l27J0759j3007J532J5509j6720P80P135p485O029
387B744r105N81J3968j4103K959R568q236N489m183Q34Q199j7000N732J0361j5285
402g477M054L267l19M371j1032J0528P064j7542Q917L990q674M111o664N230L843
417C667j3851J1238M587r809N822j356M881k54j4030J3868J357j6060R401J452
431I13k565O68n246J3086k126j2824J3664k02p171K571m499P317l955j0037J5170
$$ y = [-8341, -2182, -4735, 3631, 1503, -12802, 7345, 7952, -5076, 3410, 235, 6267, 2449, -13075, 7436, 3851, -14454, 1334, 2355, -544, -1095, -4821, 12680, 2426, -10633, 10716, 3424, -6336, -454, -4568, 4730, -2930, -11263, 8593, 1335, -4388, 5490, -263, 6220, 90, -6824, 10968, -3158, -11230, 5885, -1874, -3343, -1461, -1788, 8971, -4036, -2504, 13005, -3715, -2935, 4200, -3285, 2744, -6361, -5780, 8188, -5915, -2956, 6612, -1624, 3865, -318, 516, 8715, -8285, -2553, 7808, -7477, -3423, -156, -475, 3896, -7136, 3392, 10456, -7086, 1831, 5821, -2853, 1258, -5406, -176, 3667, -10184, 1054, 5641, -4168, 1654, 298, 5179, 4925, -9105, 4763, 6120, -9940, -539, 913, -1652, -984, -6230, 6856, 4730, -8094, 5570, 5368, -1803, 768, -3731, 3586, -369, -10406, 4764]
446D764k836q653Q454k69L861m607p084J5600o343j1621J0950k029k156n60k243
461d772J1181o989n338J3673n786k986L299l967O200p230m659J3333q078m218
475f337Q914k470K754l612j064J0551j0155k524R176p540K46N41j792O871p487
490c928J412R474r207K681M393o071L764m671M98O063j0894L156P022o161K583
505A14q86K416M429j0567N930N445j2289L994K945l299J394n724P741M014j2201
520f544P604N470p066Q12j669M951j301j1602J0506L089j0250M699J329K937O7
535C032q939J0797K011j2809N825K386k464j686m991J0714p45j1621J0911K958
549E379n946P04j461P486m731j0590J3216j090j0141O477N62J904j582m366J0611
$$ y = [4764, 1928, -6725, 1729, 1460, 5321, 714, -6370, 9230, 2887, -8734, 2216, 187, -1969, -2529, -4772, 6409, -580, -5918, 7755, 1969, -1017, 2282, -1685, 4515, -2715, -7374, 5959, -2119, -6337, 2577, 107, 2861, -751, -1815, 8736, -1419, -3943, 5233, -2307, -2061, -1520, -3312, 3559, -3928, -2516, 6958, -2249, 432, 4825, -1246, 2518, -2153, -1655, 4408, -6486, -3330, 3692, -2469, 114, -772, 1644, 6073, -4494, 1436, 6881, -5408, -1414, 1531, -1768, -374, -6098, 1643, 5657, -6544, 1060, 6530, -536, 276, -1393, 3558, 2257, -9345, 1161, 4250, -6000, -1301, 28, 2965, 3032, -5907, 4890, 6901, -5908, -83, 2303, -161, -1847, -6838, 3876, 3131, -8490, 2421, 5379, -567, 137, -1324, 6162, 1431, -9159, 4057, 2967, -7174, -697, -135, 1769, 187, -4179, 6432]
564F432l709p148Q341l237j317J16m632Q574l875o012J0459l454j720M273m235
579a144N292l366n225R334n949l912O171k933K420k558p04R860r240j177J1201
594H070q834j999M007j472J882p681L830Q786j1895K889P982n837J738k469K090
609A087M691j1405L629N988p569K736j992K226P027j1863L567J0776r526k129
623b757K769L548j082j2518J0638P230j6247N620Q011m592j90l823P592K309j3517
638g009O676M505o667J549l272N165L058j0464P535M252o913L080k704L705J916
653D412j2255P864M977j0064L388J417J513J090o975Q301J220r520O636m17k857
668a270J945n615O212M35p316Q788k683l300Q373o140p26M656m153J220l037J890
$$ y = [6432, 2723, -4425, 3916, 679, -638, -522, -5154, 3420, -455, -6467, 3992, 538, -1182, 3091, -1144, 4148, 782, -4443, 4891, -1058, -4970, 1201, -1732, 688, -1870, -2574, 7286, -1954, -3131, 8070, -764, -2763, 1244, -228, 1654, -6027, -2197, 6589, -5306, -2417, 5565, -272, 1466, -1003, 1087, 5778, -5627, -1998, 3990, -3579, -843, -2835, -609, 6418, -5445, -1878, 8898, -628, -2757, 12, 3560, 2478, -10040, 598, 7828, -8419, -2799, 5212, 620, 430, -3393, 4199, 6508, -7009, -333, 4172, -2495, -946, -4218, 947, 4005, -6459, 1076, 5328, -1585, 1495, -1209, 2496, 4412, -7843, 21, 4998, -5066, -1678, -261, 1252, 2342, -4633, 3668, 4888, -4632, 2004, 1587, -1270, 675, -4940, 1272, 1707, -5609, 3179, 496, -2804, 5569, -571, -1297, 3359, -794, 426, -2611, -721]
684g21L972r635N735N827r109N133P88l008N388o149N99M439o155K581j235k43
700a793O089r039K267J0053q094j939L467K457o07j0319Q051O930j5587M128R559
715E623n911j280j114N708L193j0789L560N216m692k17l362N067L004j1744O737
730a001Q090q967l43K433L963l36j0856P120O406j1251Q87N199P78k952n306J0592
746D456K097j2757N815N292m374j570k760O288l52r275P995K883o711K929M33
761C89K292k31o268N811N92n550K557j070K156j94n938Q514J082q790N768K175
777C295k974l32j791M309l324m070Q216l634l760O354k064L05O32j979L940l903
793g80j031N096n468L35K324k790M325k480k137O301l450p34K748k913J914k812
$$ y = [-721, 3251, -6384, -649, 5178, -3931, 1202, 1990, -1018, 4370, -1779, -1180, 3259, -2896, -315, -1550, -1793, 4296, -4743, -2476, 7577, -517, -2456, 1011, 3468, 2861, -7458, 593, 7523, -8064, -3936, 5623, -288, -1568, -2682, 3026, 6219, -4570, -1010, 4206, -486, -703, -4065, 1002, 4006, -7738, -1001, 7089, -1878, -2221, 212, 4175, 3839, -7017, 103, 6509, -4742, -3855, 1344, 2122, -830, -6136, 4456, 6553, -6204, -389, 4903, 529, -1041, -3801, 2487, 2135, -7140, 855, 3738, -2973, -44, 389, 2681, 2450, -3818, 1993, 2585, -2965, -408, -1478, 678, 484, -5454, 3060, 4142, -4648, 1120, 3295, 321, -11, -1802, 2507, -817, -4887, 3329, -305, -4065, 2289, 225, 530, 1162, -817, 3123, -780, -1811, 3285, -2183, -1848, 476, -2314, 2011, -469, -2606, 3695, 245, -489, 2259, -654, 1260, -1552]
809a552k14N407o977j44O825l723k11N04Q75K996o392J845N459p087k4K872r43
826d84J571m480K510N509o884J457M501l554j34j386K534J284p690M411M004o034
842b865K443P20L04K136n483L839L357p550J919K329j332L8l763M890J798o977
858d197N592J993m834J853n23K468j355o444P211O50o990M698O35o28N55k655
874a971N465j457n820N753p12k356N37k513N327j880n284Q133j291m624M154l15
890A146J087k874k996P595l782m793N655r71q0q09q78O515n003l342P817l524
906G63k489J539j301L635m176j506P563m694j806M562j147J155l737J74O268o978
922b175j130N760l829P27l25J51M631n949Q21O075n522K03J107j243K348m892
$$ y = [-1552, -1766, 3641, -3336, -3480, 3345, -378, -589, -85, 790, 3786, -2606, -761, 4698, -2389, -2413, 459, -484, 1087, -3393, -883, 4626, -2258, -801, 3700, 146, 12, -1374, 1160, 2444, -5246, -835, 3169, -2865, -422, 298, 602, 2738, -2745, 1094, 4451, -3099, -1180, 1149, -183, -145, -3908, 982, 2780, -4197, 1395, 3388, -1446, 407, -116, 2352, 997, -5447, 1764, 2414, -4576, 122, 757, 129, 684, -1971, 3494, 2037, -3783, 1970, 1258, -1098, -561, -3074, 2253, 373, -4911, 3222, 1931, -2693, 1461, 1146, 2233, -641, -3637, 3958, 176, -4617, 1038, 67, -13, -822, -1700, 4815, -188, -3530, 4287, 763, -1726, -187, -1488, 2147, -2029, -3535, 4028, -666, -2472, 2090, 943, 2098, -1639, -1465, 4803, -2175, -3305, 2455, -1374, -647, -972, -821, 3810, -2139, -1318, 4757, -765, -562, 545, -698, 1650, -3242]
938c242K065M571o924K552L598k977J799k662J949L179p257K861K916n128K316
953c84n40P50J989n206M852K213o348L977N9j996J607l893L777O43o241N649J018
970A926l450K366j506L030m67n462O095j047m965L955j017M77p3l100O309j613
986A458m631N968j406j834P60j940M083l326l511O943k387k416L010j091K979
1001B659k605k353O532m191l100M685k070O3j231m83N482m628j111N993l360m92
1017b10P19q31L031n021m18N948m859m81K919j039K128l116Q36M716n873J75L831
1034B455l229L11j416J108L269n588K169M363m564J189Q52k95J402m684K229L248
1050B819n803J793J917j449J424k352K829K015n791L237K082m023J083r38J306
$$ y = [-3242, -1177, 3394, -3530, -978, 2620, -357, 1442, -1220, 729, 3908, -3349, -488, 2428, -2700, -384, -924, -174, 1815, -3391, 1461, 3674, -2674, 1303, 1362, -634, 973, -2920, 857, 1500, -4741, 908, 1926, -1524, 842, -664, 2366, 1899, -3563, 2532, 1485, -3480, 475, -542, -65, -138, -3238, 3071, 1458, -3173, 2795, 1389, -445, 315, -1625, 2458, -868, -4379, 2564, 177, -2239, 771, -320, 2659, 54, -2299, 4233, 42, -3058, 1627, -443, -380, -1611, -2094, 3388, -1240, -2351, 3642, 282, -210, 509, -322, 2709, -2312, -2730, 3218, -1641, -2122, 797, -242, 1886, -1230, -394, 4322, -1551, -1376, 2455, -774, -463, -1879, -771, 2498, -3090, -921, 3442, -1122, 67, 919, 624, 2026, -2658, -429, 2819, -2984, -1191, 726, -723, 701, -1651, 1178, 3193, -2598, 639, 2721, -1302, -219, -1157, 149]
1065A49Q09m507M081J737m544K927O25m23J97l086L617n5m966L676L11k125J535
1082d2j156K909m87l778N028k91l953K222n68N42r12k594M891j376l449M434k99
1099A121p94K03j504L682k404l290M776j735k186J831l91K161k011j466N457k651
1115G99k534L275j203J34j523r59M322l657j576N041j951l74N55m20K787l352
1131f36r85M401l739j018K281j020J359k211N48M336m166j06L487k603M34r33
1147e71r0K526m316P33L886l384O84J073j94J705l359J577K730n163J356J912
1163A105k235Q96j555J868K063m514K798K341l699J453l38J81O25m009L143J536
1179A659m455K672Q49p02R55k377L361K73n073L640P78l123R72j026K613m02l841
$$ y = [149, 958, -3549, 532, 2269, -2275, 652, 1277, 854, 1051, -2035, 1582, 1527, -3439, 237, 548, -1577, -42, -1198, 1711, 1224, -2554, 2474, 2183, -1770, 452, -116, 426, -486, -3080, 1811, 435, -3014, 1420, 1121, 327, 530, -974, 2708, 304, -2986, 1790, 55, -2131, -300, -691, 1470, -541, -2007, 3450, 799, -1735, 1540, 337, 471, -1052, -2011, 2311, -1346, -2922, 2119, 168, -206, 349, -71, 2716, -636, -1621, 2780, -959, -1977, 304, -716, 643, -1568, -1020, 3316, -850, -956, 2531, -72, 362, -571, -661, 1865, -2451, -1718, 2168, -1216, -532, 541, 347, 2052, -1307, 270, 3000, -2163, -807, 1105, -1130, -234, -1789, 79, 2142, -2372, 426, 2767, -932, 521, 183, 364, 989, -3020, 123, 1659, -2796, -124, 725, 23, 978, -1399, 1962, 2235, -2838, 802, 1580, -1543, -571, -1597, 1016, 614, -3227]
1196c227M991J81l680K833l75L43p87k981M594j180m183M086k71q09N95j327M025
1213B828k025l403N158j560k440J366j175K435j742k392N225j935j875L195j281
1228C79R29j425j505M413l538k030M201k125n1N65o77L417l291n97M730l651o54
1245i10J583j431J590k415M2L630l923J099K809k692J701j068k01K672m376Q46
1261a044K946l722J107N22j56J750l382K446K598m659J979R71j978J218k415J833
1277A4J276m598L590J718l369J864k65R84M03l895L392L96m085K523j11m0L16
1294A13k590M347J67m444L712Q9j698Q60j900K306p73l406M274l02k358J837l24
1311i0K070j506k611M799j939l177L376j165l35p9j134L762j750k230L998j272
$$ y = [-3227, 1764, 1945, -1735, 1098, 723, 1066, 279, -2702, 1892, 712, -3471, 615, 344, -465, 130, -1197, 2828, 803, -2600, 2558, 998, -1442, -76, -1251, 1184, -558, -2950, 2275, 340, -1535, 1660, 379, 1308, -117, -1622, 2791, -747, -2777, 1424, -701, -752, -187, -864, 2553, -738, -1335, 3395, -256, -910, 673, -758, 832, -1583, -1541, 2089, -1834, -735, 2074, -618, 1083, 15, -186, 2486, -1890, -1044, 1902, -1820, -713, -191, -347, 1403, -1979, 467, 3065, -1594, 385, 1356, -622, 596, -1819, 14, 1290, -3308, 282, 2000, -1369, 495, 230, 1214, 1617, -2278, 1114, 1510, -2575, -52, -163, -203, 113, -2477, 1870, 2037, -2407, 1305, 1394, -304, 556, -1344, 962, 189, -3217, 1057, 755, -1603, 234, -90, 1980, 474, -2137, 2662, 723, -2454, 922, -243, -578, -657, -1791, 1971, 221, -2009, 1989, 717]
1327G17o69N91j233K043k355j285L903k562p12K183j093J876j362j052L803k976
1343a83j121K854j995j40m52J88K440l128N35L302k966Q61J053j435J250k231
1359a168N85K503m088Q19K273j626J051q77Q59J810l370J601J596l037O73m5K67
1376a74P86l080K395K103l554J828J129j135M51j713K038J64m065K505J354k221
1392a189P52l32J865K37l146L185O18l389J487J79l15k76j868K953n4k792K887
1409H02K38q96M17j153K280q97l294L280j33k324J235j64J368o32j604L577r60
1426A140k422K259n71k31o30j271K967j741j754L728j188r75J483n48J412j721
1442f3j324L110j919j318J489o61J084j208j99L460k730p02L149j942l37P0p36
$$ y = [717, 48, 639, -594, 1449, -906, -2191, 1712, -850, -1562, 621, -472, 1404, 42, -1010, 2793, -183, -1304, 1550, -445, -585, -1037, -849, 1591, -1537, -1002, 2300, -666, 195, 1248, -187, 1063, -1168, -583, 1920, -2168, -1349, 924, -702, 349, -528, 331, 2141, -1229, 372, 1968, -1069, -396, -441, -174, 612, -2468, -73, 2030, -1524, 304, 1433, 298, 749, -964, 1074, 1238, -2827, -322, 1032, -1189, -437, -769, 1096, 1333, -1813, 1372, 1990, -1399, 88, 267, -48, -324, -2192, 761, 707, -2085, 802, 1040, 144, 561, -592, 1688, 791, -2503, 777, 644, -1680, -445, -609, 759, 127, -1477, 2100, 1140, -1282, 977, 406, 175, -455, -1726, 1241, -500, -2254, 1474, 286, -689, 794, 246, 1658, -63, -1387, 1723, -196, -1514, -25, -686, 398, -810, -1009, 2451, -279, -981, 2168, 226, -111, -41, -777]
1459g77J801k396j84K955k134l0J483j94Q25k195P93K588l875K59K066k058Q47
1476b26p33M57K297l039Q55K707k435J22J38J06O16k902J724J592l389J730J160
1493G80r83J180j845J579J569l854J530J339k390O50m58J072L79k550K925O90
1509A613k630J838m48J51K93k671K429K00l472K912L59j372R33o12J962n12k488
1526a515K965p94j679J145j130J363o59j939L882j054k232L083p90k49%j368K391
1543A420j678j837L037j358m63Q44m78K144j924q17L682k570r83J839j370P08
1559A96j120n04K990k364l97K749j329K56m58o6J950l226K94K646k933L52J020
1576E6n44J526j989Q43K535l155N10J384j474N04j513J001J522l335J651J907
$$ y = [-777, 1024, -1372, -1556, 1399, -735, -765, 718, 524, 1349, -846, -53, 2535, -1340, -1081, 985, -1073, -226, -959, -502, 1795, -1244, -389, 2318, -117, 5, 143, 249, 865, -2037, -313, 1279, -2110, -380, 780, -203, 977, -868, 711, 2280, -1574, -44, 1295, -1095, -445, -903, 169, 548, -2002, 923, 1613, -1017, 821, 373, 524, 817, -1854, 575, 775, -2697, 215, 574, -798, 135, -477, 1485, 973, -1515, 1450, 656, -1023, 122, -1008, 355, -304, -2243, 1639, 585, -1647, 1436, 646, 397, 397, -971, 1420, -258, -2095, 942, -416, -879, -35, -513, 1631, -293, -1110, 2572, 2, -981, 858, -512, 196, -924, -1428, 1562, -802, -1199, 1550, 221, 477, 19, -47, 1903, -1323, -1029, 1617, -1316, -964, 56, -488, 1038, -951, -108, 2427, -728, -218, 1166, -308, 196, -1317, -316, 1206, -2129, -478, 1429]
1592A429k085J060k58M25R14k935J728J166l225J261N66m77O21j597K206Q56l044
1609a389K209L18j454P08j280J280R9k849K778L51k057J611j06O72j55j859K645
1626A522q48k427K213n31n59L02r77K441p03j884K941o24j149Q11p20J004j306
1643d94j319K933j423j200J975m23N39m53n99K382j942j225K402j275p21K40k43
1660h46J788j754k49K781j681l02J102n66N39j540p5K103k399k00K036j108L59
1677a2j83M18J531k434L91J946k072j58L10l7P25j856J049J857k288O51J268q27
1695B79K36j061P86Q62k747J048J331j627N32J05P31N07k019J698J012k417O32
1712a12L91m91R9j356J639N45k182J742Q04j150M55n04R73j21k278J832K89j925
$$ y = [1429, -656, 404, 146, 571, 1485, -1450, 278, 1444, -1781, -520, 46, -431, 190, -1407, 799, 1655, -1389, 820, 1138, -316, 392, -888, 392, 491, -2358, 420, 771, -1286, 325, 219, 891, 736, -1123, 1522, 674, -1753, 460, -71, -630, -328, -1305, 1136, 433, -1451, 1490, 866, -283, 528, -192, 812, -494, -1813, 1120, -303, -1503, 472, 49, 588, 135, -464, 1918, -24, -1249, 1153, -122, -843, -603, -846, 942, -812, -1061, 1720, 39, -263, 839, 273, 812, -728, -803, 1300, -1099, -1299, 737, -371, -12, -195, 223, 1754, -680, -289, 1657, -415, -573, -263, -300, 425, -1431, -382, 1475, -813, -162, 1106, 279, 515, -546, 240, 1102, -1645, -597, 734, -893, -361, -256, 475, 982, -1037, 661, 1673, -744, -112, 279, -212, -113, -1469, 170, 715, -1467, 275, 1079, -71, 384, -120, 853, 732, -1546, 286, 575, -1350]
1730a350J026J50M26k9j245K246p7k170J649n5p53k3p93J544o76j607K451r6j235
1749f17J058k59Q72q08j349K261j069j591J624l56J06k45m11K257j185j192K196
1766A292q44o96K28m37J134j527o08K566j402n92J463k78O06j053k15J957k026
1783d32n69J614j035k2j65J53J696j855J18K117j666q6N54m04N83j766M87J766
1801A088k255M00J427p86O46q69O41J219k437P39J211j772L77k31L98P46j905
1818a363J547J169k093J003M50o09L53j574J385M44k398J493O31j000P96o16J099
1835G17K35k049J915P9j818Q25l57N17j14j449K260j06j789J969j82m70J21q95
1853e91J572q80j804K266n66q97R36m56J332p74j008K406j059j327J370p82K85
$$ y = [-1350, -324, -174, 252, 223, -1022, 1224, 1147, -1023, 626, 571, -182, -205, -998, 546, -130, -1737, 714, 618, -617, 441, 182, 1054, 246, -1103, 1158, 89, -1502, 122, -234, -128, -373, -784, 1473, 288, -904, 1292, 448, -248, -20, -457, 677, -850, -1458, 1108, -294, -886, 577, 299, 905, -148, -363, 1594, -432, -1001, 613, -422, -444, -609, -456, 1240, -615, -497, 1620, -46, -132, 422, 18, 601, -1165, -678, 1088, -1167, -767, 660, -126, 520, -349, 292, 1511, -926, -187, 1024, -748, -371, -602, -204, 542, -1363, 184, 1353, -740, 263, 713, 104, 457, -1117, 268, 712, -1686, -193, 438, -562, 234, -382, 717, 952, -1097, 818, 897, -921, -96, -453, 64, -50, -1499, 761, 655, -1134, 835, 653, 183, 304, -591, 981, 101, -1703, 563, -3, -900, 36, -420, 912, 138, -870, 1536, 477, -850, 520, -262, 23]
1870B3n62o00K152j422p10K213q29j68J17l35J359j729m78K034j645k53R00m03
1888c36R30j140K00K049j882k14J312r63J78q36K65J335k121O12J710j507N15
1905A07P7P3Q71j846O19J162k080M20P76n32M18r38J110R33k010J137P30j215
1923a88L99o70N08L55j997J558P54j638R92J81J01K25j180J371l5j875J209J55
1941B25o81J89o30J525j50j613J994j7j266P86k82L68n28j146J736l10j305J256
1959A51j0J32j32m76J555j024j099J725o62q31M08l54J144p58p30J919o69p52
1977d63R75j64J00q36k57J508j328o47J474n73J52M2l4J127j310k28J623j185
1995b4o36N73p6M08j118L70J407j352J23J112m56M3o89K60R90j724M8J286j045
$$ y = [23, -539, -1139, 1013, -409, -1119, 1094, 265, 97, 214, -121, 1238, -491, -969, 1065, -580, -833, 67, -336, 594, -546, -346, 1703, -179, -393, 919, -44, 134, -702, -437, 898, -1223, -611, 1099, -408, 107, 184, 257, 1128, -718, -99, 1063, -1017, -597, 179, -353, 65, -873, 237, 1170, -840, 297, 1027, -188, 211, -459, 49, 404, -1593, -35, 719, -919, 73, 254, 355, 580, -600, 771, 736, -1139, 70, 225, -456, -267, -897, 628, 478, -1135, 859, 842, -424, 362, 80, 448, -80, -1226, 510, 200, -1105, 151, 141, 273, 141, -335, 1220, 196, -903, 822, 160, -671, -263, -617, 527, -231, -961, 958, 289, -463, 512, 348, 448, -388, -645, 863, -465, -1112, 362, -211, -59, -17, -51, 1076, -234, -462, 1161, -24, -660, -87, -163, 245, -873, -503, 904, -448, -325, 787, 331, 374, -315, -55, 935, -789, -741, 545, -500]
2014e00J03M32J12M48j171P47J141j625o2O27l00R8r91P80P21j524R22R91j020
2033g1J25l3M01J93j528Q63N45j420O26K99j2J56q44J351L82j772R19M30o58J5
2053c3n97Q11o0j297J411L27j001O28O4L53k76j022J350k93j350J063k4k66k5
2072b37l48J464m78j198J516k36p03K98m29P01o75p39J715n67r25J149r3K22l00
2091A37n30J339j030p03J316o40l43N9J0J252j174l77J776r25l41O05n53M51p90
2110d61q5J320j376j15J167m13K12l73J94R77j483J39J211j411J63J16N7P41j396
2129h16M98J371j334K31N89m58K02q43O37N42j746Q81O82q67N14k07M51M47j511
2148g37J124N37j677M64K35O7O9j132J231M47j326J052M7l35K28p18R90j96j645
$$ y = [-500, -397, 35, 147, 595, -576, 171, 1312, -313, -375, 252, -48, 50, -941, -161, 560, -964, -42, 949, -71, 54, 21, 422, 615, -913, -50, 495, -925, -299, 0, -12, 144, -700, 651, 1033, -739, 180, 610, -48, -33, -630, 181, 121, -1176, 235, 562, -439, 189, 253, 606, 330, -692, 658, 365, -985, 78, 54, -212, -237, -585, 879, 401, -797, 719, 483, -220, 78, -351, 350, -325, -1064, 651, 84, -841, 308, 215, 437, 137, -393, 946, -84, -787, 529, -111, -454, -395, -385, 867, -307, -684, 1092, 167, -174, 431, -122, 329, -461, -546, 774, -602, -717, 450, 37, 249, -124, 70, 1047, -436, -297, 914, -497, -334, -218, -161, 580, -816, -318, 1053, -281, -50, 539, 81, 283, -560, 77, 619, -1127, -246, 436, -431, 83, -124, 327, 774, -737, 387, 924, -753, -289, -54, 13, 82, -1050, 181, 628, -698, 354, 401, 66, 294, -424, 566, 370, -1275]
2167a275J498Q2j002O98j91O08j34q38J397l58j187R57k04M0l64o78J548n85r25
2186i13J632m18m59M96l19O64p27p64J511q25n84P54j79N22o31j44J525j220l47
2205d26J140p22J3l51j12J020j131j19J432q49j20M78p3N28j191K11J149j478
2223f01J04O83m40L71n78L87J022j408L16J024r39K9j38J09M65j268O95Q05j216
2242e78M53M06p7K09q60P76L97j501O83M55p21J61k42O11K25j118J064L92r52
2261b17L81j43J93j79q40J070mj130R10K07j86Q7m67J039k59j151J001Pq21J97
2281c05j04O25l28o39J354j76q31P02o6L2l45m19J057o67p61J190j97l30K26r4
2301g6P30o11m73J173o30o03M52j67L28n80j5J191q04l35R79l53r5j40j15P24
$$ y = [-1275, 223, 305, -697, 1, -190, 418, 284, -554, 843, 485, -702, 255, 51, 91, -273, -951, 597, 12, -913, 719, 301, -158, 338, 19, 683, -44, -808, 703, -122, -706, 48, -131, 391, -240, -384, 1141, -79, -426, 714, -8, 5, -346, -458, 562, -569, -688, 744, -105, -225, 253, 180, 708, -483, -272, 877, -601, -497, 186, -254, 117, -461, -74, 948, -460, -144, 880, -59, -30, -168, -59, 406, -862, -167, 638, -578, -125, 281, 204, 413, -447, 329, 726, -775, -92, 363, -358, -197, -439, 172, 397, -721, 343, 735, -217, 164, 21, 214, 35, -805, 265, 261, -869, 41, 248, 62, 149, -318, 721, 462, -689, 312, 319, -502, -305, -409, 216, -112, -751, 603, 427, -404, 298, 232, 264, -81, -500, 557, -110, -871, 319, 122, -208, 18, -76, 654, 43, -430, 743, 113, -490, -38, -205, 123, -457, -472, 719, -85, -420, 559, 206, 111, -29, -144, 580]
2321E80j028k32J178p21j76M05R8L85p73J29J009j050j22N91m04P0m10K54P73
2340E56j099K41R71p13J28j7J30K86j042L01P66j029J69N06j10J57o06O23O10
2359H28j310M80N13o42K9k87M13K47j053Q27N03q74M35O8J28Mr07Q92J61j279
2379h24O99K14l34J83l75Q99J4j114J025P8p29K57k04M41k62q62J308j52q95Q27
2399A94k8J00q5n92J000m66q49J049l01l85K55k38Q15n47m98J264n03n21O44l40
2419c2K38m37l74J169q27l97R83k37qp5j41Q37r70k02J087p93j63K42q8N13p66
2440d41K05J091j030qO37m10J75o11J99P96j234K36R35p73L06j28J88N17j161
2459e11M49P83j136K10K23j23K73p95O98N54j188P28L07n40K75n20N18J57j229
$$ y = [580, -448, -680, 498, -223, -399, 6, 104, 489, -284, -155, 854, -196, -318, 273, -131, -61, -471, -217, 556, -543, -302, 669, -44, 84, 67, 197, 483, -559, -258, 508, -521, -352, 154, 44, 201, -405, 218, 828, -482, -2, 511, -131, -102, -389, 24, 271, -782, 45, 548, -326, 109, 177, 305, 309, -598, 294, 455, -824, -125, 89, -245, -62, -437, 462, 476, -638, 387, 465, -264, -7, -211, 230, -32, -894, 414, 262, -633, 194, 166, 266, 181, -411, 589, 123, -726, 323, 22, -363, -108, -346, 469, -78, -576, 688, 185, -336, 308, -32, 206, -231, -605, 564, -263, -660, 323, 86, 78, 3, -138, 699, -271, -473, 614, -179, -342, -100, -188, 325, -441, -236, 855, -175, -183, 454, 44, 219, -392, -193, 603, -631, -395, 540, -233, 73, -55, 133, 650, -511, -62, 721, -415, -205, 18, -105, 168, -627, 71, 625, -563, 165, 472, -68, 207, -313, 205, 362, -867]
2478h67Q91L36q17M66m3K12J34q21J024k3j119P43o2k22P4m95R38r3r46J080n4
2499C36m93L72l51N12l84p36J182l65n90O70k30K76k18l65J106n66o57R87m58
2518B8j26j26k02P37n82l25J182n31k90M96j85M08o92r1Q65q62j52O61l26J11
2538bk59J81Q17j021O0Q03o25p6m0M7L55p74K16Q83r08J76M55j53J57o02L45M72
2560E07j042L15N28n26L1n7L44L14r00N89N00q69K94kL3Q6o80N16L49q55N65K68
2582C08j63L2l00N11J8r69P07J20o55K67o8L09m1n71Q50J03q69O32q2r3r3l83
2604d30P38k32p46P68P5l48K45j60N49k72n83Q15k56n38L39k8M7j35k61R03l59
2625A31n60P46j58j21k2j20N41o75l72R20l42k67L47j4L64n25m9Q37o66l55N56
$$ y = [-867, 24, 360, -457, 9, -34, 178, 312, -509, 515, 492, -627, 116, 54, -168, -94, -589, 349, 256, -690, 390, 336, -157, 215, -136, 376, -8, -744, 438, 73, -517, 153, -77, 199, -19, -384, 722, 156, -501, 486, 28, -98, -224, -426, 311, -271, -596, 586, 55, -235, 261, 76, 484, -208, -299, 566, -296, -448, 213, -113, -2, -261, -80, 737, -284, -224, 579, -46, -122, -162, -115, 240, -534, -318, 565, -343, -167, 288, 135, 292, -310, 35, 507, -535, -220, 308, -218, -187, -244, 100, 414, -486, 103, 603, -266, 28, 26, 59, 145, -535, -19, 330, -525, 40, 308, 145, 177, -123, 388, 406, -563, 144, 264, -391, -124, -192, 117, 76, -495, 355, 458, -411, 221, 139, 46, -47, -430, 308, 76, -670, 98, 173, -175, 70, -90, 459, 187, -396, 419, 163, -375, -36, -64, -17, -152, -413, 490, 131, -429, 317, 159, 38, 16, -104, 437, -238, -610, 310, -32, -299, 48, 34, 398, -127, -176, 661, -5, -360, 196]
2646A96k91J9j80k3O85n74j20Q15m85p8Q1j7K94o36l5P31p28j5M84j33K15m27
2668b22K65O02r22J19N94n94p2k2J70L76q87N27O23p09K03M2J08O9o82M41L16
2689C45r28M45L50l55J11j45N04J10q67N42L40o40R4j02J70Q6p46Q45J65q04O43
2710A63O3j76J91n07O17j03q83P52k4m44K66j27M96j52n66R81l37n64N21k21J95
2731A41l09l82Q90l39m99P81j10j07Lj60O51n87m33Q43n16j52K57k30N49m96l9
2752b44R00o29k74O79l34m5l12kO77p10j85P97m41J62Q5r6M80q08J35P13r15Q7
2774b80K89k37L37n32L93O01q73K75M59l91Q3l92K93K69r49N01M32o84M38L1P3
2795A36J65n94N19L44j002M43J61l34J09l50N92R3q69Q86J27m90J61j90L18j09
$$ y = [196, -95, -76, -256, -279, 406, -168, -288, 527, 42, -36, 45, 28, 322, -314, -349, 382, -346, -361, 123, -10, 205, -222, 43, 645, -277, -158, 436, -158, -230, -252, -82, 294, -593, -66, 557, -152, 51, 93, 201, 270, -412, 29, 345, -583, -138, 212, -143, -32, -177, 327, 437, -430, 112, 452, -188, -94, -196, -26, 60, -686, 159, 324, -480, 163, 226, 50, 241, -266, 351, 248, -635, 117, 93, -351, -85, -212, 284, 132, -434, 547, 210, -354, 167, -54, 141, -168, -550, 340, 1, -498, 283, 173, 66, 69, -91, 560, -27, -460, 383, -133, -285, -28, -258, 291, -205, -244, 656, 27, -247, 432, 98, 53, -259, -261, 416, -294, -479, 318, -123, 39, 124, 28, 508, -300, -165, 548, -367, -280, 9, -228, 109, -423, -30, 571, -302, -27, 432, 41, 124, -268, 25, 294, -655, -154, 278, -406, 32, 63, 136, 301, -293, 226, 570, -432, 11, 172, -162, -53, -403, 189, 282, -587, 299, 426, -64, 97, -93, 225, 116]
2815A16o93P11l8n66N42J1O6p7l48P78k39o95O49j19k19Nk02O11l93m49R74k64
2837A61l60L75j54K90m13l10Q03m67m02N93j44j6m1M4O34o84j32P25l98k02K8
2858g0q5L35n25J0P92n80m3M74j83J94m46M4M98p39M4M75m01L4L9K10L04p03K93
2881b9O07p08R6J63k08J48m82K86M07o61K78L69k40N1j59K58J92p31L88K28o33
2902c80K02M9J54R7n43N42L37o73K94J49j82j62j81M01l0n92N19K50k99J75j61
2923c4L70j23n96O33p7o50M16O4n2m3k12O44j37m52N50n0k53j3j53L96l23m21
2945e16O54r3l88L79P7P9k11k01O50l58m02M38j69j03q6j3O19n09j30P32l01j35
2967A3J12j52K29m88L0N37m46j84M83p6Q9k15J32M51o29j0M66m36m0ql5M09n73
$$ y = [116, -577, 134, 96, -470, 72, 83, 149, 72, -276, 502, 263, -432, 217, 98, -121, -116, -318, 293, -100, -549, 425, 161, -199, 176, 22, 312, -101, -411, 392, -75, -477, 116, -28, -44, -85, -41, 593, -91, -223, 502, 104, -98, -70, -155, 180, -345, -335, 457, -123, -166, 308, 125, 319, -127, -83, 415, -324, -280, 195, -206, -172, -133, 77, 381, -322, -29, 578, -130, -34, 129, -79, 69, -413, -127, 280, -381, -103, 266, 26, 77, -82, 176, 368, -363, 25, 253, -380, -178, -129, 25, 122, -421, 121, 458, -215, 79, 228, 46, -116, -297, 104, 74, -518, 1, 251, -48, 127, -34, 336, 213, -383, 250, 173, -477, -61, 3, -49, -92, -304, 340, 203, -249, 301, 251, -2, -15, -168, 228, -95, -516, 138, 45, -343, 36, 113, 192, -19, -220, 430, 72, -330, 108, -61, -164, -250, -263, 356, -153, -283, 449, 148, 13, 125, -27, 202, -286, -256, 281, -165, -349, 134, 58, 147, -68, 64, 515, -114, -124, 342, -94, -134, -142, -177, 232, -341]
2990c41K05N38m53M0J95q5O8l85J31M01o68O9M47l28J82p7K01L07p24K81L79o08
3012b25J37K7j5J03m29L96K70n85M48J15j38K0k84M04j8p31M73J77m26J99m2L29
3034B05m6m56N80J6n56L18r6qo1l49N85o6m91O34p6q2P3j58L72l41m10O06j96
3057cl99K93n6K48j90j36P18l60l05N08k33q6q9j53M76m53k25P24l15k0J51k4
3079G1K67m76m8O17n75p7K51j31J73l19J48N59n79L3M87m40N6j36J17K47o75J93
3101b37M59m78J46J33n9L38n18L01K88o50K46J37k94J22k45M15J80o30M09K37
3121C00m01J69q5J43L0o14N04N2m71K88J09P2lk68M14N7n81M31m1k22K4j49L47
3144A05j07l74O13m3k85J87M6Q5k00l30N09j99l64M22l0m7l5l3N10k98l02N17
$$ y = [-341, -136, 402, -51, -11, 184, 99, 167, -218, -87, 314, -354, -285, 162, -166, 16, -61, 140, 447, -277, 4, 383, -225, -88, -61, -76, 27, -402, -6, 264, -321, 127, 242, 104, 124, -160, 244, 226, -505, -32, 145, -281, -82, -124, 205, 159, -297, 283, 299, -257, 61, -35, -43, -104, -453, 132, 66, -425, 209, 133, 51, 124, -34, 338, -3, -413, 193, -3, -402, -109, -165, 83, -107, -243, 475, 115, -190, 318, 85, -1, -90, -243, 233, -220, -445, 279, -36, -56, 95, 71, 338, -138, -186, 431, -144, -221, 30, -101, 72, -247, -99, 460, -119, -86, 401, -39, 17, -119, -2, 245, -430, -237, 222, -256, -110, 23, -36, 302, -216, 85, 373, -277, -31, 106, -188, -66, -311, 104, 284, -346, 63, 300, -101, 68, -17, 126, 156, -458, 46, 98, -373, -85, 24, 96, 93, -175, 239, 296, -285, 146, 105, -117, -93, -242, 105, -2, -376, 237, 194, -91, 96, 142, 227, 27, -303, 206, 7, -357, 65, 35, -12, -47, -80, 430, 132, -170, 347]
3166C47j85l00N8m3K09l36j13O17k93j31L76m3K6k85M9L90n04j17L99k20k0RJ47
3189C7K12m17J16M67l93r8J66q9M6l06J62L34m27O3L96j87L0j34J21J89n02J34
3211h0K05k78q6J62O3J03l28L56K32l89L3J45j42j1k40K48R4m36K19K96k40O2
3233a2K7K11Jl85K33Q7l74R7R7k1o8j58M16R5l85K55J80k91q3PK01n7m17M25L3
3258A14k97J98N6P5j8k78M20j27l35K07l0j11o1N3K87j42k16M24pk62J23l2Q4
3281A25j98k08M79k70k41L42K0ok3o7M41l90j81M14k83j09M7q6L25k79m1M73k68
3304A6l5K36j60O0k66kL34l43j06L09p9j9j4J28K79m55J09M11m52p5J44j03J80
3327I7m27K11M01m46R8L20j51lj93J80J33n80K41K29l47J95rR7M7l29M02J17m00
$$ y = [347, 162, -138, -80, -123, 86, -250, -363, 254, -39, -170, 206, 163, 189, -96, -47, 343, -161, -278, 121, -99, -119, -110, 37, 249, -168, -52, 415, 22, -76, 90, 1, 47, -259, -97, 237, -190, -127, 269, 82, 112, -22, 99, 288, -214, -80, 125, -153, -239, -77, -14, 89, -239, 117, 349, -40, -7, 138, -4, -15, -255, -7, 87, -349, -130, 166, -74, -12, 15, 226, 227, -158, 75, 162, -212, -115, -18, -39, -107, -265, 151, 246, -139, 116, 296, 5, -78, -71, 130, 73, -344, 81, 114, -183, 15, 71, 146, 128, -150, 270, 143, -192, 15, -15, -126, -187, -134, 153, 11, -205, 219, 212, -50, 73, 41, 125, -73, -281, 198, -72, -313, 29, 49, 43, 20, -47, 394, 4, -177, 237, -46, -155, -108, -194, 131, -148, -189, 284, 16, -19, 217, 57, 117, -149, -151, 183, -160, -266, 43, -36, -55, -69, 59, 338, -117, -8, 403, -49, -124, 20, -83, 97, -330, -119, 282, -164, -66, 254, 103, 100, -93, 87, 220, -360, -119, 110, -237, -42, -51, 46, 93, -236, 166, 283, -117]
3350a17R7P2q2q8k24L54Q3m13L52J32k45K61k25K72n5m60M26l8l82J96K4J12k1
3373C1k10N14j29l61L61r4m8j06j80L42j39l81N49n0k46J52K1K78l39j62M44k80
3395c3k03K26j12J22j57J8N20l94j03L72j84r9K9k9J28l53%M14k77m8K03L1J26
3418A97k61MM11m46l1K52k10M4j51N0L67m08J02L14k22O2j4N5O2m64L01J35m49
3441c00K77J4P7J3j97K95J26m22J48J27k44k2p2J96P1m36M30J08l74K59L9lj2
3464I8l60L74j5m39L04M0n3K8q3L24rl78L39K9k87O9j5N8j42j69M57j08k34L03
3488A31N3n2j00o8K61k32k29K99m1j29M8j0K67k27k6L56k10k65K47j9j5j98n3
3511b12L67k98o2L15n3j8m0J3K27l42NK38k79n9J09N4Q2j50J42K91l64k1J83m4
$$ y = [-117, -20, 52, -30, -118, -342, 12, 95, -318, 34, 166, -79, 182, -43, 229, 174, -286, 140, 102, -280, -84, -60, 52, 31, -179, 335, 206, -155, 206, 112, 64, -42, -222, 120, -19, -400, 149, 99, -147, 5, 26, 304, -35, -197, 247, -33, -236, -10, -122, 0, -157, -139, 381, -13, -116, 256, 72, -27, 2, -27, 101, -252, -252, 162, -115, -163, 40, 71, 197, -64, -60, 351, -95, -126, 126, -84, -40, -191, -141, 226, -182, -80, 234, 12, 74, 60, 115, 177, -287, 14, 149, -300, -23, -9, 68, 81, -116, 179, 305, -117, 31, 158, -86, -108, -180, 16, 87, -349, 81, 189, -185, 74, 113, 110, 98, -262, 112, 97, -342, -38, 2, -51, -23, -106, 218, 209, -169, 170, 199, -88, -19, -34, 24, -118, -287, 170, 62, -172, 131, 184, 132, 32, -36, 225, -7, -236, 63, 22, -107, -59, -69, 198, -29, -55, 301, 91, -174, 73, 54, 39, -159, -212, 155, -143, -205, 110, 57, 39, -1, 12, 239, -103, -98, 140, -139, -198, -89, -35, 47, -103, 39, 330, -34, -55, 128, 84]
3535H4j03r6O3K12l12k2L31k38lR2J69J9k42O8L13m80L9R4k1L6j40J80Q4k91J96
3560C2K47k61m2k5J01n0k46J50J80k29J26N2J0M1k54K98L3l97K63M5j77j4n9J98
3584B2O1k95L39R6k85K01n3M3j58j34L04j03l12L23Pn2L2j13L37j90k74L34j5
3607A15k86J53j13J87q7j99M06j41j83L11l2l4j34j33L41k65j44L77j68r7J10
3628a6o1K18j47r3L47l64o1K32j69J43l02J01M14l08j08M11k03N0j12l2K78m80
3650b62P4L07k68O9O1K0Q9k16J91K61m38J03M1l0J7k34J90J72l87K17J65j40Q8
3673I0j03J25P8m01K43R9k77J62p7N5L8j99L20J19m15K17J3n2Oj69K19o3l57L37
3697HQ1k22J64n8J95p0k50K68p4k39J90m5K0l4p0L25j45j61L18q9j48P1j29J87
$$ y = [84, -19, -115, -52, 160, -152, -174, 157, -81, -84, 8, 177, 196, -46, 22, 335, -145, -106, -12, -33, 3, -137, 43, 127, -164, 32, 279, 18, -24, -49, 52, 2, -244, -94, 86, -143, -17, 35, 45, 86, -168, 130, 163, -234, 29, 74, -103, -117, -176, 22, 83, -212, 127, 223, -62, 139, 86, 129, -29, -163, 141, 38, -274, 49, 56, 4, 36, -77, 260, 70, -204, 130, 115, -171, -18, -131, 56, -31, -230, 176, 35, -148, 163, 131, 97, -37, -170, 171, -94, -238, 139, -29, -126, -16, -77, 141, -6, -99, 248, -116, -177, 55, -114, 29, -273, -172, 242, -66, -174, 237, 34, 84, -28, -60, 218, -262, -188, 119, -149, -80, -19, 1, 90, -126, 65, 326, -112, -9, 32, 2, 19, -215, -25, 147, -240, -23, 142, 2, 90, -13, 112, 190, -211, 32, 131, -146, 16, -61, -6, 32, -167, 153, 272, -143, 74, 87, 35, 41, -128, 91, 28, -329, 8, 89, -133, 31, -27, 168, 98, -152, 116, 42, -197, -7, -52, -32, -66, -136, 189, 44, -117, 201, 112, -36, 35, -94, 93]
$$ [...]
8191B2
##END NTUPLES=NMR FID
##END=
