##TITLE=1H_Pr U-11
 CDCl3
 8 sc, 
 25.7.2024
##JCAMPDX= 6.0         $$ Bruker NMR JCAMP-DX V2.0
##DATA TYPE= NMR FID
##DATA CLASS= NTUPLES
##ORIGIN= UXNMR, Bruker Analytische Messtechnik GmbH
##OWNER= root
$$ XWIN-NMR		Version 3.5
$$ Thu Jul 25 14:14:29 2024 Russian Standard Time (UT+4h)  she@DPX200
##.OBSERVE FREQUENCY= 200.1315
##.OBSERVE NUCLEUS= ^1H
##.DELAY= (6, 6)
##.ACQUISITION MODE= SIMULTANEOUS
##.ACQUISITION SCHEME= undefined
##.AVERAGES= 8
##.DIGITISER RES= 18
##SPECTROMETER/DATA SYSTEM= spect
##.PULSE SEQUENCE= zg30
##.SOLVENT NAME= D2O
##.SHIFT REFERENCE= (INTERNAL, D2O, 0, 15.7039)
##AUDIT TRAIL= $$ (NUMBER, WHEN, WHO, WHERE, WHAT)
$$ ##TITLE= Audit trail, XWIN-NMR		Version 3.5
$$ ##JCAMPDX= 5.01
$$ ##ORIGIN= Bruker BioSpin GmbH
$$ ##OWNER= she
$$ F:/spectra/data/she/nmr/H-F/1/audita.txt
$$ ##AUDIT TRAIL=  $$ (NUMBER, WHEN, WHO, WHERE, WHAT)
(   1,<2024-07-25 14:13:16.51 +0400>,<she>,<DPX200>,
      <created by zg, POWCHK disabled, PULCHK disabled
       configuration hash MD5:
       00 E9 B6 7A A2 85 ED C7 34 08 36 98 17 FE 4E 26
       data hash MD5: 16K
       C1 6A 84 72 7A D3 DF E0 6D EC 68 DC 7C A0 4C C3>)
$$ ##END=
$$ 
$$ hash MD5
$$ 4C F6 E1 AC 58 65 D2 B1 BC 82 E4 16 D5 B2 DB 3B
##$RELAX= 
##$RELAX= 
##$RELAX= 
##$RELAX= 
##$RELAX= 
##$RELAX= 
$$ Bruker specific parameters
$$ --------------------------
##$DU= <F:/spectra>
##$EXPNO= 1
##$NAME= <H-F>
##$PROCNO= 1
##$TYPE= <nmr>
##$USER= <she>
##$AMP= (0..31)
100 100 100 100 100 100 100 100 100 100 100 100 100 100 100 100 100 100 
100 100 100 100 100 100 100 100 100 100 100 100 100 100 
##$AQSEQ= 0
##$AQ_mod= 1
##$AUNM= <au_zg>
##$AUTOPOS= <>
##$BF1= 200.13
##$BF2= 200.13
##$BF3= 200.13
##$BF4= 200.13
##$BF5= 200.13
##$BF6= 200.13
##$BF7= 200.13
##$BF8= 200.13
##$BYTORDA= 1
##$CFDGTYP= 0
##$CFRGTYP= 5
##$CHEMSTR= <none>
##$CNST= (0..31)
1 1 145 1 1 1 1 1 1 1 1 1 1 1 1 1 1 1 1 1 1 1 1 1 1 1 1 1 1 1 1 1 
##$CPDPRG= <>
##$CPDPRG1= <>
##$CPDPRG2= <>
##$CPDPRG3= <>
##$CPDPRG4= <mlev>
##$CPDPRG5= <mlev>
##$CPDPRG6= <mlev>
##$CPDPRG7= <mlev>
##$CPDPRG8= <mlev>
##$CPDPRGB= <>
##$CPDPRGT= <>
##$D= (0..31)
0 1.2 0 0 0 0 0 0 0 0.06 0 0.03 0 0 0 0 0.0002 0 0 0 0 0 0 0 0 0 0 0 0 
0 0 0 
##$DATE= 1721902396
##$DBL= (0..7)
120 120 120 120 120 120 120 120 
##$DBP= (0..7)
150 150 150 150 150 150 150 150 
##$DBP07= 0
##$DBPNAM0= <>
##$DBPNAM1= <>
##$DBPNAM2= <>
##$DBPNAM3= <>
##$DBPNAM4= <>
##$DBPNAM5= <>
##$DBPNAM6= <>
##$DBPNAM7= <>
##$DBPOAL= (0..7)
0.5 0.5 0.5 0.5 0.5 0.5 0.5 0.5 
##$DBPOFFS= (0..7)
0 0 0 0 0 0 0 0 
##$DE= 6
##$DECBNUC= <off>
##$DECIM= 24
##$DECNUC= <off>
##$DECSTAT= 4
##$DIGMOD= 1
##$DIGTYP= 9
##$DL= (0..7)
0 120 120 120 120 120 120 120 
##$DP= (0..7)
150 150 150 150 150 150 150 150 
##$DP07= 0
##$DPNAME0= <>
##$DPNAME1= <>
##$DPNAME2= <>
##$DPNAME3= <>
##$DPNAME4= <>
##$DPNAME5= <>
##$DPNAME6= <>
##$DPNAME7= <>
##$DPOAL= (0..7)
0.5 0.5 0.5 0.5 0.5 0.5 0.5 0.5 
##$DPOFFS= (0..7)
0 0 0 0 0 0 0 0 
##$DQDMODE= 0
##$DR= 18
##$DS= 0
##$DSLIST= <SSSSSSSSSSSSSSS>
##$DSPFIRM= 0
$$ [...]
##$SUBNAM2= <"">
##$SUBNAM3= <"">
##$SUBNAM4= <"">
##$SUBNAM5= <"">
##$SUBNAM6= <"">
##$SUBNAM7= <"">
##$SUBNAM8= <"">
##$SUBNAM9= <"">
##$SW= 24.0689530833862
##$SWIBOX= (0..15)
0 0 2 0 0 0 0 0 0 0 0 0 0 0 0 0 
##$SW_h= 4816.95568400771
##$TD= 16384
##$TD0= 1
##$TE= 0
##$TE2= 300
##$TE3= 300
##$TEG= 300
##$TL= (0..7)
0 120 120 120 120 120 120 120 
##$TP= (0..7)
150 150 150 150 150 150 150 150 
##$TP07= 0
##$TPNAME0= <>
##$TPNAME1= <>
##$TPNAME2= <>
##$TPNAME3= <>
##$TPNAME4= <>
##$TPNAME5= <>
##$TPNAME6= <>
##$TPNAME7= <>
##$TPOAL= (0..7)
0.5 0.5 0.5 0.5 0.5 0.5 0.5 0.5 
##$TPOFFS= (0..7)
0 0 0 0 0 0 0 0 
##$TUNHIN= 0
##$TUNHOUT= 0
##$TUNXOUT= 0
##$USERA1= <user>
##$USERA2= <user>
##$USERA3= <user>
##$USERA4= <user>
##$USERA5= <user>
##$V9= 5
##$VALIST= <valist>
##$VCLIST= <CCCCCCCCCCCCCCC>
##$VD= 0
##$VDLIST= <DDDDDDDDDDDDDDD>
##$VPLIST= <PPPPPPPPPPPPPPP>
##$VTLIST= <TTTTTTTTTTTTTTT>
##$WBST= 1024
##$WBSW= 4
##$XGAIN= (0..3)
0 0 0 0 
##$XL= 0
##$YL= 0
##$YMAX_a= 66799
##$YMIN_a= -111130
##$ZGOPTNS= <>
##$ZL1= 120
##$ZL2= 120
##$ZL3= 120
##$ZL4= 120
##$ABSF1= 10
##$ABSF2= 0
##$ABSG= 5
##$ABSL= 3
##$ALPHA= 0
##$AQORDER= 0
##$ASSFAC= 0
##$ASSFACI= 0
##$ASSFACX= 0
##$ASSWID= 0
##$AUNMP= <proc_1d>
##$AZFE= 0.1
##$AZFW= 0.1
##$BCFW= 1
##$BC_mod= 2
##$BYTORDP= 1
##$COROFFS= 0
##$CY= 11.3945322036743
##$DATMOD= 1
##$DC= 2
##$DFILT= <>
##$DTYPP= 0
##$F1P= 15.6554695791079
##$F2P= 12.8336369535428
##$FCOR= 0.5
##$FTSIZE= 0
##$FT_mod= 4
##$GAMMA= 1
##$GB= 0.15
##$INTBC= 1
##$INTSCL= 1
##$ISEN= 128
##$LB= 0.24
##$LEV0= 0
##$LPBIN= 0
##$MAXI= 10000
##$MC2= 0
##$MEAN= 0
##$ME_mod= 0
##$MI= 1.114404
##$NCOEF= 0
##$NC_proc= 0
##$NLEV= 6
##$NOISF1= 3.799351
##$NOISF2= 2.8
##$NSP= 1
##$NTH_PI= 0
##$NZP= 0
##$OFFSET= 15.70392
##$PC= 1
##$PHC0= -25794.95
##$PHC1= 15.18749
##$PH_mod= 1
##$PKNL= yes
##$PPARMOD= 0
##$PSCAL= 0
##$PSIGN= 0
##$REVERSE= no
##$SF= 200.130013532006
##$SI= 16384
##$SIGF1= 3
##$SIGF2= 2
##$SINO= 400
##$SIOLD= 16384
##$SREGLST= <1H.CDCl3>
##$SSB= 0
##$STSI= 0
##$STSR= 0
##$SW_p= 3612.71676300578
##$SYMM= 0
##$S_DEV= 0
##$TDeff= 0
##$TDoff= 0
##$TI= <>
##$TILT= no
##$TM1= 0
##$TM2= 0
##$TOPLEV= 0
##$USERP1= <user>
##$USERP2= <user>
##$USERP3= <user>
##$USERP4= <user>
##$USERP5= <user>
##$WDW= 1
##$XDIM= 8192
##$YMAX_p= 0
##$YMIN_p= 0
$$ End of Bruker specific parameters
$$ ---------------------------------
##NTUPLES= NMR FID
##VAR_NAME=  TIME,          FID/REAL,        FID/IMAG
##SYMBOL=    X,             R,               I
##VAR_TYPE=  INDEPENDENT,   DEPENDENT,       DEPENDENT
##VAR_FORM=  AFFN,          ASDF,            ASDF
##VAR_DIM=   8192,          8192,            8192
##UNITS=     SECONDS,       ARBITRARY UNITS, ARBITRARY UNITS
##FACTOR=    0.0002076,     1,               1
##FIRST=     0,             0,               0
##LAST=      1.7004516,     0,               0
##MIN=       0,             -111130,         0
##MAX=       1.7004516,     66799,           0
$$ Real data points
##PAGE= N=1
##DATA TABLE= (X++(R..R)), XYDATA
$$ [...]
1318b12R96L46p66j307l81Q90P86l26j034m78R83J124L23p84o26J26J072N09o11
1337F30j024k68P37Q66lr09n08O29R68L18o71j167k37P31L67n82r68m85P38R78
1357A40M90p83n37N55Q40N30q19q31k65N87M57j31r13n41N81R95N17n74p47J01
1377c48J047L96n13q26l48L17O99j48p16p43N46Q23M04m31n50j2Q21P29j26j060
1397c9n57K97N91J93q67n43N8Q93P23m53o31j47P36P41j21r19o36L84P53Km83
1418b5q20k3Q99P26k77q36j84M70Q55j6p57r74J80Q46L75n55q33k4R89Q64R2q24
1440A48m43N68R10o5r93r26j30O97O26l67r71j83J107R54Q3j064o23N21R28M1
1460H18q83j098J82R10P37l29r01k57Q96J066j08r77q24J57J157K37q35j198L1
$$ y = [-212, 784, 1130, 364, -943, -1324, -434, 352, 26, -1008, -1486, -503, 621, 944, 160, -466, -340, 732, 1241, 630, -394, -662, 75, 941, 938, 29, -479, 150, 1118, 1436, 765, -402, -639, 92, 459, -123, -1091, -1576, -838, 140, 630, -153, -690, -135, 705, 1235, 416, -415, -680, -93, 364, 233, -680, -1221, -640, 355, 872, 298, -449, -348, 699, 1095, 582, -244, -592, -275, 424, 276, -440, -1183, -637, 186, 590, 159, -391, -403, 418, 1147, 1021, -39, -596, -299, 292, 485, -382, -925, -867, 26, 749, 296, -335, -482, 254, 995, 874, -45, -681, -297, 456, 458, -25, -845, -868, 31, 757, 480, -356, -540, -70, 785, 769, 12, -962, -782, 64, 439, -116, -949, -973, 16, 880, 972, 148, -295, 273, 1183, 1118, 125, -801, -931, -234, 392, 25, -946, -1129, -22, 932, 1015, -49, -672, -151, 777, 818, -65, -1163, -981, -71, 666, 337, -564, -821, 75, 1141, 1033, 56, -768, -611, 546, 783, -52, -1250, -1219]
1479a219J003P71j96j022k71Q01J238J7j162p23J97J176K93r31j180L7J195Q26
1497H50j94r33k14P51J058K46j217r04L37R41J01p46j303p4J041R33l82j005k70
1516i84Q02J125L39j052j043M59R98N16r50j283l11J095Q47k63j128k54R10J234
1534A057k4q75r17Q1J149L55r20j080j30R61R52j23q92l02P04J128K46j136j034
1553h00K62O64N26p41j217m7J141Q83J24j023l73P55J277J82j015r26K53Q78L80
1572A183o74j157k92Q71Q22k94r40n51O54J039Q9q49q83J36J059L98n83r21lO97
1592a99J116m68q52n48N80J078J5p71p30K1R06O24n32p60l18Q83O11j54q81n49
1612i28L80J037J26p06o69J70Q99N59n08p48r5P13O00K5p22o03L85O15K28p27
$$ y = [-1219, -216, 555, 359, -663, -934, -133, 1105, 1122, -40, -763, -566, 610, 903, -28, -1208, -1171, 24, 850, 656, -277, -491, 260, 1318, 1564, 347, -557, -220, 721, 822, 76, -1227, -1301, -260, 673, 291, -714, -984, -182, 943, 1282, 230, -813, -354, 644, 1160, 210, -1073, -1384, -289, 558, 295, -833, -1087, -177, 1057, 1033, 158, -759, -678, 471, 826, -94, -1174, -1304, -343, 609, 486, -406, -708, -4, 1124, 1370, 234, -800, -538, 126, 652, -89, -1306, -1353, -212, 671, 795, -228, -601, 154, 1431, 1613, 598, -328, -75, 803, 1183, 509, -648, -940, -69, 753, 459, -481, -1032, -378, 661, 750, -99, -982, -846, 213, 611, 28, -893, -896, -199, 917, 449, -403, -951, -371, 707, 722, -49, -779, -758, 148, 772, 240, -520, -838, 45, 656, 502, -379, -928, -548, 489, 615, -91, -760, -590, 309, 868, 360, -388, -483, 230, 830, 855, 133, -470, -85, 530, 758, 31]
1632C1n43L5O01O40l74o67j03N88P44j71o42m29N8M72K04o36o69k1Q52J40N8o18
1654d50p5L98O90j42n40m74m6N29J48l02m77p7P05N46n4l71j09M83M34J97n75
1675D38n80l20L94R7l08n17j70M50N13L03j09k43M38K80M73l89p90r6K83J35k5
1696B57n70j26J34N44M18m12l56J42M75Q0M3p26k51Q6M96j02m57l04lN32L47j50
1718I7k00k18L77L16j70l77k41P5L06J53n56l06M4N26M52j2l21j41L33M51J91
1739G79o25m88P2M12L1l39n21jN93N31j5l75j84K90O36K3m66o37L8M91K45k97
1761A93o45r1N70N68l4n72l55K87P17k3n16o10K6O23K95k43p37p8N17N10j5o28
1783b41m01J09O77K28m52p43J49M26O92q9o91k43O61O42j45n98m80J90O96Q3n50
$$ y = [31, -512, -477, 124, 764, 390, -277, -380, 208, 952, 781, 139, -290, -232, 240, 444, -192, -861, -882, -30, 110, 168, -450, -525, -127, 563, 421, -119, -593, -639, -110, 38, -264, -741, -818, -113, 433, 379, 8, -101, 382, 816, 1013, 438, -142, -462, -68, 29, -279, -796, -966, -516, -3, 300, 191, -52, 386, 666, 1139, 750, -40, -136, 147, 282, 257, -313, -439, -305, 239, 657, 245, -111, 31, 506, 586, 629, -97, -348, -262, 234, 132, -325, -629, -632, -100, 247, 97, -103, -321, 56, 372, 202, -175, -416, -341, -35, 118, -438, -744, -700, -174, 278, 266, -55, -196, 137, 588, 779, 154, -334, -262, 150, 181, -158, -679, -680, -87, 444, 429, 54, -130, 160, 796, 819, 353, -284, -246, 245, 490, 193, -452, -543, 27, 595, 561, -11, -366, -79, 638, 615, 99, -511, -485, 138, 433, 190, -547, -625, -108, 402, 387, -241, -642, -533, 144, 372, -80, -823, -674, -248, 444, 355, -336, -579, 82, 724, 579, -19, -499, -309, 387, 470, -80]
1804h0m87l2P36M38k89n43l73M72P46Mp69l63K89O25L15m75o74mP63M28j30p08
1826a11k30L47N55J70p29n81O6P54K80m52p63L5N93N63n2o06l26L99N57J16o09
1847b4n74J97L94L39m48n84N9N73N50j08n91k74M76O23O2n56n49O3M57K49l04
1868C0n97r8O73N54O4p23j58L01M76J70o23n80pL36M16k86n90j6M35P08j25k71
1890H9m13L60L74K51n12o07J69L37M30k11n58J2L09L86Q5n02m65K63M47P0l82
1911f8n29n7K92N95j33m04k19M88M93J50k45m95k0L77L68l72n04j94L50N13j46
1932B40l88k89K29N91N8k06n18Q2L61K17j34l53l17L39L71M1l14l91P3M90K06
1953C88k54n06L8K22M20j41n22k38J22O85K46k91l93L0N89L20l4p20k74K42L62
$$ y = [-80, -567, -599, 137, 575, 286, -257, -630, -158, 588, 592, -177, -540, -251, 374, 689, 214, -460, -464, 299, 727, 597, -111, -341, 6, 561, 731, 2, -579, -513, 241, 521, 69, -694, -659, -66, 497, 445, -161, -487, -88, 469, 585, -24, -598, -401, -7, 332, -116, -700, -641, -68, 482, 374, -217, -491, -15, 608, 670, 114, -435, -372, 85, 334, 30, -567, -665, 8, 562, 626, -97, -255, 46, 522, 692, 69, -511, -518, -182, 234, -52, -642, -658, -223, 485, 360, 89, -324, 36, 410, 661, 149, -458, -289, 48, 478, 267, -291, -279, 30, 416, 501, -1, -466, -203, 244, 314, -68, -597, -654, -362, 233, 100, -304, -523, -35, 458, 608, 363, -132, -152, 225, 593, 221, -283, -477, -127, 386, 240, -148, -437, -208, 383, 441, 235, -283, -201, 160, 377, 243, -110, -427, -88, 283, 324, 10, -381, -308, 182, 388, 134, -372, -334, -112, 308, 167, -355, -593, -471, 214, 460, 169, -224, -194, 395, 715, 681, -39, -313, -71, 291]
1974B91Rn08m47O7P34K11k04m70K5M71N51k79n61l46L33M02L5n25m74K50O50N04
1996G19l74n77j74O53M63n2q01m29J78O30J35n68m65J54O63L19k52o50j48N42
2016c4N04K5o89n52L20O49K49o71l85oO39N08j58o04l16N67O18rq33l72J1P61
2038B22L28n56n88J5Q46M88k44o94k65N36O48K0q22l98O7P34K67n27q39P2O94
2059DN83j92p87l03O70O58J8p10o93K95R15J91o71p77K02O11O70j82q03m84N45
2080b40P82m7o92p03K71Q47N62n93q72j0Q01N92j37q76m24N12Q40k0q18o15L45
2101d95Q91M09m69q53Q4P64M73j76r76m48N44R57l8p27n74K28Q81L83m65q29j81
2122f17J005M48l61r05k66N73O27J23o96p67L16R17K08m11o61j03O64N08l40q39
$$ y = [291, 300, -208, -655, -588, 146, 357, 153, -317, -292, 179, 730, 451, -110, -456, -123, 279, 314, -211, -685, -435, 215, 719, 345, -232, -406, 247, 710, 658, -143, -572, -394, 236, 371, -197, -662, -508, 155, 474, 222, -428, -576, -34, 470, 495, -194, -746, -426, 223, 472, -199, -584, -590, 49, 557, 399, -205, -521, 46, 664, 655, -178, -550, -539, 222, 550, -6, -594, -579, 267, 755, 511, -183, -448, 88, 736, 756, -66, -464, -397, 337, 604, 77, -762, -690, 4, 587, 395, -392, -695, -25, 633, 651, -59, -752, -457, 458, 649, -22, -799, -597, 14, 684, 502, -301, -785, -240, 542, 495, -197, -900, -629, 218, 780, 187, -685, -695, 106, 698, 561, -315, -739, -227, 613, 593, -225, -840, -495, 396, 805, 336, -517, -433, 331, 804, 628, -348, -796, -252, 705, 667, -60, -634, -406, 475, 858, 393, -436, -617, 388, 836, 475, -430, -696, -123, 504, 627, -69, -836, -520, 397, 605, 194, -467, -570, 94, 602, 262, -577]
2142e77m37N93Q13l3n75n86L02O74M91k84p80K8O28M33j48r02l69N22N71J32n50
2163e4p54K99P84L63m01o21Q3O60N24k45n58n77M18M41J01n93m35K24O59L57l54
2184C21o24l2M46N16j95p09k72J97P24M4o18m37J84O87L66k81n45k87O38M84k12
2205C95p32l68J58O72km06n49J12Q19L15j02m49l15N33M01K7o90l07K13N55L0
2226C10k71l01M1N62J88o0o61q0M58L93k3m17n49J32M82K47k59n89K4N42L42j82
2248C29m97j87M19L28J92o10l60J47O33J27n59k84k49N21L48K1n59k26J57N04
2268A95J03k98n10J12M48L50k39n74l5L55M72l06j67m13K51M61J52m31m99J70
2288d03M82J42q0m35q6L58N43%m51l53J27M94J69m10l84nL28N02j52n07l02N24
$$ y = [-577, -1014, -421, 392, 359, -216, -802, -500, 174, 665, 381, -399, -371, 257, 690, 542, -360, -729, -207, 364, 496, -54, -808, -509, 275, 638, 237, -384, -301, 359, 883, 638, 80, -497, -79, 362, 463, -130, -565, -341, 318, 675, 321, -303, -335, 111, 627, 432, -277, -549, -352, 372, 416, -202, -639, -455, 232, 598, 317, -228, -515, 123, 607, 395, -337, -705, -547, 125, 123, -283, -832, -720, 99, 414, 312, -137, -452, 81, 482, 509, -181, -488, -275, 280, 310, 39, -262, -221, 341, 529, 469, -192, -272, 186, 579, 556, 139, -410, -278, 204, 451, 192, -397, -373, 169, 511, 329, -168, -355, 64, 392, 584, -26, -386, -239, 394, 521, -38, -322, -571, -50, 298, 319, -240, -466, -309, 195, 298, 0, -510, -398, 50, 400, 161, -413, -448, -93, 379, 73, -94, -507, -256, 205, 357, -74, -573, -403, 79, 221, 141, -294, -380, -22, 521, 521, 70, -283, -156, 338, 507, 97, -287, -292, 36, 538, 386, -121, -423, 101]
2310A01M09q1n68m29K61N52Q6k12n36J80M37K51q9l95l19K60M34K4n09l48K9N55
2332I3K14l00n30N2M93L62J16o50j97K56N44p0n21l05K8N51K12k58n70J7M93M15
2354D45M0p17j04K54M42K02n37m30J51L99L24m38l39l1M67L60j38l66l44L25L28
2375B93J55m25m37J83M34J76k06o18K9M56M34j53m46j35J14M92O6m29m33P1L28
2396e1K83k57l02j50M25L91M9m90k58L62L28K8l33m42p9M33K77j83l90nM06L69
2418D11j42l67j04K09L44Pl16k75j24M98L39l44l49r5L48K99m4l75j46K6M06N2
2440B58k77m19J05M97K1j68l27J30K89J02L0l27j57K64J23M4j90l23J93K28R9
2461A95j75l34J09J84K94Nl76j4m8M05q3k57k20J50J85J19j69l6j92K89K52j33
$$ y = [101, 510, 429, -139, -568, -307, 245, 331, 119, -417, -237, 200, 451, 362, -33, -352, -92, 342, 366, -143, -491, -462, 93, 307, 7, -523, -471, 22, 384, 500, -150, -347, -91, 453, 383, -138, -443, -415, 136, 348, 90, -480, -463, 30, 445, 485, -232, -336, -82, 360, 562, 25, -405, -254, 145, 469, 31, -308, -339, 128, 488, 350, -16, -360, -35, 293, 448, 23, -414, -231, 203, 379, 173, -445, -416, 40, 474, 321, -125, -260, -146, 346, 412, -17, -450, -379, -51, 232, -25, -327, -477, -52, 339, 388, -102, -360, 2, 330, 358, 25, -417, -496, -63, 214, 31, -359, -364, 42, 411, 269, -98, -202, 7, 351, 358, 42, -233, -357, 141, 480, 136, -213, -308, 40, 339, 295, -80, -226, -200, 206, 258, -19, -438, -333, 164, 185, 17, -310, -180, 109, 211, 241, -86, -243, 21, 144, 188, -2, -325, -132, 96, 195, 20, -314, -205, -21, 273, 278, -98, -112, -160, 245, 162, -95, -315, -165, 20, 139, -30, -66, -258, 31, 283, 150]
2483A50k13m7J52J83n1j37k58R4J11P5q3k40J48K84j8j2j04j98K41K2l3j09j40
2506a83R0L17k9j28j91J10N8K41j06k80p9Q1N0M8rj70K87LMJ8lk7M7J51k39o2
2532ak0R5ll2j09k17O6J99nk8l4m6J39P4p1K2n3K1L6J1J5j5R0k1j8k5j69J60k5
2561C6j06J48l7r2K3Q1j76N9p1R3J00n9qj3J05Kj02N0j54K08l6r4j2j01J25Q7
2587E6r4j5Q6k4J08J8l29J14N0J44nj0j61J05j4J01j06p5J18O8l6q4j66O1k8J65
2613D7k12K20k38J03J11m7L6j23J24j27K95j31k63N2O6J33J0k29J63K0P2Q6m5
2636A23k53J62J54j50n2j09j07J47l0Q7N8o9Q2P9P6r6Q2k12Q9L3lj70PQ4N2r9
2662c5o7L7J19R0or2j3p5PJ42r5R6k64J34j16J93Mk04J90O2R9j65j19R0J04M8
$$ y = [150, -63, -110, 42, 225, 174, 37, -221, -127, -16, 59, -24, -264, -116, 168, 150, 138, 34, -164, 77, 99, 66, -43, -183, -93, 224, 195, 67, -124, -14, 44, 285, 179, -101, -180, -99, -49, -1, -10, -180, 107, 110, 114, 132, 129, 102, 149, 300, 61, -1, -21, 74, 71, 39, -70, -287, -221, -22, -27, -55, -89, -135, 4, 78, 7, 29, -24, -3, 33, 44, 59, 44, 134, 113, 95, 70, -99, 61, 36, -70, 78, 41, -51, -28, 53, -123, -64, -135, -42, 58, -1, -9, -22, 83, 85, -17, 33, -121, 87, 51, -43, -55, -156, -31, 56, -38, -53, 33, 9, 117, 135, -194, -80, -30, 114, 109, 99, -62, 43, 29, 130, 24, -51, 67, 135, 99, 15, -151, -90, -118, 47, -165, 55, -183, -80, 31, -16, 20, -103, 21, -106, 189, 58, -205, -153, -87, 46, 56, -173, -10, 10, 82, 168, 123, -130, 32, 186, 36, -16, -125, -232, -85, -115, -28, 30, -39, 43, 122, 198, 102, 184, -28, 61, 94, 91, -79, -72, 12, 64, -35, -102, -65, 54, 144, 138, 46, 33, -42, -35, 107, 12, 108, -156, -22, -138, 55, 59, -145, 45, 107, 206, 41, -78, 12, 116, 164]
2688A64l9l32n6K0K01N8j25q2P7P1L21j43j35j15J18J24k7j26k16J07J52k2J2
2711Gl5l1J35J64m5j42j67P2L28p9j44k39N7J00J69j04r7n7R7K89k04j00j83K03
2735fJ50K1j83j17j9J61Q8L8l08O5P5K39j59p7j67J24J32N9j3l67J34K88J47m03
2759i8J6q2R4L44j64j79q1N7J80L6p3k36N2Q0K51r3j06l02J77J68K48l37q9J07
2783c0K27J36k50j52j59K81J80m8l17o2J98P2P4l51q1K03K29R0k44q0j62L71K03
2806C28j63l20j29K86K16l3l99j97K24L05J70k53k74J2K55K33k05r8j79J04K50
2827A33J52l34j55OK42J18j60k80Q8K73K46j97k53o9P3L66j70k27j74M2M08J10
2849B38k06k08L5M48J8q2l36j6J70J52Kj64k90J16L45K8k17k21L9J72L12q7l77
$$ y = [164, 125, -207, -263, -243, -42, 16, -109, -191, -114, -43, 278, 135, 0, -115, 3, 127, 100, -26, -242, -135, 17, -5, 7, -28, -59, 76, 240, 195, 53, -114, -42, 286, 207, 63, -176, -119, -19, 150, 46, -51, -108, -11, 278, 74, -26, -209, -6, 144, 165, -18, -135, -154, 7, 95, 133, -175, -110, -35, 204, 45, -32, -199, -75, 57, 116, 103, -264, -130, 158, 305, -98, -82, -164, -70, 274, 110, -69, -150, -93, 87, 123, 50, -186, -134, -54, 197, 104, -2, -304, -127, 41, 289, -48, -137, -30, 197, 333, 83, -69, -228, 53, 233, 185, -132, -194, 4, 76, 150, -201, -282, -79, 150, 240, -4, -84, -246, 125, 328, 165, -155, -284, 2, 218, 185, -214, -411, -187, 118, 288, 35, -239, -227, 28, 261, 56, -42, -221, -117, 133, 285, -49, -204, -198, 44, 162, 2, -278, -190, 83, 329, 132, -121, -190, -117, 249, 79, -148, -322, -280, 128, 238, 32, -176, -141, 307, 325, 243, -93, -109, 61, 213, 215, 51, -239, -123, 222, 250, 33, -188, -149, 23, 335, 248, -129]
2872a29j66L14J56n6k65l9nK66J56j22l52j1J58N10j85l38m9J21R1K43l66l18
2894c86K11J75J69j81k27M3J73L32q8m32L2K55K87j34k30k38R6K51R5k07k26Q3
2916a47K39K39k29j84n7O0L05P0l00j50j2K53K48l51k25J25K63J80j5l80j80L04
2938E6N7P4k08j94k9J97L02k07l31j39L85L31r2k60k19J10M23J1l00j46r8L60
2960H3L17l51k19q1K95J93m4l39l4O0L02j11J0k54k3K50K97j76l52j08L63J29
2982B07l5l43j23J61K66J55k43k12J15J38J11j00k77J30K09L8M3j88l29K01Q5
3003IJ72k35k07j8L13J26j10k80l6L40K03p7j62k24N2K58J86l49j64n1L32J81
3025B59o9k48k52K50J89Q1k53j33j5L67K9n8k79K0K08J02qk63j06J43K07K9k30
$$ y = [-129, -295, 19, 175, 119, -146, -185, -190, 76, 232, 110, -242, -253, -95, 415, 230, -108, -157, -36, 55, 298, -68, -386, -175, 0, 169, -12, -239, -196, -23, 309, 221, -211, -179, 76, 363, 229, -1, -239, -143, 108, 203, -4, -230, -147, 92, 331, 102, -82, -139, -79, 226, 296, -4, -154, -166, 87, 335, -16, -241, -116, 147, 327, 312, -68, -248, 56, 113, 187, -21, -215, -244, -47, 255, 48, -283, -422, -37, 294, 202, -58, -277, -167, 256, 267, -33, -179, -277, 83, 400, 49, -170, -251, 44, 237, 193, -146, -180, -120, 182, 71, 81, -173, -196, 54, 351, 175, -177, -285, 78, 207, 172, -171, -294, -133, 133, 288, 45, -167, -52, 86, 197, 97, -180, -50, 159, 197, 240, 52, -277, -76, 9, 181, -54, -261, -279, 34, 160, 50, -230, -266, 74, 277, 200, 38, -186, -134, 124, 310, -39, -203, -254, 78, 259, 190, -58, -310, -60, 129, 210, -43, -176, -191, 176, 205, 147, -132, -112, 96, 198, 190, -73, -179, -36, 171, 200, -30]
3048c0k83R5L28R6k42j06N7K44Q3o1k15q0P1K58J27m64j99J54J44K33q1l55O2
3071a64J52J72m9j54j16k3K25J19j54j26K8J04K82j98j55j61K32J88j8j72k70
3092b58J13K37P9j82k42PK27K41j21l24r8L25Q8J05k38j24J47Q0J50k15k18P9
3114a42L24J57j86l46J40N3J57Qj55k91J19K32N1l8l31K2L39j00M2j61N3L7L02
3137B86j23k95j0k3L72p5l3l88J48J18J72O7l73m1K15J92m6j56n9r3K24L7j32
3160a6k47P1K08P0J74k81j38J16K05j34j81jMK61l7l8j56M5J21K16l5j99j21J2
3184h1K87p9j14j36L0J14J4Pk74K15O8O6j53j5j22L40K5r9j18j81K58L1l%k06
3209a26M6J28J56K4l40n6K00O9J09j63k15K61L8Qj12k55R0J52Q6q8o9o9P8Q4L6
$$ y = [-30, -313, -218, 110, 206, -36, -142, -85, 159, 242, 181, -34, -114, -43, 215, 342, -122, -321, -167, -23, 210, 129, -226, -164, -12, 160, 111, -43, -159, -182, 43, 162, 8, -118, -90, 14, 296, 98, -57, -218, 14, 202, 184, 12, -258, -145, 92, 171, -11, -253, -246, -19, 222, 101, -223, -321, 4, 92, 197, -41, -165, -18, 62, 212, -3, -221, -142, 182, 339, 153, -193, -53, 0, 157, 165, 10, -281, -162, 70, 121, 83, -248, -226, 113, 13, 55, -106, -53, -16, 286, 163, -132, -142, -165, 207, 132, 99, -289, -141, -23, 149, 216, -157, -198, 17, 209, 163, 7, -52, -145, 79, 116, -16, -263, -192, 16, 86, 260, -21, -159, -43, 162, 28, -153, -154, -150, 111, 74, 36, -120, -75, 46, 262, 227, 28, -93, -81, 206, 127, 13, -123, -93, 21, 35, 42, -232, -17, 51, 117, -36, -51, -173, 167, 192, 93, -25, -206, 52, 83, 80, 80, -126, -80, 48, 204, 228, -112, -168, 32, 101, 210, 47, -168, 93, 131, 139, 27, -228, -138, 14, 100, 12, -57, -126, -48, 36, 72]
3234G2j75O2p9J06J28l9k05O2M6J66j73k4q7r5L84n7j49j05N9J86o4o2j5j99J99
3259e8J31m0j33q9K74p1P4j38pj2J71J1j11mj30L05J38k18r8j73J00P1J44l7k62
3284a62J84P0Q7r6j05L8JK8J7J5o6j4j9J7P5j99P3P6J03j57k2j25J88J55p3m9
3310D0j10j47K05J37p2j22m7J24R1o9j34M9pJ48Kj71O1N8mN4j45N9o5JK54l43
3336a53J69j4O1j38O8Q7k75J60Q7p7r3q7J86J36j04M9o6M7M4K2q8j53J32j53L33
3361A80k39R1j83K36j07k%K9n2K0J03n7kn0M5j25L7O1j71J63L5O3j9m7N0j43J63
3388G9j01R0r6Q1K8j16Q2j07l4J97j41P9%O9j76K16p4N4p8j11%NJ56l3m7J21j76
3415c3P8m5O8r0K3O6j40J03l9k6R3k26L1J07P3r3N3n8P5o6m9K43j45J01j08k6
$$ y = [72, -103, -41, -120, -14, 114, 75, -130, -68, -22, 144, -29, -53, -140, -235, 149, 92, -57, -162, -103, 83, 19, -43, -58, -257, -58, 73, 33, -100, -189, 85, 14, 88, -50, -57, -69, 102, 113, 2, -2, -132, 173, 311, 93, -5, -178, -78, -7, 137, 100, -162, 22, 92, 179, 83, -22, 16, 17, 45, 62, 77, 11, -3, -22, -5, 70, -129, -56, 20, 123, -34, -56, -181, 7, 162, 89, 40, -70, -217, -12, 125, 53, -69, -116, 8, 99, 30, -104, -55, -62, 86, 88, -83, -22, 36, 32, 86, -59, 0, -65, -64, 190, -153, 16, 2, 63, -75, -7, 80, -195, -35, 52, -25, -118, -205, -19, 117, 13, 62, -4, 43, 87, 109, 21, -132, 0, -153, 180, -59, 32, -151, 85, -22, -24, -24, 5, -47, -27, 76, 19, 17, -33, 12, -113, -76, -15, -186, -23, 12, 75, 56, 9, 59, -84, 79, -22, 68, -28, 53, 81, -35, 47, -60, -94, 103, -38, 41, 41, 110, -66, 150, 76, 130, 52, -59, -59, -54, 102, 69, 22, 143, -33, 45, 0, 68, -22, 1, 67, -73, 30, -9, -35, 58, -168, -137, -30, 43, -50, 3, -55, 20, -46, -95, 148, 3, 104, -4, -30]
3441c0O5j7K7r6j3M7M3q0J06j18J42p8l0J84k61n1J78K3j43R0J4n5k3J21m5Q4
3467H4j42K8l2j0K05r1k20K20J5j6J74j22j00N2K6Or8K0n9pJ4L9J45j80J09Lj59
3494i6P0J41j06P1j26Nl6P5qK0J1n2J17m1n1P2l9L9j11J03K7l7l0J7P8j8k1l5
3522C9J6k5R9j18J26q9k22K13J2mj43Q4K5k0L2j06m3O1R3p8N4k3n4L4j5P7j02
3549g7j00L04j09L3r8M5J17j39L7ON9j83O7M9O5L3o6M4k9j15J1m3J62Q8o5j99
3575a03o4M6P8KN2L2L8j5M6r9k2o5J01p9R2O4k12M8J13P1j79m0J8P5J41j46p1
3602g8J45m0J6p1o1n6Q3J3Q2mq7O7m7Q6J22j73n3K02j56J04p5r7MJ39n7O7r1j26
3630a42L2J08J10k11P0J12p2m3j0N6n4J16m1j08Q1N7qj3J15j73r8J02P5k2P5j67
$$ y = [-30, 35, 18, 45, -51, -64, -17, 26, -54, 52, -66, 76, -2, -32, 152, -109, -160, 18, 41, -102, -12, 2, -53, -76, 45, 0, 84, -58, -30, -62, -72, 133, 42, -178, 42, 57, 41, 215, 93, -7, 45, 71, 77, -21, -1, -60, -67, -53, -14, 131, -49, 60, 63, -96, -26, 115, 9, 80, -46, -41, -77, -2, -10, 10, 21, -31, 86, 45, -6, 66, 27, 66, -45, 58, 85, 48, 18, 35, 113, 95, 74, 39, 55, 30, 129, 11, 137, 48, -174, 39, 51, 47, -96, -12, 13, -7, 25, -81, -124, -63, 30, -48, 6, -17, -71, -37, -52, 25, -77, -177, 127, 18, 51, -47, -2, 115, -24, 13, 19, 78, -105, -38, 11, 76, 109, 43, 87, 58, -57, -46, -89, 73, 161, 96, -103, -167, -121, -43, -41, 11, 43, 81, 66, 112, 13, -9, -74, 27, -52, 40, 104, -108, -60, 53, 124, -55, -95, -77, -2, 139, -7, -78, 67, 27, 43, -28, -89, -145, -62, -49, 33, 29, -58, 9, -38, 48, 170, -3, -56, 146, -10, 94, 19, -78, -74, 65, 8, 75, -16, -142, -110, -2, 108, -103, -33, 79, 7, -36, -46, 10, -44, 72, 31, -77, 4, 61, 53, 40, 155, -18, -116, -14, 61, 39, 114, -53]
3656e3r5J31N7j38L6q6J28J13l9r6l3J28K3K00l14o9R6LJ18j38po6K7J92p6J43
3682A85k26L6J90j45m9kl2QJ6J9O5j35Q7J3j7k9j55L5K49j26p9L5rJ79Q6j70n9
3709c0l2J99o5o1Q3j69K30j45J16r0l0j37J35O0r1p8J20M0J2k6p4n7n1J60o0N1
3735A0q0r1J76M5j1k9o1L7M2j5N5j05J8pJ52r9o8O8j24N8J39k18J37j7QJ84r7
3762A07j13J7j01K17j01l4J29m3J0j4j90J2J67l4O9j12m9J24Nm7Lj03K1P6J1M3
3788G0j33k3JQ4P3q0K5m5J58j15M5n4o4J12m2L7k9p2l2J75j05L9o6L8N4n2J10
3815A09N5k66J29n9J77k03J2l0P3k6k5m3lK03m7K4j66J6N6J04oj08o8J50J1l9
3841C0n3Q0Nl7m3j2K0J4n8Q3Q7j21j10J49J5k7k5k2j34J97J1k8Nj67O9J05Kq0
$$ y = [-53, -148, -17, 40, -98, -62, -148, -20, 93, 54, -42, -75, 53, 76, 276, -38, -107, -11, -8, 110, -28, -35, -101, -74, 118, 42, 185, -41, -5, 185, 40, -9, -11, -43, -35, -19, 0, 65, -70, 17, 30, 13, -16, -171, -136, 113, -13, -92, -57, -66, 113, 199, 29, -30, -62, 137, 72, 11, 94, -75, 155, 10, 126, 36, 6, -131, 4, 64, -27, -105, 15, 55, 67, 41, -33, -90, -141, 19, -41, 10, -70, -161, 15, 60, 49, 20, -41, -4, 38, 23, 78, -27, -9, -16, 136, 37, -31, 37, -87, -29, 110, -108, 29, 12, 20, 204, 107, -6, 11, -90, 127, 26, -8, 121, 78, 88, 74, -116, -104, 63, 29, 98, -14, -63, 61, 66, 19, 22, -81, -60, 16, 27, 70, -63, -86, -85, -1, 72, -8, 17, -28, 130, 15, 60, 6, -58, 54, 12, 49, 20, -52, -84, 91, -14, 25, -41, -3, 51, -1, 109, 164, -102, 27, -32, 145, -58, -46, -76, -3, -29, -54, -97, -100, 103, 56, 80, -86, -70, -14, 90, 84, -24, -92, 58, 69, 30, -23, 57, 62, 25, -18, -30, -10, 4, -54, 29, 116, -5, -115, 34, 49, 22, -3, -25, -159, 38, 49, 21, 26, -141, -72, 33, 35, -45]
3869d5k8J7oJ31K8o8r9P2R4J0j44l5J17OK4Mk19J81n2J93j98o8J6kN0P9j47j5
3897a04R9J44n0r4j86J30J39q1M2l3r5N3mJ71p3r9R1J42j01j54N0l8O1j5j2r1
3923a08L2O8J10p7Qj79P9Q9nMr1O8n1N8J14k27O2J65qj15k6n7QJ05j4J0j09N3
3951c4P3R1j05j40J54q5O7l4kj03K69j11p3N4j15J04P1l4Q0p9q4l0N5P6q1k36
3977b52K10J02r6L5K5m5j38K24P0j23q9J34K2N2k73O2J00j1n7J55j58P8n0M1K1
4002C9j46J26Q8j37J9N2M2j23m9Q2J12j37j29J54o4J89p0m5J8O3j13Qj2J19j1
4027G5M7K7j06r2J70j7j20J10j33NjJ76j70p2l1J07j9J19o5q4P1K7J15j00p7m1
4053g9J31R1j47l2l9M0q7N8M6k5M9N4j15P6j46J30o4K3k0nk7J17j19n2L06k41
$$ y = [-45, -73, -56, -62, 69, 97, 29, -70, 2, 96, 106, -38, -73, 44, 50, 74, 78, -141, 40, -12, 181, -17, -85, -69, -71, -21, 58, -89, -104, -5, 139, 89, -5, -191, -61, 78, -3, 39, 6, -89, -36, -40, 131, 58, -41, 50, 192, 91, -63, -13, -51, 10, -5, -17, -108, -76, -8, 102, 25, 33, -146, -67, 22, 17, 21, -70, -2, -53, 5, 119, -108, -46, 119, 111, -4, -30, -87, -79, 26, 12, 22, -87, -34, 39, 130, 25, -115, 39, -46, 21, -13, -15, -118, 151, 40, -33, 21, -94, 10, 81, 47, 127, 48, -36, -66, -11, 65, -16, -252, -42, 60, -36, -1, 24, -21, -159, 65, 135, 12, -77, 57, 79, 131, -142, -80, 20, 9, -48, 107, -51, 27, -23, 18, 39, -107, 19, 107, -30, -11, 41, 83, -40, -89, -7, 105, -32, -161, -7, -71, 118, 48, 3, 21, 84, -29, -21, -33, 86, 75, 122, 149, 43, -49, 121, 104, -16, 94, -39, -34, -35, 141, -29, -101, -132, -25, -44, 75, 10, -74, -3, 24, 139, 39, -38, -79, 52, 143, -4, -36, -75, -35, -122, -64, -18, -43, 6, 60, -55, 21, -125, 5, -59, -36, -56, -61, -88, 29, -90, -142, 164, -77]
4079g7M9K9NO0j9L9j92J15J2P7j97M3J8J1P7r2R3J4O1k00O2rL6Q3j76J1J24r8
4107d1K12j34p7qpK4K6K9j20J23K0l5J1m8L4j46J17J0l5o9mJ92k03K6P5j1M3J54
4135A58k34L4L4O4KQm5p8P6j63K08j7o9J07j73K09lr1nj46J77m6l1o2Q2r4L5J63
4163A00l3J9l8j04N8K7J9j4j04J71j43j29J74l7Q3o0L5o8J37K3j22J2p9O8K5l9
4189a9mP1p5j8K7M5L0q1O9k5p0mJ01j01M7pK6qJ8j04K8N4n9M4L8m2P6n9K6q8J16
4220E2R2p7L4j43p9J77O3j71J25o0o3k5O1J0O4r7P1M1j52NJ12p1Q1kqj02o9K68
4248A37j26m8L6l8J60j37N3M7j18J29q0K2r0M7P4n2J5k7j61K53j05N0k02J66Q8
4273I3j00K0k6N5m0L3K8l4Q0r1p2L3Q7q1m8k9J21K0p5J05j69K0J3p3J76j8n5P
$$ y = [-77, -28, 1, 6, 66, 47, 86, -106, 9, 21, 98, -99, -56, -38, -27, 50, -42, 51, 65, 126, -74, -12, -21, 15, 98, -78, -67, 57, -41, 171, 37, -40, -48, -55, -31, -5, 24, -96, 27, 47, 12, 23, -25, 9, -137, -20, -10, -45, -114, -118, 74, -129, -103, -28, -39, 4, 158, -76, -42, -8, 56, 58, 66, 21, -57, 19, -144, 64, 47, -22, 85, -88, 121, 118, 27, 22, -124, 53, 7, -24, -86, -4, -98, -63, 100, 67, 86, 48, -56, 2, 29, 48, 34, -70, 101, -42, -171, 3, -34, 49, -11, 24, -44, 93, 116, -6, 6, -73, -5, 20, -19, -23, 48, -27, -45, -18, 27, 57, -24, 45, 20, -50, -54, 47, -54, -7, -14, 12, 4, 22, -82, -54, 0, -59, -15, 23, -19, 57, -2, 24, -64, 52, 144, 67, 101, -42, -121, 56, 119, -52, 73, 13, -50, -75, -14, -4, 60, -37, 34, 75, -77, -72, 40, -31, 50, 48, 40, -62, -131, 137, 11, -37, -1, -39, 121, -16, 37, 84, -34, 95, 15, 37, -53, -6, 68, 16, 31, 4, -157, 96, -9, 41, -161, 5, 93, -7, 13, -13, 42, 2, 35, 63, 29, 109, 18, -54, -21, 66, -15, -63, -92, 29, 49, -26, 79, -90, -70, -57, -130, 46, 28, -27, -20]
4301b0M9J3k6m4Nl2M0Kj7m5R4M5k9L3J0j69N4J47l3j50J18m0n3J87j33LO7q9j3
4330b6RK0l5k3o0P6J22J6k7j2p6r1L19j98l4P3j17Q5qmO2r0J42j36Q0q1k4k9J05
4359C8mL7j22K8K7p4n3J79r1R0j19O1n0K0L5m7q4J86q3J6L9j18L5L8J81j22n5
4386a2J06o5o8j04J54j38N2P7rR0m9m3k7M3j4J30j24j6M5N9j54J15L0l6J0j07
4412e5l4K53k21k7J10J03o0n7R7k00J89PM3j00q0j4Q1Lo5J9n0O5k4l4K2J0K1K9
4440C1o2P9r0mM7j19J77k0J15j57Q5l5r3K2O1o3Q0K8J7j56J34r5k2J31j85R4l8
4467c8JL1J81o3j64L3O4j73J07KJ04N0k16P4J11r5kJ8o3J04o0N9K3o1q7p2P7M5
4495a0P5j9J53j95l0J3Q4j36L2K14k72j7N2J26j01J23L2k03J22p8N5m8N5l9n6
$$ y = [-20, 29, 42, 16, -28, -23, -55, -15, -13, -30, -75, 19, 64, 35, 68, 78, -91, -37, 110, 77, -73, 45, 5, -48, 139, 6, 9, 76, -13, -26, -17, 3, -32, -55, -115, -39, 83, 99, 72, 60, -16, -107, 212, 14, -20, 53, -64, 21, 13, 9, 71, -19, 123, -13, 67, -14, -38, -67, 38, 34, 71, -51, -23, 4, -70, -123, 56, -35, 55, -64, -3, -53, -33, 2, -45, -129, 57, -26, -10, 29, -89, -54, -16, 165, 43, -12, 94, 29, -39, -143, 11, -127, -75, 2, -7, 83, 34, -9, -36, 7, -7, 123, -1, -17, 28, 87, -67, 48, 78, 42, 52, -55, -89, 164, -57, -84, 26, 129, 69, 12, 109, -91, 98, 105, 148, 48, -32, -46, 35, 38, -27, -8, -58, 7, -17, -51, -29, -19, 2, 31, -31, 48, -42, -46, 1, -118, 59, 39, 154, -3, 82, 47, -46, -24, 37, -26, 54, 82, 99, -57, 77, -18, -40, 91, -94, 0, -38, -37, -6, 175, 112, -52, -19, 45, -128, -21, -19, 85, 135, -81, -7, 104, 9, 7, 25, -38, 66, 6, 65, 88, 27, -60, -132, -55, -10, 65, 46, 199, 4, -26, -13, 71, -65, -33, 181, -91, -108, -56, 70, -31, 92, 124, -79, 43, -35, 20, -28, 27, -12, -68]
4520f8J65j14M1l1k9j9Q3L9L6j83Q7m8%k4O9Q4J30k04mQ6j60O3n5J07j18N4k8
4547d1K08k65J39Oj66J13p6R2jj2J10j40K16j32j06k8J08rj40P6O5K6q7q4J75
4572D7r8J5Jj4N2L2Mj12J52p7rN3l0J9o5l9L0J68j13m6J66j71K24p1j87L2L5M0
4600C8q7J22p1N7j15J15p6J7j07j52L04j34P2j3JJ65j00r4J96k14P8k8j72K43
4624D5p7J46j05k5O7K1r2l5L2J29k24R9k5m2J23j6%n0n7J66m5r4P7Q0j37jQ8o7
4652a9l3R8j65RJ24m1n7J1J1p7J73m9lK0K0M4o0m4l2J11J5O2j09q6PJ53m9K9r8
4681c5K8N6M7j05m0k8J62l6m6j0p9K21j40M1j07J06Konm1M5j69L19j39r1n4L6
4708f8M5N3Or9J8p1K22l6OL3j42K5J6k3J14Qj92R1o1L3n5L1m7L8N4P8j19J29O
$$ y = [-68, 97, -17, 24, -7, -36, -55, 28, 67, 103, -80, 7, -41, -41, -65, 4, 88, 218, 14, 10, 96, -64, -1, -56, 51, -67, -13, -41, 167, -98, 41, 47, -119, -6, -82, 10, 9, -3, 107, -33, 183, 51, -55, -83, 25, 16, -124, -48, 17, 43, -44, -128, 47, -51, -36, -35, -49, 3, 35, 39, -73, 79, 2, -7, 46, 16, 35, -30, -69, -39, 129, 16, -30, 136, -35, 189, 118, -69, -37, -2, 38, -49, 73, 2, 59, -56, 59, -17, 0, -107, -259, 45, -89, -17, -30, -29, 136, 36, -58, 138, -76, 2, -26, -198, 45, -32, 114, 9, -16, 51, 72, -20, -55, -23, 106, -118, -19, -44, -86, 37, 21, 21, -29, -86, 80, 35, -59, 18, 98, -39, -40, 48, -19, -52, 46, -119, -110, 14, -27, -84, -73, -62, -139, 34, -15, -18, 2, 22, 66, 6, -38, -70, 41, 56, 118, 9, -77, -70, 83, 34, 63, -35, -7, 49, 96, -9, -49, -77, 85, 49, 3, -7, -86, 135, -5, 36, -71, 35, 37, 31, 26, -15, 30, -139, 180, 41, -50, -104, -68, -23, 30, 36, -63, -45, -116, 106, 70, 76, 109, -33, -8, 8, -15, 99, 107, -85, 6, -55, -22, -77, -46, -93, -55, -1, 77, -42, 87, 93]
4737I3k78J50j14J73j17K54p8Nj76M5J24Pl1L9n6k9n1n7J53Mj49J76j71J36%n0
4763BK6n7jo8J75p3j5o3J05p5j3J09k0q9lJ16m3N2KL0l6p2J0pj2j16J29Jn5J17
4793E6m2k8O3p9j1P9J16l03K97j29n0j1n0K26l7j69O1k7J07q0J83j16K4j33N0
4818cP4n8J6j50Q0O9Qr9L5r5J10K0j51P2J13o1O0q2P1q7J10M9j53m5l0J33J75
4845A81j45lk9k4JL4k8J14r2O5j25R7K6j81J07j1R9j39Q6Oo4l5O9O1j83Q3M8j8
4873@p5R5o5P7J9j07M7J28j34k6J03j65J02q5N7J2K7j5M8j57J43j7N0j14J33n7
4899B4O1j32J07l5mM2j54J23j09R7L7j45j6J63m8M7R1j19p3O6l3K4m3j7J0Q6j02
4926e2pM1lO4j00OJ06P8j73O7q3P3j68J65J10q1P3j48N9N1M0r1l5O9q8m6J43q9
$$ y = [93, -185, -35, -149, 24, -93, 161, 83, 88, -88, -43, 81, 88, 57, 96, 40, 11, -40, -97, 56, 60, -89, 87, -84, 52, 52, 2, 28, -29, -30, -98, 77, 4, -11, -74, 31, -44, -57, 52, 32, -57, -60, 56, 13, 65, 67, 97, 61, -11, -1, -8, -20, -136, -7, -6, -61, 56, 14, -14, 49, -30, -41, 38, 154, -149, 148, 19, -31, -42, -92, 134, 97, -72, -11, -38, 69, -11, 172, 56, 80, -53, -3, 71, 13, 29, -121, -41, 28, 36, -63, -28, -123, -13, 7, -144, -72, 41, -20, 40, -42, 29, -58, 52, 101, -52, -97, -127, 6, 181, 36, 33, 4, -20, -19, 15, -13, 101, 9, 74, -51, 46, 72, -109, -2, -13, 86, -53, 33, 39, -25, -60, 9, 70, -113, -30, 18, 0, -75, 20, -45, 32, 51, -56, -9, 119, -15, -41, 62, -103, -1, -86, -29, -17, 10, -5, 43, -114, 29, 12, 62, -52, 81, 24, 85, -47, 60, 25, 21, 63, -91, 32, -77, 20, 57, -88, -104, 59, 11, 58, 149, 30, -43, 23, -10, 14, -29, -46, -36, 50, -52, -59, -18, -21, 43, -57, -51, 55, 133, -40, 27, -56, 17, -151, 14, 124, 43, 116, -32, 27, 78, 118, 27, -8, 61, -27, -73, 70, -19]
4954a9n8N5N6r4N7J4J9j33J88j40J2L8J5l8O0j41N1L7N9p8j2N1m8J06J8q1Q9r1
4982hpJ4M7j6r7j5K73j92j35J61N1q1P9p9K1m2jk2Q9j06QQ3r3MO1j43N2J85j35
5011d4J49k7l5m7q7Q8q6J00n4L0j3Mk8NO8l8oOM1j9n0J00l9O2L5j35O0k1p6PK0
5042c0n2ON0KMJ22k34J36j31N0J04K1M5j25K3L3j23R1n5J12r5j8J27n5qj07J85
5069G8m6j28o7J49M4qN1r5n7K0M7K2N3n9N0K7K3j54RJ39j53N8Q7j40J2O8p7K5
5097b2m9j3K19r1j6m1L9j30J08k3o6K1N8O9j35J64o7J17r4k5L3K0j08J33o9o0
5123b8J4%M7m3k1J41m3q2P0P9o2j36M3J21l0q3o3J84o1k6K7J5j34l2J29j4K3P2
5151A07o9n2K1Rj42l1J98k6q1L1J04j17O3J2Pj0j33N9l5J21p7M3O1N0j44J24J7
$$ y = [-19, -77, -22, 34, -60, -3, 11, 30, -103, 85, -55, -43, -5, 10, -28, 32, -109, -58, -21, 38, -40, -52, -1, -49, 57, 75, -6, 83, -8, -15, -1, 46, 30, -67, -82, 191, -1, -136, 25, 76, -5, 74, -5, 16, -26, -27, -49, 40, -66, -58, 25, -68, -64, -3, -146, -94, 91, -44, 105, 78, 43, -4, -91, -3, -89, 11, -43, -13, -26, -22, -50, -45, 23, -15, -21, -15, 26, 7, -43, 57, 18, 80, 115, -20, 40, 19, -57, -50, -30, -82, -76, -26, -24, -20, 102, -132, 4, -127, -77, 27, 48, 93, -32, -9, 24, -99, -8, -63, 49, -46, -64, 63, 8, 0, -107, 78, 32, -96, -163, -14, 30, 22, 73, -22, -79, -59, -12, 10, 63, 4, 54, 81, 104, -50, -41, 98, -55, 3, 90, -50, -38, 30, -47, -22, -71, -84, 135, 44, 28, -13, 26, -104, 4, -19, -85, -64, -6, 63, -72, 92, 25, 142, 48, 23, 56, 76, -32, 101, 32, -28, -14, -14, 33, -10, -31, 110, 67, -15, 55, 134, 72, -64, -21, 100, 70, -13, -76, 108, 47, 21, 48, 63, -71, -103, 26, 12, 35, 107, 38, -14, 7, 16, -126, -157, 41, 15, -66, -35, 69, -48, 15, 27, 34, 24, -109, -50, -85, 36, -41, 2, 63, 113, -31, 93, 110]
5178A10j71J58m1n0k6l5N6PM1o4M7p9J47k6j86J48m1P5J08j70j19J45K6r2R4j23
5204f1k0J58r6O1M5j52Q7l1J14j48J0Q8K5j91M1l8P4P5j2M6k3r1o3O6N6j72J59
5231GpN2p1m9J55q1kM2j62J30j01J80K6j25l5P9pJ2l9J6o3l9k2K25j64J00j4j9
5259B4J26j30J4j1p3P1Q0j78J03r5P0OO3q0R0j99J13p7PqM2N3m9J33k2j66J47
5286E4r0k8J77j60L0k8L9N7m7j44J54J0L0m3Q1j56K7P9n6P2j00Q3j01J5mk4P9
5313Fj1M8r0P2j61J78j4o3K7J1qmL3J1j35R3R4j33k0J29oln3j3Q1j59Q3r7O7J12
5343G5j70J30M2R2k42r9J36L0J1J14j46k4N4K6j22N3K4l4J32n1n3k9J20j37R2
5368B4j97P0Q3o6J95q5M1n7q3O0J03o8m6j8M6n7N9jM7p0O9o3p9O3n3L1K5kJ0N
$$ y = [110, -61, 97, 56, 6, -20, -55, 1, 8, 49, -15, 32, -47, 100, 74, -112, 36, -5, 70, 178, 8, -111, 34, 60, -32, 62, -61, -81, 77, -19, 42, 87, -65, 22, -9, 105, -43, -33, 55, 80, -111, -70, -108, -34, 41, 29, 75, 52, -39, -102, -36, 20, -152, 7, 0, 52, -19, -68, 87, 6, 4, 46, -116, 14, -87, 93, 119, -6, -41, 38, 31, 43, 4, 20, -43, -82, -104, 121, -43, 57, 43, 24, 150, 20, 34, 23, -50, 21, 101, -77, 26, -69, 1, 7, 70, -10, 80, -119, -6, -83, -76, -84, -42, 11, -38, 95, 73, -93, 54, -36, -64, 113, -47, -17, -45, -6, 51, 4, -140, 14, 24, 54, 11, 92, -64, -37, 42, -14, 58, -42, 41, -60, -45, -49, -73, 6, -5, 43, -47, 25, -136, 42, 28, -35, -8, 3, -5, -9, 24, 35, -100, -7, 87, -46, -66, 63, 57, 54, 1, -12, 69, -90, -7, -104, -37, 75, -95, 35, 77, 169, -73, -172, -36, -6, 5, 119, -27, -51, 3, 29, -93, -40, -16, -50, 82, 31, -22, -51, 69, -68, 24, -173, -103, -20, -86, 109, 24, 65, 8, -75, -15, 88, 20, -26, -44, 2, -55, 4, 3, 50, -20, 49, -14, -93, -30, -83, -52, -27, -29, -19, -14]
5398a4Kk4R5J3j17L4M9j06J76q6j06K8J15k9j02J09j20M1O2r6Q1j39Q8J19K3o5
5424C1r9R9M2rj02O2j20K0M7Q4mj94R4L2K6R4j02R7p6k0l3J17j19J71o0p7R0o3
5452B8p9n9J43j00p6J38M9%j60J28P1j00J19j75J79k06J29r7P6L7n7PN5o0P2j91
5478a29J61j8jl1M4q3P1jr8Q0j23L34j63m6J28j68L9j73J19k9KK9R4o0m6l7J2
5505i3R1L1r4J18p2n9R9N4j70N9N4o5J8j16J38j3K8%j9K3j08M9j0L9J3Nl5%P3
5534C8L8j42J76p4K5l7q0J35j25Q1Jq5Q0l9j29J68J44k66oP8r2J84k1q2QJ28j65
5561e9J30m8j62J17q4J82l5j25J53j06R8l4qQ1p5L5j55M3NM5j45K20j04PN1O3
5587I0m5j94J63J6m9ol0LN9j20M7Q4O6j20pO2j4PJ41k40J04O2j51L7k4J68L6p9
$$ y = [-14, -12, -36, 59, 72, -45, -11, 38, -68, 108, 22, -84, -56, 59, 30, -72, 37, -83, -42, 20, -76, 5, -134, -46, 73, 96, 31, -68, 31, 73, 64, -38, 24, -96, -76, -29, 55, 51, -143, -49, -17, 9, 103, 1, 98, 22, 2, -31, 86, -33, 138, 78, 1, 91, 28, -51, -110, 33, -67, -143, -5, 44, 44, -116, 12, 83, -17, 102, -73, 106, -100, 29, -68, 8, 45, -12, -5, 50, -10, 62, -129, 32, 14, 13, -18, 26, -57, 14, 13, -85, -5, -128, 206, 43, -3, 125, -43, -4, -177, -58, -87, -85, -56, 38, -22, -68, -105, -93, -2, 29, -65, 53, -19, -78, 21, 75, -95, -36, 18, -47, -29, -145, -7, -20, 8, 8, -11, 12, -96, -47, -57, -18, -5, 0, -35, -35, 38, 76, -66, 110, 36, 61, 24, -56, 79, -46, 35, 36, -49, 31, -8, -137, 31, 175, -91, -97, -19, -111, 73, 52, -30, -22, 106, -59, 71, 23, -139, -22, -106, 76, 41, -84, 69, -37, 61, 27, 19, 100, 25, 60, -95, -52, -47, -2, -147, 73, -31, -24, 27, 90, 45, -149, 14, 30, -19, -25, -55, -52, 7, -113, -66, 18, 84, -36, -43, 19, 5, 12, 153, -87, 17, 79, -72, -35, -59, 109, 145, 66]
5615F6nl3P0q1R6k6J3p5N3j04O9o5J7J05j16m3R9M3pj49J0J8j1Q1r7Q6r1L00j15
5644A08j42PM9J8j21P7j7K8N8j4L7j47rJ5j05K54o6l0R3m4nj79K6K4l8O3M8Rp6
5673g9N0Q0j0l7%L5j18N8O4o2o3R9n1LM2j66J72o0o8R1O1j70J88J51j24Pj12l5
5701e4kJ40k3j36J09n6P9r1M4Q2j28K47k69J03l9J3K4o9N6j71K53j89J18q7j47
5726a93J47M0J02k3j05O0j57J0K34q9n6j0L1j13J75r7N4J6j19Q2J8jj26J48l8
5751a0o3KN5P0Q1k26J66r8p1P3RJ8mrl9Q7J08k40j13J96l0N6p0J4l1L3p0R8r6
5780a04J08j6P0M9k0j42J9J61k0K8o9j00N9j05J29m7j64J95lJ2o2p5J46q2O3n8
5806b8J82j39LJ28j29m2k5N1P6q0j69J72l3O1l4N7k6j16O4J02j46J3J59k1j02
$$ y = [66, 61, 28, 98, 17, 113, 87, 100, 25, 78, -26, 43, -22, -5, 100, -16, -59, 40, 83, 76, -73, -63, -45, -56, 25, -72, 14, -77, 223, 108, -34, -27, 22, 40, -81, -4, -21, 7, 65, 51, 88, -59, -68, -53, -158, 96, 30, 0, 93, 49, 44, -135, -109, -85, -123, -60, -12, -3, -79, -29, 51, 41, 4, 4, 39, -79, -21, 43, -19, -82, 17, -34, -31, 11, -155, 17, -43, -111, -20, 41, -129, 59, 210, 86, 93, -19, -54, -56, 84, 61, -75, 34, -22, 57, -34, 10, 92, -36, 211, -58, 45, 6, 19, 43, -26, 30, -141, 112, -77, 41, -46, -193, -46, -6, 96, 73, -32, 28, -129, -119, 115, 26, -30, -40, -9, -122, 53, -44, 10, 26, -93, -11, 7, 6, -120, 28, -10, -73, -71, -16, 54, 135, -91, 75, -23, -94, -21, -12, 6, 2, -7, -46, 41, 149, -91, -204, -8, -38, 18, -52, -38, -69, -36, -106, -8, -104, 4, -12, 58, 107, 87, -55, -36, 125, 105, 133, 64, -36, 23, -82, 47, 0, -164, 31, 28, 40, -22, -97, 49, -33, 30, -28, 154, 15, 18, 146, 17, -25, -50, 1, 77, -3, -172, 0, -33, 28, -6, 51, 25, -91, -27, 75, -71, -58, 101, 80, -22]
5831b2N4on6MM9j36O2j2QK1J38o0Qj02M7om4N2n7R2p6p9J45j39N1R0o3j7m8O2
5861d0L7M2j93K26j40m7R1q2J85j75J28o7P8k7r2l5J55Q6l6q0m5J07j6L1j68O7
5887a0R5M3j24R1j46m3O7Q5J3o9JK9R9r8pK1j86J11N2p7KOL0k3Mo0k0J57m1RN
5918A6K4m8O8j3l4nK0L4J0J4j68kNJ51q5k9M0J32n9p3l5Q6j39R8N5k8J0m3o4J13
5948E1m5p1J8R2r3Q8r2k4P2q5O6Kl1R2j15J01k7l4j0J9N3r8LQ3k6rj1j2Qj5J01
5979E1j86J33j03M4J55n6L1j75J28k9J13o6M5r1j4NJ13j06L9r6L0L8Q0j77jK2
6005g3k3J07J9m0k8L8J25j11j20J84j32n0J42L1j12J25j46J50N6rj16l2K8N8j98
6030a27R6O8l4O8j45K0Q7j04M8J02p6N3m1k4N0j00K2k1J38j21r6J92o7p9J88L6
$$ y = [-22, 32, 26, -30, -26, 23, -113, -51, -63, -55, -34, 104, 44, 52, -50, -3, -9, -53, -1, -58, 34, -42, -121, 24, -115, -64, 26, -37, -54, -102, -40, -3, 39, -154, 72, -68, -115, -24, -106, 79, -96, 32, -35, 43, 16, -76, -111, 44, 130, 94, 14, -31, 76, 60, 91, -77, -10, 85, 128, 4, 95, -51, -94, -27, 58, 71, 2, 3, 32, 131, 33, 26, 47, -139, -28, 24, -53, -51, -45, -15, -38, -34, -94, -114, 43, 2, 11, 16, 40, -8, 60, 47, 13, 8, 28, 62, 72, 86, -82, -84, -79, 72, -13, -42, -2, 130, 71, -2, -37, 49, -90, 8, 63, 35, 45, 2, -62, 51, 6, -65, -47, 45, -48, 40, -52, -76, -4, -89, -23, -21, -52, 40, -75, 26, -1, -35, -45, -26, 27, -71, -68, 15, -11, -20, -31, -43, -35, -50, 51, -135, -2, -105, -61, 94, 38, 69, -106, 22, -7, 106, 40, 85, -6, -20, -15, 98, -8, 31, -65, -35, 3, 83, -94, -95, -73, -96, 11, 30, -10, -38, 0, 125, 14, -106, 78, -54, -104, 38, 69, -43, 82, -64, 86, 142, 133, 17, -15, 13, 71, -127, -31, 37, 3, 71, -74, -54, 33, -71, -23, 79, 3, 56, 15, -9, 41, -59, -37, -58, 80, -41, -137, 55, -12, -91, 97, 133]
6056A33j91O8p4L4J48j83MR7Kp3M0m4ORM5L9j69J64j9N8q6R1l3j27R9l5n8N5l6
6085c6k5J30o7j10J08J3J3J49k57J28q0%J8J26j40qP3j06J50j23M9l6R5r2j14
6110a42K11k31J80j0Pn6j27J44n5OnJ23j52J05K1m2j4l4J46j05l6O5Q6m4l7Oj10
6137a00R5k2k1J43pn0p0K0O7k2k2m0n2J27Jm9No9J53j74lO4O3K7J4l1j31Q5P1
6166G2J5n4K0n2j17K8J9J3N1lP2Mj33J02J6j15j3J25q6l2K6R2m7N8k41J36n4J19
6194B1L4r9N0n6R8Q0r9K4o2R9r7K4m0j35J97j04L8k8L7K7n7L3R2k5n0L2K9n2o
6223Ej8Q7j32J57M3j01J1j32J3J00J4q7K0PM5j01R8p5J29q7J50j09j11J80k07
6248a01J8J25lQ2j38J40j92J82k22J25O3j54N0l6O4o7O4n1O2K6n2M1M8j29N6q
$$ y = [133, -58, 10, -64, -30, 118, -65, -61, 36, 38, -35, 5, -39, -33, -24, 21, 60, -109, 55, 36, 94, 8, 99, 66, -61, 38, 3, -55, 0, -36, -61, 69, 2, -108, 0, 13, 26, 175, -82, 46, -34, -34, -16, 110, -30, -38, 35, -71, 79, -44, 5, -31, 64, -28, -142, 69, -162, 18, 8, 15, -41, -168, -24, -79, -73, -78, 45, -107, -2, 19, -23, -37, -71, 75, -30, -66, -1, 85, 41, 4, 10, -100, -5, -27, -48, 95, 88, 38, -32, -12, 55, 33, 11, -29, -81, 46, 47, -2, 3, -66, 87, -87, -90, -26, 37, 64, 78, 47, -84, 1, 72, 87, 33, 53, 1, -116, -88, -69, -56, -5, -8, 64, 68, -65, 37, 53, -62, -75, 50, -36, -68, -42, 50, 3, 61, -180, -44, -98, 21, 55, -44, 6, -50, 48, 128, 29, 53, -9, 90, -7, 17, -23, -158, 39, -65, -27, -55, -18, 9, -48, -15, 77, 52, 2, 34, 63, 11, 5, -13, 74, -58, 99, 142, 41, 52, -80, -67, 33, 47, -40, -20, -13, 32, -69, 29, -46, 83, -4, 146, 37, -74, 106, -101, -83, 42, 39, 121, -17, 123, -69, 113, -109, 16, 79, -75, -25, -61, 3, -64, 0, -51, 11, 37, -15, 26, 74, -55, 1, -7]
6274gNl5o1J21N1oj71O7J06j26J71j23j8j4R3o3o0J07qLm8ml0J14n6j4l7O6N2
6303G5k8J2k6n2j4lJ12r9R4j08P8j71J03mJ33j32p5J44J4N5j37p6J52n6O3o3J56
6330A47k90J66L9M9q5q6N4p9N7l2M0k2J99p6j34J04M1j06j2O2j11R4M1m3K3j2
6356B8m7M6kk8l1O2n4lk8Q6N8j81N9O1r3K4N2O4%j6m2m6p1M5N0J21j08M2Q5k41
6386a08P7J04m1M1k7no0QJo6J21k4Kq5M6J32j80J0R1p8LJ19r2kO5nj26J17o4P0
6416D4o2m2K1L0J02j61O7k3J63j37n6J00k5R6j11n0K9M2P4j23L0O9j03L3o3M9
6442gj8M3k2k6L1q2R2P7Mj63J25j39J24jo2J24j45Q5l3jp6pM0J0L3j29J80j14
6470e7J33n9j1l2p2Q6L8p7N9J8o8l2P4k5K2rM0j0n8J43q5o2l8N8j14J66l0N0o8
$$ y = [-7, -2, -37, -98, 23, 74, 68, -103, -36, 70, -56, 115, -8, -26, -40, 53, -10, -70, 37, 29, 32, -16, -20, -50, 64, 8, -6, -43, 23, 75, 47, 59, 33, -19, -33, -36, 76, -23, 71, -37, 41, -130, -27, -31, 102, -30, -105, 39, 53, 108, -29, -105, 47, -9, 54, -9, 147, -143, 23, 62, 111, 26, -60, -6, -85, -28, -60, -20, -42, 157, 81, -53, 51, 92, -14, -26, 36, -75, 19, 60, 17, 40, 28, -19, 27, 25, -3, -34, 28, -26, -29, -57, 29, 87, -94, -35, 26, -67, -43, 9, 73, 73, 57, 15, -31, -102, -57, -7, 114, 6, 48, 133, -108, -31, 73, 32, 73, 46, 41, -19, -11, -10, -76, 45, 21, 23, -62, -16, 116, -64, -54, 37, -41, -38, 81, -11, -13, 52, 47, -79, 38, -26, 44, -18, -60, -39, -9, 93, -68, -1, -24, 139, 2, -54, 46, 21, 117, 6, -44, -15, 27, 101, -22, 8, 77, -26, 7, -56, -7, -25, 18, -4, -30, 1, -81, 11, 88, 92, -71, 54, -85, 39, 38, -24, 100, -45, 40, 7, 6, -70, -77, -37, -27, 6, -123, 57, -57, 76, 17, 6, -26, -98, -12, 26, -51, 8, 26, -42, -74, 0, -25, -3, -12, 28, 18, -40, 103, 18, -44, -82, -24, -138, 28, -2, 48, -20]
6499b0kP0j9p2J36r4mm1R7o0P7j0k5P3k01J10L6J4p2P5j03J0L1J16j03m2R7j55
6527h1J34n0J9j15R3j%n2K1J19KM8j08o7J26q0P2r8K4J14o6o8Mm6J10j22j7RJ24
6556D8M3j87P8O7J18l00J00jM8J39j0j30r6N0J76p1j56K42j65n9M6q4J38R5o5
6581F4Np1o7N2Qn2N2LJ08j12L9Q7j11L0J1l6j23J40Oo8l5N1O0j4j24l0J99J9l9
6610E2r7N7j34J36j3r6k0RJ07q4J55r2Q7p7J07r6m6P4L3j6q0L4j0J8o8p5P9R9
6638D3K4r5Q3PK7j24K0M8j7O1o2j39K02j30K41j38k93K79L8l6R9k35J70m0m1M4
6664C6r7L2P7L4j02k3J27j10K6J44k08Q2j1M0j81j4J62m6J5J8m3R3m2j1J08O8
6690A74j95J05k38J97q9l8J07n6L5R6q8j48J96m9m5jJ4n4R0p5J10j14j4M8N5K1
$$ y = [-20, -22, 48, 29, -43, 93, -1, -5, -46, 51, -9, 68, 58, 33, 106, -95, 15, 51, 65, -7, 68, -35, -25, 6, 122, 19, -23, 74, -81, 53, 3, 22, -93, 0, -1, -1, -53, -32, 87, 89, 137, 29, -38, 88, 8, 80, -18, 6, 120, 54, -14, -10, -56, 54, -68, -85, -76, 48, 91, -96, -18, 49, 167, -133, -33, -34, 14, 153, 143, 13, -83, -33, 143, 72, -84, 158, -7, -66, -20, -104, 34, 129, 64, 69, -2, -69, -17, -9, -61, -9, -6, 102, -10, 29, 116, 5, 35, 46, 10, -113, 27, 33, -35, -70, -19, 41, 27, -97, -127, 72, 91, 52, -45, 12, -122, 14, 1, -95, -115, -106, 1, -83, 72, -20, 67, -10, 97, 1, -45, 29, 62, 46, -34, 0, -10, 8, -60, -135, -56, 43, 67, -28, 55, 62, 89, -35, -15, 33, 16, 77, 15, -124, 78, -52, 189, 51, -242, 37, 75, 39, 138, -97, 73, 33, -8, 36, -61, -29, 48, 82, -20, -43, 84, -26, 0, 144, -64, 18, 7, 47, -134, -148, 14, -32, -17, 1, -42, 51, 9, -2, 106, 174, -21, 84, -154, 43, -46, -84, 23, -33, 2, 98, 10, -138, 58, 9, -36, -37, -23, -77, 13, -62, 48, -66, -80, -32, 23, 44]
6716D4j21lRJ88k0j0j51j5O2n3J58q9K3o5N4m5Q3J4p6J11q7n6J37j24l2L3J65
6743A34k26R1L0p1O6j2q9K20j38L5n6M5kk2Q7j45Q0k5Oj9P3j52N4N1k0j31K03
6770F7j16M4p2O0P9n7l6p6J62m9l0J9q6RP7k0j54J34K22j99jR5o4Q3j65J95j05
6797A6R0j28L4KJn3lk8K29j24m5Q1q4K0n4PJ35j48l7J7R3p2M3k6K02j60P0j28
6825e0J16p3RK5o3K9N8p2L2kN3q9J50j06o8R9j17R9k6K6JQ1k01J43j34Q6K6Jj8
6854A5l5m8K24j30r2J39q9M2J6q4J00j24J6N0L8J1p2L9Ql9k1M4k7pk7J16j18r4
6882a49K57q2p2QL6j54Q6M7q8J86rJ9j29J30l6j76J52N1j72L5J1q8J68o8nL0n6
6909f8J10j04N0o0J32p7J19j67J59r0j43J03j15J45O5r1l1Q4k09J75k5j9j1J06
$$ y = [44, -77, -80, -71, 117, 97, 87, -64, -79, -17, -70, 88, -1, 22, -43, 11, -34, 49, 63, -13, 98, 11, -45, 92, -32, -64, -31, 134, -92, -1, 29, -42, 24, 12, -77, 143, 5, 40, -16, 29, 27, 5, 92, -53, 27, 2, 8, -11, 62, -90, -36, 15, -5, -136, 67, -49, -5, -77, -17, 62, 5, -31, -107, 55, 6, -24, -5, -91, -82, -5, -25, -179, -45, 177, -22, -23, 72, 8, 91, -74, 121, 16, 106, -22, 12, 14, 15, -38, -41, -69, 160, 36, -9, 72, -12, 8, -46, -39, 96, -52, -89, -72, 21, -51, -8, -34, 168, 8, 78, -50, 66, -7, 2, 27, -36, -7, 51, -21, 11, 9, 62, -27, 123, 17, -51, 48, -69, 30, 4, 30, 31, 112, -89, 54, -80, 6, 32, 33, 15, -20, -68, 156, 26, -66, 73, -16, 26, 42, -42, 58, -66, -50, 0, 38, 49, -23, 16, 24, -15, -36, 8, -19, -26, -53, 63, -55, -149, 108, 26, -46, -38, -2, -156, -70, -23, -111, 75, 66, 85, -44, 86, 50, -126, 26, 77, -95, -60, -49, -137, 31, -37, -42, -12, -68, 42, -62, -12, -72, 60, -17, 102, -65, 94, 4, -139, -36, -151, -6, 59, -32, -63, 21, -188, -13, -38, -57, -68, 38]
6933C8k3P2q7N8o6j0l4k7N3J1M9K4j64O1M1R5q4K3p6j1O7o3P8p5m3K07j31Q7j3
6962E7p4O0j36J43o5O2o9n4k1lN4J11o8J4%k5N0j4N6j08L6p7L8M9N7j79J41l3
6990Bj13J21q4J78k4m6r1P5m1pj1M0p5J05l1N6o1N0m0L1K2j41L8k5R5j25J96j55
7018f1J28j00Q5o3K4K7k4J4p1J99k14J4R7q2O4o7n2K9P0L6q4n5j00J61O0p2j4
7045e1R8q6Q1Pr8q2J46l4J57j70M9Ok4J17r4J35o5o8l6n4L9R0j40J74q9n5J18
7072G1M6j03n3k6L5j01Q3O3p6J25j03N0r9P9R6n8k4l7l0J06j38O3P1o9N8m7QK5
7100A5K7O6j77K1J53j08k9N6lM4q9O3P0j37n8J93p5l1kj5lM2Mo4P6p4J30q4q1
7129g0M3R1rMr7J58k49O8Mn1N7K4R6M8m5o4j8Jo3K05j10j03M7j25M1K5J72k29
$$ y = [38, 15, 87, 0, 58, -8, -18, -52, -79, -26, -15, 34, 58, -106, -45, -4, 91, 7, 30, -46, -57, 10, -53, 25, -50, -93, 114, -17, 70, 57, -17, 43, -93, 50, -15, 47, -22, -76, -97, -100, -46, 65, -3, 11, 11, -14, 36, 22, 78, -30, 6, -71, -33, 16, 73, -106, 35, 2, -111, 10, -74, 104, 80, 34, -57, 18, -23, -30, -41, -1, -76, 29, -2, 54, -7, 43, 3, 34, 56, -85, -47, -72, 23, -102, 94, -61, 67, -33, 52, -11, 13, 40, 16, 30, -41, 158, -56, -42, 55, -27, 37, -30, -82, -53, 17, 53, -31, -86, -186, -25, 35, -37, -51, 47, -39, 42, 49, -49, -131, 15, -19, 138, -32, 17, 23, -1, 116, 22, 157, 92, 24, -12, -66, -27, 63, -77, 97, 8, -47, 71, 117, 14, -39, -65, -30, -131, -48, 15, -61, 64, -39, 11, -88, -9, 87, 29, 5, -32, -62, 44, -94, -31, 40, -29, 29, -18, -10, 15, 42, 108, -69, -48, 105, -3, -32, 24, 21, 65, -24, 39, 109, -28, -86, 107, 32, 1, -1, -16, -19, 23, 27, -37, 39, -35, 95, 11, -70, -27, 64, 55, 59, -38, 120, -129, -61, -57, -108, -51, -27, 69, 117, 72, 8, -10, -9, -72, 133, 23, -80, -33, -158, -117, -92, 80, -149]
7157a49J34J33j04m9jL6J0k6J7L9L9j4r6NJ23j87K5J36k0r3K7k7K3P5J9j93Q7
7184c1J4P9mo4O4n1j09J24pM2m7k8j4P7j6p5J35K5j10n8J23J9q2j41K19Joj53
7212g4N6ql5M6M0p2J6J81k42j5J09J37k57J09p1K11m7p2L9JK7r4K3j3q4KJ24k1
7240A6j79J2J12J5p0J1J34j10P0o0J13m6K9K6j5j08l3P8k6R5K9j24J24j20k0J66
7266A19j64J10J03k50P3J65k9m0j28L7O4k5j22R5q1M2k8Q6j05P5k6QO1q8J78j03
7292B7N2p7m4Q5m5L1m0o6JM0O1M5p5p3N9LJ41k30R4o2L2J55j16J3J08j70N9P7
7320H5r0n6m1J07J4p0L8O2j03P7J04j78J36j5m0r8J7M5K7m0R6lj26PJ40k07Q9
7347b3L8m7n4J91q8L0n5l6M2P0j66J15m8O7%q0J50r1o4Q9M2j2j01Rl2N9P0q4m4
$$ y = [-149, -15, 118, 14, -35, -36, 0, 10, -16, 1, 40, 79, 65, -31, -26, 97, -90, -65, 71, 51, -42, -15, -42, -19, 56, 75, -118, -31, -17, 62, 58, -6, 58, 7, -102, 22, 15, 57, 10, -18, -32, 45, 29, -46, 89, 114, 4, -54, 69, 88, 6, -135, 84, 85, 79, -74, -18, -26, -61, -15, 25, -47, -31, 150, -92, -107, 2, 139, -118, -9, -80, 131, 84, 12, 51, 52, 79, -15, 8, -5, -89, -87, 37, 16, -163, -151, -39, -24, -94, -83, 51, -59, 11, -49, 64, 18, 47, 73, 58, -50, -83, -5, -31, 64, 93, -31, 93, -27, -47, 119, -45, 65, 168, -82, -9, 156, 127, 87, -41, -4, 60, 35, -87, 8, -73, -31, -59, 27, -78, -3, -29, -21, 40, -48, 130, 27, 79, 2, -42, 43, -2, 29, -11, -77, -76, -36, 25, 70, -5, -78, -19, -16, 125, -105, -11, -73, -41, 114, -2, 11, 119, -51, 8, 85, -5, -61, -102, 5, 19, -51, -13, 49, -54, 23, 127, -51, 85, 70, 30, -68, -51, -6, 21, -19, 77, 74, -52, -45, 95, -112, -23, 15, -32, -86, 105, 17, 47, -8, -44, -2, 68, -98, 17, -31, 36, 36, -44, 106, 15, -49, 40, 82, 70, -31, -22, -54, 5, 75, -9, -53]
7376e3M7J1N5m5j7M4o2J19n2l6l7O9j31J10pj69K28l5j15K4l8N3m0J3J7N3R4L4
7404A34j82J03L5j86J42o7P5N3j83J32O6j75Q3P4j31k5p5J08N6j9n1m7K10k07
7428g7P3M0j04Q6M2j22P0K8n9L4m7J22q4Kk1M3p7N2k9J10Rj22nN6oj7J24j84r
7457g2J24L1j02o3J23K2k02J00L0o7J86m3n5p6R7n8m7M1K8K5j27K24j71L0J79
7482A57k61J03k2q0J71m8M0n1j88J89J6j9m7QM3M3n6L3m9p6M0R7N7k39MJ58m0
7509a7R2j4M0K5n4r9j00O0lO5K5L9j80J68k9l3j2P8qn3p5L7n0R7R0k7j96K08q2
7538hj7KQ6O4j26k4q5J05m2j7K7O4q4J71p5j32r7J89L6J43J1r7j48J22q8P6k3
7565C3j9J04j28%N2N6K4k54Q8J9J49j52nJ14j04N0l3O4L9l4r0l1JQ1p8n9K1J37
$$ y = [-53, -6, 5, 60, 15, -2, 42, -20, 99, 47, 11, -26, 43, -88, 22, 15, -154, 74, 39, -76, -52, -90, -37, -77, -64, -47, 6, 100, 134, -48, 55, 90, -96, 46, -21, 54, 107, -76, 56, 122, -53, 30, 104, -27, -52, -127, -19, 37, 18, -33, -80, 130, -77, -4, 36, -68, 18, 60, -62, 8, 36, -23, 11, -36, 86, 2, 4, -17, 26, -51, 1, -28, 82, 91, -31, -36, 20, 14, -3, 121, -63, -72, 52, 83, -19, -82, 41, 63, -139, -39, -9, -76, 110, 67, 12, -64, 33, -25, -72, -31, -3, 22, -105, 119, -52, -22, 157, -104, -1, -23, -103, 68, 20, 60, 9, -179, 10, 26, 7, -40, -32, 11, 54, -2, 31, -18, -94, -54, 43, 100, -139, -135, 23, -17, 75, 61, 101, 126, 72, -27, -127, -67, -70, -5, 20, 59, -121, 47, 18, -15, -27, 51, 43, -10, -85, -48, -98, -1, 89, 62, -134, 74, -8, -25, -23, 63, 127, 1, -23, -108, -3, -45, -62, -35, 29, -55, 116, 41, -91, -188, 1, 37, 180, 191, 94, -54, 68, -20, 56, 33, 14, 118, -10, -10, 42, 98, 122, -132, -44, -25, 124, -28, -33, 81, -23, 27, -6, 58, 97, 63, -27, -58, -57, 24, -54, -113, -92, 45]
7593D5o0l6K12j36qP9j14M4P7k8n4j30Q7J7r0J54r6N7r1q8J18K6m8J26m3L6k7
7620B9m4O5r2K7j5J04j21Q1O6q4j2j33K4R8j5O6j27J7J64j39R2n9j5KN1k0q9J50
7648G1q7J32j88J62j10K0M6l5p2L3O4l5l5J09o2J07j27j43Q5O7N9j30O7r6J44
7673D6l1k6J38k28Q1P3j22J09M5j94M4R8m6N6rj64Q4jjm1O3RR5L4j56%K6m5K5
7702c8k7J62j62N8L2j7L2K7N0k45R4N2n0k5N3Rn5o0J32q7P3m3J46j00%K2p0M5
7730Hr7J21Rj23NP3J22r6k9jO0P4nj51Q8j8p8Q6m0N3m4L1Q9j80L9MJ1k5L8k4P9
7761G9p2J4J00k07J44r1O3o2L7P9j02J46j11R3oj31P3j26J07n3o5J71j34K0O4
7786C0L3j7j65R2l7P8n6o7L4J16K6k4n2pO0j6M2n4L3k1k17L25n1j35Q0n6j6J05
$$ y = [45, -15, -51, 161, 25, 17, 96, -18, 26, 103, 75, 21, -109, -22, -5, -95, 59, -37, 20, -71, -159, -41, -15, -63, 63, 20, 56, 29, -15, 50, -42, -15, -30, 74, -47, 34, 100, 16, 4, -129, -105, -7, -22, 44, -83, -66, 98, -41, 51, -8, -23, -21, 30, 10, -79, 71, -16, 116, -72, 90, -20, 0, 46, 11, -61, -28, 36, 1, -34, 75, 13, 120, -7, -150, -65, 2, 61, -69, -2, -98, 46, 15, -11, 127, -101, -20, 53, -69, 40, 85, -109, -65, 33, -13, 43, 34, -130, -46, -47, -48, -89, -26, -17, 78, 112, -44, -44, -18, -63, -38, -65, 97, -65, -7, 25, 8, 40, 67, 117, -128, -34, 18, -32, -57, -4, 5, -50, -110, 22, -65, 8, -35, 111, 11, 11, 33, -37, 8, -89, 32, 41, -82, -77, -4, 118, 22, -7, -8, 52, 126, 121, -30, 58, 40, -38, 48, 8, 61, 17, 48, 137, -43, -4, 0, 11, -14, 24, 0, 79, 7, 21, 121, -86, 58, -33, 30, -32, 5, 84, -18, 128, 17, 110, 104, -27, 46, -80, 27, -26, -91, 80, -54, -34, 30, 63, 46, -119, -27, -64, 14, -42, -109, -75, 41, 67, 43, -9, -16, 44, 28, 70, 16, 49, 28, -189, 136, 85, -50, 30, -26, -42, 63]
7814F3o3L9q6j2K57k57Q8j12N6P5L0j20oL6k5m9J68j28M5k8M7J05j04l9k2M5l9
7841c6O4j53O8K0RjM6qL8m6Q2k8k49K40O2j42N9K7Mj80J48j9L4r0Q9j4M8J3l3
7870E2j7n1M2l1j24P4N5j73K19j5p9Q2l5j6m5M8o4P5R4p0l7m7J38j79k2J46j1
7897Ij20J25q2R2L2j38R9L8J3n8Q3j39L4N1n8L5k10J92R4j60J35o8j5jJ6Kj08
7924a07R5J31J3p9q0r0K01k2j92K44j46Q1M3j57K81k49L7j5R3r5L9Q4j07J07j34
7949b4j24J05M3oK3J3l7O0k5l7J7j2J1No9j69J27K8J14k1n1%k5J4Q2r3J6p1k8
7978a34J44nJ10j33P6j97J56l5N1p3nO3p6J0K07p6r4O4j04J44j55J02n0R6j84
8003i8J24J1q8J42o1l5J05j20j0LM4J16j70l4R0N8l3p0Q7k17K90j41j09J19J34
$$ y = [63, 0, 39, -47, -59, 198, -59, 29, -83, -27, 48, 78, -42, -48, -12, -37, -86, 82, -46, -1, -29, 18, 123, 19, -20, -42, 3, -36, 28, -125, -57, -37, -28, -29, 17, 9, 47, 1, 83, 55, -194, 46, 108, -34, 25, 52, 56, -124, 24, 5, 39, -51, 38, 24, 72, 85, 52, 35, -16, 26, -5, -129, -55, 0, -173, 46, 31, -48, 34, -1, -17, -62, -14, -78, -3, 91, 21, -16, -63, 75, -104, -126, 20, 9, -111, 14, -68, 24, 56, -82, 17, 55, 68, 10, 93, -46, -12, 39, -19, 16, -194, -2, 92, -68, 67, -1, -16, -17, -1, 1, -107, -12, 119, 132, 53, -27, -117, 84, 62, -130, 114, -32, 49, 92, -65, 216, -33, 4, -11, 82, -13, 26, 110, 3, 110, -24, -148, -43, 0, -6, 17, 30, -7, 53, 28, -9, 8, -4, 7, 12, -57, -226, -99, -71, 43, 22, -29, -29, -54, -40, 42, -51, -35, -106, -134, 10, 5, 115, -18, 58, -139, 17, -18, 33, -40, -45, 18, -58, -48, 159, 83, -11, 53, -51, 93, -62, 40, -10, 86, -98, 26, 37, -51, 91, 30, -5, 100, -20, -30, -27, 17, 133, -37, -71, 19, 77, 44, -26, 61, -156, 134, -7, -116, 3, 137]
8028A37j98R7M1j64J61j55L0J73r3J0j22J43l9P5p9%K2p6J56j41J58k18J57j00
8052b5J0j11L3J45j00P9O4m0n8j20P4J9kp3J03P9j09J14j07J5j8j03R4PR2j29
8078f7P3O1j48J11k3L0O7p8LJ02o6p4L2o9P3O2qL1q9o9J71q2M9j85N9N7J78j98
8106CQJ8M5j08k8J4K31j4l01J61p6R0q0K4J1Q5j12p7J83j37J64p1l8N4j88J65
8132B6M5lM1Rj92R1J7q0J12J08k15R5lj02O2R6jj61K6N9p1L8P9nK2q2kJ4m2m0
8162e9k5J76J1J1Kj61M2m8J55j79K13j86J41j46N1r6J1O7m0O3P4L2j16Nj57Q2
8188g7L8o3J59
$$ y = [137, -61, 36, 77, -87, 74, -81, -51, 122, 29, 39, -83, 60, 21, 96, 17, 17, 39, -37, 119, -22, 136, -82, 75, -25, -15, -126, -93, 52, -48, 31, 95, 55, -3, -123, -49, -30, -32, -105, -2, 77, -32, 82, -25, -10, -28, -131, -37, -30, 62, -67, 6, 67, -81, 30, 7, 37, 104, 26, 29, 131, 65, -9, 23, -46, 27, 89, 81, 112, 23, -46, 125, 43, 92, -93, -34, 23, 201, 3, 11, 29, 74, -34, -62, -48, 183, 169, -132, 29, -47, 43, -37, -13, -2, 83, -29, -106, 77, -60, 104, 33, -5, 49, -139, 26, 71, 68, 109, 118, -74, 17, 34, -46, 66, 174, -41, 54, 51, -51, 11, 107, 106, -55, -29, 30, -41, -3, 76, 71, 93, 11, 9, 23, -19, -59, -84, 92, 103, 114, 116, -45, -3, -51, 104, -75, 138, -48, 93, -53, -2, -98, -87, -20, -60, 3, 77, 109, -7, -2, -159, -77, -39, -102, 57]
8191E7
$$ Imaginary data points
##PAGE= N=2
##DATA TABLE= (X++(I..I)), XYDATA
0@%%%%%%%%%%qJ6j6J6j6J6k4L2l2M0m8N2o0P2q3R1j04J20j36J55j76J97k21K48
34A31k78L10l43L82m25M71n20N76o40P06p81Q67r63J071j197J344j513J717j968
53a053K278k683L234m024N270p544J3020m9533p0095P1065N6812j770o0340l0940
67g6303L4670P9681K8751m9861o4152R220O1320L4711l8283o6305k2366M9817
79a9100N9845k163n9603l5484L4899O5961J9274m5522n2852M647N2714L2735l1407
92B3944o0682j8844M4375N0570o247n2556k9190L1191N6408J9231l7681m8193
104b7674K721N0005L0182l0255n3020j4634L5364M1379k430m5965l1189K7136
116a8380N3349J3937l6746l9167L334M0781K8971k1686m9919j7883L1757L5579
$$ y = [0, 0, 0, 0, 0, 0, 0, 0, 0, 0, 0, -8, 8, -8, 8, -8, 8, -16, 16, -16, 24, -24, 28, -32, 40, -43, 48, -56, 64, -72, 83, -93, 104, -117, 131, -147, 163, -180, 202, -223, 248, -272, 304, -336, 370, -411, 456, -507, 564, -633, 711, -802, 915, -1053, 1225, -1458, 1776, -2248, 3022, -4522, 8498, -41035, -111130, -40065, 16747, 14977, -45363, -76303, -41633, 38048, 66799, 16938, -47214, -37994, 23326, 58037, 19754, -46551, -68917, -19100, 40745, 38582, -21021, -56505, -21606, 44355, 63629, 18107, -34745, -30098, 22616, 55351, 23944, -36738, -55582, -11207, 39363, 33116, -19440, -48630, -17439, 38969, 58200, 20519, -27674, -24953, 25052, 55234, 24979, -28041, -42675, -7311, 34068, 31638, -14327, -45516, -18380, 34969, 48906, 12160, -27007, -23673, 17108, 46079, 24393, -25526, -43409, -11652, 23927]
128B3927o734m0682k6838J9142M3087J5448k9807l5433M904L9002K6388j7382
140A5022m0060j4470K7609L4078q53l2096k2213J6334L7730J4891k5050l1209
152b0287K284L1491K0811j4201l3196j3926K2714L1523O44l0314k1760J1277K7858
165A4918J0595k0085k8435j924K7542K2081r823k5967p844K0478K6644K818k4765
178F233k2505O719K4604Q641j9008k5207l630K0644J9151o173k2814r099J6684
191e760K2726K638k0222j9014M344K0735R297j5017k1732m157J7037J8156j426
204G605j7595q498J4014J9930L968j4662j6002J134J6060R431j1252j9528m503
217a9898J4138J5974J123j2853r530P930J7948O471j1734j4472r12J1490Q473
$$ y = [23927, 17193, -23489, -50327, -31185, 11902, 27350, -2457, -37890, -32986, 6016, 32404, 15022, -25038, -39508, -11899, 22179, 21326, -10770, -32983, -16649, 21081, 35972, 10922, -20287, -18003, 13488, 34299, 20098, -13098, -27024, -4310, 27213, 27857, -2457, -24217, -12940, 14918, 25513, 5428, -23007, -24931, 2611, 24692, 14869, -11098, -18942, 1536, 28180, 30998, 6233, -16272, -9553, 15051, 23692, 4684, -20523, -24153, -3509, 15642, 9469, -13345, -22444, -5760, 16966, 19604, -618, -19632, -15288, 5447, 14744, -273, -22005, -26162, -9125, 9031, 7605, -9990, -18488, -4474, 15456, 19424, 4762, -11240, -10106, 5954, 15385, 4133, -15395, -19898, -5760, 10214, 11337, -1516, -11046, -3116, 14832, 21303, 9569, -4903, -5815, 5675, 14148]
230A4148o829j6926p791R882J4481J946j1258r182N545J6245J0028o957j4027
243f95l741R384Q696n171j5912j0845N726J3742M152r322r492L889J5500J1492
257A7403m915j4980o788P777R699k523j4349j1326L790J4279P576p338j0450K336
271i809J4467J1322l316j4049p801P431J2288M59j3136j1151L326J3643Q430o081
285F023j1809j376J2138J0552m106j4619r068N694J1747J291j2278j1650L770
298a3691J4933R996m734j1120j648J1799J1595k820j4185q972N752J1711K059
311A0675j1787j2186K594J4090Q453o665j3236l462J0558J1480j974j3650q671
324a3781O812J2517L009j0335j0763K609J3672Q921o598j2709k666J0585J0940
$$ y = [14148, 7319, -9607, -17398, -7516, 6965, 8911, -2347, -11529, -5984, 10261, 20289, 13332, -695, -4436, 4948, 13644, 8473, -7439, -18284, -12558, 1184, 5336, -3986, -13478, -9589, 5911, 17403, 12488, -2492, -9280, -1503, 8196, 5673, -8676, -20002, -16212, -1933, 5643, -1695, -12145, -9809, 4658, 15980, 12664, -1385, -9186, -1755, 10533, 10992, -2144, -13295, -9969, 3674, 12104, 6023, -5786, -7162, 4976, 15528, 11422, -3197, -12265, -6571, 5176, 6467, -5811, -17461, -13691, 1242, 11238, 6504, -4616, -6264, 5535, 17130, 14310, 125, -8847, -3095, 8616, 10675, -1112, -13298, -10704, 3386, 11839, 5174, -8062, -11524, -966, 10514, 8540, -5110, -13781, -6969, 5548, 8557, -1778, -12541, -9932, 3740, 12661, 6063, -6646, -9312, 1273, 12213]
337A2213k238j3396q821N492J1843K798r902r839L229J3161Q642n206j1176k366
351e566R929R449l421j3386r041M530J0627K229r478r132L062J2264P639n033
365D672j0212k110R035Q555l321j2163o854N630J0876K601p869p714L748J1947
379F821O945n195r403k212P361O832m398j1774o378M975Q946J316p775o522L673
394f788J0714N685n026q319j328O971N777l263q903m134N560Q356J064o472n074
409e180L302Q217L436n614q151j207N427M428l298p263k752M725O422L80n418
424b546l741L492O517K294m540n325j64N139L470l231n743j876L696M237l45m269
440b935k218L259N094J172l546l226J334M205K070k638m066l89L708K966r03l289
$$ y = [12213, 9975, -3421, -12242, -6750, 5093, 7891, -2011, -11850, -8621, 4540, 13182, 7976, -3200, -5566, 4363, 13812, 10391, -2995, -12036, -7506, 3121, 5350, -4128, -13260, -10198, 2066, 9705, 4672, -5540, -7650, 1385, 9940, 6619, -5544, -12398, -6768, 4108, 6709, -1160, -8874, -5126, 6821, 13766, 8571, -832, -3044, 4317, 11149, 6751, -5023, -11401, -6426, 2520, 3836, -3939, -10461, -6788, 3926, 9611, 4585, -3734, -5062, 1909, 7686, 4423, -4480, -8614, -3054, 5302, 6366, -106, -5180, -1878, 6339, 9775, 4161, -3990, -5197, 230, 4658, 1360, -5903, -8655, -3930, 2492, 2872, -2546, -6287, -2795, 3722, 6016, 1476, -3849, -4013, 1126, 4596, 1365, -4378, -6254, -2558, 1679, 1334, -2935, -5153, -1894, 3200, 4372, 826, -2400, -1066, 3139, 5209, 2571, -1495, -1884, 1824, 4790, 3887, 598]
456E98j386K321K681p00l706k514R46K336P9k763k035J001L566J966r15j451M77
473E01K538J165j652k618j406R19N87j683k416o43J977K442P21j386k91J876K117
490B748m92k612k331Q1J107k38k507j503J913L475K267p97j122J011K751J258
506E009k150l678j449J670J377j276k802q36L337M020R31k568j520K047L357O16
522F085l568m263m84K985J479k458l897q4L975M133r4l530j467L270M315k21m796
539A380m369q0L534J071m055m842k48M989L863q05l809j075M457N120k33n319
555d21l736J463M171J220m461n320N17N460M070j649m399o22M931N194m61n748
571B09l948K427M824N31m968n190R08O376M328k285m857l64N226M937j206o408
$$ y = [598, -788, 1533, 4214, 3514, -192, -2706, -1760, 576, 655, -2108, -4143, -3142, 424, 2390, 1475, 24, 501, 3039, 4204, 2552, -66, -1472, -553, 34, -1649, -4065, -4708, -2731, -289, 432, -954, -1245, 631, 2748, 2256, -356, -2687, -2606, -1499, -1737, -4244, -5747, -3834, -359, 1908, 1111, -11, 1000, 3751, 5009, 2859, -819, -2268, -598, 779, -497, -3299, -4135, -798, 3222, 4153, 1585, 65, 2112, 5469, 6085, 2517, -1746, -2230, 755, 2234, -224, -4121, -4205, -230, 3903, 3809, 279, -1188, 2082, 6397, 6176, 1380, -2989, -3069, 465, 1536, -2519, -7361, -7609, -2620, 1243, 438, -3371, -4446, 11, 5131, 4898, -421, -4157, -2694, 1477, 2697, -1764, -7084, -6567, -1107, 2963, 1314, -3085, -3707, 1224, 6418, 5957, 209, -3739, -1312, 3512, 4043, -925, -6115, -5207, 1169, 5497, 3212, -1645, -2009, 3217, 8154, 6948, 540]
587E40m517K410N062K64n529n016J503O597M106k543n337q07N692M581j553o401
603i48m053K670N439P80n551m793J730O298L240l273n988j091M989M662j910o352
619d151l185K986N831J180m915m682J883O487L378l204n319o97N291M962j229
634D616n979l060L692N662R74m795m672J092N783L106l871n941j123M690M540
649D714j130n970l002L757N842J241m394m440J433N562L344l516o071j365M426
664D31L926j491n999l405K979N689J321m560m023J709N547L277k476n778j482
679d335M227M055j675n489l277K570N271J825m089m028J329N215L077k718n286
694c328j989L315M254p35m852k482L089N724K522k503l767R13M880K865k737n494
$$ y = [540, -3977, -1567, 3495, 3759, -1770, -6786, -5283, 1314, 5420, 2877, -2460, -3267, 2425, 7006, 5453, -948, -5001, -2331, 3108, 3888, -1663, -6456, -4726, 1572, 4812, 1539, -4449, -5540, -551, 4111, 2201, -4151, -7336, -4350, 1481, 2661, -2254, -6936, -5053, 1434, 4812, 1608, -3711, -4408, 883, 5845, 4616, -1363, -4423, -731, 4931, 5905, 1110, -3562, -2470, 3313, 6419, 2548, -3393, -4516, 174, 4714, 3584, -2386, -5388, -1631, 4211, 5452, 1058, -3382, -1949, 3613, 6957, 3441, -2630, -3995, 431, 4357, 2866, -3133, -6538, -3559, 2130, 3451, -1109, -5132, -3423, 2124, 5401, 2925, -2853, -4335, -108, 3947, 2272, -3217, -6494, -3924, 1347, 3172, -917, -4945, -3616, 1599, 4676, 1958, -3328, -5317, -2002, 2252, 1517, -3335, -5817, -2728, 2996, 5518, 3015, -752, 161, 5041, 7906, 5169, -325]
710c25k684K202L607o99m777l273K456N289K489k402l616k8M326L289k001n334
726a481k646K362L700K59m061l441J483N272K771k376l786o45L523L529j239n006
742a782l404K079M154P06l451l597O42N085L469j727m263j081L542L776j57m754
758g63l868J472M558J457l456m059K03M757M194j215m408j892L765M243J54m633
774E09m317J098M658K260l461m698M7M812M313q72m823k530L195M819Kn245m633
791d866P15M462K850l282m975l01N158M737o34m910k823K936N132N24n185m708
807e170R00N129K979k722n223o97M974M682r27n379l228K511M910J148m723m846
823e682J034N788L379k250n054j108M704N106r06n804l593K608N104J118m509
$$ y = [-325, -3009, -807, 2800, 2101, -2676, -5949, -3493, 1796, 4285, 1883, -1733, -1761, 2565, 5854, 3853, -1481, -4127, -1765, 1935, 2194, -1867, -5308, -3825, 1447, 4218, 1842, -1944, -2589, 934, 4463, 3224, -1782, -5186, -3107, 1047, 1753, -1698, -5295, -4653, 432, 3901, 2174, -2089, -3170, 372, 4148, 3991, -763, -4631, -3159, 1399, 2856, -600, -4659, -4456, 301, 4495, 3280, -1128, -3020, 745, 4988, 5142, 509, -3808, -2710, 1948, 4208, 747, -3951, -3904, 908, 5221, 4349, -474, -3004, 191, 5010, 5012, -233, -4866, -4151, 311, 3161, -121, -5096, -5397, -239, 4498, 3864, -1046, -3869, -933, 4199, 4723, -462, -5170, -4270, 859, 3838, 1116, -4107, -4804, 170, 4852, 3925, -1454, -4682, -2171, 2739, 3887, -836, -5682, -4648, 1140, 4519, 2269, -2785, -3893, 811, 5917, 5011, -793, -4386, -1778, 3326, 4444, -65]
838f5n035O59N830L744k755n299j131M361N019o61n876l854K693N488J248m564
854a98n112P76N693L970k653n497j457M605N164n74n682l983K358N742J311m551
870h8n180N84N716L962k523n688j685M610N111o19n651l900K421N477J802m426
886g7n172P75N736L886k087n347j649M389M999p02n757l999K110N174J698m386
902d09n032P59N866M207k077n098j463M065M931o41n909m195K011M917J504m206
918g70m589N35N557L860k157n204j659M249M579o35n092l646K442N132J890l545
934I47m431O33N044L538k109n220k051L441L998o74m730l845J972M884J641l265
950b27l972N50M609L701j823m563j781L316M037k18m576l148J515M378J801k971
$$ y = [-65, -5100, -4441, 1389, 5133, 2378, -2921, -4052, 309, 5328, 4667, -1209, -5063, -2370, 3118, 4366, -198, -5310, -4534, 1159, 5129, 2476, -3021, -4478, 127, 5291, 4717, -965, -4948, -2590, 3152, 4463, -88, -5268, -4684, 1032, 4994, 2471, -3217, -4902, -292, 4819, 4200, -1451, -5351, -2930, 2547, 4349, -77, -5249, -4474, 1262, 5148, 3061, -2286, -3935, 454, 5453, 4751, -1006, -5005, -2895, 2279, 3977, -409, -5441, -4682, 1184, 5391, 3314, -1784, -3247, 818, 5749, 5108, -801, -4996, -2985, 1932, 3436, -770, -5359, -4824, 733, 4593, 2436, -2768, -4427, -178, 4401, 3766, -1326, -4972, -2530, 2602, 4492, 947, -3484, -2851, 2193, 5731, 3622, -1598, -3649, -208, 3790, 3116, -1614, -5459, -3487, 1397, 3038, -227, -4199, -3649, 960, 4661, 2838, -1725, -3506, -190, 3847, 3629, -947, -4095, -2580, 1798, 3599, 628]
966F28l955J89M223L107j430m467j793K717L921o1m186l094J505M062J758k628
982D96l532m8L789K996j287l943j790K512L536j69l799l003J227M129J802k130
998G86l262J23L816K978q67l889j866K098L139L5l527k985R37L509K101k067l023
1015a964j51L133K527j039l590k281J494K824K71k825k598Q83L467K188j186k655
1031a502o8K647K715p38l256j996J168K504L29k518k625O11K859J959j071k615
1047a597n63K557K190k39l013j876R89K700O49k133k174L92K743K235j047k297
1063d84q35J967K085k43k562k063R38K336Q03j814k175J46K269K020o48k050r51
1080a261J509K214J25k369k033L48J880P18j613k265k55K027K009l16j720j009
$$ y = [628, -3327, -3138, 1085, 4192, 2762, -1705, -3498, -781, 3140, 3079, -1107, -4201, -2696, 1366, 3124, 496, -3036, -3084, 705, 3701, 2414, -1529, -3319, -807, 2729, 2560, -1239, -4242, -3015, 1114, 2916, 786, -2476, -2353, 1463, 4441, 3574, -315, -2181, -83, 3056, 3091, -436, -3421, -2484, 1025, 3126, 1059, -1964, -2115, 1018, 3545, 2506, -1084, -3365, -1871, 953, 1224, -1601, -4199, -3316, 151, 2339, 1153, -1502, -1570, 1077, 3792, 3054, -202, -2198, -1030, 1474, 1803, -715, -3340, -2729, 130, 2089, 1018, -1597, -2160, 397, 2587, 2348, -665, -2541, -1552, 1148, 1797, -336, -2510, -2118, 625, 2860, 1813, -484, -1319, 648, 2733, 2490, -72, -2135, -1197, 1139, 1942, 128, -2047, -1901, 368, 2388, 1740, -310, -1261, 248, 2462, 2587, 218, -1815, -1467, 413, 1131, -482, -2747, -3002, -975, 1034, 718, -1002, -2011]
1096b011J521K220L33j810j914P6J895R81j069j811l77J713J781Q2j873j203J052
1113d14J818O25j832k011N7J833J252n65j767n94J410J997J86j789j218O04J792
1130A384N72j374j851j89J670J565k79j769q56J278J908J82j745j640Q3J403P53
1147A095j030j940k34J456J641kj654q77Q76J812L27j420j797j04J682J022o29
1164B24j574m72J523J695O2j516j249P33J518N04j396j793k73J575J177l58j528
1181a148n82J518J698N60j471j283O45J597P74j357j737m56J239J077n19j669
1197a114q41J288J942O05j172j218N63J443P65r41k073p16J066J223o40j408j058
1214b286J097J814Q17q81j431K01J378Q56r47j876p79R16J328j06j487p01J035
$$ y = [-2011, -490, 1730, 2063, 253, -1661, -1585, 310, 1291, 222, -1589, -1966, -253, 1528, 1610, -263, -1466, -414, 1404, 2029, 197, -1814, -1757, 76, 1328, 763, -1004, -1598, -188, 1809, 1995, 206, -1012, -408, 1384, 1956, 582, -1269, -1458, 212, 1777, 1498, -271, -1127, 151, 2059, 2241, 496, -1144, -1061, 342, 1095, 65, -1875, -2109, -653, 988, 986, -668, -1545, -669, 1143, 1470, 50, -1747, -1851, -169, 853, 224, -1350, -1822, -299, 1396, 1458, -58, -1307, -574, 944, 1448, 52, -1741, -2014, -439, 738, 380, -1148, -1730, -212, 1486, 2046, 575, -708, -63, 1534, 2308, 951, -786, -1242, -3, 1074, 555, -1114, -1955, -667, 1275, 1880, 708, -510, 53, 1496, 2261, 1320, -753, -1469, -403, 820, 180, -1228, -2286, -1189, 625, 1442, 561, -870, -669, 709, 1565, 618, -1258, -2037, -1121, 207, 101, -1386, -2087, -1052]
1231a052J803R45p17j321J97J286Q11q75j803j077Q53J264pj229q75O46J776J058
1249A683p18j457k76J308J268p21j829q85Q47J445M34j083q74N51J717Q70p01
1266A579j479m43R44J154m75j743j039L57J348L41j062j338L08J451J111m93j299
1283g78j76R09J047N0j447r77N99J120M83r83j153N2J323R40m42j216m66R54R38
1302G77L6r70j094N24J400M83o82r68K4J077R75o31j194p42P14R70r8j045r70
1321a414L71J006P69n54q01K8J052R73J3j187p88O44Q76J49j044q89J58Q38Q41
1340A041n98q30l49P54Q84k71j055q28Q5Q48L85o25o35J64J081Q27J10q87m08
1359c07M62Q16j75j039p66J40P87M96l32p41j84J029Q11j28p39n85M64O82J16
$$ y = [-1052, 751, 1696, 979, -342, -145, 1141, 1952, 1077, -726, -1803, -950, 314, 307, -922, -1797, -1151, 625, 1683, 965, -492, -768, 540, 1808, 1087, -742, -1627, -780, 665, 1099, 16, -858, -307, 1410, 2280, 1579, 100, -343, 601, 1755, 1280, -463, -1502, -1145, 203, 544, -518, -1856, -1548, -97, 1014, 521, -778, -954, -45, 1002, 1052, -395, -1372, -773, 347, 830, -153, -1306, -1254, 69, 1009, 567, -649, -1115, -161, 777, 813, -157, -1251, -727, 673, 1156, 474, -494, -470, 607, 1582, 951, -243, -985, -271, 699, 601, -444, -1414, -1043, -37, 732, 178, -623, -595, 457, 1430, 1443, 256, -532, 112, 988, 1137, 93, -796, -638, 200, 1041, 443, -387, -736, 18, 902, 631, -424, -1252, -1167, -319, 66, -559, -1194, -1030, 51, 878, 988, 101, -307, 155, 971, 796, -243, -1009, -869, -82, 414, 82, -659, -843, 186, 997, 869, 130, -455, 9, 691, 807]
1378H07p16j041O7P00N17k42o61l05Q89Q56J38q15n64L29O43K79n43j095k61Q99
1398a19M70k64m14m57N32J007K05p22n87J72O68L82m52r52m92P84O45l1n73o29
1418h27L26R36M17m47q90k6Q23M41l51j050l32M62Q82K76o27o09L53R73N23m90
1438G63r60m71P71N71l55j073n74K85J071N99p65n59J33J216M83m12j096n11O32
1457b52Q13o3j049o15O27J035M96o30q18m3J036O14o30j138l99N99R05L7r94q09
1477a278O04J359L28n41q98r8R96P27n61j036m68N47R84Mj054p46N28J405N70
1496A372r25p81l4Q31Q73n81j401p11P72P67J00j067p51M73J375O39o48q32q0
1515f09J076P95m12j311n96N93R70J39j307p33M24J211O80o10q96k4J058R14o02
$$ y = [807, 91, -950, -883, -183, 334, 92, -569, -874, 15, 871, 1009, 194, -370, -41, 602, 881, 338, -757, -1018, -119, 351, 87, -327, -784, -252, 755, 960, 238, -349, -177, 491, 873, 421, -531, -1023, -239, 406, 375, -198, -827, -501, 435, 852, 405, -485, -511, 312, 753, 402, -648, -980, -518, 364, 640, 13, -596, -243, 730, 1253, 763, -197, -668, 103, 674, 319, -754, -1328, -1043, 28, 627, -138, -697, -564, 652, 1135, 723, -373, -884, -252, 561, 498, -551, -1166, -539, 496, 992, 362, -456, -499, 537, 1151, 521, -617, -1016, -417, 488, 525, -469, -1278, -674, 685, 1013, 472, -426, -524, 472, 1199, 638, -398, -866, -319, 665, 669, -385, -1131, -603, 802, 1372, 447, -334, -368, 463, 1336, 755, -646, -1357, -585, 182, 282, -785, -1536, -1063, 312, 951, 303, -529, -609, 467, 1262, 850, -461, -1057, -464, 506, 645, -662, -1395, -971, 240, 920, 310, -586, -610, 448, 1362, 760]
1534G60j233o47N96J158l4r60q10O01J189P28n66j063j28R95O97m43j362n45L89
1553f78J057R6p70o58M16J292P28n42j110J5P24P31m02j316o39N79P32P3q43p85
1573a300J72J190M43n04q01k73R83Q02l19r36m84O45J025J09r66n83K09J040O00
1592A052o48r60j54Q07P38l15q33n58O48R16J55r29n47K12Q72K54l37q17k46O15
1612g5Q50M9r30l76N05P78J18n58q14K22O82L39l49p36k35M81N66j11p00m25M27
1633b92O54K40m76o10J88M13N52n24p04m64L22P95Jp14m41L25Q89L39m09m91J6
1654c91M11M88k75m90m53M12O06m3l96k66M38N47L79k20n29lJ48J82j05p72l93
1675g25J09L89K22j00l88K64N46N44Rl93j93K55K65j56o30m56r8K21L55k46l43
$$ y = [760, -473, -1120, -524, 634, 600, -360, -1170, -569, 620, 1348, 782, -281, -409, 586, 1283, 840, -522, -1067, -678, 379, 475, -295, -953, -537, 755, 1483, 941, -169, -154, 570, 1301, 899, -417, -1056, -477, 255, 328, -515, -1300, -1128, 62, 505, 1, -800, -1073, -90, 712, 393, -543, -1027, -382, 643, 752, -214, -797, -588, 452, 1052, 404, -556, -710, 97, 835, 520, -313, -871, -223, 693, 848, -81, -628, -416, 456, 710, 373, -444, -690, -75, 775, 824, -106, -482, 23, 801, 919, 361, -453, -231, 451, 790, 441, -295, -530, -49, 517, 406, -294, -719, -292, 362, 602, 126, -484, -296, 117, 669, 145, -559, -1023, -701, 94, 95, -619, -1060, -735, 154, 493, 84, -407, -391, 20, 508, 233, -257, -710, -298, 308, 265, -131, -397, 41, 588, 967, 747, 218, 215, 363, 545, 440, -332, -725, -616, -227, -5, -105, -493, -229, 317, 861, 870, 477, 284, 539, 804, 648, 18, -438, -536, -315, 40, -206, -549]
1696e49J40M40M15Nl83k78J46K11J08m17l88j65M28L41j00m59k8M26M58R0l26
1717A15l30MM29K19l74m91l05M60M44j22l33k17N44M37L05k56n31M9L51K40k75
1738C63o73k48L21L94R5l65k63K57N45M28k56o25r2L40L46j42p25l04J84N50J79
1759C09l40l85O9N80L34k32p20p6L93M61j72n67m30K34O37L70o05m67J0P27L75
1780E05l07o63l01M98O26J5o14m08M30Q06K67o83m86J95N25K19k74q00j99M23
1800b26N26J17n00m73K35P27L35n03p37J15N60N79m44o26j66M95O47j3n40n15
1820d07J64P16J88m70o12q3N65M52k77q04j16L06N66K08n98n25L09P28L20n47
1840H3l51k41O46L68k41o63l38L29O99P5m29m54K62O71N05m03o54j57L69M85k11
$$ y = [-549, -409, 31, 446, 451, 68, -210, -64, 147, 255, -162, -550, -715, -287, 54, -46, -505, -533, -107, 351, 441, 115, -215, -211, 218, 437, 63, -428, -733, -273, 171, 49, -284, -501, 43, 480, 785, 529, -2, 47, 398, 638, 363, -310, -558, -237, 157, 252, -113, -376, -119, 426, 854, 598, -27, -119, 221, 567, 425, -300, -604, -420, 130, 309, -31, -416, -347, 233, 567, 335, -385, -461, -68, 393, 221, -346, -776, -542, 95, 465, -140, -607, -597, 130, 505, 198, -465, -766, -268, 358, 373, -241, -649, -219, 587, 854, 171, -315, -120, 405, 624, 350, -450, -649, -226, 300, 417, -83, -556, -321, 406, 741, 238, -499, -384, 176, 755, 311, -315, -481, 14, 661, 648, 108, -407, -243, 473, 661, 191, -421, -504, 61, 513, 236, -568, -684, -378, 188, 396, -202, -727, -418, 310, 630, 83, -268, -509, 137, 505, 264, -399, -737, -408, 291, 366, -63, -517, -255, 416, 921, 518, -136, -293, 76, 561, 350]
1861C50o15m77K80P31J51l99m58K22N83M08l27n94j13L65K52j16m47n85L36N14
1881F1K57k88m81K28O70K43k98m92j13J02O60k27n19l62K01O51K03l83m01j2L96
1902I6M06k84o62k09L18M48P4n07l04K95N39K17q1l71q8L39L61k0n07m13J92N82
1924D21j12l92m34R4M66L24k11l24q8L08M41j72k80l17J72L42L3j64m47m3K61
1945a22M35n8l15l41J49N78O6m46k73l2N67J84j69m13k15M93M39P1l09m09J22
1966BN04K50o22l34l60L83M05m42k37j04L79O79J00n36l49J82L88K03m58m75j94
1987f36M42N07j02m68k92L94O87J73n38o02K29K92M86l95n95l78M08O99l9o53
2007c81k87L75P62J23n23m48m5P01K00j10p58j93M73O30j9n39o13M26Q32J71m77
$$ y = [350, -265, -742, -462, 269, 420, 21, -437, -215, 368, 776, 449, -145, -258, 107, 359, 243, -204, -789, -453, 61, 318, 30, -451, -223, 447, 690, 392, -100, -213, -111, 549, 322, -197, -559, -358, 293, 496, 113, -288, -300, 96, 502, 218, -444, -653, -335, 113, 187, -320, -624, -329, 210, 427, 346, -25, -113, 226, 587, 567, 60, -353, -161, 421, 309, -83, -517, -423, 43, 367, 156, -168, -256, 52, 493, 321, 41, -276, -104, 238, 271, 107, -340, -383, -122, 313, 255, -60, -401, -252, 326, 392, -54, -327, -359, 208, 392, 223, -190, -405, 88, 527, 598, 289, -120, 2, 506, 756, 134, -200, -560, -177, 228, -214, -451, -555, -176, 503, 603, 67, -282, -100, 288, 491, 33, -442, -636, -194, 313, 211, -257, -549, -155, 532, 705, 167, -435, -206, 86, 572, 177, -418, -796, -388, 311, 272, -381, -668, -293, 469, 592, 69, -379, -424, 277, 477, 367, -391, -584, -111, 519, 500, -39, -652, -226, 606, 777, 300]
2028C00n53j14O70L90l32p76k34M40O26J55p40n49N32P52K09n08o98o6P28M59
2048F91j34j086m74O13Q57m1p52m44K37R80K00m23q35J29O61N21k67q72l43M68
2068c14O75N6o46n53K82P59L19l79q61l1O92P45k84r47k61O08P01J34o33o57L06
2089b89R10K53n30p42j55O70O99l95p99l90N21R17K37q37p41L98O57M00p21n92
2109e29l81R95O62l02q22m27O47P85J18q74o36K99R02J35n07q45n5P16O35j55
2129C61r23k24N93P36Q5p89p64M06P19L70n98p30J11N88O00r4p58j50M85Q04n
2150H23p51m75M8P64L75o44p42j02O26N97o7p80j46L82Q58J89p40o44K80P20J73
2171G44o09p29j42P13M92j64o45m24N20P32J45n50o64O9P89K42o63m16j94N36
$$ y = [300, -253, -367, 303, 693, 361, -415, -649, -209, 417, 572, -168, -717, -185, 567, 776, 268, -430, -496, 232, 691, 557, -529, -1003, -390, 467, 426, -326, -770, -533, 447, 647, 224, -611, -482, 179, 700, 433, -439, -782, -314, 361, 417, -229, -782, -500, 259, 578, 199, -662, -693, -1, 744, 460, -487, -748, -140, 561, 695, 62, -595, -289, 621, 874, 344, -398, -553, 117, 816, 421, -378, -768, -247, 670, 907, 70, -671, -273, 384, 784, 63, -529, -910, 85, 747, 445, -377, -804, -157, 628, 746, -128, -764, -465, 437, 572, 65, -780, -835, -119, 516, 361, -562, -786, -193, 543, 628, -161, -925, -519, 200, 570, -28, -758, -647, -59, 541, 447, -311, -461, 24, 828, 823, 72, -403, -355, 409, 784, 140, -602, -704, -78, 519, 452, -328, -474, -92, 766, 955, 215, -429, -149, 571, 744, 135, -594, -736, -23, 469, 305, -340, -764, -244, 488, 633, 83, -581, -512, 277, 519, -144, -560, -754, -218]
2191b18N44M0o27l55L99O90J19n25n34r1N63L05l01o72l5M60O13j11m13k74L09
2212a14O13K49n08m87JN16K69k70o32j51L81O79j13m81k69J88N14K38m29m65j06
2233c77N71K82j94n48l93N45M76Nn37l49J73O82N9k65l97j06M00L52j41n33n49
2254h44N02N73ln49l06L16N27J73j96m13j58N38K74j87m41j95J36N52J05l59n28
2275d83Q3O47K30k88m57j98N12K92O9m58l67K43M75K71l83l47RM03L31k92n02
2296b10j30L25K12J85m91l12P1N42J60l33n13K3N65K43o7o53j15L49N08n9k53
2317D7m10J24N04K58l49n52k3M19K43j23n78p7J85N37J36m37k25J15L91M80m09
2338B56n47k41N65L73j72n32k17L39N52J74m72l75R3O18K21l56m58j37L60M96
$$ y = [-218, 326, 366, -261, -616, -217, 473, 592, 67, -467, -558, 5, 310, 9, -663, -698, -238, 375, 264, -149, -423, -114, 499, 748, 240, -247, -246, 270, 539, 269, -363, -514, -133, 546, 433, -48, -317, -129, 385, 623, 194, -271, -377, 194, 476, 282, -266, -659, -114, 362, 367, -170, -519, -346, 336, 395, 130, -267, -373, 27, 379, 238, -295, -844, -342, 231, 228, -321, -627, -311, 216, 389, 193, -220, -378, 160, 434, 247, -194, -389, -253, 299, 404, 45, -483, -400, 247, 477, 189, -268, -466, 46, 338, 407, -51, -418, -175, 300, 571, 188, -159, -150, 253, 584, 292, -210, -340, -15, 197, 382, -109, -421, -350, 192, 352, 19, -494, -471, 94, 337, 270, -383, -498, -149, 359, 300, 47, -363, -239, 265, 523, 174, -378, -401, 18, 261, 138, -440, -517, -332, 205, 341, -96, -321, -206, 185, 665, 256, -291, -532, 33, 406, 234, -298, -515, -176, 376, 550, 78, -297, -204, 414, 635, 279, -179, -316, 44, 540]
2358E40k14m57l66L25M48J96m16m14J46M05K60l46l31j26L89M60k78n35j43K33
2378b24M20P3k15m00J58K67N10m28n25j0L50N44n41k64l06K80M55J51j27n26J71
2399a87M75L50m21l87j42L72L25k15m51j21N6N92L1k62k52%O04J11k93m17l3L93
2421A28K53j73m15n5K18L68q0k96k64RM85J28k23k07l3J03K37k11k63KJ01L95
2443B07J51m01j35M8L45Q9k74k66p5K63L35j82l28n1K34K17m1k76l8J38J58J02
2465B20k39k12P2K30lJ7j76q7J86K65o8j61j37n7K78R4k12j55P4K1J67m1l60J56
2489a28J54L5K13l01q0PK22m4j03j22j4J62R5n6j46jJ3J67J35j43j91L1K10M0
2513A55j85j89P1R8J74k26M8j00K16K19j53r3p7J06R2j17n1j05j11J82l9o3j7
$$ y = [540, 326, -131, -497, -172, 276, 472, 56, -358, -212, 193, 453, 107, -224, -350, 39, 499, 221, -314, -457, -224, 196, 269, 54, -346, -188, 79, 589, 161, -364, -374, -24, 520, -21, -285, -591, -311, 144, 295, 168, -358, -187, 288, 638, 217, -170, -312, 60, 385, 170, -281, -402, -346, 246, 277, 15, -237, -237, 367, 478, 185, -232, -265, 128, 381, 208, -207, -262, -44, 324, 244, -52, -316, -307, 178, 306, 83, -124, -157, -54, 183, -28, -291, -289, -188, 207, 358, -43, -178, -130, 215, 304, 30, -236, -311, -48, 287, 105, -223, -274, -40, 177, 136, -140, -178, -40, 118, 220, -19, -231, -159, 71, 68, 85, -91, -178, 8, 273, 205, 44, -93, -150, 128, 222, 10, -145, -71, -50, 117, 76, -284, -128, 26, 61, 274, -27, -107, -100, 122, 78, -25, -147, -161, 1, 96, 40, -106, -107, -94, 73, 208, 65, -126, -95, 115, 155, -30, -219, -148, -50, 124, -102, -54, -154, 62, 281, 128, 35, -42, 64, 156, 39, -12, -117, -228, -46, -85, -148, -165]
2536a65j0J85k2J33j46p3Q7j0J27j65J12j86K14m7q8J01J0L2j18O2j11L8NK4n7
2561f8p7K6j4J27K5J34j25j7M9J75k91N5J46j0j86qNm9J13k5m4p3J08J04qj04
2587c2K23j49P2j48P8k7k4O0J1K3j2j71L9J50Q3k16j52J80J39j85Q1r2k8J66l1
2612C8j16L0P9K1J05n8p7j74QK13N5j04j44K3J66m0j3o0M9K6Q0M8j45j32J22k9
2638b9m6k2m5J27J8Q0M4q6q4J36J19J3j18j42O3N1o2k29J78q8Q1J47n3p8J1P9
2664F5j1L2p1j45O2l0J97j47l7n2P1J04J14j78k4R2N8n9Rj40l8J66K4j18j65J13
2690a08Q9Q7N5r7o0J18O3K02l79Q4j68P2J13k4k83J02J11P5J16k20k6J35O8N3
2714A78l7j49l5M3Q7m1j09j55J87J14J19l10J6K8R2Q0m9j74p7J01J59L8l40Q5
$$ y = [-165, -175, 10, -12, 121, -25, -98, -11, -21, 106, -59, 53, -133, 81, 34, -54, 47, 57, 89, -29, 33, -78, -40, -35, -11, -68, -145, -119, -133, -6, 19, 153, 28, 11, 60, 235, -56, -1, 145, 135, -51, -59, -54, -103, 10, -15, -59, -132, -24, 80, 72, -32, 191, 42, 114, -34, 44, 17, -7, 53, 64, 87, 75, -96, -57, 93, 176, -40, -192, -12, 127, -58, 23, -69, -97, 69, 38, -78, -48, 31, 52, 157, 99, 22, -152, -144, 69, 124, 20, -124, -101, 65, 25, 12, -48, 1, 27, 107, 155, 10, -122, 0, -29, -75, -97, -142, -15, 3, 83, 127, 41, -43, 93, 212, 225, 107, -35, 28, 79, 17, -212, -34, -122, -41, 106, 53, -25, -14, 65, 54, 86, 15, -130, -68, -98, 99, -48, -85, -137, -66, 38, 152, -26, -50, 42, 100, 41, 50, -90, -128, 38, 62, -56, -221, -108, -19, 68, 123, 26, -34, 84, 147, 349, -30, 54, -114, -42, 71, 47, -236, -134, -23, 52, 168, -52, -78, 57, 125, 178, 141, -8, -43, 0, 87, 46, -63, -218, -31, 83, 202, -108, -92, -64, 28, 108, 59, -115, -192, -91, 68, 106, -234, -149]
2738a49j2J81J62j59j72M8J72L2j4k20N0J50L4l3j59n4J45J90j31n4k09J48J55
2761A01N5r0k14k8N0K66O5k63q9J01J84Pn0j75j9K94p4J00j07k29K04J07O9l33
2785f8j98J33J23J31j95j55p7K37K10j66k16J26J30J47p2j34j54J22M12n3l36
2806e3p7o1J61K33j12l53n6J78J87J61k66j86K15J47O1k26j64P4O1L74j30l86
2828b18j09K13K96M6k63j49J39K40O5k07k52J07K61J12j81l75p1K14L93J2l04
2849c1j53P8M67L6l86k67l4K88K40l22j97j84L25J98J52l26k75K77K86L34m79
2870B7l48M4K49J53j46j82p2J83L46J05l51k07J39K40K05m21k15L7M16M5J1m01
2892a43n3J17L09M6j59m63K00L37J71k46k84r2L38K92k11l99j45K48M34Kl41j64
$$ y = [-149, -161, 20, 182, 23, -149, -101, 71, 103, 89, -131, -81, 69, 103, 70, -89, -143, 2, 192, 61, 7, -202, -54, 101, 156, 66, -148, -176, -126, 140, 205, -58, -147, -46, 138, 145, 95, -80, -99, 195, 121, 221, 114, -115, 89, 196, 265, -68, -266, -133, -10, 121, -74, -229, -306, -69, 141, -25, -241, -115, 15, 162, 90, -44, -198, -76, 336, 283, -53, -130, -191, -30, 203, 91, -262, -318, -140, 47, 208, -58, -244, -29, 118, 179, -47, -211, -137, -76, 298, 168, -218, -327, -114, 182, 228, -35, -184, -45, 195, 260, 53, -199, -92, 169, 281, 100, -275, -346, -132, 261, 273, -31, -184, -106, 361, 397, 11, -256, -290, -2, 238, -84, -281, -465, -140, 58, 210, -116, -391, -114, 172, 506, 27, -321, -277, -28, 125, -21, -203, -275, -92, 254, 359, 8, -199, -60, 180, 385, -36, -251, -214, 202, 247, 258, -143, -196, -79, 230, 276, 117, -346, -146, 191, 362, 116, -168, -260, 78, 370, 159, -240, -385, -137, 297, 299, -42, -206]
2914b06J45K59O5k05l03J9L21J9%k01j98Q4L48qj13k17Q5J83R5p3k56RK19P0j01
2939D0k05m6L18Q3Lj62k49J29K61P9j26l16M9K29L16k79j94j24J44K31P4l14r4
2962a53N3J09L23k70l75J20J44L20r1k01j54K06K39K0l71k10J49K71J20j65j30
2983d6k01K49J71R0l65j33J36K60jj04l17QL19J43j00l04q0L26K82j65j10l02
3005b44L72J12kj47k93L2J69L39k51k10K0Q5J20J61l64l6P7K18M0j86k12o3K67
3028DJ72Ml40k2R8K86j21j27j16q6L79P6k67j72J47J34J66m7k55k02J80K63K08
3051C62l33j91J51J42J15j28k17j16J31K22Mj69j65l8L55Q7k61l8j11L35Or1q8
3074c6j44J20L31j20l32n1J90J20K01l06j06k9L34P0k21j81m7J83K46M8m04r7
$$ y = [-206, -61, 198, 263, 58, -245, -226, 95, 114, 114, -87, -285, -201, 147, 139, 26, -191, -106, 77, 172, 99, -157, -148, 71, 141, 40, -165, -211, 107, 190, 193, 31, -218, -89, 172, 251, 125, -191, -142, 87, 403, 124, -70, -194, -50, 181, 255, -59, -153, -100, 9, 332, 62, -313, -193, -49, 271, 180, -21, -175, 31, 270, 290, -81, -291, -142, 129, 249, 84, -46, -247, 2, 173, 263, -102, -235, -99, 161, 160, 56, -261, -253, 66, 209, 109, -195, -275, 51, 333, 168, 58, -244, 128, 240, 238, 91, -202, -170, -1, 338, 87, -123, -103, -18, 102, 263, -101, -137, -60, 158, 198, 12, -200, -263, 4, 176, 180, -160, -182, -84, 202, 81, -46, -162, -248, 131, 207, -60, -232, -85, 49, 215, 168, -87, -289, -109, 154, 362, 29, -162, -11, 131, 246, 118, -99, -215, -84, 138, 142, -27, -192, -230, 125, 212, -49, -87, -198, 137, 143, 52, -36, -180, -60, 271, 151, -181, -232, -42, 78, 279, -27, -133, -162, 172, 242, 21, -160, -207, -24, 222, 270, -134, -231]
3096b31J77J82p9j1k47J28J57J01o3j21k14R6L41k5j77j55Q1J36Q1k08j73L8K05
3119A9J71n7k28k31L67R1Lk40r0L00j7P7p8k91j03M52K5j46r2j30J52R8O3k48
3143a33p6J35K25M4j46k13mK53J11j28j95r2J23L28o3j89k40PM66J5k41k27j2
3166b52L11R3m0l17N6jK78J0j28j14m1L12J06j27k68j08L24Q8j38j48j16J12K65
3189A57j01j16j27J20Q3O7K4j03n2R3J04j33l1j30j4L52L4l00j05J06J18J27j65
3212Hj86K9K73k5M9k77O3k1J05J21o4k53J39K26K3l00kK7J06J97j45l13K1J97
3236bK49k63O8j50k6J44J22j81o6L2N8K46j61j52j4J17p0K20k26m7J9K29P8k25
3260ap0j03K28M6Q8k10p4Q3J28o2P8k63Q8J22N8L8k29j01M5K25q3j4j24J54N3
$$ y = [-231, -54, 128, 49, 38, -209, -81, 76, 177, 114, -7, -221, -125, 216, 191, 14, -141, -60, 76, 157, -51, -224, -186, 19, 190, 133, -95, -326, 41, 132, 135, -105, -195, 105, 88, 165, 87, -204, -307, 145, 170, 24, -68, -198, -46, 52, 115, -133, -209, -74, 151, 195, 49, -164, -168, 85, 196, 68, -127, -219, -96, 232, 169, -20, -260, -253, 213, 228, -13, -240, -252, 59, 152, 112, -205, -149, -150, 128, 138, 10, -104, -145, 167, 273, 146, -122, -230, 94, 182, 44, -104, -220, -108, 157, 56, -60, -187, -67, 16, 83, 107, 4, -48, 45, 149, 16, -15, -145, -159, 193, 227, -73, -178, -72, 46, 173, 8, -178, -149, 124, 99, 148, -129, -66, -87, 18, 139, 75, -178, -39, 187, 210, -90, -92, -65, 41, 238, 93, -220, -199, -2, 247, -16, 52, -98, -124, 20, 142, -39, -105, -73, -15, 231, 70, -82, -96, 21, -49, 171, -55, -102, -83, 146, 224, -1, -71, -174, 54, 100, 188, -22, -96, -13, 115, 53, 131, -132, -44, 78, 136, 174, -55, -156, -111, 114, 31, 17, -107, 47, 100]
3285A00K4j80j05J38L6J94l78J12m8O7O1J17j11j72N7K95q4j24lj3M7j14p3J43
3309a4p5o7K64p2k2r4K8R2L0M3j74l4J28j6p6J5l3M5rj8J14j04K1J53j8n5j22
3336g0J02l3J1j8j4o9P2k2L7r5J08n1RJ78k06K7K0Mn0kn8J55j9PL5j9j01J27p8
3365a3K0P7k85J01J24q5k7M2O6p1lJ92j35k5J47j51J16j29J0L9J7P6k5j06J9q
3391a7L3K7j29P5P1r4J4lll3M6J11L5p8J90l52L8J98j72P4K4l5m2J6l0K9l0n3
3419i0K4R5p8j72J78Q1M6p1O4r8J1P0lrj04K3m5M1j1n8M2J14j21J49k55K41o8
3446dO8P6k4q7j2o0KR8K0q4K3m2O6p7J9Kl9J5L9R0j31j9J30r5J08o6q7J62m3j50
3476a02nJ48J2mp4l3L5q2J32j3p3J05j6LJ7l6j6l7nJ9j36K48L5j82J25k3q2J38
$$ y = [100, 124, -56, -161, -23, 13, 207, -171, -59, -107, -40, 21, 138, 27, -145, -88, 207, 123, -1, -4, -17, 30, -84, -157, -14, -89, -156, 108, 36, 14, -80, -52, 40, 70, 113, -61, -95, 33, 17, -59, -44, -77, -32, -41, -59, 55, -49, -28, 125, 107, 52, -70, 32, -1, 10, -8, -22, -91, -19, -41, -4, -99, 9, -42, -33, 145, -61, -34, -14, -10, -60, -62, -120, 35, 16, 23, 58, 39, -62, 65, -13, 7, 84, -201, -100, 24, -61, -88, -46, 20, -51, -54, 138, 3, -22, 125, -26, 90, -39, -29, 10, 27, 103, 78, -28, -9, -17, 16, 43, -86, -11, 60, -34, -20, -23, -26, -59, -13, 98, 133, 55, 245, -107, -69, 129, -43, 31, 55, 20, -22, -6, -36, -7, -37, -90, -66, 29, -49, -221, -43, 38, 84, 13, 77, -21, -10, 60, 57, 48, -56, -33, -78, -37, -48, -106, -64, 50, -71, 78, -177, 64, -4, 64, 140, 116, 29, 17, -43, -41, 57, 77, -7, 16, -26, 40, -37, -18, -16, -55, -40, -1, 89, -42, -61, 69, -26, 82, 16, -71, 91, 48, -102, -107, 41, 53, 49, -25, -58, -23, -105, 27, 14, -59, 46, 30, 33, 50, 14, -2, -39, -44, -25, -161, 87, 122, -60, 65, 42, -40, 98]
3504I8r4N3l5M1r2KM9M5j54N7K5k2J4j0N4o7J37j32M2L8j39LO1nR4j6p0n5J11
3533C3n0P5o3m5j03J57P3o1n6n8M0M7L6o1m6J6Q1R9j42Q7j86K10k08J40L2j35
3559h8R6J71o2k31N7m1J60K9r9k6J2j00K15j21L0n1P7m6O8j04n7L0K2L3N2r4J41
3586G3q1L5L3q0k8N2o0J52j4l68J87J69o9j03JO3r7J88J33k23pl4O6R9j26N2J4
3613B7M4J2j42k3K4J38k5j08J15j85P9O2MK9k06O2J35J15m0j32J8jJ48n3j6j97
3639a16L8R9m4m6j18J44oJ30k6k04mJ37l1R0j52n0J54kJ01mj77LJ76j3l8j90J13
3666c6j1L4Q5j00j31R6L6L6k2J28j20M8Oq5l4NJ5J17p1m9J5n8P3J63j44M1k11
3693a74L57p9j88J6O4P3n1Q0j10r9J42N6Qj37k3L3q9J82q3p9O4P2rR9j62N0P0
$$ y = [98, 4, 57, 22, 63, -29, -27, 22, 67, -87, -30, -5, -27, -13, -23, 31, -36, 101, -31, 11, 49, -90, -87, -26, -31, 63, 47, -23, -78, 33, -17, 58, -5, -50, -153, 4, 77, 16, -40, -98, -58, -11, 25, -36, -82, -66, 15, 114, -28, 59, -127, 83, -125, 15, 47, -88, 8, 179, 117, -114, -57, -98, 62, 91, -8, -34, -22, -122, 93, -28, 2, -49, 28, -18, 50, -54, -111, -81, -59, -26, 26, -68, 73, -8, 27, 60, -20, -48, 4, -56, 96, 82, -286, -99, 70, 1, -102, -101, -38, -135, 53, 186, -37, -44, -78, -12, 87, -39, 13, 27, 71, 83, -59, -82, -58, 80, 55, -53, 62, -123, -44, 18, 22, 51, -155, -93, 42, 157, 117, -15, 3, 2, 150, 97, 81, -116, -78, 21, -23, -69, -187, -43, -49, 81, 55, -149, -153, -16, -47, 43, -109, -159, -5, -7, 94, 90, -87, -84, 92, 79, 41, -149, -36, -47, -13, 72, -28, -159, -63, -27, 9, -13, 115, -5, 43, 49, -36, -70, -65, -50, 67, -4, -53, -38, -96, -23, 140, -4, 37, -174, 183, 104, -84, -68, -4, 69, 18, 98, -12, -111, 31, 87, 95, -42, -65, -32, -121, 61, -22, -101, -37, 35, 26, 125, -37, 13, 83]
3720H3j05J7L3j0j10P9PQ1q7O9K9PJ67k73r7R3R8or7k1k3J92p3n9K9j27M5J20
3748F1M8k05l4K6K15P0k17O7p5J54k8n5P0j47l3R8J04j75J1M3l0M3K6r8L9j8N4
3775A4m9k8j0k3J2J37J6k11J11l8J53l5k3k12K19J0n7N4j86K01o9Q3r8q7p4K77
3801H7p0R6j75j8O0K05j67K6j44J30pN1j57K0N2p9K45r1j63n8J23P6J2j10mPJ81
3828A28j19m1J38q2m2o0J80o0o4J4M4m6L9K7r8l3J65j03m7JJ65r6j05O4r4P1J98
3855A44j1n4j0j4K8kj17n3N6J7J04j50oJ08N9j81J48%j25L8P2k7r7m7Q8J1Q0k5
3883C4j30j0o6J86j4M7j05qQ8o6l1m7J89K5m4k3k8j05O9P3mj37J18J1p6J51jj55
3911e9L4j1J85p0q2pM3OJ73j58J2J6j32N3M1k01J16OP3k03N0N3n0Q0m4r7J61j24
$$ y = [83, -22, -5, 28, 18, -92, -13, -6, 75, -12, 57, 86, 93, 260, -13, -110, -17, 81, 75, -22, -43, -66, 126, 53, -6, 23, -104, -59, 61, 109, -96, -130, -104, 111, 181, -36, 31, -44, 110, 82, 27, 97, -50, -83, 15, 119, -56, -45, -2, -32, 11, 37, -61, -22, -40, 14, -35, -63, -73, -96, -84, 53, 69, -142, -31, -69, 84, 49, 26, -186, 33, 43, -14, 40, -146, 55, -14, 69, -29, -116, -190, 87, 17, 113, -62, -80, -20, 185, 18, 44, -100, 30, 23, 74, -83, -63, -11, -90, 155, 64, -99, -157, -34, 42, 54, -56, -60, -53, 128, 9, -32, 106, 24, -18, -78, 102, 42, -22, -8, 36, -10, 29, 56, -42, -75, 90, -13, -60, -59, 106, 10, -95, -31, -125, -54, 144, 133, 79, 69, 55, 83, 81, -36, -89, -33, -16, 88, -62, -68, 40, 99, -82, 66, 66, -59, -21, 51, 24, -73, -120, -32, -21, 59, 34, -96, -106, -172, 14, 0, 47, -58, -66, 22, -44, -75, -122, 67, 92, 48, 25, -3, -108, -39, 34, 30, -107, 11, 22, -54, 97, 96, -59, -25, -36, 149, 79, -3, -10, 33, 39, 212, 54, 66, 82, -50, 3, 44, -157, -41, -35, 38, -165, -115, -62, -112, -32, -76, -173, -12, -136]
3939a36L5J27L4o5o5J12r4Q1n4O8j21M7l5J55q4n5m7K18j19o4Pn5J75p3n8O5j15
3966a16m6K71j16O5q6K03o6k29K14r1O2Q9k60Q4o9ML5O1J13o5j03k3N0m6J39l0
3992D4r5J45o2o5M4O5l0lr2N0k3j11Q4O0J4j55J40l7M6l4J6Pj47K62j40m7Q2l3
4020a5N3K4l0qj2o5N5j19Q7J55j66l3Q7J0l8j32K29j18%R3j0j29M6mk2J5M5j6
4048a8NJ11j65N3pPqJ07p6j69J93j4q5J5L4L4p1j6R0o0J2J17l8j76K0J23N8o5
4076A1l5l4P4J00j19n9R8j72R9J18m9k3k04R7J98l6k2j57k4J89J4J3j70J66n9
4101A4l4k7k9L9n4J75n0M2M0q7o4J35j16K6j1J79l10J66p9M5j2J2R3j30L3k4J1
4128a7J07j64KL0j1Q4k8k0m6r9J06J85q3k8J9r8J24j20P3L0J0l6Qr5k8J19K0P2
$$ y = [-136, -101, 26, 60, -5, -70, 42, -52, 29, -25, 43, -78, -31, -66, 89, 5, -50, -97, 121, 2, -62, -55, -110, 65, -8, -66, -1, -116, -162, 109, -7, 58, -28, 175, 109, -120, 94, 3, 65, 154, -106, -22, -91, -87, -52, 9, 122, 57, -46, -69, -19, -65, 74, 44, -51, 94, 32, -33, 11, 76, 46, 43, -49, 1, -22, -133, -49, 11, 25, -130, 10, -27, 19, -15, 1, 8, -139, 123, -17, -64, 18, -15, 38, 62, 32, 24, 12, -53, 2, -117, -30, 125, -41, -74, 13, 23, -15, -147, 82, -36, -36, 57, 47, -82, -36, -40, -62, -47, -2, -18, -13, 98, -67, -14, -21, -14, -22, 85, 9, -160, 33, 19, -66, -51, -17, 17, -54, -70, 20, -40, -28, 89, 51, -125, -105, 18, 76, 11, -24, -58, 16, 116, -3, -62, 36, -136, -37, 81, 32, 9, -195, -98, 100, 64, 42, -115, -139, 50, 64, 77, -93, 73, 14, -20, -47, -76, -37, -91, 84, 34, 76, 116, 29, -35, 100, -16, 10, -1, 178, -132, 34, -45, 0, -12, 0, 93, -37, -4, -28, -17, 90, -74, -72, -42, -53, 31, 3, -17, -63, -162, -56, 129, 46, 18, 37, -61, 63, -57, 16, 46, 56, 20, 28, -67, -95, 24, 44, 116]
4156A16j43q2j4J5J47o6j7J1J00o6R2j38jO8k9J27j81J47j27LP4K2j0r7N6r2J28
4183D3Q5j45Jo0P4k2R5n9n8P0J4j7lK3j49J26K3J7r7L3n5L4k7M3q1J94j02J33
4211A33j18J5N8q1j10R1m5O2k8K7j94J65k6k5J57j55N1p2R8L7j08J32p9Q3o7J2
4237A3Q1m9lM9Q4l35K44j11m3M3l2qM0j34J20J23p3L3m9K9J37K6k22o9N0lJ25
4264F6q2M9l8R9j32L9J38k45K13j09o9J82k59J41K9J00op4q5J08n7n9J9j00K1
4289a11L7J49o2j08K28p1p4ok0O0K22k34o5J12j35L1J11K8J14j73jJ52m1q0r1
4314b8q5J82n5J56k39J62j27j2J46j95nJ05L7K9k2p7P1L2m8k3J21j32M8j87J14
4339c2jL7M3r2M1N9M2j23M0m1k9J53p8K1K1k40K24j72L6K8N4n9O9r2N5k9R0r7
$$ y = [116, -27, -109, -123, -108, 39, -27, -44, -33, 67, 1, 93, -45, -46, 22, -7, 120, -61, 86, -41, -38, 36, 58, 48, -49, 7, -85, 43, 128, -17, -16, -76, -2, -24, 71, 12, -46, 24, 38, 21, 18, 41, -108, 18, 41, 58, -39, -6, -61, -27, -54, -11, -92, 102, 0, 133, 15, 30, 88, 7, -103, -12, -57, 5, -23, 4, -190, -25, -51, -76, 81, -74, -23, -95, 3, 40, -68, 64, -15, 68, 1, 13, 94, 45, 42, 91, 175, -160, 84, -27, -70, -27, -59, -67, -27, -161, -41, 82, 9, 42, -7, 22, 159, 185, -37, -106, -56, -59, 66, -16, 33, -5, 94, -38, 1, 139, -106, 107, -2, -71, 111, -148, -7, 22, 122, 116, 42, -43, 65, 8, -51, -32, -132, -111, -74, 75, 13, -95, 133, 62, -12, -18, -38, 22, 244, 10, -55, 57, -78, -47, 64, 92, 206, 33, 32, 184, 143, 63, -28, -113, 69, 14, 170, -69, 93, -34, -46, 100, -95, -100, 5, 42, 71, 49, -28, 43, 75, 27, 4, 125, -7, 41, -146, -32, -33, 4, 47, -45, -4, 55, 97, -26, 14, -27, -56, 97, 19, 40, 61, -179, 45, -127, -91, -63, -9, -68, 1, -91, -36, -65, 25, -72]
4367g2J16l9Q3Q8k38P8Oj05J01n2O7o7l7J50j22L4O2j22oJ18j11m4k7J95j72J87
4393G1J9j86M4L3L7k0J3L0l1j41J03Ol9m4L0Q0m3J7o1N0j6J24j25j49K16Rj8L2
4421D1J9J7p7l8J17l8O9j18j8J00q9L8kj21J26j13J85j18N7j05J00o6P2m8J9k9
4447b0J42k94J17j1P4n6J45j92J40k3j88J35M7O4p5L9r7O6q1M7j7Q9r3J5r1J30
4473A2k8N1Q8k49K04n8Q0o9m5O3n0J28q5j43M2J46j31N8k5kl6k3P9N2j37j9N7
4500d0J63k6r7L0r0m2J11J9l6M0j20L5J47q0p3J60j51r7K10l3j4On4j3J28j16
4526c3M6r1M3Q0j06J03j30pk2K60o7Q%j02J09j17OO1k5r5J94m5l7M4m5r2J16j68
4554a12j2J13J42r9j31J42l5J01j70J17m4n%oN9J3q7j16J36J29n9j70J05m0M9
$$ y = [-72, 44, 5, 88, 176, -62, 16, 22, -83, 18, -34, 33, -34, -71, 79, -43, -9, 53, -69, -75, 43, -68, -112, -139, 56, -116, 71, 90, -96, -52, -19, 18, -2, 11, 41, 10, -131, -28, -22, -61, -105, -75, 5, -38, -21, -82, -32, -48, 76, -49, -198, 18, 27, 9, 41, 60, 77, 0, -38, 79, 41, 110, -8, -26, 74, -15, 23, 21, -100, 26, -87, 98, -20, 37, -68, 32, -34, 38, -10, 9, -20, 122, -172, -55, -66, 8, -48, 97, -95, 45, 22, -166, -31, 16, 80, 5, 44, -53, 13, -68, -21, -38, 51, -42, -27, -118, 12, -16, 35, 123, -126, 78, 20, 100, 31, -14, 49, -1, 127, 42, -101, -59, 87, -44, 14, -11, -13, -49, -72, 7, 59, -78, -97, -40, 123, 97, 0, 30, -60, -102, 9, 28, -8, 32, -88, -53, 94, 14, -59, 101, -50, -147, 63, 30, 16, 22, -32, -45, 83, -33, 13, -78, -35, 45, -61, 42, -88, -95, -117, 143, 76, 84, 84, -18, 91, -26, -20, 41, 16, -79, 115, 70, 33, 77, 32, -60, 56, -112, -124, -11, 131, 32, -99, 43, 8, 109, -61, 56, 12, 7, 7, 1, 60, 73, -14, -130, 6, 135, 76, -94, 11, -29, 20]
4579B0j06O8M9m3j46J92k5J87j26j18L2M1Nm7q7L5J16k3L7j09J8lQ0LM2r4Mk1
4607a9J1j0M1L3q2M2O8%j05N3j8L3M0n9n5J07j47R0mn1L5pN2j54J65j46R0j60
4635a57K07r3jO1j5Op9m4J95r5O2j70O1Q6j5J54n3j60K17q0j88j9R3k3j9R2p8
4662e5L6Jj6Kk9OM5M1J3l5j7K6j0o0L2M5q8k2K10j26KJ56j34n6L3J37j04j42J82
4691G3r1Q8j44O5J14j39J71j08q1R9o3j3J18j32J5N3r6J54r9K7N6l7J2o6R6j2
4717F0n1P9p1Ro9KK40k07J15j88J42r7J61m9nj74J32l1K0j66R4L3m1J07q9M7P3
4744G6NJ6j54J33j75J00l3J28n8M8r7j0Nj4J60k19J65j16RJ9K6j66K36q5J46j50
4770eJ37n7j08m1J8J15p6j01K40r6p7J09N1r0No1K3ko4J48j17P0j08M7P4P9m6
$$ y = [20, -86, -18, 31, -12, -158, 34, 9, 196, 70, -48, -16, 25, 30, -17, -104, -69, 47, 24, 61, -48, -30, -33, 47, 50, 92, -2, 2, -19, -8, -18, 23, 56, -26, 16, 84, 84, -21, 32, 14, 47, 87, 28, -27, 80, -67, 23, 19, -32, 3, -4, 48, -106, 59, -87, 3, -157, 50, -43, -44, 17, 2, 8, -71, -115, 80, -15, 47, -123, -62, 24, 9, 163, 110, -50, 167, 87, -101, -120, -27, -50, -69, 23, -55, -19, -18, -34, -32, -61, -55, -10, 31, 44, 9, -8, 18, 8, -52, -20, 25, -63, -85, 125, -1, 1, 157, 23, -33, 0, 137, 33, -109, 73, -18, 70, -74, -9, 105, -34, 137, 29, -52, 47, -16, -29, 89, -43, -28, 25, -71, 83, -16, 11, 67, 30, 42, -24, 72, 60, 9, 88, 17, 26, -43, -41, 199, -8, 107, -81, 61, -36, 125, 76, 71, -103, 29, -2, 18, -148, -54, -21, -62, 45, -44, 3, 76, 81, 97, -57, 76, -99, 1, -32, 96, 38, 86, -11, -21, -16, -30, 130, -89, 76, -40, -31, -12, 14, -152, 84, -1, 145, -5, 132, 75, -33, -74, -56, 59, -17, -118, 122, 26, -51, 58, 109, 19, 24, -37, -14, -16, -80, 68, -49, 21, -87, -40, 34, 113, 67]
4797F7m5j24Q4j6j5J8N5m8j4N2q8J22p9j0K9J07r0m4m0J18Lj05Q4j44J27JJ8q0
4825e7N1M7j09O8m4M8l6K8j7j06L8Q6K9N9lj15P4n8J06o4q1J60k18J08K9Q1K9
4852A33j90oJJK5k2M3kNl3N4M1j6o2R5j3k0j34J88k00Q8M8R6k9q1L4m4J26oj54
4882c4PM7po0O7Mm1K0q8Q4o3k2pJ13L7j3l8m1J94j68N2j57L3R3k8R0j44J44o3
4911A1N9L2j30k8p0L6J77j68J01l6j8K4n1J06r9o1O5J28n1n0mPjj5K5nl5J7Q2
4940D8n7k6M8m0N0J06k96J74M6m2R6k27J01P0o2NP0r9RQ4j02R9j46J46k25J79
4966IN8q2J8J6O3j01m0J3P1j26J37j58J20n5O1J9n0L6m6Q0k8J8j37J36M4j06K6
4993dM5Rp4P8n3k3K2m9n2R1M1p0P5o0K5M1j04J3P9j33J92j44J33nJ4j34Nj1Pk2
$$ y = [67, 22, -102, -18, -34, -49, -31, 24, -24, -38, 14, -74, 48, -31, -41, -12, 95, 5, -39, -79, 39, 42, -63, 21, -123, 4, 5, 23, -57, -6, 41, -68, 0, -44, 4, -32, -4, -21, -127, -89, -3, 26, 85, 82, -33, 41, -17, 89, 25, -56, 104, -114, -6, 23, 104, 133, -57, -63, -62, -61, -36, -58, -15, -17, -12, -45, 9, 50, 34, -28, 67, 54, 34, -100, 88, -112, -24, 24, 120, 91, 10, 44, 0, 126, 120, -34, -27, 20, 13, -47, 20, 24, -17, 3, -85, -1, -64, -86, -93, 20, 57, 44, 6, -35, 159, -9, 43, -114, -81, 12, -16, 74, -70, 74, 11, 70, 102, -28, -56, -126, -90, 87, -81, 20, -16, -34, -10, -61, 45, -54, -115, -50, 78, 27, -23, -27, -20, -21, -36, -11, -16, -51, -34, 48, -9, -35, 13, -27, 23, 129, -167, 7, 53, 11, 107, -120, -19, 51, -11, -6, 64, -35, -26, 58, -44, 55, -91, 55, -170, 9, 67, -15, 3, 19, 82, -19, -59, -46, 25, -101, 36, -122, -2, -57, 4, 23, -27, 9, -37, 43, 15, 33, -104, 32, 76, -30, -4, 41, 50, -24, 54, 1, -22, 0, -49, -101, -10, 31, -39, 36, -24, 1, 42, -62, -49, 30, -103, 89, -55, 78, 73, 87, -47, -42, -53, -46, -68]
5023f8Q4k9J68j94K5M5l9m8R0k3lJ0q3n0J79n7q7J60r5N9m6r1J22K6m0k9j8O1
5051B9j11O6J5m2rJ19Q4k5l46K98l7j69Q0n7R7R4j19K7n4O5L8j01J27j58K25r7
5077C9j24RK6N2ljK7J5o8N2m2n1J05j42J59j52N5Q6J2j16k8NJ63Lm5j35J19jl6
5106a7P4n6p6M4J25p1ko4J34j49J6O9n4R8Q7j86l7R0O0k32J40p3K6L6l3J23m7
5133B5o2j6O2oN8M4q7p4j0M0j4L2k4O5l4PM5Q5r2J9L0j92O1K6k4k5M5P8m3r9J57
5164G7j32L0k5OO6o4k2O9J29j69M9j9j8l0J11n1J11j39j05M7R1O1j22J32j02j17
5190a36K09j37j1M2O5k6p1P4k3P2j22Q2lJ1n4jMl5J06p8m6J03j0p5k2N7%O4j5
5219B4j28K8J10OK6J2j20o5J44o6J38j8j01M1nq6N0Ll1Q1j09J5Q0J3j25J62Pj73
$$ y = [-68, 16, -13, 155, -39, -14, 31, -8, -56, 34, 11, 8, 18, -65, -115, 64, 7, -80, 80, -15, 44, -2, -93, 29, 55, 15, -14, -32, 29, -82, -16, -1, -43, -52, 67, 151, 126, -220, 78, 41, -128, -48, -105, -8, 86, -33, -6, -60, 5, 43, -58, 69, -89, 136, 39, -85, -76, -50, 2, -1, -2, 25, 40, -28, 24, -18, -69, 36, -106, 53, -99, -44, 42, 54, -62, -90, -85, 78, 81, 36, -99, 20, 19, -17, 57, 1, -75, -31, 94, 23, 21, -43, 91, -58, -42, 27, -27, 71, 158, -28, -65, 25, 85, -147, -7, -80, -54, -18, -51, 72, 25, -37, -53, 9, 3, 61, 105, 18, -56, -66, -26, -40, -8, -32, 33, -1, 6, 51, 136, 44, 63, 93, -99, -38, -12, -36, -61, -16, 62, 19, -80, 77, -55, -25, -50, -44, 22, -42, -64, 5, 134, -35, 14, -5, -23, -53, 58, 7, 118, -21, -126, -79, 12, 73, -49, 83, -19, -136, 73, -64, -75, -33, 32, 6, -65, 9, -14, 58, -64, 18, 15, 26, -28, -29, -25, -60, 46, -32, -78, 25, 15, -60, -82, -25, -25, 39, 24, -104, -76, 34, 40, 66, 78, -42, -107, 37, -29, 109, 91, -10, 31, 26, -60, -10, -7, -38, 43, -66, -51, 29, 42, -83, 79, 86, -87]
5247h7N3O1n8m2K1Q0J4P0p2Lj64J15j9l2O1q0J32Ok04MN6O7N6K7j56J44j30J31
5275E7j36R2Om5J32q9j00Q3j52J89J24j86q7J37N8j61L2p8O0M7j8J14K1n9k28
5300a87P7q6J80nJ1m0J46q0q3M1O1j83J34L8l4N5n0r5O2ML7j27P1P7m8pk2R0j16
5329g9KJ68p3R7j27K9j58K13l4m6n7O6no9rJ37l1J01p1m5R7k62R3Q7q2J36o6R5
5357A07j03j23J75j54R8j16J73m7O2r6QJ0Q2r8O1pm5j57K53j65P8k9j00L09j02
5382G4mr9K0J04m7n7j7O5o1j64J94k8kJ1M7pk8J2Q3j32k7J69n8o2J4N0j15J17
5410E2J2q0n1L8J09j44%j7J34o1j07N7Q8L4Oj09M0m7K7J1O5o8j62J62Ok2J62j19
5438A6r1R0o0K15j09J4k4j20J46pq3L2ll6N1ql5k7M4p3l0Q0L0J0m8J56k6k26O1
$$ y = [-87, -34, 27, -31, -73, -52, 28, 42, 112, 40, 43, -121, -6, -25, -57, 4, -76, 56, 62, -142, -138, -82, -15, 41, 68, -88, 56, -74, 57, -79, 13, 19, -26, 106, 17, -83, 0, -152, 37, 161, -25, -112, 25, 83, -78, -46, -124, -64, -17, -35, 79, 100, 41, -187, -110, -196, -16, -21, -10, -50, 96, 16, -67, -26, 35, -148, -14, 24, -10, 45, -5, -100, -38, -34, 3, -124, -53, 24, -24, -31, -53, 37, -79, -77, 91, 18, 115, -12, 17, -141, 72, 38, -8, -65, 1, -4, -73, -82, 55, 24, 125, 54, 9, 106, -156, -63, 24, -58, 78, 12, 107, 4, -119, 56, -98, 0, -116, 57, 10, 72, -24, -16, -6, 76, -22, 39, 32, -13, -170, 83, -82, -4, -33, -133, 176, 74, 70, -29, -9, 95, 48, -9, -26, 39, -22, -186, 8, -20, -22, -11, 36, 29, 1, 13, 96, -36, -63, 106, 48, -14, 0, 50, -65, 52, 64, -16, -67, -29, 80, -64, -64, -81, 53, -8, -115, -58, 30, 64, 70, -39, 1, -46, -19, -8, 57, -11, -173, -11, -5, -27, 135, 16, -75, 15, -45, 170, 61, 75, 51, -69, 77, 70, -13, 19, 16, -20, 31, 23, -12, -39, 5, -68, -98, -18, 12, 22, -26, 130, 104, -122, -61]
5467f1P3r5N0J20k7m7%L9P6j64K8j21J75k6M7p8j18J12Nj17J53n3O8Ok07N4J13
5494Er2M8j1M9N1o0p6j4K6J35j14R3m1Kn4O8j21N6L6j4k5J24m8n6J15M7p5K1o7
5523Hl9N9O2q7j56J3P0n4R3O7l6j11R8K7k7kOm2M1m2OK2j01J11j5N6q3L6o7J32
5553D5k8pr1R3j0L4O8j12k0L4oM5n6k2mJ83j50j34R7J53j36J9J6j54K07p9J43
5580A28q8k8p6J2o7J20L6p6J26q2m3m1P3o6J73l0j04P2j38J99r0o2R0k2j7N2q6
5607c5j29J64j83J42J23j16n7J5%Q7k6rj6k7m4K12j71N2mO2L7j75k2J92M9p5m0
5634Fl9m9J22o7l3K4p2J49O0j63l6J53j82J35R7j42J2k4PJ18p4LN6K8j38k8J37
5661F0Rj71K03k40J86J09k24K31j86o8R5N0mN8k5j98pK31j49J86j24n0R6m8L5
$$ y = [-61, 12, -83, -33, 87, 60, 13, 13, 52, 128, -36, -8, -129, 46, 20, 67, -11, -129, -17, -12, -129, 24, -29, 39, 45, -162, -108, 5, -87, -39, -50, -1, 50, -10, -86, -100, -74, 61, -53, 40, -1, 1, -53, 15, -106, -50, -14, -28, -53, 71, 23, -33, 82, 129, 54, 75, 8, -31, 28, 90, 3, -153, -140, -70, -124, -31, 36, 0, -111, -13, 14, -13, -15, -9, -51, -10, -52, -46, -24, -125, -14, -29, 27, -56, -20, -87, 45, 17, 10, -81, 12, 2, 36, 104, -8, -28, 6, 0, 45, -11, -33, -37, 146, -4, -138, -41, 112, -24, -5, 11, -143, 64, -15, 128, 40, 12, -64, -52, -119, 1, 37, -39, 87, 5, -38, -79, -6, -72, 101, 71, -33, 39, -99, 100, 10, -52, 38, 16, -1, 51, -35, -164, 0, -183, -41, 82, -34, -91, -76, -76, 11, -15, -24, -40, -67, -111, 101, -70, -18, -22, 40, 77, -98, -120, 72, 121, 46, 6, -33, -82, 40, -27, -60, -36, -108, 41, 101, -62, -98, 55, -127, 8, 105, -37, -25, -49, -42, 76, 2, 5, 61, 89, -49, -77, 60, 69, -102, 101, -139, 47, 156, -68, 163, -23, -91, 4, 54, 50, 108, 83, -115, -122, 109, -40, 146, 22, -28, 68, 20, 55]
5686E5j06O4n5qQ0n0M6j21O8J56k56J65j26J19j11J11j02k4m1J17k7Q5or3Jk9
5712h8K09j70M1m8Q7K0k6j65J58L2r3M5O5Lj36kO1l0J35q2M6R6k00R5j41J09p0
5739d9J12j23N3J0J49k60L2KM6O3o2MPJ6P7k0j49P3N1r3N8m7J94j85K9j25J25
5766a2qq6J22l3J52j07p4K8J2j4J05j24P8O2k7m1j71J62j8n9K22k26L8n0M8O6
5792D5j23K09m9j04J25j04j03k8J48L3P0q7mOm8j2N4n5J00j30J06j8r0M5M4j1
5818A9P0N7j66N0j12O1J18r1M5o8OP3o0j90J21L9J28j92K07j26m9M7J33j41M5
5843B4l0J80k48MJ01m0R7j43M3J1J8j32J02Q1r9L9m4Q1k0r2J79l2n2L4j44J33
5869E1l9kM6M6j61J01O5j66J06po4j4J57o0LK4j50J28Jj19J78j92R2Jn3P2n6q0
$$ y = [55, -51, 13, -42, -50, 30, -20, 26, -95, -27, 129, -127, 38, -88, 31, -80, 31, -71, -95, -136, -19, -46, 39, 33, -60, -59, -88, 121, -49, -8, -56, 31, 51, 25, -140, 18, 50, -43, 2, 67, 70, -66, -68, -7, -37, 98, 16, 62, 158, -42, 53, -88, 21, -49, 63, -60, -7, 3, 152, -108, -76, -74, -28, 35, -27, -23, -16, 0, 77, 57, -92, -19, 32, -61, -3, -50, 144, -41, -12, -137, -12, -20, -106, 16, -17, 135, 28, -46, -18, -6, -20, 85, -39, 39, 101, 74, 33, -138, 24, 6, -53, 169, -57, -19, -69, -21, 45, -78, 131, 82, -22, 103, -1, -104, -132, 16, 49, 119, 32, 28, 34, -14, -26, 28, -27, 73, -57, 49, 31, -59, -14, 30, 19, 89, 146, -20, 30, -82, -21, 97, 6, 51, -17, -11, 62, 2, -188, -67, -28, 100, -92, 115, -11, -60, -13, 120, -21, 24, -6, 174, -74, -70, 31, -9, 88, -55, -12, -1, 17, -115, -13, 68, -31, 8, -36, 45, 25, -67, 112, 80, 28, 62, -82, 51, 12, 10, 56, 102, -59, 42, 107, -59, 47, 40, -24, -38, 119, 59, 62, 86, -64, 64, 65, -54, 124, -68, 24, 25, -28, 44, -12, -92]
5897i2J95r6k2Q7k14J99j07K17j16o6J6J35n1r6N0j54N8J12M8m9j7j01R1p5Q7
5922C9K2o3NJ00j41LR0j04J01j38J80q7m8L3M5l2k2n8Q6J25j32P4j53J62q4p5
5948g2k2J92o2P2j24L3k5M7k0jP8j53k6J32p8N6n1k5O2K8M9r0J65j62O3J5j06
5975b5j00J32J23r5p2J6N8j91J12mO2j20J07Q7%r0j49J74j51J43J04j05j32N9
5999e7K2oJ18j56P7N0R8j49r9M6L7Q6N8j11j01K24oj29j08K22j77J72j21Q3r6
6024b3m5RO7J0P7p2J4q6R4Ol7j6q8J10K0q6J10P5k08J71j40j26J80o3J60m3j59
6051h9K6J06k8J00Qj77mJ93j55j17P0P9L7J1K2j49R5m0Q9Nj05q2P4R8o5%N5K7
6079H4No8j15J23j02n8J65P9l8m5n6J1L6l2j17J59n6P2Kr3mk5J20p6j7l7Q1j2
$$ y = [-92, 103, 7, -15, 72, -142, 57, -50, 167, 51, -15, 1, 136, 85, -11, 39, -115, -57, 55, 103, 54, 37, -64, 27, -48, 39, 61, -2, 3, 103, -38, -35, 55, -49, 52, -86, 94, 7, -41, -8, 37, 5, -17, -75, 11, 136, 4, 78, -75, 87, 3, -72, -94, 98, 36, 108, -16, 17, -8, 39, 19, 18, 96, -57, -83, 49, -29, 27, -24, -49, 13, 41, 90, 0, 165, 3, 66, 81, -25, -125, 7, 130, 35, -37, -21, 37, -154, -42, -46, 16, -104, 3, 90, 90, 0, -149, 25, -126, 17, 121, 16, -116, -57, -35, -41, 77, -79, -2, 48, 146, -3, -102, -56, -19, 67, 125, 14, -87, 137, 131, 2, -106, 116, -61, 111, -10, 73, -23, -68, -59, 8, 18, 95, 23, 37, -49, 45, 51, 14, -2, -90, 20, 40, -46, 64, 139, -69, 102, -38, -164, 16, -47, 113, 70, -89, -63, 43, 15, 115, 123, -54, -58, 135, -20, -137, -67, 12, 49, 60, 82, -67, 28, -12, 77, 82, -23, -105, -31, 67, 2, 2, 57, 84, 89, 21, -94, 29, -73, -131, 34, 113, 75, 30, -26, -15, 21, -11, -128, 31, -25, 47, 49, -44, -48, -73, 47, -29, -46, -83, -2, -14]
6107a4Nn3Ql3OQ1K8%O9j14N0jro1p3J00J9J2J6j08J08M1q7p0J49r1K1k5j1o3J72
6138G2L4j47N2N6p2OL6j25M2R3r5rJ23q6J8KK6L2q1q4J40j26O7J40j00M8L1m2
6166E1j21R7j46K21j1l8n8R8j17O9M0j70RP8KPJ21j70J16j18L0L2r1mM1J39j9
$$ y = [-14, -9, -62, -54, -87, -81, 0, 28, 28, 97, -17, 33, 32, 23, -38, -111, -11, 8, 20, 36, -72, 36, 77, -10, -80, 69, -22, -1, -26, -37, -100, 72, 106, -41, 11, 67, -5, 1, 37, -88, -46, 47, -48, -57, 66, -20, -2, 0, 26, 58, -23, -107, 33, -93, -26, 114, 14, 62, 93, 51, -70, 27, -119, 102, 91, 53, -5, 93, -24, 45, 85, -85, -76, 2, 4, 11, 132, -38, 78, -40, -10, 22, -69, -73, -32, 107, 88]
$$ [...]
8191b3
##END NTUPLES=NMR FID
##END=
