##TITLE=1H_Pr U-1
 CDCl3
 8 sc, 
 2.7.2024
##JCAMPDX= 6.0         $$ Bruker NMR JCAMP-DX V2.0
##DATA TYPE= NMR FID
##DATA CLASS= NTUPLES
##ORIGIN= UXNMR, Bruker Analytische Messtechnik GmbH
##OWNER= root
$$ XWIN-NMR		Version 3.5
$$ Tue Jul  2 16:19:38 2024 Russian Standard Time (UT+4h)  she@DPX200
##.OBSERVE FREQUENCY= 200.131
##.OBSERVE NUCLEUS= ^1H
##.DELAY= (6, 6)
##.ACQUISITION MODE= SIMULTANEOUS
##.ACQUISITION SCHEME= undefined
##.AVERAGES= 8
##.DIGITISER RES= 18
##SPECTROMETER/DATA SYSTEM= spect
##.PULSE SEQUENCE= zg30
##.SOLVENT NAME= DMSO
##.SHIFT REFERENCE= (INTERNAL, DMSO, 0, 15.7039)
##AUDIT TRAIL= $$ (NUMBER, WHEN, WHO, WHERE, WHAT)
$$ ##TITLE= Audit trail, XWIN-NMR		Version 3.5
$$ ##JCAMPDX= 5.01
$$ ##ORIGIN= Bruker BioSpin GmbH
$$ ##OWNER= she
$$ F:/spectra/data/she/nmr/H-F/1/audita.txt
$$ ##AUDIT TRAIL=  $$ (NUMBER, WHEN, WHO, WHERE, WHAT)
(   1,<2024-07-02 16:17:54.46 +0400>,<she>,<DPX200>,
      <created by zg, POWCHK disabled, PULCHK disabled
       configuration hash MD5:
       00 E9 B6 7A A2 85 ED C7 34 08 36 98 17 FE 4E 26
       data hash MD5: 16K
       52 0A 9A 37 55 FF 02 08 86 49 90 36 40 1A 32 F0>)
$$ ##END=
$$ 
$$ hash MD5
$$ F4 76 37 E2 8C 71 B5 C6 5E C5 EB 62 01 22 6A 77
##$RELAX= 
##$RELAX= 
##$RELAX= 
##$RELAX= 
##$RELAX= 
##$RELAX= 
$$ Bruker specific parameters
$$ --------------------------
##$DU= <F:/spectra>
##$EXPNO= 1
##$NAME= <H-F>
##$PROCNO= 1
##$TYPE= <nmr>
##$USER= <she>
##$AMP= (0..31)
100 100 100 100 100 100 100 100 100 100 100 100 100 100 100 100 100 100 
100 100 100 100 100 100 100 100 100 100 100 100 100 100 
##$AQSEQ= 0
##$AQ_mod= 1
##$AUNM= <au_zg>
##$AUTOPOS= <>
##$BF1= 200.13
##$BF2= 200.13
##$BF3= 200.13
##$BF4= 200.13
##$BF5= 200.13
##$BF6= 200.13
##$BF7= 200.13
##$BF8= 200.13
##$BYTORDA= 1
##$CFDGTYP= 0
##$CFRGTYP= 5
##$CHEMSTR= <none>
##$CNST= (0..31)
1 1 145 1 1 1 1 1 1 1 1 1 1 1 1 1 1 1 1 1 1 1 1 1 1 1 1 1 1 1 1 1 
##$CPDPRG= <>
##$CPDPRG1= <>
##$CPDPRG2= <>
##$CPDPRG3= <>
##$CPDPRG4= <mlev>
##$CPDPRG5= <mlev>
##$CPDPRG6= <mlev>
##$CPDPRG7= <mlev>
##$CPDPRG8= <mlev>
##$CPDPRGB= <>
##$CPDPRGT= <>
##$D= (0..31)
0 1.2 0 0 0 0 0 0 0 0.06 0 0.03 0 0 0 0 0.0002 0 0 0 0 0 0 0 0 0 0 0 0 
0 0 0 
##$DATE= 1719922674
##$DBL= (0..7)
120 120 120 120 120 120 120 120 
##$DBP= (0..7)
150 150 150 150 150 150 150 150 
##$DBP07= 0
##$DBPNAM0= <>
##$DBPNAM1= <>
##$DBPNAM2= <>
##$DBPNAM3= <>
##$DBPNAM4= <>
##$DBPNAM5= <>
##$DBPNAM6= <>
##$DBPNAM7= <>
##$DBPOAL= (0..7)
0.5 0.5 0.5 0.5 0.5 0.5 0.5 0.5 
##$DBPOFFS= (0..7)
0 0 0 0 0 0 0 0 
##$DE= 6
##$DECBNUC= <off>
##$DECIM= 32
##$DECNUC= <off>
##$DECSTAT= 4
##$DIGMOD= 1
##$DIGTYP= 9
##$DL= (0..7)
0 120 120 120 120 120 120 120 
##$DP= (0..7)
150 150 150 150 150 150 150 150 
##$DP07= 0
##$DPNAME0= <>
##$DPNAME1= <>
##$DPNAME2= <>
##$DPNAME3= <>
##$DPNAME4= <>
##$DPNAME5= <>
##$DPNAME6= <>
##$DPNAME7= <>
##$DPOAL= (0..7)
0.5 0.5 0.5 0.5 0.5 0.5 0.5 0.5 
##$DPOFFS= (0..7)
0 0 0 0 0 0 0 0 
##$DQDMODE= 0
##$DR= 18
##$DS= 0
##$DSLIST= <SSSSSSSSSSSSSSS>
##$DSPFIRM= 0
$$ [...]
##$SUBNAM2= <"">
##$SUBNAM3= <"">
##$SUBNAM4= <"">
##$SUBNAM5= <"">
##$SUBNAM6= <"">
##$SUBNAM7= <"">
##$SUBNAM8= <"">
##$SUBNAM9= <"">
##$SW= 18.0517599122864
##$SWIBOX= (0..15)
0 0 2 0 0 0 0 0 0 0 0 0 0 0 0 0 
##$SW_h= 3612.71676300578
##$TD= 16384
##$TD0= 1
##$TE= 0
##$TE2= 300
##$TE3= 300
##$TEG= 300
##$TL= (0..7)
0 120 120 120 120 120 120 120 
##$TP= (0..7)
150 150 150 150 150 150 150 150 
##$TP07= 0
##$TPNAME0= <>
##$TPNAME1= <>
##$TPNAME2= <>
##$TPNAME3= <>
##$TPNAME4= <>
##$TPNAME5= <>
##$TPNAME6= <>
##$TPNAME7= <>
##$TPOAL= (0..7)
0.5 0.5 0.5 0.5 0.5 0.5 0.5 0.5 
##$TPOFFS= (0..7)
0 0 0 0 0 0 0 0 
##$TUNHIN= 0
##$TUNHOUT= 0
##$TUNXOUT= 0
##$USERA1= <user>
##$USERA2= <user>
##$USERA3= <user>
##$USERA4= <user>
##$USERA5= <user>
##$V9= 5
##$VALIST= <valist>
##$VCLIST= <CCCCCCCCCCCCCCC>
##$VD= 0
##$VDLIST= <DDDDDDDDDDDDDDD>
##$VPLIST= <PPPPPPPPPPPPPPP>
##$VTLIST= <TTTTTTTTTTTTTTT>
##$WBST= 1024
##$WBSW= 4
##$XGAIN= (0..3)
0 0 0 0 
##$XL= 0
##$YL= 0
##$YMAX_a= 803734
##$YMIN_a= -973719
##$ZGOPTNS= <>
##$ZL1= 120
##$ZL2= 120
##$ZL3= 120
##$ZL4= 120
##$ABSF1= 10
##$ABSF2= 0
##$ABSG= 5
##$ABSL= 3
##$ALPHA= 0
##$AQORDER= 0
##$ASSFAC= 0
##$ASSFACI= 0
##$ASSFACX= 0
##$ASSWID= 0
##$AUNMP= <proc_1d>
##$AZFE= 0.1
##$AZFW= 0.1
##$BCFW= 1
##$BC_mod= 2
##$BYTORDP= 1
##$COROFFS= 0
##$CY= 11.3945322036743
##$DATMOD= 1
##$DC= 2
##$DFILT= <>
##$DTYPP= 0
##$F1P= 15.6554695791079
##$F2P= 12.8336369535428
##$FCOR= 0.5
##$FTSIZE= 0
##$FT_mod= 4
##$GAMMA= 1
##$GB= 0.15
##$INTBC= 1
##$INTSCL= 1
##$ISEN= 128
##$LB= 0.24
##$LEV0= 0
##$LPBIN= 0
##$MAXI= 10000
##$MC2= 0
##$MEAN= 0
##$ME_mod= 0
##$MI= 1.114404
##$NCOEF= 0
##$NC_proc= 0
##$NLEV= 6
##$NOISF1= 3.799351
##$NOISF2= 2.8
##$NSP= 1
##$NTH_PI= 0
##$NZP= 0
##$OFFSET= 15.70392
##$PC= 1
##$PHC0= -25317.89
##$PHC1= 9.387481
##$PH_mod= 1
##$PKNL= yes
##$PPARMOD= 0
##$PSCAL= 0
##$PSIGN= 0
##$REVERSE= no
##$SF= 200.130013532006
##$SI= 16384
##$SIGF1= 3
##$SIGF2= 2
##$SINO= 400
##$SIOLD= 16384
##$SREGLST= <1H.CDCl3>
##$SSB= 0
##$STSI= 0
##$STSR= 0
##$SW_p= 3612.71676300578
##$SYMM= 0
##$S_DEV= 0
##$TDeff= 0
##$TDoff= 0
##$TI= <>
##$TILT= no
##$TM1= 0
##$TM2= 0
##$TOPLEV= 0
##$USERP1= <user>
##$USERP2= <user>
##$USERP3= <user>
##$USERP4= <user>
##$USERP5= <user>
##$WDW= 1
##$XDIM= 8192
##$YMAX_p= 0
##$YMIN_p= 0
$$ End of Bruker specific parameters
$$ ---------------------------------
##NTUPLES= NMR FID
##VAR_NAME=  TIME,          FID/REAL,        FID/IMAG
##SYMBOL=    X,             R,               I
##VAR_TYPE=  INDEPENDENT,   DEPENDENT,       DEPENDENT
##VAR_FORM=  AFFN,          ASDF,            ASDF
##VAR_DIM=   8192,          8192,            8192
##UNITS=     SECONDS,       ARBITRARY UNITS, ARBITRARY UNITS
##FACTOR=    0.0002768,     1,               1
##FIRST=     0,             0,               0
##LAST=      2.2672688,     0,               0
##MIN=       0,             -973719,         0
##MAX=       2.2672688,     803734,          0
$$ Real data points
##PAGE= N=1
##DATA TABLE= (X++(R..R)), XYDATA
$$ [...]
1879d517K013O32j430K174J822j172J069K657p93k12K432L4j587J638J195k113
1895C842j47J648j693j577J451p47k407P42N14k048o12J658j394j247J891Oj685
1912a805J461J243j661N76J933j030q08J876l62j546R64Q67j823n21J357j673
1928i52j245J306p02j655O81L07j211p7J045k86m53J505L26r01J599R91p47M49
1946b0J486m15l93J092M8p28N5M56j266m29L17j049j059M51m06r54J72J19n39
1965c062L2O47K35J54P00J381j89R53J381K69N77R12N17M68M8L42M50o69R1k16
1985E021j100l20L3j602o93l03q86r33j185m2m72j052M74l70j055J435m66o98
2003d214J306N20l11K69R02N09l99M11J148q40M64J279j531Q8J457j005n06O74
$$ y = [-4517, -2504, -1872, -3302, -1128, 694, -478, 591, 3248, 2455, 2243, 4675, 4709, 3122, 4760, 5955, 3842, 3695, 5343, 3650, 2073, 3524, 2777, 370, 1112, 1626, -422, -1034, 624, -770, -2017, -126, -120, -1805, -344, 899, -762, -186, 1747, 717, -91, 1785, 1423, -123, 841, 1708, -115, -636, 721, -952, -2197, -891, -1593, -3248, -2567, -2260, -3471, -3548, -2503, -2789, -3242, -1737, -1411, -2312, -713, 278, -469, -20, 1466, 1051, 658, 1750, 1798, 1070, 1125, 1581, 315, -114, 203, -846, -1905, -1454, -1860, -2814, -2642, -2523, -3062, -3030, -2383, -2148, -1994, -1294, 87, -102, 851, 2232, 2501, 3078, 3990, 4507, 4975, 5023, 5365, 5815, 5146, 5237, 5021, 3921, 3601, 3634, 2032, 1339, 1036, 150, -783, -1968, -2010, -2482, -3534, -3060, -3430, -4485, -3050, -3516, -4214, -2908, -2388, -2699, -2430, -1528, -1019, -1418, -1007, 141, -699, -235, 1044, -487, -399, 1058, 53, -453, 221]
2021B21J00l74n04N99k0o99J316M8j470J677M80j518J148O24o74M06J5K45n32
2040A088o2P19j740J43J557j980q11J727j304o56Q06n47j73K55l8J11o96J628
2058B7N63j840J472J377j578J087M76j002R67K36p13k4R4K7j032p02J776j636
2076d25j492J453j097n39R60j115K4R63q8J85l64R91J256j262P22J698j013J136
2094A993K50j145J249N42j028m9j26K69m25j444O66m34j176M01r58n24J059j085
2112a965m88R60l63O39n62k8J620k27L3R24k84Q47O09j052Q09N92n83K56j103
2131F34J54R56j821k46K95p71K79q69r56Q80m81n43N20o53J015M07j264J484N93
2150c87n30Q77oK49J055l22J6N55L6Q63j187l33J444r37q20Q81q48m0M41j258
$$ y = [221, 321, -53, -557, 42, 22, -677, 639, 687, -783, 894, 1374, -144, 1004, 1628, 954, 1360, 1375, 1620, 1088, 1026, 1745, 5, 148, 1705, -275, -1086, 641, -663, -1319, -513, -1060, -1233, -978, -1016, -905, -1601, 27, 590, -1250, 222, 1599, 21, 1108, 1584, 582, 1549, 1785, 1072, 1048, 1142, 1169, 137, -565, 1211, -425, -1917, -464, -1561, -2100, -1140, -2255, -2231, -1268, -1356, -1171, -1535, -544, 712, -550, 172, 1870, 857, 1993, 2243, 1098, 2347, 2889, 1861, 1812, 1686, 1955, 1530, 86, 752, 318, -858, -457, -1415, -1939, -880, -1965, -2453, -1493, -1856, -1217, -1779, -1807, -187, -414, -381, 543, 259, 1106, 1715, 663, 1472, 2064, 1481, 1737, 634, 788, 1744, -77, -323, -28, -799, -520, -1389, -2345, -1465, -1946, -2489, -1969, -2622, -1607, -1200, -2464, -980, -387, -917, -40, -46, 203, 1258, 936, 952, 1507, 1543, 2406, 1219, 886, 2330, 1393, 573, 1454, 606, 566, 1007, -251]
2170b51J55L35l09l3r01R58P64j305O52P93r69J125lo49J268k26m15J78p2N49
2190A644m71r13R05n15j121R41j247k62P67j053n38M52p4k32m19J29P81o46K90
2209a582M72o52J025M09p85R36L88l07J02O8L65J69o97O25k76l46P65q02l51P47
2229B73l77n48M54k65J41J1p8L73o6LM37n30L83Q59p14Q5N11k43K56k52p8M54
2251A089l21q6K4k03K81j98n34O18q9j73K93m44J88K99k35K90J85j10J2l89N2
2272E49M89n92L9n6j84K6n04n15K44m20m71J60o54m3J16m32O3J4j74K62j69K46
2294b006O45m6M40L59K7O02L71j39P45J65J1J62P6K83j30l8K11l01n8R2m35m73
2316E63J85j23n62M9N4l66j62o3m6k14J58j28k26J84J82j41J03J47m1K56M24m9
$$ y = [-251, -96, 239, -70, -103, -1004, -46, 718, -587, 65, 858, -111, 1014, 1011, 362, 1630, 1404, 989, 1167, 1095, 1644, 1173, 260, 1165, 650, -471, 470, -777, -1039, -272, -1325, -1863, -1411, -1485, -1717, -2136, -2007, -1226, -1872, -1582, -1110, -1762, -737, -328, -1113, -177, 211, -96, 6, 74, 439, 608, -89, 536, 260, -86, 679, -123, -474, 273, -104, -652, -198, -463, -322, -311, -389, -16, -82, -79, 358, -172, 211, 1070, 356, 441, 952, 709, 965, 713, 635, 1089, 768, 682, 706, 503, 784, 586, 52, 670, 581, 408, 701, 257, 445, 744, 509, 799, 984, 874, 886, 497, 549, 1038, 446, 485, 429, 245, 271, -233, -748, -504, -924, -1395, -1235, -1889, -1932, -1816, -2248, -2185, -2171, -2345, -2083, -2252, -2006, -1361, -1407, -967, -608, -581, 21, 392, 253, 998, 1163, 1174, 1336, 1412, 1695, 1565, 1527, 1738, 1437, 1379, 1471, 1036, 563, 748, 625, 63, 112, 166, -200, -362, -425, -471, -685, -527, -655, -881, -697, -515, -656, -553, -406, -447, -191, 233, 184]
2338A84q1K51K43j98qN08p4j45J05k02k15K55R5o07K6M5l36j82j50Ol79N8k0k59
2362a080L6R9J6o6J20J67N4L70J24J22L17K58J38J83L31J1J68J50J20j53j94L24
2384A615m00j68k5m53l42k39j94o43j41j32m00j33o5k58j35J64K29j53J73J63
2404a537J76M00L35K37M84K45J93J52M04J55k1P9K02r2M4p1k44k00j74k95k11
2425B61k05l43k73l9k38k72n6j48J68Q1MK05M29J35Q9L57K82L06K40L53M02J2
2447A750L59R1k44J03m8j62j49n67k62k35n24k71n26m48l26l31l37J9m60J25K19
2468b224N2qL81K42N14L27L88O56l6O15L97oM79J4l2L16k88j79l43l29l36k68
2490C32o41j75n12n88J40n00j61L7J14j15J56M1N50M49J15O98r0N15Q81j46J41
$$ y = [184, 103, 354, 597, 399, 391, 899, 825, 680, 785, 583, 368, 623, 718, 111, 137, 182, -154, -336, -486, -480, -859, -801, -821, -1080, -1044, -945, -929, -995, -875, -708, -654, -284, -160, -38, 279, 537, 675, 858, 1189, 1200, 1368, 1518, 1638, 1485, 1291, 1615, 1215, 1047, 1022, 569, 227, -12, -206, -849, -990, -1122, -1522, -1655, -1720, -1978, -2113, -1949, -1720, -1873, -1700, -1537, -1361, -961, -626, -389, 95, 340, 533, 685, 1089, 1244, 1223, 1302, 1504, 1412, 1456, 1385, 1141, 941, 767, 472, 261, 56, -287, -560, -599, -837, -1109, -1165, -1313, -1145, -1064, -1060, -855, -426, -291, -202, 155, 437, 743, 983, 1336, 1738, 1750, 2109, 2200, 1956, 2059, 2011, 1849, 1700, 1133, 871, 636, 112, -159, -685, -1133, -1459, -1790, -2127, -2108, -2568, -2443, -2224, -2172, -2180, -1799, -1557, -1043, -716, -328, 328, 292, 907, 1304, 1298, 1777, 1791, 1759, 2075, 1787, 1608, 1265, 936, 600, 332, -309, -484, -996, -1584, -1444, -1944, -2105, -2068, -1954, -2069, -1913, -1872, -1322, -873, -758, -60, -150, 365, 1246, 1100, 1241]
2511A241O01n2L37j81j94L40l85m36J11o33j20q1q15J01m20J0O9l12k35O59l93
2532g88J56L10j27N46o8R2O19k44j36M92l09L17N8q51L18k05j68m3o20q7M30o58
2554i66N0k72R7M38m37j12Q07j35RL92k6N02J11l94O80m5P4J45p47K08O07r17
2576F9R7k45j82L01n77l91O01m13j00K01n69P51J38n66Q05M9p3N64n68O48N88
2597A128q82K56J62j69P08q68k88O99l70k66%o72N83j31j056N96o7j32K74o63
2617a158N26N95o35N16P7RO89m29m0R54k85m1K20n05J016k16p83N15k37Q8L17
2638A193j103L82M76q11K3k88j22M34o03k21N91m30J49l3n40N80k32n83P06m14
2658h46M9L58p65N80R5m38N73m49o0N39n80N8O58m93K25Q3k89P21j02m72O45n3
$$ y = [1241, 1842, 1790, 2127, 1946, 1752, 2092, 1707, 1271, 1382, 749, 629, 548, -267, -166, -586, -576, -507, -819, -1054, -395, -788, -632, -322, -449, 97, 29, 121, 740, 496, 360, 852, 543, 860, 918, 67, 385, 180, 12, -31, -651, -738, -308, -966, -916, -1188, -1091, -653, -1090, -1202, -395, -530, -521, -129, -155, 347, 458, 64, 744, 699, 773, 918, 171, 379, 986, 69, 166, -79, -261, 40, -537, -928, -327, -740, -840, -639, -1208, -457, -319, -885, -80, -31, -104, 460, -108, 540, 1128, 246, 502, 664, 495, 1203, 335, 47, 746, 376, 110, 110, -562, 21, -110, -1166, -570, -637, -769, -495, -1158, -632, -37, -672, -156, -79, -70, 619, 190, 150, 1104, 819, 778, 998, 493, 1509, 1293, 510, 1025, 788, 876, 1193, 90, 472, 948, 137, 160, -128, -250, 184, -419, -640, -49, -479, -330, -363, -903, -323, -555, -1138, -432, -846, -797, -439, -1204, -624, -529, -967, -394, -843, -903, -364, -944, -886, -228, -721, -496, -413, -702, 19, -83, -555, 90, 37]
2680C7K11L29o36L80M91n37L05l20K27O18p72Q6N33n66J78m7l30N65k14m16N08
2701F30j50L0N17n63L05K84n02K96k98N1O84r29Q9L61l87R5l99j50N73l53l84
2722b00K33m03M7K53q49L31K47l83M6j63j85M99o09J25M07l60J63m2k94N74m47
2743a010j47K72MQ7J65l46N11K03m33L33M8L69L11k44K0M66Q5K11j32l27P81k97
2765I30j04M53m55J91k21j12QL7l86M0k63J25J11l51K41l7OJ75p4l6K27j20k7
2788C58L26k29R5J70l30Q7j33j61m0l22k84J96m31J00j41k42R5l32k25L95j37
2809a185r4O6n2K19K65l1K86k3l4K88Q3%J76j50J56J16j34L44j46j6J88K4R1J8
2833D55J16K4p7J54L84j39j98L03j56J16J23m2l11J45j39r4l27j07p1k23k03q1
$$ y = [37, 248, 577, -59, 321, 812, 275, 580, 260, 487, 1105, 333, 419, 952, 386, 564, 517, 187, 752, 538, 122, 630, 480, 510, 1027, 464, 769, 1053, 551, 847, 549, 600, 1284, 355, 444, 805, 418, 513, 114, -36, 537, 184, -200, 33, -370, -323, -70, -919, -588, -341, -724, -678, -841, -1026, -527, -1136, -1011, -604, -964, -801, -843, -1137, -563, -1010, -1157, -885, -881, -794, -629, -975, -464, -261, -694, -361, -313, 56, 367, 123, 143, 609, 694, 905, 773, 446, 1227, 930, 826, 1279, 824, 1015, 794, 682, 690, 727, 341, 381, 118, 243, 354, 3, 244, 207, 213, 388, 314, 278, 505, 385, 358, 684, 455, 550, 720, 390, 477, 344, 183, 143, -179, -463, -267, -698, -598, -739, -981, -886, -1218, -1443, -1048, -1185, -1279, -1213, -1265, -1046, -781, -812, -526, -549, -583, -295, -212, -212, -36, -186, -30, 86, -48, 296, 150, 134, 322, 346, 437, 455, 571, 595, 518, 672, 1056, 917, 719, 1022, 866, 982, 1105, 1063, 752, 897, 758, 664, 337, 230, 159, -64, -267, -348]
2855c48k48oj88pq4k38K89J85j6q0K50Q5K05K73J21L4K6J19J07j08O6L3j5j45
2879C10k23j17j65q3k77L0n05K69j18k33L69j07n6K60K75J4K33J58jL23K65J68
2901G89L9L74j10J30R4j96K58l87K11j49k35j16q7j58k20q3j86j13l95R8m8L6
2923d54k18j30n1R5M4J02n7j7Q1j08P5K51p8J89O0J39J02nJ44K01j54L0q0Q2N8
2948C01k04J33j95j29j27L7j3j08j30n4j33j8pp9J17J46J8l7M18J76n3M42Q8M01
2972I90R7L7J84J74J01j36k0Q1k6l41k2l5n53l9l78m04p1j56m65J18l03R3k08
2995a282q3K83J28p8K84P3K34L02j69M26J24j19M04j28j96K21j81J9J52n77l5
3016a98K98l56l0j07l01J90k40R2L7m8J63L0j29M77j7K2J46R9J85J99l27K87J04
$$ y = [-348, -596, -602, -790, -797, -881, -1119, -830, -645, -661, -741, -491, -406, -201, 72, 193, 227, 253, 372, 479, 371, 437, 470, 455, 310, 87, -30, -195, -278, -555, -525, -1030, -761, -879, -1112, -743, -850, -906, -646, -371, -357, -124, 34, 33, 356, 621, 789, 828, 1202, 1092, 1222, 1316, 1120, 1378, 991, 1202, 1053, 818, 702, 615, 457, 237, 154, -32, -145, -540, -442, -490, -454, -672, -802, -853, -758, -714, -612, -669, -686, -605, -713, -638, -387, -465, -276, -216, -77, 25, 20, 164, 365, 211, 241, 161, 243, 301, 97, 230, 35, -94, -221, -184, -197, -305, -435, -489, -622, -640, -647, -726, -609, -463, -445, -482, -64, 112, 59, 501, 589, 990, 1087, 1124, 1308, 1482, 1583, 1447, 1427, 1508, 1482, 1141, 1119, 1084, 531, 492, 114, -290, -361, -517, -982, -864, -1167, -1074, -1282, -1365, -1082, -954, -1032, -748, -675, -441, -139, -308, 118, 242, 123, 527, 399, 203, 424, 243, 262, 414, -163, -198, 100, -256, -286, -393, -694, -504, -744, -652, -615, -663, -500, -470, -599, -122, -139, -117, 29, 128, 313, 512, 185, 472, 576]
3039E76k63J80n8M1p8j72j15K35l69K18j82l64M14ll02N58k00l0L02j45K3k9K99
3062E36r4r4L7L09m79qJ57l66K64o0n97O69l38l75J28j04J09j01m21M18P2j63
3084e01K84j39k46Q15o86K01L64j25J88k08j93N99j71j07Q0l20M52Oo75L81J82
3105A81k67J31j28K0J60l12j9O1j72L09k52l11L81J08l32L24QQ5K09n16L81P0
3127A19m2K42j61k4N73n37J04L52j17J40j7m98O06k42m02M10o22M07O5m49J21
3148B8Pl20M29n86J17N65p85K64K03j02Q4o5j74O18O5l64K82l03N68K3m88M54
3170E20J31l43K08o17L16M20o27l6O5j80L62o77l55O28l71j56Q8k49K74K50o38
3191i87K87Q7j85M62k93K40L78m29M29J5k26N92m52N5L82p1l61M83j47K46o3n40
$$ y = [576, 313, 493, 435, 476, 398, 226, 111, 346, -23, 195, 13, -351, 63, 60, -242, 316, 116, 86, 388, 243, 266, 237, 536, 442, 348, 385, 694, 215, 207, 364, -2, 262, 202, -395, 274, -64, -439, -311, -415, -306, -407, -828, -410, -338, -501, -217, -356, -602, 213, -473, -272, 92, -33, 155, -53, -246, 353, 182, 75, 155, -165, 287, 293, -382, -1, 181, -86, 45, -83, -63, 97, -215, -234, -173, -345, -36, -288, -599, -218, -110, -442, -118, -110, -25, 184, -332, 49, 119, 77, 319, 158, 134, 707, 170, 274, 626, 509, 649, 632, 134, 740, 498, 96, 506, -116, 291, 356, -93, 28, 35, -285, 144, -442, -325, 240, -545, -281, -78, -180, -96, -161, -335, 283, 348, -16, 266, -37, 531, 554, 66, 520, 651, 308, 516, -101, 215, 635, 8, -28, 37, -143, 219, -458, -813, -185, -556, -712, -624, -873, -599, -349, -987, -700, -613, -798, -336, -629, -389, -11, -440, -11, 4, -222, 370, -82, -27, 355, 284, -77, 406, 259, 505, 442, -98]
3213i8M98k31P5J12k90J78M58l03o8L35k43K89j41l02M37j65Q1l31O5J89j31o27
3235b13L95J33m01L46o66L63n8k45j30O3o5M79m05J47M46k33n7L33k42M75j11
3256C54k82M10k07k1o8j87N0ol85j33o8j89P2l61j66K49k73J03j83O7M42J52j90
3279h20K52K70J04L66o6L90M12j98K55J76j64J87j21J0R5l40r4r0k95P6nl16j27
3302d3j49j54K81l50L12J96k70J90K1L0J53m8J00K25j99L04l0m01K59mn31K89
3324A81j23j37m8k85n7J01m06J14j91k4J92k58J90Q0j04K0K46r2J89N3L8J01L
3347b17K23j28J12K00j40q1J98j06J57k6J38j54l2M2K13p1R8P9j15N5J19j14P4
3370E24J47j83j45N6j5j10K7j60K51n31K86k63L3O1M5k72m1P1j69K00J68k84R8
$$ y = [-98, 400, 169, 244, 356, 66, 244, 702, 399, 331, 666, 423, 712, 571, 269, 706, 541, 622, 291, 356, 545, 414, -213, 182, 315, -86, 260, -406, -43, -101, -346, -476, -413, -478, 1, -404, -257, 189, -44, -101, 232, -10, 465, 354, 72, 482, 275, 254, 186, -1, 49, 43, -342, -475, -543, -732, -660, -1021, -1187, -938, -1211, -1108, -1291, -1224, -782, -630, -820, -568, -298, -194, 172, 106, 496, 908, 710, 965, 1141, 977, 1164, 1043, 1053, 1148, 808, 714, 624, 329, 405, 400, 84, -43, -192, -346, -65, -415, -103, 93, -177, 13, 34, 64, 217, 169, 269, 494, 295, 599, 569, 168, 427, 423, -108, 181, 58, -79, -127, -412, -469, -368, -774, -660, -851, -875, -683, -941, -751, -671, -775, -755, -509, -601, -412, -359, -321, -220, -217, 6, -122, -10, 190, 50, -31, 167, 61, 218, 192, 330, 176, 144, 186, 399, 328, 426, 505, 390, 445, 564, 450, 524, 671, 488, 343, 399, 384, 274, 301, 141, 392, -139, 147, -116, -83, -22, 23, -249, -290, -219, -388, -188, -20, -304, -206]
3393b06j04R1k5KJ15k12K1j08L2L2J80q8l12J78J69k11j11L73r1J71J02K7j60
3416a35K11J52j46L8L00j84Oj5K1j82J28J1k51J12J10L6n1qj51M0M58r7O4L0J38
3441F35q6K03P5j19j87j32K51r0k5l01j23n8k59r4r5j96pk8j30j70j07J74o4j46
3465a079J56J81o8J81RJ00j33K47O6P7m9L08K7j83m2j2J25%M2j25K08kj56O9J55
3490A02J84j96J87P0N1J01K49j6L15J33l28J17K51Lj93N3k94J44q4n2k10m7j56
3513C84l13o3K2k32l43J25l97j20L13k85j51K66q7j89J56r7P1j88K82Q5O5J87
3535e09l0k12K74J27O2K66k78K65K20P7K60k04M3J45k00o0N78n07MJ88j32K5j36
3558B66j02J00q1lj70j91K01J1l29K26J20o4L2JR0K02k5M3n9j3J31K4k77L27k23
$$ y = [-206, -310, -219, -244, -242, -127, -339, -318, -426, -394, -362, -182, -270, -582, -404, -235, -446, -557, -184, -275, -104, -2, 25, -135, 76, 228, 82, 120, 420, 236, 242, 227, 248, 66, 194, 205, -46, 66, 176, 212, 161, 153, 2, 42, 500, 403, 467, 497, 635, 549, 752, 827, 708, 521, 389, 640, 550, 525, 224, 101, 43, -216, -310, -405, -601, -608, -636, -766, -936, -1043, -869, -933, -1079, -923, -742, -810, -629, -620, -520, -653, -406, -340, -263, -312, -4, 23, -160, -202, -214, -89, -89, -47, -172, 36, 34, -122, -53, 102, 286, 90, 277, 347, 398, 499, 748, 732, 1047, 1180, 852, 969, 1220, 1223, 1030, 1083, 789, 933, 849, 797, 587, 540, 384, 71, 8, 30, -202, -545, -420, -817, -937, -624, -909, -1060, -794, -881, -1070, -914, -1011, -940, -1128, -846, -761, -696, -509, -539, -751, -477, -350, -288, -22, -300, -35, 185, 262, 522, 318, 361, 506, 306, 246, 824, 317, 321, 509, 377, 402, 266, 164, 264, 183, 180, 10, -181, 20, 31, -298, -72, 48, -16, 16, 17, 107, 309, 284, 327, 268, 255, 386, 410, 133, 460, 237]
3583B37p9J62l18J91j41k04pR0M5j1k76J54R6l64K57J34k80L60j66q5L56k8p0
3606E3K33k83K54Rk07R8j84QO8l39QL02m37K7J2j5K27m44j90M60j28Q2J63j52
3630c75J83J75k66M89r8p0L44l08K87K23k74J33O6j11K02l58kK2R6k04j35j71
3652a52K83n8m52K73j85r2J58j68K41J03p0L4K1M9N63l48P0K71j5N0o5l9K96j68
3676F00k90K64l84K57j62m35K19o7l36J0p4j59K41k08j3J93K9J29k27J54L85j55
3698b9m5L48j78J18K99l09q5M05k25q2j35j68L34n70l8k8k17j59J58l11N28q0
3720d69k46J98J7L78q9j6M43k6o4M39l07J60K11n2l89N15k29n8k72M7K4l89J79
3743Ep2k05kJ87m97L29J34j10Q2J41P3K28J1%J92R9J09o4k18L19j99r9K54j90
$$ y = [237, 158, 320, 2, 193, 52, -152, -159, -69, -24, -35, -311, -157, -61, -425, -168, -34, -314, 46, -120, -205, 151, 123, 53, 286, 3, 257, 266, 59, 157, -27, -19, 49, -290, -282, 20, -417, -390, -378, -393, -166, -610, -800, -340, -468, -386, -223, -375, -192, -17, -283, 206, 108, 38, 382, 74, 361, 584, 310, 443, 509, 398, 600, 242, 240, 262, 358, 154, 19, -152, 131, 73, -379, -106, -291, -383, -225, -393, -152, -49, -119, -85, -64, -15, 548, 200, 270, 541, 526, 576, 511, 472, 768, 600, 310, 574, 190, 447, 285, -150, 69, 2, -334, -324, -398, -557, -316, -524, -537, -344, -315, -186, -413, -259, 126, -29, -74, 274, 96, 214, 513, 204, 119, 524, 299, 217, 82, -86, 248, -322, -360, -388, -605, -764, -606, -917, -389, -469, -715, -517, -500, -122, -211, -227, 216, 190, 126, 565, 258, 418, 629, 577, 188, 703, 474, 416, 144, 191, 215, -174, 5, -67, -272, -274, -87, -584, -255, -121, -231, -149, -8, 65, 293, 304, 304, 496, 595, 704, 640, 422, 741, 542, 443, 697, 507]
3767E07j78N6n58K70k55j15J83m47J01K74l84M8J67j83J77L6j9J67J0j39L49k02
3789a35j46K73j23J9J67k16L5r6J45J6k54j7J50p8J7j26q9L08n0k58j8R5K83L4
3813f4j45K71j20K04K78k8m9K55j88J91j05J09O6j16J01j0j60nK5k17m9j09n6
3836G9j94K80l95p2k35J95j03j65J73k04R1J36J05l15K73K58k41J43K73mm7K55
3858B86j20N1K7J73k04J8J12j57r8J20m3k06K2j87j03rJ11j16Nl5r4r4M02j22
3882b61o0K81J5J7%J19J9j8P9l2L5N7M6j76N8K74l14KJ95j5k49R2Q0j21j55K70
3908B38r2o0N4o1mj86J82j13K4K2k69J08%l5N6j62J08j89m5J12k00j20J7K23k34
3933f26J69M6m8L07l1OR6J17J20l9j6P1K9K0K20k55K28Q8j19m5L08l3j23J21J14
$$ y = [507, 329, 385, -173, 97, -158, -273, -90, -537, -436, -162, -546, -498, -331, -514, -337, -301, -320, -153, -143, -282, 67, -135, -281, -8, -131, -112, 55, -161, -126, -222, -77, -61, -315, -332, -182, -260, -243, -369, -458, -150, -200, -458, -476, -381, -98, -64, -209, 62, -58, 146, 424, 396, 347, 602, 414, 605, 500, 609, 675, 559, 660, 650, 490, 485, 510, 293, 244, 135, 79, -115, 165, -230, -302, -537, -342, -445, -610, -437, -641, -550, -414, -309, -624, -351, -93, -334, -191, 82, 78, 31, 286, 166, 217, 244, 417, 213, 231, 343, 186, 88, 208, 165, -41, -19, -206, -309, -318, -207, -323, -318, -353, -447, -541, -139, -261, -321, -40, -25, -8, -8, 111, 130, 112, 191, 159, 194, 251, 297, 121, 179, 453, 139, 141, 336, 321, 72, 164, 244, 123, -32, 238, 146, 86, 140, 79, 75, -111, 71, -42, -18, 4, -265, -157, -157, -192, -136, -298, -190, -379, -424, -312, -512, -632, -615, -392, -626, -457, -411, -459, -152, -183, -177, -81, 36, 156, 117, 101, 172, 201, 221, 441, 186, 414, 502, 383, 338, 646, 613, 490, 611, 725]
3958G25r0j65K88J1Q7r3p2j10l06J79rj73j49O7k43j53L6l36M8j37j66j23j02
3981i86J18j45m4j25L35j48pK47J39j39J79J82j26kJ18L05J0K67L5m20M56K0q5
4004A84K71m5mj26J57J89l17K8L46j66n3L80l74mK00Q8l43m6J70k08k0K13k47
4027B73k44L33j7m63J01P1k27r8J73j48P1N1J01m06J72K3l30K5K83j39M3L44l67
4050c75K08J83j40JP1J90j06j68L91J2m24J81J45j57J91J76k43k23Q9J04j55j15
4072a64K00l64m5K98l23J7L48k17k17L54l0l3k46L27j0j09K4J49j00J08J66j61
4094b8K6L54l53M1L6P1j89K37M5r2nJ61k78J41J34k0p3K16m8k9P5p2K56q5j36
4119C85P6j98J13K0k69qJ96l65J1p0m42M53k96J08j58J5R6J01k06J32N0Ll2RK85
$$ y = [725, 635, 470, 758, 769, 856, 763, 691, 581, 275, 454, 445, 272, 123, 190, -53, -206, -170, -506, -458, -595, -761, -884, -986, -868, -1013, -1057, -1182, -847, -995, -1002, -755, -616, -755, -576, -394, -520, -522, -404, -99, -89, 178, 213, -207, 249, 269, 184, 455, 410, 406, 280, 437, 626, 309, 337, 683, 517, 464, 844, 470, 466, 666, 754, 411, 365, 535, 327, 307, 520, 273, 29, 362, 345, -118, -17, 54, -173, -271, -98, -246, -175, -124, -23, -429, -257, -234, -564, -539, -256, -395, -352, -8, -375, -167, 16, -124, -123, -52, 138, 32, -136, 255, 267, -157, 24, 169, 12, 203, 379, 136, -87, 2, 106, -49, -164, 36, -328, -373, -75, -398, -381, -33, -250, -467, -113, -143, -176, -422, -95, -105, -214, -190, -41, -141, -33, 133, -28, -2, 352, -1, 40, 76, 147, -42, 195, 240, 148, 143, 304, 26, 167, 301, 281, 208, 424, 376, 347, 422, 350, 606, 521, 385, 461, 263, 376, 396, 127, 119, 315, -50, -39, -109, -551, -98, -394, -286, -444, -429, -333, -232, -438, -306, -256, -253, -285, -276, 9]
4144Iq4j04J63M3k38L32k21n6J76o5j35O0j0L1j33k8J58k61M0J13j17J29M33l69
4168a34L7J71J19O7j43K27J49m30L07P2k41M37j29n29K73J16j95k96O6K56j54
4189D6j54K47k90j5L69k96j32M49n3j64L92j47m6O8J61q6K4NJ7l37J99O4m38K80
4213A63l4l47Kj07M1j48J42p7j76j45M15k43j80N26m0j73K12K81j16J01j71J78
4235A04j0J51Q3k09K19Q5k65p6K00l07J82l9k60P4j4Q1j02j34K24j59k08K79o4
4258a65j72L40j3k18L12k07J79J2Q2j34Q9j22K51j33Lo1j52J35Q3j03l1j0j1l4
4282h0k18J94K6o5M2p9K99J10j96K14PQjm1r2J13J03r6M4R3k59j36J66M5j98n
4308bl2j11R1j8k96L8Q6k4k01Q9P1j15R7J48j85q6L48J29k11P9L25m83K29K16
$$ y = [9, -75, -179, -16, 27, -211, 121, -100, -156, 20, -45, -180, -120, -130, -99, -232, -260, -102, -363, -323, -210, -327, -198, 235, -134, -97, 74, 193, 260, 117, 344, 493, 63, 370, 442, 201, 638, 509, -20, 253, 369, 174, -122, -56, 200, 46, -108, 139, -151, -166, 203, -93, -225, 224, 171, 7, 399, 252, 206, 274, 435, 349, 373, 378, 395, 58, 257, 321, -117, 163, 129, -218, -216, -323, -282, -430, -288, -365, -541, -686, -271, -514, -694, -168, -208, -381, -169, 112, -4, 97, -74, 104, 94, 245, 328, 119, 338, 423, 158, 82, 282, -25, 157, 118, -142, -68, -82, -1, -103, -237, -13, -172, -380, -101, -165, -337, 3, -10, -228, 84, -123, 56, 68, 150, 16, 105, -17, 234, 101, 104, 43, -109, 26, 109, 6, -25, -35, -46, -80, -298, -104, -78, -143, -101, -180, 119, 229, 33, 247, 254, 262, 261, 220, 128, 241, 344, 248, 292, 385, 126, -10, 156, 201, 3, -2, -34, -145, -54, -72, -368, -330, -244, -268, -469, -380, -309, -424, -327, -179, -364, -450, -102, 27, -184, -105, 220, -263, -34, 182]
4332A82k52L2K76j12k56K56Q5l57N9M50m61nL62l01k58L98K84m95J82J92k86k0
4354d5K95j61j39K92j33l19J68L31k86N6R9j40l9J80Pk04j13K22n9j83M41k19
4376E1k47K28J55k32R1J51k09j15J89n7j50K08j12j65K85q8k2j7J1j18J3J67j10
4399i3J86l19L92j10q7L32j63r7N6k8L0J55k8j61J42o1j69l8J06J4k93J81L3j24
4423a44Q0M2J24l51K43n6j24J97j44K14N7q3pj09MJ55L2k8NO3l18Q3J46k01K6
4448i4J14n5K5j21O1j01l0O0J7k04J76N5k6K0O0Mj1K53j18m0m9L73l71J24K01
4473C23j38j77J36J00j48R3K06j77N3K58k27l45J78P3k00Q5K52j96l07L37j31
4494D8l82N14j30j76J05q9k11J67K23j14m46M10l0o5J9J73l20J14L46k12k53K18
$$ y = [182, -70, -38, 238, 126, -130, 126, 211, -146, -87, 363, -98, -103, 259, -42, -300, 98, 382, -113, 69, 261, -25, -45, 250, 89, -50, 242, 109, -210, -42, 289, 3, 59, 158, 18, -21, 159, 166, -38, -151, 71, 12, -171, 270, 51, -196, 32, 187, -45, 46, 197, -12, -127, 62, 5, -145, 63, -49, -214, 71, -17, -39, -56, -45, -163, -150, 17, -93, 93, -226, 166, 56, -31, 301, 138, 41, 97, 69, 99, 254, 226, 65, 207, 146, -23, -61, 45, 59, -234, -53, -20, -144, -64, -22, 102, -249, -6, -62, -186, 11, -133, 81, 138, 55, 48, -61, -57, 98, 130, 102, 107, 170, -148, -65, 81, -120, -94, 20, -35, -10, -131, -70, -171, -201, -141, -124, -328, -152, -97, -123, -103, -43, -39, -50, 203, 85, 45, -4, 369, -2, 122, 323, 185, 8, 144, 244, 96, 189, 395, 218, 271, 529, 302, -43, 135, 208, 8, 93, 345, 149, -158, 179, 48, -334, 180, 50, -126, -21, -110, -321, -154, 69, -45, -491, -81, -111, -176, -157, 16, -304, -190, 156, -56, -309, -91]
4516i1Q2k88j7K83j89n6M15k21k26M64j2l43J19J71j22J9K85k15j95L02k02m3
4538h0R2O4k92K34K10l42j37K27%k66K25Q7j26J0L26j70k76M23N1l44K98J43l03
4561E4J24J40k0m3O3on1J26j0l04k27L78j67j47L31k18J8k1Qj12Q9M7l4k55J37
4586a00R7l40L81J77l03JP9q6L7l19J03j6j43R7J21k06N4p8J57q8n3K69j20O3
4610b16J72Q9k09N34k44j10K97L3M0j44L07m1k78Q0J05k64K74p6l90J73O7k60
4632f1j26K95j42m7j23J18j5j02M12j05k96L37O8k39K69R4k59oK43j39j85K72
4654B63kl05O5L40n68l7M84m90K9P0k4r3j15N3J61l92O56l29k73N20J3m11L62
4677b3K74l31J20O9k91J60J97j12m32L26K55n47k0L94k07j63K06j9k57K30J38
$$ y = [-91, -9, -297, -314, -31, -220, -276, 139, -82, -308, 156, 144, -199, -80, 91, -31, -12, 273, 58, -137, 165, -37, -80, 12, 76, -216, 18, 228, -114, -251, -24, -24, -290, -65, 22, -104, -94, 232, 62, -214, 209, 260, -84, 214, 357, 54, 178, 318, 298, 255, 318, 312, 261, 387, 377, 73, -154, 224, 57, -90, 241, 23, 41, 20, 28, -84, 5, 52, 18, -237, -100, -3, -343, 38, 215, -88, -87, -8, -94, -57, -376, -273, -289, -432, -335, -214, -420, -366, -444, -287, -375, -428, -159, -279, -216, -44, 45, -164, 370, 126, 16, 313, 346, 386, 242, 549, 508, 230, 310, 415, 151, 425, 349, -41, 132, 199, -61, -187, 108, -34, -81, -204, -86, -101, -203, 209, 104, -192, 145, 213, -26, 243, 337, 78, 72, 315, 176, -9, 263, 261, -44, 21, 361, -207, -244, 240, -250, -221, -151, -175, -268, -383, -330, -169, -561, 95, -234, -507, 13, 26, -385, -23, 251, -80, 40, 109, -182, -22, 175, 63, -369, -43, 212, -335, -355, 39, -168, -331, -125, -144, -401, -171, -33]
4698c3j35j5K31P8l80L11J50j97L32J6l35M15m2k59K48J47j41k29QL5k57J24J29
4721B01l93P2Q3k31P4J86k06L6k27K63J19j19K39j98Q2K01j35K3K1l7O5p3J09
4744A55J3p4n0P8j32k3J27m0Jj05k83K37j59L0K82k54j13K39K17k48J52Q5Mq1
4768E8J69o7J9p9N6j11L0K32m73K20K12k69j41K25o2k71Q4L4j11L4K84k22k34
4791c83M37p7k81J83J25k44J57L09j45j80J99%j88K42K30m22q0L64j71k42N23
4812C56l25j25K86O4l63JL45j56j96J65N5l75L91J46m25J28K81k80j11L01o0l15
4834b12J35K69m89K24K87l43j8J73k42j59N41j61k41P0K00j69N2k3Rq4P4L37m64
4857b34J32K67j93j7O2R9k88K33J3j51Q4k4j60M2M18m65l7L05k64K63l1j55J46
$$ y = [-33, -168, -183, 48, 126, -254, 57, 207, 10, 342, 358, 23, 438, 396, 137, 385, 532, 391, 162, 170, 205, -52, 72, 201, -192, -120, -37, -268, -194, -8, -214, -178, -405, -142, -23, -142, 97, -101, -19, 182, 47, 70, 91, 54, 119, 46, 155, 168, 94, 44, 122, -10, -33, 94, 54, 55, -50, -333, -96, -255, -225, 57, -197, -310, -71, 146, -102, 50, 135, 139, 58, 227, 160, 179, 100, 156, 45, 75, 307, -166, 54, 266, -3, -144, 81, 19, -252, -168, -134, -245, -211, 73, -149, -383, 54, -23, -304, -121, 4, -240, -83, 226, 81, -99, 100, 100, -88, 154, 384, -38, -118, 246, 75, -167, 356, 31, -94, 192, 256, -107, -106, 239, 83, -113, 52, 107, -268, 123, 269, -156, -28, 253, -27, -138, 163, 103, -212, -77, 192, -297, -73, 214, -129, -147, 26, -216, -375, 166, 5, -236, -166, 34, -135, -83, -106, -97, -181, -107, 230, -234, -102, 165, -28, -45, 17, 116, -172, 61, 74, -77, 7, -17, -177, -135, 283, -182, -219, 86, -178, 85, 54, -101, 45]
4880D5o6J36rn7P5k12%J08L74l61n3J81l01K1K32j11q9j28O2J67K7n2p9J09l4
4905a5k3K1M0j04KR4q8J11J58oj10P0jq1LO4J51l45J79j20j54P7J6k5Q2j37k22
4932c63K45O9j02j27K71k81K51J88j34r6J54Pl6K18P6j92k40L64k5k26n4K62l93
4955a64Q3J43p0l96L68k33N8N7J61l06J24K54j81k3K87j51J6J39R9m56K97J51
4977B57l83%L78k61k12M06r2j60P0J43l98J35K20j55n2K16J9k09J53N8k47R2K26
5000B04l7l40J68J55k36J60o0j16QJ54l7Nq7J13k72K19K18l84O5L2M2j07K32k25
5024a26M0J82j8l7j16K90k69J19M6Q7j16j11Q4m6J48o9k07k0R6m3Q0p1k58j3K61
5049h7j54J04P7n1J4k07J69j3L6O6P4K3o5N4J59m3k00r7K27J53k20J3L21l05n1
$$ y = [45, -21, 115, 106, 49, 124, -88, -88, 20, 394, 33, -20, 161, -140, -119, 113, 2, -87, -215, -153, 14, 41, -11, -90, 19, -15, -38, -17, 23, -81, -79, 15, -73, 38, 196, 190, 80, 150, 149, 68, 71, 135, 286, -59, 120, 0, -154, -77, -61, -86, -4, -141, -363, -118, -49, -151, -278, -7, -288, -37, 151, 17, -79, 75, 82, 46, 264, 340, 148, -92, 272, 247, 21, -33, 229, -164, -81, 62, -8, -404, -36, -269, -211, -154, 7, -299, -175, 79, -102, -125, 162, 11, 27, 166, 265, -191, 106, 257, -126, -126, 252, -9, -221, 185, 93, -67, 3, 146, -252, -117, 103, -52, -104, 112, 131, -78, 75, 133, -114, -22, 204, 167, -173, -5, 150, -86, 74, 14, -102, -94, 60, 23, 28, -59, 54, -218, 1, 219, -165, -100, -68, -26, -133, 99, -126, -86, 96, 78, 41, -75, 215, -54, 65, 111, 198, 82, -29, 55, 9, 157, 88, -119, -139, -43, -86, -6, -77, -335, -348, -87, -241, -137, -60, -111, -97, -304, -135, -148, -112, -46, 28, 51, -14, 40, 199, 156, -44, -141, 86, 239, 19, 32, 353, 48, -3]
5074cK30m3k60K3L5j04J68r8r6q7K55Ql5J23j5k52J81R9k32L25j76pj4J77j4l18
5100a30J47K08k65N4J40k50J6K68l25jK3L27l62L0O4J08j71J90P5j89K49n3l65
5123b12L20J48m14M9K72k74j47L07j49j58K02J69l72P9K10n0l61K30O0k96L26
5144f1J6m7N0R0o9l02L59Q7j98J55K27j78O1O9j34m4R7o8n9N0J11k48P1J62j39
5169E8q1J80k58NK22r1K6R1j57MP3j63J55O3p3J50j78r4L32m18r3J06Q4L8lj84
5195b06K4J44p6j21p4J22j00J5K03j10J61j11nL9N7J0l5Q3j42L51k57O4m2L6P9
5220A09r0k1j2O4k67K43K4j09J10Lk7m0N7j89O9J25K9j97Q6J79k87K07J21j36
5244E1L1J52k21P3k5r4j38j25L17N6k33J19o9oK7n8J0P2J13j54q1K14K9k21K13
$$ y = [-3, 227, 184, -76, -53, -18, -122, 46, -52, -148, -235, 20, 28, -7, 116, 101, -151, 30, 129, -103, 222, 46, 39, 25, 202, 188, -130, 17, 225, -40, 14, 154, -96, -80, 188, -137, -138, -115, 212, -150, -120, -56, 52, -119, 71, 146, -43, 206, 153, -212, 108, 256, -158, -109, 163, -111, -258, 49, -100, -258, -56, 113, -259, -180, 30, -20, -381, -151, -91, -387, -61, -45, -92, -42, 48, -21, -323, 36, 123, -75, 80, 307, 129, 190, 259, 125, 81, 178, 110, 51, 101, 212, -36, 35, 197, 58, -23, 157, -101, -96, 126, 35, 61, 152, -5, -1, 72, -91, 64, 127, 54, 204, 26, -68, 264, -154, -247, -141, -57, -19, -22, -206, -182, -38, -114, -235, -309, -187, -287, -272, -69, -179, -18, -129, -134, -95, -38, -28, -63, 20, -122, 229, -28, 36, -6, 30, 109, 19, -2, -14, 50, -217, 26, 50, -59, 51, 54, 27, -13, 44, -145, -76, 49, 78, -119, -33, 146, -141, 66, 187, 51, 82, 234, 13, 86, 61, -33, -171, -296, 21, 77, -156, -37, -106, -112, -85, -143, -133, -61, 52, -102, -183, 31, 60, -161, 52]
5269E2Q9p5K1J78k38M1J78k80K8j27J25k38L28M6l83N0J59j31j90L89j17r6K21
5292C0J04l36j4L56o8N8K0l1n9J21K57l99R4J77j44j28J45r1k71J72J33j01j97
5315a72J50j08j90K02o3j32J05J43j23J05J97k44J57J18j08Q6J54r5j65m9K99
5336B67j05M9Jj17N4M6k29m6N5j01N5j42J44R0j2J13r7m9K22k17N1J96p2j41j38
5361a23K24P6j0p6P4j73J07j68l9N9J34l08J41J68k87J70J14k42q3K66r0J08j58
5384a16R5NJ1J57P4k08J59j57j57L91l25N1J10j17j61Q4K18k62K01q3j17j74K75
5407d6n2j12J98J38k99M8J33O9j93R8J79k00N6K78k47n1J51j84j2J39N4k51J87
5430H1L4j33r0J59l2L9Q7M6k03K27P0k59R8J11j03p2J71j01k77p8K67j62R9M2
$$ y = [52, 141, 66, 87, 265, 27, 68, 246, -34, -6, -133, -8, -246, 82, 128, -255, -205, -46, -177, -367, 22, -95, -191, 30, 134, -202, -216, 140, 72, 130, 150, 119, 60, 181, 438, 39, 133, 310, 166, 38, 183, 92, -179, -7, 126, 25, -172, -22, -130, -320, -118, -181, -313, -208, -65, -188, -83, 114, -130, 27, 145, 37, 123, 277, 182, 17, -32, 267, 162, 211, 212, 95, 149, 195, -34, -80, -25, -126, -71, -213, -69, 21, 9, 122, 25, -24, 198, -19, 32, 228, 156, 15, -123, 101, 177, 167, 91, 165, -8, 99, -69, -108, -49, 85, -223, -82, 86, -201, -31, 83, -159, -242, 24, -66, 42, -116, -21, -16, -5, 152, 226, 18, 177, 20, -137, 254, -71, -20, 90, -27, -188, -104, 114, -148, 53, -30, -147, -321, -46, -98, -210, -12, 126, -173, -125, 8, 77, -116, -18, 161, -39, 17, 295, 48, -3, 148, -36, -48, 91, 145, -106, 81, 115, -18, -108, 51, 19, 58, 145, 191, -12, 215, 285, 26, 124, 235, 132, 60, 231, 130, -147, -225, 42, -120, -21, 21]
5454B1J3k66L42q2k87K70P3r2k89J92o8K21q2r7R0j7L9j22l3L20k56L2Q6o6p3
5479a31K04k07Q0Q7n8K3K14j64j32K35M3k03J60q2K19l26K3K47k35j00J65Q6l9
5502A09J7j5j87J06J8j33J49n2q7J0K7l0J7M6KP3k56L3RK07n1L4j06J04q3o6O0
5529d5J08p0K71j36j79M5k2M1j77L02r5K0R6N0m40K13k1q2R8Q3j43J23j4j98J08
5554f4R9k79R0j4qN0M7J78j02j53J48R1k67L95k45O1m6J48Jn6J00nk4m6M2m8r3
5581@o0O7P8L5p3p7N6K8k36J64J21k06J03j0p4l5M1J02k06J75m8R6O3j12j30L3
5607a05L5kK6NL4J02k15L28l0m56K85j28K9J68j18k50M07%j05j22K10j74L8J37
5631I9Nk20K14k6k22K10j5m7p7M2J74j22L5j3q2j10PN6j8J83j54j4J20m6o0O3
$$ y = [21, 34, -232, 110, 28, -259, 11, 84, -8, -297, -105, -173, 48, -34, -131, -41, -58, -19, -141, -174, 146, -110, -78, 8, -58, -131, 73, -134, -54, 33, -25, -2, 212, 48, -84, 151, 194, -9, 151, 69, 288, -38, -15, 232, -3, -103, 62, 148, 109, 126, 111, -76, 30, 48, -85, 64, 12, -75, -65, -38, -68, -51, -5, -3, 70, -186, -153, -144, 63, 12, 46, -60, 44, -39, -105, -45, 63, -7, 264, 128, -51, -6, -28, 13, -164, 138, 43, 63, 159, 209, -231, -18, -39, -121, -23, 60, -83, 40, 26, -172, -64, 35, -244, -154, -168, -176, -126, -79, 99, -3, -156, -8, 83, -184, 211, -34, 27, -19, 129, 130, 74, 174, 169, 145, 99, 141, 93, 0, -60, 7, 85, 120, 47, -30, 26, 54, -182, -18, 103, -103, 0, -10, -84, -119, -78, 24, -182, -7, -55, 41, 104, -8, -138, -105, -70, -72, -46, -41, -7, 95, -120, 208, 178, -278, 7, -121, -92, 76, -42, -292, 115, 115, 10, -112, 98, -76, -38, 99, 104, -116, 98, 72, -150, 60, 45, -2, -79, -37, 137, 15, 50, 37, -45, -155, -148, -92, -110, 73, -81, -95, 25, -21, -81, -18]
5657a8M6j64J14lo1Q4N9o4q6J4J7Qj8R7qp4j50QJ69O1J0j44pk7L7j2L67l68K66
5686A53j49L6P4Qk6P4j58j97Q2J60j64J31qL9M5l29J40M8p0J06m8%J12P7j16m9
5712b9J98k7m6j02L78k96R0J21j66k04J69O9j86J49j76R0N0m2L8l96K26j2l09
5735d13M00n0k38J43ml2J82j37R9m2K04L2k84O9rJ16j99M34l33p5R2J05j44K47
5759A63Ok87m7J84n6l5J32N2k55J73J95j42j37J47L0O6L0k1j56j34L56l23Q2k4
5783am1L9o4n2J7j9O2p5J18J26k33m5J52N7j2j11R1LM0n1P1R9K4r5L6j83J02j39
5811h4R9K04l06j01Q5j0m8J90k07O8jN3j25J89Q3j07O2P4r0j65K82j27j58L49
5835B09j51j43P0J19j20M4O6k41K27k27k7Q2mMm5J88n2j9R4n5m9J2K53j98n0J79
$$ y = [-18, 28, -136, -22, -25, -86, -2, 57, -7, -93, -79, -62, -54, -72, 25, 17, -57, -207, -199, -30, 31, 41, -103, -110, -137, -100, -112, 255, -113, 153, 4, 40, 114, 122, 96, 170, 12, -185, -103, 57, -107, 24, 16, 55, 100, -229, -89, -41, -111, -5, -53, -53, 59, 136, 20, -29, 169, 142, 96, -6, 372, 76, 166, 287, 121, -83, 86, 155, -31, 118, -58, 32, 82, 40, 78, -318, -92, -104, -413, -13, -63, -301, -158, -162, -194, -12, -149, -50, -92, 112, 144, -140, -71, -80, 36, -163, 271, -62, -137, -45, 60, -84, 163, 169, -118, -165, 19, -37, -72, 60, 112, -143, 30, 225, 83, -54, 93, 123, 189, 219, 198, 42, -92, 264, -59, 23, -1, -42, -3, -67, -119, -102, -121, -59, -134, -16, 110, -123, -168, -16, 41, 29, -82, 9, 12, 52, 1, 72, 171, 195, 100, 136, -47, 55, -84, 15, 219, -87, -188, -103, -113, -161, 29, -178, -110, -111, -58, -183, 6, 89, -18, 44, 118, 28, -137, 145, 18, -140, 209, 58, -85, -15, 104, -16, 28, 94, -147, 80, -147, -174, -92, -96, -92, -137, 51, -1, -20, 74, 19, -30, -18, 235, 37, -13, 166]
5861A66o3k76J30J38l11K99M4r5l02L33j52rM7J09Qr3P6j6R7m3j20r3K88kk32
5886g2J33K3n7j8J61p8m8oK2j20J91j2p6n2p4K55l41L07j6p8j36L76j92q0Mn0
5912c4MK40j95r7L27j92l5q6K86j45r6KJ2j06K60k31L4n7K1j75K52J05J1k46J
5937a40J00j51J04J05k49J39j47L9J11P9q6m6J80J31p1J4j48R6P7l0P3m5M3j74
5961DP8K22l11l6J33m1j0m9N5P9k83P2J97j23j7L0qP0l2p1p4L57k41J14j10K27
5987B32k73J25M8j73L9N2K9o9N4oMj26K7MM0l9n7j00K45j62N2o7N3j68K13Kl8
6014e9j25N0O3k47K87L6j09K7J53k7P7l0%k1J6m2j48J29J6j73K00N2q3j00K04
6039A46k39q2K66ok42K11Ko1K1R4j9JN8K36l24r1K05J7j92J33j20JJ67l46J9L7
$$ y = [166, 103, -173, -43, 95, -216, 83, 127, 32, -270, 63, -89, -98, -51, 58, 66, -27, 49, 33, 130, 87, -33, -126, 162, 160, -72, 61, 84, 27, 9, 170, 92, 44, 38, 60, -60, 131, 119, 43, -9, -83, 172, -169, 138, 122, 44, -92, 284, 92, 12, 16, -34, -30, 210, 15, -82, 245, 53, 18, -68, 218, 73, -23, -21, -9, -115, 145, -86, -52, -109, -88, -263, -11, 94, 105, -141, -140, -40, -191, -87, 18, -231, -92, -239, -200, -89, -10, -96, -142, 38, 169, 98, 112, -36, 60, 137, 107, 180, 135, 178, 4, 82, 304, -7, -43, 90, 49, 39, -10, 45, 124, -159, -87, 110, -13, -30, 0, -8, 62, 30, -41, -115, 242, 1, 115, 5, 232, -41, 84, 132, -41, -2, 50, 79, 10, 64, 58, 62, -64, -37, -33, 7, -32, -89, -189, 56, -106, -54, -121, -68, -236, -23, -21, -59, -184, -134, -71, -318, -31, 5, -104, -77, 76, 49, 126, 96, 96, 75, 91, 49, -99, 30, 46, -127, 73, 125, 42, -58, 146, -93, -175, 91, 85, -157, 54, 56, -5, 16, 110, 91, 92, 150, 386, 62, -29, 176, 193, 1, 134, 14, 15, 182, -164, -145, -108]
6065a08J58k1r2J92j49j01L16j11l21N2J78j00n4K06m2p8R2J05k71L45j4k75J15
6088B2j53K01j62oJ60m8J29j28o4P0j2j7N2K48k15K29k22k7K8Kn5j22P1n0K79
6113B10l90N6n7k2J41j24Lm8J36n8M0o6K2o8L08k9L5q8k0Km5J75p0L9J52j17q4
6140C3J16r9O2j11Q7O6j49N6j72J80qK7k13K09j86M7J58j49J94K4k6r9k8R7j78
6165f2r4L38j7j78N3o7j94J04J12j00l8J11j34N7k3J49m6LOJ2J7L4J1J78J29k95
6191F6j28K27j70J19l44J72k8p9J74l1j17K7r1J98J15j99j6L7%o4j0K10j15n5
6215a02K39l4L6kK0j10N6Q8j11l8n2K39j11k04J41J23j71P0o4L9j2p5N6N9q4R
6241EJ70o4K4k3N0j26Qr2K65l00K88j18l05M0l6J97R9k67l7J29l5O4M6N9J6k14
$$ y = [-108, 50, 29, -63, 129, -20, -121, 195, 84, -237, -185, -7, -107, -161, 45, 3, -75, 17, 122, -149, 196, 182, -93, 22, -131, 70, -92, -98, 62, 14, 143, 15, -49, 21, 9, -8, 44, 292, 77, 306, 84, 57, 85, 87, 32, -90, -19, -69, 210, -180, -124, -181, -203, -62, -186, -183, -231, -95, -153, -113, -179, -157, -225, 83, 54, 89, 1, -19, -17, -62, 113, 43, 82, 234, 117, 33, 149, 50, 112, 1, 88, 154, 5, 61, -111, 69, 61, 88, -125, 84, -102, -55, 103, -46, 148, 172, 146, 47, 19, 116, -62, -156, 182, 165, -13, 40, -27, -221, -117, -5, -105, -143, -32, -166, -109, -132, 17, -29, -26, -20, -8, 9, 43, 54, 232, 361, 66, -62, 165, -5, 114, -230, -58, -86, -165, 9, -22, -139, -112, -203, -5, 110, -89, -105, -68, -68, -132, -142, 68, -47, -102, 137, 103, 139, 137, 157, 47, 103, 191, 80, 42, -10, 229, 118, -86, 55, 178, 7, 77, 13, 52, 40, -35, 21, 80, -4, 5, 175, 111, 135, 112, 162, 36, 44, -48, 217, -83, 205, 87, -218, -178, -214, -17, 82, -185, -222, -93, -128, -64, -18, 41, 57, -157]
6267a57o1K91K0j14j12K0R1O1j01J66M8J6q9n7qJ75p2m2k0j03P4K11k61M7N1l3
6293D1Q5j39L3j18J00J92j10j01pJ07j39j8L1K52j56J33m00K20JN2j06q3L0q0
6317a80L4l8O5Ol4J32Q5j79n0OK56j07r7M3J38r0J09J35j14j8K42m04J14J71k78
6342e3Q1J75k14L0R5r9j2n7O5J61k21n2J78J2K4J1k20J25qmk41K22K8j29O3P3
6368C3N7r0J10Jj03Q8k09M8J24j04J03n2lk1j11P8m8k9K03j93o5P9P3o4r4J77
6394a2J62j60M9m1j19M6J76j36J11q2p1K50l9k21J14j4M8M8k32K75k27J03m6k6
6418d4Q1m0J39k78K40J0j9O9j29k2j27N5J55k9j17l6m9J96R3m0M0N8j76J6n3j0
6444a7P6j02K9j1j09O1J09j90J78q7l21K04J89j44J81p9j00j0J48j05K09q9L2
$$ y = [-157, -218, 73, 93, -21, -133, -113, -22, 39, -62, 104, 152, 168, 79, 22, 14, 189, 117, 75, 55, -48, 26, 237, -24, 23, 74, 41, 126, -13, 20, -98, 2, 194, 84, -17, -24, 83, -56, -74, -43, 209, 53, 186, -214, 6, 7, 59, -47, -130, -100, -180, -146, -184, -119, -113, -147, -15, 70, -109, -159, -153, 103, -4, -101, -58, 80, -10, 99, 234, 120, 102, 344, -60, 54, 225, -53, 28, 203, -11, 19, 114, 15, 3, -54, 11, 172, -49, -101, 77, 89, 113, 124, -96, 29, 21, 17, -224, -2, 26, -103, -40, 33, 90, 0, 110, 111, 8, 96, -113, -65, 59, -45, 58, 6, 3, -18, -129, -51, -99, -128, 75, -118, -183, -104, -31, -95, -189, -12, 150, -10, 39, -2, -121, -75, 101, -35, 76, -6, -77, 173, 134, -87, 27, 13, 61, 109, -123, 152, -75, 28, -18, -44, 37, -3, 136, -142, 98, 108, 89, 158, 29, 7, -120, -65, 90, 61, -56, -92, -141, 55, 148, 108, 148, 206, 30, 46, -7, -17, 59, -43, -14, -25, -134, -73, 36, -154, 24, -63, -384, -180, 9, -135, 46, -33, -133, -143, 5, -100, 109, 20, 52]
6467E2j21p3N9k0J23J77n1k21J2j02QQ4L02k84j53J59R0M0j56l6O2J58l5l7q6
6492d9J10O5j58L19qk16J27j28J65r5j11J6j3j29K2p6K26J07k32N4l0M2j68J79
6516A9O8l7J15j06J56j42k0N4j24K40P9k18j74J21j37Q4q5J62j06J65k15k4J67
6539D2r5r0j6R2nK11j07k10J24J56j69j60L74l85K89NM9j00J04j73l7J27q7j0
6563g1K13M3k67L7J2p3N2J12R4j11q8J52j73P6n6q5J54P1r4%k01J41m4J82j56
6588h0K6J03k7q8KM7J76n7m4J03k05r7K77j13MP8M0p4RM7o4k12Q6J35n2r6l0j01
6616b07K11k06J03O0L9O5j83K87j21j64J37O1k9l9J3N5j45K89j91p4J46j14j18
6639a25p6J58l3p2j24j7J10n9L9j00K91j64L5k4J57j58K40M2j11oR2r7K2K89k16
$$ y = [52, -69, -142, -83, -103, 20, 197, 146, -75, -63, -165, -157, -73, 229, -55, -208, -49, 41, 81, -75, -111, -49, 109, 74, 37, -49, 61, 126, -32, 287, 279, 63, 190, 62, 227, 132, 21, 37, 24, -105, -83, -159, 67, 174, -58, -4, -34, 8, -160, 19, 87, 50, 165, 59, 215, 73, 53, 107, -17, 223, 302, 84, -90, 31, -106, -22, -107, 55, -51, 114, -101, -125, 42, -53, -143, -159, -67, -72, 139, 32, -178, -54, 102, -67, -227, 147, -238, 51, 56, 105, 5, 109, -64, -101, 26, -61, -71, 142, 185, -82, -45, -33, -106, -54, 58, 152, 41, -47, 105, -68, 8, -48, -133, 21, 92, -2, -2, -203, -62, -106, 76, -80, -54, 49, 22, -66, -64, -17, 159, 102, 58, 161, -44, -141, 136, 23, 27, 105, 145, 71, 80, 127, 63, -149, -63, 72, 20, -76, -106, -207, 4, -202, -99, -39, 0, 65, -118, 169, 48, -116, 21, 82, 53, 14, 27, 82, -63, 226, 35, -39, 107, -7, -125, -201, -43, -76, -148, -272, -289, -179, -238, -199, -299, -8, -172, -137, -161, -4, -162, 78, 120, 9, 3, 95, -2, 20, 309, 93]
6664I3M4j68K84q0r0k27R6O1P1jp1J7P5j60J4K3J5m5J15m7k3n5K06j19K8J9N1
6691A26o3K27j45j18l8k0j29J86j16q3J42l0O4k21K31k52J65N2J22j69R4m9j84
6714b08j8L33j03J33O3l3k29J7J00k29J70P3j4o8K1P8nj13q3O9K1K29l08r0L03
6739A09j54R0q2p0K12o5m3J2K2R7k25J84J15L2k89K38r2K1Nn4q8q5R7m8j6N9J27
6766A09j29n5K17l08P5R6j90K17p2R2oJ11q5j22N0O7j52J22nQ7l91J73K2j04K56
6791G5k54m1K43o0n3K8l2J00j00M6J88j65r9L12k44J16n5PO0j07jJ56o6r2J51
6816A13j77R5m9j5j30K60k8j26k4J66p7P9j76j4N0N6j10O3K08l07J30k8o0k4J31
6841FM2m1p9O8l1P9oM8q9O6P5k5k05J27J15k89K04%mM2o9L8L3j28r9J95k07N1
$$ y = [93, 137, -31, 253, 173, 83, -144, -48, 13, 84, 83, 12, 29, 104, -56, -42, -19, -4, -49, 66, 19, -4, -59, 147, 28, 56, 75, 126, 63, 290, 145, 27, -11, -31, -160, 26, -90, -173, -31, -61, 3, -218, 13, -239, -74, -22, 100, -69, 25, -24, -208, -226, 107, 4, 137, 200, 167, -62, -45, 55, -174, -4, 69, 55, -13, 8, 86, 81, -32, -115, -46, -25, 204, -104, -194, 109, -45, 45, -37, -107, 105, 40, -3, 9, 31, 128, -97, 87, 202, 234, -55, 183, 91, 112, 117, 63, -25, -110, -13, -61, -77, -18, 109, -20, -75, 142, -166, -91, 5, -185, 32, -40, 52, 46, 157, 72, -50, 0, 67, -85, 37, 32, 119, -272, -99, -77, -181, 75, -179, -220, 23, -37, -90, -62, -94, 6, -94, -48, 140, -25, -124, 188, -56, 60, 5, 12, 72, -35, -36, 120, 54, -38, 113, -64, 31, -18, -33, -163, 97, 69, -57, -81, 85, 8, 87, -89, -103, -53, 3, -107, -44, 164, -143, -13, -41, -101, -125, 6, 48, 7, -72, -4, -35, 44, 38, 86, -3, 63, 138, 113, -92, 35, 150, -139, 65, 65, 61, 103, 34, 72, 105, -23, -122, 73, -134, -83]
6869h3J08kj24K18J8k52J33j27J12ll0L5J19j37N1q9P1j0k2m3J27l4k47K48J4
6894E1k95K26r3M8k5O6Mj27m4K74n3P3q6m2o6J50o6J13r6P0q2J37j36j90K44j14
6920e9Q6n1k45K10j16Q2J59Kj50K5k3L0K00j12Q3j92K14j43o1L5J47Q1j64K1q3
6945b4J44j74R8j2R2n4k14K05j98J33o2J37j3P1ol8j28l9J89j75J25J59l56K86
6969A46L4k59j08J50R8j17J66l5q1j21J11O6j58J10J85l03M5J97k29K7J12M9K3
6992A08k0k42K09j25K65k99J34j8O1M0k74K38j24Q5j06j14K45k38J81j16M6J27
7014F3j00J43j03j37K34j03Q5q2o2K27j30j04j7K29Q6l05J33k8j97J30K62k60
7036c6N9j78J08j4L7r9J53o7N0J28m8j59K10j44K3r4J6K19j60m4J1j4K68k62O2
$$ y = [-83, 25, 23, -101, 117, 135, -117, 16, -111, 1, -2, -32, 3, 122, -15, 36, -53, 18, 8, -14, -57, 70, 36, -211, 37, 51, -244, -18, -111, -63, -88, -22, -18, -145, -189, 85, 32, 105, 19, -23, -89, 61, -5, 108, 12, 82, 0, 137, 1, -189, 55, -59, 27, -24, -269, -59, -175, -93, 66, 68, -82, -57, -80, -50, 150, 38, 121, -71, 143, 0, -61, -26, 121, 202, 38, 59, -24, 120, -54, 44, 32, 124, 70, -144, 61, -137, -4, -66, 71, 58, 129, 123, 85, -43, -82, 107, -68, 57, 216, -140, 146, 180, -79, -187, -37, 61, -56, 110, 75, -6, -127, -16, 50, -108, 2, 187, -116, -71, 126, -103, -76, 36, 85, 108, 88, -154, 55, -70, 195, -104, 30, 12, 73, 113, -161, 77, -47, 38, -68, -182, 63, -175, 6, -110, -64, 63, -37, 106, 3, -134, 100, -3, 82, 0, -62, 165, 35, -69, -86, 143, 229, -76, 57, 29, -168, -38, 224, -36, 23, -155, -47, -61, -24, -123, 30, -37, 13, 141, 93, -66, 144, 0, 23, -71, -55, 164, 4, -40, -29, -43, 225, -37, 25]
7061B5r3J73l1oj21O0j7j04K56p1j2N5O1j39n3o4J89j02j66J38Q8j17N6K5N8j96
7087a08J06j53O4J23q1q5q8J99N4Kj98q5L45q5m0J53j02p4n3j0K06k04J11J46
7111A43j57p6nj3o5K65nj85p8K35l5j73K10J8Mo2P1n2J73j57k02J99m4J84l6o6
7137I1N3l04Q9L3N2P5j16K6P2j92J4mR6m1lN9J10p2l1j15m4J36P2Q9j65N1n3K8
7165Fn3J2j39K92k36o5P4J20j44J7o0J34o4Q5j07o9L74k38m2K25q2n5J58j87K16
7190A72j16n6lJ63o4l8R2j28O3q5j26QN8r2K19k24J97p1m0J44m2o0oP2N9j03J8
7217A1O0J2N9mj9r0j24J01M1P6l15L33r7r1k1K67k64m4J7J33j3n0q2j4R2j64K33
7244D3j77K54p3n3n1j49L05l4k2m5K9N6r8m6m8N8n4K53j10l6P4n3j1k0L5m6o1
$$ y = [25, -68, 105, 74, 68, -53, 7, -10, -114, 142, 71, 59, 114, 175, 36, -17, -81, 108, 6, -160, -22, 66, -51, 5, 30, 88, -108, -2, -155, -91, 32, -49, -134, -222, -23, 31, 33, -165, -250, 95, 10, -30, 123, 21, -53, -106, -116, 90, -114, -3, 143, -14, -90, -95, -108, -173, 92, 87, -98, -176, 59, 24, -149, 61, 79, 83, 21, 92, 40, 213, 56, -146, 53, 9, 193, 157, 91, 144, -160, -71, -38, 14, 89, -27, -1, 71, -121, -107, -111, -15, -56, -59, 0, 110, 38, 7, -108, -152, -16, 56, 145, -20, 31, -22, 6, -47, -35, -174, 118, -118, -183, -109, 11, -133, -116, -176, -42, -106, -21, -128, -197, 177, -61, -103, 122, 40, -15, 143, -44, 172, 56, 0, -3, 160, 96, 58, 150, 22, 85, 0, -126, -118, -60, -152, 67, -157, 40, -31, -71, 73, 31, -29, -35, 37, 96, -7, 11, 71, 83, 142, 138, 119, 29, -95, 6, 47, 123, -192, 141, 44, -47, -68, 199, -65, -109, -92, 41, 28, -22, -104, -118, -26, -190, 43, -134, 120, 47, -6, -57, -206, 99, 65, 43, -2, 27, 83, -15, -61, -109, -51, -105, 148, 38, 2, 76, 23, 12, -8, 27, -19, -80]
7271h0R6L8r4J20P0k29K27j36J69p1j25J70p9n7J03k08K05j43J41m7k54M52k04
7294F4k9m7J07r9ml3J06%O0Q0k03R3m1M1j19J2Q9j89J84j04K3q1J03Lk59K36K9
7321B2p4o7J94m7K5J6K54k66j08J39j09pLo8J13k6L6j28J59mk64P5J96l03K44
7346EK6j77K27J7j07l0J96p2o7N9r1J31j72K42k02l8R1j70r0J67L5J71l06pJ04
7371e8K0K4q7O4J17m1j0j36J77q1K22k34j17K32j32J32pk53K78m2m2R3j42o5o
7396i4L4J4L3j35O1r2N8j06K36J70k70K7N6Q6M1j04Nm7O7L9n8M6K5j47R9j34L8
7423e2P5p6L4j10O7l4J17r1J70r0j13J76Kq9J69l6j02j63J73j25Q4R9K8j30J5
7448bj4O5j11j04O0p8K27n5R7j63J68o8k6J9R8j57L2q8M0q3J86j40kL08k01J1
$$ y = [-80, 16, 54, -40, 80, 150, -79, 148, 12, 181, 110, -15, 155, 76, 19, 122, -86, 119, -24, 117, 70, -184, 268, 64, 35, -12, 95, -4, -8, -41, 65, 65, 125, 205, 2, 95, 54, 95, -24, -12, 77, -112, 72, -32, -9, -90, 13, 16, -243, -7, 22, -52, -119, 75, 28, 53, 69, 323, 57, -51, 88, -21, -28, -25, -93, 20, -6, 30, -98, 61, 57, -207, -132, 64, -239, 5, 31, -146, 81, 98, -9, -39, 157, 85, 18, 77, -14, 117, -55, 187, -15, -53, 38, -132, -222, -55, -20, 151, -155, -162, -58, -38, -14, -101, -37, 80, 39, 29, -107, 70, -11, 211, -23, -140, 92, -40, 92, 85, -168, 110, 68, 26, 119, -23, -88, -94, -60, -46, -13, -148, -87, -179, -121, -227, 9, 179, -91, -64, -8, 78, 119, 15, 20, -27, 40, 79, 21, 67, 92, -55, 44, -90, -52, 23, -53, -19, -129, -62, -96, 21, -70, 100, 10, -103, 73, 75, -14, 155, 119, 17, -146, 27, -98, -14, 85, 113, -17, -2, -16, 49, -62, -166, -106, -184, 43, -12, 85, -78, 90, 22, -4, 15, 113, -44, -12, -100, -60, -143, 43, -97, -99, 209, 8, 19]
7474A9M8r4n6j45K43jQm2r6P9L1o1J11j95M4K1J02%j22j3K78l7k25J90j02k1l1
7501f7K39j50M9K5r2r5L6J39J0j49N3J10P1N8k60J7J27Q8k21J31j11l6ORM1p0
7527d2M2p8L9J06j39J02L1K4k0M6j78O9j99J78P9L0k14K90j81j30J66k20J65L0
7551dO6k64J66j11o9J28k79K51M7j1j9JM3jJ71J3m4j33J18L3p9Q9j32J80k43K78
7577A95j17j5N4j00L4k4k2p1p8K73k27J00p5J13J05j13J24k12M5K4j46J89j27
7600g1P1n0J05J07j12m5kJ09Pj24o5J45j36Q7j64j3J31j49rL13j86j16J52p7K6
7625f6o2J04j09K62l9O8k95J1L6R8m4P3j54K16N9pj50L4j54J44o5K0R6m9J07l69
7651b35K80j12L6J97l9j71J56J02k94jK84L1o1j19O2j72J65L9m5kN1j03M7m8r8
$$ y = [19, 67, -27, -83, -228, 15, 14, 22, -20, -116, -37, -6, -67, 44, -151, -107, -86, 16, 16, -106, -119, 159, 122, -103, 87, -15, -36, -67, 172, 22, 71, 96, 4, -91, -55, 84, 94, -55, -2, 108, 179, 237, -23, -6, 121, 209, -12, 119, 8, -28, -22, -13, 28, -42, 0, -78, -39, 67, -72, 30, 61, 85, 65, 111, -67, 2, -197, -19, 60, 90, -124, 166, -15, -145, 21, -199, -34, -4, 62, -202, -36, -147, -216, -88, -367, -116, -69, -80, -99, -98, -55, -56, 115, 128, 84, -49, 69, 102, 23, 112, -20, 160, -83, 195, 78, 63, 117, 17, 51, 27, 5, -66, -144, 129, -98, 2, -73, 40, 145, 32, 156, -56, -11, 13, -133, 56, -71, 0, -50, 55, 162, 50, 5, 3, 112, 119, -5, -70, 75, -61, 26, -138, -151, -20, -169, -178, 135, -51, -167, -15, -92, -66, -128, -24, -133, 129, 90, 158, -137, -126, -90, 8, -36, 37, -117, 99, 158, 151, 1, 35, -119, 25, -40, -20, 76, 27, 134, -235, 45, -67, -31, 166, 127, -44, 112, 214, -80, -81, 203, 234, 173, 54, 116, -56, 109, 148, 103, 101, 152, 49, 96, 48, -50]
7676e0j21J75r6J01j16P1j2K7Jq1L5J14k49K79nj04J8R0K7j62n2J76o6k2j07k9
7702a58Qp0N0J04M1j00J65n2m9J16J10k89M7L0l8J39m3NJ82o8j27mp8J94r8l9
7728b2qk0M2J15k66J92q1J9lJ24k47J86l8k5Qj63L87r7k8n3Q7o6Q8o3j9J7o8K44
7756B42k21Q7k6j25NO0P8j07m4M8o9J95j24J84j61r3N3r4K48j86nP8j5m1J30J67
7782B64l61P9r5K7MMJ37J15j28q0j05K64k24Q7q3qK79k29q6J67j6N8j9J9j03N0
7808A7P7j62P8j23P5J47k31M3J36J60k48n2Q7P8o%K02j94k07J90O8n1o4L2p5N1
7834B8J21j93K4jj60J54o5L00j88r4k8KO4N0RP1j00l9J29k06nJ05J09J6j17k0
7860c4p3q3J23k6J18j81Q1j3p8J05K5j73n0K36l4%J03j23R2j48j7K36O6j64n1
$$ y = [-50, -171, 4, -92, 9, -107, -36, -48, -21, -20, -101, -66, 48, -201, 78, 73, -31, -13, 77, 104, -58, -110, 66, 0, -22, -129, -158, -150, -220, -170, -66, -25, -125, 40, -12, -61, 55, 165, -124, -77, -47, -85, 54, 11, 16, 198, 130, 3, -1, -79, 115, 17, -22, -30, -50, -8, 107, -159, 33, -48, -29, -32, 92, -155, 31, -7, -32, -24, -187, 200, 103, 75, 22, 109, 43, 131, 68, 49, 66, -2, 242, 21, 108, 82, -43, -38, 22, 100, -7, -51, -3, -72, 123, -1, 183, 22, -71, -18, -112, 136, -50, -55, 23, 8, -33, 97, 264, -97, -18, -113, -86, -82, -78, 59, 174, 46, -34, -139, 125, -99, -12, -95, -103, 176, -53, -139, 28, 12, 70, 51, 70, -33, 17, 94, -68, 10, -113, -38, 109, -122, -79, 57, 217, -31, -83, 4, 82, 76, 76, 278, 84, -123, 67, 135, 84, 20, 52, -23, 28, 149, -44, -20, -21, -181, -27, -92, 208, 20, -74, -102, -100, -36, 14, 23, 94, -6, -45, 84, -122, -127, -22, 87, 103, -14, -34, -107, -190, -67, -93, 25, -156, -75, -88, -166, -61, -36, -209, -259, -23, -57, -57, 46, -77, 15, -133, -150, 86, 152, -12, -63]
7885f3O4J36j25p6J7K1o1J12M8R4j92n7J77k14J14j6J8q6P2M0J12l02P7K92j22
7910H0K0o9oP4j68K61p5O1j51p2j40J31J92jj12o9%p4m6J42QOj27J9j07K06K10
7937A93j74k2k7j8j9J0pM6Pj40J72j06K5K16m7j91O4O5j02J15l1n8J91k10o3J42
7963C1J01O2j73k0K19l15qK23K7j60J81j55J23j16l2P0k60L21l2r1j03J6J08n
7987A2L7J08k05J98q6k0J62j95J5j55k4K71j61RK9J80k27q1L6q5J92L4m8P2q1
8012a3l4m1K0K34l22J11Oj08J94r8J0J06j24J05Q3j61R8r0j51K23J06k11J14K6
8036H3O6J7p2j73O4P4j7kLj16J35o1q1Ln9K41l37K28j13j10K78o0Q6j31j44K1
8062a77R2j16J27j45K08M9l5l4%O5J1Q9k5J20j56l2K0J07o4mj79K30n3%j17R7
$$ y = [-63, 1, 137, 12, -64, -47, -26, -87, 25, 73, 167, -25, -82, 95, -119, -5, -21, -3, -89, -17, 23, 135, -167, -90, 202, 80, 100, 31, 25, 99, -69, 192, 117, 178, 27, -45, -185, -54, 138, 137, 25, -44, -44, -118, -164, -22, -14, -8, -135, -116, -223, -17, 193, 19, -3, -30, -48, -67, -57, -64, -18, -11, -151, 21, -85, -60, 156, 109, -82, -18, 47, -55, 60, 29, -29, 162, -48, -111, 31, 132, 194, 21, 1, 220, -95, -103, 120, 147, -13, 168, 13, 136, 20, -12, 58, -202, 119, 87, -4, -107, -91, 17, 12, 49, 157, -48, 150, 64, 44, 206, 11, 26, -129, -153, 118, -43, -34, -5, 175, -52, -133, -97, -182, 10, 44, -4, 68, -13, -47, -88, -68, 166, -156, -45, -39, -147, 47, -51, -41, 65, -59, 46, 129, -32, 66, -24, -175, 48, 154, -57, 57, 83, 149, 166, 94, -79, -15, 59, 42, 40, 43, -73, 62, 1, -80, -77, -136, 105, -232, -4, -117, -227, 51, -9, 77, -54, -198, -177, -85, -201, -74, -219, -11, 38, 3, -31, -31, 34, 45, 134, 109, 229, 73, 41, 61, 168, 104, 100, -79, 151, 98, 98, -19, 78]
8088G8m5O8q0r4J32l3o6p6K77j57K1J3J61k23K4o0J44j95O2J75j66J99r8r3K86
8113B54k83N0j38K43K6j30m7R9q0Jp5Q6k05K09O2j24J7J48p8rJ36o2j71J57o6
8138B0j94J86n1j35m9K18L0N8M7j99o8m8J83M2k39J59K5K0n2o7J09K2j06J05j12
8163i6J76j04R6M8O9k35o2%R6rj84J11P2L2j31p1J34N6j57K63K3j35K8Nl6M4P
8190D0J6
$$ y = [78, 33, 101, 21, -73, 59, 26, -40, -116, 161, 4, 25, 38, 199, -24, 0, -60, 84, -111, -49, 126, -40, 159, 61, -32, 254, -29, 21, -117, 126, 152, 22, -25, 74, -6, -5, -80, 6, -199, 10, 72, -52, -35, 113, 35, 26, 162, 100, -71, 86, 20, -174, 12, -39, -174, -223, -5, 25, 83, 130, -69, -137, -185, -2, 40, -199, -40, -15, 5, -47, -114, -5, 17, -89, 16, -96, 80, -24, 72, 120, 189, -46, -108, -108, -12, -21, -205, -94, -22, 10, -121, -192, -58, -2, -159, 104, 127, -8, 20, 25, -11, 33, 40, 56]
8191E6
$$ Imaginary data points
##PAGE= N=2
##DATA TABLE= (X++(I..I)), XYDATA
0@%%%%%%QqQj6K0k8M0m8N6p2Q8j12J37j67J99k38K86l38L99m64N39o26P27q37
30d47R58j094J246j414J598j799K024k272K542k837L160l515L902m326M788n290
46b776N841o446P106p829Q625r502J0473j1551J2751j4102J5636j7388J9410k1775
60a1527K4594k8017L2276l7745M5063n5429P1369r9349J63016n75559k94247K40938
72e24617m49102M31737K88137j80037Q1266M99523o8398j10196M12904J93671
82E74888l45994K48821L26019l40173o4166L70220k33012k63951K34998k8926
92D78724l75079O6880J51711l25490j57719K88406j46763l07994K55684Q8487
102A6847l17714J33704K27728k07646j9416K74926m8430j64397K02919J36633
$$ y = [0, 0, 0, 0, 0, 0, 0, 8, 0, 8, -8, 12, -16, 24, -24, 32, -40, 48, -64, 73, -94, 105, -133, 153, -185, 214, -250, 289, -337, 390, -447, 511, -583, 663, -751, 847, -952, 1072, -1200, 1342, -1495, 1665, -1850, 2052, -2274, 2514, -2776, 3065, -3381, 3725, -4104, 4521, -4981, 5492, -6059, 6692, -7410, 8226, -9162, 10248, -11527, 13067, -14950, 17326, -20419, 24644, -30785, 40584, -58765, 104251, -471308, -765555, -524617, -973719, -541982, -253845, -433882, -352616, 146907, 78509, -31687, 381217, 574888, 228894, 477715, 803734, 463561, 399395, 769615, 536603, 272652, 507650, 478724, 103645, 170525, 322236, -3254, -160973, 127433, -19330, -327324, -71640, 16847, -300867, -167163, 60565, -147081, -166497, 108429, 59999, -104398, 98521, 235154]
112B35154k36684L5456K42152j90409j26072K26337q7307k08065J31863L2728
122E5153k10912p191J39031j18507j46697J63119L1968j95561R8762J39489j46261
133a97607J6212J72084n1542o1891J39120O4862j07414L5043J51467p7386q3286
144c38J49506m112j41612Q0972N7613j33559j1790R4139o4902j06234Q0767M8657
156D9107j47774P095J36890j06772p1744J50508k3700j15235J01391O8164j17280
167f9350J339J41312n8526j15692J46172M3113j77942P7627J28121j59665k1169
178f4660J65489p6814j17376J41409N0864j70548M7588J66932j40806p4387K08872
189A36563m6546j64403J65874O5181j93509N8823J56358j48418p9822J84324l5793
$$ y = [235154, -1530, 33926, 276078, 85669, -40403, 185934, 98627, -109438, 22425, 55153, -155759, -162950, -23919, -142426, -289123, -126004, -94036, -289597, -190835, -51346, -197607, -181395, -9311, -60853, -122744, 16376, 81238, -26176, 8867, 160334, 82948, -338, 149168, 145056, 3444, 84416, 142029, 8470, -3320, 90819, 25917, -80317, 450, 49107, -98667, -91572, 45318, -61454, -133198, 17310, -6390, -121625, -20234, 47930, -69350, -68011, 73301, 14775, -100917, 45255, 88368, -89574, -11947, 116174, -43491, -64660, 100829, 24015, -93361, 48048, 98912, -71636, -24048, 142884, 2078, -72309, 136563, 90017, -74386, 91488, 156669, -36840, 21983, 178341, 29923, -49899, 134425, 98632]
200I8632j88763J28683R1580k18121K0628J78363j66313r5612J98656n0965j80849
211a84081J38924Q6895j94000J8680J87798j27494j07354K10582j2538j90151
221a72739J53056J08160j99618L5874J88187j27545r4210J91479l772j78879J19676
232A9669J16484j89047O894J89352j26001j05067J89498j4652j73108J15387R8311
243A27720j68149j97J64693r7614j08521J61905O451j69277R5079J01944j60387
254d6353o275J48542q8775r6394J29795J0020j39010O0753R4065j23577k6522
265h3731J33523o0619r6071J15280K1284j19921N2143Q5930r0688k5386J07783
276C9527k5169q3420Q1886M6051r8517K3261R0750o7552l8580R1275r419p5366
$$ y = [98632, -90131, 38552, 130132, -87989, -67361, 111002, -55311, -150923, 47733, -3232, -184081, -45157, 41738, -152262, -133582, 54216, -73278, -180632, 29950, 17412, -172739, -19683, 88477, -111141, -75267, 112920, -14625, -108835, 82644, 78872, -100007, 19669, 136153, -52894, -46000, 143352, 17351, -87716, 101782, 87130, -85978, 29409, 127720, -40429, -40626, 124067, 26453, -82068, 79837, 86288, -82989, 12090, 114034, -46353, -52628, 95914, 7139, -89255, 40540, 50560, -88450, -27697, 66368, -57209, -83731, 49792, -10827, -106898, 8382, 29666, -90255, -38112, 47818, -42870, -68256, 39527, 14358, -69062, 12824, 58875, -39642, -16381, 74369, 6817, -31763, 59512, 50093, -25273]
288b5273N0657M6863p2846j0040P5519l4773o2714O5196J8622q3248K1408N9635
300D9006o1196l3071O7728r218o9801L7451M7015o9126j5252P8495l2369o2054
312g2392P0147K2263p9996K6998O8428n9461l0866Q4394p811p8039O1148N3253
324E8066r0733O557R6354o1724n6200R9305K68r8169N6898O7452r8311j4355J09212
337G4620n3184q4089J04328J9139j22100N4304Q6520j10107k2015J20585n2265
348A5736r3037J05663K8686j29311M5209J01372j14519l7670J34708n2101j08059
359a03323J12689L3250j36188M5019J05878j08020m1174J36460l5778j09136J13087
370A2764N1434j32633M6331J18626j02678l6872J38197l2244j03811J03044M9710
$$ y = [-25273, 25384, 72247, -599, -10639, 64880, 30107, -32607, 32589, 51211, -32037, -10629, 49006, -12190, -45261, 22467, 13249, -56552, -19101, 27914, -41212, -56464, 22031, -10338, -72392, -2245, 20018, -59978, -32980, 35448, -24013, -54879, 29515, 21704, -56335, 4813, 58066, -32667, -26110, 70244, 8520, -47680, 51625, 51893, -46276, 10622, 78074, -20237, -34592, 74620, 21436, -62653, 41675, 60814, -61286, -6982, 79538, -30569, -52584, 68001, 15736, -77301, 28362, 57048, -72263, -27054, 74318, -40201, -77871, 56837, 4736, -103323, 9366, 42616, -93572, -48553, 57325, -50695, -91869, 44591, 8813, -100323, 12764, 64198, -68435, -22104, 96522, -6156, -43028, 95169, 62925, -40886, 62158, 111868]
381A11868j28425K7451J09167j02233n7172J23270l7570j17834Q8038L8706j30325
392g5059J8690R5495r1570n4921J12180j9628j03466Q4593N7382j09545K5162
403f0687J08438p1018m0530J13487o181q4013P2276N6441r0195O371R1768o0121
415C6036n7170Q7621p562r1413M7692M2331q2973o239O7702m1709n0545O3830
427G601J2169o9858L3167N6921n7783r757P1155k1256m2910M9586J7914n2123
439e174P581M2498l8571l5790M4452q105o2110K2137K4604n5517j1618M0027k0348
452e5934l5160L3812K2581l8499J2468N7615k1091j7740O7448J4111l8794M1463
464D2280M5077l5287l584N3261j4278m6450L9206J5515p3712M966M5512o7573
$$ y = [111868, -16557, 10894, 120061, 17828, -39344, 83926, 46356, -71478, 16560, 55266, -75059, -56369, 39126, -52444, -107365, 4815, -14813, -118279, -33686, 23696, -85849, -60687, 47751, -23267, -63797, 49690, 43509, -40504, 31772, 88213, -1982, 4389, 96157, 36036, -21134, 66487, 58925, -32488, 15204, 57535, -25438, -31677, 36025, -5684, -56229, 7601, 19770, -50088, -16921, 40000, -17783, -27540, 43615, 22359, -20551, 29035, 46949, -5174, 2407, 44905, 6334, -29456, 14996, 6891, -55219, -33082, -8478, -63995, -75613, -35586, -55934, -91094, -57282, -34701, -73200, -60732, -3117, -24208, -41948, 25500, 39611, 817, 42280, 87357, 52070, 48486, 101747, 87469, 41019, 80225, 95740, 22028, 26994, 72506, 4933]
476D933l9998N4490k6461o8949L5063K5575o7235N35O7541l9592l8966Q6167R624
489B727o8774O3984O1297o5672J0875Q4820l3804m2814P4517R338q3078L7424
501E0840N5019r3183k1093Q2741o0074p4503P2943k182r4684L4837N3886q0949
513g6402j5882R2588l6974o8463R4940K8176r4583N1990P9370p8892p307R3927
525F2488l7787o0916P7079J7497r6394K9171P1601r0007l4714R2991m3491p7404
537h9886P5785J2769q5875L6683O2883o5517j6376R2643j5368o4429P9297M2491
549F5100p7734L5444P4215o1281j2139P8400k7696n6165N6093K0642p7496N653
561B3036N8593n9305m3176O3650k1996o6327M7187J5481o6579J5949M8105m1638
$$ y = [4933, -35065, 19425, -7036, -75985, -40922, -15347, -82582, -82047, -14506, -54098, -93064, -6897, 2727, -66047, -2063, 59234, -6438, 4437, 89257, 55453, 12639, 87156, 96494, 13416, 50840, 105859, 12676, -8417, 74324, 14250, -60253, 12690, 10508, -84176, -49339, 4547, -76402, -92284, 304, -36670, -105133, -10193, 17983, -76600, -24610, 54760, -24132, -31439, 62488, 24701, -36215, 40864, 58361, -38033, -8862, 62739, -27268, -61982, 31009, -12482, -89886, -14101, -1332, -87207, -50524, 12359, -53158, -69534, 23109, 7741, -56688, 22609, 65100, -12634, 22810, 97025, 35744, 23605, 102005, 74309, 18144, 74237, 94879, 17383, 23036, 81629, 22324, -20852, 42798, 20802, -45525, 1662, 17143, -49436, -33487, 14618, -27020]
573b7020k5582N6148M321n0777L3680L9502m8852M537N1546l5007k2772M6809
585B6533p063m4665J8266K5189l8920k1241L5609j3112m1824K7807R783m1863
597f5501J3251K8894k6912q934L5953O096k5394J9050L6408j9726n383M3692m524
610B6970k0810L4954J1010l0019J2546K8640k3204k2755L0874L712m5175J1582
622A8325K6552m3165j0707L6416k7370l0753L4914L151m4469J2898L7949l4921
634b1180k1705N2559o862m5231M3307K1758n2218J9281M5333m1001j8241N4838
646C0638o716n1564L6017L3482n8143J864N6516m2691k9889O1311j1885n5535
658c6595M2838K9474n9362J979N7931l5466l8342N9892Q28o2775M0559L6213o6589
$$ y = [-27020, -52602, 3546, 7867, -42910, -9230, 30272, -18580, -14043, 37503, 2496, -20276, 26533, 19470, -25195, -6929, 18260, -20660, -41901, -6292, -19404, -61228, -33421, -23638, -65501, -52250, -23356, -50268, -59202, -23249, -17153, -42547, -23497, 12911, -6815, -12198, 31494, 26970, 6160, 41114, 52124, 22105, 34651, 63291, 40087, 17332, 48206, 51918, 6743, 18325, 44877, 1712, -8995, 27421, 51, -30702, 4212, 7363, -37106, -24208, 13741, -21180, -42885, 9674, 2812, -42419, 888, 22646, -29572, -10291, 35042, -5959, -24200, 30638, 23922, -27642, 8375, 41857, -16286, -14422, 42094, -597, -30486, 30825, 18940, -36595, 6243, 35717, -23645, -21666, 36265, 799, -37543, 22349, 23177, -39598, 961, 37174, -29415]
671b9415M793O1204m3242l7102N9747j47o1488L2290L9734o0212m494O3622l8542
684a3252m0356O5712J32o2396M0165L9695n6862p70O0211k8738l7516N7487P726
697C1238n9274L4705M1834n8083k696N8952l1567l7299N0608M845n2474K3490
709D279L5314m7717r231N1357k4874l8650M5987P926n0247K0977L3866l9788q766
722a9567M2058j5780l1865L4023J1694m0941J2044L2762l2299j3397L7371j0921
734E182k9892K5614J1746l2072N085K6918k0952j6245K9838q02k8696J7734J8263
747A1721k5430j542K6258j0690j6585K1164P858k2625O677K1604j6504j0603K4052
760A5355j152k2015J3817J4557k1362l033K2578j0083j8775J9192O984k5907M735
$$ y = [-29415, -24622, 36582, -6660, -43762, 15985, 15838, -45650, -13360, 26374, -33838, -38332, 25290, -13252, -53608, 12104, 12236, -50160, -9995, 29700, -27162, -27932, 32279, 3541, -33975, 23512, 31238, -28036, 6669, 48503, -9580, -12276, 46676, 15109, -22190, 28418, 33263, -19211, 4279, 39593, -8124, -17355, 34002, 9128, -29522, 16465, 24391, -25856, -4879, 28987, -10801, -19567, 22491, 6711, -25154, 8869, 20563, -20378, -8334, 24428, -7871, -21268, 16103, 5182, -24710, 904, 12650, -19422, -14337, 12581, -8371, -24616, 5222, 4420, -24276, -6542, 11721, -13709, -15251, 11007, 317, -16268, 4896, 12754, -9871, -3194, 18410, 1906, -8697, 15355, 14203, -7812, 6005, 20562, -800, -3833, 18745, 8662, -10113, 9079, 16063, -9844, -5109]
773e109K1743k0003j3943K6034l833k6779J6715J5548k8229j115K8575j6276j9950
786b6622K8943M730l1599J6467K5235k9275n047L6844j3864k5635L3171R231l6628
799a4049J4849L0470l2506j0937L9289j3721l3612L2269J1436m3254J1799L3063
811B5096l5702j4440M2043j3438l5664L3930J5065m3256J2120L8057l3106j5401
823b4696M6128r773l6753L5668J7657m3451J1040L7883l2806j7673M3016r304
835A6936l8679L0769J7362m4436P356L6907l2791j8361M1596q611l6324L0043
847A767J8092m0065P370L6719k7860j7986M0244n444l5545K7846J7618l8063M907
860a0400L2640k6234j8316L3925n084l2903K2037J6809l3354K413L0415k0943
$$ y = [-5109, 16634, -3369, -17312, 8722, 4889, -21890, -5175, 10373, -17856, -18971, 9604, -6672, -26622, 2321, 7051, -24548, -8081, 17154, -12121, -17168, 19676, 5812, -19823, 13348, 22579, -14049, 800, 31270, -1236, -12173, 27116, 13395, -20217, 12052, 23488, -19766, -7967, 25096, -10606, -25046, 16997, 3559, -32105, 1825, 16890, -26366, -14246, 23811, -9295, -24696, 21432, 11659, -25094, 10574, 28231, -15220, -4180, 33703, 897, -16776, 26240, 16936, -21743, 9026, 26388, -18048, -10692, 26215, -6576, -24937, 16659, 8048, -28276, 1767, 19859, -20206, -12836, 23883, -3977, -21963, 18281, 12837, -22708, 5138, 22756, -15307, -10400, 22240, -3994, -22310, 11615, 6531, -26372, -4335, 12474, -20880, -18467, 11948, -8995]
872h995j6370L1093n63k7162J9493J7683k5424J339K6953j3512j5518K4222K439
885A5678k3639J1631J5003k0993m192K0527j0261j6159J6285M443j9911N571J4847
898H830j3346n738J7405j604j3332J1991R887j3253O10J5802o450r926J2819K956
912A6651j4742L005J0231j1649q381J1222k911j6288O351P977j6491l217J5059
925c183p572j2361J4581N504j5542O466J6783j0940n634K1758q97j6472J6355
938H846J1852k0012K522J9656j3935j2574J9065j729k3189J0813J2533k5092l543
951a4787K3342j5600j8000K3823J458k4946J4264J7674k2069j212K7786j0682
963A051j7790K7577O939k8498J5129K2067k6643l402K8090j4759k0077K3991K576
$$ y = [-8995, -25365, 5728, 5165, -21997, -2504, 15179, -10245, -8906, 18047, 4535, -10983, 13239, 15678, -7961, 3670, 18673, -2320, -6512, 14015, 3754, -12405, 3880, 8323, -11588, -6017, 8830, -4516, -10254, 7151, 5547, -7785, 4206, 14093, 840, 1450, 17252, 10802, 876, 13695, 16651, 1909, 4914, 15145, 3496, -4885, 6337, 3426, -12862, -6511, 1466, -15025, -18242, -3183, -10755, -23116, -8535, -3031, -18573, -12107, 4676, -6264, -11898, 9860, 8963, -7509, 8846, 20698, 686, 3208, 22864, 8929, -3645, 15420, 13691, -9498, 1315, 13848, -11244, -14787, 8555, -7045, -25045, -1222, 236, -24710, -10446, 7228, -14841, -16053, 11733, 1051, -16739, 10838, 17777, -10721, 4408, 26475, -168, -3570, 24520, 9761, -10316, 13675, 16251]
976A6251l0372J1081K0912k8274q431L0717j3431k3772K7441N379k8726J4661
988f564K1278k3806l354K9597r373k1190K5367R836k9574J0675K2969k5647o033
1001e819K6377j4113k0451K1608L633k7521O361J9895k1472j0791K5344p566k0655
1014b5170K1564O558k3158J1723J8394j7276l525K2837l032j6438J5990J1250
1026A9717j9690M556J8056j6732o154J9537q482j5618J2575M958j7133j067J2657
1039G180r148j1128J2850o50j5346J0393O495j4954L012J2251o954o092R164M585
1053A658q351J154J0450o322m312J1771l475q343R297K771q803J38P238j456p961
1068d546M690O111r250P35R371q076k646J1051l253p832O767O567q014m247J1690
$$ y = [16251, -14121, -3040, 17872, -10402, -18833, 11884, -1547, -25319, 2122, 7501, -21225, -6564, 14714, -9092, -12446, 17151, 7778, -13412, 11955, 21791, -7783, 2892, 25861, 214, -5819, 20558, 6445, -14006, 7602, 11235, -16286, -9925, 9970, -11502, -22293, 3051, -4515, -25170, -3606, 2952, -20206, -8483, 9911, -7365, -10890, 11947, 8915, -7523, 8467, 19717, 27, 4583, 22639, 5907, -247, 19290, 10808, -4810, 7765, 12723, -4410, -5477, 7180, -1968, -13096, -246, -896, -16242, -5849, 646, -14308, -11296, 955, -5999, -12091, -2927, 1658, -6693, -5539, 4911, -1411, -5723, 6048, 2573, -5770, 3527, 6298, -2505, -2367, 4871, 3415, -4546, 144, 6255, -2995, -2260, 7111, -965, -3611, 7440, 4187, -3645, 3122, 9689, 1675, -2572, 9118]
1083I118j142j2176R854M390j4807O158R000j3655k530J3035m609j2483Q235Q700
1097G088j4545j260J5906j0442q657J8805m819j4631J5393O381j6710K862J5999
1110A1370q897j1288J6089K524j8802J1169J0984k1352K577J8597j5806j0272
1122a3107J8682j380j8093Q929J1888j6619k674J9769j1428j2777K2372r89k0849
1135a6276J5294J2333j9366O43J8596r006j1673J6733K702j9719J1028J3858k1773
1148f626j21K1251j3610j2281J8689j01j6673Q312J0917j5003k301J8662r251
1161A864j3729J9967J810j9343J0944J1450j5350m09J3903o825r460J1912K777
1174I511j5616O011J1850j5120l778J5688p741j0145J1300O49j0639M186P381
$$ y = [9118, 7976, -4200, 5654, 10044, -4763, 1395, 10395, -3260, -5790, 7245, 2636, -9847, -1612, 7088, -7457, -8717, 7189, -3253, -11910, 6895, 2076, -12555, 2838, 9219, -7491, -4629, 11370, 2473, -8815, 7274, 9798, -9004, 2165, 13149, -8203, -5626, 12971, -2835, -13107, 5575, 4195, -13898, -4969, 6919, -9700, -12374, 7395, -4033, -16810, 5562, 4573, -16276, -982, 11351, -8015, -7372, 11224, 2218, -9455, 7278, 9980, -9739, 1289, 15147, -6626, -6747, 14504, 894, -11387, 7302, 7201, -9472, -1160, 9757, -5246, -7547, 11115, 1864, -11865, 8102, 9912, -9431, 1513, 12963, -2387, -2796, 11107, 4282, -5178, 6734, 9511, -6105, -94, 11756, -3364, -7142, 8546, 805, -9340, 1960, 2609, -8030, -3844, 3537]
1187C537q703l670J1593k581j0709R520N352j1747L476Q392p215j667P295j507
1201A366n650M662M815p233j468R372m085o373P767R02o850L146L775m329j695
1216a878M794L8o339L018N717p294j684P608l572n085N270J642n768O55N576m017
1232a319m533P882M47q871N525O419q859j80R077m191n628P956J970r069L465
1247I1Q352r164l635J1891m317j0091R916K817j2251L716Q813r917m056J1865
1261D030l216j1152J0381N518j4248M123J2058j0626m270J4336l310j0881J0718
1274C461N632j3352L047J2608j0437o398J4525k882j3211J0698N555j4852K943
1287b663J1767j0587o346J3816k647j2895J0133O572j4632K408J3059j0334o203
$$ y = [3537, -5166, -8836, 2757, 176, -10533, -1013, 4339, -7408, -3932, 4460, -2755, -4422, 2873, 1366, -4284, 378, 5193, -2040, -3508, 5864, 1779, -4594, 3173, 4075, -2775, 371, 4146, -183, -1878, 2916, 2954, -3385, -367, 5350, -1944, -3628, 3980, 408, -4677, 593, 2235, -3533, -2878, 2698, -1319, -5852, 2030, 2477, -6394, -869, 5550, -3309, -3489, 5588, 1397, -4231, 3725, 5695, -3374, 91, 8443, -721, -4356, 7535, 3218, -6873, 3043, 5860, -6391, -2675, 6138, -3779, -7835, 4030, 814, -10338, 43, 5561, -8687, -4564, 7494, -3132, -7402, 6934, 3624, -7257, 3461, 9093, -4259, -1212, 11396, 959, -5439, 9086, 6204, -7007, 3691, 9246, -5606, -2663, 9104, -1483, -7829, 5987, 3340, -9555, 578, 7150, -7482, -5074, 7985, -2349, -8552]
1300h552J4017k434j1820R531O044j3033J849J2031r532o243J2916j673j1948
1313h847R169N840j2769K081J0874q217n676J1520q09j0620P597O112j0796R74
1327c567J0037o922n639R879p18r508N928M989r104j07Q244n178n467Q191K28
1342A286p826M356N563o360n21P508k453m314O334J991n457K680M985l938j784
1357B050N689j155m366L235J964m680l43L749l057l433L087M49m901P36L123l744
1373a597k197M043p36m266K431K912m159p86M870j930l826M518J382n313J334
1388c320M654m185k426N545r33n790M105L400o573K15O638m066m247P302L19p219
1404f581M613M881o765k04P764l652n260P753J203q371M092O317p929j097Q737
$$ y = [-8552, 5465, 3031, -8789, 742, 6786, -6247, -4398, 7633, -1899, -8142, 4774, 3101, -8847, 322, 6162, -6607, -4526, 6348, -1869, -7545, 3975, 3166, -7454, 143, 6255, -4541, -3567, 6470, -452, -6091, 3788, 3070, -6438, -510, 4479, -4625, -4732, 3512, -1666, -7133, 1058, 1286, -6540, -2184, 3379, -2981, -3502, 4006, 1553, -2761, 3573, 5564, 107, 2787, 7772, 3834, 2050, 7739, 6584, 2218, 5453, 7417, 2737, 2394, 6143, 3086, -347, 2740, 3189, -1712, -976, 2147, -1597, -3794, 249, -487, -4753, -2322, 590, -3569, -4355, 515, -1415, -5241, -723, 659, -4654, -3320, 1334, -2851, -5277, 268, -665, -6455, -2350, 1050, -5523, -5308, 1330, -2736, -6983, 319, 638, -6581, -1968, 2913, -3852, -4056, 3708, 56, -5204, 2549, 3752, -4619, -527, 5790, -2139, -3236, 5501]
1419E501m051o015P973J546q721M388O836p600j665J0081l644p055R376K155r453
1434c48M762O859q426j357Q967m148p419P896J725j0268K812P028r767k953R187
1449D550n174p590P903O63r252L136O572p328k876R022k508p083P923K629q852
1464h265M448O545p379j097Q467l068n590N895K614p112J394O754o466k346Q020
1479B814l398n349O689J364o151K225M975l588j976N537l86m755M949K437o532
1494a145K560M779m781j357M497j474l299J795J875l465q96L694k428k890M475
1509A940l34m002K973J791j867m7J698Q20j412R59K269k585K08L249k710j873
1525A077L136j014k334l84R17r47l280Q98P41m193J142J565m697Q11L058k825
$$ y = [5501, 1450, -4565, 3408, 4954, -3767, 621, 7457, -143, -1808, 8273, 4629, -2426, 6950, 9105, -348, 4414, 11273, 2847, 1490, 10457, 6309, -1110, 6786, 8511, -1757, 1055, 8083, -1684, -4637, 4550, -624, -8214, -311, 352, -8900, -5764, 808, -6520, -9396, -374, -2882, -9965, -2042, 587, -8265, -3817, 2728, -4651, -5748, 2719, -349, -5939, -44, 2570, -4542, -3148, 3606, -2860, -5206, 2814, -584, -5933, 756, 2120, -4031, -1806, 3169, -419, -2395, 3142, 2756, -1999, 2950, 5387, -1145, 1415, 6194, 1413, 56, 4553, 3079, -220, 1575, 3450, -15, -911, 2783, 355, -2535, 1940, 1606, -2396, 577, 2368, 501, 454, 2152, 2972, 1560, 2519, 4788, 2203, 2411, 5660, 2950, 1077, 4213, 3199, 865, 481, 1398, 451, -2829, -1931, -1190, -5383, -4241, -2676, -7373, -6562, -3504, -6329]
1541f329j154K420J632k148k71M215q11j945N343p60l477N831J212m875K607L548
1557E038k578k098K977J484m664J373L768n767R0O003n795k403O393j930m330
1572b439K812K541l375j106M661j668m171O344J3p328N592L754p486R30M938l319
1588F93k582L140K76m490J840L831o335p43P295m985m322P142j216m673L517J924
1604C12l475L19M356j926l817O148J199p058M064M711o039Q61M246l189r61L290
1620C041n74l545J814L760m838j758O388k922m213N284q26l701L017K96k562L39
1636a000K693j276l309L014K387n214J448L334l620M55K386k652j03K109o03j585
1652a536R7K713j528k318L548p8k878K788j02j812K068J57j164j04O22J339j979
$$ y = [-6329, -7483, -5063, -3431, -5579, -5850, -1635, -2446, -4391, 952, 192, -3285, 2546, 3758, -1117, 1490, 5038, 2460, 362, 3339, 4823, 159, 1532, 5300, -467, -377, 5626, -169, -2572, 3821, 1891, -2439, 373, 2914, -461, -1567, 3094, 1426, -2745, 3599, 3612, -3716, 1876, 5630, -1856, -926, 4012, 693, -1889, 1251, 1527, -2963, -1123, 2708, -3627, -4370, 2925, -2060, -6382, 760, -456, -5129, -1612, 312, -3163, -2844, 1512, -414, -4231, 1917, 3116, -3942, 122, 4833, -1206, -345, 3901, 712, -249, 3041, 2467, -1078, 736, 4496, -342, -2100, 4288, 1366, -2847, 2437, 1611, -2090, 927, 1223, -1339, -1000, 1693, 417, -2892, 122, 2509, -2705, -1257, 2077, -1543, -1088, 1298, -1354, -1457, 652, 49, -1536, -1439, 1274, -254, -2572, 976, 898, -1980, 808, 706, -1106, 962, 1119, -45, -149, 473, 1812, -167]
1669a67n40K680j501j594K126j402l58J096j114m87K55L34N02k491R42K223k955
1686b451J61K380j783J85J268n69R3M29J194p08j086L207k22k963L031J340l048
1703D58J532J370k002K43J418o44j906J301J559l542j50L688l359j765L587j704
1719H4k430K653l7k524P01K447j791k110L393K66l851L057J710l848J542K527
1735A789k929n82L195j057k819J988K141l546m82L558k643k096L906j178k975
1750c730L050P85l079J107K777j582j531L403K97k977K615K149l209J261L065
1765D401k890o66L123r42k432J483J126k879k84J978k135j940K461j259k587J851
1781a591O96k679M21J836j050r49K161N30j825J839J675j678P85K389j096n41
$$ y = [-167, -707, 1973, 472, -1122, 1004, -398, -756, 340, -774, -1261, -1006, -672, -170, -2661, -1719, 504, -2451, -2290, 90, -1693, -1508, -240, -809, -716, -287, 907, 199, -887, 2320, 2098, -865, 2166, 3506, 458, 1990, 3360, 1358, 1601, 3019, 2375, 469, 1770, 3329, -213, -363, 3325, -34, -1799, 1788, 84, -2346, 307, 270, -2254, -1553, 894, -897, -3007, 386, 652, -3199, -142, 1568, -2280, -738, 1789, -1140, -1722, 1473, 416, -2403, -415, 1726, -1820, -2302, 1256, -1387, -3483, 423, -755, -3730, -680, 105, -2974, -1867, 910, -672, -2203, 1200, 1497, -1480, 1135, 3284, 75, 1336, 4401, 1511, 845, 3968, 3026, 594, 2077, 3203, 324, 40, 2018, -117, -2057, 404, -855, -3442, -1591, -895, -3574, -3153, -1317, -2367, -3316, -1155, -625, -2450, -611, 1064, -614, 171, 2560, 1464, 923]
1797I23J862L8j075Q50O50j375k71J045q75j280R21k02j895N25N12j223j70P60
1815b80k30o51M52N10m85o4J010m13n25Q79L68p77J79M56m85m03J82K77r03j6
1835i19O15p60n99Q89r7r41Q51N90p42J67J298k72j024J551K54j318Q14R53j230
1854H0l22J175q08j170Q31Q9j859M55Q84j451n41J657p58j409J987O79j712R64
1872a229J992j157o5K291j15r97K320O12j761J040J659j553n90K122j088j754
1888A727J474J40k363M89J318k165q79J960j239j983J765L64k227N83J577j782
1904a241o24K154r03j700J742K56k160O91J658j955m75J844q12j655J617L69j652
1921b846N78J524j307l86J855j79j316J828L34j231J015J064r32k94J295n16r45
$$ y = [923, 2785, 2823, 1748, 2598, 3248, 1873, 1602, 2647, 1772, 492, 1413, 1211, -684, -159, 353, -870, -1040, -280, -510, -1161, -709, -199, -684, -748, 262, -151, -676, 203, 571, -206, -27, 429, -56, -459, -277, 0, -903, -919, -304, -1064, -1663, -774, -871, -1812, -961, -371, -1113, -946, 352, 80, -944, 607, 861, -457, 357, 1310, 80, -242, 933, 125, -1045, -214, -125, -1984, -1529, -645, -2096, -2637, -980, -1738, -3147, -1160, -481, -2193, -1229, 763, -394, -459, 1832, 1717, 720, 3040, 3652, 1891, 2931, 4590, 3037, 2447, 4569, 3481, 1727, 3201, 3341, 978, 1467, 2785, 620, -259, 1701, 462, -1521, 244, 608, -1619, -1036, 541, -1241, -1865, 289, -614, -2314, -572, -316, -2476, -1785, -127, -2082, -2557, -713, -1525, -3180, -1563, -1194, -2846, -2268, -744, -2051, -2437, -582, -761, -2077, -249, 85, -1146, -131, 933, 1, -293, 1002, 486, -459]
1938d59Q64N25j819N35P64j203j86R54m46o60O60M26o28L00R03Q3j55J329K67
1957B054o34J194N46o35P08N50l93R6m9K05p90j27K29q24j007O18q61q90j12m42
1977e64k96o04l58L22o27q7M02p70K90M17m19o5N82q0l35J08M52J57p88Q13J90
1998a260r08R95P5r79Q60O01p81K61N87N40j39j53J137r9j76J725r70l68K039
2017B987o23o00R00L1n11l97J44J74j313N72O0k023Q89O95k348J00J169j182l75
2036a651L89j98L34k09P28o28k83J999o70j183K428k3j080J372j17l59M23J4l65
2055I21l49J87P90k038L37J507k165j83J025j350R0M22j219N74K20K36m51n83
2073b029J803p4j353J894L68q47J359k78k95J297r8l98K1L25Q82j450m07J223
$$ y = [-459, 405, 930, -889, -354, 410, -793, -979, -25, -471, -1131, -471, -45, -673, -373, 530, 613, 458, 1787, 2054, 1420, 2614, 3160, 2525, 3233, 3783, 3390, 3486, 3437, 3642, 2852, 2725, 2954, 2130, 1123, 1741, 880, -10, -122, -564, -860, -1464, -1822, -1500, -2127, -2214, -1812, -2582, -2292, -1875, -2294, -2359, -1777, -1857, -2192, -2084, -1632, -1475, -2263, -1450, -1260, -2168, -1173, -1098, -2077, -1217, -616, -1397, -1136, -549, -9, -148, -301, 836, 737, 561, 2286, 1316, 948, 2987, 2364, 1764, 2664, 2695, 2184, 1787, 1931, 2105, 792, 1364, 1424, -599, 290, 985, -1363, -1263, -94, -1276, -1651, -1262, -1460, -1126, -1335, -607, -1235, -1518, 481, -189, -1372, 1056, 1033, -47, 1325, 1208, 849, 1272, 1286, 921, 572, 759, 1549, -489, -152, 1355, -810, -993, 32, -1318, -1228, -806, -2025, -1451, -1231, -995, -1446, -2029, -226, -300, -1653, 241, 609, -238, 1121, 843, 548, 1845, 1747, 1349, 1370, 1695, 2577, 1127, 720, 1943]
2091A943j155m39M80j457K68N86j512o2K37j2K9j190M42R51j295P86K44m16J340
2110b32k25n27J428O0R7J51m47J399k23r78Q82k52l24O66j608R9O06r57k01m08
2130i94k92O23r49n98J138l92l2M22p07J252L05o35Q82K83M57Q07j026Q03J188
2149B535j009N07J08q02J163q08p62O17m55j31o39j166J382o66j290J099o48k92
2167a257Q11p89J41J260n25K63l09P07J014j045Q5J280q23L04R9j111O83J59j231
2186b84M1k08j60k67j130N05j09r83O41m61o87J318k60p04J296J18J42M10R4J109
2206D21j02K0R76n03K92J044j334O10O44q23j42j92k09K20p81j10J58l14L25p3
2226A27q35R95O3q03Q10J66K26K48j11L68J73j62M16o08O8N51p28n22N87o85l04
$$ y = [1943, 788, 349, 829, -628, -360, 226, -1286, -1348, -1111, -1123, -1094, -2284, -1842, -891, -2186, -1400, -1156, -1572, -232, -457, -984, 444, 504, 601, 752, 305, 1704, 1481, 503, 1385, 1133, 809, 1475, -133, -34, 572, -385, -586, -994, -1286, -663, -1612, -2210, -1072, -1464, -1496, -1074, -1781, -529, -224, -859, 23, 306, 763, 1570, 544, 1347, 2535, 1526, 2033, 2141, 1339, 2502, 1694, 932, 1549, 1094, 963, 324, -842, 540, -126, -1416, -317, -965, -1257, -446, -1235, -1094, 166, -359, -96, -405, 302, 1316, 271, 356, 1636, 813, 1117, 1216, 105, 788, 947, -284, -243, -451, -611, -878, -2008, -1503, -1612, -2595, -1954, -2415, -3102, -1784, -2044, -2748, -1452, -1334, -1192, -782, -688, 421, 319, 339, 1315, 812, 1104, 2148, 814, 1424, 2068, 1245, 1103, 911, 702, 922, 141, 31, 189, -125, 200, 127, -708, 287, 350, -453, 357, 523, 749, 997, 886, 1254, 1427, 1265, 1681, 1073, 1141, 1692, 964, 442, 1029, 344, 40]
2247D0J1l85l9j42n11J90m19N52k4o20P10L92l84M28P8j8N65k42K17l6j58K38
2269D43k80l57L10n70m00p0k79k55J19p19K36K05m06L97k12J64P07m2K22P28J05
2290D6M91K04L61N84j73Q1N08l08L00K92n50P4o1m56k45k63j94l51l14j15o2o54
2312h05K71j29m59M05K8m80M80k5O4J12K43J75o8J78K57j47O3L72k07j42O05l99
2334C92n4K51j59m7j07Q2k29j66K59Jo04Q7j8m00j60K46l05j41K13o8l20K48L05
2357f94j56J68L08p0J56M82L34m2O07lJ65L45K84j8M9q8q7k14j83k15k66m55m05
2380Bn06l19j35n57l30o1j73k97r9K49n9L23K14K37M18L38L88M22M73L84K67L65
2402A544K78J66n1M29k40j5l32k22m99j44k50j62n56j91n47j54p0j68q8r8MP2
$$ y = [40, 51, -334, -373, -515, -1026, -836, -1255, -703, -727, -1347, -637, -245, -629, -201, -123, -141, 424, 182, 399, 363, 205, 443, 163, -194, 116, -454, -854, -924, -1203, -1458, -1339, -2058, -1822, -1617, -2023, -1626, -1838, -1674, -967, -1009, -787, -59, 46, 537, 741, 1102, 1686, 1513, 1594, 2102, 1794, 2094, 2386, 1836, 1910, 1849, 1393, 1148, 885, 691, 340, 26, -89, -151, -805, -534, -663, -1122, -717, -689, -1169, -689, -714, -650, -538, -295, -120, -188, -10, 247, 100, 163, 535, 328, 186, 791, 392, 338, 589, 430, 383, 276, 358, 129, -37, 222, 223, -381, -294, -312, -712, -872, -626, -931, -1072, -859, -927, -1247, -999, -694, -850, -682, -374, -444, -288, 194, 528, 486, 1093, 1090, 1255, 1600, 1884, 1866, 1915, 1827, 1740, 1526, 1343, 1128, 862, 407, 2, -504, -823, -958, -1515, -1845, -1906, -2079, -2376, -2475, -2226, -2285, -1962, -1748, -1511, -1093, -755, -367, 55, 528, 912, 1179, 1544, 1822, 1988, 1937, 2366, 2126, 2111, 1779, 1557, 1058, 914, 664, 502, -54, -245, -792, -946, -1016, -1184, -1272, -1370, -1366, -1294]
2424a294L02K47J71K77M24J21M04L73K9K55J67K03O4r9N2k54j70p1n39k40q5m39
2446a02n85j0m30k78j5m58j12j4J54k4k76K91K83j06N28K26K04N31K91o8P18K68
2468A016p1M1L24J7J75j38K21l78r4Qn32j39O8m20k57k84m48K9j63j19j5j59K12
2491a106nn6L77K19l8M19M35j38N13K72N5M58j01J63Q2j78L49m79o6K05n09Ql14
2514E65k95P7l65m62J89k89k74L47o57K33K98k38J09N1k01P85l75j03M59l3J34
2535d5n0k99N68p9k16K42k37r5L55p70K92L07l28L01l35j90Q42n34o7M61j06P7
2557I4J46m14P79J9n79L97k62J99j4o20K47M07n77R9k21l06O26m83k65M49j64
2578d43K89J51m84O72J86l02M63m21L51M50o03L82L72n53K87k87l5N96q68k41
$$ y = [-1294, -992, -745, -574, -297, 127, 248, 652, 1025, 1054, 1309, 1476, 1679, 1743, 1644, 1696, 1442, 1272, 1201, 662, 422, 337, -102, -687, -697, -1127, -1405, -1420, -1878, -1990, -2004, -1850, -1874, -2150, -1859, -1576, -1682, -1154, -928, -724, -193, 98, 30, 748, 1016, 945, 986, 1310, 1327, 1502, 1364, 1585, 1207, 1113, 1121, 589, 450, 518, 98, -159, -443, -891, -862, -1025, -1144, -1159, -1318, -1106, -1111, -1167, -790, -571, -609, -190, 245, 107, 620, 892, 947, 1405, 1304, 1467, 1549, 1371, 1720, 1241, 1175, 1380, 871, 879, 565, 270, 347, -18, -480, -291, -580, -854, -507, -1164, -931, -633, -871, -762, -711, -912, -127, -502, -605, -146, -179, -45, -95, -394, 174, 95, -121, 121, -116, -211, 144, -626, -334, -27, -355, -54, -389, -579, 263, -271, -338, 123, 17, 94, 240, -174, 605, 624, 45, 442, 180, 379, 365, -255, -8, 399, -178, -79, -300, -606, 20, -463, -728, -279, -443, -154, -3, -487, 185, 371, 69, 532, 111, 462, 912, 309, 691, 1063, 510, 797, 510, 475, 1071, 203, -38]
2598c8K91k82N8k89o56P61l52l28M59n86M94N92j229P15L11j68N75k35P6P71m09
2619E31j04N50l79P04k66p47R17k06n07L7m41L57J26j029J35J57m73L8m55O4P46
2640b45p77k47M00k75N16j93n66J042r4k90J52j38M62K10p25L91L68k91M47n90
2660d43J64O69n32L1L44m70O54m17j1P47j34j59J44m04Q77p8o11O89J82m87M75
2681A230p63K68O87r82K89k7j37J76l98l13M66q1l68J71l40J62J26n70L79R3k41
2702a73K47m18J98M91p44J82J52l55M72m07m45N40m35j82Q3k91L21j26n30N05
2722i15R9k87K20n08K77N92m51N8L58o0N90m64P9M28m3R7n2p2N77M3k31K20K14
2745G69j10L19k26J53K74m20K98m9k4J07j81j72L01k11r7%l77N37p6p21L18k37
$$ y = [-38, 253, -29, 29, -260, -916, -155, -507, -835, -376, -962, -468, 124, -1105, -390, -79, -247, 328, 93, 169, 940, 531, 427, 977, 598, 1302, 1036, 289, 1206, 1000, 493, 530, 89, 446, 572, -457, -322, -165, -638, -600, -1055, -991, -245, -1022, -1269, -869, -1144, -628, -821, -1387, -345, -439, -729, -577, -715, -253, -43, -768, -377, -9, -300, 147, -443, -279, 390, -142, -111, 233, -237, 417, 0, -11, 736, 602, 443, 587, 183, 1060, 982, 371, 1060, 1242, 755, 1230, 467, 735, 1422, 440, 729, 702, 565, 741, 343, 30, 496, 415, 47, 218, -122, 40, 166, -404, -25, 68, -173, 74, -344, -146, 345, -399, -217, -65, -420, 52, -355, -800, -260, -695, -877, -794, -1085, -764, -890, -1420, -915, -816, -1103, -883, -1391, -1114, -522, -973, -915, -557, -617, -27, -491, -412, 16, -27, 70, 18, -54, 523, 566, 335, 555, 769, 659, 978, 752, 905, 1179, 759, 1057, 1008, 984, 1091, 910, 738, 1039, 828, 731, 731, 354, 891, 815, 94, 412, 175]
2767A75j38J97n49K57L61n20n7M3K4K85l70J2K37j73J36p5j41J55j40q5L61m59
2789d64j53P1j86j27J59r2o7j61j08J73j39M9K06k51M52M3J23L55j13J3K30K65
2811B78K23o5l5P0K46q0J99M3r1m7l2j3J42n1M8K02l43K35l10J76j65J11j01j7
2835F23k1p4j74l32K03j00k13r1j39n7j60k34O4j92j41MnK4J7L0Q2J78K40k0M1
2860d47K45K78j6K33j7L25j17j7n9L11r2j82j42n8j74p4R7l52p4K5q6k15K24l8
2884d22p3K94K9R7J36K57P3K24M9K03k2O8J52K3k2m5k01j60J37l20k16j23j15
2907B3n6l13k05p0k36j20J38q2M8o7q0L2J45j39J77L16r0o3L19J10J42N2q0L5
2931f4K5L45jJ21l2J12j93J7J02j63L4N6q5j73M7j03M5k80J19j2j45J09k67K15
$$ y = [175, 37, 234, -315, -58, 303, -217, -274, -231, -207, 78, -292, -280, -43, -216, -80, -155, -296, -141, -281, -366, -5, -464, -617, -546, -732, -859, -700, -792, -859, -1020, -1128, -955, -1094, -1045, -839, -1090, -638, -595, -472, -117, -230, -217, 13, 278, 501, 436, 401, 471, 717, 637, 836, 879, 788, 741, 709, 696, 838, 787, 835, 1037, 694, 929, 619, 795, 630, 741, 640, 623, 602, 528, 354, 22, 225, 125, -88, -179, -318, -375, -535, -769, -705, -897, -1038, -1034, -1039, -1015, -998, -968, -886, -708, -468, -488, -447, -202, 76, 60, 293, 276, 601, 484, 467, 408, 719, 627, 445, 303, 245, 71, -3, 94, -258, -332, -307, -393, -608, -384, -422, -495, -201, -172, -75, 61, 318, 391, 615, 664, 867, 845, 913, 1065, 1088, 1066, 1021, 820, 660, 797, 477, 261, 138, 23, -33, -346, -551, -621, -857, -977, -839, -921, -873, -940, -1020, -988, -843, -982, -805, -489, -579, -642, -323, -213, -71, -19, -99, -64, -39, 306, 305, 426, 394, 506, 313, 330, 432, 269, 303, 359, 274, 101, 148, 45, 90, -190, -71, -83, -228, -119, -386, -171]
2955a71l5j24L20O3J81J61M0K38p7J41K09J0K37j50J51l06R1j94j61P7l32j57
2977B12k76j25k89k11l34p7k84o9K2kJ56j54j26M45J20J99J68n4M43K13p4N96
2999D99j3l4K32n1JO0l25j5J37k98Q7j11l37K14m42l6J44k47q8M61j32P7J70j58
3023b05M34j8J00K26j16l4K00j36J93k76K22L06n76p3M28m23l22K63k68J11R8
3044A34m74L39l3qj37J29M8J01k51K21J51j89L77k86q0P3L7j23l2l91M35m17m09
3067g85N49m27J23J01l63J68J96k00J86j21L37O2k63K65K63k89J36K20j06L14
3087C66j75k48N50j20j89O8l15L85km33K78k31K23K52o75K21J42j88m4K3p2K89
3109A05l90M0M10l21J53J01k35M81J9n63M79q7K01K03n63K05K86j26J14j47q6
$$ y = [-171, -206, -330, -10, 53, 234, 395, 435, 673, 596, 737, 946, 956, 1193, 1043, 1194, 888, 979, 785, 624, 701, 369, 212, -64, -189, -478, -689, -1023, -1100, -1384, -1453, -1431, -1433, -1277, -1431, -1557, -1112, -992, -793, -625, -679, -236, -23, -97, 499, 486, 452, 684, 633, 634, 694, 369, 354, 491, 193, 280, 169, -168, 46, -396, -432, -288, -535, -623, -162, -294, -217, -47, -205, 229, 211, 311, 537, 421, 387, 587, 451, 644, 368, 590, 896, 320, 247, 675, 252, -70, 193, -75, 36, 134, -340, -1, -34, -42, -179, -50, -2, 99, -152, 69, 220, 31, 408, 122, 42, 115, 152, 29, -3, -394, 41, -376, -785, -236, -663, -540, -439, -802, -634, -438, -638, -452, -573, -236, -174, -437, -172, 91, -198, -62, 158, 52, 366, 191, -57, 493, 373, 184, 252, -63, 322, 320, -113, 165, -66, 157, 409, -266, -45, 97, -91, -135, -112, -184, 105, -285, -245, 165, -156, -3, 98, -137, 344, 363, -200, 279, 192, 393, 596, 33, 238, 524, 398, 512, 365, 279]
3130B79L77l13m04N07m12J35k9m11M55o0n22Q2K50k16J7l90K21J39k52K29j56
3151d74Q0N77m61l57P07j33J20R4k70P23k90l26L19j77J10K03o10J69M03n31J7
3172a07l56jM14n41j29M35n27K07Q6n42P62k07k96M99k56L31M08m99K12N87l21
3193A59J70J58K25K20k26k59O34m38K32j04m88L61m7o42M25j63lJ32m95K41L18
3214D10n41L27l95J36M97m69m0J58N4k8ol51N91j74k97L2j14K3n4n12L63J95m05
3237f00K26j40l2K14k22J21O4Q2J50O7j98N20k6p4J04k10J38J18o06J76J21k05
3259b12k3j31j59J61n37Q6K71l57J66K3l3N95J42n1K75R4M41p7M2M06K8J04J88
3282A442Q1l7j0l14j69n2k18J8k57n27lk17L9j64l80O2R1k55L58J03j29M3J57
$$ y = [279, 656, 343, -61, 446, 34, 169, 140, -271, 184, 124, -398, -316, -66, -282, -265, -655, -434, -295, -547, -318, -474, -394, 183, -278, -635, 72, -61, 59, 153, -117, 606, 316, -10, 309, 132, 242, 445, -165, 4, 407, -124, -107, -463, -464, -50, -591, -720, -285, -812, -605, -519, -1061, -299, -506, -802, -303, -559, -228, 180, -319, -107, 480, 159, 329, 487, 712, 932, 706, 447, 1081, 643, 875, 771, 283, 644, 597, -45, 380, 217, 214, 346, -149, 92, 410, -131, 196, -199, -63, 434, -35, -75, 83, 137, 109, 103, -248, 343, 169, -128, -96, -210, -187, -241, -753, -390, -195, -600, -374, -514, -546, -332, -554, -433, -369, -287, -137, -70, -268, 252, 226, 152, 256, 46, 184, 302, -304, -128, -7, -212, -235, -366, -525, -364, -901, -815, -544, -901, -735, -712, -745, -150, -8, -59, 216, 310, 751, 674, 716, 1122, 1150, 1254, 1442, 1523, 1486, 1476, 1162, 993, 941, 723, 741, 484, -43, -46, -263, -224, -388, -768, -706, -615, -870, -512, -409, -538, -495, -338]
3305c38q4N03j38l5K96j28K00Mp0Q9j95k02n1Mo0j09j40j58J77l67K07j82nJ32
3329f50p8R2J37J54J76l6J43Q9j21J88J08J83k3K2J63j87J87J00j32j33J34J44
3351F60l42K59j0q4j41J63p2K73j59j75K0m5k0o9k47Q7k00Oj00j3j56j05J73k13
3375e10pKj62K09j50K27q4L33o8J57j68K60j96p9M3J03j81M73l24P7k5J7J4l39
3399c78N85l66k64M04j19mJ14P3K27j53L24k33J12J61l5j32J05J40l00Q4p1M6
3421C20l0%mk5P3k34k4N2k2j12R4K2R3Jj5j24j00O3oo6J8j11j54j1j94J10l95
3448g81K44j74r6M6OQ9l29O5K32j2K03j0j78L54K08o9K61M3J17J61P7K3J51J27
3472G58j06j49o1k4K49J3j40L1j28K02k30J77j81%o3K32r1O0N5R6k07N0p5J9J07
$$ y = [-338, -422, 81, -57, -92, 204, 76, 276, 280, 210, 299, 104, -98, -149, -145, -205, -314, -454, -612, -435, -802, -595, -777, -782, -650, -728, -636, -499, -345, -169, -205, -62, 27, -94, 94, 202, 385, 362, 384, 547, 360, 547, 647, 515, 382, 516, 660, 318, 577, 567, 483, 342, 505, 433, 706, 547, 372, 392, 347, 327, 258, 11, 98, -102, -96, -196, -209, -365, -470, -297, -510, -517, -515, -677, -468, -618, -391, -475, -142, -210, -53, -221, 39, -157, -236, -193, -90, -271, 202, -122, -45, -70, -53, -39, -378, 207, -159, -423, -19, -138, -142, -28, 45, 272, 119, 443, 210, 322, 483, 448, 316, 421, 561, 261, 345, 274, 320, 290, 290, 286, 261, 334, 100, 76, 128, 106, -6, 88, 110, 203, 204, 189, 65, -35, 28, 22, -44, -26, -137, -291, -302, -496, -386, -781, -537, -711, -807, -761, -755, -666, -995, -930, -698, -710, -507, -517, -695, -341, -133, -202, 59, 102, 219, 380, 457, 480, 631, 758, 652, 503, 442, 418, 667, 680, 540, 571, 443, 645, 415, 592, 411, 411, 348, 580, 489, 549, 604, 700, 493, 543, 468, 487, 594]
3497E94j13m0k14rm2k12k33N5k66r5o9q4j09N9k58J10j44K06k17j65K45j1J2K40
3521g60o0J61J95P8m5m3J62K95j08K0L31k53L83L22k78J63K37j98K19M5j61j09
3543E96J56N6N1k10m0j90J6J2j84J0p7k04R5k5j50J81l18n2L73k47n5L49k57q1
3567a95K71k49J62J05j54O7J74l2k5J6k7p2m38O14j82l81L03m49J13L11k84q7
3589d39J73p3R8j26M1M20m25L21q1lL66q0k68L25J56l12m2j1J71K76p11Q6j3k44
3613c95K00j77%K59k53k95M17ko8J02j96M48j50K3K73j49L37K13l45L43j3P8K18
3636H68k78k6L10l39k15k4l24M74l75r4J87l50j97M2k28J48R7l11J31L26j56K00
3658a34jK59K02j49J97K38k05L44j95j91M77l17l81J54j82n0j48k52j21m0p2J30
$$ y = [594, 481, 441, 227, 218, 176, -36, -269, -214, -480, -575, -644, -728, -837, -778, -1036, -926, -1070, -864, -1081, -1246, -1001, -1012, -1000, -760, -820, -659, -464, -386, -431, -474, -312, -17, -125, -105, 226, -27, 356, 678, 400, 563, 800, 602, 821, 866, 705, 596, 752, 808, 859, 649, 609, 419, 435, 447, 263, 273, 196, -8, 87, 62, -88, 93, -225, -277, 96, -151, -206, 143, -114, -195, 76, -173, -11, 94, -60, 7, 181, 149, 124, 140, 113, 41, -397, 217, 35, -346, -43, -492, -379, -68, -352, -439, -266, -339, -241, -367, -326, 94, -331, -10, -91, -94, 272, 192, -76, 249, 405, 93, 51, 40, 211, 487, -224, -138, -151, -395, -195, -372, -372, -113, -366, -661, -244, -246, -314, -212, -408, 40, -110, -87, 186, 37, 374, 587, 242, 585, 572, 650, 868, 590, 564, 874, 535, 320, 296, -28, 446, 71, -23, 164, -186, -383, -341, -569, -421, -324, -635, -504, -178, -334, -134, -135, 124, 326, 177, 374, 612, 407, 751, 556, 365, 842, 525, 144, 298, 116, 66, -82, -334, -455, -495, -567, -437]
3680d37m72N4K92l95K85K14j07J98R6o0N83o0J70K1n7M86p6j74J48N6m35K54m46
3703A38r5K27n12j23q3j69O3k94k18N20j54M4M71l17K74M22l61K13K96J62L74
3724H78m20M53J00j36n6Jj96J43l09l13P3j34k64k4M4N4l09j46K92l06K10L05
3746f0j95%M79k15N8R3K72K21q5j23j5r1on3l00J62p7n66J50r7j84r5r3J91r5
3771g24k7J90j96k4M93q6q3M76k0j06K86QJ51N1q0J67j25kj25J25j04O7l32J06
3795H6J14j64N0j74j47J17Rj75J59j28L50j26j84M63j28N1J99O3JQ4j32K56n1
3818E93NJ1j27j18J76j38q9j94R3j9l06n8pj67NJ0k72P4L2p2q3K73mk0k4J16J34
3845a76M1K68j76j3J16K87k48K71K9k17J33j20j67P2M4j04k90J02Oj08l2K83l05
$$ y = [-437, -909, -855, -563, -958, -673, -459, -566, -368, -272, -332, 251, 191, 361, 382, 325, 811, 735, 561, 709, 765, 330, 584, 138, 43, 270, -242, -365, -448, -617, -554, -848, -1066, -546, -700, -656, -185, -502, -228, 194, -167, 46, 342, 504, 878, 458, 911, 1011, 875, 819, 820, 624, 767, 458, 145, 218, 84, -180, -204, -160, -106, -415, -561, -269, -575, -365, -60, -255, -255, 224, 9, 67, 160, 432, 653, 568, 445, 430, 339, 333, 280, -20, 142, 65, -501, -351, -448, -632, -727, -820, -629, -724, -751, -561, -757, -781, -288, -374, -457, 19, -1, -107, 179, 187, 338, 389, 309, 476, 351, 349, 224, 349, 245, 312, -20, 86, 200, 36, 86, -88, -235, -118, -109, -284, -125, -253, 97, -29, -213, 250, 122, 173, 372, 435, 436, 520, 388, 644, 593, 598, 609, 482, 364, 540, 402, 313, 119, 212, 193, -113, -171, -178, -345, -340, -330, -602, -528, -496, -568, -651, -378, -382, -402, -426, -310, -176, -135, 133, -43, -56, 60, 347, 99, 370, 399, 182, 315, 195, 28, 100, 144, 40, -250, -148, -142, -250, -282, 1, -304]
3868c04o6K22j95J21J03P0j3m4K74j54J90J12J23j44k1J63k18J75R8j05j35L08
3890E60k98j81R4k2r7j43K0j46j19P9K02j88l3m4Q5k83L50k8k32ML13k29K3J44
3914a69r4N4K28K4j35Q8j05M6lL01k30J47j9R7k13K27J02j11J56Q2k13j5K91l27
3938B09P9J99N2k49m3J44j42q0K49J1k43n5m5N6q1N9N1k61J32r4m0l9j5K1k23
3963c48l0j26l7pn9l4j17K15j72j57K05j10n4J89R0J23j84K03J69O2J29K46j08
3986H8OK08k8rJ5L22j17j69L63j40q6Q8j01k6j31K82k11n9J68kj80J48k8k14K74
4011D61N7k54n4J69j84P6J76k68j35k4R4m3l67M00l83k95K83M4l17R8q4L1j15
4034f34K30l28q0L19j31m5J51L27j91k66M19O2k36N81j74k0P5J24k20J78J99m6
$$ y = [-304, -370, -148, -343, -222, -119, -49, -62, -106, 168, 14, 204, 316, 439, 295, 274, 437, 219, 394, 492, 387, 252, 560, 262, 81, 175, 153, 56, -87, -67, -213, -332, -253, -51, -239, -272, -316, -231, -514, -164, -192, -424, -420, -107, -336, -313, -169, -263, -209, 19, 43, -92, -4, -109, -63, -66, 235, 5, 152, 133, 230, 17, 244, 346, 235, 391, 473, 260, 245, 536, 209, 288, 487, 539, 290, 247, 391, 249, 169, 418, 429, 186, 131, 86, 142, 61, 120, 171, -90, 42, -52, -92, -131, -146, -125, -348, -378, -504, -541, -548, -607, -641, -758, -543, -715, -872, -667, -777, -831, -642, -552, -429, -613, -410, -241, -179, -50, 196, 88, 94, 302, 274, 265, 280, 602, 485, 316, 679, 539, 453, 541, 440, 414, 283, 565, 354, 295, 463, 461, 281, 429, 401, 187, 461, 518, 264, 210, 379, 195, 271, 447, 179, 44, 20, 114, 71, -296, 104, -279, -574, -291, -247, -564, -466, -550, -519, -634, -404, -732, -812, -493, -624, -669, -518, -191, -382, -648, -229, -167, -403, 178, 4, -16, 59, 183, -37, 141, 340, 294]
4056B94r9O0J84l21o1K53l45J81nj27J04J81m94J76R2n6k9OK5k09L1L28k53k5
4080a09J86J38j38o4K9K0n4j32K61k53Q5K71l62J53K83l76q6K61k4q0O1M3K05
4103C18k97M32J2j26K20k40r8J61K05l39J60k21L6m2k40J26m21Q3L6j40j13J36
4125c52k73R5k37Q6J39N7o1L10r5mM1j23L87j73J34J20k66K30mq3o6L81n82J22
4149b17Q0k38K61M2l1J24j9R6MnJ26QJ56L25j62p3M20j74j57M19j38j44j61l9
4173E03Q8l96n4M7m61J62M3n13J69L12n45PJ04P2J4k14N11j09r0O80m32l8N10
4196C70J7l41M60K2k54Q6k67J68l55L30j5l64j00K82n13q8O14l86j37J55o5R1
4218b90J94M7k49L9O23l21j32M15l1k49K86J30k58m2q0J39j65J08j21l32k8J95
$$ y = [294, 195, 255, 439, 118, 57, 310, -35, 146, 141, 14, 118, 299, -195, -19, 73, 17, -12, -6, 19, -190, -159, 169, -84, -109, 77, 215, 77, 13, 42, 62, 8, -124, 137, -116, -31, 240, -122, 31, 314, -62, -148, 113, 89, 9, 70, 113, 318, 21, 453, 465, 339, 559, 319, 221, 382, 587, 248, 408, 187, 223, 181, -59, 67, -354, -271, -235, -375, -488, -352, -625, -530, -767, -681, -542, -485, -546, -236, -331, -335, -294, -417, -30, -203, -69, 51, -215, 15, 11, -72, -138, 243, -339, -217, -137, -375, -114, -72, -103, 21, 2, 98, 102, 97, 223, 231, 387, 712, 550, 477, 897, 723, 566, 985, 847, 703, 542, 503, 591, 195, 141, 188, -273, -111, -68, -581, -412, -100, -645, -638, -534, -462, -448, -662, -151, -260, -350, 330, -102, -140, 370, 387, 46, 506, 528, 274, 360, 93, 261, -94, 236, 221, -143, -243, 39, -474, -562, 52, -334, -471, -316, -381, -290, -96, -49, -298, -259, 364, 43, -89, 326, 295, 46, 332, 462, 204, 162, 82, 221, 56, 164, 43, -289, -317, -122]
4240a22k32kK36k40j5K06n1r2J11R6R6r3K86L3J9O0K72l32K35l9j7J59k74J05
4264D05k55J68J2l7l53K75k62p3J7j07k17J51k37J92j12p2M32k03kJ59k9QJ23
4287a7k3J87P4n4J8K38k53J5q0J28n3Nj28m5j4j88J33j73Q3p7K63l49j48M41o7
4312h4l33M00l6j32J80k4p7K8J26p2j6J22Pk85J01L05l39l1K38l10R8K59k88M0
4336a23L2J53j92K8L90k55j56L67J4j94K19L4k12O1M83n03K24J9O8n41J68K61
4358C45j43k31L43l10J2N9j25k64J90J74l37q8M65l22p6J00Q4k55J16K81m13J58
4380b37J11K6p1N1Rj57K10K64l77J41J48O4j36K33q4j30K35O7k78K05J09k81R9
4403B21J42n2l05K12j02j6m1J09l66M3J06j30j19M5Q1n7N6r2j6j11K47J9r0R6
$$ y = [-122, -354, -356, -120, -360, -375, -169, -220, -312, -201, -105, -9, -102, 184, 217, 236, 296, 568, 236, 471, 432, 415, 574, 300, 405, 150, 318, 330, 293, -60, 215, -47, -120, -103, -210, -427, -276, -513, -321, -433, -505, -73, -276, -278, -119, -148, -140, -17, -40, 147, 221, 167, 185, 423, 170, 185, 105, 233, 180, 185, 57, 12, -2, -190, -57, -230, -147, -224, 39, -310, -458, -17, -84, -417, -17, -53, -185, -5, -29, -106, -78, 48, -24, -40, 82, 89, -196, -95, 210, -129, -160, 78, -232, -134, 125, -163, -123, -91, 62, -130, -102, 288, 33, -123, 244, 258, 64, 283, 317, 105, 166, 649, 146, 370, 389, 457, -84, 84, 345, 202, -29, 314, 4, 16, 75, -50, -314, -124, 50, -287, -375, 90, -232, -308, -208, -124, -379, -263, 18, -395, -237, -126, -100, -171, -120, -111, -268, -58, 206, -171, -30, 118, 182, 46, 279, 195, 65, 300, 367, 89, 294, 403, 122, 221, 363, 311, 6, 218, 116, 100, 59, 168, -198, -155, -49, -179, -298, -253, -172, -229, -173, -265, -281, -392, -145, -126, -216, -120]
4427a20nN1m9p4K89p4j00J01k2j36K93j49L5k6J67K7j93J30mj48jK38k27R3j47
4452e1K70j81k4J49k04R9J54j10j4qJ27k52J84J59k62J8J89j88m0K05j78k81J16
4475a23L50l27j11L24k50k42L42L3l73L16o2l1J5K82k56n7K30k9l77L12J70k71
4497a35J94j06n6j58K05K7k87L41J90n16J14J15m69J40M70k43q9K83R0k11R6K37
4519B32l34j21N85l11k28M61P0l64K58K44m32j26K36oj19R9O5l2j87J07k35k0
4541a58M15l1l91K16L2mn0L38k41p5J49oq2J91l2k60J09J13l25o0j09K42j44J35
4565b8k00n3o6J70qk83K43K5r9J48j54K25l1p3M2J51Q2n5j6k2J29k56R0O8m9L2
4591A2k94J53J15j65k04K77j82M7J46n9j04L23O0P3l8o4j73J02L20lj94J80r9
$$ y = [-120, -125, -74, -123, -197, 92, 18, -82, 19, -3, -139, 154, 5, 40, 14, 181, 208, 15, 145, 141, -7, -8, 230, 3, 96, -51, 219, 38, 14, 163, -41, 58, 212, 102, 88, 80, 207, -45, 139, 298, 36, 54, 243, 55, 15, 220, 42, -239, -123, 227, -100, -211, 113, -137, -379, -37, -4, -377, -61, -123, -154, -139, 143, -113, -170, 60, 31, -346, -34, 136, -135, 59, -47, -103, -261, -56, -29, -316, 25, 215, -301, -187, -72, -541, -401, 69, -174, -263, 20, 110, -101, -5, 232, -102, -223, 362, 51, -177, 284, 354, -10, 248, 492, 60, -66, 170, 164, 45, 144, 209, 177, -10, 97, -138, -158, 257, 226, -165, 51, 83, 79, 29, 367, 126, 51, 200, 194, 112, 303, 271, 11, 120, 233, -92, -152, -261, -19, -163, -28, -228, -281, -347, -177, -185, -468, -225, -200, -299, -151, -305, -80, -111, -184, -142, 9, 91, 36, 20, -2, 127, -129, -39, 29, -20, 12, -282, -129, -14, -179, -383, -106, -288, -241, -95, -154, -258, 65, 125, 198, 160, 96, -77, 25, 345, 342, 148, 328, 229]
4614B29R5J56j07j74nJ85n7K1j40K9k71o9J64j27j05M41k13n4k9R0r8M8P4j4j02
4639c3K93Pm04L28J17l76O5K13l10o8K06J0l81R4Q9n09o1N89m03r5M78l26r4L14
4663b57J8j19L36m2j07O4N11l39j00N18l5m03J99J70k41j18K88j81j71J95l0k49
4685i3N2J39r6k93L36K0k97K78J86l51K87n4k63L92J75j09m18L12K09m03j0M34
4707D33m08j18K55l15K6Q6j0j80Q5J66j82k1O5k8k57K23J31j13J50K22j94J85
4729B01n9J6q8l9K46j44n8K0Q7j55J47l75J02k1O8q4r2OL8Q7m4r4m5K81k77j4
4755b90L19k1j3R5j53J80N5r9J3j2JO2l2J06j97j33K42j49j5J48j99o7J40Q1k42
4780a80J38p9J7K38j58L7k9J05N3k53K42J21l75J81L54m16q0N04l58j32K63p9
$$ y = [229, 324, 480, 373, 199, 194, 379, 322, 343, 203, 232, -39, -108, 56, -71, -176, 265, 52, -2, -31, 59, -39, 9, 83, 69, -33, 260, 267, -137, 191, 308, -68, -3, 210, -100, -168, 38, 48, -333, -239, -150, -659, -720, -131, -534, -629, -151, -477, -571, -257, -239, -358, -22, -64, -171, -107, 404, 65, -35, 483, 448, 45, 244, 414, 173, 55, 343, 162, -9, 186, 156, -93, -41, 98, 2, -291, 45, 65, -232, 46, 232, -119, 168, 114, -149, 243, 418, 309, -109, 203, 412, 9, -1, 433, 25, -93, 162, -153, -127, -41, -51, -231, -146, 20, -162, -183, -118, -146, -403, -180, -49, -162, -12, 210, 16, 201, 142, 158, 70, 31, 277, 133, 75, 95, 182, 27, 174, -201, -99, -120, -52, -136, -228, -222, -184, -97, -141, -235, -280, 1, -276, -290, 29, 8, -5, 90, -63, 117, 172, 73, 86, 74, 75, 137, 105, 211, 14, -119, 123, -26, -41, 107, -92, -159, -19, 62, -180, -42, -121, -104, 134, -24, 13, -16, 89, 142, -111, 131, 252, -123, 58, 412, -4, -84, 420, 62, -70, 193, 114]
4802A14k84L2J05O0k24L35m5k18J87r6l36L42J21j53o1K67rk09K51K8l91J36K53
4825B05m58P0N63m86j65M67j24l46K04K48m95J23K28j01j23J52R8l07J10J41j72
4846a68N0K54n1j93K99M9n03M24k44J00N7O1p0k60K37k2k30K19P1k24l8M79l02
4869em7m2O0N2K95j63j44K51k26j5k0K84k53o5J57l9p8JP5l35R8MK5k1P4L2p1
4896a16j56K78j50K06n2j39kkK58j29K02j49K7P1j13J4j2j17K62KJ51n62J92K8
4920hk26n0K31Q2k49K45q9n6M4j3j8J80l1k29J43L47r6j19K85j34k50J82m5q0
4944D6J3K44k07k77K26K2l08L9L03m00P2K34o6l14L35J37k23l4K65k40kR9O2j74
4968a48K60M1l14K39K6j96K0K60k54j29K67J73l16J89j45j46J90N0J3p1K67k05
$$ y = [114, -170, -138, -33, 27, -197, 138, 93, -125, 62, -34, -370, -28, 93, -60, -121, 146, 137, -72, 179, 207, -184, -48, 205, -253, -183, 380, -106, -271, 196, 72, -274, -70, 178, -317, -194, 34, -67, -190, -38, 60, -247, -137, 4, -168, -118, 136, 85, -108, 191, 240, -263, 161, -83, 17, 74, 135, 65, -195, 42, 20, -210, 9, 80, -144, -182, 297, -5, -52, -94, -34, 18, 313, 150, 6, 257, 31, 16, -4, 280, 27, -38, 119, 80, 2, 3, 78, -257, -159, -155, -130, -151, -77, -45, -116, -272, 6, -144, 62, 10, -129, -131, -133, 125, -4, 198, 49, 76, 147, 34, 48, 36, -81, 181, 183, 334, -228, -36, -8, -234, -284, -53, 29, -220, 25, -64, -120, -76, -89, -107, 73, 42, -187, -44, 303, 207, 88, 373, 239, -11, 171, 126, 46, 59, 303, 96, -181, 45, 67, -241, -202, 101, -299, -227, 7, -59, -373, -38, 99, -124, -158, 107, -133, -135, -36, 26, -148, 112, 153, -161, 78, 104, -92, -72, 188, -66, -195, 72, 245, -71, 118, -27, -173, 17, 67, 80, 9, 276, 71]
4990G1k06J26K64k82J73J12k22Q7n6P8j98M1J27j85o7L1J65k18J5rl5J86Q7l30
5014b45K49K73m27J21Q1n5k05L37Nk36K16L1o9n0l%J11L0k19j64L71k26r8J31
5038d1Q7j47J0M1j06j06K71l5J3r7O9m0J4K04ok11K94k00R1J42j55K3J81j30j12
5063E4K40l17j9K14o5p0j05J36J32n04K24L03l02R1n5j43K58M6k22K60j49J91
5085A98j85J93R3k71j00K17r3M0Q1k00j66L24r6j91K6Q5r8m1Q8K9l27M27o1l49
$$ y = [71, -135, -9, 255, -27, 146, 258, 36, 123, 67, 145, -53, -12, 115, -70, -137, -106, 59, -159, -144, -153, -188, -2, 85, -245, 4, 277, -150, -29, 52, -3, -208, 129, 134, -102, 114, 145, 76, 26, 23, 23, 134, 164, -55, -219, 152, -74, -172, -41, 46, -101, -91, -50, -156, -262, 9, -26, -13, -110, -41, -81, -67, 137, 131, -80, 214, 14, 105, 247, 92, 115, 296, 166, 54, 294, -23, -42, 172, 107, 37, -68, 68, 200, -304, -80, 223, -79, 12, -43, -186, 72, 118, -104, 156, 7, 198, 13, 206, 299, 28, -72, 145, 52, 92, 173, -27, -193, 131, 35, -156, -130, -45, -143, -184, -96, -67, -394, 33, -28, -377]
$$ [...]
8191I4
##END NTUPLES=NMR FID
##END=
