##TITLE=1H_Pr Tur
 CDCl3
 8 sc, 
 6.12.2021
##JCAMPDX= 6.0         $$ Bruker NMR JCAMP-DX V2.0
##DATA TYPE= NMR FID
##DATA CLASS= NTUPLES
##ORIGIN= UXNMR, Bruker Analytische Messtechnik GmbH
##OWNER= root
$$ XWIN-NMR		Version 3.5
$$ Mon Dec  6 10:57:30 2021 Russian Standard Time (UT+4h)  she@DPX200
##.OBSERVE FREQUENCY= 200.131346
##.OBSERVE NUCLEUS= ^1H
##.DELAY= (6, 6)
##.ACQUISITION MODE= SIMULTANEOUS
##.ACQUISITION SCHEME= undefined
##.AVERAGES= 8
##.DIGITISER RES= 18
##SPECTROMETER/DATA SYSTEM= spect
##.PULSE SEQUENCE= zg30
##.SOLVENT NAME= D2O
##.SHIFT REFERENCE= (INTERNAL, D2O, 0, 15.7039)
##AUDIT TRAIL= $$ (NUMBER, WHEN, WHO, WHERE, WHAT)
$$ ##TITLE= Audit trail, XWIN-NMR		Version 3.5
$$ ##JCAMPDX= 5.01
$$ ##ORIGIN= Bruker BioSpin GmbH
$$ ##OWNER= she
$$ F:/spectra/data/she/nmr/H-F/1/audita.txt
$$ ##AUDIT TRAIL=  $$ (NUMBER, WHEN, WHO, WHERE, WHAT)
(   1,<2021-12-06 10:56:31.23 +0400>,<she>,<DPX200>,
      <created by zg, POWCHK disabled, PULCHK disabled
       configuration hash MD5:
       00 E9 B6 7A A2 85 ED C7 34 08 36 98 17 FE 4E 26
       data hash MD5: 16K
       7E 0C 9D B4 F5 32 FC 60 9E 4E 5C 84 1B C6 87 99>)
$$ ##END=
$$ 
$$ hash MD5
$$ 9B 19 B9 A0 6D 7C 12 0D 46 9A DF 3C 90 BC 60 10
##$RELAX= 
##$RELAX= 
##$RELAX= 
##$RELAX= 
##$RELAX= 
##$RELAX= 
$$ Bruker specific parameters
$$ --------------------------
##$DU= <F:/spectra>
##$EXPNO= 1
##$NAME= <H-F>
##$PROCNO= 1
##$TYPE= <nmr>
##$USER= <she>
##$AMP= (0..31)
100 100 100 100 100 100 100 100 100 100 100 100 100 100 100 100 100 100 
100 100 100 100 100 100 100 100 100 100 100 100 100 100 
##$AQSEQ= 0
##$AQ_mod= 1
##$AUNM= <au_zg>
##$AUTOPOS= <>
##$BF1= 200.13
##$BF2= 200.13
##$BF3= 200.13
##$BF4= 200.13
##$BF5= 200.13
##$BF6= 200.13
##$BF7= 200.13
##$BF8= 200.13
##$BYTORDA= 1
##$CFDGTYP= 0
##$CFRGTYP= 5
##$CHEMSTR= <none>
##$CNST= (0..31)
1 1 145 1 1 1 1 1 1 1 1 1 1 1 1 1 1 1 1 1 1 1 1 1 1 1 1 1 1 1 1 1 
##$CPDPRG= <>
##$CPDPRG1= <>
##$CPDPRG2= <>
##$CPDPRG3= <>
##$CPDPRG4= <mlev>
##$CPDPRG5= <mlev>
##$CPDPRG6= <mlev>
##$CPDPRG7= <mlev>
##$CPDPRG8= <mlev>
##$CPDPRGB= <>
##$CPDPRGT= <>
##$D= (0..31)
0 1.2 0 0 0 0 0 0 0 0.06 0 0.03 0 0 0 0 0.0002 0 0 0 0 0 0 0 0 0 0 0 0 
0 0 0 
##$DATE= 1638773790
##$DBL= (0..7)
120 120 120 120 120 120 120 120 
##$DBP= (0..7)
150 150 150 150 150 150 150 150 
##$DBP07= 0
##$DBPNAM0= <>
##$DBPNAM1= <>
##$DBPNAM2= <>
##$DBPNAM3= <>
##$DBPNAM4= <>
##$DBPNAM5= <>
##$DBPNAM6= <>
##$DBPNAM7= <>
##$DBPOAL= (0..7)
0.5 0.5 0.5 0.5 0.5 0.5 0.5 0.5 
##$DBPOFFS= (0..7)
0 0 0 0 0 0 0 0 
##$DE= 6
##$DECBNUC= <off>
##$DECIM= 32
##$DECNUC= <off>
##$DECSTAT= 4
##$DIGMOD= 1
##$DIGTYP= 9
##$DL= (0..7)
0 120 120 120 120 120 120 120 
##$DP= (0..7)
150 150 150 150 150 150 150 150 
##$DP07= 0
##$DPNAME0= <>
##$DPNAME1= <>
##$DPNAME2= <>
##$DPNAME3= <>
##$DPNAME4= <>
##$DPNAME5= <>
##$DPNAME6= <>
##$DPNAME7= <>
##$DPOAL= (0..7)
0.5 0.5 0.5 0.5 0.5 0.5 0.5 0.5 
##$DPOFFS= (0..7)
0 0 0 0 0 0 0 0 
##$DQDMODE= 0
##$DR= 18
##$DS= 0
##$DSLIST= <SSSSSSSSSSSSSSS>
##$DSPFIRM= 0
$$ [...]
##$SUBNAM2= <"">
##$SUBNAM3= <"">
##$SUBNAM4= <"">
##$SUBNAM5= <"">
##$SUBNAM6= <"">
##$SUBNAM7= <"">
##$SUBNAM8= <"">
##$SUBNAM9= <"">
##$SW= 18.0517287032376
##$SWIBOX= (0..15)
0 0 2 0 0 0 0 0 0 0 0 0 0 0 0 0 
##$SW_h= 3612.71676300578
##$TD= 16384
##$TD0= 1
##$TE= 0
##$TE2= 300
##$TE3= 300
##$TEG= 300
##$TL= (0..7)
0 120 120 120 120 120 120 120 
##$TP= (0..7)
150 150 150 150 150 150 150 150 
##$TP07= 0
##$TPNAME0= <>
##$TPNAME1= <>
##$TPNAME2= <>
##$TPNAME3= <>
##$TPNAME4= <>
##$TPNAME5= <>
##$TPNAME6= <>
##$TPNAME7= <>
##$TPOAL= (0..7)
0.5 0.5 0.5 0.5 0.5 0.5 0.5 0.5 
##$TPOFFS= (0..7)
0 0 0 0 0 0 0 0 
##$TUNHIN= 0
##$TUNHOUT= 0
##$TUNXOUT= 0
##$USERA1= <user>
##$USERA2= <user>
##$USERA3= <user>
##$USERA4= <user>
##$USERA5= <user>
##$V9= 5
##$VALIST= <valist>
##$VCLIST= <CCCCCCCCCCCCCCC>
##$VD= 0
##$VDLIST= <DDDDDDDDDDDDDDD>
##$VPLIST= <PPPPPPPPPPPPPPP>
##$VTLIST= <TTTTTTTTTTTTTTT>
##$WBST= 1024
##$WBSW= 4
##$XGAIN= (0..3)
0 0 0 0 
##$XL= 0
##$YL= 0
##$YMAX_a= 684675
##$YMIN_a= -767406
##$ZGOPTNS= <>
##$ZL1= 120
##$ZL2= 120
##$ZL3= 120
##$ZL4= 120
##$ABSF1= 10
##$ABSF2= 0
##$ABSG= 5
##$ABSL= 3
##$ALPHA= 0
##$AQORDER= 0
##$ASSFAC= 0
##$ASSFACI= 0
##$ASSFACX= 0
##$ASSWID= 0
##$AUNMP= <proc_1d>
##$AZFE= 0.1
##$AZFW= 0.1
##$BCFW= 1
##$BC_mod= 2
##$BYTORDP= 1
##$COROFFS= 0
##$CY= 11.3945322036743
##$DATMOD= 1
##$DC= 2
##$DFILT= <>
##$DTYPP= 0
##$F1P= 2.36226072786647
##$F2P= -0.459571619588291
##$FCOR= 0.5
##$FTSIZE= 0
##$FT_mod= 4
##$GAMMA= 1
##$GB= 0.15
##$INTBC= 1
##$INTSCL= 1
##$ISEN= 128
##$LB= 0.24
##$LEV0= 0
##$LPBIN= 0
##$MAXI= 10000
##$MC2= 0
##$MEAN= 0
##$ME_mod= 0
##$MI= 1.114404
##$NCOEF= 0
##$NC_proc= 0
##$NLEV= 6
##$NOISF1= 3.799351
##$NOISF2= 2.8
##$NSP= 1
##$NTH_PI= 0
##$NZP= 0
##$OFFSET= 15.70392
##$PC= 1
##$PHC0= -15513.74
##$PHC1= 14.60081
##$PH_mod= 1
##$PKNL= yes
##$PPARMOD= 0
##$PSCAL= 0
##$PSIGN= 0
##$REVERSE= no
##$SF= 200.130013532006
##$SI= 16384
##$SIGF1= 3
##$SIGF2= 2
##$SINO= 400
##$SIOLD= 16384
##$SREGLST= <1H.CDCl3>
##$SSB= 0
##$STSI= 0
##$STSR= 0
##$SW_p= 3612.71676300578
##$SYMM= 0
##$S_DEV= 0
##$TDeff= 0
##$TDoff= 0
##$TI= <>
##$TILT= no
##$TM1= 0
##$TM2= 0
##$TOPLEV= 0
##$USERP1= <user>
##$USERP2= <user>
##$USERP3= <user>
##$USERP4= <user>
##$USERP5= <user>
##$WDW= 1
##$XDIM= 8192
##$YMAX_p= 0
##$YMIN_p= 0
$$ End of Bruker specific parameters
$$ ---------------------------------
##NTUPLES= NMR FID
##VAR_NAME=  TIME,          FID/REAL,        FID/IMAG
##SYMBOL=    X,             R,               I
##VAR_TYPE=  INDEPENDENT,   DEPENDENT,       DEPENDENT
##VAR_FORM=  AFFN,          ASDF,            ASDF
##VAR_DIM=   8192,          8192,            8192
##UNITS=     SECONDS,       ARBITRARY UNITS, ARBITRARY UNITS
##FACTOR=    0.0002768,     1,               1
##FIRST=     0,             0,               0
##LAST=      2.2672688,     0,               0
##MIN=       0,             -767406,         0
##MAX=       2.2672688,     684675,          0
$$ Real data points
##PAGE= N=1
##DATA TABLE= (X++(R..R)), XYDATA
0@%%%%%%%Qj6J6j6K4m0M8n6P2q8J12j42J67j99K39k86L42m01M65n43O35p32Q38
30D47r59J097j253J425j611J816k043K295k570K868l197L557l950M380m848N359
46B813n919O532p201P934q737R625j0608J1696j2911J4272j5812J7570j9597K1960
60A1617k4758K8141l2324L7647m4680N4456o9067R3528j44350M24733o70278k73908
72f09243J286709p04728m76895R83274k26365r64826Q83276M10127r94330J21583
82b91418P63616n67549k25881O71137k24789o00137N04073L38754n06052n5985
92a94231L95922k37546j90888M35038k5607n30402K73333M53522m36668k03785
102b61312M60200j78739k77630N09395m0338o02659L84484L66645n84815O9460
$$ plain form
0 0 0 0 0 0 0 0 0 8 -8 8 -8 16 -24 24 -32 40 -48 64 -78 89 -110 129 -157 185 -216 249 -294 341 -391 447
30 447 -512 585 -668 757 -854 962 -1081 1214 -1356 1512 -1685 1872 -2078 2302 -2546 2813
46 2813 -3106 3426 -3775 4159 -4578 5047 -5561 6135 -6776 7496 -8316 9254 -10343 11617
60 11617 -13141 15000 -17324 20323 -24357 30099 -38968 54560 -89790 334943 -335335 -609243
72 -609243 677466 -27262 -504157 479117 252752 -712074 171202 581329 -413001 -291418
82 -291418 472198 -95351 -321232 349905 125116 -475021 29052 367806 -138246 -194231
92 -194231 201691 -35855 -226743 208295 182688 -347714 -74381 379141 -57527 -261312
102 -261312 198888 20149 -257481 251914 211576 -391083 -6599 360046 -224769 -155309
112a55309N17244m76467j81781O34025k57037m76822N52669Q4424n51498L38150
122B7598K81395n81065Q7317N38996l68731k74632M60478l9654l57511K60251
132C4442J45055l41920O9546L23544k11435k43367K79681J19040l08273M0120
142i3567K95896k11679j98754L45898q333l83363K63491K68838m43778n659M43404
153B72394l07821k44702N09564o8398m77527L55044K22467m72026J22788L59314
163B71097l88013p8428M62803k16152l34532L75211Q3488l47535J60172J82461
173A70572k93409K0019K82277j77619j74879K46145L6482k25087R1011J43272
183A18784j90330l6309K42336o9519k14180J65343R8054k22686P6799K03228k40927
$$ plain form
112 -155309 361935 -114532 -296313 337712 80675 -396147 156522 240946 -310552 27598
122 27598 308993 -272072 -184755 354241 -14490 -289122 171356 131702 -225809 34442
132 34442 179497 -162423 -92877 230667 19232 -224135 55546 174586 -133687 -93567
142 -93567 202329 -9350 -208104 137794 129461 -253902 9589 278427 -165351 -171010 272394
153 272394 -35427 -280129 229435 161037 -316490 38554 261021 -211005 -88217 271097
163 271097 -116916 -195344 267459 51307 -283225 91986 175474 -172061 -11889 170572
173 170572 -122837 -102818 179459 1840 -173039 73106 109588 -115499 -24488 118784
183 118784 -71546 -107855 134481 64962 -149218 16125 114179 -108507 -31708 171520 -69407
194f9407q2761L21750r9090k69860K53622Q8181k94964J46503J94256l20402j19
205a32291L37235j99435j93621L06234l1650k71781K21677J16336k95252P4986
215f7562K35772k05774q3901K31179q2726j62900J95324N4271k15306N1417J59927
226A09721j23539o6503J51116l0372j31976J11244P5851j65406L207J69085r0441
237A1987j13743J57618P257j74699J08319J16801j86626J145J88541j26923j06184
248a16507J99867k7956j81845J53217Q6005k05972M5837J64041j50471n2049J85078
259I9245p1349j36115J52605L4331j66555O9225J15072j32350k8518J37728n9234
270A4085r7362J14168K8872j25534M3843R6117j00995l9019J23997l0138j03372
$$ plain form
194 -69407 -152168 169582 70492 -199368 54254 142435 -152529 -6026 188230 -132172 -132291
205 -132291 204944 5509 -188112 118122 86472 -185309 36368 152704 -142548 -67562
215 -67562 168210 -37564 -121465 109714 26988 -135912 59412 113683 -101623 -50206 109721
226 109721 -13818 -80321 70795 40423 -91553 19691 95542 -69864 -66657 102428 11987
237 11987 -101756 55862 63119 -111580 -3261 113540 -73086 -71941 116600 -10323 -116507
248 -116507 83360 55404 -126441 26776 112781 -93191 -47354 116687 -33784 -85833 99245
259 99245 27896 -108219 44386 78717 -87838 -18613 96459 -35891 -64409 73319 14085
270 14085 -83277 30891 59763 -65771 -21928 74189 -26806 -65825 58172 28034 -75338
281g5338R2922M8050j25637K8817J12200r8601n1379J35243l2959j16725J07306
292B3899M6517j38897M6435J11351j20627l5740J39788n6176r9805J21223J7413
303E5381j31611O7429Q4868j20367o815J19847o7182o9059J08317l497j03627
314f6316O8107O1552r9109J72R2996n5884n4008Q7317q59q6131N2855N6072q5614
327b8850q353Q7316m4153n8673Q0577P495q8706M6732O1415q5660q782R1849m9639
340B568n9613Q9498J698r1813N8030N6240r1709M041Q6826o0770m3649Q8976j4810
353B5513p7768O4953L4422q4963J8483O8499n9558k7322P2069k0291n6848N3464
365A0653K1523o4588J6110N2927m5331k4628N7325r102n0273L9879K8297n7078
$$ plain form
281 -75338 17584 65634 -60003 -31186 81014 -17587 -68966 66277 33318 -83407 23899
292 23899 70416 -68481 -22046 89305 -31322 -67062 72726 16550 -83255 37968 55381
303 55381 -76230 -8801 76067 -44300 -51115 68732 1550 -67509 40808 37311 -66316
314 -66316 1791 63343 -35766 -35594 57402 1518 -52490 34827 33968 -52163 692 56764 -28850
327 -28850 -37203 50113 5960 -52713 27864 35359 -53347 -6615 54800 -30860 -39642 52207 2568
340 2568 -57045 32453 34151 -57662 368 56608 -35101 -31060 55766 -5004 -48653 40323 25513
353 25513 -52255 12698 47120 -37843 -19360 49139 -10419 -37741 34328 14037 -42811 10653
365 10653 32176 -32412 -16302 36625 -8706 -33334 23991 14889 -35384 4495 32792 -24286
377b4286M715N6252l6907l3012N7659m481n5835M3271L1192o6659P578O2597m4348
390b264l2735O1681j2303n2608N0312J9260o6204K0329N2812m9301j9232N5497
402B5244j8529m0028M6409J1770n2547J6179M1364l4368j5667M0141j2614l4373
414b7019L8301J9621n3227K530N0947k6852k9482M3527o842m5184M4495K4302
426C5117o8301J1804O1751m7154k7040O3287k3358m9315O4173J1432p3898L3001
438h501M7585n9972L122N9191n1182l0972P3949p188o1337L6818K3895m6195J9394
451a393L3170m9872r144N7628j5719m5153K9817J9962l3357P963K6085l1841j1389
464b3243M4592p865m0342K6864K0019l9187J3182L7765m3189j8302N5913j0485
$$ plain form
377 -24286 -19571 36681 -226 -33238 24421 19940 -35895 7376 38568 -28091 -20513 42084 -2264
390 -2264 -34999 26682 14379 -38229 12083 31343 -34861 -14532 38280 -11021 -30253 25244
402 25244 6715 -33313 13096 24866 -27681 -11502 29862 -4506 -20173 19968 7354 -27019
414 -27019 11282 30903 -22324 -19794 31153 4301 -25181 18346 11504 -33680 10815 35117
426 35117 -33184 -21380 40371 -6783 -33823 29464 6106 -43209 20964 32396 -41502 -8501
438 -8501 39084 -20888 -17766 41425 -9757 -40729 33220 26032 -35305 1513 25408 -20787 -1393
451 -1393 31777 -18095 -27239 30389 14670 -30483 -666 19296 -14061 -6098 19987 -11854 -23243
464 -23243 21349 13484 -26858 6 20025 -19162 -5980 31785 -11404 -29706 26207 15722
476A5722m0669L4947L396m0134L9025K1229o3866J0252N6581l5214k4001L7805
488A5073j8245j7117M5032j4571m5312L5916K3431l5665M884J5845k3173Q030
500e872K5550j7590j4896R810K570O699N615j4649p411P718Q915J0389j6324k5367
514b4843K5733K5749k8578j1615J4662r568J1834K2877l7555k2126M6082O072
526A8724l0580J2677J042k3369K5951K1749l2955j0495J8904m47N201R305k1925
539f218j4599K2567J9579j1071k3653j003K2970N232j2875n097q326N424L0196
552B3126j1686l9618K0361K3578k3389R737J5173m0503N017M7263k6451k2115
564a9507L5837k0446k2354N6094o851o2158L4976L4563m1416J1105K1608m7150
$$ plain form
476 15722 -24947 10000 13396 -26738 12287 33516 -30350 -20098 36483 1269 -22732 15073
488 15073 -3172 -20289 24743 10172 -35140 776 24207 -11458 -6574 9271 -13902 -5872
500 -5872 19678 2088 -12808 -2998 -428 6271 11886 -2763 -10174 -2456 6459 16848 524 -24843
514 -24843 890 26639 -1939 -13554 1108 -8460 3374 26251 -11304 -33430 12652 18724
526 18724 -11856 821 1863 -21506 4445 26194 -6761 -17256 1648 1201 6402 15707 -6218
539 -6218 -20817 1750 21329 10258 -13395 -14398 8572 13804 929 -4168 -12494 -7070 23126
552 23126 11440 -28178 -7817 15761 -7628 2109 17282 -23221 -18204 29059 2608 -19507
564 -19507 16330 -4116 -26470 29624 22773 -39385 -4409 30154 -11262 -157 21451 -25699
576b5699J2074N3471m1367k9667M8240o446l1559K9540J469l0286K2651J3575
588A5996k8520N424J7611j6560j837J7046m438j1164J033O969N724o037n218O332
602B361k320j467J0508r377r756J9943l014k2799J9069J3043k6447K337J5392
615G473j4461P254J4890k7797l768L1321j0577j7069J7648l645j0396J8041n706
628C208j5566J7630K196j4673J3181k08j8180J3933Q486j2829Q058l283j8767
641a6814K2225J3901l0453J519J8364j5474P899J4588l2412m2L7910j8165k0177
654a7131K7534r794j9021L1576p24l1554K1172J2374k7727J4067J7238l0137J285
667a0842K9390j5401j3519J5112n961n727J7992n425j8883J0086J1270p894m301
$$ plain form
576 -25699 -13625 39846 -1521 -31188 17052 10606 -20953 8587 10056 -20230 2421 15996
588 15996 -12524 -7100 10511 -6049 -7886 9160 4722 -6442 -5409 1560 7284 1247 -3971 2361
602 2361 41 -1426 9082 -295 -10051 9892 6878 -15921 3148 16191 -10256 -7919 7473
615 7473 -6988 266 15156 -12641 -16409 14912 4335 -12734 4914 1269 -9127 8914 3208
628 3208 -12358 5272 7468 -7205 5976 5768 -12412 1521 10007 -2822 5236 1953 -16814
641 -16814 5411 19312 -11141 -9622 8742 -6732 1167 15755 -16657 -16699 21211 3046 -17131
654 -17131 10403 609 -18412 13164 12440 -19114 2058 14432 -13295 772 18010 -12127 -10842
667 -10842 18548 3147 -10372 4740 -1221 -6948 11044 5619 -13264 -3178 8092 198 -4103
680d103K595O40j53J179K397m506n280R241L676j1197O735O988j7916M041K1909
695A6246j6947j0768K2758q028j5982K3085k909k5012K3198J0971l1465R221K0744
708A5112k5028J365K4855j9724j0864K5049r956j4675K3373k932k1551J6504Q613
721A0141j7531O166P596j2369O031J0071j2721k630R360l118q29L787n923K53
735a716M059l100J222O09n792M877N081r139N82N655o910L388R764j2545m530
750h495J4584m435p171J0874m364q950J4357R00j5366P287P639r752M466N171
764F745j2461J372J1469o289m266N242l752k11O127n074l883N253M22m30J338
779A602n699J89Q075l593k414M647n030r15R852m763q159R465Q41p510P404n89
$$ plain form
680 -4103 -1508 -868 -1021 158 2555 -1951 -7231 2010 5686 -5511 1224 8212 -9704 -5663 16246
695 16246 -701 -11469 11289 3261 -12721 10364 7455 -17557 5641 16612 -14853 -5632 15112
708 15112 -9916 -8551 16304 -3420 -14284 10765 809 -13866 9507 6575 -14976 1528 10141
721 10141 -7390 -1224 6372 -5997 34 10105 -2616 -5246 4114 996 167 3954 -1969 -1716
735 -1716 2343 -757 465 1074 -4718 159 5240 -3899 -3317 2338 -4572 -1184 8580 -3965 -8495
750 -8495 6089 1654 -5517 5357 993 -7957 6400 7300 -8066 -779 6860 -2892 1574 6745
764 6745 -5716 -4344 7125 836 -3430 1812 -1940 -2151 3976 -1098 -4981 272 694 264 1602
779 1602 -4097 -3908 4167 574 -1840 2807 -2223 -3138 6714 1951 -6208 3257 4098 -3412 3992 3403
795C403j1535R379Q384j3355k97Q374p674P22R327r790m695J2567k277q434O568
810F67j33n277P551J589q855K603M527l194J493J484m697J798L638k274o21r10
826f11p62M452N0o165J539K347k522L518L46p820L845O947p527j636O932m720
842a787j508Q360n481n853R517l94o970O849P17q535O059M921q271R55N849n465
858a037K07N009o174j866P449k105m305K983q83j511L754j850k712L432l4j953
874a596J932q39j157L342q98k266L178p34k981L852N69m486L133J349m289K505
890F14K161n352J971M054n686L6M875l601j842M242k577j343M899l149l215M999
906A086J90k777K444j115j925M281k30l870L143L10l166M194k30n757L910L205
$$ plain form
795 3403 -8132 1247 9631 -3724 -4021 4353 -3321 -2599 6728 -3062 -7757 4810 2533 -5901 667
810 667 534 -4743 2808 4397 -4458 -1855 2672 -522 971 2455 -2242 -444 3194 920 299 -611
826 -611 -1373 3079 3129 -3036 -1497 850 -1672 1846 2192 -5628 -1783 5164 -2363 -3999 2933 -1787
842 -1787 -3295 5065 -416 -6269 3248 2854 -4116 2733 3450 -5085 974 5895 -2376 -1421 4428 -1037
858 -1037 -830 4179 -1995 -3861 3588 1483 -2822 161 -722 -2233 1521 -329 -3041 391 357 -1596
874 -1596 336 -503 -1660 1682 784 -1482 1696 962 -2019 1833 2402 -2084 1049 2398 -1891 614
890 614 2775 -2577 -606 3448 -2238 -2202 2673 -928 -2770 1472 -1105 -2448 2451 -698 -3913 1086
906 1086 1276 -1501 943 -172 -2097 2184 1954 -1916 1227 1537 -1629 2565 2335 -3422 488 3693
922C693n079K198J033o581M562N888p690k559O589l489m17O232o706m095J0479
937D058q81p460N233L91n935P137K837r359K365N871n407J541M174p400m19Q594
953E340l215n177L228m63j070M693k788n823M338L759k871j179k94j64K169R31
969A414j589q58l73J474J879j628j33Q59k575J410M342m624k751O286j571m256
985b694M761j832m036P635k81j0909O444O743r525J411O335q365J310R873r697
1000b827l771J3060m796q589J0776m82r587R516K393j2057O447O563j1142L386
1014a110Q936j1682j700J2662n386o562P228l127m067R947j787j1449O262O888
1028E053o042o53K662l742J587N220l901m041M705J956l449M24K290k458j606
$$ plain form
922 3693 -1386 812 1845 -4736 -174 5714 -1976 -4535 2054 -1435 -1852 4380 -2326 -6421 4058
937 4058 3177 -4283 950 1341 -4594 2543 5380 -3979 -1614 4257 -1150 391 4565 -2835 -3254 5340
953 5340 2125 -3052 176 -287 -1357 3336 548 -5275 -937 2822 -49 -1228 -1522 -1686 483 1414
969 1414 -175 -1033 -1406 68 1947 319 186 1045 -1530 -120 4222 -402 -3153 3133 1562 -2694
985 -2694 2067 235 -3801 3834 3553 -7356 -912 5831 -3694 -2283 4052 -4313 -3003 6870 -2827
1000 -2827 -6598 6462 1666 -6923 3853 3371 -6216 3300 5693 -6364 83 6646 -4496 -1110
1014 -1110 7826 -3856 -5556 7106 1720 -4842 2386 -741 -4808 5139 3352 -8097 -1835 5053
1028 5053 -989 -1642 1020 -2722 -1135 4085 184 -3857 848 2804 -645 -221 2069 -389 -1995
1043a995M629P61n930Q62M087k776R04L512q218k019J2694k371j1319O630K928
1058B379p304P509K615j3227N723J1104j2433k179J3811q805o207J4173m921j0703
1072h465J3459L89j3024J0605M571j6410P096J2606j4065k324J1420q216k086
1085d444J2087q403q480J3628J16j1704O852M587q187L415M608p563J537O947
1099D996n248l096N514M0m432K733K216l183q01K499J18k179J540J79l698K475
1115c27N092o382l856P919n37n849N029J82o577P032K789j0714M648Q658j0025
1130b918j091J0250p403l473J1327n647p275J1078k137r667J0490K842j3305N286
1144a643P448r472K691O839j0546M02J1037p734n133J0303l143o115P756p54o181
$$ plain form
1043 -1995 2634 3395 -2535 -1673 2414 -362 542 4054 -4164 -6183 6511 4140 -7179 -549 2379
1058 2379 -4925 2584 5199 -8028 -2305 8799 -3634 -5813 7998 -807 -7014 7159 2238 -8465
1072 -8465 4994 5383 -7641 2964 7535 -8875 -1779 10827 -3238 -5562 5858 -2358 -4444
1085 -4444 7643 -760 -9240 4388 4504 -7200 -348 4239 -3948 -533 4075 -3488 -1951 4996
1099 4996 -252 -3348 2166 2206 -2226 507 2723 -460 -1261 1238 1356 -823 717 896 -2802 -327
1115 -327 4765 -1617 -5473 2446 1909 -3940 1089 1271 -5306 1726 4515 -6199 -1551 7107 -2918
1130 -2918 -4009 6241 -1162 -4635 6692 1045 -6230 4848 2711 -6956 3534 6376 -6929 -1643
1144 -1643 5805 -3667 -976 5863 -4683 -4281 6756 -978 -6111 4192 1049 -5066 2690 1936 -4245
1159d245N985J329p222M557L646o198P78M830l358r93K152j705N25K368k389j978
1175a918J593J034J01j137j282J542k9j151K032l58l115K832J308l443K599J339
1191A947n402K943M808n720j322N916l077j738N915m639l777Q046j103o976N142
1206I63J437n940M982K185q372L281N724o801O73N212o250m67P590l699m121N604
1222B001j799k737N615j748n228M979J769m479K347O32l154K822K166m877N58
1237a133K561k073P60R68l129R83K721k061m26R26j871J511K296l011r04K729
1253H47j167J64K364l328n85M006j142k492K866j335j872M159j031l960L091R89
1269A574l124K448N4l954K928K674m229J24K505k618J191K496m010m12M600j844
$$ plain form
1159 -4245 1740 3069 -4153 404 4050 -2148 -1370 3460 102 -891 1261 -444 81 2449 60 -1918
1175 -1918 -325 709 810 -327 -1609 -67 -96 -1247 785 427 -2688 144 1452 -1991 608 1947
1191 1947 -3455 -512 4296 -1424 -2746 3170 93 -1645 4270 -369 -4146 3900 2797 -4179 963
1206 963 2400 -3540 1442 3627 -4745 -1464 4260 -2541 -1868 3344 -2906 -3373 4217 518 -3603 2001
1222 2001 202 -2535 3080 1332 -3896 1083 2852 -1627 720 1352 -1802 1020 3186 -1691 -1133
1237 -1133 1428 -645 115 1083 -2046 -1063 1658 -403 -829 97 -1774 -263 2033 -978 -1882 847
1253 847 -320 -156 2208 -1120 -1705 2301 1159 -1333 1533 198 -1674 2485 1454 -2506 585 1574
1269 1574 -1550 898 952 -3002 -74 2600 -1629 -1505 1000 -1618 -427 2069 -1941 -2353 2247 403
1285D03j891K883j833j028L847j467k878K999J10k119K536o05l176K550J512k825
1301i82J110N39k767K252J901l703PK612j386k09J462k524L55L297k005j504K553
1318A008q49j027K252j134j613K932o99j882K218n05k144K086R31k811J326N70
1334F59k073J513J292l211L99K844j973m58J727j922M55K636k592n80K511r58
1350B69j371K463j139j151K411j133j668K458k06k382K488r4k416J771R11k908
1366a697J803J300l277J173K443l091k27K684j722o80K354j409j438L570j106
1381F80k374K393M65k129J138N81j563J407P65j853j23J400n85k81N35p41m22
1398g07Q36k15K06l12j034R97N09q00L60l5j237K226N94l018R41K412k447P24
$$ plain form
1285 403 -1488 1395 -438 -1466 2381 914 -1964 1035 1145 -974 1562 957 -2219 331 1843 -982
1301 -982 128 667 -2100 152 2053 -1650 -1643 969 -417 -626 836 -1688 -1333 1964 -41 -1545 1008
1318 1008 159 -868 1384 250 -1363 1569 870 -1012 1206 701 -1443 643 1574 -1237 89 659
1334 659 -1414 99 1391 -1820 -1421 1423 -550 -1008 719 -1203 -748 1888 -704 -1284 1227 269
1350 269 -1102 1361 222 -929 1482 349 -1319 1139 933 -1449 1039 945 -1471 300 1211 -1697
1366 -1697 106 1406 -1871 -698 1745 -1346 -1573 1111 -611 -1291 1063 -346 -1784 1786 680
1381 680 -1694 699 1164 -965 173 754 -809 598 1363 -490 -613 787 202 -79 456 -285 -707
1398 -707 129 -86 120 -192 -1226 -229 280 -520 -160 -195 -1432 794 1388 -1630 -689 1723 -724 0
1416@J710k730r3M092k581k394L556j053k766M145j69n061L129K521m157J599
1432b52K323m568O69M634l321k300M809j807k329L867r51l478L380J281l762J866
1448F1K045l288M09L061k333q08J975j154q67J971o76j989J410J064j519J06R96
1465D64j074l26Q02P44j108k20J008o42j20K038j005k608K483J646k327K29J155
1482A139k770J965L198m086j908M290j530j985M141k141m228M885J461m891K460
1497@J049m317L276M246o548j429O013j492k056L904l745k878P264N14o681K561
1513c19K013l544K786K871o064m36N325k097j622K896k851k182N192M52m725P5
1529b230K700m16P23L22l179m05M696J87l879l6K042k90K58J752k561k503L894
$$ plain form
1416 0 1710 -1020 -1113 2979 398 -1996 1560 507 -2259 1886 1717 -3344 -215 2306 -1851 -252
1432 -252 2071 -2497 -1828 2806 -515 -2815 1994 187 -2142 1725 774 -2704 676 1957 -1805 61
1448 61 2106 -1182 -773 2288 -45 -853 1122 -32 -899 1072 396 -1593 -183 881 -638 -532 464
1465 464 -610 -936 -134 610 -498 -718 290 -352 -472 1566 561 -2047 436 2082 -245 -16 1139
1482 1139 -1631 334 3532 -554 -2462 1828 298 -1687 2454 313 -3915 970 2431 -2460 0
1497 0 1049 -3268 8 4254 -2294 -3723 2290 798 -1258 2646 -1099 -3977 3287 3801 -2880 -319
1513 -319 1694 -1850 936 3807 -2257 -2693 2632 535 -1087 1809 -1042 -3224 1968 2420 -2305 -2230
1529 -2230 470 54 777 1099 -2080 -2485 2211 2398 -1481 -1517 525 235 493 2245 -316 -2819 1075
1546A075J121l001J072Q71l586K341L983m477k983N076r46k420L666j938m182
1561d328N915J950o669J805M053m682R21M810n126j721O359k451l473N104j474
1576I93m520M828K022n740J760K549l427J807K831n109q54N033j525k480K908
1591A076j049k105K672K68j815R15O18j640R06J652j491p63J129K09k33m84J01
1608c4L66J39K91o81j518J503J428j416o63J194j117k50K032j195j714K192p42
1625a85j681K801K58l273J634K177k741Q78J683k753P69L110l080j203L736j665
1641D65j818K897j416k179L541k42l603K784J303l834J450K451l377M06K978k913
1657a107j27L277k790j018L660j164k579K571J10j752J615L18k081J832M45j933
$$ plain form
1546 1075 2196 -805 267 1138 -2448 -107 3876 -601 -3584 1492 546 -1874 1792 -146 -4328
1561 -4328 1587 3537 -3132 -1327 2726 -1956 -1035 3775 -1351 -3072 3287 836 -2637 2467 993
1576 993 -3527 1301 3323 -2417 -657 1892 -1535 272 3103 -2006 -2860 2173 648 -1832 1076
1591 1076 27 -2078 594 862 -953 -38 580 -1060 -154 1498 7 -756 373 582 349 -135 -34
1608 -34 332 471 762 81 -1437 66 1494 78 -585 609 -508 -758 1274 79 -1635 557 -185
1625 -185 -1866 935 1193 -2080 -446 1731 -1010 -132 1551 -1202 -433 2677 -403 -1606 2130 465
1641 465 -1353 1544 128 -2051 1490 1248 -2355 429 1732 -2102 -652 1799 -1578 -1172 1806 -1107
1657 -1107 -1234 2043 -747 -1765 1895 731 -1848 723 833 -919 696 1014 -1067 765 1210 -723
1673g23L92J353j171l68O59n56L18M45m38j4j47j26M05p5o21J020m00q00J216
1692C69J25j356J222N48j614P40R56j905P48K053k561l11K266j333m28J643j415
1709b53j374K634k73k395K038K89k310J739Q83k797J415J911k458M04J659k015
1725i03j7K768k047j327K941r95j142K136j046j618K014J35j953J100N19j523
1741i58J204P98k107L81J379j112L26O30j363L72J213r38l68R23n31M2R71j051
1759a89r4R56m55j76P44j134M78J240j340k32R31q31l79J498r13j225J422J36
1777D37j567J585l84j388J506N01j796O69J335j507J68J513j848K47J948j297
1793A22r46J893n61j323J468j06j272J134J5j259J334j26j118P35N11j315P37
$$ plain form
1673 -723 -331 1022 -149 -517 142 -414 -96 349 -89 -103 -250 -376 29 -46 -667 353 -47 -847 369
1692 369 494 -862 360 908 -706 34 990 -915 -167 1886 -675 -986 1280 -53 -481 1162 -253
1709 -253 -1627 1007 734 -1661 377 666 -1644 95 978 -1819 -404 1507 -951 -547 1112 -903
1725 -903 -920 1848 -199 -1526 1415 420 -722 1414 368 -1250 764 899 -1054 46 565 -958
1741 -958 246 1044 -1063 -682 697 -415 -89 541 -822 -450 763 -175 -543 380 -151 -109 862 -189
1759 -189 -283 673 218 42 786 -348 130 1370 30 -202 729 -102 -481 1017 104 -1121 301 437
1777 437 -1130 455 71 -1317 189 690 -1106 -437 898 -609 -441 1072 -776 -529 1419 122
1793 122 -824 1069 508 -815 653 547 -725 409 424 -835 499 373 -745 -10 501 -814 -77
1810g7M51j170N86P92j215J9J059o54k8P88r76M43J007j034k58J135p45k51R73
1829H45q07o24J215n02r70J338r5j380J002L65j195P73K70j249Q82O32j351L40
1847e11Q99q88N3J103q20J49Q51j220m3J776j011r16J276k94q63J104l94q96J059
1866D14j6j398J128Jr67P54L32j033N66N19j141L72R56q18l48J166l42n94Q15
1885C66k08m2M91n75l86Q68p9m15R9k12J99K73k71p49R07n0p28M45k41j71M52
1906b7o2o47R20K70j194Q21Q10j550L40J106j117N50P20j296q8J576j179n89J390
1925G54l21j014J271n28j121J405J03j819J469M95j272L51N80j330K16J653j174
1942b82l54J155q39j20J615n91j237Q91K98n52K44R5j106R80P38j251j97N61J78
$$ plain form
1810 -77 374 -796 -210 582 -633 -614 445 -209 -237 551 -425 18 1025 -9 -267 868 123 -128 845
1829 845 38 -586 629 127 -843 495 400 -980 22 387 -808 -35 235 -1014 -132 500 -851 -511
1847 -511 388 -500 -447 656 -164 -15 836 -384 -427 1349 338 -578 698 404 -459 645 251 -645 414
1866 414 398 -1000 128 129 -838 -84 248 -785 -219 300 -841 -469 487 -331 -679 487 145 -449 366
1885 366 158 116 607 32 -354 514 435 20 119 -93 106 379 108 -641 266 216 -512 -67 -308 -479 -27
1906 -27 -89 -736 184 454 -740 81 891 -659 -319 787 -330 220 940 -356 -444 1132 -47 -636 754
1925 754 433 -581 690 162 -959 446 549 -1270 199 694 -578 -227 353 -977 -761 892 -282
1942 -282 -636 519 -320 -440 1175 584 -653 238 536 -16 228 323 -783 197 935 -316 -513 48 226
1961B26k45N12o81o80P06P04n89m61k6M3O63K48K8r20M1J116k60n43J13l81J31
1982b55J396p7j857L75J225n06o17P63j135K1K015j021j411Q83M8r64K142m82
2000E43k629J658J428j346M08O32k102R14K371j653j390J873k09p14J355r67j371
2017a199J579Q59j567N21K52j503R07J386j476p98J259m73r4R04r40r64J585N64
2035H02j151R5Ll26R45N00q99m15M14P20l39k3j56o67J80J176k47q29M0J32k26
2056b71P23K39j924O19J550j049n05J097q65n61K047j004j389J668L96j717J451
2073E05O79k403Q05J944j656p7J455j962l11K702q64k650K111N73j669R27N30
2090F39k074R99J891k123n45J987r59p92K123o14k084J739P35j560O48P91j705
$$ plain form
1961 226 -19 493 -188 -868 -162 542 -47 -508 -534 -491 172 420 448 -472 -431 685 425 -118 -5 -386 -255
1982 -255 1141 1064 -793 -418 807 301 -316 447 -688 -667 1348 327 -1084 -201 -153 -1117 1025 543
2000 543 -2086 -428 1000 -346 62 694 -1408 -494 1877 224 -1166 707 498 -216 1139 172 -1199
2017 -1199 380 1239 -328 193 445 -1058 -151 1235 -241 -1039 220 -253 -347 557 -383 -1347 238 802
2035 802 -349 -254 -251 -577 368 868 -31 -446 -32 688 349 326 170 -497 -317 859 612 -217 -177 -45 -271
2056 -271 452 691 -1233 -614 936 -113 -618 479 -386 -947 1100 96 -1293 375 771 -946 505
2073 505 1184 -1219 -414 1530 -126 -203 1252 -710 -1021 1681 817 -1833 278 851 -818 109 639
2090 639 -1435 -436 1455 -668 -1213 774 -185 -977 1146 532 -1552 187 922 -638 10 801 -904
2107i04N17J807j071j062Q93N44j014N39K04j320K98J543j090p67J023p0j106
2124a036J647K62j819J28J912j386m71J717j186j125K451k45k194J576J091k107
2140g85N55J523k247L23K318j998j112K646q65j604K162j89k130J473P90j810
2156i50Q28J317k047j10K110j030j069J666k56j490J371N79j563O04P83j082K30
2173a09P64o10m71P75j45m78K59K67l63k2N13l00n34N81K09p39J54O89o95O0O61
2194D66q72r9J183m23q18J103m7j183R31N82j605P18R97j129L0R21j058m39J585
2213H43n72j282J288o9j187J326J21j524Q13P33r56J58Q74r36O0J035o85k34Q13
2232F19m99l82R16o20n35Q66j18n17M69k08k97L53P5j67j21J38j43K42j21j44
$$ plain form
2107 -904 -387 1420 349 -713 180 724 -290 249 453 -867 -569 974 -116 -883 140 70 -1036
2124 -1036 611 873 -946 -818 1094 -292 -763 954 -232 -1357 1094 849 -1345 231 1322 -785
2140 -785 -230 1293 -954 -631 1687 -311 -1423 1223 358 -1246 916 727 -1403 70 860 -950
2156 -950 -122 1195 -852 -962 1148 118 -951 715 459 -1031 340 919 -644 -40 743 -339 -109
2173 -109 655 45 -426 349 204 -274 -15 252 -111 -133 380 80 -454 127 336 -403 -249 440 -255 -195 466
2194 466 -406 -505 678 255 -563 540 493 -690 241 823 -782 -64 933 -196 -166 755 -303 -742 843
2213 843 271 -1011 277 208 -979 347 468 -1056 -243 490 -466 -308 566 -370 -310 725 40 -194 619
2232 619 120 -262 654 34 -501 365 247 -270 199 -9 -306 47 122 -45 -166 -28 -171 71 -50 -194
2252a94Q8K57l98M15j04l35L67J58m51J73K30j25K66K49p91L37L18n06J4J57k48
2273a23l12P88l15m25P42n20m61O90J51o98N20K87p25L56K48l40L1L53l70j6P52
2294F13p20K00L54n99J24M88n21m00O03n7k49J84j20j20L98k39k93L68j76l27
2314d89N30L2l91N13j80m50O45J77m24K8J72l82J7M96l11K8K53k79q1N91n26n71
2336f02O26M6k80L39l10n2K12j24m56O02j09P8j18K20l42M66J28o42K81l5Q4j55
2358a43N34m72N9M00m86L6N05k21m01N28m07n76Q70l62l03N67k55l39M56M25o55
2379b40M7K29k40K34J38j43m02O95l24l1M02l40m9L26j47j14K03k88k02M86Q6
2400C26l15j54o0M7J91j90j68M47k49J92K6l69M3M79L0l27K93J26n95N01J30n22
$$ plain form
2252 -194 -106 151 -247 168 64 -271 96 254 -197 -24 206 81 347 596 -195 142 460 -46 -32 125 -123
2273 -123 -435 353 38 -387 355 -165 -626 64 215 -483 37 324 -401 -45 203 -137 -106 247 -123 -139 613
2294 613 -107 93 447 -152 -28 460 -61 -461 142 85 -164 20 -100 -220 178 -61 -354 14 -162 -489
2314 -489 41 73 -318 195 15 -435 210 387 -37 -9 163 -219 -202 294 -17 11 264 -15 -96 495 -31 -602
2336 -602 24 70 -210 129 -181 -233 -21 -145 -601 1 -108 -30 -148 72 -270 196 324 -318 -37 -72 12 -143
2358 -143 391 -81 -22 378 -108 -72 433 212 -189 339 -68 -644 226 -136 -439 128 -127 -466 -10 415 -240
2379 -240 -193 36 -204 30 168 25 -377 318 -6 -37 365 25 -24 302 155 41 244 -44 -246 240 326
2400 326 11 -143 -203 -156 35 -155 -323 124 -125 67 93 -276 -233 246 276 -51 242 368 -227 274 404 -118
2422a18K45K24l83O0L47m28J27K51n80M6O09o78nL40l09k61Q16p1q43N21K96q33
2444f27O08N14q24N4P60m45k38M00o8l50M87J49o43K95L38m60J77K91p16J69M65
2465C36j82l54J08K74m34L15L02n92L3L20j05m51N22M6k08K6K94n34J2R94p59
2486c7q9L01Q5p01P93K01j073N13O16j014O8J029r70m32J241o45m44J025l80r86
2506h99J177L18j364N57P56j200O80P17j236M2J359p17p00J073k05j047R58O11
2524H80j452L92N85q47Q7O40l67o60J123J13j430R23L03p63N29L83p59q9N80M8
2544B19m98L65K09o69K28P78p82j40Q83p16l51J113m05p48O35M63j110M75O11
2563E60r84KJ192j052m13J267l59p94J007j9j165P35Q55j165K63O88q75R8R34
$$ plain form
2422 -118 127 351 -32 28 375 -53 74 325 -255 -209 400 -278 -283 57 -252 -513 303 232 -611 -90 206 -627
2444 -627 -19 495 -329 -275 485 40 -198 202 134 -216 271 420 -223 72 410 -50 127 418 -298 -129 336
2465 336 154 -200 -92 182 -252 63 365 -227 -194 126 21 -430 92 138 -70 -44 250 -284 -272 722 -37
2486 -37 -126 175 260 -441 352 553 -520 -7 609 -405 -337 692 -278 -710 531 -114 -558 467 87 -899
2506 -899 278 596 -768 -211 545 -655 25 742 -494 -452 907 190 -510 563 358 -689 269 880
2524 880 -572 -180 405 -442 -355 285 -82 -742 381 494 -936 -13 290 -473 56 439 -320 -409 171 219
2544 219 -279 86 295 -374 -146 632 -150 -290 593 -123 -474 639 234 -514 121 584 -526 -51 560
2563 560 -424 -422 770 -282 -695 572 213 -581 426 407 -758 -23 832 -333 -70 618 -257 -159 775
2582G75p58r80J391J40q01M95Pr09P28L56p07j48O16l51j65L75n6m75M88K89o77
2603c67L99J47k28K46K25q5o06M44J06k28j00J44j91k2K23rl41M54j98j96L52
2624A69J76o39Q8M88o76L68J79m44j33Q32n37l75P80r8m30K92L27o88L94K67m96
2645a56n6N08l16p5L71m73o2M10j49l61N10j98l32N27j54j91O5Q2q3L20rn34J49
2668b07M17k34J10l9N4k83L69k20k10K78J05k46M6pK3nJ43l1l53K49P2p9P3k36
2692b11l2J99K9O6j36J85m0M5N1k1jj45K83j41l12M32R6n32L04Q7n55N14nl28
2716a68K39M38p23J13K84m1l26L58j13k43j5M17l37K19J88n70M76J85l75j28N43
2737D21k24l89O03k95j69M18o39L40k6j63J12j70L30m34J78M3j07J10j21m5M07
$$ plain form
2582 775 17 -963 428 568 -233 262 269 -640 88 444 -263 -411 205 -146 -311 64 8 -467 21 310 -367
2603 -367 32 179 -49 197 422 337 -269 175 281 53 -47 97 -94 -116 107 98 -243 211 13 -183 169
2624 169 345 -294 -206 282 -394 -26 153 -291 -424 408 -129 -504 276 178 -252 40 367 -321 73 340 -156
2645 -156 -212 296 -20 -95 276 -197 -259 151 2 -359 151 -47 -379 148 -6 -197 -132 -50 -133 187 178 -356 -207
2668 -207 210 -24 86 47 101 -182 187 -33 -243 35 140 -106 -60 -67 -44 -49 94 63 -290 -41 31 -48 25 -211
2692 -211 -243 -44 -15 51 -85 100 60 105 156 135 134 -11 272 131 -181 251 347 -185 119 206 -349 165 160 -168
2716 -168 71 509 -214 -101 183 142 -184 174 61 -182 -197 220 -117 102 290 -280 196 381 6 -122 421
2737 421 197 -192 411 116 -53 365 -274 66 40 -123 -11 -181 149 -285 -107 -64 -171 -61 -182 -227 180
2758A80k5j18o4j75L16P3nj26J53l3j55K35k04n7p8K3k11J92K31l94K0K13j02
2781a11j5J96j20k57L43L0k27J87j36j15K10K76l47K60P5k03K08Q0j57j91L69
2802C55m41K57L1r1k93J34k07K05J81k26J17M9j65j19K95k96j4J18J59j93K26
2823H2J2j01l1L35k73J7J50k67J14L21j11j44r0j82J55P9j56L14k77k27J41L09
2845A70k62p1J75j09kJ47q4j9J55l31M7L38r6j11M19r5l58j13K57NP6M4k36j46
2869b00J22K24l50L8R5l9J25k09L7M01k22k33P3jP0J89j33J32o7M6j72O8J23J56
2893B73l37J44k04P2qk4j06O3J91J18k72J15j88J06k10M17r5r3L6N4k90J80L39
2916B81o17M69J52J1m98N33k78l24N25j02l03L68r7j72J76J15n29M48K15k19m09
$$ plain form
2758 180 155 37 -27 -202 114 187 182 56 209 176 21 256 52 -5 -83 -60 -271 -79 152 -242 -222 -9 -111
2781 -111 -126 70 -50 -307 36 66 -161 26 -110 -225 -15 261 -86 174 249 46 254 334 177 -14 355
2802 355 -86 171 202 111 -182 -48 -255 -50 131 -95 22 71 -94 -213 82 -214 -228 -110 49 -144 82
2823 82 94 -7 -38 297 24 41 191 -76 38 359 248 104 14 -168 -13 66 -90 224 -53 -280 -139 170
2845 170 -92 -163 12 -97 -99 48 -36 -55 100 -231 -184 154 58 -53 366 271 -87 -200 57 62 138 182 -54 -200
2869 -200 -78 146 -204 -166 -71 -110 15 -194 -157 244 22 -211 -138 -139 -69 120 -13 119 52 98 -74 -6 117 273
2893 273 -64 80 -124 -52 -60 -84 -190 -127 64 182 -90 25 -163 -57 -267 150 55 -38 -2 52 -238 -58 281
2916 281 -336 133 285 296 -202 331 53 -271 254 152 -151 217 120 -52 124 239 -290 158 373 154 -255
2937b55K75k23p8O13m71j19L09nl77K96K13k72J02J12jj88M4L6k67M06J11m90
2959b29K90J72l52J41j37j49J51J7J27j22r1J85k20K84l12L65j82J82j6k94n2
2980b42L32k71K14Q6l90K94J07l0k12K96n9m42R18l71k59P5k8r3J15O7l79J72
3002a00P8%l22M31m5m14K80j0k20L79l9k90L08O3j30LJ13R8j49Q1j82k19M99k74
3026f1k98M85Jj85j00J55j51L82j81o1q8O9q1K65k30J09j78K54k37K66ln2o5K15
3050B30j5k90K09m2j25nj23K27k77p5L20j08j02p8L69j45O4Qn40O80k2l73L97
3073A84J94n08J66M08o35L3K73k08k13M28L6l88J00L19r2mK57m49o2K05l51m7
3095c54N79j90l71O04j27l04K22R3l47L69oj05j73N6K3j7M2K16l49L40j26j0k30
$$ plain form
2937 -255 20 -203 -281 332 -139 -258 51 46 -331 -35 178 -94 8 120 119 -69 -25 11 -256 150 261 -229
2959 -229 61 233 -119 22 -115 -264 -113 -96 31 -91 -182 3 -217 67 -245 120 -62 120 104 -190 -242
2980 -242 90 -181 33 119 -271 23 130 100 -112 184 125 -317 601 230 -29 46 18 -75 40 107 -272 -100
3002 -100 -22 -22 -344 87 42 -372 -92 -102 -322 57 18 -272 36 99 -31 -28 85 183 34 115 -67 -286 213 -61
3026 -61 -359 126 127 -58 -158 -3 -154 228 47 -14 -102 -33 -114 151 -79 30 -148 106 -131 135 132 80 15 230
3050 230 215 -75 134 92 -33 -38 -161 66 -211 -286 34 -74 -176 -254 115 -30 34 42 -498 182 160 -213 184
3073 184 378 -130 36 444 -191 -158 115 -93 -306 122 158 -230 -130 189 97 93 350 -99 -161 44 -307 -354
3095 -354 225 35 -336 268 141 -163 59 152 -195 174 168 63 -110 -54 -31 -48 -6 210 -139 201 75 65 -165
3118a65k4J96k07K95J65m84J67R5j95j98L35Nl49N66n9k94P2K46k35J90O4m29
3140b43L24K29k55J70J00l54o0K38O8l44L62J15o73J11M19m93n9N31l84m7L02
3161E7Pk39K45J46m42M38K21m74k77M93j30j13L27k74k69L27K31k85L1J73j49
3182D4k02J94n6p5K85j83l34N47l88j6K30J22o4l89L06k04j0O9L92k52o0L02m88
3205b30L30J20k73M2J96r7o5n8J79k96J25K07m25K97J79m33j10M42m02J51M53
3226C32l81K73rl36OK44n4j94K90k39j81J32N09k79m1p2Q7j24mK38m1j13m3Qj07
3251i9K23k34j41K44k65J66M0J49k99L21j20N4m4O1J82j72jk8J24j96O4Rp1J50
3275A17r5l2L77o09N3J74Nk9m7M2j98N1K43q0R0rM4j69R3N5m3K39k44j28N3K63
$$ plain form
3118 -165 -189 7 -200 95 260 -224 -57 38 -157 -355 -20 -15 -364 202 143 -151 -79 167 -68 122 186 -243
3140 -243 81 310 55 225 325 -29 -89 149 217 -127 235 350 -323 -212 207 -286 -345 186 -198 -245 57
3161 57 64 -175 70 216 -226 212 433 -41 -318 175 45 -68 259 -15 -284 43 274 -11 20 193 44
3182 44 -158 36 -20 -95 190 7 -327 220 -168 -184 46 168 104 -285 21 -183 -193 -124 268 16 -44 258 -230
3205 -230 100 220 -53 -11 185 88 23 -35 144 -152 -27 180 -245 52 231 -202 -312 130 -272 -121 332
3226 332 -49 224 215 -121 -115 129 75 -119 171 -68 -249 -117 392 113 72 0 87 -37 -41 197 156 43 0 8 -99
3251 -99 124 -110 -251 -7 -272 -106 -66 83 -216 105 -15 39 -5 56 238 66 65 37 161 -35 29 38 -33 117
3275 117 22 -10 367 -242 -189 -15 -10 -39 -86 -44 -242 -191 52 -28 62 53 97 -72 21 76 33 272 28 -100 -47 216
3301B16m8k32K61l80K57j13n5J59J75l29K18j99L1K27j79n7PK28N7l49j45K34
3323a6k29L91k34K94k91n5L78r8l85J78j35J29K42M7q1j10J51j89j67J25L6o8
3345h7L9J18k7k9j92J42J00j93O9j19J62j57K88r5OO3ML24m61J39O8j55k14L91
3369A84k19j11M30k87Q1j96q9K21k5k31p9L31Q5m8R1j16J21k57J49l4j55K30j6
3392F0N4n7k41L54O6j85J40l33K83p8k17L1L35k02P4K2l31M60l23p0J82j28J20
3415A6p8K3n4J7j04L33j29J08k36J75J5p7K4J4J74j71k54K64j50K1m9J26r7R0
3439AR1j87J67L3l73J80K35k97l1J97j10J50K4J1j64L88l26O9rj96J13k9J86j50
3463b7J12R8q8k62J36K4m8J34j14k08p9M89j65K03k35j01J86q6K36m29J4L57j61
$$ plain form
3301 216 168 -64 197 -183 74 -39 -94 65 240 -89 129 -70 -39 188 9 -48 -41 187 244 -105 -250 -16
3323 -16 -245 146 -88 206 -85 -140 238 140 -245 -67 -202 -73 169 216 135 25 176 -13 -180 -55 -19 -87
3345 -87 -48 70 43 14 -178 -36 64 -129 -60 -179 -17 -174 114 19 25 88 92 416 -45 94 162 7 -207 184
3369 184 -35 -146 284 -3 78 -118 -207 14 -11 -242 -321 10 95 47 138 22 143 -114 35 1 -154 76 60
3392 60 114 57 -184 170 236 51 191 -142 141 63 -154 -123 212 10 84 106 -225 235 -88 -158 24 -104 16
3415 16 -62 -39 -93 -76 -180 153 24 132 -104 71 86 9 33 47 221 50 -204 60 -90 -69 -118 8 -89 1
3439 1 92 -95 72 105 -268 -88 147 -150 -181 16 -94 56 80 91 -73 315 -11 58 49 -147 -34 -63 123 -27
3463 -27 85 183 95 -167 -31 -7 -55 79 -35 -243 -322 167 2 205 -30 -131 55 -31 205 -224 -210 147 -14
3486a4o0K90j36l13K01K39l56J33L5j34N6K50m1l37L81r4m17M02j81l55O05j19
3508C5l56J61K28k38K45J02n40J80L40R2k84L21k12j3n7K28l44q4M96l52j39L38
3530A47j58j04L51l88j47L99r3k04l9L39j99QJ48k6k49K88J51j33o6J45n79N70
3552A61K28m18nJ6R4k11J92k4k12J17K61l38J12p2J04p5O8J58k62J55Q7j86M05
3575C55j94k11J4J27j07J46K7k05j36K93J79k62Q6J79m40K21K48l73J70j93Q2
3596FL3J05j60j74J20j3l3J15Q6o9j13J41k16R4L93j78j60K40j42k06L91m51J44
3619d7j10L97k73J4j1o6p6J86j39J26j33L15m21J56J64k66J18J98m5j86J66J05
3641A72k28K24R4j26P9q4o5k95K64k44m6J58J06q6J60j09mL5J30k39K75k77K10
$$ plain form
3486 -14 -74 216 80 -233 -32 207 -149 -16 19 -115 -59 191 150 -187 194 100 -317 85 -96 -451 154 35
3508 35 -321 -160 68 -170 75 177 -363 -183 157 249 -35 286 74 61 4 232 -112 -196 300 -52 -191 147
3530 147 -11 -115 236 -152 -299 100 7 -197 -236 103 -96 -88 60 34 -215 73 224 91 25 170 -409 161
3552 161 389 -29 -34 -18 76 -135 57 33 -179 -62 199 -139 -27 -99 5 -70 -2 156 -106 49 136 -50 355
3575 355 161 -50 -36 91 -16 130 157 -48 -184 109 288 26 112 291 -149 72 320 -53 117 -76 6
3596 6 39 144 -16 -190 -70 -83 -116 -1 85 16 -97 44 -172 -78 315 137 -23 217 75 -131 260 -191 -47
3619 -47 -157 240 -33 -19 -30 -96 -172 14 -125 1 -132 183 -238 -82 82 -184 -66 132 87 -99 67 172
3641 172 -56 168 262 136 215 131 66 -229 35 -209 -255 -97 9 -77 83 -26 -30 5 135 -104 171 -106 104
3664A04J8k07L3R5J64K46n08L10p8l55K12R3J9l49M11m08K68O4kj81J63J4P4l6
3688A64m0q9j80P2K30k28k31J96j04L98j91kQ5k38K13k5J79r3k09J78k3L7P7J77
3712C53l34j4j23nJ7J41j38K45M8r3j77rJ85k96M96l53k9J44O7l02M07l14J50
3735F6j03J39m6r1J23K36l77J02M1Kj30P1L7l16K01K42j50m6q2J3J72j33k16K75
3759C0k0J6n5K9P9O5j78J50j00J16o0m9r0J62k72K14R1m3Q0j99K48j74r4J69m23
3784c08J38r1N8K15l6P2j25J33J86j77j34P9o8j08J29O5Q4j62J97j71J80l57K06
3807EM4K35j64n0K81k59l03M13l1j19J30j94M4K32j32k92J63k15L09k0J1k21P0
3830f3j13L43p2k29O5K4J25l44K39k9K25k11K62M1k89J60l47KK6K47k58J66j2
$$ plain form
3664 104 122 -85 -52 43 207 453 -55 255 177 -178 34 127 146 -203 208 -200 68 132 130 -51 112 126 200 164
3688 164 124 35 -145 -73 157 -71 -302 -106 -210 188 -3 -5 80 -158 55 30 209 116 -93 85 62 99 176 353
3712 353 19 5 -118 -123 -106 35 -103 142 190 97 -80 -89 96 -200 296 -57 -86 58 125 -177 230 -84 66
3735 66 -37 102 56 -35 88 324 -53 49 90 92 -38 33 70 -246 -45 197 47 1 -81 -68 104 -29 -245 30
3759 30 10 26 -29 0 79 144 -34 116 16 132 72 23 -67 95 -177 37 128 85 165 -34 214 40 -54 115 -308
3784 -308 -170 -261 -203 12 -24 48 -77 56 242 65 -69 10 -58 -166 -37 28 112 -50 147 -24 156 -201 5
3807 5 49 284 120 70 351 92 -211 202 171 52 182 -12 32 264 132 -160 3 -212 97 77 88 -133 -63
3830 -63 -176 167 95 -134 -69 -45 80 -264 -25 -54 171 -40 222 263 -26 134 -213 -211 -185 62 -196 -30 -42
3853d2K60l53K71m1j26j03J42P3k72K82j6O9k2N4k13J4L16m02J51M5m2k96R6L11
3877A56o2k66J05r4J05J32j40R7Kj41J13l0o3j45L00M6j38N1k83J66L36O2k81
3900B8P2r0r7J8n7J82L5l15K82j82J12pp1J00p8M5J01N7j34mlr1q2N8J55O1l1
3927F4n4P0O5r5J18j89J70J48k50n5n0Q3j09N5M06n38K60K1j35m5J65m32J70L81
3951B24j49J13j54j06j60M53k95L8k8J53l11K97J33k66J59k9j06k07L24q2l4j19
3973a52J87R1l96K44R3Q1k30Q2k71N11l01P3j05J01j8p9L27m62K33j70K85j89
3995f5K0J58k79L42k58N7oP7j96R7L04k95pr2K11o0J13M4p4j59L56j36q9o2l8
4020c7M0K13k90Q1K12k2l29K70p7l35J11J16K6l1l3L14k21j43m7P0J87Q2l6l91
$$ plain form
3853 -42 218 -135 136 95 -31 -134 8 81 -191 91 75 144 122 176 -37 -23 293 -109 42 87 45 -251 -155 156
3877 156 94 -172 -67 -161 -56 76 -64 33 35 -106 7 -23 -86 -231 69 115 -23 28 -255 -89 247 309 28
3900 28 100 10 -87 -69 -126 56 91 -224 58 -124 -12 -19 -90 10 -68 -23 78 135 1 -3 -6 -97 -179 -121 34 95 64
3927 64 10 80 145 50 168 -21 149 297 47 -8 -58 25 -84 -29 377 -161 99 120 -15 -60 105 -327 -157 224
3951 224 75 188 34 -72 -232 221 -74 -36 -64 89 -222 75 208 -58 101 72 -34 -241 83 1 -33 -152
3973 -152 35 126 -270 -26 67 148 -82 0 -271 240 -61 12 -93 8 -10 -89 238 -224 9 -161 124 -65
3995 -65 -45 113 -166 176 -82 -25 -31 46 -150 -53 251 -44 -51 -143 68 8 121 165 91 -68 288 152 63 1 -37
4020 -37 3 216 -74 7 219 197 -132 138 61 -274 -163 -47 -21 -52 -85 229 8 -135 -182 -112 75 157 121 -270
4044b70L40m9P7n5j69J53r0K8j91K99J31l66L80j90KrR1r6p6L42k10l56R2N4J06
4069c2o1J61n21M64P8P6k76L67j91j02K05j61No7p7M5m9K54p8J62j58j99M6k3
4093a32L23l07L35j15k03J78j36j66n7J11R6r1J82m3q1m2Q0P9lJ29j04l1J12J11
4117B25j21k04j14O2K12j64M3oN5N3R0k22Q3K20j07m6o0rKJ33M5p8m8j38m1K72
4143A37k36MJ24O9j25M9R0l4j97j16J97l4LJ75j67j11J79J82j72k2J25j92K06
4166A34j36J3MK51j94o5o6J86k11q2L20l04L74j96K6j68J70J44j48P9j55j25J45
4189dJ5N9r7m0p2p0L77j74j98Q4R1k16R4J28n1J21K4L8q1j1K79n81N4K21j0R5
4215G5j11K60k16k31K94j1k93L15k65L67k83L1N3J27k02K85N0l33K5J54o5n5J60
$$ plain form
4044 -270 70 21 98 43 -126 27 -63 -35 -226 73 204 -162 218 28 30 21 112 16 -60 282 72 -284 -192 -138 -32
4069 -32 -93 68 -453 11 89 165 -111 256 65 -37 168 7 12 -55 -132 -87 -136 118 40 202 44 -155 -109 -132
4093 -132 191 -116 219 104 -99 79 -57 -223 -280 -169 -73 -164 18 -25 -106 -148 -68 11 8 137 33 2 114 225
4117 225 104 -100 -214 -152 60 -104 -61 -67 -12 41 131 -91 -8 212 105 59 -1 -10 -8 125 170 92 44 -94 -135 137
4143 137 -99 -95 29 98 -27 22 112 78 -119 -235 -38 -72 -69 106 -61 -172 7 189 17 -5 120 -72 134
4166 134 -2 11 15 266 72 7 -59 127 -84 -166 154 -150 224 28 54 -114 56 200 52 131 -24 -149 -4
4189 -4 11 70 -27 -67 -139 -209 168 -6 -204 -120 -29 -245 -151 -23 -74 47 71 109 28 17 296 -285 -231 -10 -20 75
4215 75 -36 224 8 -223 71 60 -233 82 -183 184 -99 -68 -15 112 -90 195 245 -88 -63 91 26 -29 131
4238A31P9o7j3J20m51K12m8l9J12k12J03J45j32J73q8j06K90k39O0l9j56J0J31
4261b4K06k06l3K53o6j41M3J87j94J90k45k3r8J76M0K1j03K30k11k7q5R1J18k38
4285a39M16l31o7J5J9J8M4L1J51j22K1n1k38J34J42l5j86K91l3o8l7K10k59J15
4309D1k64J24o3J95Q1j38K34l57K80k26M9j33L76j32j36j53J81Q7k89J03J54k00
4331a86n0J55qK74j20j21R7k0nj37k0K51j8jj81K32k61L3J55j29l0Q4p4o3J08
4356c5Q6n4j75J54M7m2J16r2N2J1j33N2l1J17j38J51J18k99K47j71j61M22l63
4379a21J49r8q4K1K40o0J35k31%L3J7l1M3J0o1P0L8k0N6j31q3K52j16J5P9k06
4405h4O8q0J23k6N4l25J70P7P0n1j37M7J75O6j72m3J73r1O5j8O4j58M9O5mj21
$$ plain form
4238 131 210 143 130 250 -201 11 -37 -76 36 -176 -73 72 -60 113 25 -81 209 -30 30 -9 -165 -155 -24
4261 -24 182 -24 -57 196 130 -11 32 219 25 215 -30 -53 -151 25 65 86 -17 213 2 -25 -110 -19 99 -139
4285 -139 277 -54 -121 -106 -87 -69 -25 6 157 35 56 5 -233 -99 43 8 -178 113 80 12 -25 185 -74 41
4309 41 -223 -99 -162 33 114 -24 210 -147 133 -93 -44 -177 199 67 -69 -222 -41 46 -243 -140 14 -186
4331 -186 -236 -81 -89 185 65 -56 41 21 16 -121 -141 110 92 91 -90 142 -119 -86 69 -60 -90 -6 -80 -143 -35
4356 -35 51 -3 -178 -24 23 -19 97 5 57 68 -65 -13 -44 73 -65 86 204 -95 152 -19 -180 242 -121
4379 -121 28 -70 -154 -133 107 47 182 -49 -49 -16 1 -30 13 23 -38 32 70 50 106 -25 -108 144 28 43 122 -84
4405 -84 -16 -96 27 1 55 -270 -100 -23 47 -4 -141 -94 81 147 -25 -68 105 14 79 61 125 -33 16 81 77 -44
4431d4p6J38J1J11k63K65j85M5Pj38K17k0j31j31M10j29k38J65J03l8j01K0mj3
4455a9J39l31M37k66p2L28j58j22r1K00m8P5n9J54j43j47K62k96l7L14j16n2O
4478d2Q4r8K62o4m67L90Q7k28j03J22q4J34l9J27j10oM16n33J49K4o6o6J25j81
4502a67K02j4P0n8j50K01J03j36j75J48k11L52k72L7nj61K69J94q2k08rJ16P1
4525A15J79k61J8M8k40L60j56P8j67N5k00J65n6q3J17j05M46k96j21J5J67j65
4547h7k69L24K34m75M26j33j3j44p1K15k18L66j56K0n6J54k10P8j11j65J57N98
4569D64n31k05L84k5k11Q4K41l78J08K59k16J76k6l17P9K49j51k06K12J42m24
4590b92L55m7j75J46M64l06mK7r0m24N95l75j47L90o2k30M64j93k49mL69k07J19
$$ plain form
4431 -44 -120 18 29 140 -123 142 -43 2 9 -129 88 68 -63 -194 216 87 -151 14 117 79 -22 -2 -6 -19
4455 -19 120 -211 226 -40 -112 216 58 -64 -155 45 -3 72 13 167 24 -123 139 -157 -194 120 4 -48 -42
4478 -42 42 -56 206 142 -325 65 152 -76 -179 -57 -141 -7 -46 81 -29 -35 381 -152 -3 21 -45 -111 14 -167
4502 -167 35 21 91 33 -117 84 187 51 -124 24 -187 165 -107 -70 -75 -236 33 227 145 -63 -72 44 115
4525 115 294 33 51 99 -141 219 63 141 -26 29 -171 -6 -62 -145 -28 -133 313 17 -104 -89 78 -87
4547 -87 -356 -32 202 -273 153 20 7 -137 -208 7 -211 155 -1 19 -37 117 -93 -15 -126 -291 -134 464
4569 464 -67 -272 112 87 -124 -40 201 -177 -69 190 -26 150 124 -193 -114 135 -16 -222 -10 132 -292
4590 -292 63 16 -159 -13 451 145 141 168 78 -346 249 -126 -273 117 55 -175 289 96 -153 -157 212 5 124
4613A24K29m63R0R3r5L5O4q2J72j81J36j88P0M4k10K8J91N4r7J90j24j29j00J69
4637B0K0k00L71j52k64p7N22j95k22J20P5j04O9M9PJJ02k12K47r1k13l7l1M41
4661B46l32J78j79L3L15r1k07q1J46k35J46J20l78J36J78k61K94R2k45j17J14
4682a28K13L2l27L65l72J38J5J32n4J2L8l1K0j09jK47k50oJ66k83L0R2J80l4j99
4707a14M3J29j58NJ11J23K5j25J04M7k30J19J01q3j82K15k58n6j00J70LM33m72
4730a50J86N1q8O9J05k4j97MK46k43m3m6j54K57j4j03J63J0q8q8K89k52L5n0Q9
4755c6Q2j55J15Q8j61j03J92Mr2k16K28jo5K15j86J51J26j98O1J46k76k5P3LJ15
4780H5l5q3j9J41N4j38J77k70nJ4J94m6J19k08ko8p3J23nn8K25j52M2K73k51o7
$$ plain form
4613 124 353 -110 -20 73 -22 13 77 -5 167 -14 122 -66 4 48 -162 -134 57 111 14 204 80 -49 -149 20
4637 20 40 -160 211 59 -205 -282 240 45 -177 -57 18 -86 -17 32 39 40 142 -70 177 86 -127 -164 -195 246
4661 246 -86 92 -87 -54 261 170 -37 -118 28 -207 -61 59 -319 -183 -5 -266 28 120 -125 -242 -128
4682 -128 85 117 -210 155 -217 -79 -64 68 14 26 64 33 53 -56 -57 190 -60 -66 100 -183 -153 -61 119 85 -114
4707 -114 -71 58 -100 -95 16 139 164 39 143 190 -40 79 180 97 -85 130 -128 -184 -284 -114 -111 322 -150
4730 -150 36 87 -1 68 173 149 -48 -44 202 -41 -84 -130 -284 -27 -41 -144 19 29 -59 -147 142 -110 -75 -125 -36
4755 -36 46 -109 6 94 -67 -170 22 26 -66 -282 -54 -55 -120 95 -91 60 186 -12 49 195 -81 -106 -33 -30 85
4780 85 50 -33 -52 89 143 5 182 -88 -93 -79 115 69 188 -20 -22 -90 -163 -40 -45 -103 122 -30 12 285 34 -33
4806c3Q5k31J21K54l05mQ7q8J97J11q7mk28N8m3N1R0ol10L37K6n1J42j9L4k78
4832i4J87Q9k08K46j14j44j90L68J16o2j77P2m2k72J55L9K4l06L34o1J66o8j19
4855f1R5j04J22K1o3O8j70J70L26k62Jj03q3K24k63K96mk88N4K3j4K77l36RJ17
4880E2j37n0J04P3j12j13J43k13M46%p2m9j94J06J03j44j7j62K64J67j07p0j49
4903a31K19J2j35j30J65k2k46K96J16k84J51J57q9n9l4j67J36j30j2L60j9k91
4925a37O9K22O7N6k79j08K58K5k72n3P4M00j09j03jj52q0q2N3J7l1J58l47L61
4949Fp9p0J56k61L44k02l8P8K24j70k12J28O0J27R8p4k07N2K60l04K46n2j95K71
4973A86j78R9J4r6j94mR0J13k83J64O3j96L41k17J93q8k1l9K00J39l51J62k92
$$ plain form
4806 -33 52 -179 -58 196 -109 -113 -26 -114 83 194 107 103 -125 -67 -110 -59 31 25 -285 52 78 27 169 150 184 -94
4832 -94 93 182 -26 220 106 -38 -228 140 256 194 17 89 47 -225 -70 -31 -7 -313 21 -40 126 58 -61
4855 -61 34 -70 52 73 10 78 -92 78 404 142 143 40 -43 181 -82 214 210 -78 -24 -1 -15 262 -74 -65 52
4880 52 -85 -135 -31 42 -70 -183 -40 -253 193 193 121 72 -122 -16 87 -57 -74 -236 28 195 88 18 -131
4903 -131 88 100 -35 -165 0 -22 -268 28 144 -140 11 168 79 20 -14 -181 -45 -175 -187 173 154 -137
4925 -137 -68 154 221 277 -2 -110 148 173 -99 -152 -78 322 213 110 109 -43 -123 -205 -152 -135 -166 -8 -355 6
4949 6 -73 -143 13 -248 96 -106 -144 -66 158 -12 -224 -96 -36 91 189 115 -92 -40 220 -84 162 110 -85 186
4973 186 8 107 121 25 -169 -173 -83 30 -253 -89 -26 -222 119 -98 95 7 -14 -53 147 286 -65 97 -195
4996a95L10J40l89K61k77Q7K40m06K74k57K94r0o9J71j79j34J37j82J39K75j84
5017c4O1J34j55j31O2O8pJ32j57N9j00K08k23J17j21K44o4j00L3j58O16m15m0
5040B9j41j0K35J6j5l19L61j56ok23O1K42l56K81J68k31M15m68L36m18L68j01
5062F8j39O7L5j62k1K08k84K23j1J21j77J33r8J53k45L43k94J70q3J18j79O1o7
5085f0j56M88l60k07M37j32J02k1j52l0k4J67k97K81L4k05J97L1k14P6M1j01L52
5108B47j64n2J31k05QO9L7j12k11J63K7NQ2j29J63j98l9J30o7J03m9PK12l65K73
5133F6j92K9J58j59J95n7j67J7J38j15L11q2j88J1J51l14M13l23J91K82m07P9
5155C7Q6k23K35j23j14M2k61K95l0J8P7j8j07j13J89P6k11K61j73J82k12J55m8
$$ plain form
4996 -195 115 255 -134 127 -150 -63 177 -229 45 -212 82 -8 -77 94 -85 -219 -82 -264 -125 150 -34
5017 -34 27 161 6 -125 -63 5 -2 130 -27 32 -68 140 -83 34 -87 157 93 -7 26 -132 484 69 29
5040 29 -112 -122 113 129 114 -205 156 0 -6 -229 -168 74 -282 -1 167 -64 351 -117 219 -199 169 68
5062 68 -71 -4 31 -131 -152 56 -228 -5 -16 105 -72 61 -37 116 -129 214 -80 90 7 125 -54 7 -60
5085 -60 -216 272 -88 -295 142 10 112 91 -61 -91 -115 52 -245 36 70 -135 62 93 -121 -45 -4 -105 247
5108 247 83 31 162 -43 -35 34 71 -41 -252 -89 -62 -57 25 -104 59 -139 -178 -48 -115 -12 -61 -54 158 -207 66
5133 66 -126 -97 61 -98 97 40 -127 -110 28 -87 224 142 -46 -35 116 -198 215 -108 83 365 -42 37
5155 37 123 -100 135 12 -102 -60 -321 -26 -56 -38 39 21 -86 -199 -10 66 -145 116 -57 125 -87 68 20
5178B0k04Q5J29j28K60k04K0J5K24p6k69K90q5M1m8L0k46J54j14L0M5J49j80J15
5202E3k0J3l9J97p8k37j34K21n8K51j18MJ9l10L27lj7n1j00J95m9j0J03j15j63
5227a19Q9m5M4J7m7j19O5R8K13k12Q8L9j14N8j66L01j63J75j44o8J02L6o1j01
5251c4L62n45L34j35N2p4PN5l00J06K29O1r5O1K42l01k16J38j7K37k09j14K03
5274D7om2J69j98R3j70P3j41l2J85K07j37K73j43j15q1J16l31K11j6K07j35j50
5297a16N2O5j00l7J7K12j67j8J94l5j44J42J07k8r0J11o0k45O4K28q2k87J54N9
5321dj31J98j3k07JM73l03m8J70q2n3P5p7j3j74J93N8N1Nk25R8K13l5j59p9K18
5347A50k28M6L9j55J93J1O4j77P4N1j09L0j13j59K81r6J62L13m06R9r2o9l1n2
$$ plain form
5178 20 -184 -99 30 -98 162 -42 -22 -7 217 141 -128 162 77 118 70 100 -146 8 -106 -76 -31 118 -62 53
5202 53 33 46 7 204 126 -111 -245 -24 -82 169 51 55 74 -236 91 88 71 20 -80 115 66 56 159 44 -119
5227 -119 -30 -75 -31 -14 -61 -180 -115 -17 196 -16 72 111 -3 55 -111 190 27 202 58 -10 92 128 67 -34
5251 -34 328 -217 117 -18 34 -40 -33 22 -278 -172 57 118 23 84 326 25 -191 -53 -70 167 -42 -156 47
5274 47 41 -1 168 -30 63 -107 -34 -175 -207 -22 185 48 321 178 63 -18 98 -233 -22 -38 169 34 -116
5297 -116 -64 1 -99 -136 -119 93 -74 -92 102 67 -77 65 172 144 54 165 105 -140 -76 152 70 -217 -63 -4
5321 -4 -135 63 50 -157 -156 317 14 -34 136 54 1 76 -1 -14 -188 5 63 114 119 -106 -8 205 170 11 -68 150
5347 150 -78 -32 7 -148 45 56 120 -57 17 68 -41 -11 -124 -283 -2 -98 64 377 -29 70 -22 -91 -122 -174
5371a74J66J2j35r4j4K99p3Mn7J08OJ05j15n4J14j81K12q9k2l6r6j03K22L1r0
5396e4K93m04K6J9J43j4K14k00l6J42J9o9k04J61j98J84k93K98J69k34K86k97
5418d9Q2k5R9o0p8r9J79p4o8j84L81N9j63K17K5K6r0k31Q1kP4n8j97K14J93j16
5444A36p0j53O0k80M94j22O2j46J29k9j63K6R7j79M2o2L69j29j16K1K3Mj58K46
5468A02q8M7j93r5J39K56J16k42J12j66nj51J20k37L31p2P9k24J68K14l2l4k35
5491i0M8n7J58j60k9K11j4j63l40N16j71K25j84K8K31k58m5L09l29o9P2J47J11
5514A47k66K24j31n2k2j79J15J11K11k7j74m8K19j83J34j48K96k88j65M3K15o7
5536c5qM2r7O7k8N5J82k80Q2K2j71P8J3pJ93oQ9j64Q1m3j97k5L85k08o6J70l7
$$ plain form
5371 -174 -8 4 -131 -225 -239 60 -13 -9 -66 42 48 153 38 -16 98 -83 129 40 18 -18 -114 -217 5 36 -54
5396 -54 239 -165 -139 -120 23 9 223 23 -13 129 148 79 -125 36 -162 22 -271 27 196 -38 248 -49
5418 -49 33 8 107 47 -31 -130 49 -25 -93 -277 104 163 0 217 242 268 178 -53 28 26 100 42 -155 59 252 136
5444 136 66 -87 -27 -307 187 65 127 -19 110 81 -82 -56 41 -138 -96 -158 211 82 -34 -13 10 14 -144 102
5468 102 14 61 -132 -227 -88 168 284 42 154 -12 -17 -168 -48 -285 46 -26 53 -171 -3 211 179 145 -90
5491 -90 -42 -99 59 -101 -130 81 67 -96 -436 80 -91 134 -50 -22 209 -49 -94 215 -114 -183 -111 36 147
5514 147 -119 105 -26 -78 -100 -279 -164 -53 158 131 -43 -91 128 -55 79 -69 227 -61 -226 -183 32 -35
5536 -35 -43 -1 -98 -31 -59 -4 178 -102 -20 2 -169 -91 -78 -85 108 102 191 27 108 65 -132 -157 228 20 -46 124 87
5563H7%r8N0j08L6k48K16J12l2j6J11O1l30J54l3M5P0j30j2j6J46n1M3n3J8j81
5589a59N4J84k02Q3Pj9j69r3L56J55l19mL1K33j66j6k4K67k39J28k60K22j01M5
5613fk52M15k11J06l1q1N2k5K24l15K07O1j56j46M49k91QJ99m26K52m4q0J19k31
5637b03J83P4J08k08N4K80k85j84L11j53o9J29N9k21K83J7k73L03j92Q9p3M9J59
5660B37k11j39p6M31n07M01m6j80o3P2R0K3J60k36n1L47k63J08j20J09K5m03L90
5683I8j29PO2K98l31j56K18l03mL48k58J85j56J61j53P1J67l10L51j93K07LK9
5706B12k70l01M67k03J07J34j24J7l0J03j86L13j90J8M18n58K5O5k4r6Rk87N90
5729B09j72j23J03k21L97r2k5j19r3J04J49j11O2r3L0K4j36q0K35j8QL0J62k66
$$ plain form
5563 87 87 -11 39 -69 -33 -281 -65 47 15 -1 110 171 -159 -5 -38 7 77 -53 -65 -81 65 14 57 4 22 -159
5589 -159 -105 79 -123 -40 -33 -52 -221 -314 42 197 -122 -126 -95 138 -28 -44 -68 199 -40 88 -172 50 -51 -6
5613 -6 -258 157 -54 52 21 -60 -8 -33 191 -124 83 144 -12 -158 291 0 8 207 -219 33 -11 -91 28 -203
5637 -203 -20 54 162 -46 8 288 3 -181 130 -23 -92 37 96 -125 158 175 -98 205 13 102 29 78 237
5660 237 26 -113 -189 242 -265 136 90 -90 -153 -81 9 32 192 -44 -95 252 -11 97 -23 86 111 -292 98
5683 98 -31 -24 38 336 5 -151 67 -236 -240 108 -150 35 -121 40 -113 -42 125 -185 166 -27 180 183 212
5706 212 -58 -359 108 -95 12 146 22 39 9 112 -74 239 49 67 485 -73 -48 17 -7 -103 -94 -381 209
5729 209 37 -86 17 -204 193 101 76 -43 -136 -32 117 6 68 -25 5 29 -107 -187 48 30 38 68 230 -36
5753c6j42K46m8nM56m01J9k94J35Q2r2J08l6J53l43K1M27l36jJ24j60K33k42R
5777a23K32l93M25j53J26r3M6L6p1j71P8J20j31j14L19q8j59J14l4K92j46O9j98
5800a7p6k7m9J86N2J00q3k68N30j87q5k7K3MR6l58N41j36J9p3p9j22r8J23j41
5825a52Q4K85r3j44R3k15J03J94j61o6j3J09o3L33q5k76L1K99m57r9L06j46J32
5848aJ31k96M29j57j84j05J71j44J10N1n0nN5J53j63L8J56k16j19kK37K12m17
5871a16J87p2O1K06l25M1J44l34L36j54n8K5p2R3J34j67K67o3j85K51m16J94j07
5894a30K35J3n4m0l35L77n0o1K0l8m0L06m25M66j50j24J09j43J83j3p1m2j59j
5918a67R7r8J72P8j56J18J00n45R1J93j9L03k68K03r8K67k90N0j47k6L85o1m37
$$ plain form
5753 -36 -178 68 20 15 471 70 89 -205 -70 12 -80 28 -8 145 -198 -177 250 -86 -87 37 -123 110 -132 -123
5777 -123 109 -284 141 -12 114 21 67 103 32 -139 -61 59 -72 -186 133 45 -114 0 -34 258 112 181 -17
5800 -17 -93 -120 -169 17 69 169 86 -182 348 161 76 49 72 76 172 -186 355 219 238 165 86 -36 -134 -11 -152
5825 -152 -68 217 124 -20 73 -142 -39 155 -6 -72 -85 24 -39 294 209 -67 -36 263 -194 -293 13 -133 -1
5848 -1 130 -166 263 106 -78 -183 -12 -156 -46 5 -45 -50 5 158 -5 33 189 -27 -146 -148 89 301 -116
5871 -116 71 -1 60 266 -59 -18 126 -208 128 -26 -84 -59 -131 -38 96 -71 196 133 -52 199 -217 -23 -130
5894 -130 105 118 64 24 -311 66 16 -45 -25 -63 -103 203 -222 244 94 -30 79 -64 119 106 35 -7 -166 -167
5918 -167 -70 -168 4 82 -74 44 144 -401 -310 -117 -136 167 -101 102 4 271 -19 31 -116 -142 243 182 -255
5941b55K64q7k6J53L9r0k02L04M9j77K58o66M34P3P9k2j66L8J07J5Oq4R6J41l78
5966i7K20l63K83L5r0m0O8P9q8j97L08k26L3Q0j49K47j28p5J54j26P2J86l57L2
5990a39P0l0N2k45K29J13j15J49j52j42J78L7L11m91P8J50l2j05NL00l54J16Q3
6013F6k36K43J86k17l8j48J91k57J37J21Mj42K15o4j67o7K62L0N1l13J65k55L41
6036A08mq2M1k26K96k54K90l01L04k96j40J29L83k20k05Q6n2j48L57o8j30K29
6058I7k23J56j4j33MJ11Q3N9j61m0q1j19L24n0%j1m2J53LR9m02K00J17l22P8L52
6084B38k33k64J91P2r9L39k64L52k85K01m44K25o7J07k39NK18k86R8K32j91K49
6106A55J3k09k7J67j79o4K36N4j88P5M3k99L63n5j78P4J21j39Q5o6J06k2n4J39
$$ plain form
5941 -255 9 -78 -104 49 88 -2 -204 100 149 -28 230 -436 -2 71 150 128 -38 0 107 122 128 44 140 281 -97
5966 -97 123 -240 43 78 -12 -52 16 95 7 -190 118 -108 -75 5 -144 103 -25 -100 54 -72 0 186 -171 -139
5990 -139 -69 -99 -47 -292 -63 50 -65 84 -68 -210 -32 5 316 -175 -97 53 21 -84 -79 221 -133 -17 66
6013 66 -170 73 259 42 4 -144 47 -210 -73 48 52 -90 125 61 -106 -173 89 119 170 -143 22 -233 108
6036 108 104 22 63 -163 133 -121 169 -132 172 -124 -264 -135 248 28 -177 -91 -143 -291 66 -2 -132 97
6058 97 -126 30 16 -117 -113 -2 81 140 -21 -61 -142 -261 63 13 13 2 -40 113 116 215 -187 13 130 -192 -114 238
6084 238 5 -259 -68 4 -95 244 -20 332 47 248 -196 29 -38 69 -170 -165 53 -233 -135 97 -94 155
6106 155 168 -41 -68 99 -80 -144 92 146 -42 33 76 -223 140 85 -93 -19 102 -37 48 -18 88 66 12 151
6130A51k42K33p5l78M4L16m7q6N7r4j0P2J18L11k52k58p1N1q1J9L21k47M1J40
6154C3k05NJ5K17q5p9J0J55N1l98N10l66J77J71l10K38k14J66K3j86p0L2J28J17
6178A35r8P1L8j61j09P5J07r5K49j26k20K83k29J31n2J55k33j29J98M3N2n3l0
6201BJ72o0mr9l4k3o3L1K34p6k10K68k44J19K5j4j51L22k65m7L28P0m62K61J3
6226I3k08R9P2mM1J7k59Q6J99J14l42j9J78Q4j03K01m29M3J54j01J98L2m0j40
6250c4L3K6k77J32J57l64L45Kk70K41k3Q1j21R7j91O0j8l6K91j74J90l14K91L2
6274A56j26J42k36K94L1k50qj37J4K55k6R8l65J91K4k59K59Nk61K24j57n5K70
6297H3J28j70j52K70j4k78J09N8J99q0k33l8p0J60N7K7l03K92J42k11J20M9q6
$$ plain form
6130 151 -91 142 67 -311 -267 49 2 -84 -27 -121 -131 -59 59 370 118 -140 -211 -160 -241 -222 99 -148 -107 33
6154 33 -172 -167 -152 65 -20 -99 -89 66 117 -281 229 -137 40 211 -99 139 -75 91 114 -72 -142 -110 18 135
6178 135 37 108 146 -15 -124 -49 58 -37 212 86 -134 149 -80 51 -1 154 -79 -208 -10 33 85 32 2
6201 2 174 114 110 11 -23 -46 -109 -78 156 80 -130 138 -106 13 38 24 -127 195 -70 -117 211 281 -181 80 93
6226 93 -115 -16 56 52 93 110 -149 -63 136 250 -92 -111 67 151 48 249 -180 -137 17 -84 114 146 106 -34
6250 -34 -1 25 -252 -120 37 -327 18 20 -250 -9 -32 49 -72 25 -166 -106 -124 -160 131 -43 147 -167 124 156
6274 156 30 172 -64 230 261 11 3 -134 -120 135 109 207 -158 33 57 -202 57 62 -199 25 -132 -187 83
6297 83 211 41 -111 159 145 -133 -24 34 233 153 -80 -118 -188 -28 29 56 -247 45 187 -24 96 145 59
6320E9j86K41O9n9N6j33r1J38N8j91N3j51m8J76j02K92l02J26Q6m1j10j21mL19
6344A34R5j18j28J86m6K6j46o5k0J88j1j65j18K46Jk14K90k12j1J14kJ69k55r4
6368a56J77J05N9j54n2nJ56q7O0j56J5q9N2J61k19k12L56%n6jrj4K51l44M5o7
6394a84K62J28q7j23J0m8O2J34k78K45P7k35J32K02k38R5j70N0j43J83P1j5K5
6417A55k65q3K30j3m1J52j06l0q6k2J42j6m7N2k84K12j08J24K3p1Q8N1l9M1M0
6442I9K20j07j74p1o6pk07K44k7J61mj8p6K92O8l52J37k4N2n7k57J14pK16j02
6467D7P0j50j6L0j2l8J17o6R8j87RJ99J4j62J8j13J00J59l8o9k10J82l5m7j5L5
6493h0k5K09p2J5J99q0j99O6j14J29k56J41M8j21Q8Q5J52k23qJ10M4p3j58P5O
$$ plain form
6320 59 -127 114 183 124 180 47 -44 94 152 -39 14 -137 -185 -9 -111 181 -121 5 91 50 -60 -181 -185 134
6344 134 229 111 -17 169 123 149 3 -62 -82 106 95 -70 -188 58 59 -155 135 -77 -88 26 24 193 -62 -156
6368 -156 21 126 185 31 -21 -26 130 43 103 -53 -38 -127 -75 86 -133 -345 11 11 -45 -46 -55 -69 182 -162 -117 -184
6394 -184 78 206 119 -4 6 -42 20 154 -124 121 198 -37 95 297 59 154 -16 34 -109 74 145 130 155
6417 155 -110 -193 37 24 -17 135 29 -1 -87 -109 33 17 -30 22 -262 -50 -158 -34 -11 -82 6 57 18 59 99
6442 99 319 212 38 -33 -99 -106 -313 -69 -96 65 61 43 -33 259 327 -25 112 88 140 83 -174 -60 -67 149 47
6467 47 117 -33 -49 -19 -31 -69 48 -18 80 -107 -98 101 115 -47 -29 -142 -42 117 79 10 -200 -18 -53 -100 -115 -80
6493 -80 -105 104 32 47 246 166 -33 33 -81 48 -208 -67 -19 -140 -52 33 185 -38 -46 64 108 35 -123 -48 -42
6518d2N3J08l12J96J16K1K17l22j20l3M04l79L96m42K69j71O6O2o2n0k30K88j59
6541a26K6Q8K66k88J19k7Rj39J77n5R6j31j34J48K30N5k83R0J34k09r3K07PR0
6565B57l86j32M93l29J91k01L1RL7J23j78J13Oj56J66k34Q9J63j33K1J73Pm7K6
6589A09J9k34K32j70q6K74j73N8n0M4J88k32K35j92J75j20O1L3j90J67q2Q3l52
6612b03J79j36K59r3j6j67k11L83k98M19j60J4j61K63j5q2O8O3k98K43j52J15
6634A4j65J56j34J50P1j39q1J99K0k12l6K11P5j52k63K79j33j05M07K1j05l0q0
6657c2P4O7k48L00r8J15k95j94K81r9J40J4o0R1J55j86J01j88J24j37O8q0J41
6680E4r1Q1o2J04J46r7k13J5K4J39J26k62O1l37K74K38j60j1PK7j91J57R2o2k35
$$ plain form
6518 -42 11 119 -193 3 119 140 357 35 -85 -118 286 -93 303 -139 130 -41 25 87 25 -25 -255 33 -126
6541 -126 -100 -12 254 -34 85 58 67 -72 105 50 146 15 -119 29 259 314 31 121 255 46 -47 160 167 257
6565 257 -129 -261 232 -97 94 -107 -76 -67 -30 93 -85 28 34 -122 44 -190 -101 62 -71 -50 123 130 83 109
6589 109 128 -106 126 -44 -130 144 -29 29 -21 23 211 -21 214 22 197 77 138 171 -19 148 66 149 -203
6612 -203 -24 -160 99 6 -10 -177 -388 -5 -303 116 -44 -30 -191 72 57 -25 43 106 -192 51 -101 14
6634 14 -151 5 -129 21 92 -47 -128 71 91 -121 -157 54 129 -23 -286 -7 -140 -245 162 183 78 48 -32
6657 -32 42 109 -139 161 63 178 -117 -311 -30 -129 11 25 -35 56 211 25 126 -62 62 -75 -7 -87 54
6680 54 -37 44 -18 86 232 135 -78 -63 -39 100 226 -36 25 -312 -38 200 40 29 36 63 -128 29 121 59 -176
6705a76J24L1J75r5k77K61ok8J10k20j0o4K84Lk43J47p2J30r5M0N1m00M50j03
6729A7J42p6J56k17j72J14k9K9Q7K2k36M26l10L5M8Mj53K7r3K75l14K19R0l18
6753b27K22j4L53l95L39l87J47k78N05m11J73j85O7j8K30M3k36L6k29Q8R0R6J69
6776A78j24n7P0j25R6Pj32j74K90n2q8J5L26j23j08K0m4J07k10Q2J81M3k1k3n0
6801H4N2j98J36j01Q6n9j3j8N1j12J67N2o4j09R6L7l19JJ98N3lj09j16L95j29
6826E8r5N4r3J81J7j33M6j66M17j70l13K74k55L25o7J69k04J50j33r2R8o5L9K4
6850F6j1l1k5nL2J15P4m18J10J76m06M96k74K3j44L28K8m0K8j98L04k40J6M2j4
6875C2l41N39pj11k86J14k1J41N9j4J5j2k36J93j29l4K25m3j04J11j80J99k09
$$ plain form
6705 -176 -52 -21 154 59 -218 43 37 9 119 -101 -111 -175 109 112 -131 16 -56 74 -21 19 70 -330 120 17
6729 17 159 83 239 22 -150 -36 -65 -36 51 73 -163 263 -47 -12 36 40 -113 -86 -179 96 -218 1 91 -227
6753 -227 -5 -19 334 -61 278 -109 38 -240 265 -146 27 -158 -91 -109 121 164 -72 -36 -265 -177 -87 9 178
6776 178 54 -3 67 -58 38 45 -87 -261 29 -23 -111 -96 230 107 -1 19 -25 82 -128 -46 135 178 157 134 84
6801 84 136 -62 74 -27 59 0 -13 -31 20 -92 75 127 63 -46 50 87 -232 -231 -33 20 17 -92 -208 187 58
6826 58 -37 17 -76 105 122 -11 35 -131 286 116 -197 77 -178 147 80 249 45 195 62 -30 68 3 42 66
6850 66 55 24 -1 -6 26 141 215 -203 -93 83 -323 173 -101 -78 -222 106 134 94 122 -76 228 -12 4 46 32
6875 32 -309 230 223 112 -174 -60 -81 60 119 105 120 108 -128 65 -64 -98 127 84 -20 91 -89 110 -99
6898i9j62K92j34J57j65K25r3N1j46M4k11M6K47j37J7J18K18n14K36K8j61M9R5
6921Aj25R5LL9J09k03oj00K53o1K00k27L1m7K21m34L40l9m2J8j73L82k93J50l48
6946b56K35J41k18J35k23L32l53j5K48J6o6J26k70K23j10l4J03j65J45L5M7L9
6968A15o1l9J03j60J01K5R8k69L21j69j84LJ06j4J16k09K40m2M9k37Q5J54j02
6991C0K0l8K27j74j06L2K9K4K3j1j66J14L83j33j88j09K86l24M12j95K05k96%
7014D5k45K32k07J26R2q1J33l12K36k22K67j00K34k65K66k80K26k26K0Q5j07k5
7036a08j93L35k94M87l87O1R0n5o5J51j9L7l0RK3k12J36o7K39k45J43j2j02k2
7060a00R2j49K11m4L8k05K71k25K78k59J64k89K42j19q9j84M16J12k80j0k6O7
$$ plain form
6898 -99 -261 31 -103 54 -111 114 21 72 -74 -30 -241 -195 52 -85 -68 50 268 -246 -10 18 -143 -94 1
6921 1 -124 -29 -26 13 122 -81 -87 -187 66 5 205 -22 9 -38 183 -251 89 50 8 26 -147 235 -58 92 -256
6946 -256 -21 120 -98 37 -186 146 -207 -222 26 42 -24 102 -168 55 -55 -89 14 -151 -6 29 76 115
6968 115 54 15 118 -42 59 84 182 -87 234 65 -119 -116 -10 -24 92 -117 123 81 130 -107 -22 132 30
6991 30 50 12 239 65 -41 -9 20 44 67 56 -110 4 387 254 66 -43 243 -81 331 136 341 45 45
7014 45 -200 32 -175 -49 43 -38 95 -217 19 -203 64 -36 198 -67 199 -81 145 -81 -61 24 -83 -108
7036 -108 -301 34 -260 227 -160 -99 -9 -64 -129 22 3 40 10 19 42 -170 -34 -101 138 -107 36 24 -78 -100
7060 -100 -8 -157 54 10 48 -157 114 -111 167 -92 72 -217 25 -94 -183 -367 49 161 -119 -129 -155 -88
7082h8n1J15L1J13k51J03J94l40K2J57k56K19J30R3j41j50j79K52K34j72j84J63
7104A4J95l44J24j02JK46m6k41J73j34K36l89J87J33j40M8J73j68j20J17J18l28
7126b47J53L20j87J0j71R5j40K42k54J65q1o0L65k23j56K9J07J9J42j47l8K82
7148B25j50j17N5q6L4J8R0j64l6J3n0J10K6J55j46K77k00J13k52R0J9J57k1o9
7172I1j43l7J06Pl5J28Pn3j85rJ67k4o2k1M1K84l44o6J83P8lk8l68K21J07j26
7198h4K24j60J73k17K39k78qk71K49K56j66j15J10o1J39m8P9J20Q0m58K38p4L07
7221B74l37k7J11jn4k12K89Q0k06k9J28k18n2K10K10j27j25j27k5L59k20J98q8
7244A1j82J12J30j79Q6Km1l8N2N9J9P5k07Q9oJ94j28n0j0j06K7K50k97M3J2j02
$$ plain form
7082 -88 -139 -24 7 120 -131 -28 166 -174 -152 5 -251 -32 98 191 50 -100 -279 -27 207 35 -149 14
7104 14 209 -135 -11 -113 -112 134 88 -153 20 -114 122 -267 -80 53 -87 -39 134 -34 -154 -37 81 -247
7126 -247 -94 226 39 49 -122 -27 -167 75 -179 -14 -95 -155 210 -13 -169 -140 -33 -14 128 -19 -57 225
7148 225 75 -42 13 -73 -39 -21 69 -95 -131 -118 -168 -58 -32 123 -23 254 54 167 -85 5 24 181 160 91
7172 91 -52 -89 17 24 -11 117 124 71 -114 -123 44 20 -42 -63 -22 262 -82 -148 35 113 110 82 -286 -65 42 -84
7198 -84 140 -20 153 -64 175 -103 -111 -382 -133 123 -43 -158 -48 -109 30 -18 61 181 261 -197 41 -33 274
7221 274 -63 -90 21 20 -34 -246 43 123 -83 -112 16 -202 -254 -44 166 39 -86 -213 -238 121 -99 99 11
7244 11 -171 -59 71 -108 -22 -20 -61 -99 -47 12 31 106 -101 -12 -18 176 48 -2 -12 -118 -91 159 -138 -95 -83 -185
7270a85M6j8K92n6k15L68m04J13J15K03m09Q3J58r2M5r0J42k12L56m25K16k24
7292a93K6J64j7N0p7j27K47Q1p7p8J44m55K87R9k74L74j07j31J95j40O5j40K74
7315A90j52j46M56l25R3%j39N2qq9P0L08k96J6O2k31J02q5J15J35k50Q0K57k74
7339e9N6M7K1qj71J54k37K66J39k48M4k36M27m7k19K63j84k1j36N6q6J24J21l15
7363b49K78k89K08J28JJ53j14j78P6j1q0k44K38L1L8J4q3O8J73k69J67k09K93
7386A40j97J0K3n3j01O4J25o6J26j25j00L41k15L5k68J34N0J71j5p4p1J59l6o2
7410ej15K7J04k21J07J05k0k0o2J10J23k61J87o6L7p5l0M8r7J06J0K5k87K77j36
7435a29L7J92j68K65l35L28j9j70q1K2j20N4J65k7L4J0M5J6m00L72j82J81n4M9
$$ plain form
7270 -185 -139 -157 135 79 -136 232 -172 -59 56 259 -150 -67 91 -1 44 -46 96 -116 240 -185 31 -193
7292 -193 -167 -3 -20 30 -47 -174 73 154 77 -1 143 -312 -25 74 -200 174 67 -64 131 -9 56 -84 190
7315 190 38 -108 348 23 116 116 -23 29 21 -68 2 310 14 30 92 -139 -37 -122 -7 128 -122 -42 215 -59
7339 -59 -3 44 65 57 -114 40 -197 69 208 -40 4 -232 195 148 -71 192 8 -13 -149 -93 -179 -55 66 -249
7363 -249 29 -260 -52 76 77 230 116 -62 14 3 -77 -321 -83 -52 -14 0 -83 -15 158 -111 56 -153 140
7386 140 -57 -47 -24 -77 -178 -114 11 -55 71 -54 -154 187 -28 7 -261 -127 -77 94 79 5 -66 93 57 -5
7410 -5 -120 -93 11 -210 -103 2 -18 -38 -100 10 133 -128 59 -7 30 -45 -75 -27 -124 -18 -8 17 -270 7 -129
7435 -129 -92 100 -68 197 -138 190 171 1 -80 -58 -178 -124 41 14 48 58 103 119 -281 91 -91 90 36 85
7459H5K0r8N1q4J03k68J89j15JL8J1K05j50J78j92L8q1j6J50j83J88l14M21j81
7483dq6J19j87K23m1j70J10j81K71k5m7J17l7L31k19o6m8kj85N5J74r9l0J70k12
7508f9J55j13p4K81r9k67L94k61o5R8R2q6m6R8k08K27p2J21J15j91j43pJ4J86
7532H0k49K42j36K2J48k47j6Q7O2J62L1r3j00N1L7k1J9j02R0k36K7NJ16q7J45
7557C7O3J83r4j43k8j46J58k37L04J25k12J10m9j30J92j32RO1j45K08k28n8J84
7580C2j15M9K80k70K37k89K7Jp8jr0K44j95K42p3Q7k06L10j84r2P4M2K4j2m8L62
7606C58l65J76k45J64k26j14L36k30J99K0o4R9j24k7K21j59J74k61Qk54L39r3
7628f8K11j94Q7J41j07J04j28J1j77K78O5l34p8J82J36k42K9J25M4O2j27K23j58
$$ plain form
7459 85 105 7 58 -26 77 -191 -2 -117 -116 -78 -67 138 -12 166 -26 12 -69 -85 65 -118 70 -244 177 -4
7483 -4 -90 29 -158 65 24 -146 -36 -217 54 29 -18 99 62 393 174 108 60 58 -127 -72 102 3 -27 143 -69
7508 -69 86 -27 -101 180 81 -186 208 -53 -118 -20 72 -14 -60 38 -170 57 -15 106 221 30 -113 -120 -106 80
7532 80 -169 73 -63 -41 107 -140 -156 -69 -7 155 186 93 -7 44 81 60 79 -23 67 -169 -142 -137 -21 -108 37
7557 37 100 283 189 46 18 -128 30 -207 97 222 10 120 71 -59 133 1 10 71 -74 134 -94 -152 32
7580 32 -83 -34 246 -24 213 -76 -49 -48 -126 -127 -217 27 -168 74 1 88 -118 192 8 -84 -10 32 56 44 -4 358
7606 358 -7 169 -76 88 -138 -252 84 -146 53 73 9 108 -16 -43 178 19 193 -68 -60 -314 25 -68
7628 -68 143 -51 36 177 70 174 46 57 -120 158 223 -111 -189 -7 129 -113 -84 41 85 147 20 243 85
7651H5j24km5K52l62K98j05n1K16pj25l9PR7j8q2J21O0k30M4J46l4l9mj06P9N5
7678H7j65M40n25O2qJ06J10Jk48QN6p3J79po5Kq7K56k39P5K27k29m8LK27j60j34
7705a49R5K9R3J72l13q5R0N00n73J00J28j92K48p8l7J68j30j98J01j3M2j3L5L
7729B3k01K77k71Q6j8L0r6L15m5m42N93l58J46n5M8J4r0r1K70l16J01kK16k6j57
7754d9Kj13M55l50L7m5R1l56N44mj86j32o0J19J18j92J70rM0j53m7j55K96Rj22
7779i2J52j72j32K56J11J67l83o7M3o7L25j59L33j79k63J07j05%J61J6k07J47
7801hQ0j68j12K7L41k67J52m0j58K20P5k5j31j31K1o5K43r0K02m42J39K99K1j76
7825Gj15J94j25j84R7j3Q8J28j76o2O1L44m88K79k73m3L12o1O3O8J1J6N1k43Q4
$$ plain form
7651 85 -39 -41 -86 166 -196 102 -3 -54 162 155 30 -9 -2 95 77 -5 116 176 -54 -10 136 102 63 59 -47 32 87
7678 87 -78 362 -163 -101 -109 -3 107 108 -140 -132 -76 -149 30 23 -42 -40 -127 129 -110 -35 192 -37 -85 -82 145 -15 -149
7705 -149 -54 -25 68 240 -73 -158 -68 432 -141 -41 87 -105 143 65 28 196 66 -132 -31 -44 -2 -15 20 23
7729 23 -178 99 -172 -86 -104 -74 -170 145 100 -342 251 -107 39 -16 32 46 -44 -135 135 -181 -80 -82 134 108 -49
7754 -49 -47 -160 295 -55 -18 -63 28 -328 216 212 26 -106 -166 -47 71 -121 49 40 80 -73 -120 -275 21 30 -92
7779 -92 60 -112 -244 12 123 290 -93 -160 -117 -184 141 -18 315 136 -127 -20 -125 -125 36 52 -155 -8
7801 -8 72 -96 -208 -181 160 -107 45 5 -153 67 142 117 -14 -145 -124 -189 54 -36 166 -276 -137 162 183 7
7825 7 -108 86 -39 -223 -126 -139 -51 77 -99 -161 -100 244 -244 35 -238 -281 31 -30 33 101 112 128 179 -64 20
7850B0J01m1k12J62J5j29Q7m9j86J18O3j73M72n05L20j46L8J20m2M1k1k75K44
7873B2K8Q0l39M4L37j37K6m4J13m0Q4QOk54M6J24k07q7N9J06k3KK8j35L25j53
7899A9m8j84J45P1O4j66O9j2K8j11K84j44l0J72j33J35j99j45j2J72Pk04M76j38
7923A16r6j07K25m7m66M68O5k52L64l55M52m31J90J1k96Q8J8j78K54J98l03k1
7945a03O9OJ9KJ13k68Q9J13n3J75k04K43k26Jk58K21l9K16k39J79j65J84j33K00
7969A42M3q1L8j44p8J62j13R8L6k82J99j46j7J99k17M4K09k57J74K71k06j38j52
7992b16K64o4j9J76Q0l92L47q2j21k0j11M5P9J8K49l76P6J07j26J38j30k8k1K99
8016A72l00J42q8K54L6k10L7L1K6k64J09J34k36J92J77l58N0L6J61R1j3l55L71
$$ plain form
7850 20 121 80 -132 30 45 -84 3 -46 -232 -114 -51 -224 248 -257 63 -83 -45 75 33 74 53 -222 22
7873 22 50 130 -209 -165 172 35 61 17 130 90 174 182 188 -66 -20 104 -103 -190 -131 -25 -48 -46 -18 -153 172 19
7899 19 -29 -213 -68 3 67 -99 -30 -42 -14 -125 159 15 -15 157 24 159 -40 -185 -197 -25 -18 -222 254 116
7923 116 20 -87 138 91 -375 93 158 -94 270 -85 367 -64 126 137 -159 -71 -53 -231 23 221 -82 -103
7945 -103 -34 -28 -9 -7 106 -162 -73 40 -13 162 -42 201 -25 -24 -282 -61 -100 116 -123 56 -109 75 -58 142
7969 142 185 104 142 -2 -80 82 -31 67 103 -179 20 -126 -143 56 -161 -117 92 -165 9 280 74 -64 -216
7992 -216 48 -16 -35 141 221 -171 176 94 -27 -47 -158 -113 -34 -16 233 -143 -67 40 -86 52 -78 -106 -127 172
8016 172 -128 14 -74 180 216 6 43 74 100 -164 -55 79 -157 35 212 -146 -96 -60 101 192 179 -176 195
8039A95k62q3J11P9N5k92j23K98p8j42K90j83Q2J42k02J67j44O9k2j28o4J53m5
8062a27K89j34J40N6l53K77j73j32K59o4q8K10l04rK25n9j82K91j45j08J93k19
8084a57Q0J48Q3k42K2j00p4L46j85Q0j39K02l69K83k5k8L9J21M3j01nq7J94J68
8108B97l90Q7Q4p5j79K46q9j35N7P3J47nok50o4O1l5J75j63j61N23N6l43L07k72
8133e4K04j35j75M81n22J13o7J37l1j57K74lq6p3K67m53J11M50l86Q5J12r0k80
8156b78M90k30kj13L9k10O1K96n2L2k89K37M0J38r9j30K04k07J19j6m12K03J70
8179ij21j19M27l69M37k34J9j05p9P2J88o7
$$ plain form
8039 195 -67 -150 -39 40 95 -197 -320 -22 -100 -242 48 -135 -53 89 -113 54 -90 -21 -43 -171 -235 -82 -127
8062 -127 162 28 168 224 -129 148 -25 -157 102 38 -50 160 -144 -153 72 13 -169 122 -23 -131 62 -157
8084 -157 -77 71 154 -88 -66 -166 -240 106 -79 1 -138 64 -305 -22 -47 -75 -36 85 128 27 22 -65 129 297
8108 297 -93 -6 78 3 -176 70 -19 -154 -97 -24 123 118 112 -138 -202 -141 -176 -1 -164 -325 198 254 -89 218 -54
8133 -54 150 15 -160 321 -201 -88 -155 -18 -49 -206 68 65 -21 -94 173 -280 -169 281 -105 -20 92 2 -278
8156 -278 212 -18 -20 -133 -94 -304 -243 53 1 33 -256 -19 21 159 60 -70 134 -73 46 30 -382 -179 -9
8179 -9 -130 -249 178 -191 246 12 31 -74 -153 -81 107 40
8191D0
$$ Imaginary data points
##PAGE= N=2
##DATA TABLE= (X++(I..I)), XYDATA
0@%%%%%%Qq%%Qj6J6j7K5l2M0n6O4p2Q8j06J29j51J72k00K35k72L10l54M05m61
32b45N22n86O57p44Q36r33J039j155J285j429J582j746J929k130K350k587K847
49A492l135L453l805M197m635N127n687O330p072P941q978J0236j1806J3822j6496
64i016K0228k5794L4903n2148R5002l72381m58200J344616k95610q87137Q78409
75B72872J41170j051654O13905P08382r87331j44656R31776l84157n02074O46116
85B44349j5187o64833L99342M76354n27970k04198M64442j00333k97661L45558
95A19863Q7916n01977J53079N13215l67128l51088M73613K0116l90568L63646
105A20687J32170n95666K21156N22651n11123j60157N89839k92897l76183N94337
$$ plain form
0 0 0 0 0 0 0 0 8 0 0 0 8 -8 8 -9 16 -16 24 -32 32 -40 48 -58 71 -80 92 -108 127 -145 165 -189 216 -245
32 -245 277 -309 348 -396 440 -493 546 -609 676 -753 829 -917 1012 -1118 1232 -1355 1492
49 1492 -1643 1810 -1995 2202 -2433 2694 -2993 3337 -3735 4206 -4772 5464 -6342 7480 -9016
64 -9016 11212 -14582 20321 -31827 63175 -309206 -767406 577210 281600 -605537 272872
75 272872 414042 -637612 -23707 684675 -302656 -447312 484464 100307 -401767 244349
85 244349 229162 -435671 -36329 440025 -87945 -292143 172299 71966 -225695 119863
95 119863 207779 -294198 -141119 372096 4968 -346120 127493 147609 -242959 120687
105 120687 252857 -342809 -121653 400998 -110125 -270282 319557 26660 -349523 244814
115B44814m0136n93628M35751K97961n92276J36660M40371m93100r7374N94998
125C34041k48616m25151M40842J12455m29525J67357K57985l16874l1280L42818
135B04052j50556k89174K52872J87148k97616m2482L09784j27156k60910K86735
145G2697J07137l80677J36425L47112l72092j52208M69515j54576l66187M32250
155A39396R4597n25415K24871L71449m40744m9662M43651k74105k31082M53033
165B05989p7707m20621L18933K17398l83518M6686K76779k45327p9928L03536
175A62220j08634k36692K23964J05391k46220K9923J88745j45828r1203K24341
185A06007j7670k39474J19684J66861k00708j4413K25605j64718j53895K96473
$$ plain form
115 244814 204678 -388950 46801 344762 -247514 -110854 329517 -163583 -260957 334041
125 334041 85425 -339726 101116 213571 -215954 -48597 209388 -107486 -138766 204052
135 204052 53496 -235678 17194 204342 -93274 -135756 174028 46872 -214038 72697
145 72697 179834 -200843 -64418 282694 -89398 -241606 227909 73333 -292854 139396
155 139396 233993 -291422 -66551 304898 -135846 -185508 258143 -15962 -247044 205989
165 205989 128282 -292339 26594 243992 -139526 -92840 183939 -61388 -141316 162220
175 162220 53586 -183106 40858 146249 -99971 -70048 118697 -27131 -118334 106007
185 106007 88337 -151137 -31453 135408 -65300 -79713 145892 -18826 -172721 123752
195A23752n184l13053J86997J92536k91979K9631K61247k48539j03437L50910
205A82881j06191k82493K68894Q3108l08144J36965K04294k76396j9333K80577
215A64162j52881j67199K32007k589k05973J49569J10365k16146J550J95311r1783
226A6393j14574J43391J7545j46156P3744J08461j43269l7666J74849m7349j49159
237a03790J28362O4540j75183N2043J54737j55684o3585J98276o7847j57439J73098
248D7528M2173k03264R6174J42112j91546k0657J96819j04530j13010J78886j1459
259E9226j69977J20257Q9443j67954K0499J48133j07346p4359J42174j7819j22500
270h0223R1494O5240j25929P862J14678p6102p0769J17308M775j19170O2751P9903
$$ plain form
195 123752 118568 -194485 -7488 185048 -106931 -77300 183947 -64592 -168029 182881
205 182881 76690 -205803 63091 146199 -161945 -24980 179314 -97082 -116415 164162
215 164162 11281 -155918 76089 73500 -132473 17096 127461 -88685 -87135 108176 16393
226 16393 -98181 45210 62755 -83401 -9657 98804 -44465 -82131 92718 45369 -103790
237 -103790 24572 89112 -86071 -34028 120709 -34975 -98560 99716 31869 -125570 47528
248 47528 89701 -113563 -17389 124723 -66823 -87480 109339 4809 -108201 70685 59226
259 59226 -110751 9506 98949 -69005 -48506 99627 -7719 -82078 60096 42277 -80223
270 -80223 11271 76511 -49418 -41556 73122 -2980 -73749 43559 48334 -70836 -8085 71818
282G1818j14403j0763J25485o6076q6442J23320J0365j32849P4283Q6709j29343
293d7896M00J32430q8312p7588J37907j1133j26208R4033O1447j34522K6889J13784
305H1231j00333m7664J26286l3098r9599R3116L3366j12215L8797Q6601q8885
316b2397l0905J01159l0265p5808P5380K7953r0327K8507P4649p2078l3555R0609
328D2922j8512p6260O5206L4984q9450K0077P9003o9971l7466R3225k1765q0340
340e8347P2770L2225r5510K9110P8565p9224k7395R4084l4224o8442P9491J5461
352C8564q8173M3155N9563p9149p403Q0706m1419m9789O9577L145o7646L8907
364C8M0389o2233k590O0997l2822m0934N3786P698n6642K5673M0642n0823j2290
$$ plain form
282 71818 -42585 -53348 72137 6061 -80381 42939 53304 -79545 -5262 81447 -47896
293 -47896 -47496 84934 -3378 -80966 56941 45808 -80400 13633 75080 -59442 -32553 81231
305 81231 -19102 -66766 59520 26422 -73177 19939 53305 -58910 -20113 66488 -22397
316 -22397 -53302 47857 17592 -58216 17164 45117 -45210 -16703 57946 -14132 -47687 42922
328 42922 24410 -51850 13356 48340 -41110 -21033 57970 -12001 -49467 43758 21993 -58347
340 -58347 14423 46648 -48862 -19752 58813 -20411 -47806 46278 12054 -56388 23103 38564
352 38564 -49609 -6454 53109 -26040 -33443 47263 5844 -43945 25632 28777 -38869 38
364 38 40427 -21806 -24396 36601 3779 -37155 16631 24329 -32313 -6640 34002 -16821 -29111
377b9111N9286k1767m6423M9652J5577n9401K5071M6243n7238j2404O8794k7222
389A1057n0494N6303J1133o0559L3234L7768o2068L62O2742l7385l8088N5382
401A9387n74n0442L3854K6858n2227K662M9108k6900k9336L8932J752l8745K7273
414A602K8251m7319q619N4574j5110m1740L6999J2130m6523K6711L7124n9438
426b1358p500O8701l1062m7616N8098K269o0576M5870L2484p3874J1161O4930
438D1527m9598k3962O3716k8937m7590O6890J2595p1533K4189M4893m3858j799
450a3467M2112l6757k1364N6654m228n3433K4283L3742l3908n923L0755k1022
462b556k0176L9405K290m5046J7472L2076l4611m201M0536k9387k9795N2815M492
$$ plain form
377 -29111 30175 8408 -38015 11637 27214 -32187 -7116 39127 -18111 -30515 38279 11057
389 11057 -39437 16866 27999 -32560 674 38442 -23626 -23264 39478 2093 -35995 19387
401 19387 18813 -31629 2225 29083 -23144 -20482 28626 1726 -27610 11322 13074 -25671 1602
414 1602 29853 -17466 -26085 28489 13379 -28361 8638 20768 -25755 956 38080 -21358
426 -21358 -28858 39843 8781 -38835 19263 21532 -39044 6826 39310 -34564 -23403 41527
438 41527 -8071 -32033 31683 2746 -44844 22046 34641 -36892 -12703 32190 -11668 -13467
450 -13467 28645 -8112 -29476 27178 22950 -30483 -6200 27542 -6366 -12289 18466 -2556
462 -2556 -22732 16673 18963 -26083 -8611 23465 -11146 -15347 25189 -4198 -33993 18822 23314
475B3314n1473K4748K3880m0109J9089L3183n4291n695O4499k4833m2661M0022
487I673J994k9788L4296P13m8306K7416L5720l9013r095K6942j6121l023K6120
500A7528j5014k1548J5508Q385r63K093j2078o487J3203P740J324j1338j9003
513b0650K1106K7969k8880k0045K4036P67k497J7853k6352k4514M4581J4795m1181
526a3012L347J6235j9656J3805K3877l2666j6488K8004N204o841N196j5297j1542
539a9834K4159J7490j7496k1649N003K4607L989j9452n361L551M589J9950q067
552A1479l7427J5733L4242k3098q624K0872k7242o251M7719j6891l7981L3791
564F322J314l2290M1203R074o3539K2956N2281m1575j2133L4841l1883n026N4890
$$ plain form
475 23314 -28159 -3411 20469 -19640 -551 32632 -21659 -27354 37145 12312 -30349 9673
487 9673 11667 -18121 16175 16888 -31418 -4002 31718 -7295 -16390 10552 -5569 -8592 17528
500 17528 2514 -19034 -3526 4859 3896 5989 -6089 -12576 627 8367 9691 -1647 -20650
513 -20650 456 28425 -455 -20500 3536 4303 1806 19659 -6693 -31207 13374 28169 -13012
526 -13012 -9665 6570 -13086 719 24596 -8070 -24558 3446 8650 1809 7005 -8292 -19834
539 -19834 4325 21815 4319 -17330 -12327 12280 16269 -3183 -8544 -4993 -404 19546 11479
552 11479 -25948 -10215 24027 929 -7695 13177 -14065 -20316 27403 10512 -27469 6322
564 6322 7636 -24654 16549 25623 -37916 -14960 37321 -4254 -16387 18454 -13429 -18455 36435
577C6435k8808m4078M8102J1472m2792K0239J6696l2325J2274K2701k8456l603
589a2143K4348j2863r104J7544l154j4349L747Q596K817o129o683O953K338m755
603b837P528l194j1449J5703M486k2920J1633J9465k4497n971K3023r265n202
616c497J6189j8806j0847L1751l755k6522J5717O103j5957J3006K538j9019J3441
629C42R824j8061O522Q255j7540Q384J4896j4952j09O444j5194J3844J8235k8618
643g728o829K6639r814o043J6713k1827q696L8126r694l2037K4677M881k5178
656a6810K2685J0164l4876J2134K3545k6294J304K4410k3301q300L2124r502k2708
669a5425J7338L546j1089J3620m11j9732Q771J5718j0098p470N105J940j477K40
$$ plain form
577 36435 7627 -36451 11651 23123 -19669 570 17266 -15059 -2785 19916 -8540 -12143
589 -12143 12205 -658 -9762 7782 4628 -9721 -5974 2622 5439 -690 -7373 -420 1918 -2837
603 -2837 4691 1497 -9952 5751 10237 -12683 -1050 18415 -6082 -12053 10970 1705 -3497
616 -3497 12692 -6114 -16961 14790 11035 -15487 230 6333 -9624 3382 5920 -13099 342
629 342 10166 -7895 -1373 6882 -10658 -2274 12622 -2330 -2439 4005 -11189 2655 20890 -7728
643 -7728 -14557 12082 2268 -3775 12938 -8889 -17585 20541 10847 -21190 3487 8368 -16810
656 -16810 5875 16039 -18837 -6703 16842 -9452 -8148 16262 -7039 -15339 16785 7283 -15425
669 -15425 1913 5459 -5630 7990 7579 -12153 -3382 12336 2238 -5232 -127 1813 336 576
683E76P76k848m498P055N323j1155R81J0114j3003k040K1766j0458j7766K1211
697F034K001k1079J7371P452k5839J3689J9580k9463n99K8054j8754j0638K7280
710A5089j2200j9356K4229J19k1546J8154O015k4752J0993J5700j8981k45J3812
723G031j0775j14J2030j0672o057J2334k45n228M059l202j980O354k049k038K931
738B379m131J487O299p516k969P915m170j752R167q797q047J4633K26j2004Q343
753A063J743j1068J0426N409j5685L547J2798r256j458Q107r305j565J3234m425
767C565q602O817j43l423N909k951n649N616J867l606Q78k896j031P527j983n963
783d068M203j097l009Q279k085r915Q227N107r389L614M704j0541N181J1200j2070
$$ plain form
683 576 1352 -1496 -5994 1061 6384 -4771 -3790 6324 -6679 -8719 13047 2589 -15177 6034
697 6034 8035 -13044 4327 11779 -14060 -371 19209 -10254 -10853 17201 -1553 -12191 15089
710 15089 2889 -16467 7762 7881 -13665 4489 10504 -14248 -3255 12445 -6536 -6781 7031
723 7031 -3744 -3858 8172 -2500 -8557 3777 3532 -1696 2363 -839 -2819 3535 1486 -552 2379
738 2379 -1752 -265 6034 -1482 -4451 3464 -706 -2458 6709 -2088 -10135 4498 4724 -7280 1063
753 1063 2806 -8262 2164 7573 -8112 -4565 8233 -1023 -2481 5626 -3679 -5244 7990 3565
767 3565 -5037 1780 1637 -1786 4123 1172 -4477 1139 3006 -600 278 -2618 -3649 3878 1895 -4068
783 -4068 135 -962 -3971 4308 2223 -7692 535 5642 -3747 -133 4571 -5970 -789 10411 -1659
798a659m903J1619l946m342R383n698q055J2237J185j1855M670M218o127L900
812F27L461q811O00P383l525j232K616l251K99M607k245j933J153l10K839J272
828C550n860L21N119k382L55J704o160J337Q028o101m879P831k314m497O912k008
844I56p772Q032L111q760L662M301q207K756P686p590k317Q002l479k806O096
859C671l536l806P518j45o276K834J415k532K308r4l861K793J481l312R13Q92
875B63k039K191M24l532K405J030l644K919K101m572J821L339l902M98M043m302
891i57J92M743m392j986N679k051l554M015n35l246L867r92m563M544J430m622
907b428J659R08k832L239J384m931K078K763l386J949J868n513K234N273m712
$$ plain form
798 -1659 -6562 5057 1111 -3231 6152 454 -7601 4636 5821 -6034 -1364 2854 -3273 627
812 627 4088 -4723 -4123 3260 -265 -1497 1119 -2132 -1833 2774 529 -1404 -251 -561 2278 3550
828 3550 -2310 -1989 3130 748 1103 2807 -3353 -2016 6012 -89 -4968 2863 549 -3948 2964 956
844 956 -6816 1216 4327 -4433 -771 3530 -4677 -1921 5765 -1825 -4142 3860 381 -2425 3671
859 3671 135 -3671 3847 3702 -2574 260 1675 -857 1451 1357 -2504 289 1770 -1542 -629 263
875 263 -1776 415 839 -2693 -288 742 -2902 17 2118 -2454 -633 2706 -1196 -698 3345 -957
891 -957 -765 3978 -414 -2400 3279 1228 -2326 1689 1154 -2092 1775 783 -3780 764 2194 -2428
907 -2428 -769 139 -2693 546 1930 -3001 -923 1840 -1546 403 2271 -3242 -1008 4265 -447
922d47n80L696m916J445P041o295n016Q007p09m410N250l489n519Q975J754r861
938e074L312M043o223M095M480q960k86Q679m216k212N692m900k762R311j491
953C488p528L605K711k540L064j242n801L572N438l933k852R33N56J109Q57k304
969h67j138O74J022J402j576j068J468r39q7L843k860l430N628J136o018L645
985H35J498n001N181K224r792K880R765q407l264Q503n797l010J0209o081p428
1000g685J2154o33j1914Q638M613j1107N384O825j1937K712J0246r614k122J1184
1014F744p716n734J3001j794j0403O872J831o243P195J235j2202M780R201o358
1028D09m183M644j862q20N398l829m490M685K876m091o46K897j390j618L794J257
$$ plain form
922 -447 -1027 2669 -2247 -802 6239 -56 -5072 2935 2226 -2184 3066 -423 -5942 3033 4787 -5074
938 -5074 -1762 2281 -3942 153 4633 -4327 -4613 4066 -150 -2362 3330 -1570 -4332 4979 3488
953 3488 -4040 -435 2276 -264 2800 1558 -4243 -671 4767 834 -2018 -1085 -529 580 1437 -867
969 -867 -2005 -1331 -309 1093 -483 -1551 -83 -1022 -1109 2734 -126 -3556 2072 3208 -2810 835
985 835 2333 -2668 2513 4737 -5055 -2175 7590 -817 -4081 4422 -1375 -4385 5824 -257 -7685
1000 -7685 4469 3836 -8078 560 5173 -5934 -550 6275 -5662 -2950 7296 -2318 -4440 6744
1014 6744 -972 -6706 6295 4501 -5902 970 2801 -3442 3753 4988 -7214 -2434 6767 409
1028 409 -3774 870 -992 -1812 3586 -243 -4733 -48 2828 -1263 -1909 988 -402 -2020 1774 3031
1044C031n580n0N787j590k007K905m143l151J1127j14j2885L912Q143p814K224
1059b05N735j1291Q62J3687r679p495J4375l805j0826J2248R37j3468J0202O133
1073G410j4495N710R687j4437J969J5188j1709p837J4204l191p574J1231l689
1086B467j1581J1944M477j3591L643Q530q178o21O670n996j502Q009l940n541
1100e210O437J363n193J896L137k814j570K841Q60j956K14J231k227P64M712m860
1116c75m495P776J258p814L100L556o716L345N363r645P66J0552p945n276J1013
1131D463l561p296J0360q59j0049Q944L064j1285P027O822j2918J589J1352q325
1145f72k741Q872o979l568J1458m366q890R870L62q919O020L368q441M054M192
$$ plain form
1044 3031 -2549 -2599 3188 1598 -409 2496 -1647 -4798 6329 6215 -6670 -2758 5385 -2429 -205
1059 -205 5530 -5761 -4899 8788 -891 -8386 5989 2184 -8642 3606 4543 -8925 1277 7410
1073 7410 -7085 -1375 8312 -6125 -4156 11032 -677 -8514 5690 2499 -5075 6156 2467
1086 2467 -9114 2830 7307 -6284 -2641 5889 -2289 -2910 3760 -2236 -3738 4271 331 -5210
1100 -5210 1227 2590 -2603 -707 2430 -384 -1954 887 1747 -209 5 1236 -991 -227 4485 -375
1116 -375 -4870 2906 4164 -3650 -550 3006 -3710 -365 4998 -4647 -3881 6671 -1274 -6550 4463
1131 4463 902 -6394 3966 3107 -6942 2002 5066 -6219 808 7630 -5288 -3699 7653 -672
1145 -672 -3413 5459 -1520 -5088 6370 2004 -6886 2984 3346 -5573 447 3815 -4626 -572 3620
1160C620p350J751N755n727j279N992k617k389L138l95r58K125j454j958K208
1175D62J499r57j134r80J772P43j751P07N43k863J527K476l688N97K718m112M71
1192a970N725m630l516O745j307m117N340j623n090O887J981q473L715M282o242
1207b293K019M815p367K63P829n326l191O380l647l339P640k174o413N121J306
1222A623m561M297L83n760L572L874m970J55K883k747J219L019m216m09L771j526
1238F07o20J525k338k90L448j734j738J583j106J55K441k482j803K729j48j314
1254a085K088j858j670M095k60l590K495P98k330K883K24m463K316K987l616J096
1270A10J828l623J135L806l937j334L517j620q99K793k732j830M544p11l605K774
$$ plain form
1160 3620 -3730 -1979 3776 -1951 -3230 2762 145 -2244 894 499 -459 1666 212 -1746 462
1175 462 1961 1004 -130 -1110 662 1405 -346 361 904 -1959 -432 2044 -1644 -1047 1671 -2441 -1970
1192 -1970 3755 -875 -4391 2354 1047 -3070 2270 647 -4443 2444 4425 -4048 -333 3949 -2293
1207 -2293 -274 4541 -2826 -2563 5266 -60 -3251 3129 -518 -3857 3783 1609 -4804 317 1623
1222 1623 -2938 1359 1742 -4018 -446 3428 -1542 -1387 1496 -1251 -32 2987 -1229 -1638 2133 607
1238 607 -13 1512 -826 -1116 2332 598 -1140 443 -663 -508 1933 -549 -2352 377 229 -1085
1254 -1085 1003 -855 -2525 1570 1310 -2280 215 1013 -1317 1566 1790 -2673 -357 2630 -986 110
1270 110 1938 -1685 -550 3256 -681 -2015 1502 -118 -1017 1776 -956 -2786 1758 1047 -2558 216
1286B16K06k614L230M4l559K427J623k897J523J164l167J679K751k769m57J912
1302A312k216P68K810l375r51L554j437j563K156j945q62L386j222k878K621J33
1318B91j880K074k96k028K094P64k397J425J529k815J418J949k774J00J861j823
1334e08O49J821l157J87K729j689j273K162j360m54K004j477j597K326O3k055
1350a629J843P3j806J928K57k455K312R05k722J726J228k480Q04J775k386N37
1366i0K059k487n80L033k097j540L197j045k068K438p31j821K555%l003J888J705
1383A413k636N12J380j489O00J645j887m82K014n51n69O31o09k45R04j6n10J42
1401B47o67M81R19j211l07L73q26J211P75k704Q7L108j596q91J973j662j110L731
$$ plain form
1286 216 422 -2192 1038 1082 -2477 -50 1573 -1324 199 1363 -1804 -125 2626 -143 -600 1312
1302 1312 -904 -136 2674 -701 -1652 1902 465 -1098 1058 -887 -1749 1637 415 -2463 158 291
1318 291 -1589 485 189 -1839 255 1019 -1378 47 1576 -1239 179 2128 -646 -546 1315 -508
1334 -508 141 1962 -1195 -1008 1721 32 -1241 921 -439 -893 1111 -366 -1963 363 426 -1629
1350 -1629 214 287 -1519 409 666 -1789 523 1428 -1294 432 1660 -820 -16 1759 -627 -90
1366 -90 1969 -518 -1098 1935 -162 -1702 1495 450 -1618 820 89 -1732 823 823 -2180 -292 1413
1383 1413 -1223 -711 669 -820 -220 1425 -462 -944 1070 519 -50 581 -28 -273 631 615 105 247
1401 247 -420 61 980 -231 -538 -165 -991 220 995 -1709 -1622 1486 -110 -1001 972 -690 -1800 1931
1419A931r73l498L374P58l487K780J684m906J560L908l781m21L396l298j191N279
1435C115k686l568M058K78l282K623Q16m042K345K678l758J82L451l009p29L596
1451B068j787j761K491j96j607J655L76k284Q31J609j206m20O20k86p14P55Q16
1468I60j535m37R93o7m92J281p57k183J975K092k256r21K103j559K94L176l024
1485c57k812M881J6l297K891J63m609L429L397n493L18L539l668Q65M722n426
1501a441l236P061m4m671L274j409l413O182J836p543R15M982l398Q83L424n062
1517a660j510O159p88l774K360m98k585M130J513n597k22M052n89j296P32j990
1533a563m02L952J85m106n25L025K20q82R69j539j679L204J820l705n1K191k547
$$ plain form
1419 1931 958 -2540 834 1592 -1895 885 2569 -2337 -777 3131 -650 -1071 2325 -973 -2164 3115
1435 3115 429 -3139 919 1197 -2085 538 1354 -2688 -343 2335 -1423 -1241 2210 -799 -1528 2068
1451 2068 281 -1480 1011 815 -792 863 1239 -1045 -214 1395 189 -231 389 103 -611 144 960
1468 960 -575 -1012 -19 -86 -578 703 -54 -2237 -262 1830 -426 -1347 756 -803 -509 2667 -357
1485 -357 -3169 1712 1728 -1569 1322 1485 -3124 305 3702 -1791 -1473 2066 -1602 -737 3985 -1441
1501 -1441 -4677 2384 2340 -2331 943 -466 -3879 2303 4139 -3404 -2489 2493 -905 -22 3402 -1660
1517 -1660 -3170 2989 2201 -1573 787 289 -2296 1834 3347 -2250 -2472 1580 991 -305 427 -1563
1533 -1563 -1965 1987 2172 -1934 -2459 566 786 -96 873 -666 -2345 859 2679 -1026 -1077 1114 -1433
1550a433J200M004l833l478N161Q66m111K273M47m255L732L523o706N1N229l513
1566h43j516N260l428l497O354n41n208M360Q91n188L622L788n983J9M635l233
1582e08j01L527l671k029N230n05l711J994O31k218J619J154k531L92J319j311
1598g19M0J731r14j429R75N90l10l88M9M11M75l9l11j143R77J731j395j381J647
1617E97k97r64J929l33k192J427N44k081J854Q04l307Q86K827k434m71K406k172
1634i77m34L460k138k419M027l58l200K560P47k832K314J300l925J730K682l899
1650a362L44L462k917r27L180j685j804L172j343k145L070j02l020J764J322k264
1666a255R12J369j945N71J583j955j53K077n08j093N45O2J82J35l50j70J98o3
$$ plain form
1550 -1433 -233 3771 -62 -3540 1621 2487 -1624 649 1096 -3159 573 4096 -2610 -2559 2670 -843
1566 -843 -2359 2901 -527 -4024 2330 1789 -3419 941 1832 -3356 266 4054 -1929 -1910 2725 -508
1582 -508 -609 2918 -753 -2782 2448 1943 -1768 226 857 -1361 258 1412 -1119 -727 592 -719
1598 -719 -679 1052 138 -1291 -316 274 -36 -424 -375 36 511 472 161 -982 -5 1726 331 -1050 597
1617 597 300 -664 1265 932 -1260 167 711 -1370 484 1288 -2019 -1133 1694 -740 -1211 1195 -977
1634 -977 -1411 2049 -89 -2508 1519 1161 -2039 521 1268 -1564 750 2050 -1875 -145 2537 -1362
1650 -1362 -1018 2444 -473 -1400 1780 95 -1709 1463 120 -2025 1045 943 -2077 -313 1009 -1255
1666 -1255 -343 1026 -919 -348 1235 -720 -873 1204 696 -397 148 210 392 527 177 7 205 142
1684A42qk67k31L96J76p25L97P73j436K19J259j694L22J307j442O1K241j678j144
1703a332K664n39j891J768j82j756K389M53k778J314J406k351Q31J570k735K76
1719h93K529k195n05K011j290j323K629r91j704K287N9j923J829K77j921J413
1735B89J022k144N21J506j674L45J429j411k00J569j109p36J265o93n89J268n26
1752A32j005R95m88j83Q48n41n74J070k94n04Q84k92n04J397n51r87J193l05j119
1771h28J332J79j755J329Q63j731P48R36j993P59J383j894n57K107j107q16J555
1788E10j183n91K364o95j670J749j43j271J285M23j439R09M82j343O26J084j465
1805c68L58P06r25JQ16o59j57Q19r38k64J122o52n01R93o43l11J182p95o53J184
$$ plain form
1684 142 134 -133 -364 32 208 -517 -120 653 -783 -564 695 -999 -677 630 -812 -751 1490 -188 -1332
1703 -1332 1332 793 -1098 670 488 -1268 1121 1574 -1204 110 1516 -835 -4 1566 -1169 -893
1719 -893 1636 -559 -1064 947 -343 -1666 963 -28 -1732 555 614 -1309 520 797 -1124 289
1735 289 1311 -833 -312 1194 -480 -135 1294 -117 -317 1252 143 -593 672 -21 -610 658 132
1752 132 -873 122 -366 -549 299 -242 -816 254 -40 -544 340 48 -456 941 390 -597 596 291 -828
1771 -828 504 683 -1072 257 1120 -611 137 1073 -920 -161 1222 -672 -1229 878 -229 -1045 510
1788 510 -673 -1264 1100 405 -1265 484 341 -930 355 778 -661 248 730 -613 13 1097 -368
1805 -368 -10 696 -229 -228 588 -71 -228 591 -347 -611 511 -141 -642 351 -292 -603 579 -216 -869 315
1825C15p8r37J187j57q10J033r6q83R02M47j441M92R03j250J41R55j115K6J087
1844G21j291j43J508j281k36J252n54l40P05n32n14J159j14j212J311N18j338
1861c81P39N2r30R59L23j386N98J101j373q8J054r82k21J115p91m64J017o60m43
1880g61J315l36q39M30J55l74M97J2q84P76O46p54K31M8k45M68j3p29P65J00p65
1901b57M78J28o99L98K21n90M34K44j003K63J029j322J07J216j063o1R51p93m49
1920g68J760r72r42J550K7j329R81N01j347Q43J052k125N29J406j404k4J060j258
1938d60l92J939j013r89J112k78r60J252P8j637J248O44o62J45R0p23O99R59j298
1957b46l31J025L3o4k51j14k41L73L28k85p39K57K39K65Rk46p05j79J151J03q62
$$ plain form
1825 315 237 -700 487 330 -480 553 457 -426 476 923 -518 -26 877 -373 -232 723 -392 -366 721
1844 721 -570 -713 795 -486 -722 530 -24 -364 341 -191 -705 454 340 -872 439 957 -381
1861 -381 358 410 -520 439 762 -624 -26 1075 -298 -386 668 -314 -535 580 -211 -675 342 -318 -761
1880 -761 554 218 -621 -191 -36 -410 87 99 -785 -9 637 -117 114 162 -83 385 372 -357 408 508 -257
1901 -257 221 349 -350 48 269 -321 113 357 -646 -383 646 -676 -569 647 -416 -477 474 -319 -768
1920 -768 992 20 -922 628 655 -674 307 808 -539 304 1356 -769 -240 1166 -238 -262 798 -460
1938 -460 -852 1087 74 -915 197 -81 -1041 211 289 -1348 -100 544 -118 27 117 -606 93 1052 -246
1957 -246 -577 448 481 417 166 52 -189 184 512 227 -512 -255 -16 249 258 12 -693 -872 279 382 -480
1978d80j32L44R1R90j46j619L89J665p80o25N72m26m10K029p34j897J137Q81j377
1997e28J269J14k379Q33K173j472p54J266j431J78K307j535j917K170K73j158
2013e91J216n13j633J542J633k161N8J131j224M25J483j280j294J768r5m30N59
2030E94o50j055J214Q34j345l24P89k18L11J3n08n06P15O34l93j24l0m13L98R71
2050I07l40j270M27P21l10L94j50r99k4J784p34j191J184l31r00J647j20j916
2068a221J044J177j823L11J406k150J34K712j516j254J869o65j079K763p80k915
2084a987J877J943k206M49J009k011L08K342j896j071J866j64j907K111J20k355
2100a572J171J413j428o6J127j567J27J673p75j362J355P51o49m19P95j071L8
$$ plain form
1978 -480 -612 -268 -177 813 667 -952 -563 1102 322 -303 269 -157 -567 1462 728 -1169 -32 849 -528
1997 -528 741 855 -1524 -691 1482 10 -744 522 -909 -731 1576 41 -1876 294 567 -591
2013 -591 625 112 -1521 21 1654 -507 -449 682 -542 -117 1366 86 -1208 560 465 35 594
2030 594 -56 -1111 103 937 -408 -732 57 -161 150 163 -345 -851 -136 498 105 -19 -49 -462 -64 907
2050 907 567 -703 -276 445 135 529 379 -620 -644 1140 406 -785 399 68 -832 815 695 -1221
2068 -1221 -177 1000 -823 -512 894 -1256 -1122 1590 74 -1180 689 24 -1055 1708 928 -1987
2084 -1987 -110 1833 -373 76 1085 -926 -618 1724 -172 -1243 623 459 -1448 663 783 -1572
2100 -1572 -401 1012 -416 -482 645 -922 -795 878 103 -1259 96 847 198 -221 574 -497 -459
2117d59J700r14j352J328M63j244N26J058j812j05J698r43q86J662q78j048J831
2134F25M39k506Q35J858j939J38J692j348o89K486j233j642K114K13k483J900
2150D60J033k593Q26J757k050o2J943j889p87K192n43j605J372M51j459Q48Q65
2167G59j759M37J426j357q2J382m78n97P88j0r97M83K63l61J49K70k37l42L68
2186A05M14r23o0O24m01j36R04m16r42R47L98j368Q16M82j092O94O93j149M3J196
2206H29o52n50J062m90j068J714k67j310O95N59j095M21P22j032J59R73r07m20
2224f57J073p68j52R49n22p24Q44J65p81J050l24o78P55K05m27Q8J42l72J04N06
2244D76n68J99K20m32K12K2k42j04N77k62l09M83m00k1J51k32j81O24n44K75N81
$$ plain form
2117 -459 1241 327 -1025 303 766 -478 48 1106 -706 -811 887 -56 -942 720 -158 -1206 625
2134 625 1064 -1442 -607 1251 -688 -550 1142 -206 -895 1591 358 -1284 830 1043 -1440 460
2150 460 1493 -1100 -274 1483 -567 -629 1314 -575 -1362 830 287 -1318 54 505 -954 -106 759
2167 759 -1000 -563 863 -494 -576 806 328 -269 519 509 -488 -5 258 -103 46 316 79 -263 105
2186 105 519 -404 -464 160 -241 -377 527 111 -831 116 514 -854 -38 444 -648 46 739 -410 -367 829
2206 829 177 -373 689 199 -869 845 578 -732 -37 522 -573 -152 570 -462 -303 670 -237 -657
2224 -657 416 -352 -504 445 -77 -801 43 208 -573 477 153 -525 230 435 8 96 238 -134 -30 476
2244 476 -92 107 327 -105 107 129 -113 -217 360 98 -211 272 -128 -149 2 -230 -411 213 -331 -56 525
2265E25q27J48N76m37k93P93m62p9O00l69k66M65n1m67K46J75o73N27Q4l99q7
2286b71L03l67j5P51o98j08O82k60k56M81k99k96O49M4l78N31j20n56M80J18m67
2307e2L18j5l85J18L68m81Q6K18k59pN0m20J28O46l11o82Q30n42J15O04l74L9
2329hK48k7l35P71l83n49N59k95k49K38L38l74L19J26q39L04K73k57O4P8l40K41
2351i7K44n49L62L32o05J06N64o11j60R75n64j29M74k39n75R37p4o56L04L06n08
2372a63J82J16n11L25L35l26k09N25m31lK10l20L8L88p4n38N59Rk83K47K6k04
2394a02M27k55j74K05K26l60q2K45q0J59k95J81J31O1k87Q8J1k46J04K25o26M04
2416d0L3m02K11M80p31J89O13l15j89N09l48j21N23m14k62P05k97n53M85O0n78
$$ plain form
2265 525 -302 -154 422 -15 -308 485 23 -56 544 175 -91 374 323 -144 102 277 -396 131 215 -184 -271
2286 -271 32 -335 -350 401 -297 -405 277 17 -239 242 -57 -353 296 340 -38 493 373 -183 297 415 -52
2307 -52 266 251 -134 -16 352 -129 -43 175 -84 -91 -41 -461 -333 313 2 -680 150 -392 -277 327 -47 -8
2329 -8 240 213 -122 649 266 -283 276 -19 -268 -30 308 -66 253 379 -460 -156 117 -140 -76 2 -338 -97
2351 -97 147 -402 -40 292 -313 -207 357 -254 -414 561 -3 -132 342 103 -472 465 391 -265 39 345 -163
2372 -163 19 135 -376 -51 284 -42 -251 274 -157 -160 50 -270 -232 156 82 -456 103 112 -171 76 102 -102
2394 -102 325 70 -104 101 327 -33 -115 130 50 209 -86 95 226 287 0 88 99 -147 -43 182 -444 -40
2416 -40 -7 -409 -198 282 -449 -260 353 38 -151 358 10 -111 412 -2 -264 441 144 -409 76 136 -442
2437d42O12J73r49L67N31o33K68L53n62j09N54k33m44O13j0p55Q41J81o02N3N60
2458C67m45j35P50n98q2O36m78m77O79K6m97K5L04l62p8N11J10l83J94J13o85
2479e05K80R05j029M1M51j79o14J002j68q32J011K75j215M93P36o10n09J082p28
2498a13p49J488j40j208Q52M10j267N21Q24j320J86J108p78m65J113o75p35J459
2516E11j0j131R38J27j085P77P68j474L21J077o75o02P68j07q29Q51K58j126L93
2535b50P71r51L67L00m74j31P79k46o51L94L55n92L53O18o01o05Q12J27o13P07
2555D69J71j182O18O04r76l34J256o43n29J112m44q14Q80M32j363P74N83j290
2573f76N54R48j213j52R16k40n32J063n70j094J242L44j017O27J35n99J56O99
$$ plain form
2437 -442 170 343 -606 -239 292 -341 -73 280 -282 -391 163 -70 -514 99 89 -666 175 356 -246 -193 367
2458 367 -78 -213 537 -61 -143 493 15 -462 217 243 -254 -229 75 -287 -365 146 256 -127 67 180 -505
2479 -505 -225 680 -349 -308 143 -36 -650 352 184 -648 363 638 -577 -84 652 42 -467 615 -113
2498 -113 -862 626 486 -722 130 540 -727 -206 618 -702 -516 592 -186 -651 462 -213 -948 511
2516 511 501 -630 308 435 -650 127 895 -579 -258 819 144 -458 310 203 -626 225 483 -643 -250
2535 -250 521 -430 -63 237 -237 -368 411 165 -486 -92 263 -329 24 642 41 -564 248 375 -238 469
2555 469 640 -542 76 680 -296 -630 626 -17 -546 566 122 -692 188 620 -743 31 614 -676
2573 -676 -122 826 -387 -539 377 137 -395 668 98 -996 246 590 -427 200 335 -264 -108 591
2591E91o23k99Q49m09m60M82M4o81L92K67m12J72L85l86o5L26j80l81O90k01k97
2612a96K54J99k72j01N75l06n56M15M89q08M97J05n74K17L41l47k05M60l20l39
2632d72P42J13p26J94K67l19M7J32m33L18M57n10j29R23k71n39M59j16m43L51
$$ plain form
2591 591 -32 -331 518 109 -351 131 175 -506 -114 153 -259 -87 298 -88 -153 173 -7 -388 302 101 -196
2612 -196 58 257 -15 -116 459 153 -403 12 501 -307 190 295 -279 -62 279 -68 -273 187 -133 -472
2632 -472 270 383 -343 -149 118 -201 -154 -22 -455 -137 320 -190 -319 604 333 -206 253 137 -306 45
$$ [...]
8191f8
##END NTUPLES=NMR FID
##END=
