##TITLE=1H_Pr TUr-2
 200.13MHz, CDCl3,
 8 sc
 
 29.8.2025
##JCAMPDX= 6.0         $$ Bruker NMR JCAMP-DX V2.0
##DATA TYPE= NMR FID
##DATA CLASS= NTUPLES
##ORIGIN= UXNMR, Bruker Analytische Messtechnik GmbH
##OWNER= pz
$$ XWIN-NMR		Version 3.5
$$ Fri Aug 29 13:55:24 2025 Russian Standard Time (UT+4h)  she@DPX200
##.OBSERVE FREQUENCY= 200.1313
##.OBSERVE NUCLEUS= ^1H
##.DELAY= (6, 6)
##.ACQUISITION MODE= SIMULTANEOUS
##.ACQUISITION SCHEME= undefined
##.AVERAGES= 8
##.DIGITISER RES= 18
##SPECTROMETER/DATA SYSTEM= spect
##.PULSE SEQUENCE= zg30
##.SOLVENT NAME= CDCl3
##.SHIFT REFERENCE= (INTERNAL, CDCl3, 0, 14.3821)
##AUDIT TRAIL= $$ (NUMBER, WHEN, WHO, WHERE, WHAT)
$$ ##TITLE= Audit trail, XWIN-NMR		Version 3.5
$$ ##JCAMPDX= 5.01
$$ ##ORIGIN= Bruker BioSpin GmbH
$$ ##OWNER= she
$$ F:/spectra/data/she/nmr/H-C/1/audita.txt
$$ ##AUDIT TRAIL=  $$ (NUMBER, WHEN, WHO, WHERE, WHAT)
(   1,<2025-08-29 13:54:21.93 +0400>,<she>,<DPX200>,
      <created by zg, POWCHK disabled, PULCHK disabled
       configuration hash MD5:
       00 E9 B6 7A A2 85 ED C7 34 08 36 98 17 FE 4E 26
       data hash MD5: 16K
       7A 90 D8 4B 10 DD 67 F7 72 4C 2E 8D 8E 44 CA 5D>)
$$ ##END=
$$ 
$$ hash MD5
$$ D4 31 7D 65 D8 A7 45 5F A1 00 F5 8F 50 89 FB DD
##$RELAX= 
##$RELAX= 
##$RELAX= 
##$RELAX= 
##$RELAX= 
##$RELAX= 
$$ Bruker specific parameters
$$ --------------------------
##$DU= <F:/spectra>
##$EXPNO= 1
##$NAME= <H-C>
##$PROCNO= 1
##$TYPE= <nmr>
##$USER= <she>
##$AMP= (0..31)
100 100 100 100 100 100 100 100 100 100 100 100 100 100 100 100 100 100 
100 100 100 100 100 100 100 100 100 100 100 100 100 100 
##$AQSEQ= 0
##$AQ_mod= 1
##$AUNM= <au_zg>
##$AUTOPOS= <>
##$BF1= 200.13
##$BF2= 200.13
##$BF3= 200.13
##$BF4= 200.13
##$BF5= 200.13
##$BF6= 200.13
##$BF7= 200.13
##$BF8= 200.13
##$BYTORDA= 1
##$CFDGTYP= 0
##$CFRGTYP= 5
##$CHEMSTR= <none>
##$CNST= (0..31)
1 1 145 1 1 1 1 1 1 1 1 1 1 1 1 1 1 1 1 1 1 1 1 1 1 1 1 1 1 1 1 1 
##$CPDPRG= <>
##$CPDPRG1= <>
##$CPDPRG2= <>
##$CPDPRG3= <>
##$CPDPRG4= <mlev>
##$CPDPRG5= <mlev>
##$CPDPRG6= <mlev>
##$CPDPRG7= <mlev>
##$CPDPRG8= <mlev>
##$CPDPRGB= <>
##$CPDPRGT= <>
##$D= (0..31)
0 0.7 0 0 0 0 0 0 0 0 0 0.03 0 0 0 0 0 0 0 0 0 0 0 0 0 0 0 0 0 0 0 0 
##$DATE= 1756461261
##$DBL= (0..7)
120 120 120 120 120 120 120 120 
##$DBP= (0..7)
150 150 150 150 150 150 150 150 
##$DBP07= 0
##$DBPNAM0= <>
##$DBPNAM1= <>
##$DBPNAM2= <>
##$DBPNAM3= <>
##$DBPNAM4= <>
##$DBPNAM5= <>
##$DBPNAM6= <>
##$DBPNAM7= <>
##$DBPOAL= (0..7)
0.5 0.5 0.5 0.5 0.5 0.5 0.5 0.5 
##$DBPOFFS= (0..7)
0 0 0 0 0 0 0 0 
##$DE= 6
##$DECBNUC= <off>
##$DECIM= 32
##$DECNUC= <off>
##$DECSTAT= 4
##$DIGMOD= 1
##$DIGTYP= 9
##$DL= (0..7)
0 120 120 120 120 120 120 120 
##$DP= (0..7)
150 150 150 150 150 150 150 150 
##$DP07= 0
##$DPNAME0= <>
##$DPNAME1= <>
##$DPNAME2= <>
##$DPNAME3= <>
##$DPNAME4= <>
##$DPNAME5= <>
##$DPNAME6= <>
##$DPNAME7= <>
##$DPOAL= (0..7)
0.5 0.5 0.5 0.5 0.5 0.5 0.5 0.5 
##$DPOFFS= (0..7)
0 0 0 0 0 0 0 0 
##$DQDMODE= 0
##$DR= 18
##$DS= 0
##$DSLIST= <SSSSSSSSSSSSSSS>
$$ [...]
##$SUBNAM0= <"">
##$SUBNAM1= <"">
##$SUBNAM2= <"">
##$SUBNAM3= <"">
##$SUBNAM4= <"">
##$SUBNAM5= <"">
##$SUBNAM6= <"">
##$SUBNAM7= <"">
##$SUBNAM8= <"">
##$SUBNAM9= <"">
##$SW= 18.0517328524113
##$SWIBOX= (0..15)
0 0 2 0 0 0 0 0 0 0 0 0 0 0 0 0 
##$SW_h= 3612.71676300578
##$TD= 16384
##$TD0= 1
##$TE= 0
##$TE2= 300
##$TE3= 300
##$TEG= 300
##$TL= (0..7)
0 120 120 120 120 120 120 120 
##$TP= (0..7)
150 150 150 150 150 150 150 150 
##$TP07= 0
##$TPNAME0= <>
##$TPNAME1= <>
##$TPNAME2= <>
##$TPNAME3= <>
##$TPNAME4= <>
##$TPNAME5= <>
##$TPNAME6= <>
##$TPNAME7= <>
##$TPOAL= (0..7)
0.5 0.5 0.5 0.5 0.5 0.5 0.5 0.5 
##$TPOFFS= (0..7)
0 0 0 0 0 0 0 0 
##$TUNHIN= 0
##$TUNHOUT= 0
##$TUNXOUT= 0
##$USERA1= <user>
##$USERA2= <user>
##$USERA3= <user>
##$USERA4= <user>
##$USERA5= <user>
##$V9= 5
##$VALIST= <valist>
##$VCLIST= <CCCCCCCCCCCCCCC>
##$VD= 0
##$VDLIST= <DDDDDDDDDDDDDDD>
##$VPLIST= <PPPPPPPPPPPPPPP>
##$VTLIST= <TTTTTTTTTTTTTTT>
##$WBST= 1024
##$WBSW= 4
##$XGAIN= (0..3)
0 0 0 0 
##$XL= 0
##$YL= 0
##$YMAX_a= 463032
##$YMIN_a= -423191
##$ZGOPTNS= <>
##$ZL1= 120
##$ZL2= 120
##$ZL3= 120
##$ZL4= 120
##$ABSF1= 10
##$ABSF2= 0
##$ABSG= 5
##$ABSL= 3
##$ALPHA= 0
##$AQORDER= 0
##$ASSFAC= 0
##$ASSFACI= 0
##$ASSFACX= 0
##$ASSWID= 0
##$AUNMP= <proc_1d>
##$AZFE= 0.1
##$AZFW= 0.1
##$BCFW= 1
##$BC_mod= 2
##$BYTORDP= 1
##$COROFFS= 0
##$CY= -3
##$DATMOD= 1
##$DC= 2
##$DFILT= <>
##$DTYPP= 0
##$F1P= 0
##$F2P= 0
##$FCOR= 0.5
##$FTSIZE= 0
##$FT_mod= 4
##$GAMMA= 1
##$GB= 0.15
##$INTBC= 1
##$INTSCL= 1
##$ISEN= 128
##$LB= 0.25
##$LEV0= 0
##$LPBIN= 0
##$MAXI= 10000
##$MC2= 0
##$MEAN= 0
##$ME_mod= 0
##$MI= 1.114404
##$NCOEF= 0
##$NC_proc= 0
##$NLEV= 6
##$NOISF1= 3.799351
##$NOISF2= 2.8
##$NSP= 1
##$NTH_PI= 0
##$NZP= 0
##$OFFSET= 14.38212
##$PC= 1
##$PHC0= -1725.673
##$PHC1= 20.39228
##$PH_mod= 1
##$PKNL= yes
##$PPARMOD= 0
##$PSCAL= 0
##$PSIGN= 0
##$REVERSE= no
##$SF= 200.129724274929
##$SI= 16384
##$SIGF1= 3
##$SIGF2= 2
##$SINO= 400
##$SIOLD= 16384
##$SREGLST= <1H.CDCl3>
##$SSB= 0
##$STSI= 0
##$STSR= 0
##$SW_p= 3205.1282051282
##$SYMM= 0
##$S_DEV= 0
##$TDeff= 0
##$TDoff= 0
##$TI= <>
##$TILT= no
##$TM1= 0
##$TM2= 0
##$TOPLEV= 0
##$USERP1= <user>
##$USERP2= <user>
##$USERP3= <user>
##$USERP4= <user>
##$USERP5= <user>
##$WDW= 1
##$XDIM= 8192
##$YMAX_p= 0
##$YMIN_p= 0
$$ End of Bruker specific parameters
$$ ---------------------------------
##NTUPLES= NMR FID
##VAR_NAME=  TIME,          FID/REAL,        FID/IMAG
##SYMBOL=    X,             R,               I
##VAR_TYPE=  INDEPENDENT,   DEPENDENT,       DEPENDENT
##VAR_FORM=  AFFN,          ASDF,            ASDF
##VAR_DIM=   8192,          8192,            8192
##UNITS=     SECONDS,       ARBITRARY UNITS, ARBITRARY UNITS
##FACTOR=    0.0002768,     1,               1
##FIRST=     0,             0,               0
##LAST=      2.2672688,     0,               0
##MIN=       0,             -423191,         0
##MAX=       2.2672688,     463032,          0
$$ Real data points
##PAGE= N=1
##DATA TABLE= (X++(R..R)), XYDATA
0 0 0 0 0 0 0 0 0 0 0 0 0 0 0 0 0 0 0 0 0 0 0 0 0 0 0 0 0 0 0 0 2 -4 4 -4 4 -4 7 -8 9 -12 13 -15 18 -19 24 -26 29 -33 37 -40
50 -40 44 -48 55 -57 61 -65 67 -65 64 -58 42 -16 -32 118 -277 586 -1261 2991 -9104 68665
70 68665 463032 105544 -348410 -70596 195462 -165 -85407 76259 16534 -121421 -6028
81 -6028 94873 -21096 -49950 59253 36787 -76310 -62259 22005 64623 58231 -36148 -145940
93 -145940 -52014 154219 120207 -113611 -156308 23243 102869 8008 -51385 -12122 5025
104 5025 -32154 -29327 34909 52453 -26623 -77733 -11789 49885 3036 -36070 18255 30961
116 30961 -63358 -82931 52599 119568 -21121 -144813 -44974 100998 58029 -57397 -42722
127 -42722 13149 -21043 -29633 51608 48873 -66471 -75786 37452 52077 -34345 -32935 30330
139 30330 5975 -53068 -27675 33004 40185 -1565 -55641 -62010 22274 88609 9149 -95790
151 -95790 -42229 63971 30664 -49198 -11787 41246 -17150 -61404 12091 60128 -7901 -52166
163 -52166 -3835 16326 -19584 -5216 38939 3723 -60208 -33003 41844 46170 -14884 -51151
175 -51151 -20065 32932 28426 -26194 -28858 27287 20975 -46637 -31108 52982 41275 -49150 -52011
188 -52011 24792 39866 -8865 -22671 1491 4253 -12474 -6816 20763 20904 -23008 -41132 12188
201 12188 47308 -6800 -46744 7109 39229 -20673 -42820 27299 46539 -28353 -52445 15008
213 15008 44841 -4364 -32395 368 21404 -5280 -21160 11430 32224 -9113 -43435 491
225 491 48389 10954 -42518 -15933 32643 14213 -26202 -12304 23477 13834 -23207 -21579 18625
238 18625 28029 -11932 -28992 7223 23447 -9511 -17040 17768 15074 -26626 -19206 29805 25657
251 25657 -26161 -30751 18406 32138 -11843 -32333 9097 35403 -6425 -38234 5257 42808
263 42808 438 -39781 -2117 35517 3964 -26668 162 22904 -2153 -21585 1957 23202
275 23202 2140 -24782 -8391 24289 12262 -24179 -13728 24743 13345 -26388 -12713 28234
287 28234 14357 -26455 -15341 23402 17255 -17973 -17119 14908 18491 -13232 -20609 13427 24587
300 24587 -13120 -28013 12477 30155 -10419 -28740 9574 27098 -7514 -23972 6455 23223
312 23223 -3266 -22481 -274 22535 3605 -22840 -5852 22979 5467 -24800 -4969 26084
324 26084 3898 -27283 -4003 27535 5779 -25352 -6995 23873 10213 -21081 -12222 20831
336 20831 16052 -19940 -18482 20197 20562 -20143 -21247 19283 19868 -19043 -18589 17598 16880 -16040
350 -16040 -16519 13417 16924 -10443 -17985 7858 19404 -6153 -20689 5733 21957 -6007 -22990
363 -22990 5955 22835 -5859 -22320 4497 20995 -2391 -19335 154 19036 3225 -18660
375 -18660 -5692 20041 9003 -20385 -10567 21184 11698 -20934 -11596 19816 10418 -19184 -10643
388 -10643 17019 10433 -15789 -12268 13481 13902 -12121 -15825 11407 17541 -11273 -18229 12431
401 12431 19324 -12591 -18918 12774 18582 -11592 -17481 9864 16457 -8159 -16370 6040 17131
414 17131 -4212 -19154 2186 21277 -151 -22218 -1283 22002 2156 -20507 -2199 18545
426 18545 2127 -16867 -3152 14544 4154 -13445 -6400 11972 7468 -12369 -8473 13406 9066
439 9066 -15248 -9391 17517 11076 -17327 -11800 16269 13293 -12717 -13166 9720 13385 -7265 -14071
453 -14071 5755 15269 -5232 -17469 4222 18018 -4383 -18114 5073 17274 -6446 -16783
465 -16783 7250 17141 -6318 -17647 3964 17889 -474 -17210 -2588 15761 3679 -15129
477 -15129 -3541 15051 2481 -16064 -2279 16524 3092 -15369 -3539 13671 4106 -11778
489 -11778 -4207 11813 6043 -12115 -9105 12152 12530 -11360 -15186 9148 14864 -8262 -13550 7455
503 7455 11053 -8127 -9875 8133 9865 -6862 -10257 4980 10935 -2482 -10591 2096 11401 -2648
517 -2648 -13282 3182 15967 -2270 -17983 -386 17142 2443 -14838 -3512 12312 3130
529 3130 -11497 -2884 12326 3801 -13273 -5430 13622 7148 -12360 -7544 10474 6268 -9643
542 -9643 -5331 9317 5253 -9779 -7630 8633 10325 -6476 -11990 4510 12008 -4080 -11032 6273
556 6273 11699 -8007 -12744 8685 13929 -7111 -13359 4602 11084 -3046 -9233 2025 8223 -1781
570 -1781 -9636 269 11554 2129 -12905 -4722 12668 6184 -11001 -5169 10298 3465 -10779 -2864
584 -2864 11881 4439 -11926 -7322 9928 8814 -7885 -8914 6944 7999 -8118 -7678 10023 8889
598 8889 -10633 -10259 9861 11262 -7425 -10586 5362 9475 -4504 -9302 4461 10519 -4509 -13271
612 -13271 2857 14622 -936 -14132 -77 12006 -818 -9979 2763 9901 -3291 -10371 2177
625 2177 11060 880 -10109 -3317 8789 4408 -8410 -4593 9190 4370 -11093 -5468 12125
638 12125 7041 -11587 -8280 9371 8197 -7011 -6801 6373 6168 -6784 -6970 7486 9234 -6948
652 -6948 -11421 5166 11633 -3979 -10779 3685 9550 -4589 -9502 4816 10418 -3596 -11032 1624
666 1624 11147 535 -10065 -1093 9641 603 -10100 287 11467 -388 -13007 -1045 12694
679 12694 2346 -11264 -3318 9156 3121 -8221 -3102 8548 4385 -8892 -6251 8864 8201
692 8201 -7727 -8561 6763 7681 -6524 -6565 6930 5969 -7402 -6817 6607 7769 -4986 -8577 3109
707 3109 8692 -1849 -8548 2059 9280 -2502 -10256 2605 11385 -1754 -11471 335 10278 355
721 355 -9072 -785 8189 809 -8763 -1723 9509 3182 -9934 -4597 9808 5502 -9033 -5013
735 -5013 8779 4389 -8678 -3909 8848 4491 -8415 -5617 7118 6304 -5906 -6920 4969 6973
749 6973 -5210 -7390 5836 8339 -6008 -9043 5720 9496 -4583 -8786 3587 8028 -2840
762 -2840 -7672 2101 7868 -1299 -8816 -59 9276 1111 -9570 -1827 9249 1784 -8844 -1257
776 -1257 8849 1176 -8633 -1348 8557 2437 -7691 -3466 6879 4295 -6594 -5011 6616 5382
790 5382 -7374 -6221 7648 6753 -7682 -7107 6986 7050 -6097 -6570 5483 6597 -4750 -6832 4180
805 4180 7614 -3291 -8361 2540 8706 -2221 -8757 2040 8483 -2302 -8306 2265 8105 -1731
819 -1731 -7802 992 7649 224 -7156 -985 7138 1722 -7329 -2139 7735 2467 -8178 -3024 8005
834 8005 3161 -7695 -3438 6826 3476 -6201 -3826 5609 4476 -4939 -5197 4606 6217 -4176 -6708
849 -6708 4104 6961 -3977 -6910 3982 6680 -4027 -6623 3446 6447 -2831 -6509 1905 6553
863 6553 -1099 -6837 602 7393 -154 -7856 58 8338 213 -8313 -455 8004 686 -7480 -1130
878 -1130 6759 1483 -6298 -2325 5814 3050 -5685 -3847 5602 4384 -5495 -4485 5649 4660 -5511
893 -5511 -4413 5273 4389 -4869 -4518 4059 4635 -3447 -5151 2680 5533 -2263 -6225 2069 6756 -1885
909 -1885 -7126 1875 7302 -1583 -7052 1462 6766 -892 -6394 176 6179 565 -6214 -1425 6177
924 6177 1956 -6456 -2560 6489 2643 -6582 -2593 6562 2606 -6234 -2460 5964 2823 -5280 -3111
939 -3111 4705 3622 -4320 -4169 4105 4716 -4105 -5338 3993 5547 -4015 -5645 3799 5549 -3439 -5233
955 -5233 2977 5166 -2219 -5021 1560 5275 -847 -5619 173 5903 81 -6185 -263 6168 44
970 44 -6276 -160 5985 261 -5643 -572 5168 1236 -4870 -1732 4772 2553 -4793 -3034 4937 3522
986 3522 -5197 -3750 5216 3844 -5170 -3913 4711 3746 -4132 -3726 3557 3947 -2961 -4275 2445 4855
1002 4855 -1985 -5148 1819 5419 -1839 -5529 1929 5468 -1861 -5359 1616 5051 -1296 -4875 656
1017 656 4708 -151 -4653 -508 4921 1005 -5099 -1133 5497 1564 -5557 -1659 5434 1802 -5081
1032 -5081 -1785 4512 1929 -4292 -2362 3780 2904 -3435 -3505 3226 3972 -3113 -4173 3254 4311 -3255
1048 -3255 -4193 3304 4122 -3069 -4058 2612 4013 -2125 -4199 1387 4230 -1015 -4600 719 4960 -601
1064 -601 -5335 444 5656 -170 -5324 174 5068 20 -4708 -120 4478 594 -4295 -1182 4082
1079 4082 1665 -4269 -2164 4170 2343 -4295 -2371 4268 2368 -4271 -2215 4186 2372 -3717 -2532
1094 -2532 3228 2843 -2643 -3080 2286 3321 -2324 -3913 2213 4350 -2214 -4572 2028 4453 -1785
1109 -1785 -4151 1699 3958 -1268 -3748 886 3791 -295 -3929 -192 4087 657 -4220 -940 4213
1124 4213 786 -4338 -755 4419 657 -4353 -818 4085 1162 -3640 -1403 3306 1752 -3008 -2057
1139 -2057 3178 2596 -3206 -2953 3183 3180 -3224 -3225 2949 3013 -2714 -2867 2437 2823 -2049 -2915 1728 3277
1157 3277 -1153 -3506 851 3727 -593 -3760 652 3799 -822 -3903 750 3823 -574 -3758 136
1172 136 3302 199 -3218 -638 3174 973 -3232 -1254 3521 1627 -3595 -1852 3652 1932 -3479
1187 -3479 -1942 3204 1817 -2994 -1865 2685 2024 -2464 -2499 2118 2830 -1780 -3028 1793 3150 -1774
1203 -1774 -3174 1991 3301 -1972 -3215 1851 3143 -1537 -3081 1047 2936 -692 -3027 369 3187
1218 3187 -130 -3471 -110 3777 322 -3683 -358 3592 519 -3275 -376 3102 477 -2871 -834
1233 -834 2728 1133 -2651 -1678 2343 1927 -2412 -2042 2520 2126 -2669 -2088 2697 2215 -2497 -2197 2288
1250 2288 2196 -1803 -2284 1515 2318 -1359 -2631 1110 2955 -1100 -3283 927 3307 -842 -3229 741
1266 741 3023 -679 -2827 566 2802 -180 -2690 -177 2644 556 -2600 -801 2642 873 -2811
1281 -2811 -925 2884 890 -2985 -1023 2843 1073 -2517 -1265 2270 1405 -1926 -1552 1825 1862 -1756
1297 -1756 -2188 1769 2419 -1686 -2534 1597 2469 -1518 -2370 1406 2298 -1337 -2239 957 2384 -578 -2394
1314 -2394 334 2572 -82 -2681 37 2746 -44 -2967 43 2855 -116 -2832 -173 2648 286
1329 286 -2446 -538 2305 800 -2214 -1095 2274 1476 -2349 -1635 2358 1711 -2291 -1685 2240 1586
1345 1586 -2092 -1585 1883 1607 -1698 -1739 1365 1939 -1150 -2118 1021 2292 -922 -2288 1039 2559
1361 2559 -1034 -2555 987 2499 -842 -2454 608 2259 -403 -2277 30 2225 186 -2370 -397
1376 -397 2556 547 -2582 -610 2633 715 -2489 -657 2415 731 -2242 -845 2016 928 -1851
1391 -1851 -1270 1644 1447 -1655 -1668 1682 1731 -1677 -1793 1712 1891 -1712 -1821 1590 1772 -1341 -1789 1055
1409 1055 1884 -909 -1956 672 2104 -459 -2318 373 2407 -309 -2480 297 2427 -242 -2278
1424 -2278 174 2169 4 -2037 -169 1957 419 -1955 -699 1927 863 -2028 -994 2082 1059
1439 1059 -2122 -1118 2034 1123 -1909 -1138 1748 1250 -1469 -1344 1383 1533 -1192 -1772 1110 1919 -974
1456 -974 -2071 980 2067 -1025 -2161 907 2038 -807 -1951 611 1904 -468 -1876 217 1930
1471 1930 -2 -1981 -167 2121 241 -2203 -286 2234 304 -2252 -380 2147 441 -1981 -579
1486 -579 1836 751 -1732 -889 1701 1206 -1584 -1311 1585 1484 -1593 -1535 1531 1569 -1525 -1510 1365 1458
1504 1458 -1233 -1507 1087 1535 -888 -1630 708 1743 -564 -1841 566 2105 -482 -2089 486 2096
1520 2096 -421 -2011 285 1925 -175 -1848 -57 1771 236 -1822 -395 1793 595 -1869 -670
1535 -670 1949 757 -1904 -760 1921 802 -1809 -866 1654 880 -1482 -991 1354 1145 -1240 -1317 1164
1552 1164 1422 -1173 -1580 1141 1613 -1066 -1627 1065 1611 -946 -1621 781 1612 -612 -1564 434 1642
1569 1642 -287 -1724 76 1821 37 -1880 -43 1881 96 -1830 -107 1819 190 -1754 -352
1584 -352 1633 443 -1558 -613 1450 753 -1469 -880 1463 951 -1527 -1113 1487 1105 -1479 -1140 1407
1601 1407 1144 -1221 -1152 1110 1254 -877 -1325 799 1476 -722 -1617 629 1668 -576 -1732 553 1704
1618 1704 -562 -1655 510 1633 -306 -1525 193 1531 -5 -1526 -141 1606 260 -1660 -337
1633 -337 1725 391 -1806 -496 1681 488 -1641 -499 1513 676 -1347 -731 1295 893 -1211 -972
1649 -972 1268 1168 -1108 -1220 1193 1238 -1210 -1306 1101 1278 -998 -1268 925 1287 -741 -1320 552 1408
1667 1408 -438 -1487 418 1605 -310 -1565 324 1706 -229 -1668 155 1517 -46 -1538 -48
1682 -48 1359 165 -1401 -321 1409 467 -1445 -575 1363 663 -1452 -652 1426 707 -1337 -680 1308
1699 1308 670 -1161 -799 1078 882 -985 -1016 817 1051 -875 -1156 842 1259 -809 -1256 783 1346
1716 1346 -729 -1321 585 1252 -444 -1230 370 1280 -216 -1369 114 1344 29 -1442 -75 1445
1732 1445 102 -1426 -73 1418 128 -1295 -176 1301 306 -1207 -485 1122 510 -1112 -655 1123
1748 1123 754 -1131 -864 1159 872 -1140 -891 974 817 -957 -920 886 939 -704 -1003 599 1088 -512
1766 -512 -1149 456 1234 -422 -1290 414 1282 -441 -1261 363 1249 -339 -1189 206 1186 -80 -1164
1783 -1164 -61 1166 186 -1261 -253 1290 281 -1304 -331 1270 359 -1265 -385 1102 434 -1095
1799 -1095 -499 970 605 -929 -717 891 833 -828 -920 863 958 -815 -938 883 893 -739 -911 743
1817 743 950 -600 -949 492 1016 -379 -1014 339 1127 -205 -1158 289 1223 -194 -1167 176 1195
1834 1195 -139 -1109 81 1026 53 -1045 -140 950 230 -993 -368 1024 441 -1038 -478 1054 463
1851 463 -1019 -530 963 507 -910 -515 815 569 -757 -658 744 749 -667 -783 680 906 -531 -929
1869 -929 623 929 -514 -935 518 847 -390 -842 374 893 -270 -938 114 927 -96 -979 -20
1886 -20 1019 31 -1054 -52 1044 49 -1039 -57 1009 113 -905 -208 884 278 -825 -382 846
1903 846 456 -878 -508 860 569 -857 -607 764 545 -756 -597 714 616 -605 -607 573 731 -453
1921 -453 -830 468 834 -417 -891 343 952 -424 -916 385 933 -325 -876 302 877 -106 -857 79
1939 79 825 53 -822 -70 945 153 -925 -167 939 219 -918 -240 924 257 -842 -287 802 350
1957 350 -756 -452 656 454 -676 -556 621 621 -681 -615 668 622 -672 -596 564 622 -515 -628 428
1976 428 657 -358 -746 267 735 -190 -781 242 887 -220 -871 257 881 -139 -784 104 786 -79
1994 -79 -800 -15 744 20 -785 -173 726 233 -763 -259 815 270 -771 -248 787 262 -703 -321 677
2013 677 346 -598 -383 496 438 -521 -534 429 586 -447 -638 501 667 -463 -686 422 633 -400 -612
2032 -612 354 640 -304 -610 187 669 -133 -695 32 735 -108 -791 35 793 -44 -740 -7 728 25 -718
2052 -718 -92 693 142 -614 -216 601 280 -639 -350 610 348 -679 -386 649 419 -627 -409 577 454
2071 454 -479 -422 456 450 -415 -492 410 553 -344 -701 364 647 -306 -683 264 666 -356 -685 270 589 -205
2092 -205 -630 111 646 -76 -649 63 694 36 -644 -60 745 109 -719 -136 693 140 -628 -146 603 105
2112 105 -600 -193 511 309 -495 -286 538 408 -487 -391 453 403 -456 -456 441 454 -424 -458 433 426 -425 -487 221
2135 221 578 -168 -510 198 607 -221 -620 189 601 -147 -636 179 603 -114 -526 24 608 9 -533 -70
2155 -70 597 174 -570 -191 602 199 -612 -212 616 247 -575 -212 577 216 -544 -263 523 313 -374 -325 388
2176 388 428 -396 -459 348 531 -357 -501 317 501 -351 -510 320 532 -290 -481 162 518 -117 -510 119 582
2197 582 -74 -544 67 664 8 -638 11 655 -50 -546 -12 554 63 -469 -121 486 123 -529 -218 449
2217 449 268 -524 -266 561 370 -584 -315 554 326 -491 -293 416 326 -378 -309 365 469 -333 -472 323 540
2238 540 -280 -476 232 466 -225 -476 251 512 -218 -494 200 536 -64 -485 90 479 -9 -582 -38 551
2258 551 35 -577 -71 530 34 -583 -57 551 117 -522 -139 507 219 -460 -213 454 340 -427 -336 440
2278 440 422 -453 -313 445 403 -431 -384 353 352 -325 -403 284 390 -224 -443 290 445 -209 -439 235 556 -130
2300 -130 -562 99 537 -78 -455 75 448 -46 -481 2 452 40 -416 -104 447 181 -534 -189 510 149
2320 149 -406 -159 558 253 -449 -170 427 247 -422 -273 353 236 -390 -398 323 391 -415 -410 331 398 -347 -426
2342 -426 402 352 -227 -391 225 419 -182 -383 147 434 -104 -461 60 521 -93 -522 38 492 -87 -488
2362 -488 19 528 11 -472 -17 452 129 -485 -110 423 180 -415 -241 399 238 -462 -197 437 184 -429
2382 -429 -250 373 242 -332 -256 309 325 -275 -371 326 406 -231 -409 278 386 -231 -429 224 381 -180 -404
2403 -404 199 380 -194 -465 17 418 -70 -369 35 446 -9 -418 -71 497 49 -466 -130 461 101 -471
2423 -471 -84 403 84 -379 -200 392 217 -390 -260 389 294 -318 -281 402 318 -315 -288 365 289 -330 -266 261
2445 261 280 -183 -355 157 370 -169 -409 122 389 -115 -435 101 418 -92 -427 83 385 -11 -433 -24
2465 -24 419 50 -409 -104 368 80 -406 -115 376 164 -377 -130 432 181 -408 -188 376 198 -307 -237 310
2486 310 320 -285 -292 254 313 -266 -363 182 386 -277 -356 224 373 -199 -363 186 327 -184 -329 97 386 -143
2508 -143 -402 95 409 -13 -337 113 426 8 -407 -23 414 14 -417 31 427 98 -357 -151 381 138
2528 138 -325 -153 395 202 -358 -200 413 214 -353 -247 283 213 -313 -202 264 232 -234 -299 177 340 -143
2549 -143 -302 260 328 -149 -335 127 357 -93 -416 151 359 -120 -372 75 368 -67 -327 57 420 60
2569 60 -371 -54 422 114 -355 -47 351 79 -411 -144 366 36 -339 -152 319 184 -363 -226 280 198 -291
2590 -291 -247 305 301 -278 -240 241 263 -204 -271 174 276 -211 -259 185 317 -105 -330 94 350 -68 -357 54
2612 54 397 -77 -399 56 402 -74 -376 64 313 -39 -368 -25 323 90 -356 -122 301 56 -315 -117
2632 -117 340 189 -313 -190 330 146 -281 -138 328 218 -285 -199 237 292 -221 -248 192 262 -142 -320 187
2653 187 244 -176 -287 172 323 -112 -325 100 286 -70 -257 31 301 -45 -324 5 370 -12 -337 39
2673 39 368 61 -326 -52 284 46 -309 -86 294 105 -289 -141 292 155 -277 -176 252 141 -275 -178 258
2694 258 168 -297 -220 264 204 -271 -188 216 219 -211 -227 139 307 -194 -298 131 292 -101 -309 146 270 -63
2716 -63 -302 71 286 -22 -303 10 276 26 -231 30 309 7 -292 -38 309 41 -263 -88 325 113
2736 113 -276 -88 295 97 -286 -106 259 150 -233 -124 237 174 -229 -213 200 226 -182 -210 171 250 -207 -224
2758 -224 204 195 -167 -281 98 274 -70 -269 94 351 -54 -336 94 316 -86 -274 64 251 6 -289 -9
2779 -9 296 -17 -265 -42 275 29 -307 -63 357 99 -269 -62 304 127 -282 -142 256 124 -216 -119 189
2800 189 157 -181 -152 184 244 -223 -235 212 243 -165 -233 143 266 -173 -224 143 266 -133 -245 159 252 -121 -278
2823 -278 14 265 -45 -350 7 291 -64 -310 12 311 51 -265 -19 232 64 -278 -95 270 67 -271
2843 -271 -99 260 158 -291 -114 227 150 -203 -145 191 106 -169 -137 217 219 -152 -171 172 195 -150 -220 172 235
2866 235 -115 -258 88 242 -142 -347 149 235 -57 -269 23 236 13 -269 -13 232 4 -241 -2 281
2886 281 73 -311 -1 280 55 -299 -119 302 44 -205 -117 255 99 -212 -150 244 132 -242 -183 227 206
2907 206 -191 -209 145 245 -223 -186 169 144 -87 -215 153 212 -165 -204 87 225 -108 -214 87 241 -29 -240
2929 -240 80 251 -18 -245 61 295 -39 -260 -34 249 10 -243 7 295 126 -239 -89 222 72 -267
2949 -267 -98 224 178 -237 -144 207 166 -208 -135 191 203 -188 -203 141 159 -128 -196 160 282 -92 -215 92 202
2972 202 -150 -198 98 239 -104 -235 13 242 -29 -219 54 246 -51 -235 40 241 9 -225 -14 244
2992 244 96 -219 -12 259 90 -201 -62 180 102 -197 -112 199 125 -234 -138 162 87 -208 -154 191 195 -134 -135
3015 -135 163 213 -99 -247 110 210 -135 -191 89 223 -96 -212 94 228 -79 -201 22 221 -44 -256 -3
3036 -3 217 4 -225 -15 261 62 -260 -45 207 -16 -263 -96 234 69 -223 -111 210 98 -168 -144 163
3057 163 129 -192 -138 210 169 -110 -151 138 175 -195 -135 175 205 -150 -197 112 216 -99 -203 77 238 -46 -218
3080 -218 53 162 -84 -235 31 239 -18 -262 -25 224 19 -220 -72 232 23 -237 -46 167 39 -239
3100 -239 -54 235 120 -184 -111 183 130 -184 -117 157 158 -186 -118 167 167 -161 -153 174 230 -141 -183 159 222 -106
3124 -106 -298 47 195 -149 -167 73 159 -78 -187 29 240 -83 -260 46 221 20 -217 23 210 7 -213
3145 -213 -55 296 77 -265 -70 230 106 -168 -47 198 72 -189 -101 227 169 -197 -186 184 174 -179 -201 157
3167 157 171 -140 -176 118 204 -128 -198 90 250 -107 -202 88 233 -105 -255 98 222 -38 -241 40 229 13
3189 13 -181 -39 262 5 -214 -43 240 63 -187 -97 272 87 -266 -108 189 86 -255 -107 152 115 -241
3210 -241 -106 177 150 -188 -178 156 160 -159 -171 107 127 -69 -155 169 166 -128 -232 107 240 -48 -237 65 194
3233 194 -31 -233 98 213 -23 -244 -9 270 53 -220 -5 261 7 -247 -19 216 29 -288 -80 267
3253 267 70 -215 -92 186 131 -271 -138 164 142 -189 -148 211 138 -178 -165 145 157 -164 -229 141 197 -91 -315
3276 -315 102 232 -102 -263 80 264 -25 -207 95 204 -22 -160 37 183 -9 -255 -80 245 45 -235
3296 -235 -102 247 41 -204 -47 273 58 -225 -83 214 114 -181 -112 221 119 -200 -149 167 207 -164 -141
3317 -141 192 233 -181 -161 172 131 -146 -209 70 204 -121 -188 129 281 -91 -289 36 247 6 -249 22 311
3339 311 -62 -300 -26 244 -26 -273 -31 264 20 -236 -41 217 67 -249 -55 254 53 -236 -91 220
3359 220 177 -252 -155 228 132 -204 -146 172 213 -158 -181 141 151 -167 -191 167 224 -124 -226 100 263 -76 -262
3382 -262 73 205 -62 -234 41 170 -40 -181 -23 206 58 -215 8 199 15 -280 -63 294 24 -217
3402 -217 -83 228 68 -187 -25 201 128 -210 -142 207 177 -237 -187 208 186 -202 -169 153 182 -107 -215 120
3424 120 182 -147 -197 93 226 -118 -247 85 190 -53 -251 34 222 -43 -238 49 226 -20 -209 22 244
3445 244 23 -270 -39 203 58 -216 -131 233 66 -286 -111 253 99 -213 -45 166 135 -222 -128 211 168
3466 168 -165 -191 84 166 -106 -176 165 153 -128 -212 159 217 -100 -170 114 185 -156 -249 81 217 -7 -214 13
3489 13 231 -36 -213 24 205 -8 -240 6 240 33 -245 -43 223 64 -153 -105 193 104 -181 -125 176
3510 176 67 -168 -147 141 99 -217 -172 176 168 -162 -190 114 169 -143 -157 97 175 -137 -192 114 208 -58 -183 104
3534 104 232 -103 -178 116 178 -28 -276 45 221 16 -171 11 151 10 -215 -15 235 13 -210 -48 263
3555 263 75 -143 -98 193 93 -158 -70 167 94 -130 -122 155 160 -178 -177 197 164 -151 -177 159 161 -162 -158 123 182
3580 182 -124 -195 73 244 -39 -214 91 181 -56 -215 9 244 -2 -232 -38 180 1 -186 47 232 28
3601 28 -169 -106 207 77 -268 -106 237 157 -205 -101 182 108 -168 -90 144 101 -156 -137 146 140 -145 -126 84
3624 84 170 -101 -170 136 196 -110 -149 78 134 -55 -197 107 148 -19 -216 4 153 -25 -151 30 185 -21
3646 -21 -161 22 178 -18 -234 -24 213 58 -199 -41 181 66 -156 -124 165 79 -204 -96 206 128 -190
3667 -190 -109 147 155 -149 -121 165 148 -111 -123 120 115 -92 -137 100 169 -139 -179 35 188 -11 -149 35 180 -64
3691 -64 -181 59 183 -20 -173 -23 155 -21 -166 14 115 23 -205 -42 133 50 -215 -38 153 82 -182
3712 -182 -79 127 13 -134 -94 117 131 -170 -88 148 87 -117 -177 82 116 -78 -152 156 130 -112 -142 112 179
3735 179 -78 -136 50 164 -36 -168 -1 171 -34 -169 28 165 -35 -146 -22 176 10 -181 12 140
3755 140 -2 -155 -36 211 74 -131 -67 133 84 -193 -109 202 181 -147 -113 110 30 -182 -121 97 120 -127 -92
3778 -92 37 106 -96 -157 77 145 -62 -123 84 176 -65 -168 57 140 -72 -170 -9 171 -35 -158 -34 149 8
3801 8 -110 -4 193 -38 -186 -27 151 -3 -127 -112 131 29 -175 -12 162 67 -74 -104 107 138 -80 -65
3823 -65 160 97 -139 -96 79 86 -109 -125 133 92 -145 -199 16 136 -70 -147 43 127 -48 -183 43 179 25
3846 25 -193 -37 167 -5 -144 -39 100 -12 -148 -22 150 46 -104 -50 138 75 -172 -63 125 42 -115
3867 -115 -26 158 66 -121 -88 124 75 -68 -83 83 124 -86 -63 42 57 -72 -138 46 33 -91 -140 66 117 -40
3891 -40 -69 51 162 -35 -134 34 114 -18 -101 -30 132 -39 -155 26 161 -49 -179 -41 80 -4 -120 -40 131
3914 131 27 -146 -130 70 104 -132 -108 46 62 -124 -60 73 70 -127 -75 98 121 -63 -65 93 112 -58 -49 64 104
3939 104 -6 -97 57 153 24 -110 54 119 -126 -136 -19 130 -28 -67 31 153 -13 -168 11 69 -6 -108 -42
3962 -42 102 20 -155 -37 117 37 -171 -57 59 37 -88 -45 100 110 -62 -94 85 77 -96 -52 79 100 -95 -117
3986 -117 41 112 -31 -124 70 115 -26 -138 55 87 -94 -92 1 135 74 -95 -24 70 13 -85 -11 109 5 -184
4010 -184 -4 113 50 -123 -18 114 16 -69 -64 77 23 -112 -47 99 36 -120 -59 115 127 -74 -117 16 88 -78
4034 -78 -75 95 64 -64 -132 86 98 -74 -133 72 88 -49 -46 35 96 -42 -102 71 88 -76 -137 -17 73 -23 -96 -23
4060 -23 100 -14 -97 -41 122 -15 -69 -21 176 41 -66 -26 85 25 -95 -45 102 98 -84 -45 80 106 -90 -9
4084 -9 82 41 -102 -60 27 61 -60 -68 59 52 -40 -66 36 55 -126 -89 92 72 -42 -89 3 103 -9 -96 73 71 -35
4111 -35 -78 28 51 2 -80 -7 60 62 -154 -11 42 12 -90 -11 42 -1 -80 -32 47 26 -85 -64 118 45 -127 -24 55
4138 55 26 -66 43 49 55 -65 -57 90 38 -20 -81 29 61 -29 -105 91 81 -75 -95 -42 114 -2 -88 -6 49 -36 -112 -78
4166 -78 107 -51 -49 18 88 -48 -130 -5 116 36 -40 -7 64 -24 -61 -47 83 38 -46 -84 103 61 -128 -59 42 89
4192 89 -17 -63 65 71 -44 -72 13 53 -63 -100 79 70 15 -126 38 86 -39 -37 41 88 -9 -66 35 88 -78 -78 -14
4219 -14 60 4 -43 36 102 0 -87 21 87 60 -79 -5 85 54 -93 -4 65 5 -65 -32 70 30 -75 -100 65 66 -43
4246 -43 -38 56 0 -46 -116 56 108 -55 -128 23 56 -32 -39 35 32 5 -47 6 105 -3 -113 35 105 -34 -71 6 80 -27
4274 -27 -103 15 138 -30 -113 1 85 18 -85 -43 115 38 -119 -58 89 51 -102 -80 41 89 -134 -18 62 80
4298 80 -73 -83 -1 77 -46 -57 87 59 -58 -82 39 46 2 -95 -13 80 -18 -66 7 93 -56 -86 25 54 32 -83 2
4325 2 41 -9 -82 -36 57 8 -54 -53 101 53 -93 5 111 11 -124 -57 57 59 -28 -38 88 73 -44 -28 71 40 -85
4352 -85 -28 110 51 -6 -68 10 147 -46 -29 22 62 -99 -112 41 28 -11 -149 68 127 17 -93 -13 80 17 -77 27
4378 27 97 23 -154 4 72 19 -127 -13 130 23 -47 -10 67 29 -102 -4 118 58 -98 -24 98 63 -40 -84 112
4403 112 39 -41 -92 56 85 -42 -73 -2 119 -17 -55 58 66 -20 -60 -12 83 -15 -68 -7 112 -20 -58 -8 51 25 -111
4430 -111 -36 114 31 -68 -61 80 30 -129 -9 96 51 -31 -30 58 67 -55 -66 108 37 -86 -56 90 70 -65 -44 44
4456 44 65 -21 -70 67 2 -61 -84 44 93 -12 -28 84 84 -14 -75 55 71 -57 -35 12 90 -54 -91 42 68 31 -87
4483 -87 -63 121 18 -115 -17 53 53 -59 -53 77 47 -118 -11 78 20 -132 -58 92 26 -130 -47 128 31 -108 -5
4508 -5 39 64 -30 -23 75 69 -68 -112 -10 73 -31 -86 31 90 -18 -128 21 89 -15 -63 -10 62 48 -93 6 137 12
4535 12 -24 -27 85 28 -75 -25 79 9 -34 -44 106 -1 -116 -59 86 -33 -56 -63 44 23 -69 -35 15 98 -107 -27
4561 -27 66 79 -67 -26 67 106 -16 -69 87 94 -61 -70 3 133 -46 -69 35 30 41 -66 1 148 17 -77 -35 92
4587 92 -14 -124 -9 104 -28 -32 -66 64 42 -106 -52 96 18 -89 -56 69 60 -30 -74 88 96 -15 -22 54 46 -70
4613 -70 -99 89 135 -29 -81 22 87 -33 -102 32 91 -77 -108 10 115 -23 -81 8 139 80 -107 11 98 11
4637 11 -71 4 112 72 -100 -56 102 45 -46 -8 99 64 -71 -31 69 59 -97 -44 87 55 -38 -74 90 79 -80
4662 -80 -101 76 70 -44 -39 34 72 -108 -91 13 107 -38 -103 73 107 -39 -104 36 139 38 -136 65 81 72 -73
4687 -73 -8 125 -9 -106 -24 141 -9 -102 32 66 62 -54 -28 87 88 -59 -15 67 28 -77 -38 114 70 -115 -60 81
4713 81 38 -57 -182 -7 85 -59 -34 54 91 -39 -82 38 150 -50 -71 0 126 32 -104 36 122 16 -41 -61 109
4738 109 17 -128 -38 143 29 -101 11 104 56 -132 4 75 58 -148 -107 147 13 -28 -42 43 86 -53 -15 54
4762 54 108 -37 -123 16 125 -26 -57 94 112 -39 -97 60 74 -15 -105 54 103 13 -53 29 92 9 -133 5 161
4787 161 39 -96 -35 91 28 -52 2 48 42 -112 -48 95 13 -88 -57 95 46 -14 -56 60 73 -69 -82 94 140
4812 140 -14 -54 76 90 -49 -35 93 160 -30 -72 2 120 -66 -84 9 86 12 -102 38 94 -56 -70 -7 123
4836 123 -11 -98 4 132 13 -101 -12 124 9 -91 -73 103 87 -140 -57 94 11 -108 -24 78 46 -79 -85
4859 -85 58 90 -82 -55 73 50 -151 -99 13 104 -91 -127 45 58 -9 -78 48 81 -42 -124 16 76 -46 -119 1
4884 1 140 36 -114 -48 76 26 -117 -42 137 42 -125 -10 115 66 -51 -18 104 85 -120 -45 126 68 -141 -24
4908 -24 128 109 -63 -98 120 96 -104 -119 56 89 -25 -94 60 79 -23 -145 65 90 -36 -169 36 110 -42
4931 -42 -135 4 100 -6 -118 -57 113 12 -104 -38 83 5 -103 -31 141 46 -149 -88 112 -36 -124 -92 81 59
4955 59 -155 -67 65 33 -128 -88 53 91 -128 -129 71 119 -60 -123 81 115 -66 -116 83 163 -46 -132 45 129 -57
4980 -57 -101 55 160 30 -117 12 98 -13 -160 6 89 26 -178 -20 120 16 -160 -49 113 24 -147 -58
5002 -58 127 34 -109 -63 114 73 -117 -86 145 73 -102 -97 72 97 -93 -90 126 125 -95 -121 91 95 -34 -90 55 137
5028 137 -33 -182 41 131 -18 -153 -48 151 -37 -163 -57 73 -12 -154 12 114 -11 -83 -43 76 37 -95
5050 -95 -95 93 37 -164 -30 132 94 -130 -110 85 148 -132 -127 168 80 -111 -74 47 122 -91 -100 80 95 -70 -128
5075 -128 59 153 -59 -167 51 107 -43 -148 -6 142 -69 -158 20 136 11 -159 -15 142 31 -176 -20
5096 -20 140 9 -113 -61 109 64 -158 -25 150 96 -115 -49 48 93 -166 -44 85 96 -88 -151 97 124 -41
5119 -41 -83 70 103 -63 -108 57 112 -80 -132 64 134 -22 -153 8 183 -11 -134 35 109 -22 -173 42 206
5142 206 7 -124 -26 142 84 -173 -27 84 20 -147 -14 106 35 -148 -125 107 28 -169 -78 87 75 -102 -103
5165 -103 91 77 -123 -88 109 112 -62 -107 32 140 -50 -144 40 165 -135 -150 5 164 -3 -112 49 172
5187 172 -2 -152 38 126 -16 -97 -74 129 2 -126 10 169 45 -108 -16 109 106 -81 -74 83 59 -128 -50
5210 -50 124 107 -95 -94 90 55 -130 -79 49 133 -156 -123 128 117 -82 -152 85 44 -129 -88 67 170 -40 -112
5234 -112 32 74 -17 -191 -15 132 -7 -121 34 123 18 -101 0 150 -9 -148 -25 160 31 -161 -69
5255 -69 151 80 -148 -64 112 64 -95 -51 132 80 -115 -47 159 132 -103 -101 59 92 -93 -116 58 75 -80 -51 56
5280 56 126 -40 -107 44 162 -37 -176 32 168 -26 -105 -25 120 -6 -125 4 127 16 -137 38 82 91 -157
5303 -157 -15 112 84 -87 -41 103 10 -107 -79 126 51 -93 -105 85 104 -60 -124 101 117 -119 -100 78 96 -67
5327 -67 -138 106 185 -43 -176 -2 145 -34 -108 -10 152 -14 -123 38 137 46 -112 34 104 -23 -165 -18 154
5350 154 -1 -148 -34 146 80 -72 -50 63 85 -155 -105 52 47 -154 -127 89 115 -116 -119 80 153 -34 -92 55
5374 55 118 -102 -133 87 100 -12 -145 11 110 -65 -140 -13 143 -15 -73 45 140 -13 -100 -8 149 28 -106
5397 -106 -40 172 -1 -137 -21 108 72 -90 -17 92 30 -63 -40 110 99 -117 -74 69 30 -99 -92 32 110 -90
5421 -90 -77 70 109 -100 -59 79 136 -53 -137 -9 107 -1 -138 40 67 -34 -101 39 159 -20 -99 -3 105
5444 105 47 -133 -32 169 -15 -149 -34 149 12 -111 -6 172 23 -106 7 79 54 -121 -94 74 46 -76
5466 -76 -54 45 43 -68 -90 69 139 -11 -107 34 108 -43 -55 7 109 14 -96 26 87 -46 -112 19 69 -28 -68 -25
5492 -25 110 22 -121 -14 107 76 -117 -28 110 -9 -66 -93 142 47 -148 -32 77 59 -129 -55 99 67 -110
5515 -110 -74 89 101 -97 -44 68 106 -20 -127 68 101 -54 -85 42 97 -57 -57 59 128 -14 -144 -2 156
5538 156 -14 -169 -10 90 5 -88 22 88 12 -124 -15 146 -21 -67 -65 91 88 -41 -19 86 74 -110 6 97
5562 97 92 -44 -103 94 52 -101 -103 83 106 -91 -79 89 94 -63 -84 89 106 -31 -85 53 82 -42 -107 -47 67 -22
5588 -22 -136 57 125 16 -52 -10 95 -14 -142 -15 91 41 -80 -34 123 -8 -146 7 148 34 -144 -51
5610 -51 63 101 -133 -35 138 15 -115 -40 92 86 -56 -83 77 22 -41 -73 75 74 -48 -123 46 123 -53 -142 68
5635 68 73 -36 -83 26 112 -48 -118 14 118 13 -120 31 54 -34 -111 -12 109 52 -36 -7 124 -9 -118 -49 88
5660 88 68 -99 -87 109 82 -79 -37 55 66 -124 -61 25 25 -46 -124 89 102 -14 -77 44 130 -13 -100 33 129 -14
5686 -14 -73 18 60 6 -112 42 113 -30 -57 8 86 -26 -78 -35 136 19 -91 -1 140 -36 -91 52 76 70 -21 -1
5712 -1 93 29 -76 -29 104 59 -56 -46 65 110 -85 -31 79 88 -40 -55 17 80 -30 -79 37 51 -39 -74 49 45 21
5739 21 -73 47 87 -12 -57 -8 122 7 -73 -27 68 -16 -105 -88 52 -4 -153 -47 114 13 -25 -48 159 41 -77
5764 -77 -36 4 55 -75 -20 124 49 -54 -45 54 90 -51 -56 55 117 -89 -89 35 71 -61 -106 54 107 -28 -94 3 86
5791 86 0 -58 -8 61 -46 -51 12 122 4 -80 -36 84 31 -40 -5 98 51 -102 -48 94 51 -89 -67 50 -20 -62
5817 -62 -21 65 16 -59 0 26 38 -29 -93 76 25 -56 -7 90 44 -15 -89 17 65 2 -110 18 56 -61 -113 46 136
5844 136 36 -87 10 114 -6 -69 -13 40 47 -76 -33 94 64 -40 -83 21 23 -40 -14 55 35 -41 -63 87 60 -30
5870 -30 -39 20 88 -99 -70 43 48 -9 -112 -2 108 -9 -114 41 121 -52 -14 41 64 -60 -88 31 63 -6 -101 12
5896 12 121 45 -96 8 63 26 -28 -48 78 -1 -41 -37 35 42 -99 -47 20 -19 -52 -45 70 13 -22 -14 24 61 -53 -60 20
5925 20 74 -18 -74 31 103 -56 -75 40 58 -16 -75 -2 81 3 -96 1 84 -51 -41 31 140 8 -48 -14 74 22 -20
5952 -20 -18 67 13 -99 -59 22 1 -48 -64 33 9 -59 29 40 19 -62 -26 62 29 -24 -35 46 98 -105 -91 52 22 44 -41
5981 -41 57 55 -16 -7 4 48 -44 -77 -31 51 -33 -117 17 52 15 -48 -4 56 -20 -24 -88 23 -21 -26 8 86 -8 -79 -47 99 18
6012 18 -48 -20 45 76 -38 -33 67 125 -10 -52 34 12 -43 6 21 57 -41 -41 61 62 23 -54 20 52 -58 -39 -1 36 -6
6041 -6 -1 -32 52 22 -80 78 82 19 -6 -22 93 61 -64 20 56 -7 -51 -33 22 32 -2 -60 31 -22 -69 -31 31 50 -38 -88
6071 -88 8 64 -58 -17 31 101 -88 -46 -15 39 -7 -52 46 22 -28 -70 -15 89 -65 -62 66 40 17 -6 18 44 20 -62
6099 -62 30 75 54 -96 11 57 13 -36 -7 21 20 -42 16 91 -1 -52 -66 36 12 -51 -38 42 13 -51 -61 14 36 -61 -35
6128 -35 20 16 -17 -18 3 28 -3 40 -7 6 -23 -60 32 53 -22 -42 18 36 30 -111 46 7 -6 -50 36 50 -1 -29 -29 11 -23
6159 -23 -56 41 62 16 -60 -2 34 53 -49 32 49 9 -73 7 36 -4 -21 -75 62 26 9 -68 -17 7 -6 -39 36 32 -7 -80
6189 -80 65 15 0 -9 48 45 -20 58 -21 51 -56 -38 38 13 -28 -15 17 54 -6 13 -75 98 38 -11 37 17 -34 6 -23 -6
6219 -6 24 -72 -2 59 -20 -53 -2 37 5 -34 -50 72 51 -7 -38 26 75 9 -19 30 73 -49 9 58 101 26 -83 8 47
6248 47 -49 -34 -2 62 -20 45 -3 52 42 -35 -3 30 -4 -101 -13 34 -12 -35 -30 48 42 -44 15 56 9 -21 27 71 23 14 44 56
6280 56 4 -27 -33 65 1 -71 -16 31 26 -21 0 72 16 -71 -84 20 103 -28 -50 23 37 3 -46 57 -6 -21 -50 57 48 -23
6310 -23 -13 13 55 48 -25 -49 49 -24 -46 -29 95 -22 -69 -35 116 39 -46 -19 49 -34 -49 -7 5 -5 -30 2 55 70 -4
6339 -4 -63 14 23 -10 -5 67 30 -53 -76 33 59 20 -53 -24 37 16 3 -13 85 -40 -82 16 41 -18 -96 -16 33 28 26 10 56 38
6371 38 -45 6 47 9 12 -4 35 -32 -47 -14 -7 24 -21 -58 22 27 1 -51 48 7 -44 -17 26 0 22 -5 67 -1 5 -7 34 98
6403 98 -6 0 28 44 23 -37 27 39 12 -16 35 31 14 -56 -36 47 -11 5 22 18 -19 -51 -50 24 21 -61 -9 43 23 -45 -31 70
6435 70 42 -40 -31 51 -9 -74 8 49 -18 -27 34 58 38 -20 -5 -2 49 -32 -52 -18 42 -53 -9 20 3 -13 -76 28 46 2 -75
6466 -75 -16 57 -23 -86 -16 31 -7 -27 -34 28 -28 -36 -46 39 43 -27 32 2 36 -9 -12 -11 5 4 -16 44 5 -44 -44 58 -65 -52 -33
6499 -33 70 24 -40 -47 14 20 -67 -67 64 78 -17 5 48 38 31 -26 3 98 -35 -10 -53 65 -54 -68 12 37 -5 -24 -2 53
6529 53 45 -53 -17 53 9 -64 -26 52 -31 -3 -5 122 36 -14 14 31 -2 -16 -101 -10 71 -46 -40 58 20 -19 -61 79 15 20 -60
6560 -60 39 124 -15 -35 10 44 -44 -50 -3 38 10 -97 4 32 3 -36 3 72 32 -37 -31 10 -24 14 -12 78 14 -46 -31 69
6590 69 2 -82 -25 85 52 -35 -38 -13 51 -56 -24 68 56 -51 -23 12 12 -14 -57 39 -21 20 -69 1 41 15 -9 -31 62 23
6620 23 -31 -23 -6 -13 -15 45 45 -28 -60 83 48 -38 -83 -3 30 -41 -62 -3 44 16 65 -27 7 -21 -61 -36 -11 -2 -41 -13 69 48
6652 48 -15 -52 58 32 -53 -11 13 36 -7 -10 -15 71 -18 -39 -11 55 -60 -46 -11 58 -41 -47 16 10 -14 -113 2 66 -9 -63 -3
6683 -3 12 14 4 -31 75 36 -66 10 55 12 -63 2 36 47 -24 75 73 47 -73 -52 21 25 -38 -3 76 34 -63 -49 11 22 -39
6714 -39 -43 13 91 -37 -33 -2 43 38 -76 -7 62 0 -2 -19 26 7 -18 19 24 -22 1 -35 40 29 -63 -1 20 44 -67 -8 55
6745 55 -17 -82 -10 42 -27 -40 -35 90 32 -65 -69 33 40 -20 -46 98 75 -7 -67 71 83 -43 -17 10 109 24 -14 -26 60
6774 60 24 -24 1 38 -19 -40 0 69 -11 -60 -12 6 21 3 22 68 -49 -66 -4 56 -20 -68 -28 39 50 -30 -38 69 59 -44
6804 -44 -29 62 17 -58 -45 9 66 21 -9 50 72 -39 -78 -48 63 -2 -13 44 9 -2 -36 -21 68 -9 -40 15 52 -18 -31
6833 -31 -11 31 -27 -71 7 59 10 -52 -51 46 11 -61 31 77 9 -114 -6 62 19 -69 -11 55 52 -39 -3 7 11 -22 -62 67
6863 67 53 -72 -47 -4 53 -94 -58 16 47 -33 -70 0 54 -22 -111 -36 43 21 -44 -80 27 -32 -22 24 39 24 -67 -10 66
6892 66 43 -35 -24 71 6 -85 -62 37 -26 -62 -59 25 43 -10 -3 71 -37 -14 -20 -6 30 -43 9 -23 44 -16 17 37 76 -47 -45
6923 -45 -35 72 9 -130 43 42 -42 -92 51 75 9 -33 -10 34 20 -32 -43 59 17 -41 9 42 -19 10 -55 41 7 -34
6951 -34 15 46 71 -27 -49 30 55 -100 -94 71 52 -51 -53 4 27 -65 -31 64 -25 -23 -90 31 47 -66 -67 24 91 -18 -83
6980 -83 28 17 -54 -57 42 50 -45 -66 17 46 29 -33 69 95 50 -87 12 20 -3 -91 -18 69 41 -39 7 89 -1 -51 -18 25
7010 25 24 -39 -58 68 13 -11 2 21 52 -63 -18 38 39 -37 -88 100 96 -62 -38 21 74 39 -18 65 79 -16 -74 -4 34 62
7040 62 -101 13 62 48 -46 -35 126 44 -58 -48 55 46 -77 -16 105 6 -5 7 76 32 -50 11 55 84 -66 -41 44
7067 44 9 -70 -56 36 91 -42 -34 21 48 -82 -60 47 62 -37 -71 -2 7 35 -40 43 22 23 -30 -5 59 50 -51 3 93 -48
7097 -48 -54 -24 86 70 -25 -32 75 30 -8 -74 70 22 -51 -3 70 14 -64 7 97 30 -47 -77 50 72 -42 -68 0 43 -86
7126 -86 -3 11 4 30 -3 41 71 -22 -8 -3 110 19 -35 36 30 2 -82 -2 117 49 -46 -18 100 32 -78 -39 32 75 -53
7155 -53 -40 101 44 -52 2 101 27 -22 -49 45 93 -7 -39 -23 26 -11 -70 35 82 -52 -91 57 76 -46 -50 -62 47
7182 47 -36 -35 -16 88 35 -102 -39 94 -32 -46 3 70 -14 -48 15 105 64 -28 -42 41 16 -55 -76 80 82 -29 -24 50 70
7211 70 -71 -94 47 36 -70 -46 84 11 -70 -54 30 116 -42 -71 49 32 -27 -64 -15 75 35 -30 -4 38 -61 3 -2 48
7239 48 26 -44 -3 65 -17 -37 -59 79 19 -57 4 79 -9 -64 -49 86 46 -40 -32 93 8 6 41 8 53 -18 -2 52 41 -41
7269 -41 -54 69 73 -77 -66 59 14 -4 -67 2 58 -15 -50 0 65 -37 -29 -41 34 13 -84 -48 92 -59 -120 10 57 12
7297 12 -83 -9 57 30 -81 -1 71 65 -51 -20 107 31 -51 -46 58 54 -68 -154 32 79 -42 -88 104 55 -1 -21 29 47
7325 47 -30 -76 39 9 -6 -63 3 121 -55 -94 7 70 53 -38 20 73 14 -39 24 91 57 -46 -18 72 -3 -86 -33 69
7353 69 22 -89 -17 162 5 -32 -6 100 68 -1 -30 -7 53 -82 -18 31 38 -26 -70 27 107 -38 -86 8 36 -14 -90 54
7381 54 67 11 -26 41 68 -5 -21 -21 89 19 -76 -12 70 -59 -106 -7 148 26 -27 -2 63 53 -24 -71 46 55 -43 -75 40
7410 40 17 -117 -37 46 32 -36 -17 46 117 -62 4 65 119 -33 -45 34 89 -18 -63 11 4 30 -60 32 106 37 -114 -8
7438 -8 89 1 -67 -17 90 -7 -23 3 122 30 -46 -36 14 32 -61 -31 37 25 -40 -3 54 6 -99 -49 94 71 -82 -20
7466 -20 70 71 -19 3 24 48 0 -64 28 40 -33 -50 32 -6 4 -18 -46 131 -47 -123 -28 45 17 -58 10 37 -3 -34 -107 29
7496 29 19 -102 -54 91 16 -111 5 65 -14 -40 -17 14 69 -69 -52 73 46 -13 -51 -5 51 -66 -53 57 63 -80
7522 -80 -47 41 96 16 -109 39 60 43 -89 -11 92 -5 -91 36 4 -17 -93 -16 70 -27 -24 25 80 12 -59 -5 80 13
7550 13 -16 17 55 60 -77 -24 37 49 -29 -48 -4 10 0 -37 38 41 -49 -6 60 70 -86 -87 -12 103 -33 -39 25 65 -23 -59
7580 -59 26 15 -47 -54 7 118 23 -67 15 77 24 -24 -55 87 57 -22 26 -3 69 -90 -12 31 99 -15 -41 65 53 -90
7608 -90 -9 35 28 -48 -23 90 26 4 -54 6 48 -53 -89 37 50 14 -67 10 39 9 -61 63 70 -8 -90 9 32 -11 -78
7637 -78 19 35 -2 -83 -35 76 -23 -72 -51 67 15 -34 26 82 7 -11 -113 50 86 -60 -15 88 56 -61 -84 -5 54
7664 54 -62 -59 61 59 -49 -74 49 36 -1 -45 -20 54 -29 -100 31 70 43 -12 -4 86 -25 -55 27 60 -13 -64 -45 13 -13
7693 -13 -16 -21 44 24 -107 -68 103 82 -29 -53 70 25 -65 -33 12 47 -75 -1 33 21 -64 -62 2 53 -26 -64 64 47 -57
7722 -57 6 32 128 43 -34 49 53 -16 -81 10 30 19 -22 -72 70 21 -121 -3 28 7 -71 22 67 46 -68 -38 65 35
7750 35 -50 -67 59 41 -68 -12 30 30 -71 -39 53 46 -17 -64 64 60 -19 -33 81 90 -27 -97 30 67 -34 -82 -18 69
7778 69 -20 -16 83 53 21 -54 7 81 21 -71 -23 50 40 -65 1 53 40 -78 -39 74 41 -102 -25 85 34 -78 -24 41
7806 41 13 -17 -44 12 55 -8 -42 28 42 -35 -67 -10 126 -124 -99 26 132 -51 -68 44 87 -36 -128 0 62 7
7832 7 -113 7 19 8 -67 -10 43 6 -60 -23 80 13 -44 -14 63 -11 -10 -40 39 16 -26 -21 65 86 -57 -48 4 72 -97 -55
7862 -55 69 48 -81 -44 53 21 -34 -16 45 100 -42 -57 -19 41 55 -90 43 83 34 -52 -10 42 4 -53 3 51 5 -11
7890 -11 -5 52 10 -83 -10 46 6 -97 26 72 46 -89 -18 22 41 -23 -3 92 43 -46 -9 11 56 -20 -58 42 16 -58 -46
7919 -46 90 98 26 -35 4 103 6 -41 54 52 -14 -78 43 109 4 -45 31 116 76 -19 2 82 49 -28 6 45 21 -84 20
7948 20 61 28 -34 -59 14 93 -77 -49 -14 32 -13 -27 61 -18 -46 -79 88 40 -20 -99 61 70 -39 -103 50 73 60 -30
7976 -30 29 110 39 -1 17 120 26 -61 -36 98 29 -58 9 67 21 -87 -51 93 42 -101 -79 63 25 -16 -29 16 45
8003 45 -33 -83 81 40 -14 -74 28 87 -104 -34 49 84 17 -18 72 69 -12 -65 53 49 -43 -70 25 108 -35 -31 -15 100 -60
8032 -60 -98 9 69 28 -96 12 66 -7 -101 -39 52 51 -64 -27 65 25 -88 -14 99 11 -126 -27 59 67 -37 -37 61 37
8060 37 -46 -73 61 20 -37 -22 37 48 -36 -51 -5 63 -1 -66 -20 49 -18 -52 12 51 -31 -40 68 103 -17 -80 17 31 -3
8089 -3 -22 -36 39 45 -66 -15 64 35 -33 5 84 9 -28 -47 19 25 -46 -50 56 99 22 -33 57 29 -10 -24 22 43 -54 -37 8
8120 8 63 -45 -48 20 85 0 -76 -30 22 28 -97 35 80 -21 -50 44 46 48 -74 -12 97 18 -71 1 103 49 -115 -57 38
8149 38 30 -50 -61 76 4 -79 -74 119 72 -54 -49 80 36 -48 -52 10 76 -84 -90 38 52 -26 -77 28 41 -28 8 -30 48
8178 48 7 -39 13 114 8 -31 2 62 11 -81 1 99 6
8191F
$$ Imaginary data points
##PAGE= N=2
##DATA TABLE= (X++(I..I)), XYDATA
0 0 0 0 0 0 0 0 0 0 0 1 -8 8 -8 16 -16 24 -29 32 -40 48 -64 72 -88 102 -120 137 -160 186 -215 246 -282 322
32 322 -363 412 -467 523 -589 658 -737 822 -915 1017 -1128 1248 -1380 1525 -1682 1855 -2045
49 -2045 2253 -2480 2734 -3014 3326 -3674 4069 -4517 5031 -5631 6340 -7187 8231 -9544
63 -9544 11264 -13612 17032 -22492 32592 -57478 249550 175715 -423191 -60371 256544 55709
75 55709 -138944 62203 51348 -82095 447 133537 975 -57394 44673 50239 -68162
86 -68162 -34748 64173 80226 23123 -45591 -99823 6054 166741 99853 -133857 -137886 74249
98 74249 144368 5528 -68593 -9591 29572 -3839 -4979 43995 47928 -28042 -62546 12231
110 12231 73591 18341 -34842 10684 34486 -37630 -48172 68581 107828 -37004 -134483 -9987
122 -9987 131038 60244 -76687 -53863 32728 13740 -14704 42027 40547 -61508 -63613 55257
134 55257 69725 -31563 -40668 31981 17941 -41154 -12383 48234 35217 -20047 -51011 -30331
146 -30331 42419 79153 -6875 -96813 -29284 80921 39904 -54896 -22631 42265 -4874 -51038
158 -51038 16967 62706 -10947 -59292 -734 33740 -6343 -9353 28013 -7 -53857 -18851
170 -18851 53051 40005 -30953 -52516 -5392 41699 25874 -28845 -30446 24025 23385 -37198 -25320
183 -25320 50704 34992 -54559 -49779 36263 46308 -17438 -33823 1007 9737 -8054 -5257 15306
196 15306 10613 -25139 -33305 16786 44557 -9744 -49001 4563 41648 -14277 -41080 23904
208 23904 43373 -30573 -51641 21206 48647 -10346 -40371 -175 24670 -3403 -20913 7715
220 7715 24828 -12409 -39157 4717 46438 4778 -47301 -15263 36630 14573 -30080 -14291
232 -14291 23034 10919 -25020 -18897 19874 23807 -16726 -30701 7821 25818 -8086 -20576
244 -20576 12851 15017 -22700 -16490 29099 22453 -28720 -28599 22389 31614 -14961 -32407 9670
257 9670 32996 -8407 -37415 5495 40303 -3102 -42482 -2034 37629 3180 -31288 -2408
269 -2408 24020 -1620 -21953 2326 21941 -610 -24558 -5753 24211 10121 -24738 -13826
281 -13826 23682 13181 -25865 -13206 27346 13296 -27640 -14664 25471 16758 -20309 -16849
293 -16849 16602 18037 -13509 -19113 13357 22554 -13519 -26702 12598 29016 -11891 -30285 9487
306 9487 27552 -8930 -25748 6927 23405 -4938 -22666 1763 22774 2343 -22364 -4676
318 -4676 23138 6117 -23687 -5212 25384 4317 -26917 -3939 27503 4625 -26670 -6424
330 -6424 24559 8598 -22316 -11036 21089 14367 -20062 -17072 20277 19784 -20139 -21136 19728
343 19728 20557 -19451 -19549 18041 17330 -17265 -16897 14477 16410 -11999 -17365 9143 18917 -6542
357 -6542 -19724 6197 21771 -5343 -22164 6458 23378 -5782 -22551 5348 21704 -3678
369 -3678 -20342 1084 18879 1174 -19042 -4675 19086 7355 -20179 -9888 20949 11355
381 11355 -20976 -11571 20582 11130 -19440 -10296 18138 10371 -16591 -11402 14510 12843 -12883
394 -12883 -15077 11548 16682 -11250 -17833 11996 19101 -12244 -18814 13100 19108 -11982 -17828
407 -17828 10953 16936 -8979 -16307 6940 16378 -5479 -18461 2895 19902 -1513 -22131 -857
420 -857 22133 1814 -21351 -2158 19711 2292 -17388 -2226 15936 3852 -13730 -5167 12729
433 12729 7061 -12002 -8063 12658 8626 -14406 -9280 16376 10136 -17710 -11401 17169 12824
446 12824 -14473 -13153 11357 13393 -8232 -13469 6498 14595 -5473 -16442 4482 17709 -4441
459 -4441 -18483 4329 17444 -5899 -17033 6871 16917 -6981 -17279 5552 18089 -1963
471 -1963 -17359 -896 16727 3561 -15215 -3603 14945 2950 -15634 -2374 16264 2379
483 2379 -16423 -3595 14322 3771 -12699 -4157 11599 4968 -11764 -7300 12420 10981 -11756
496 -11756 -14014 10328 15309 -8545 -14377 7646 12153 -7869 -10483 8047 9529 -7865 -10071
509 -10071 5998 10739 -3506 -10659 2222 11002 -2064 -11942 3230 14761 -2857 -17160 1092
522 1092 17820 1350 -16293 -3359 13266 3112 -11890 -3124 11636 3117 -12885 -4529 13715
535 13715 6544 -12962 -7383 11567 7259 -9686 -5549 9500 5131 -9649 -6279 9432 8967 -7796
549 -7796 -11569 5187 12096 -4059 -11661 4969 11242 -7236 -12022 8631 13538 -7992 -13763 5995
563 5995 12412 -3661 -10108 2392 8341 -2083 -8827 1054 10388 613 -12565 -3586 12917 5672
577 5672 -11827 -5821 10520 4411 -10134 -2694 11506 3580 -11935 -5831 11182 8312 -8852
590 -8852 -9101 7029 8197 -7526 -7885 8891 8021 -10655 -9577 10424 10937 -8600 -10994 6303
604 6303 10178 -4575 -9135 4570 9803 -4523 -11817 3869 14120 -2012 -14757 105 13040
617 13040 -258 -10875 1777 9682 -3295 -10017 3077 10921 -605 -10526 -2084 9623 4163
630 4163 -8358 -4538 8638 4374 -10222 -4948 11647 6065 -12276 -7949 10479 8311 -8302
643 -8302 -7619 6529 6390 -6440 -6201 7362 8180 -7243 -10262 6253 11810 -4369 -11221 3649
657 3649 10025 -4249 -9512 4745 9768 -4471 -10923 2598 11168 -442 -10636 -959 9770
670 9770 1069 -9570 3 10810 -401 -12300 -214 13054 1746 -12177 -2954 10120 3181
683 3181 -8670 -3128 8239 3543 -8827 -5291 9033 7443 -8207 -8508 7367 8425 -6404 -7005
697 -7005 6795 6191 -7215 -6298 7130 7185 -6022 -8361 3877 8599 -2413 -8716 1763 8726
711 8726 -2333 -9670 2722 10996 -2107 -11503 1111 11100 171 -9558 -549 8513 731 -8468
725 -8468 -1281 9005 2341 -9907 -4099 9898 5162 -9388 -5369 8862 4752 -8663 -3962 8897
739 8897 4197 -8619 -4852 7851 6038 -6500 -6758 5266 6883 -5092 -7276 5326 7784 -6065
753 -6065 -8890 5866 9372 -5194 -9120 4116 8489 -3102 -7588 2637 7763 -1688 -8235 684
767 684 9049 622 -9575 -1691 9350 1813 -9132 -1582 8789 1028 -8829 -1125 8636 1923
781 1923 -8048 -2921 7382 4040 -6570 -4577 6579 5173 -6975 -5836 7487 6410 -7841 -6982
795 -6982 7248 7052 -6657 -6865 5797 6500 -5092 -6576 4524 7291 -3658 -7837 3028 8652
809 8652 -2295 -8656 2098 8590 -2233 -8385 2260 8157 -2176 -8035 1364 7694 -421 -7395
823 -7395 -608 7163 1449 -7125 -1857 7608 2455 -7970 -2757 8185 3113 -7889 -3346 7179
837 7179 3372 -6594 -3680 5744 4013 -5303 -4943 4745 5805 -4399 -6491 4146 7020 -3941 -6881
852 -6881 4135 6851 -3952 -6641 3769 6520 -3240 -6533 2271 6387 -1591 -6771 773 7093
866 7093 -389 -7612 71 8183 194 -8270 -314 8277 667 -7727 -830 7100 1298 -6511 -1980
881 -1980 6054 2611 -5884 -3569 5609 4082 -5664 -4522 5553 4551 -5593 -4498 5505 4506 -5037
896 -5037 -4354 4535 4663 -3713 -4907 2988 5389 -2439 -5996 2108 6433 -2054 -7009 1891 7198 -1787
912 -1787 -7172 1531 6912 -1157 -6471 583 6342 189 -6131 -926 6166 1728 -6373 -2297 6389
927 6389 2572 -6617 -2741 6563 2542 -6469 -2534 6106 2651 -5573 -2870 5041 3370 -4410 -3912
942 -3912 4271 4513 -4013 -5053 4046 5481 -4039 -5668 3900 5609 -3707 -5407 3173 5184 -2571
957 -2571 -5078 1945 5237 -1140 -5390 620 5796 2 -6061 -163 6205 96 -6268 -117 6096
972 6096 85 -5894 -517 5400 833 -4961 -1455 4848 2129 -4694 -2710 4901 3390 -5014 -3622
987 -3622 5264 3921 -5179 -3919 4918 3798 -4460 -3809 3736 3789 -3271 -4151 2702 4585 -2164 -4969
1003 -4969 1954 5330 -1728 -5397 1945 5530 -1876 -5409 1832 5188 -1474 -4958 970 4755 -450
1018 -450 -4721 -285 4785 747 -5017 -1096 5344 1427 -5544 -1545 5631 1794 -5184 -1781 4886
1033 4886 1855 -4393 -2194 3997 2559 -3676 -3290 3251 3735 -3139 -4149 3114 4233 -3215 -4261
1048 -4261 3297 4235 -3118 -4002 2923 4096 -2406 -4093 1862 4200 -1227 -4439 864 4678 -728
1063 -728 -5188 476 5456 -332 -5524 241 5270 -110 -4885 27 4653 385 -4336 -872 4228
1078 4228 1455 -4153 -2010 4150 2258 -4248 -2497 4257 2338 -4382 -2315 4210 2273 -3944 -2470
1093 -2470 3534 2758 -2811 -2890 2455 3252 -2278 -3648 2246 4095 -2218 -4482 2027 4477 -1965 -4397
1109 -4397 1671 4040 -1527 -3888 1121 3758 -572 -3692 85 3999 493 -4070 -770 4245 926
1124 926 -4282 -802 4340 621 -4500 -717 4209 929 -3922 -1337 3449 1496 -3168 -1952 3154
1139 3154 2346 -3125 -2739 3280 3142 -3159 -3242 3054 3189 -2929 -3020 2536 2813 -2288 -2876 1893 3012
1156 3012 -1440 -3356 986 3656 -679 -3666 666 3825 -717 -3833 806 3870 -727 -3818 338
1171 338 3529 -62 -3261 -435 3069 765 -3241 -1147 3397 1490 -3561 -1728 3685 1962 -3597
1186 -3597 -1946 3358 1912 -3091 -1810 2819 1952 -2563 -2286 2248 2610 -1973 -2978 1724 3139 -1802
1202 -1802 -3172 1984 3263 -1966 -3243 1989 3275 -1642 -3107 1332 3006 -946 -2990 483 3089
1217 3089 -287 -3362 -11 3531 163 -3748 -348 3669 415 -3451 -376 3221 471 -2979 -631
1232 -631 2868 1014 -2601 -1507 2455 1787 -2445 -1989 2471 2021 -2625 -2098 2667 2136 -2678 -2135 2410
1249 2410 2230 -1979 -2168 1692 2303 -1409 -2472 1288 2845 -1118 -3148 927 3312 -867 -3370 803
1265 803 3088 -741 -2937 667 2825 -376 -2668 10 2692 393 -2675 -682 2667 908 -2695
1280 -2695 -960 2832 898 -3017 -986 2819 1000 -2745 -1187 2411 1309 -2107 -1438 1863 1673
1295 1673 -1798 -1987 1832 2353 -1706 -2533 1699 2523 -1588 -2448 1511 2299 -1400 -2277 1072 2263 -898
1312 -898 -2403 509 2434 -205 -2611 98 2765 29 -2810 34 2955 -37 -2878 -56 2767
1327 2767 157 -2518 -481 2298 583 -2239 -1013 2228 1240 -2384 -1481 2354 1714 -2350 -1709 2279
1343 2279 1726 -2189 -1583 2037 1584 -1806 -1672 1495 1834 -1309 -1970 1007 2186 -991 -2404 943
1359 943 2456 -1009 -2514 1046 2577 -904 -2446 737 2352 -512 -2235 257 2254 27 -2335
1374 -2335 -336 2492 472 -2600 -692 2592 726 -2536 -694 2511 765 -2350 -718 2112 981
1389 981 -1947 -1080 1786 1347 -1665 -1574 1682 1703 -1764 -1856 1695 1880 -1735 -1828 1638 1832 -1439 -1853
1407 -1853 1255 1801 -941 -1922 766 2024 -544 -2236 397 2290 -326 -2469 257 2397 -288
1422 -288 -2413 204 2195 -71 -2070 -40 2037 323 -1884 -557 1927 851 -1935 -973 2016
1437 2016 1059 -2101 -1123 2017 1093 -2063 -1134 1798 1156 -1710 -1309 1434 1391 -1291 -1624 1202 1891
1454 1891 -1083 -1965 1008 2069 -943 -2122 969 2043 -826 -1949 694 1852 -536 -1869 288
1469 288 1834 -95 -1944 -108 2042 266 -2090 -274 2238 333 -2240 -394 2175 373 -2029
1484 -2029 -530 1838 667 -1771 -845 1670 1062 -1624 -1320 1550 1445 -1559 -1513 1663 1536 -1507 -1481
1501 -1481 1445 1530 -1321 -1429 1206 1528 -964 -1600 745 1735 -597 -1858 571 1984 -514 -2065
1517 -2065 472 2108 -420 -2030 415 2019 -237 -1866 118 1844 96 -1818 -338 1797 493
1532 493 -1841 -728 1936 740 -1904 -811 1860 766 -1771 -793 1759 918 -1573 -980 1391 1060
1548 1060 -1271 -1236 1164 1397 -1204 -1544 1187 1660 -1182 -1633 1019 1608 -1025 -1571 851 1594 -715
1565 -715 -1542 501 1589 -331 -1653 199 1811 -48 -1886 -39 1871 89 -1894 -55 1763
1580 1763 142 -1754 -246 1601 391 -1563 -483 1503 706 -1469 -763 1530 954 -1498 -1065 1526
1596 1526 1069 -1543 -1092 1415 1115 -1322 -1191 1112 1198 -994 -1275 873 1414 -751 -1503 685 1712
1613 1712 -607 -1719 569 1702 -601 -1730 552 1598 -403 -1598 198 1532 -109 -1514 -25
1628 -25 1621 202 -1628 -264 1723 417 -1708 -424 1800 432 -1650 -491 1559 614 -1439 -665
1644 -665 1369 781 -1224 -996 1185 1138 -1187 -1190 1200 1254 -1139 -1207 1144 1313 -1020 -1251 917 1271 -789
1663 -789 -1281 618 1334 -523 -1418 373 1535 -345 -1581 349 1598 -229 -1678 216 1610 -98
1679 -98 -1510 2 1419 103 -1425 -202 1451 348 -1421 -560 1368 604 -1441 -636 1400 735
1695 735 -1426 -625 1348 666 -1194 -732 1149 834 -1028 -893 904 1057 -880 -1133 875 1229 -840
1712 -840 -1276 837 1333 -724 -1315 657 1263 -597 -1252 468 1244 -225 -1261 129 1348 -43 -1396
1729 -1396 -93 1466 43 -1429 -65 1381 66 -1352 -203 1303 307 -1177 -385 1150 472 -1093
1745 -1093 -581 1113 733 -1066 -792 1221 803 -1118 -889 1101 894 -1048 -914 890 889 -781 -977 689
1763 689 1085 -596 -1114 598 1210 -415 -1231 483 1312 -414 -1302 411 1217 -346 -1203 228 1261
1780 1261 -187 -1187 17 1153 128 -1207 -176 1225 297 -1332 -268 1339 298 -1261 -333
1795 -333 1184 381 -1107 -471 1027 538 -973 -679 829 803 -847 -834 885 940 -850 -924 838 945
1813 945 -753 -934 749 908 -647 -864 541 958 -463 -1030 378 1078 -328 -1152 228 1178 -200
1830 -200 -1255 185 1216 -104 -1165 110 1039 -73 -1062 -49 980 163 -999 -292 1004 408
1846 408 -1010 -466 1072 470 -1037 -449 1044 523 -939 -466 864 550 -762 -588 738 654 -656
1863 -656 -742 576 858 -615 -888 582 971 -597 -932 511 857 -394 -896 345 875 -333 -894 172
1881 172 962 -37 -1008 -32 1064 -3 -1058 -10 1046 42 -1023 -77 1056 91 -956 -139 914
1898 914 241 -823 -323 880 461 -786 -491 799 560 -845 -557 853 566 -839 -591 762 618
1915 618 -719 -619 583 703 -512 -784 440 830 -432 -840 379 889 -385 -891 313 926 -329
1932 -329 -913 267 832 -208 -833 29 825 15 -867 -87 882 189 -927 -168 1009 214 -915 -187
1950 -187 853 231 -830 -272 754 313 -768 -341 696 476 -676 -581 617 577 -659 -609 657 633
1968 633 -623 -618 597 637 -567 -594 477 676 -371 -711 358 703 -272 -734 248 791 -227 -830 228
1987 228 858 -163 -782 149 775 -100 -787 4 719 7 -745 -142 689 180 -711 -240 757 306 -753
2006 -753 -322 786 322 -756 -329 657 306 -619 -371 581 449 -558 -471 462 579 -471 -668 456 670
2025 670 -547 -633 450 649 -397 -605 385 581 -314 -655 263 683 -137 -656 95 751 -98 -793 29
2044 29 742 -8 -771 14 715 -3 -712 -84 724 116 -622 -168 604 239 -586 -246 664 355 -626 -322
2064 -322 659 412 -623 -433 590 401 -518 -401 499 437 -412 -492 422 543 -404 -643 351 674 -300 -630
2084 -630 297 631 -240 -692 272 633 -223 -619 184 588 -146 -636 72 697 48 -699 -33 721 173 -694
2104 -694 -102 736 85 -645 -82 605 130 -582 -178 553 273 -504 -327 495 433 -519 -445 478 482 -468 -487 527
2126 527 483 -490 -412 428 462 -395 -500 301 500 -263 -547 173 596 -183 -584 136 631 -167 -589 119 631
2147 631 -68 -578 100 583 -28 -535 20 575 77 -607 -192 613 232 -562 -207 608 232 -618 -161 586
2167 586 223 -537 -255 483 254 -421 -319 448 442 -368 -386 425 413 -377 -493 369 503 -372 -455 348 504 -288
2189 -288 -455 238 523 -122 -510 94 547 -45 -566 47 570 -45 -578 26 518 -31 -566 -34 581 -3
2209 -3 -535 -69 526 118 -579 -166 484 264 -452 -287 498 277 -593 -296 531 257 -475 -310 484 295 -410
2230 -410 -306 347 372 -329 -436 338 486 -237 -505 279 562 -261 -492 274 540 -238 -512 191 521 -175
2250 -175 -497 85 500 -75 -464 8 538 26 -510 -76 558 101 -545 -21 475 98 -552 -144 485 150
2270 150 -491 -231 374 231 -404 -285 386 315 -467 -368 436 369 -423 -425 392 351 -370 -387 324 382 -319 -444 220
2293 220 538 -168 -526 169 447 -116 -532 156 549 -145 -511 138 485 -123 -494 41 472 10 -456 -49
2313 -49 444 100 -484 -120 479 202 -533 -160 476 244 -419 -224 441 257 -452 -243 394 275 -383 -357 351
2334 351 357 -293 -372 378 385 -345 -427 309 430 -270 -404 243 444 -214 -399 155 443 -96 -441 92 463 -52
2356 -52 -480 71 482 -83 -512 2 523 5 -525 -13 478 86 -468 -15 412 163 -472 -253 472 175
2376 175 -450 -283 472 222 -371 -202 389 260 -362 -320 353 279 -324 -345 288 329 -266 -413 257 389 -275
2397 -275 -423 199 391 -171 -368 178 440 -103 -451 79 451 -94 -467 33 478 24 -426 -6 495 49
2417 49 -481 -18 494 77 -467 -75 374 97 -383 -106 385 160 -320 -215 382 235 -304 -275 375 283 -337
2438 -337 -288 394 270 -269 -264 304 347 -253 -325 259 353 -171 -355 188 401 -131 -386 139 437 -73 -383 92
2460 92 436 -33 -474 60 379 17 -371 -14 429 72 -333 -108 446 145 -415 -152 402 176 -426 -217
2480 -217 411 190 -391 -194 354 214 -293 -230 302 256 -283 -287 290 406 -300 -342 288 337 -226 -331 289 398
2502 398 -174 -373 132 364 -92 -391 121 387 -46 -429 55 396 23 -487 -66 365 14 -424 -49 347
2522 347 29 -342 -60 370 115 -288 -145 400 182 -365 -247 358 239 -323 -218 355 242 -318 -282 281
2542 281 203 -196 -241 215 315 -184 -263 165 287 -187 -371 143 382 -129 -374 122 380 -132 -340 66 388
2563 388 -45 -329 59 336 22 -385 -16 380 6 -352 -71 347 77 -380 -135 347 105 -327 -76 302
2583 302 150 -322 -192 303 226 -237 -280 251 271 -232 -238 316 270 -284 -312 279 321 -191 -266 204 315 -120 -302
2606 -302 72 348 -117 -377 51 415 -74 -368 83 345 -29 -383 23 344 -22 -410 -30 411 79 -307
2626 -307 -101 365 75 -356 -138 342 143 -304 -190 342 139 -342 -225 280 174 -279 -211 266 241 -225 -208
2647 -208 265 230 -220 -302 231 294 -183 -307 192 306 -144 -289 97 302 -113 -297 64 343 -17 -351 93
2668 93 404 -31 -361 -12 366 30 -400 -24 351 14 -301 -103 345 76 -319 -77 331 89 -317 -139
2688 -139 352 200 -230 -189 276 196 -232 -206 251 237 -275 -230 215 235 -234 -273 232 284 -167 -285 157 341 -147
2711 -147 -298 117 330 -184 -345 103 306 -74 -218 36 292 5 -308 -24 313 27 -284 -12 289 89
2731 89 -294 -60 298 72 -287 -165 300 50 -263 -57 296 164 -248 -189 279 209 -176 -223 220 201 -240 -243
2753 -243 225 242 -256 -269 171 243 -220 -285 94 248 -128 -273 72 261 -97 -311 48 340 -42 -303 86
2774 86 317 -24 -297 -16 285 18 -268 -61 301 57 -314 -49 262 161 -264 -91 344 92 -302 -164
2794 -164 237 141 -291 -139 280 146 -219 -173 165 208 -226 -273 192 205 -206 -253 113 280 -184 -246 130 271
2816 271 -79 -246 71 264 -49 -319 57 315 -52 -285 37 313 9 -310 65 326 20 -316 -54 259
2836 259 -2 -251 -88 255 96 -240 -51 265 133 -227 -130 277 107 -217 -155 244 232 -144 -133 183 230 -160
2858 -160 -184 147 212 -151 -279 175 241 -138 -236 141 254 -85 -265 73 183 -21 -237 -2 282 -70 -246
2879 -246 43 230 6 -212 -55 286 29 -274 -58 249 45 -256 -49 267 50 -217 -129 184 126 -195 -92
2900 -92 268 170 -190 -136 214 207 -216 -142 192 224 -177 -173 125 225 -152 -235 108 198 -143 -226 96 210 -100 -261
2924 -261 113 246 -58 -221 24 232 -48 -278 83 253 -46 -274 31 236 -2 -225 -23 214 40 -237
2944 -237 -68 195 77 -212 -101 218 97 -227 -101 217 102 -194 -180 194 142 -122 -233 170 183 -160 -194
2965 -194 139 185 -142 -211 190 188 -90 -212 130 241 -55 -216 104 262 -61 -170 60 259 -62 -213 -9
2986 -9 253 -40 -275 -34 209 -34 -222 -12 234 -4 -200 -84 186 107 -262 -73 206 83 -181 -188 201 136
3008 136 -199 -89 200 130 -205 -195 147 205 -129 -185 165 195 -123 -220 114 295 -85 -200 100 290 -37 -257
3030 -257 54 273 -18 -185 15 235 34 -191 -1 286 19 -270 -19 253 18 -255 -34 230 89 -208
3050 -208 -49 167 114 -217 -143 183 141 -179 -96 202 210 -175 -187 149 198 -188 -144 137 159 -151 -192 116 198 -77
3074 -77 -175 83 250 -49 -244 51 254 -98 -233 100 207 -36 -272 14 234 0 -236 42 216 80 -154
3095 -154 -54 235 78 -193 -51 211 89 -231 -30 196 113 -193 -171 244 136 -161 -79 140 112 -130 -153 128
3117 128 195 -171 -208 91 279 -77 -185 86 225 -89 -221 75 209 -66 -195 90 238 -23 -251 -7 267
3138 267 48 -195 -35 217 8 -206 -22 282 12 -157 -65 194 57 -222 -74 209 200 -137 -91 224 174 -176
3160 -176 -89 214 173 -201 -129 224 141 -104 -187 128 176 -111 -217 33 216 -90 -239 64 251 -56 -221 40
3182 40 233 -109 -248 60 217 2 -262 -19 154 14 -201 -23 222 59 -217 -79 199 82 -212 -112
3202 -112 201 63 -200 -140 192 120 -193 -201 187 161 -129 -125 145 236 -166 -168 152 197 -89 -167 125 222 -157 -211 168
3227 168 172 -126 -201 112 198 -22 -222 54 261 -39 -266 -1 257 -6 -241 0 232 12 -240 -73 231
3248 231 58 -258 -58 241 73 -235 -97 199 80 -199 -186 234 157 -204 -135 189 158 -240 -146 162 170 -153
3270 -153 -172 120 152 -170 -229 80 210 -40 -244 76 233 -60 -185 112 191 -36 -240 -13 233 -30 -222
3291 -222 -58 211 18 -218 -81 162 -13 -264 -59 228 93 -211 -133 201 121 -186 -85 228 111 -182 -115
3312 -115 172 163 -170 -214 214 215 -132 -146 223 149 -161 -174 203 206 -144 -250 89 259 -79 -223 29 252 -63
3335 -63 -288 1 296 -41 -264 -73 255 -14 -199 -29 208 81 -249 -40 200 50 -256 -44 220 110
3355 110 -219 -102 238 94 -236 -92 216 157 -195 -164 192 135 -166 -226 162 207 -148 -185 162 219 -144 -192 100
3378 100 209 -125 -267 99 239 -67 -296 57 184 -21 -246 14 258 23 -182 18 255 9 -185 -8
3398 -8 238 10 -220 -19 216 98 -207 -79 186 88 -219 -84 229 137 -180 -184 209 153 -154 -134 133 170 -138
3421 -138 -217 152 145 -145 -203 125 230 -94 -223 97 246 -27 -257 40 261 -51 -224 30 219 -10 -209
3442 -209 -18 228 -23 -197 7 279 71 -234 -127 191 82 -230 -91 205 142 -200 -68 213 153 -187 -132
3463 -132 219 122 -175 -98 173 147 -144 -165 189 150 -103 -225 134 182 -117 -229 138 251 -84 -174 92 211
3485 211 4 -225 83 195 -13 -220 31 264 -18 -294 -5 264 -5 -274 -86 200 10 -231 -64 243
3505 243 102 -175 -111 142 102 -191 -139 230 108 -167 -150 221 173 -157 -169 130 140 -141 -172 161 157 -97 -200
3528 -200 87 241 -103 -229 53 188 -100 -253 135 188 -61 -256 -1 209 15 -213 12 249 1 -230
3548 -230 -14 224 20 -217 -54 220 60 -218 -67 265 96 -170 -126 163 142 -180 -82 145 137 -155 -145 138
3570 138 194 -161 -171 147 140 -182 -195 164 163 -78 -163 115 84 -85 -193 6 180 -55 -209 -15 201 -61 -262
3593 -262 27 163 29 -171 -4 167 34 -208 -90 182 61 -222 -24 169 112 -166 -131 202 87 -222 -142
3614 -142 168 132 -137 -118 173 115 -93 -111 138 158 -128 -156 71 185 -111 -238 90 158 -104 -181 51 182 -83
3637 -83 -172 77 229 0 -199 50 233 12 -187 -16 173 28 -138 6 188 90 -217 -51 217 89 -165
3658 -165 -87 183 53 -146 -88 184 120 -159 -93 137 161 -124 -121 133 155 -167 -110 132 123 -130 -141 139 130 -81 -158
3683 -158 61 216 8 -211 82 186 -68 -180 -41 169 -50 -147 24 189 5 -131 45 172 5 -184
3703 -184 -25 124 70 -166 22 130 -15 -200 -60 176 70 -92 -24 150 131 -154 -71 145 73 -91 -101 131
3725 131 147 -91 -185 125 178 -110 -172 67 204 -62 -118 83 150 21 -151 58 152 -23 -136 -18 137 14
3747 14 -244 -49 135 2 -184 -37 223 -10 -166 -56 156 39 -99 -64 132 43 -133 -119 128 158 -165 -109
3769 -109 154 162 -183 -124 84 151 -91 -168 108 113 -130 -154 125 116 -94 -114 76 200 -47 -161 -4 192 -60 -98
3793 -98 18 172 -38 -192 -8 170 31 -205 15 147 48 -132 -24 148 36 -162 -38 143 72 -189 -46
3814 -46 169 62 -124 -68 113 58 -72 -40 93 135 -150 -130 119 86 -145 -148 65 92 -110 -156 63 157 -66 -135
3838 -135 48 118 -3 -185 20 42 1 -120 25 108 -52 -194 0 177 -7 -113 -50 160 7 -161 -45 126
3860 126 36 -119 -82 161 33 -137 -53 159 74 -134 -82 122 64 -89 -62 79 68 -85 -180 100 55 -100 -170 108
3884 108 86 -79 -103 52 168 -59 -138 13 133 -18 -133 78 131 9 -110 47 169 22 -136 -24 173
3905 173 -46 -156 -4 121 15 -142 -12 161 58 -118 -60 143 70 -93 -51 116 92 -61 -43 79 126 -115
3927 -115 -55 117 105 -72 -89 53 126 -52 -115 107 168 -118 -130 76 118 -8 -138 55 163 -54 -159 0 147
3950 147 -41 -137 -9 108 -51 -113 -23 65 15 -97 30 103 24 -97 -29 107 71 -57 -39 109 54 -124 -87 70
3974 70 32 -100 -55 127 73 -107 -43 47 93 -30 -49 47 59 -67 -127 68 66 -28 -70 78 158 -49 -103 51 124 -60
4000 -60 -133 -8 155 -61 -125 -38 107 20 -116 41 75 8 -86 7 94 -11 -153 -12 98 -23 -109 -61 105 33
4024 33 -106 -59 59 58 -122 -63 75 27 -74 -111 61 54 -146 -44 27 56 -8 -146 55 96 -70 -110 0 96 -43
4049 -43 -101 79 70 21 -89 -1 74 -52 -93 -28 103 -27 -72 39 111 -12 -93 -29 113 -17 -116 -76 59 4 -71 -73
4075 -73 77 81 -114 -25 30 85 -141 -87 83 94 -79 -33 76 30 -128 -93 51 105 -47 -84 41 79 -88 -83 20
4100 20 65 -51 -64 62 62 -24 -83 16 62 -4 -68 -40 71 -16 -112 18 116 18 -119 6 69 -61 -105 12 74 -27
4126 -27 -116 -20 111 94 -51 -55 84 64 -106 -32 65 129 -69 -38 74 -19 -48 -44 34 26 7 -57 79 74 -27 -96 106 88
4154 88 -86 -73 48 76 -13 -86 35 83 -21 -73 16 81 -16 -88 -33 129 38 -69 7 65 -39 -54 -11 52 -14 -59 -25
4181 -25 64 1 -87 -60 94 22 -45 -65 46 37 -50 -18 103 80 -59 -73 91 100 -47 -50 27 62 -68 -104 15 26 15 -82
4209 -82 -1 -3 -16 -63 -1 74 -41 -134 1 118 -1 -69 23 45 6 -87 5 48 29 -116 15 94 -1 -79 -81 103 35 -53
4237 -53 -58 114 54 -94 -18 114 56 -46 -72 29 42 -89 -49 22 12 -64 -15 21 108 -70 -50 69 57 7 -116 15
4263 15 139 1 -137 -9 61 -26 -27 -40 48 -15 -111 -42 90 3 -127 -33 91 -14 -95 14 77 33 -52 5 43 8
4289 8 -108 -64 41 45 -106 -67 78 30 -79 -27 51 23 -51 -24 40 81 10 -20 29 53 -68 -20 12 36 -38 -92 -5 38
4317 38 37 -108 -11 79 -45 -75 3 96 -37 -52 -41 65 35 -72 -29 81 5 -82 -40 72 17 -49 -98 91 39 -76
4343 -76 -64 65 66 -66 -13 22 55 -19 -75 71 55 -59 -1 56 58 -26 -93 84 132 -57 -71 11 90 -49 -66 5 146
4370 146 -72 -162 -31 92 -27 -160 -34 59 12 -87 4 88 22 -96 -88 75 35 -112 -37 75 52 -33 -18 56 16
4395 16 -98 -53 65 61 -27 -77 59 52 -66 -98 62 76 -61 -65 48 26 -75 -113 -12 43 -82 -89 19 46 -47 -84 5
4422 5 39 -78 -91 -17 80 8 -80 -3 74 20 -99 -2 108 -23 -63 -18 103 -13 -124 -83 73 89 -40 -33 75 -12
4448 -12 -117 -8 122 39 -58 -25 52 86 -48 -9 30 77 -93 -118 89 83 -71 -102 20 63 -4 -101 73 78 20 -107
4474 -107 39 137 -8 -81 -34 88 -25 -105 -6 81 25 -103 -64 46 29 -119 -36 50 10 -58 -27 84 89 -79 -19 77
4500 77 27 -92 -33 97 53 -132 -57 72 50 -60 -77 89 25 -66 -56 45 76 23 -56 25 43 -20 -21 41 36 -72 -116
4527 -116 8 141 5 -71 23 78 8 -125 -61 79 11 -95 -70 119 62 -104 -41 58 -22 -53 -63 86 17 -93 -9
4552 -9 74 63 -34 -80 117 62 -103 -65 91 33 -45 -15 20 102 -83 -61 55 72 -34 -84 -5 63 73 -24 27 60 -33 -73
4580 -73 30 92 5 -63 -40 81 10 -71 10 77 8 -77 -13 82 12 -83 44 99 62 -94 -42 44 78 -78 -52 75 34
4607 34 -97 -41 91 36 -25 -93 77 75 -77 -79 80 65 -42 -61 32 46 13 -91 47 74 -32 -108 -40 116 0 -124
4633 -124 8 103 41 -83 -20 85 21 -114 67 77 4 -87 -24 80 15 -28 -45 71 28 -88 -19 108 84 -75 -69
4658 -69 65 42 -77 -38 82 31 -77 -75 42 50 -24 -73 63 37 -45 -80 74 49 -6 -121 -5 130 -52 -56 -33 70
4684 70 -22 -69 36 92 -13 -103 2 94 6 -31 -25 148 51 -69 -16 76 13 -75 -39 73 100 -81 -100 82 58 -112
4710 -112 -56 79 24 -91 -68 81 113 -53 -85 50 93 -52 -76 31 50 -93 -140 1 156 -59 -81 -15 67 7
4734 7 -85 54 70 -44 -99 35 141 -36 -85 -17 88 12 -31 -58 138 24 -129 -85 52 49 -103 -101 102 25 -83
4759 -83 -75 65 87 -93 -97 57 73 -55 -56 131 46 -40 -50 26 139 -49 -92 -33 102 -23 -98 -1 109 -30 -61 3
4785 3 71 -52 -93 -24 76 -6 -104 -28 105 -22 -112 -38 133 40 -117 17 94 31 -151 -40 82 45 -83 -55 61
4810 61 124 -71 -70 91 108 -33 -94 86 64 -46 -131 46 76 -61 -69 29 126 -64 -142 23 115 -31 -130 -9 151
4835 151 -21 -123 -17 93 -25 -152 -53 164 24 -130 -35 66 -18 -87 -22 133 7 -84 -40 105 80 -15 -65
4858 -65 76 97 -104 -79 77 115 -97 -109 122 96 -84 -110 53 87 -64 -147 35 144 -36 -174 41 61 -82
4881 -82 -131 -1 112 -65 -142 -32 137 -14 -105 -27 102 -46 -146 -71 70 18 -62 -58 105 60 -82 -56 110 79
4905 79 -86 -97 106 75 -95 -110 47 59 -16 -131 89 49 -96 -115 70 104 -84 -95 50 68 -27 -74 38 117 -23
4930 -23 -120 11 120 -22 -137 -8 137 -34 -153 -3 131 -24 -124 -51 121 27 -117 -76 137 50 -79 -75 88
4953 88 61 -146 -96 123 35 -105 -65 68 69 -99 -89 113 95 -78 -156 107 93 -97 -137 46 117 -83 -116 69 133
4978 133 -48 -151 43 171 1 -144 41 112 42 -170 49 180 13 -220 1 115 19 -132 -24 179 18
4999 18 -119 -73 144 68 -118 -81 87 57 -122 -142 148 140 -102 -33 128 73 -71 -102 75 125 -106 -71 70 136 -56
5024 -56 -131 75 111 -140 -118 2 112 -3 -74 64 157 -31 -126 20 127 7 -146 -46 128 36 -84 -13 123
5047 123 56 -160 -59 157 18 -198 -30 84 75 -95 -74 95 97 -105 -78 115 137 -125 -118 143 118 -26 -57 131
5071 131 98 -55 -144 37 118 -91 -71 62 127 -88 -138 -13 78 -56 -135 44 114 -2 -168 58 129 -3 -178
5094 -178 -53 50 38 -113 -19 131 101 -90 -114 121 83 -147 -55 101 88 -138 -95 139 93 -135 -98 79 107 -102
5118 -102 -172 97 124 -57 -76 28 149 -66 -110 39 134 -38 -164 52 79 -47 -132 74 73 -81 -97 -20 166 42
5142 42 -129 37 99 47 -173 -55 116 0 -96 -30 82 90 -154 -40 72 112 -100 -142 86 52 -113 -111 101 96 -116
5167 -116 -136 87 85 -67 -66 90 141 -74 -92 57 68 -36 -153 91 151 -32 -149 8 142 -53 -118 32 139
5190 139 -4 -107 9 174 10 -117 -14 153 8 -130 -46 79 13 -168 -49 133 85 -105 -83 119 32 -143
5212 -143 -85 61 77 -114 -98 98 97 -128 -128 74 72 -92 -138 137 154 -26 -181 57 106 -49 -143 20 135 -20
5236 -20 -164 6 103 -40 -112 3 139 4 -93 -10 144 56 -180 26 90 72 -84 -14 129 44 -139 -75 95 58
5260 58 -72 -102 118 90 -127 -82 57 36 -66 -96 67 126 -36 -137 45 103 -69 -101 72 141 -18 -98 29 105
5284 105 -71 -111 -11 172 30 -125 -50 118 -8 -77 -50 153 -25 -121 29 123 22 -85 -53 105 57 -118 -31
5307 -31 128 13 -147 -73 89 96 -142 -50 73 108 -112 -78 88 93 -58 -139 53 87 -38 -172 61 157 -64 -175
5331 -175 -3 160 -63 -144 20 163 -24 -160 15 122 -19 -125 -1 178 18 -100 -7 121 103 -148 -77
5352 -77 128 9 -107 -93 112 103 -108 -7 118 9 -90 -81 109 65 -107 -42 78 122 -48 -165 40 132 -58 -84
5376 -84 3 123 -55 -154 1 123 -52 -138 51 143 -43 -127 55 155 -51 -93 7 139 15 -138 -43 111 -53
5399 -53 -128 -45 147 27 -109 -71 141 71 -148 -30 103 72 -125 -85 90 101 -105 -66 48 80 -67 -122 91 127
5423 127 -130 -64 61 123 -53 -90 14 66 -53 -107 -8 91 -19 -139 55 125 -21 -133 60 139 11 -151 -27
5446 -27 103 49 -67 -21 113 26 -124 -43 148 51 -148 -60 81 53 -131 -61 89 55 -109 -94 100 93 -71 -88 48
5471 48 98 -89 -111 102 91 -21 -107 45 93 -26 -122 23 124 8 -76 32 130 2 -88 17 140 9 -134
5494 -134 19 98 -11 -68 -72 95 1 -79 -67 109 80 -41 -30 124 75 -90 -97 87 118 -142 -47 62 70 -87 -53 72
5520 72 99 -39 -96 90 59 -58 -129 43 111 -60 -86 68 166 -66 -104 54 90 -32 -141 24 59 -38 -119 16
5544 16 133 28 -94 -25 56 -1 -109 -63 137 -28 -126 -35 100 0 -95 -21 90 48 -108 -50 95 93 -111 -40 100
5569 100 42 -87 -71 80 139 -12 -84 94 73 -65 -81 2 118 -24 -112 -10 83 -37 -138 -11 124 -19 -151
5592 -151 15 80 -16 -136 5 106 23 -77 -23 128 47 -83 -88 94 46 -84 -5 127 8 -75 -20 64 61 -102 -75
5617 -75 52 74 -74 -99 58 81 -74 -121 104 93 -37 -64 32 147 -63 -98 83 54 -23 -52 14 87 -50 -160 65
5642 65 132 -55 -89 -22 92 12 -144 -19 82 7 -76 -25 69 -4 -138 -40 100 35 -113 -49 35 92 -75 -86 58
5667 58 87 -77 -97 100 96 -105 -107 79 122 -66 -98 88 84 -84 -75 48 117 -13 -144 48 65 -47 -115 -8 64 -13
5693 -13 -143 17 121 29 -168 47 114 38 -98 -1 125 -2 -27 -23 8 -3 -197 -24 95 5 -77 -60 66 90 -34
5718 -34 -41 38 89 -8 -88 60 74 -41 -100 84 59 -49 -94 28 70 -18 -98 46 137 -41 -90 1 160 4 -130 2
5744 2 39 -25 -111 -73 99 30 -78 -55 66 39 -89 -46 73 42 -92 -83 84 54 -80 9 89 37 -67 -11 24 80 -72
5771 -72 -51 39 73 -35 -71 28 48 -40 -90 -1 51 -40 -95 47 35 -78 -60 58 96 -31 -118 -67 38 -4 -78 27 115
5798 115 -13 -103 -29 84 8 -71 -6 86 -2 -111 -17 100 20 -73 14 83 79 -54 -69 107 74 -50 -69 25 53 -61
5824 -61 -102 43 41 -79 -49 87 101 -90 -32 13 60 -45 -100 30 50 -20 -84 10 83 -13 -104 60 85 28 -66 18 119
5851 119 14 -79 -11 85 -15 -51 -30 13 37 -93 -15 81 32 -117 -67 60 49 -63 -41 21 52 -68 7 116 56 -51
5877 -51 -119 77 43 -40 -109 9 71 -47 -72 28 61 -51 -67 7 75 -19 -74 -16 108 8 -81 -30 77 52 -67 27
5903 27 94 63 -40 -27 36 19 -42 -16 66 27 -12 -65 57 64 -82 -38 35 54 -87 -61 43 31 -60 -49 45 113 -54 -97
5931 -97 -3 34 -22 -45 -9 40 10 -79 48 88 35 -55 28 166 -21 -55 -32 48 -3 -85 31 18 -11 -86 4 49 16 -27
5959 -27 -15 42 46 -54 1 59 73 9 -61 54 65 -50 -53 22 60 19 -73 102 60 -28 -86 6 72 -43 -64 76 72 7 -76
5988 -76 -13 65 -37 -110 -25 35 22 -45 6 57 -3 -35 -32 78 21 -149 -7 105 28 -44 -48 62 58 -42 -62 71 36 -28
6016 -28 3 95 50 -37 -31 -6 20 -84 -97 17 67 -42 -18 60 20 -69 -15 5 78 -46 -85 29 24 -23 -18 1 13 22 -63 -4
6046 -4 50 -51 -80 -37 26 -12 -94 4 57 -36 -64 -32 32 16 -59 -21 41 17 -26 -26 11 25 -67 -28 31 3 -56 -7 54 0 -49
6077 -49 -27 11 59 -59 -68 65 79 9 -50 29 28 -2 -58 -35 36 25 -56 17 38 67 -86 1 14 -21 -6 7 81 2 -24 -17
6107 -17 65 -10 -94 -76 26 -27 -38 -18 59 -8 -61 -27 41 38 -61 -49 83 71 -97 -12 11 41 -96 -58 -8 78 -45 -4
6135 -4 -8 35 -21 -60 3 35 -22 -47 66 56 17 -57 17 62 44 -43 -3 60 -28 -61 27 83 8 -89 -14 27 -5 -77 -38 13 17
6166 17 23 -45 53 -1 -1 -11 71 22 -28 -19 -34 90 15 -54 39 5 -4 -16 31 15 -42 -53 5 109 -51 21 38 32 -30 -39 -26 75
6198 75 -36 -53 42 76 -20 -42 25 75 -9 -67 -9 72 25 -49 -61 43 5 -55 20 27 12 -98 77 59 9 -57 -20 5 44
6227 44 -39 -5 42 72 -43 -29 27 85 -58 -92 13 -33 -30 -17 30 34 -38 -98 61 84 -30 -47 -40 0 36 -85 43 17
6255 17 71 -19 9 125 -7 -25 -2 51 8 -26 43 55 38 -29 6 17 16 -51 -28 3 96 -26 -10 20 28 -67 -56 26 17 -52
6285 -52 -60 22 36 -8 -123 40 23 -50 -4 8 46 -18 -21 71 37 -34 -67 -9 61 -30 -42 -3 19 14 -21 15 33 -18 -42 -17 19
6316 19 23 -25 1 60 7 -80 -51 69 34 -70 0 68 0 8 -82 55 -11 -34 -51 25 -8 -13 3 55 96 -43 13 53 41 -80
6346 -80 -44 -29 24 -22 -16 25 25 -11 -24 12 58 24 -18 28 47 -16 -39 -23 -3 15 -2 5 28 -58 -78 -1 25 -19 -124 -30 -7
6377 -7 -2 -26 -29 50 26 -40 -49 25 1 -28 -9 25 -41 -26 -6 -13 5 4 -45 28 64 -40 -43 16 -48 -19 -5 -3 43 -57 -57 -6 38 31
6411 31 -25 -5 38 -32 -46 33 80 52 -4 34 -25 -8 -45 -1 -17 -10 -22 -19 77 81 -23 2 -75 17 -7 18 57 -16 -27 -60 28
6442 28 45 -89 -50 99 14 -33 -71 2 54 -11 -5 25 21 -43 -107 24 60 -9 -82 45 65 -87 -27 34 65 -28 -3 36 104
6471 104 -7 -66 33 61 55 -70 7 57 34 -65 25 16 34 -42 -59 43 7 -72 -36 67 70 -103 -32 78 14 -73 -46 -6
6499 -6 32 -100 -43 -12 11 -43 -1 -55 73 2 -4 -13 82 33 -47 13 50 19 -41 46 51 -6 -49 0 36 -7 -99 -1 48 73 -70
6530 -70 -62 20 15 -72 9 50 58 -69 -20 43 17 -14 -74 -21 28 -23 0 54 49 -70 -26 43 65 11 -60 27 -2 11 -39 5 30
6561 30 -4 30 49 -44 -27 -18 -3 9 -5 -47 -33 12 -11 -29 -37 32 -48 -35 -10 58 -22 -51 -62 39 4 -40 -45 79 40 -70
6591 -70 -24 84 12 -24 -34 39 -39 7 -43 30 -5 -29 -45 13 0 -61 -23 4 4 -44 -12 -19 72 -33 -39 -25 28 4 -28 -5 21
6622 21 7 -96 10 77 -43 -87 -53 32 -5 11 28 64 17 -44 -7 82 4 -93 -8 0 30 -66 -56 34 17 -53 -1 45 9
6651 9 -22 -17 1 -4 -79 -45 -3 35 -20 -40 53 52 -5 -95 70 71 -59 -79 -24 48 3 -10 -50 50 -44 -73 -16 40 -15 -44 42
6682 42 80 25 -74 -22 82 -8 -41 -3 59 -14 -39 -16 32 0 -23 -34 50 14 -27 -6 52 13 -84 -86 94 20 -8 -50 -1 86
6712 86 -30 -55 33 46 -16 -55 20 48 -19 -103 5 24 -73 -41 4 59 -31 -102 39 66 -5 -98 24 -1 -30 -7 -17 75
6740 75 30 -96 14 10 6 -29 -66 88 14 -21 -34 24 34 -38 -49 7 65 -34 -50 20 50 -18 -46 -16 48 -34 -68 18 99 -62
6770 -62 -62 -26 90 -52 -19 32 72 -34 -61 -1 46 13 -44 -26 35 -8 -50 -5 65 46 -31 -4 59 -34 -81 -45 56 42 -69
6799 -69 -45 67 13 -64 -42 44 78 -48 -30 33 69 -68 -83 -9 33 -42 -80 49 27 -82 -29 19 14 -55 -5 -10 41 -11 -46
6828 -46 67 91 -51 -106 2 -4 22 -71 53 99 -25 -109 -39 66 -41 -48 -37 59 43 5 -68 116 45 -37 10 28 56
6855 56 -27 -16 37 50 -42 28 24 17 -1 -67 49 12 -59 -40 -11 64 -15 -86 22 34 1 -74 17 72 -21 -92 20 39 -64
6884 -64 -64 0 36 7 -80 -11 90 -27 -50 12 101 6 -48 1 73 -1 -61 -14 30 48 -70 -67 87 19 -109 -47 56 24
6912 24 -24 -55 26 27 -92 -69 32 38 -71 24 27 74 -24 -4 8 64 -15 -39 -23 58 54 -86 12 45 -3 -28 8 80 44 -59
6942 -59 17 72 -3 -64 -7 89 -19 -56 -12 43 16 -100 -11 36 34 -70 -43 34 62 -76 -62 9 52 -15 0 -1 53 -17 -31
6971 -31 -10 90 29 -93 -3 38 37 -15 -37 34 -11 -73 36 71 27 -76 3 70 1 -118 16 62 -15 -52 -34 29 10 -41
6999 -41 -68 98 28 -36 -34 29 20 -36 8 98 45 -30 -39 71 46 -63 -81 37 24 -56 -47 -6 0 8 -75 -1 50 -5 -47 71 71
7030 71 -58 -100 21 97 -10 -47 -14 56 -8 -59 24 68 -3 -66 -2 36 21 -89 -49 -3 48 -41 -45 35 0 -73 -41 82
7058 82 31 -63 -45 40 43 -53 -59 23 5 -39 -35 20 -8 -71 -26 19 45 -41 -107 14 38 1 -63 -57 24 -22 -61 7 47 -33 -87 9
7090 9 19 55 -85 8 72 23 -47 -34 61 8 -68 13 60 -6 -54 -108 97 23 -54 -70 -18 7 -45 -68 8 81 -92 -58 44
7119 44 97 -15 -44 14 29 -43 -35 25 71 -9 -56 62 66 9 -35 -5 79 12 -87 -10 102 34 -36 41 39 25 -9 -56 34 -51
7149 -51 14 -22 101 51 -104 -2 27 39 -38 2 85 13 -42 -82 5 -5 -43 -61 61 66 24 -58 0 23 -36 -86 21 45
7177 45 18 -99 9 86 -18 -73 0 47 -12 -99 4 105 27 -51 12 43 0 -91 -34 50 -42 -5 -70 77 39 -27 -2
7204 -2 62 36 -70 -33 60 22 -44 -26 41 33 -38 20 15 36 -29 -74 -16 47 -53 -47 35 76 -16 -67 -45 55 11 -98 9 15
7234 15 -33 -65 -2 82 24 -94 -66 59 48 -37 -54 14 -20 -65 -32 46 -38 -44 -72 76 19 -21 -72 -2 19 -87 -46 33 34
7263 34 -44 -46 9 49 22 -38 46 40 -19 -32 -9 86 -41 -62 38 41 -47 -88 -14 0 -27 -37 -28 76 20 -54 -12 15 2 -58 8
7294 8 89 10 -26 1 19 -2 -10 -53 40 24 -74 -30 91 84 -74 -71 97 26 22 -46 14 69 -49 17 94 12 -51 -57 54 22 -62
7325 -62 -111 60 15 -49 -16 41 93 -25 -91 25 43 -40 -45 5 63 -42 -80 -17 71 5 -58 -52 81 48 -42 -48 53 3 -31
7354 -31 -7 65 92 -86 -50 69 73 -16 -23 -3 14 -47 -29 43 52 -36 -57 32 35 -47 -34 11 72 -42 -57 8 39 -6 -25 10 42
7385 42 7 -88 32 64 12 -56 -45 68 -4 -41 -18 73 61 -79 -31 5 33 -35 -73 61 50 -54 -19 -2 65 -53 -43
7412 -43 39 43 -27 -88 19 56 -57 -102 12 49 -42 -87 5 62 -21 -16 26 61 33 -33 28 135 2 10 -11 82 36 -53 -23
7441 -23 74 5 -62 10 95 -6 -56 -51 33 -14 -19 -28 46 68 -113 -91 69 76 -11 -55 5 -1 -47 -65 23 65 -97 -79 14 91 -6
7472 -6 -80 69 26 -3 -114 64 88 -4 -63 -25 51 -23 -48 -29 56 -4 -90 -31 82 1 -115 -25 13 49 -60 -15 57 -3
7500 -3 -41 -39 34 9 -44 -68 53 99 -36 -21 9 72 -72 -55 26 -3 16 -18 122 9 35 -42 97 24 -31 -60 92 83
7528 83 17 -28 12 76 19 -57 52 56 14 -90 -17 60 -4 -81 -32 65 -37 -85 -18 32 -14 -34 -63 39 2 -58 -1 24 96
7557 96 -1 -27 24 44 -13 -42 93 87 31 -33 44 40 -36 -48 25 60 -39 -118 24 73 -22 -29 22 64 -16 -113 -12 108 4
7586 4 -93 37 24 6 -30 -15 72 0 -74 -5 70 53 -38 -12 24 13 -29 28 65 49 -38 -37 48 45 1 -35 -57 69 -68 -20
7616 -20 -13 20 21 -79 59 20 -11 -73 44 35 -38 -45 19 59 -18 -32 -9 -2 -36 -91 17 56 31 -51 20 105 72 -44 50 44 1
7647 1 -50 -44 73 37 -71 -15 55 63 -47 -28 41 60 -106 -28 27 29 -46 -58 34 9 -20 -34 34 44 -23 -33 34 42 -37 -105 -30
7678 -30 76 -9 -80 16 24 -23 -15 35 41 -8 -77 -7 107 82 -104 -16 24 57 -64 -28 55 9 -70 -23 92 44 -61 -54 80
7707 80 7 37 -59 21 28 -19 -54 29 77 -41 -77 79 -8 -14 -56 1 49 -30 -56 -4 82 -36 -34 -10 44 50 -68 -4 52 -34
7737 -34 -60 -19 48 -15 -86 -47 53 22 -48 -51 41 13 -8 -67 42 89 -43 -56 28 27 -92 -57 16 25 -22 -47 -15 50 -46 -43
7767 -43 35 61 -34 -59 27 102 -36 -60 47 -16 -29 -34 14 18 44 -36 2 48 -18 -88 -7 68 27 -37 -29 50 -23 -128 -7 74
7797 74 37 -41 -60 65 55 -79 -46 68 76 12 -63 75 63 -29 -37 61 60 -77 -77 56 104 -28 -37 21 89 -70 -66 34 74
7826 74 41 -69 -8 58 -48 -102 14 32 30 -46 -17 100 46 -77 12 61 45 -132 -61 82 31 -84 -49 108 23 -63
7852 -63 -57 44 48 -64 -43 75 44 -44 -56 13 58 -5 -66 43 83 -15 -64 41 54 -38 -57 15 38 18 -42 -33 61 -4 -117
7881 -117 -4 26 39 -31 12 117 15 -96 55 110 32 -93 9 52 17 -36 -43 107 6 -108 19 67 14 5 -44
7906 -44 102 23 -68 -86 47 80 -51 -102 24 44 -54 -53 29 72 -23 -48 24 25 -33 -68 33 88 -8 -104 -23 85 -4 -80
7934 -80 57 101 -22 -75 -36 129 11 -47 -21 40 55 -12 -56 85 54 -74 -18 44 43 -121 -51 -13 60 -81 -46 81
7960 81 4 0 -87 62 73 18 -74 30 107 0 -75 66 48 -46 -19 5 28 -37 -55 12 33 36 -30 14 111 10 -106 -35
7988 -35 14 15 -19 -6 41 0 -68 13 60 6 -47 -19 19 -12 -93 -83 71 59 -71 -90 38 76 -56 -82 67 113 2 -112
8016 -112 29 48 9 -15 47 89 -37 -95 12 120 0 -57 30 72 4 -77 13 41 15 -65 -47 77 2 -106 -41 -9
8042 -9 27 -78 -26 54 46 -90 -9 59 39 8 10 60 33 -57 -29 81 95 -14 -51 104 38 -38 -61 44 50 -48 -93 15 105
8071 105 -32 -72 46 126 5 -66 44 80 -35 -87 30 123 -54 -5 5 45 14 -49 2 75 18 -118 -57 73 12
8096 12 -39 -76 67 31 -66 -40 47 15 -65 -52 39 27 -49 -16 35 58 -39 -117 34 62 -109 -40 34 66 -30 -118 11 73
8124 73 4 -66 39 89 -38 -93 -6 44 -33 -157 1 79 8 -88 15 44 42 -42 5 126 7 -101 -17 60 27 -66 -33
8151 -33 104 47 -13 -33 67 -42 -39 -71 40 53 -88 -112 26 22 -59 -46 22 33 -13 -78 19 41 10 -23 34 62 -31 -62
8179 -62 30 62 -33 -100 37 68 0 -21 -40 68 11 -54
8191e4
##END NTUPLES=NMR FID
##END=
