##TITLE=1H_Pr Tur-1
 200.13MHz, CDCl3,
 8 sc
 
 28.8.2025
##JCAMPDX= 6.0         $$ Bruker NMR JCAMP-DX V2.0
##DATA TYPE= NMR FID
##DATA CLASS= NTUPLES
##ORIGIN= UXNMR, Bruker Analytische Messtechnik GmbH
##OWNER= pz
$$ XWIN-NMR		Version 3.5
$$ Thu Aug 28 15:43:34 2025 Russian Standard Time (UT+4h)  she@DPX200
##.OBSERVE FREQUENCY= 200.1313
##.OBSERVE NUCLEUS= ^1H
##.DELAY= (6, 6)
##.ACQUISITION MODE= SIMULTANEOUS
##.ACQUISITION SCHEME= undefined
##.AVERAGES= 8
##.DIGITISER RES= 18
##SPECTROMETER/DATA SYSTEM= spect
##.PULSE SEQUENCE= zg30
##.SOLVENT NAME= D2O
##.SHIFT REFERENCE= (INTERNAL, D2O, 0, 14.3821)
##AUDIT TRAIL= $$ (NUMBER, WHEN, WHO, WHERE, WHAT)
$$ ##TITLE= Audit trail, XWIN-NMR		Version 3.5
$$ ##JCAMPDX= 5.01
$$ ##ORIGIN= Bruker BioSpin GmbH
$$ ##OWNER= she
$$ F:/spectra/data/she/nmr/H-C/1/audita.txt
$$ ##AUDIT TRAIL=  $$ (NUMBER, WHEN, WHO, WHERE, WHAT)
(   1,<2025-08-28 15:42:22.71 +0400>,<she>,<DPX200>,
      <created by zg, POWCHK disabled, PULCHK disabled
       configuration hash MD5:
       00 E9 B6 7A A2 85 ED C7 34 08 36 98 17 FE 4E 26
       data hash MD5: 16K
       22 60 34 18 89 1D 72 0C 41 1F BB 84 6A 42 86 5D>)
$$ ##END=
$$ 
$$ hash MD5
$$ 65 04 07 48 38 A6 88 BE F6 5E 22 88 66 1C B5 7E
##$RELAX= 
##$RELAX= 
##$RELAX= 
##$RELAX= 
##$RELAX= 
##$RELAX= 
$$ Bruker specific parameters
$$ --------------------------
##$DU= <F:/spectra>
##$EXPNO= 1
##$NAME= <H-C>
##$PROCNO= 1
##$TYPE= <nmr>
##$USER= <she>
##$AMP= (0..31)
100 100 100 100 100 100 100 100 100 100 100 100 100 100 100 100 100 100 
100 100 100 100 100 100 100 100 100 100 100 100 100 100 
##$AQSEQ= 0
##$AQ_mod= 1
##$AUNM= <au_zg>
##$AUTOPOS= <>
##$BF1= 200.13
##$BF2= 200.13
##$BF3= 200.13
##$BF4= 200.13
##$BF5= 200.13
##$BF6= 200.13
##$BF7= 200.13
##$BF8= 200.13
##$BYTORDA= 1
##$CFDGTYP= 0
##$CFRGTYP= 5
##$CHEMSTR= <none>
##$CNST= (0..31)
1 1 145 1 1 1 1 1 1 1 1 1 1 1 1 1 1 1 1 1 1 1 1 1 1 1 1 1 1 1 1 1 
##$CPDPRG= <>
##$CPDPRG1= <>
##$CPDPRG2= <>
##$CPDPRG3= <>
##$CPDPRG4= <mlev>
##$CPDPRG5= <mlev>
##$CPDPRG6= <mlev>
##$CPDPRG7= <mlev>
##$CPDPRG8= <mlev>
##$CPDPRGB= <>
##$CPDPRGT= <>
##$D= (0..31)
0 0.7 0 0 0 0 0 0 0 0 0 0.03 0 0 0 0 0 0 0 0 0 0 0 0 0 0 0 0 0 0 0 0 
##$DATE= 1756381342
##$DBL= (0..7)
120 120 120 120 120 120 120 120 
##$DBP= (0..7)
150 150 150 150 150 150 150 150 
##$DBP07= 0
##$DBPNAM0= <>
##$DBPNAM1= <>
##$DBPNAM2= <>
##$DBPNAM3= <>
##$DBPNAM4= <>
##$DBPNAM5= <>
##$DBPNAM6= <>
##$DBPNAM7= <>
##$DBPOAL= (0..7)
0.5 0.5 0.5 0.5 0.5 0.5 0.5 0.5 
##$DBPOFFS= (0..7)
0 0 0 0 0 0 0 0 
##$DE= 6
##$DECBNUC= <off>
##$DECIM= 32
##$DECNUC= <off>
##$DECSTAT= 4
##$DIGMOD= 1
##$DIGTYP= 9
##$DL= (0..7)
0 120 120 120 120 120 120 120 
##$DP= (0..7)
150 150 150 150 150 150 150 150 
##$DP07= 0
##$DPNAME0= <>
##$DPNAME1= <>
##$DPNAME2= <>
##$DPNAME3= <>
##$DPNAME4= <>
##$DPNAME5= <>
##$DPNAME6= <>
##$DPNAME7= <>
##$DPOAL= (0..7)
0.5 0.5 0.5 0.5 0.5 0.5 0.5 0.5 
##$DPOFFS= (0..7)
0 0 0 0 0 0 0 0 
##$DQDMODE= 0
##$DR= 18
##$DS= 0
##$DSLIST= <SSSSSSSSSSSSSSS>
$$ [...]
##$SUBNAM0= <"">
##$SUBNAM1= <"">
##$SUBNAM2= <"">
##$SUBNAM3= <"">
##$SUBNAM4= <"">
##$SUBNAM5= <"">
##$SUBNAM6= <"">
##$SUBNAM7= <"">
##$SUBNAM8= <"">
##$SUBNAM9= <"">
##$SW= 18.0517328524113
##$SWIBOX= (0..15)
0 0 2 0 0 0 0 0 0 0 0 0 0 0 0 0 
##$SW_h= 3612.71676300578
##$TD= 16384
##$TD0= 1
##$TE= 0
##$TE2= 300
##$TE3= 300
##$TEG= 300
##$TL= (0..7)
0 120 120 120 120 120 120 120 
##$TP= (0..7)
150 150 150 150 150 150 150 150 
##$TP07= 0
##$TPNAME0= <>
##$TPNAME1= <>
##$TPNAME2= <>
##$TPNAME3= <>
##$TPNAME4= <>
##$TPNAME5= <>
##$TPNAME6= <>
##$TPNAME7= <>
##$TPOAL= (0..7)
0.5 0.5 0.5 0.5 0.5 0.5 0.5 0.5 
##$TPOFFS= (0..7)
0 0 0 0 0 0 0 0 
##$TUNHIN= 0
##$TUNHOUT= 0
##$TUNXOUT= 0
##$USERA1= <user>
##$USERA2= <user>
##$USERA3= <user>
##$USERA4= <user>
##$USERA5= <user>
##$V9= 5
##$VALIST= <valist>
##$VCLIST= <CCCCCCCCCCCCCCC>
##$VD= 0
##$VDLIST= <DDDDDDDDDDDDDDD>
##$VPLIST= <PPPPPPPPPPPPPPP>
##$VTLIST= <TTTTTTTTTTTTTTT>
##$WBST= 1024
##$WBSW= 4
##$XGAIN= (0..3)
0 0 0 0 
##$XL= 0
##$YL= 0
##$YMAX_a= 11157
##$YMIN_a= -15986
##$ZGOPTNS= <>
##$ZL1= 120
##$ZL2= 120
##$ZL3= 120
##$ZL4= 120
##$ABSF1= 10
##$ABSF2= 0
##$ABSG= 5
##$ABSL= 3
##$ALPHA= 0
##$AQORDER= 0
##$ASSFAC= 0
##$ASSFACI= 0
##$ASSFACX= 0
##$ASSWID= 0
##$AUNMP= <proc_1d>
##$AZFE= 0.1
##$AZFW= 0.1
##$BCFW= 1
##$BC_mod= 2
##$BYTORDP= 1
##$COROFFS= 0
##$CY= -3
##$DATMOD= 1
##$DC= 2
##$DFILT= <>
##$DTYPP= 0
##$F1P= 0
##$F2P= 0
##$FCOR= 0.5
##$FTSIZE= 0
##$FT_mod= 4
##$GAMMA= 1
##$GB= 0.15
##$INTBC= 1
##$INTSCL= 1
##$ISEN= 128
##$LB= 0.25
##$LEV0= 0
##$LPBIN= 0
##$MAXI= 10000
##$MC2= 0
##$MEAN= 0
##$ME_mod= 0
##$MI= 1.114404
##$NCOEF= 0
##$NC_proc= 0
##$NLEV= 6
##$NOISF1= 3.799351
##$NOISF2= 2.8
##$NSP= 1
##$NTH_PI= 0
##$NZP= 0
##$OFFSET= 14.38212
##$PC= 1
##$PHC0= -1480.363
##$PHC1= 23.99228
##$PH_mod= 1
##$PKNL= yes
##$PPARMOD= 0
##$PSCAL= 0
##$PSIGN= 0
##$REVERSE= no
##$SF= 200.129724274929
##$SI= 16384
##$SIGF1= 3
##$SIGF2= 2
##$SINO= 400
##$SIOLD= 16384
##$SREGLST= <1H.CDCl3>
##$SSB= 0
##$STSI= 0
##$STSR= 0
##$SW_p= 3205.1282051282
##$SYMM= 0
##$S_DEV= 0
##$TDeff= 0
##$TDoff= 0
##$TI= <>
##$TILT= no
##$TM1= 0
##$TM2= 0
##$TOPLEV= 0
##$USERP1= <user>
##$USERP2= <user>
##$USERP3= <user>
##$USERP4= <user>
##$USERP5= <user>
##$WDW= 1
##$XDIM= 8192
##$YMAX_p= 0
##$YMIN_p= 0
$$ End of Bruker specific parameters
$$ ---------------------------------
##NTUPLES= NMR FID
##VAR_NAME=  TIME,          FID/REAL,        FID/IMAG
##SYMBOL=    X,             R,               I
##VAR_TYPE=  INDEPENDENT,   DEPENDENT,       DEPENDENT
##VAR_FORM=  AFFN,          ASDF,            ASDF
##VAR_DIM=   8192,          8192,            8192
##UNITS=     SECONDS,       ARBITRARY UNITS, ARBITRARY UNITS
##FACTOR=    0.0002768,     1,               1
##FIRST=     0,             0,               0
##LAST=      2.2672688,     0,               0
##MIN=       0,             -15986,          0
##MAX=       2.2672688,     11157,           0
$$ Real data points
##PAGE= N=1
##DATA TABLE= (X++(R..R)), XYDATA
0@%%%%%%%%%%%%%%%%%%%%%%%%%Mj2J6j6J6j6J6j6K0k8L2l2L3m1M8m9N7o4O9p7
45d0Q5r3J04j16J25j38J53j69J86k05K28k52K80l13L50l95M48n15O03p21Q86j138
67f47J578k560R345n641j6122R898J2336m88j0576j167N297K417m709l058J655
82b442N228J837l775o487L4P083M960m449n784J369M635j174l179K283M159k550
98A748n829J65N625J977l745l030J567K852k00k845j023L243L577k047n733n77
114d275O572L941m966o113K278O368M1n732k074L969L087j877l281o70J921K394
130A583L34k519j985K091L116j328l567Q97M302J09m601j479L683J994k540j821
146a731J821R76k210j350K274K342r18k417p85J104J784J175q59k092l96K040
$$ y = [0, 0, 0, 0, 0, 0, 0, 0, 0, 0, 0, 0, 0, 0, 0, 0, 0, 0, 0, 0, 0, 0, 0, 0, 0, 0, 4, -8, 8, -8, 8, -8, 8, -8, 12, -16, 16, -16, 17, -24, 24, -25, 32, -32, 37, -40, 45, -48, 56, -60, 65, -73, 80, -89, 97, -108, 120, -132, 148, -165, 185, -210, 238, -277, 326, -395, 491, -647, 931, -1629, 7716, 2075, -14047, -4149, 8187, 7699, -2877, -4044, 1253, 3670, -1039, -4097, -2442, 2786, 4623, 848, -5639, -5605, 1478, 6438, 1989, -3795, -2426, 2209, 1035, -2144, 139, 4298, 1748, -4081, -3916, 1709, 3686, -59, -3089, -1522, 1330, 1130, -1715, -2738, 505, 4082, 2035, -3698, -4275, 2297, 6238, 1272, -4841, -2563, 3805, 3846, -1886, -3960, 9, 3096, 1219, -2062, -2732, -811, 1583, 1917, -602, -2587, -496, 2620, 1292, -2275, -1378, 2924, 3033, -1568, -3047, 636, 2630, 90, -1731, 90, 1066, -1144, -2494, -220, 2122, 1204, -1213, -1998, -894, 890, 2065, 1206, -886, -1282, 758]
162G58P57j960q36K471J452k980l285J583M141P57l219k395R89K278Q04q19r19
179d23K71Q05j84j270kK083J215k032k678N06K663P05j638j096N05L73m22O7Q36
198B84M50m86p53k46N37J101N12r24j219L04J134n4j073J10R72j83j541l46J517
217I6R62q75j249K61J026M19m65l96J07N83K87n12p49L65J009p8j305n68J081
236aQ11q49j112M51J088N7p71l26M72N82P8k67k89R8L76R9m46l01M85L65o43p59
258h02L24Q34p7p74j20N12J89l50O6N00J35l74k77K16L82K05j57m40k79K03L63
279B79j67m46j4L92l6n75o6O92M73m34n72J85N65K61k35k02n1J23P9j36j84P4
301EJ56j41l89j00L24K46j88k66R0K54N1m6Q0J25J4j17J3Q2L7j4j29j84m0R7M2
$$ y = [758, 1515, -445, -1281, 1190, 2642, -338, -3623, -2040, 2101, 2858, -361, -2756, -1767, 511, 1315, 496, -423, -152, 653, 469, -801, -803, 1280, 2495, 463, -2215, -1709, 954, 1659, 21, -1075, -570, -197, -619, -552, 284, 734, 248, -505, -751, -214, 887, 1399, 475, -744, -440, 694, 640, -433, -323, 649, 466, -1075, -1421, 96, 1058, 183, -1066, -805, 221, 640, 175, -221, -114, 469, 756, 244, -505, -140, 869, 791, -514, -1082, -1, 810, -39, -1151, -700, 388, 445, -326, -652, -180, 402, 480, 213, -76, 22, 398, 497, 51, -250, 235, 600, -43, -802, -478, 356, 279, -495, -615, -103, 86, -264, -198, 302, 437, 63, -214, 2, 384, 589, 432, -8, -287, -84, 279, 112, -334, -348, 44, 8, -567, -633, 59, 532, 98, -474, -289, 276, 537, 302, 100, 49, 172, 251, 115, -69, 5, 161, 20, -369, -469, -145, 101, -87, -353, -263, -9, 42, -4, 76, 201, 215, 98, 111, 193, 230, 216, 87, -97, -137, -40, 2]
326Bk31p6J14J62j44j29K26K75q6j92J08K21J3q5l6Ol4kk2j34o5k6P7m7j85K5
352b65J88N6j27k0K15J37o6n8J06K9o2J8L1j14o9k2N8m5j88qJ02Nm8k6L6J30J5
379HK6L6KK9Q1P8j09q8oN5p6j33m2J8P2o3q0k4P7R0J9mK1N7N4M9Q5r9l6J6J01
410B14p7j92n8J21M4j35j69j1J80P0q1o4N8O2J42P5k0j52N9J75M0k32j24J08J13
435A46j18k45k7J57M0q7l8L3K0K6J41J40j25j40J51K30p3k26m1K15Pj71j48J1
459a22P5jm0l8n7OJ20J18l4j22K8K40J32j88j61J27J76p3j99m6Q6L6j22l7j5l5
485a46n4J14J17n4j44N0K83L5j67r1K03J47j73j11pR1k5o4o2n5p5O5J31l4j87
510b13m8K62J93j13j77O1K42L0j59k7P4J0j23k5N6o6j47K8J43m1j76j2K69R9j85
$$ y = [2, -229, -305, -191, -29, -173, -302, -76, 199, 113, -79, 29, 250, 263, 178, 142, 148, 114, 112, 90, -44, -109, -135, -58, -105, -290, -265, -77, -21, -148, -168, 47, 184, 118, 60, 166, 195, 133, 151, 182, 68, -1, -23, 35, -10, -198, -206, -104, -99, -147, -173, -137, -7, 8, 34, 70, 72, 101, 182, 260, 151, 63, 57, 112, 36, -97, -139, -121, -49, -112, -192, -216, -139, -49, -30, -34, -13, 44, 98, 147, 232, 133, 97, 113, 214, 137, -55, -113, 8, 52, -83, -252, -263, -83, -13, -94, -158, -100, -38, 104, 179, 159, 7, 66, 241, 281, 49, -75, 33, 146, 28, -217, -244, -87, -47, -134, -172, -139, -119, -93, 48, 188, 63, -77, 74, 304, 231, 5, -36, 179, 186, 15, -133, -122, -47, -48, -88, -126, -183, -177, -57, 61, 27, -95, -67, 173, 305, 117, -44, 83, 259, 186, -13, -59, 27, 63, -59, -96, -111, -146, -200, -86, 31, -23, -167, -117, 166, 201, 34, -57, 146, 293, 120, 9, 2, 93, 68, 4, -58, -113, -188, -123, 8, -26, -213, -261, 1, 194, 81, -96, -35, 207, 237, 78, 51, 125, 135, 12, -13, 43, -23, -170, -142, 1, -40, -216, -228, 41, 140, -45]
535d5j42J66K07Qj06n3N1J0nM8m3j57j21J93R1k05j64J27K41j16k22Q6K72R5j91
560B5m8O4P9K0MK2j53j20P6J22m7j97j03J16J37m1j15N7J25Ln0k6J08R1ll7k5
587H4j09K3J69K8j86k44J9K36J00k21j63J41J33k8o4Q6P9Mr7K1J17k3K2L1n5j79
613g6n9J60J09j13k61l4J95J09k6pm6l8M5J57O1p8n9J4Q8j14o5Q4J39j10k35q4
639b44J73J69o8j24j30R6J02P8K6m2m3K5J7P8M1Lj15no0l9K9Q5k3j19j33M6J55
666b2R2k2j04k2RJ27J43kj30j20Q0J30r7n3J8K1j40j37P8J94K9j57j13L8J52R2
692H4K9n9m2j8R3L0M3n2o2l9r0L2J03L5j33j34L1P7N2RL2Oo0n1J37J30J4j15j66
721h4L7J09J06r2j49J5Qj2m3K3J06kj35j30J79K05P8j33j56j6K16R2r6j10m6P9
$$ y = [-45, -187, -21, 186, 194, 88, 35, 86, 96, 91, 139, 96, -61, -182, 11, 102, -103, -267, -140, 101, -15, -237, -151, 121, 216, 25, -23, 41, 120, 140, 144, 166, 13, -107, -31, 91, 44, -153, -256, -140, -3, -44, -159, -102, 23, 26, -24, -50, 58, 149, 146, 109, 84, -25, -2, 167, 195, 9, -235, -216, 20, 120, -101, -264, -123, 10, -18, -82, 4, 83, 87, -10, 11, 128, 105, 127, 158, 103, -76, -135, 25, 134, 21, -240, -274, -79, 30, 4, -3, -49, -87, -42, 115, 176, 98, 39, 53, 141, 27, -38, 46, 185, 75, -160, -244, -71, 98, 30, -94, -224, -128, -26, 52, 78, 36, -7, 18, 35, 113, 154, 157, 42, 37, -23, -62, -33, 52, 29, -90, -223, -177, -22, 70, 48, -56, -78, -69, 58, 201, 199, 69, -51, 29, 159, 62, 9, 27, 48, -92, -229, -151, 43, 72, -85, -198, -160, -8, 84, 113, 54, 12, -6, 87, 117, 160, 108, 46, 7, -83, -51, 52, 87, -46, -180, -149, -72, -20, -11, 21, 27, -33, -84, 53, 183, 197, 82, -84, -47, 62, 168, 76, -73, -58, -50, -62, -105, -82, 24, 22, -113, -243, -64, 141, 219, 86, -70, -86, 130, 222, 126, 16, -30, 49]
747D9n5o4J6Q1K5k08q0J22J51P3j24n8j2J25M7M6jm5n3p9N2O4O9j09j54p5J58
774c9R3k8j55L2O0K3n8M7J59Q0j76j61J16K01N8j80j76j1J54K5q5r1K3N5l5o6
800a35M4J36O3j23j33J11J63P5j19j12K8O1On6PJ6n9j07k7J48Q7r0j17j7J63N2
826F5om9K7L9%o5L0O1L2r5j54j9J65O6j03j53K4J24N2q6n6J14O6l4j25O1J57N4
854A92j58j06M0R3M6r2j19K1M7%n0QN8rJ6l5L6J30no0o1N4N8k5p8J8K1l2q9oJ02
885A5k0n1j00L5J20P2r6l7L1O7O4p4k4K8R3n7q8o1J03M4p7r6KO5O7k9o3jL8P3
915D3k8L5pK9k4OmnL4m4m2j4Rk5j2j0K8qm5K9M3N8n4j1k1J35Qp9k3J9K9Qo0j1
949a4l0K3Llm6J2K7M6l8k8L5Q8jl9j4M1L6o9j2%k7Nppj4k1j6M2On5K7OR3k8lJ0
$$ y = [49, -6, -70, -54, 27, 52, -156, -236, -114, 37, 110, -14, -72, -84, 41, 88, 134, 133, 88, 35, -44, 8, 72, 141, 32, -122, -197, -39, 54, 26, -129, -97, -37, -14, -72, -25, 134, 214, 38, -123, -7, 194, 252, 72, -104, -115, 39, 64, -21, -112, -89, -34, -69, -135, -91, 45, 108, -15, -148, -37, 126, 201, 82, -30, -2, 59, 65, 9, 16, 32, -27, -134, -161, -13, 74, -16, -133, -150, 13, 65, 59, 10, 37, 76, 76, 11, 41, 102, 134, 39, -115, -134, 31, 97, -6, -159, -135, -11, 41, -45, -101, 13, 79, 45, -80, -19, 138, 192, 34, -72, -32, 61, 107, 15, -104, -83, -36, -36, -86, -78, -20, -29, -13, -48, -12, 118, 113, 53, -8, 46, 104, 79, 1, 19, 40, 8, -81, -87, 15, -5, -56, -156, -121, -1, 71, -25, -62, -31, 36, 100, 26, 2, 30, 123, 66, -22, -83, 20, 64, -13, -109, -107, -42, 25, -4, -67, -68, -30, 43, 15, 50, 43, 72, 48, 54, 50, 45, 79, 35, -7, -21, -12, -37, -49, -59, -31, -39, -84, -55, -12, 46, -8, -19, -40, 95, 103, 24, 1, 20, 49, 57, -3, -14, -44, -21, -18, -21, -67, -55, -28, 18, -20, -48, -13, 75, 74, 35, 21, 62, 98, 29, 17, 17, -10, -5, -12, -19, -33, -54, -70, -28, -22, -77, -50, -44, 49, 21, 18, 28]
985B8K3Jj1L3l6J4m3Jrk0j8l7O5j3o8J8N8K3m3lM7M0m2K0K8k0j3nM7m9p7K3M4
1018F%r3k0O0R3r8j0M1J3O3j4j1L1K1n0K0L3p3l1M0L0p0o6O6j5%k0J0M0Mk5M5
1050B0N6l0k7J3M6J0j01mL2L7l9n2k3N5k1k8j1L1L1kNmJ9J3M0K2m4l8J1O7m8n5
1082a9KK9j9m1K5LMl2j1Q6l6J3j1N4J6l0j0PM0j2k8k6J2n8J2J9m4j9L8K2j7jo
1115c8L4M2k0j5L1N7m0l4kL2kk1l3j3Nk8mJ9j0K4l0M2j6M9Rl4K0RNJ6ol8J2J4
1149C6o0Ol2jM1l6j1M2J5J0k4LK4L7LlnJ4k9j0J1l4MRk5l3J1J1orlL3J0%NK7Q
1186C9Jl6L2J2l4j5J4j8Ol5K7j3j3k5M1%j4L4RNknP1j5k1rk3NK0l5Kk3J5n1j5
1221f9K9j2K2kJ0pL3J8Qj2J3J9Rk9k4J0l1K5L2o8K5l9M5l2NrJ8J8J9k2PL3%l2
$$ y = [28, 51, 52, 41, 74, 38, 52, 9, 10, 1, -19, -37, -74, -9, -22, -90, -72, -14, 9, -34, -37, 10, 50, 8, 28, 56, 36, 23, 18, 65, 16, -61, -38, 6, 6, -87, -107, -47, 46, -52, -62, -21, -8, 55, 41, 30, 61, 82, 32, 52, 85, 12, -19, 21, 51, -19, -85, -19, -34, -34, -54, -44, -4, 0, -25, 20, 76, 46, 19, 32, 78, 88, -13, -17, 15, 52, 13, -39, -62, -7, -28, -56, -67, -36, -5, -7, -2, -6, 13, 26, 66, 88, 44, 6, 17, 84, 36, -19, -17, 12, -7, -48, -23, -20, -16, -48, -59, 27, -9, 4, -7, 47, 63, 33, 23, 30, 70, 58, 30, 4, 16, -42, -30, -11, -55, -74, -36, -14, -31, -32, -38, -4, 38, 18, 3, 34, 91, 51, 17, 15, 47, 45, 24, -9, -22, -17, -45, -49, -30, -40, -16, -46, -4, -20, 29, 38, 4, 24, 33, 38, 54, 48, 10, 22, 36, -24, -18, -50, -51, -10, -46, -57, -15, 0, 10, -14, -11, 13, 50, 53, 50, 45, 59, 30, 20, 31, -3, 1, 10, -15, -48, -37, -26, -32, -41, -44, -11, -1, -1, 4, 31, 39, 40, 4, 36, 48, 14, -1, 13, -5, 1, -34, -7, -20, -33, -58, -17, -17, -31, 3, 12, 17, 15, 10, 81, 66, 45, 36, 13, 18, 38, 3, 5, -18, -3, -54, -69, -40, -52, -30, -32, -22, -29, 4, 22, 30, 18, 31, 50, 59, 30, 6, 16, -15, 10, 42, -26, -1, -40, 5, -27, -22, -31, -13, 5, 24, 2, 9, 42, 42, 10]
1255A0J6J1oK5n1j3k4L3m9N2j8k3mjL2PK4okK7rK7lrm5MJ7j2k4nj1Om9J8L8mJ2
1292ij6J0PN5l9J9j7K6kk5K3oj9k1nk0J6K7k6k8pL0J4j3PL1NJ2lQRJ3l5n2K0N6
1328D5l1k5m2NK5J1J9n6O7j2m8QL0P6j4j7o3L9%N0r0M3qj8k9j6L0L5l9m0N5J2
1360BL3l1j0jL4J6l7L5K9p0KnKK3j5l6m1PN7J2k5k9K5N5J2m7L2L0j7m1j4L3K4
1393D4Rp2k3L2rOJk1lRqJ0M0L8k3j5NL2J1%m6k2K0K9l6l0J9j7Qm4MP0j8j5m2K4
1429c3M4K9k0l8M4%rJ2%mj0j9j8rJ6J9l0k7L7K4K0n7J6J3K1k3QP1j8l9k0lK0l
1463A4mk5%%j2k5K5K0OPnl3N8J0j5ok7M8Oj4o6L8jQl0K6nrk7kRL6J9q%J1J3%j5
1502B5Pk7L2j0k1%Pk2j4J1J2J0l5lk0J7L3J0JJ4J4j0k1k5K8L1m6Jp%LRqm9L6j
$$ y = [10, 26, 37, 31, 56, 5, -8, -32, 1, -48, 4, -14, -37, -41, -42, -10, -3, 21, 15, 13, 40, 31, 58, 55, 46, 1, 5, 22, 10, -14, -19, -30, -24, -73, -55, -17, -21, -9, -25, -15, -8, 47, 8, 27, 10, 36, 34, 9, 32, 26, 7, -14, -19, -39, -23, 4, -22, -50, -57, -27, -13, -26, -19, 12, 17, 29, 26, 34, 43, 56, 21, -31, -11, 45, 14, -11, -53, -48, -23, -12, 7, -49, 18, 6, -42, -34, -4, 72, 58, 41, -22, 17, 17, 67, -23, 20, 12, -6, -35, -51, -21, 14, -25, -65, -10, 2, 35, 4, -6, -7, 27, 43, 6, 41, 70, 0, 2, -3, -1, 22, 7, -29, -70, -63, -6, 6, -19, -48, -23, 32, 44, -3, 29, 59, 42, 1, -13, 20, 44, 53, -19, -42, -10, -19, -13, -12, -33, -36, -27, -35, -25, 15, 53, 30, 15, 20, 52, 63, 63, 17, -5, 15, 44, 8, -22, -3, -20, -12, -56, -52, 18, 0, -15, -57, -33, 11, 40, 20, -18, 26, 26, 17, 29, 29, 25, 15, -4, -22, -31, -15, 4, -26, -53, -16, 8, 28, -29, -13, 0, 21, -2, 6, 77, 59, 20, 0, -3, 17, 14, 10, -15, -15, -15, -27, -52, -27, -7, -1, 6, 1, -32, 26, 36, 21, 15, -12, 36, 42, 28, -38, 0, -1, 7, -23, 3, -2, -11, -38, -40, -31, 5, 24, 16, 16, 27, 40, 40, 25, 32, 5, 37, 27, 6, 6, 13, -9, -23, -12, 0, 10, -25, -28, -48, -31, 2, 12, 13, 27, 41, 31, 10, -15, 13, 44, -2, -1, -8, -8, -5, 4, -4, -53, -17, -18]
1538a8lL3OJ2k5Oj4K3Qj8J3j7Ok2nJ1k6K2j9K4l3K8k0K0j3NJ4K7k7nMOj8J6mK2
1574A9l2Oj2j1K3J5j5j1J1j3JL0J5nL0l4mJ0oK0l4J6lm7L6k4j2k1L8k3j3L3J9
1607Bj2J5K0rJ7k7K0Ml1lRrrk6M3l9M8mm0PK6l9M7%kkL0l9L4Lm4M8nn8J7K2l1
1644a7j2J4nNj5%K0QNQMJ0opJ5j0Pj1k2L3j6k1k2Nk3L0oK0j8J9J3K0J0rppK4j7
1682A9Qm1K6j8lJ0k4L0k7k7K4k9O5l9N4k8kL8k1MnJ0J8m4j1j5L3lOj6J1j7rJo
1717b8J4LPRK5rKqj4J0k2K8l0rJ4pRk7k4M2j0L6j5J2qJ1Rj3LJ8k8L5j8NnpqNJ
1756Hl3J3LOj6j0L3nj4J6nJ1J7j8j7K8%j3mNj1kkj0j1M9n8J2J9jK8j8K1PolLl
1794A9j3rk5M8l6K1k9Ojqj3MK8KkNK2k3mOj1M0l3L2n9M1K8l4m3M5qJ0m2L4oK5
$$ y = [-18, -21, 12, 18, 30, 5, 11, -3, 20, 28, 10, 23, 6, 12, -10, -15, -4, -30, -8, -27, -3, -36, -8, -28, -8, -21, -16, -2, 25, -2, -7, -3, 3, -15, 1, -3, 19, -13, -7, -19, -30, -7, 8, -7, -18, -7, -20, -19, 11, 26, 21, 51, 17, 13, 23, 17, 37, 3, 19, 16, -31, 5, -19, -31, -52, -14, -37, -50, -17, 2, -10, 5, 25, 16, 33, 6, 26, 30, -1, -4, 5, -4, -13, -39, 4, -35, 13, 9, -31, -24, 2, -37, 10, 10, 8, 6, 36, -3, 31, 34, -10, 38, 33, -25, -8, 14, -17, -29, -15, -20, -15, -30, -30, -10, -2, 3, 11, 15, 25, 19, 12, 27, 17, 24, 13, -9, 24, 8, -13, -35, -30, -53, -23, -29, -9, -27, -8, 5, 25, 35, 26, 19, 12, 36, 19, 27, -14, 12, -6, -9, 1, -23, 7, -20, -47, -23, -52, 13, -26, 28, 0, -2, 36, 15, 19, 14, 24, 42, -2, -13, -28, 5, 2, 8, -8, 3, -14, -23, -22, -28, -14, -11, -4, 5, 30, 21, 23, 15, 1, 11, -11, 17, -13, -22, -8, -15, -6, -33, -57, -15, -25, 11, -4, 8, 0, 11, 20, 7, 10, 28, 0, 35, 17, 22, 17, 10, 2, 7, 8, -25, -12, -9, -3, -19, -29, 4, -1, -15, 1, -4, 7, 24, 6, -11, 17, 17, 4, 0, 5, -6, -8, -10, -20, -31, 18, -40, -28, -9, -10, 18, 0, 21, 28, 22, 19, 22, 19, 6, -3, -28, 20, -16, 5, -24, -18, -19, -27, -40, -36, -8, -6, -8, -3, 19, -4, -8, -2, -13, 27, -6, 26, -33, 8, 36, 2, -41, 4, -4, 6, -36, -2, -8, 17]
1830A7J3l3K4K2m4J7qrQK6k8K6j9j3l0L0j6jmqM5l0J7k3PLK5kl0J7J1Nj0j8mJ8
1866AqJ4k6J9kj8oLK1j1K0RrJ2k6M0k1j0MJ9k8j9Mj5O7n5J8k5RLoK8JJ2j8Qj3
1903dL9j5Nm1M1kqj1j4Ql4M3j5J4l7N3k1qJ5LKrk6L4J3Kn8N7pl1j2J5l1K9l5n
1939e1L7j7L7K8j8ppJ4Qpj1J4J3j1j1lKm0K7l0QK8J1o2L0L6j0PRj7K7k2J1k4q
1974iK7J2o2M3%j0m0J8j6L2L%pj3K6j0J4pL5k9rK9l5L5j2pj9MJ5Qk0m4P3k7Ro
2010Ak8K3mKJ8nk%mK3j0k5PK3l7PPpJL0k0MJ4K1m7LK7j5j3J6K5m6kJ8%j2lj4J4
2049a0KK1k9j5L4K8m0J4loJ1K8l9J4k2pJ7MnL7m5kk0K7ooK9lJ2l0J8J6pj8j5M4
2085B8j1Lj0rJ9k5Lk8J1K2k0J5j3J7n%%RPJ2%jmqj5K1oj8qJ4k2J4J6m7K1L0pR
$$ y = [17, 30, -3, 21, 43, -1, 16, 8, -1, 7, 33, 5, 31, 12, -1, -31, -1, -17, -18, -22, -30, 15, -15, 2, -21, -14, -11, 14, 12, -18, -1, 10, 15, 5, -13, -17, 1, -7, 7, -19, 0, -2, -20, -26, -23, -2, -13, 7, 16, 7, 19, -7, 33, 12, 2, 6, 25, -3, -22, -18, -33, 34, -21, -3, -28, -19, -16, -22, 6, 7, 19, 1, 9, -4, 35, 20, 25, -16, 25, 23, 15, 4, -10, -2, -36, 7, -8, 6, -31, 22, 1, -7, 8, 11, 13, 4, -22, 12, 25, 27, -31, 26, 19, -12, -24, -9, -40, -11, -46, -51, -14, -31, 6, 34, 16, 9, 2, 16, 24, 17, 6, 20, 33, 22, 11, 8, 10, -30, -3, -33, -25, 3, 14, -48, -18, 18, 8, 15, 24, 7, 34, 12, 23, -1, -9, 18, 30, -32, 11, 11, 1, -39, -21, -37, -5, -2, -2, -9, -22, 4, -6, 8, 1, 36, 7, -2, 27, -8, 27, 15, 8, -11, -7, 8, 16, -4, -48, 25, -2, 7, 1, -27, -4, -8, -6, 12, 7, 5, 5, 1, 24, 14, -11, -4, 19, -18, -11, -4, -11, -10, 20, 0, 4, 18, 39, -8, -5, 22, 7, -6, 10, 35, -11, -13, 5, 5, -7, -10, -24, -10, -8, 13, -16, -31, 3, 31, -9, 5, 2, -4, 7, 35, -4, 10, -12, -19, -2, 2, -3, 34, -11, -13, -33, -6, -12, -18, 11, 8, 20, -10, 8, 24, 17, -1, -16, 28, 17, 20, 10, 1, 20, -5, -2, -30, -19, 3, -17, -2, -15, 2, -3, -3, -3, 6, 13, 25, 25, 24, 20, 12, -3, 18, 12, -6, -14, 0, -22, -8, 8, -39, -18, 12, 5, 14]
2123A4k3J4L8k2J2j1j6J2oj0j1pJ5RMk9rJ4Oj3K8j1Mk8M3KLj7Oj0K0Pj8mMLk3
2160a0J3OK1m0LpJ6RJ9j1rNJ9k4mK5k4j1pJ0kJ0k2j2L5l1qL8j7kJ7J2k0oMPOl1
2198b3L3oJ9m9K0NJ2J0Ll9J8k2K2K4k4K6rj7OrppKK4j5J3j1nJ1l1K0pK2Ol1J8
2234BMK0l0K7j8J6Kk7K5J3j4nk9N1l0j0J3k3K1n1M8Pj3J0j4J5J3ol1M5Ol5j8K5
2268IJ0j4k8K1j1l6L9PKk9J7L2l6J9knJ7nl4L9k0OK1lk1j3L7m4N2m3OK1oJ6m1
2303b0J0M1j9rOK8j0j1j0j9J5mMkj0J3k1M4j0j6J3JlJ2%j4J1Mj6kL2m4LJ7rk4
2339a9K8Km9L0J8j3j1LJ7loJ5J6k6k6P6n9NPRj8J5l8L8Kj6j1RnpM1l1J6J0rJ5
2375B5j5j0mK1K7l8qQK5l9ljj2M9l2Oj3J1Ml%oK1mMplj4rM0k2k0J0Qj9J1NJ7q
$$ y = [14, -9, 5, 43, 21, 33, 22, 6, 18, 12, 2, -9, -16, -1, 8, 12, -17, -26, -12, -6, -19, 9, -2, 2, -26, 17, 19, 22, 5, 11, 1, 21, 28, 10, 6, 10, 13, -10, 3, 9, 30, -10, -7, -14, 2, 11, 30, 19, 10, 15, 34, 10, 6, 31, 7, -4, -11, -1, -3, 7, -15, -27, 8, -23, -31, 7, -10, -12, 5, 17, -3, -9, -5, 2, 8, -23, 10, 4, 23, -26, -6, -1, 11, 21, 24, -15, 3, -19, 3, 27, 3, 29, 20, 3, 9, 0, -7, -14, -12, 12, -3, 10, -1, -6, 5, -26, -6, -13, 9, 15, -16, 2, 6, 26, -4, 23, 5, 21, 23, -4, 21, 34, 20, 15, -14, 37, 7, -3, 10, -13, 8, -43, 5, 12, -1, 9, -5, 10, 23, 17, -14, 31, 37, 2, -16, 9, 19, 5, -23, -2, -13, -49, -10, -3, -1, -30, -13, 19, -17, 2, 0, -5, 12, 7, -27, 12, -8, -2, 19, 16, -5, -18, 19, -25, 27, -16, -10, 11, 5, 21, -20, -10, 31, 12, 3, 9, 37, 27, 16, 6, -13, 2, -2, 2, 0, -10, 3, -18, 26, 16, 0, 13, 14, 11, 23, 23, 9, 20, 24, 8, 6, 38, -6, -3, 14, 5, -19, 9, 11, -38, -8, 10, -3, -14, -11, 6, 3, -3, 12, 28, 2, -24, 52, -7, -2, 5, 14, -4, 11, -27, 11, 13, -3, -14, -5, -10, -17, 24, -7, 9, 19, 10, 25, 10, 0, -4, 17, 44, 6, -2, 6, 31, -8, -11, -12, -24, 25, -7, -1, -14, -3, 1, -2, -2, -8, 13, 9, 13, 6, 3, -11, -20, 20, -2, -22, -12, -4, -23, -12, -7, 10, 2]
2414Bl0K7J8Pj2moJKJ1Mk0%rJ1j4lL6m5j0K7J0k0J2NNq%NOKk5nJ4PJ1j1l7QL9
2454A1j0lj6N4l0J5mk3LJ2nJ1%mj9oJ0nk3J0mM0J5m2qK1j0J4KjrLJ7nj6LLK8l6
2493gMJ0j8M1o7J0J3J0rk6N0k9L0j6Rk5K3jK1nj1Kj6OJ0k4Pj1lk0M1pJ7l0OJ4
2529aj4J5qK8l0K7j6J0nmJ2%l2K2Jk3N1l3Lj4K1j8OoK6j8J6J7k7Jj7Pj8JM4l2
2565hnpK1l1K5PRmjjK4l7PkJK0l3K4J3j7k4K7k0lK2k4J7OJj2KoMk4K0j6J2J1K
2604@Pl1j5M9Ok8J0j5OOmMPj3K5k%j1J4rJ0J5m0NN0m2l3MJ2K0j6k3K3nj3J9K7
2641A9k1pjKk5L3J1k1j4M2k0J7Lk8J5K1m5J2j6MK8lj9L1j6M0m1J0Nj4JQj5J9j5
2676@rj0L0k6nK1j1nJ3J0oJ2nKmK5n3%J8J2J6n5L4k2J6j4K3Nj4Kj4J5J5nMrpJ
$$ y = [2, -28, -1, 17, 24, 12, 8, 2, 3, 5, 16, 20, 0, 0, -9, 2, -12, -15, 21, -24, -34, -7, 3, -17, -5, 0, 5, -3, -3, 2, 8, 10, -15, -20, -6, 1, 12, 1, -36, -28, 11, 1, -2, -18, 36, 6, 21, 17, -6, -3, 9, 4, 15, 15, 11, -8, -14, -4, -9, -32, -22, -26, 14, 29, -13, -21, 0, -10, 4, 6, 5, -4, -1, 16, 11, -5, -2, 1, 29, -7, -3, 7, -11, 30, -37, -27, -14, -4, -13, -39, 11, -18, 12, -4, 5, -20, 3, 2, 23, 18, 7, 9, -7, -1, 9, -15, -8, -19, -22, -42, -1, -8, 9, -21, -15, -1, -15, 0, -8, 20, -10, 17, 1, 11, 6, 2, 14, 14, -18, 4, 5, -18, 33, 0, 3, -11, 10, -8, -2, -8, 18, 0, 16, 33, 6, 7, -10, -3, -21, -20, 24, -8, -13, -20, 1, -30, -5, 2, 11, 7, 6, 5, 29, -8, -1, -3, -2, 18, -15, 9, 22, 5, -19, 8, -12, -15, 7, -17, 0, 6, 7, -5, -3, -9, -5, -29, -9, -25, -13, -2, 0, 7, -24, -39, 10, 16, -12, -2, -17, -11, -5, -9, -5, 2, -11, 14, 12, 12, 1, 15, 6, 16, 31, -9, -4, 46, 4, -29, -25, -13, 7, -9, -32, -9, -14, -27, -8, 19, -2, -9, -10, -8, -33, 0, 11, -10, -24, 18, -2, 15, 18, -10, 5, 26, -19, -7, -23, -19, 9, 6, -13, 18, 2, 42, 1, 11, 16, 2, 3, 11, -4, 15, 0, -9, -19, 11, -15, -20, 1, -10, -15, -2, 8, 2, 14, 9, 11, 7, 32, -21, -21, -3, 9, 25, -30, 4, -18, -2, -16, 7, 12, -2, 0, -14, 1, 16, 11, 15, 6, -1, 0]
2714@rkMj1oK9J7m6K4lK9l3rLjoL5rj1J0mK8k1J0jnPjlj5Oj5JoNoK3k3L1oj1L
2756BnJLQl1K6j7PjLKJ0j5j1J4j7J9KpkL3pk6K4j0Kj2K9k4K4k6jkj5rM0kpJ2P
2796B1l0jK0Kj1K1k0Kj2K4j3j8J5lJ4qplKJMjJ0kl1L6pJ0L3m3k9O5n8LJ1nK2m
2834A0j4j5K4j8J8j2j0J0J8kk1OL8k7j1J7Kk8J0k6J5kJ0Qj4OKK2l9K5j3J0%k8
2868b9M4J2opPj5K4n1N9m0MRj4J4mj1j6POKK3Rl9K1k1J0J9m0J7J4pk2JrK3Qj2
2905a0K0k0K7l8KkkK0kL1l3Nkj3K2j4K2j4lk2K1Rpj6K4Jj1oK2oj6K3l6JK1lJ9
2942A4l1KK0l5L0j2kj9JJ7L3k5j9J9K4JLj0oMNj4j2K3rkj2nnKNJ6QLJl5K4J4O
2981B2k2Mlk0J4J0Nk2j6QJ9nOll3K7nK1j1J5J1nl0N7n3J2%K1j6l7Pj3J1J0K6l2
$$ y = [0, -9, -11, -7, -18, -24, 5, 22, -24, 0, -3, 26, -7, -16, -13, -14, -20, 15, 6, -5, 5, 1, 29, 8, 18, 17, 12, 19, 18, 15, 0, 6, -9, -8, -14, -9, -15, 8, -15, 16, 10, -1, 2, -3, -2, 1, 9, -22, 4, -13, -6, -7, -4, -2, 8, -7, -18, -4, -21, -2, 0, -7, -9, 24, 17, -9, 15, 5, 7, -5, 24, 0, 24, -2, -3, -5, -20, -29, 11, 9, 2, 14, 21, -9, -10, 10, 12, 1, 22, 2, 4, -8, 16, 3, -15, 0, -3, 11, 3, -4, -7, -5, -4, 0, -1, 9, 7, -24, 12, 5, 15, 48, 5, -24, 41, -17, -14, -3, -8, 14, 10, -4, -19, 5, -13, 5, -7, -17, -7, 11, 9, -12, -6, 32, 5, -6, 11, 13, -15, -5, -31, -16, -18, -8, 0, -14, -8, -6, 16, -23, 2, -11, -1, -1, -29, 15, 27, 21, 14, 21, 6, 30, -21, 38, -2, 2, 11, -3, 11, 7, -4, -20, -13, -7, -5, 18, 27, -12, 9, -12, -2, 17, -23, -6, 8, 1, -21, -20, -29, -6, 2, -10, 10, -10, 17, -21, -19, -21, -23, -3, -5, 26, -7, -2, -4, -17, 5, -9, 13, -1, -4, -26, -5, 4, -3, -19, 5, 6, -5, -11, 11, 5, -11, 12, -24, -23, -2, -5, 14, -17, -15, 5, -30, 0, -12, -14, -33, -32, -15, 18, -7, -26, -7, 17, 18, 21, 11, 5, 9, 14, 0, -12, 11, 2, 0, -12, -17, -22, -20, -15, 1, 9, 12, 13, -22, 2, 16, 22, 0, 4, 1, -19, -5, 5, 10, -12, -28, -20, -1, -6, 0, -3, -36, -9, -14, 7, -4, 11, 22, 17, -13, 44, -9, 3, 3, 24, 8, -29, -22, -35, -24, -14, 12, -20]
3017b0K6m8K1K6kJ6l5jJ4K1j5mNj0J5k7L3j2j6K3k3M1k5j0jj0J8K6k2K0l2%K7
3050A9j8npK2Pk0kj5LOpJJ7Ojj3J2J8rj2LJj8PK6j0k1j4K9J6m1J0j3M7Pl8J3k0
3088a4QoK8l3RK3%k9PjlJ4J1rj8LK8l6kL2l1J8K7l3j1PRLMK1j6lj9lJ9j4J7k0
3126a3J0Pmmj%kk3K1J6qRKjk3L5l1k7L6j2j9M7j2J5m3J4L4m1OJ2MJk2L6nmK6m5
3164iJ3lJ9l4K8j6j7PJ4Lj0NJ3j4k1M0j5j3JJ6k0J6k0mj1QK5J2l9L6j4j9NL9l8
3199a7K3nl3K0LL5nk0J9l0RJ0k0Oj1J5J3j9j1K0kMrJ3k5pO4k1j9J5J6m3OJ4j5
3234gK3k4RnK4m1jJ2%Ol9L6K0qKoJ7KJm7K1J8K6m0p%Rj5nK9k%Pj4j9K4nRkn2M0
3275dkRk1lN1l1qNJ3k1J1J7j4J8oRj7l0J2knL1PopMj3J9jm1L7mOrjk8L7j8MnJ
$$ y = [-20, 6, -42, -21, 5, 3, 19, -16, -17, -3, 18, 3, -1, 4, -6, 9, -18, 15, 3, -13, 10, -13, 28, 3, -7, -8, -18, 0, 26, 4, 24, -8, -8, 19, 1, -4, -11, 11, 18, -2, -4, -19, -16, -10, -17, -16, 1, 7, 6, -7, 5, 23, 14, 2, 5, 6, -12, -5, 21, 11, -10, -24, 5, 21, -20, -10, -23, 24, 31, -7, 6, -14, -6, -12, 16, -17, -8, 15, 15, -14, -7, -8, -11, 3, 14, 5, -13, -10, 18, -18, -20, 12, -19, -1, 26, -7, -18, -11, -2, 1, 5, 26, 10, 7, -12, -15, 4, -10, 7, -13, -3, 4, 0, -4, -5, -5, -7, -30, -9, 7, -1, 8, 10, 9, -14, 21, -10, -37, -1, -13, -32, 15, 3, 18, -25, -11, 23, -18, -12, 0, 4, 5, -17, 19, 14, 10, 36, -9, 4, 1, 20, -14, 14, -2, -19, -12, 2, 5, -5, 0, 13, -1, -22, 18, 3, -10, -9, 7, -13, 3, -17, -21, -32, -24, 1, 13, -26, 10, -4, -23, -18, 21, -17, 6, 1, -32, -12, -9, 26, 21, 1, 20, -10, -1, 9, -11, -5, -16, -1, 12, -7, -18, 2, 0, 4, -5, 8, -17, -24, 40, 19, 0, 15, 31, -12, -6, 8, -7, 16, -8, 1, -4, 20, -21, -22, -10, -10, -4, -43, -7, 13, 5, 7, 1, 18, 20, 21, -26, -5, 13, 39, -1, -8, -8, 1, -14, -19, 10, 8, 8, 15, 1, -18, 6, 1, 10, 8, -44, -4, -6, 3, -18, -21, 30, -1, -9, -4, 9, -12, -1, 16, 2, 20, 14, 23, 6, -24, -12, -14, -19, 12, 19, 13, 6, 10, -3, 16, 15, -26, 11, 7, 13, 4, 3, -25, 12, -6, -2, -7, -6]
3316frJ5K2l7K3Pk7NK6m2K3k6J7J2K9m4J6k0K8J5l5jj1K8j0nJ5Jj5jkL3l2oJ3
3351aLrj6J8j4%L5l6J0M7n7L4k4mK4nLj6Pj0lJ8J0Lk0J4mmL8rl4j9L2j3J7k0K9
3388B4m6L3kk2lK9l4L1j5K4l1RNJ8j5k0JJ5jj2J1JpJLL1nn0LK4J6m9J5K0J0j1
3424ARL1o8oM4Kk0%nMlLNj1%KL7j5prpK7J5m1O2m2j6K1j1K7j3k7K5Nl4POK3j7
3463Dj5%J8qK1n0L6Mj7Kj4jJ3pjK2l9K5KqJ9pPl3K9MprJ3K9j8k6J7m9M9lK8k1
3501I%j9J2j3qK4k3K6mJ8k6Qj1j4K1k7J2J1NJ2ml0L0mk9K8j4LPk1%RJ1J7j6JP
3538Hj9j2L3J0l2J0J1Kqj8K9k4J4j2J5j5%MllJ0J1Lj2l0L5J1m1L2m1K5J4j9%M3
3573C1n0oN8l2Qj6J7rJ2j3J5j7oM6m2KpJ5J4l5K4Oj6qL0k6l0J7L2m5L5rKj2j1
$$ y = [-6, -15, 0, 22, -15, 8, 15, -12, -7, 19, -23, 0, -26, -9, 3, 32, -12, 4, -16, 12, 27, -8, -9, -20, 8, -2, -7, 8, 9, -6, -7, -9, 24, -8, -14, -1, 2, -7, -23, -5, -19, -19, 16, -20, -10, 37, -20, 14, -10, -14, 10, 5, 8, -8, -1, -11, -14, 4, 14, 17, -3, 11, 7, 3, 41, 32, -2, -21, 11, -2, 15, -5, 24, -22, 11, 9, -13, -16, 13, -21, 10, -5, 19, -12, -3, 2, 20, 5, -15, -14, 1, 0, -12, -1, 0, -7, -6, -3, 28, 23, -27, -24, 0, 16, -33, -18, 2, 12, 1, 10, 41, -27, -33, 11, 13, -7, -7, -12, -8, -11, -8, -3, -14, -14, -12, 25, 10, 3, -6, -13, 14, 29, -12, 50, 8, -8, 13, 2, 29, 16, -11, 14, 19, -15, -8, -2, 21, 4, -11, -11, 7, -1, 20, -30, 6, 10, -7, -5, -19, -20, -7, -14, -15, 7, -32, -7, -5, -13, 6, -1, 6, -27, 2, 6, -1, -10, 3, 32, 14, -12, 5, -44, 5, 2, 30, 9, 9, -10, 2, -11, -19, 5, -18, 8, 4, 22, -4, 4, -7, -21, 0, -27, -15, -4, 1, 13, 9, -21, 9, 5, -24, 4, -10, -7, 0, -21, -21, -12, -1, 16, 0, 1, 8, -11, -23, 10, 20, -12, -2, 9, 11, 3, -15, 14, -10, 4, -8, 7, -8, -8, -4, -7, -10, 0, 11, 14, 2, -28, 7, 18, -23, 9, -32, -7, 7, -12, -12, 31, -19, -25, 33, 1, 9, -7, 10, 1, 13, 0, 15, -2, -8, 38, -4, -2, -9, 6, 20, -15, 9, 15, -1, -9, 21, -5, -35, -18, 14, -31, 4, -5, -3, -15, -26]
3608b6K8l2L3j2L1k0j0K3k9K3j1J4Oj8k3kN0k6K2k6NJ1rK3l1J4jQl5R%MMj0K9
3643A6j9RPk8JJ8Nj6L5k3k5M0j2Rpj7rL4oj1oJ1J0J6l0J3k4jJ4mK4Jj3J9oj3k4
3680a2J6mj8KJ7k8J8JJ9l6K1J9l8K7J9m1M1j7kMj6K2j5J9k9J0l3M7qk5J7J1%Q
3714A6k0JNk3L6k7JJ9j7J0j2j3K8j2L5m0OJ5lk8L0j0j8K6oOk4K7J7l3K2J0k5K0
3748A9kol0QJ4jkj8K2k9M0k2j2J0mj2J7K4qJ0j5Nl0QJ9JJ1j0j6J5jK1l2%LMKj
3786BlRj1l3L3lK0oJ0rNj0J4j9l0J7L4k8qJ2K3k1OJ6j0KrJ2j5J0j8M3m4j0oK8
3822CmPKk4KPK2n1L0RMk0M4j9k2K9j9j5Kk4J5Rl9N1J9lJKj7Nj1jJK4m5M3j6j1
3860a0pK4j9k1J8j4K9J4olLj8j0K6j3J2k2J9Qj6K0j2Ok3RJ3Rkk2k8LL9ll3J5J7
$$ y = [-26, 2, -30, 3, -9, 22, 2, -8, 15, -14, 9, -2, 12, 18, 0, -23, -25, 25, -1, 21, -5, 0, 11, 2, 25, -6, 8, 7, 15, -20, -11, -11, -7, -3, -13, 16, -3, 6, 13, -15, -14, 4, 9, -7, 28, 5, -20, 20, 8, 17, 10, -7, -16, 18, 12, 1, -5, 6, 16, 32, 2, 15, -9, -10, 4, 0, 24, 25, 12, 31, 25, 12, -12, 4, 0, -18, -16, 1, -27, -9, -8, 11, -25, -4, 15, -23, 4, 23, -18, 23, 6, 4, 8, -8, 14, -1, 18, -11, -1, -34, 13, 5, -20, -3, 8, 8, 16, -4, -3, 2, -21, 15, -12, -11, 8, -9, 1, -11, -24, 4, -8, 27, -13, -7, 8, 5, -23, 7, -3, -21, 5, -1, 5, -19, 8, 25, -8, 14, 24, -1, 19, 17, 11, -19, -11, 3, 2, 0, -18, 4, -25, 15, -7, -19, -9, -13, -25, -8, 16, 8, 18, 3, 8, -22, -14, 5, 6, 17, 7, -9, 6, 5, 26, -6, -6, -3, 1, 3, 2, -1, 8, -3, -36, -3, -6, 14, 8, 18, 9, 14, 4, 18, -1, -31, -14, 20, -8, -16, -4, 19, -2, 4, 20, 10, 12, 3, 15, 0, 10, -8, 35, -9, -19, -25, 3, -1, 6, 8, -16, -14, -7, 15, -36, -6, 3, 7, -13, 31, 12, -10, 19, 0, -15, -13, -37, -22, -13, -52, -1, 18, 15, 16, 18, 1, 6, -5, -6, -5, 19, -26, 17, 1, -10, -17, 7, -12, -33, -15, -29, 0, 14, 8, 5, 8, -10, -20, 6, -7, 5, -17, 2, 10, -6, 14, 2, 8, -15, -6, 7, 16, 14, -8, -36, -33, 6, 3, -30, -15, 2]
3896Bj4K1k6j8J0K5JLK4j7m7L9k4OM4l9lJ4RJ3m8M6l2J2Qk6K3J7rjMk3pNOJ3j4
3933ck1K7k2j1K9j9K3rjJ7j2qJ7l9J4jK0pj0K0rjPj9J5RnNj6J4K1oj0ok7M9k1
3970DQl1J9j6kL1j9J8k6OJ3mj1rj2J6JL8k3j8J6KJ1j3k6K4L0l1pK3j6PJ0j9J8
4005A2J5k5lmL9l2ooLkK0m0K7J7l6J3Kj0jrLM8l0l5N5k1qM3j4k0K9J6k0j2j4J8
4041A2l7M1%Lj6k%j6M8m6K8ol4J5K0m0M4Ol9K1nl2N3m7J4K0mj3K0Ok4J7j0J2n8
4076d9L7J3%kj3JJK9l3J2K7l7qL2J7k0j5J6k2J1pK6Pjl2j8M5k0OLj8nK2j1K5k4
4112em5N4rJ3k1j3M3krj1K6l1J5L3jj7mk3J9k7MJ7K9m5NJ5j3j5J7K1qm1K7j7K
4147a7K0K1j6l3M6j0l1j8K8K9j5j0pj6J3K3J2m6M5m8L0J1j1J2j4Nj6nMj9pL2J
$$ y = [2, -12, 9, -17, -35, -25, 0, 1, 4, 28, 11, -36, 3, -21, -15, 29, -10, -13, 1, 10, 23, -25, 21, -11, 1, 9, -17, 6, 23, 14, 13, 17, -6, -13, -8, -2, 11, -3, -24, 3, -19, -30, -1, -20, 3, -6, -7, 10, -2, -10, 7, -32, -18, -19, 1, -6, -16, 4, -5, -6, 1, -18, -3, 6, 1, 6, -10, 4, 25, 19, 9, 3, -24, 25, 4, 12, -19, 0, -16, -18, 13, -6, 12, -14, -8, 5, 1, -10, -19, -31, -15, -14, 24, 1, -17, -1, 1, 12, -1, -27, -3, 27, -4, -11, 12, -4, 3, 13, -6, 12, 27, 2, -1, -5, 34, 2, -4, -10, -7, -9, 11, -29, -2, 15, -21, -8, -6, -16, -17, -26, -23, 25, -5, -40, 15, -6, -14, 29, 15, -5, 24, 40, 20, 8, -6, 12, -25, 16, 16, 19, 3, 1, 1, -15, 33, -13, 15, 9, -25, -10, 10, -30, 14, 20, -19, 2, -3, -35, 18, -29, -15, 5, 1, -12, 8, 14, -10, 7, -3, 9, -49, -12, 1, 1, -1, -14, -13, -12, 17, -16, -4, 23, -14, -22, 10, 27, 7, -8, 8, -14, -3, -10, 16, 23, 22, -10, -28, 17, -3, 3, 6, -12, -17, 5, -6, 19, -5, -50, 4, -5, 8, -13, -26, 17, 15, 6, -5, 21, -10, 5, 38, 37, 20, 16, -7, 12, -15, -11, 6, 35, -10, -5, 10, -3, -18, -1, 20, 12, -29, -2, -19, -17, 3, 24, 8, -25, 21, 11, -20, -38, -10, 19, 4, -6, -13, -29, -16, 7, 19, -27, 18, -30, 0, 11, 0, 12, -2, 3, -13, -18, -14, -33, -40, -8, -7]
4180gJ9k1lK2%jj0K3j3j1PKK3m1J1J5k8MQM%%k5M1J5m3J1jLj6qL1j5K2Qm0K2j8
4218a0j0L0J4j5j5k0L4n9L9L0k7K0m6M4k3MNpJ2k7RJ1J5poJ9k7QRk7J0OPj4J9
4253Ej5L9l0j7L3J0j5LJ8m0K6k3Ml4J5J9Rj0j4K7K2k0k8LpL4n2LM0l2K1Qqk3K5
4288dJ0l4M4j2Kk6K1qLkJ8lj2Loj0JRk6K5k0K0j3J3k8N2k1Mj8J5K0nj3j6K4j4
4324gJ6k5J0M5q1M8j1JK2j1k1lL1nrk0J4K3mk4J2nPJ7k5K%j6J4k3K3LJ0j0J1M
4360A3k1L6l9L2k2K2l1L8kQk5J8Jn9M2j9%J0Nm3M8J8l0JkJ1j8K5j5Nk0kkJ9j8
4395a6JmJ8mJ2%lj0lRo%NKJ0k2K3j9QNj8OKJoJJ0K0m2L2Mk1J7j4mL5m8M7l8K2
4435A2l2K1KlOj5L2k5Ql5L4n%Ok0K4j0j9J9KQk6KJ0KK5l7J1NlKj7JL7k1Oj1mk2
$$ y = [-7, 12, -9, -12, 10, 10, 9, -1, 22, 9, -2, 5, 7, 30, -11, 0, 15, -13, -9, -1, 3, 3, 3, -22, 19, 34, -9, 2, 1, 4, -12, -20, 11, -4, 18, 26, -14, 8, -10, -20, 10, 24, 9, -6, -26, 8, -51, -12, 18, -9, 11, -35, 9, -14, -10, -5, -12, 0, -27, -18, -7, 8, 1, -5, 14, -13, -5, 4, -23, -13, -7, 0, -14, 5, -10, 29, -1, -18, 15, 25, 10, 13, 31, -9, 17, -6, -2, -36, -21, -2, 7, -3, -17, 10, 32, 12, -16, -13, -20, 14, -38, -35, 5, -27, -6, 2, -6, -29, -4, 6, -28, 16, 4, 6, -20, 1, -7, -4, -6, 12, 9, -3, 0, -6, -16, -15, -6, -32, -7, -27, -7, -20, -7, -35, 17, -4, 0, -18, -3, 17, 12, -1, -17, 7, -7, 9, -16, -6, 39, -42, 6, -5, -4, 18, 7, -14, -17, 14, 9, 0, -20, -6, 17, 13, -11, 1, -4, 3, 20, -5, -3, -3, -19, -5, -28, -5, -2, 8, -2, 9, 13, -8, 28, -11, 21, -1, 21, -10, 28, 26, 34, 9, 27, 28, -31, 11, -8, -8, 2, 7, -36, 12, 30, 0, 1, -1, 10, -8, 17, 2, 7, -13, -15, -17, 2, -16, -15, -19, -1, -5, 7, 7, 4, -6, -9, 0, -6, -6, -1, 1, 11, -11, 12, -7, 1, 6, -12, -6, -4, -3, -9, -8, 2, 22, -20, 12, 16, -5, 12, -2, -6, 29, -19, 28, -10, 12, -20, 1, 3, 0, 6, -9, 23, -2, 6, -29, 5, 0, 0, 6, -14, 10, 0, -19, 0, 2, 10, -16, -14, -4, -2, 23, -14, -3, 2, -1, 1, -16, -15, 22, 1, 7, -4, -8, -30]
4474c0L8k4K6j3m4N5nRk4OOnJ3k7L5j2J6rj7J5KL4m8K4k7K4nJ1jk4KPJ5l5LJ5
4510FQqK2l3K1%j8j2J1Ror%j7K6k1M2l8J3K7j3k0K9j4pJ0l0L9l5J9Lj0K4l6kK9
4546I%j8ONOj5J1Qk5k4J9kK8J2l2j2J5K6k4j6J9qPoj7L6J0jj9J1Jok8L1j1PqK1
4584A6nOPk7j7K0K0Mj3m6M6M0o6L6k5l1O1o4N1k6J4j3jK9l2K9lLj0jpPjk1KJ4
4620dPpK4jj2nRj3j0L0k7K6j0Pk1J1J1l1LK7jj1J3l4nK5j9J4oK3l8K0J3j0m2J8
4656b6MM0l1J2k5J1K0j4Kj1J3J1J4m3L5k8nJ6j2L2kk5OJ4n4K6%K2k5L5l7L1j2
4689fk1RJ5Nj6PrLQnJ9j7K2J6j3l2J5OJ4J5k2mk0L8l4RK8k1K2j0oj4J3p%l1L2
4726Hk7jJ5l2L3Qm3M1RplOj1k0J8J8l1K2nj2K9k5K4kOl9M0Ol0J1j1J8k2Jok2K0
$$ y = [-30, 8, -16, 10, -3, -47, 8, 3, 12, -12, -6, 0, -5, 8, -19, 16, 4, 20, 11, -6, 9, 11, 45, -3, 21, -6, 18, 13, 24, 23, -1, 1, 8, 23, -12, -9, 6, 14, 6, 28, -5, 16, 16, -2, -14, -3, 6, 0, -9, -9, -26, 0, -21, 21, -17, -4, 23, 10, -10, 19, 5, -2, 8, -22, 17, -18, 1, 4, -6, 18, -18, -20, 9, 9, -9, -3, 2, 8, -7, 4, 12, -13, -37, -18, -20, 8, 20, -12, -24, -9, 17, -7, -23, -4, -12, -5, -11, -28, 8, 18, 17, -2, 9, 10, 4, -24, 7, -4, 3, -5, 16, 11, 17, 24, -3, -20, 0, 20, 24, 11, -35, 11, 51, -15, 21, -4, -35, 26, -38, 13, -13, 1, -12, -13, 16, -16, 13, 10, 13, 3, 2, -5, 2, 1, -20, -18, -4, 3, -4, 20, 19, 7, 2, 11, -2, -12, 18, -9, 17, 7, 14, -7, 4, 15, -16, -13, 14, 13, 2, 15, -19, -24, 1, -18, -4, -10, 13, -25, -5, 8, -2, -44, -26, -22, 18, -13, -1, -26, -15, 5, -9, -7, -18, -5, 6, 20, -23, 12, -16, -21, -5, -17, 15, 13, -12, -6, 8, -46, -20, -20, 2, -23, 12, -25, 6, -6, -27, -18, -3, 2, -14, -7, -16, -13, -5, -10, 9, -8, 14, 30, 17, -15, 0, 6, 20, 35, 13, 9, -11, 27, -7, 2, 30, 9, 31, 21, 15, 1, 14, 7, 7, -24, 8, -19, -20, -5, -37, -4, 4, -39, 2, 11, 4, 1, 7, -4, -24, -6, 12, -19, 3, -2, -14, 15, -10, 14, 12, 18, -21, 19, 25, -5, 6, -5, 13, -9, -8, -14, -36, -16]
4763a6j7N1Qk0l0J9K3l5L8j3j5rj0K5l3K0J4oOMplL0k1K8k1j5ojONK1k7L2k9o
4799a0PJ5rj1rK3J4nqj9nK5pK0k0K1Pn2L4j1J3j5Oj5k6K8mK8j8j6M0m7J5K6Lk8
4835a0K4k2jK3kj3JjoNOK9l7J3kkJ3j9Nj2pOj5L4j6RqLoKOJ1nrJ9j3Pn%j5MJ4
4877HjJ4J8n1K4mJ9o2L9Oj5K6m0J7rKQK3n2K7ljQk3J8L5l9pkjJ1j8JL1J5l7J9
4914Djk3NL0nMkj6j3pK7qK0j0qJ9j3l4K6OOKk6Mj2J2K3Qk4k5L3PJmQk3J4l0JJ7
4954gJ6j0J3l2J1k5L2NmoL9k2k0J2lk3K6L%j0JPj0Rjj8NJ5MqmLJ5m6J2%N0n1M9
4993B7Ll5rJ8LRrk3K7J0l8LK0k1J3Kj7J6OJ1NNm7j1M4j0k5L4Mk7kRPoK0l5K9k0
5031a0J3rj0K4Qkj8L0k3MJ4n5M5j4j1nM0j5%j0K1rj6mnJ7j6L3j2Kk0J4k0J3Pl8
$$ y = [-16, -33, 18, 26, 6, -24, -5, 18, -17, 21, 8, -7, -16, -26, -1, -34, -14, 0, -6, 0, 4, -3, -6, 24, 3, 31, 10, -5, -11, -12, -6, -1, 20, -7, 25, -4, -10, -3, 12, 3, -8, -17, 6, 20, 15, 7, -12, -17, 8, 1, 21, 1, 22, 29, -23, 11, 0, 13, -2, 4, -11, -37, -9, -13, 15, -3, -19, 21, -26, -11, 15, 18, -10, 14, -8, -9, 14, 12, -1, 0, -1, -7, -2, 4, 33, -4, 9, 7, 5, 18, -1, 4, -8, -15, -9, -24, 10, -6, 3, -5, -2, -8, -6, 0, 11, 6, -3, 16, 3, 10, 5, 5, -10, -6, 8, 7, 21, 39, -12, 12, 8, 27, -35, 4, 10, -5, 21, -19, -2, -11, -9, -1, 22, -30, -3, -6, -7, 1, -22, -4, 31, -8, -15, -17, -18, -7, -25, -24, 7, 22, -15, 4, 3, -20, -15, 15, 10, 14, 12, -4, -17, -24, 3, -5, 15, 5, -3, 16, 3, -31, -5, 1, 7, 9, -17, -13, -25, -13, 10, 18, -6, -31, 2, 9, 10, 6, 14, -9, 5, -25, -24, -7, 9, -1, 12, -20, -9, -34, -2, 3, -1, -7, 32, 10, -10, 2, -1, -24, 2, 5, 5, -5, -4, 3, -7, 2, 1, -17, -12, 3, 7, -1, -5, -2, 13, -33, -21, -21, 29, -22, 27, 30, -5, -14, 4, 7, 16, 7, -16, 11, 21, -17, -14, 6, -15, -2, 0, -17, -1, 5, 16, 21, 26, -21, -32, 12, 2, -23, 11, 15, -12, -14, -5, 2, -4, 16, -19, 10, -10, 3, -6, -16, 8, 16, 14, -4, 26, 3, 7, 21, -34, 11, -3, -14, -19, 21, 6, 6, -4, 17, 8, -8, -12, -17, 0, -16, 17, 5, 7, -13, 1, -19, -6, 1, -37]
5067c7L3Npj2KK9k5M6n4QN%j2L7k7L0pj0OQJ9k2k1nLJ1j3J3j9J0J6l2J6J3j7K4
5103A4l3qJ7j0k0M8j2j4K3OJ4l2J1nj3KlQK0LjJ5k1Ok0L7k0ml6K9ok4L7j8j7L4
5139Gl2PJ4j4PJ3%Pj6Lkk%K1k7J5J3j8j4J9J9k0j8M9m6K4J4o9M1K8k6j1j3%N2
5174B5Km5M0k8k5M8l4PnkjJ0j4L3nk5K2k3K0J1km2M3k2J8K1ql2NJ7k8PqL5k1j8
5210b4L8m1J9J2l0L8l7K0k6K0L1k3Rj3J1j4J3J5m3L3k4J4j5%KJ2%J9k2J6npJ3
5243A1pk7QK3mj3Nk3M1j5qjPj2KJ3JjoK0j8MPk7J1k0J4L3k4K2k9MpNM4l3j3mK0
5282Cjk0J1Jlj3QJ8Lk6K4j6Kj8rK1M%oORj3K3j0k1JN3n1J8OooLj9K4j4J8J5j2
5321Gl1J2J5kj5LK5oj3%j0K2j1nK4j8KKNj6Rqj4PJ3k5L4Jl2J0K8qj4kmj0lJ2Q
$$ y = [-37, -4, 1, -6, -18, -16, 13, -12, 34, -20, -12, -7, -7, -19, 18, -9, 21, 14, 4, 10, 18, 37, 15, -6, -11, -8, 3, -10, 3, -16, -6, 10, -22, -6, 7, -10, 14, -19, -27, -10, -20, -40, 8, -4, -18, 5, 11, 25, -7, 4, -1, -14, -12, -15, -7, 13, 16, 15, 30, 9, 15, -5, 32, 12, 8, -28, 1, -5, -29, 8, -10, -27, 7, -25, -18, -4, -18, -11, 2, 2, 9, -7, -4, -6, -8, -8, 13, -14, 1, 14, -4, -18, 1, 20, 0, -18, 31, -15, 9, 23, -46, -5, 23, -3, -14, -27, -27, 25, 27, -18, 22, -6, -31, 17, -17, -10, -15, -17, -18, -8, -22, 11, 6, -19, 3, -20, 0, 11, 9, -33, 10, -12, 6, 27, 19, -13, -8, 9, -19, -12, -20, 15, -6, -24, 14, -27, -8, 4, -26, 12, -25, -5, -31, -11, 20, -3, 6, -7, 4, -10, 3, 18, -25, 8, -16, -2, -17, -17, -15, -3, -3, 16, -6, 10, 5, -2, 11, 4, -23, -15, 8, 4, -9, -4, -27, 14, -1, -9, -10, -3, -15, -13, 0, 1, 0, -6, 14, -4, 0, 7, -20, -9, -29, -15, 18, -6, 16, -13, -9, -16, -11, 33, 0, -13, -17, 3, 2, -18, -7, -6, -9, -22, -14, 4, 7, -19, 5, -11, -9, -27, -36, -15, -11, -11, -17, -11, -2, -15, 8, -2, -23, -22, 31, -20, -2, 4, -2, -8, -5, -24, 0, -14, 4, 19, 7, -24, -12, 3, 1, -14, -11, 14, 8, -5, -5, -15, 7, -4, -9, 15, -3, -1, 1, 6, -10, -1, -9, -23, -16, -3, -28, 6, 7, -25, -15, 13, 5, -9, -11, -15, -25, -28, -16, -8]
5360hjL9k1j9JL2lj0l7L3Mk3Pj0J7Kk5NL0k4J4l8K0L1pj4j6J5qJ4Nk4Pj5K2Kk7
5397c0mM3j9mRKK3j2l6K1J9k5LNOk0K2j7jK1pk1L1j3MKJ6Jl0KLK6k3k9J8lnM1
5435A9k4pQk7M4m4O1l7J7k2K5mk0nKjLnJ5k7J7L8k4rK2MnojJ7j8Kj2k1M%L2qm4
5474d1L5k4j9L9mJ8l3L1L7k3k1mJ0M%Nkk7L0%LNj8j4J4j3J5k7K2J4Rk0K5j5O%
5510A7k6J7k3mK2oQPok3nK5l9K5OOK2k6oLJ0k2K9K7n3J1k4K1K9k4pqmJ5lNj8M9
5548B7k9j1j1J6K0k1K9Ln7M3J3m7M5k4K5m7KK3k5K9J5Jl0K3j2j8K1j0J5KqolN
5582bj1L3j7qJ3K4n9J7PK0k2lKPmQNnk0J8rK4j6j9JJ4oqKK0k4L2m4L5mLj2J2k1
5621a7L1l2M9l7kK6l6K0j0L2m1K1j5J1j3RoJ0J3k5L3k1kKk1Pj2jK6k0L0m1J6J9
$$ y = [-8, -9, 30, 9, -10, -9, 23, 20, 10, -27, 6, 10, -13, -6, -16, 1, 3, -22, -17, 13, -11, 3, -35, -15, 16, 9, -5, -21, -6, -14, 0, 5, -19, -12, -27, -5, -3, -30, -34, 9, -10, -14, -5, -3, 20, 8, -28, -7, 12, -13, -10, -5, 1, -19, 3, -14, -15, 6, -1, -22, 9, -4, 0, 2, 18, 19, -11, -9, -6, 20, -3, -32, -14, -17, -22, 19, -5, -12, -4, -31, 13, -31, 30, -7, 10, -12, 13, 9, -11, -16, -14, -15, -12, -17, -2, -29, -12, 26, 2, -7, 15, 19, 14, 8, 7, 24, 6, 8, -4, -25, -21, -21, 11, 3, -41, -6, -30, -49, -10, -14, 4, -29, 2, 39, 16, -5, -9, 1, 5, 5, 10, 8, -19, 11, 11, 14, 19, 1, -13, 1, -12, 3, -24, -2, 12, 21, 1, 26, 11, 17, 17, -9, 8, -15, -19, 3, -3, 5, 12, 6, -17, -22, 3, -36, -11, -5, 1, 23, -3, -9, -6, 4, -18, 11, 38, -15, -4, -28, -7, 22, -2, -9, -17, -21, -6, -9, -4, -22, 27, -2, -13, -24, -8, 12, -9, 20, 23, -34, 9, 22, -25, 20, -4, 21, -26, -24, -1, -26, 3, 18, 19, -11, 12, 0, -18, 3, -7, 8, 10, 2, -4, -7, -2, -13, 20, 3, -5, 8, 32, -27, -10, -3, 17, -5, -8, -6, 1, -3, 5, 10, 5, -15, 3, -6, 18, 2, -17, -16, -2, -8, -16, -14, 6, -18, 14, -30, 5, 1, 4, -8, 4, -17, 14, -18, 31, -6, -8, 18, -18, 2, -8, 24, -17, 4, -11, 0, -13, -4, -10, 0, 13, -12, 21, 0, -2, 0, -21, -14, -26, -27, -1, -21, 9, -32, -16, 3]
5655Ckk6L2ok5K0M0m9J3J4k1J3J2k3K0Jnj7L0k6j6J3J4k4Pk0MM5l4J6Oj7j0J6
5689bQj3j6L7k2kMJ4%k9RK5%k7J7LnJ0%j3OkJ6j8k6K7l2J2K7k9JL1%J0k5j3L1
5726A4ok1jK3k6K2jj8K5j3j2J6k5J1L6k0pJ0JJ1Pl8J3l5L4QOJ9j5l8M3m3K9j7
5760hOjJ3k3PJ2qmroK7j8j3qJL4mj9J7K5k7k2L5Rm5M1kJ1k9k6K7k4K6Ok4L8j3
5797BJ8k5NOqK1m1J9j0J3m3K0M7l3j3L5j7j5PL6l1j2QJ4J5l6K0j9K3kRj1J1k7
5831a4K4j6J0nJ3j5K1l2Rkj1OOJ2QRl7K0Mj2j4J6k4K6mKNk8j8L3oJ8l4K3J3j4
5867hj9KK4J0qK6j9j3J6Jj8qJ6l4RL9n8N4rJj4J6j5MJrLPPJpmj8RJ0j4J0J6j6
5906iMJ1kj4mK1j0lj3L5k0rJ1L4j6qk4N1l2k2lJ9KjqJ8nl5L1rj1K0Jj2j3K0rJ5
$$ y = [3, 1, -25, 7, 1, -24, -4, 36, -13, 0, 14, -7, 6, 18, -5, 15, 16, 11, -6, 24, -2, -18, -5, 9, -15, -8, -28, -24, 21, -13, 3, 9, -8, -18, -2, 6, -7, -23, 14, -8, -10, -6, 8, 8, -21, -12, 13, 13, -14, 3, 6, 1, 11, 11, -2, 4, 2, 18, 0, -26, 1, -31, -19, 8, -21, -20, 11, 11, 21, -4, -17, 14, 8, -13, -14, 9, -17, 5, 4, -14, 11, -2, -14, 2, -23, -12, 24, 4, -3, 7, 8, 19, 26, -12, 1, -34, 0, 8, 14, 33, 18, -20, 23, -20, 9, -8, -2, -3, 10, -13, -6, 6, -2, -6, -15, -21, 6, -12, -25, -33, -32, 2, -2, -21, -4, 21, -6, -28, 7, 16, -29, 12, 10, 21, -8, -34, -7, -31, -5, 1, -23, 15, 2, 20, -5, 0, 6, -2, 19, -22, -3, -13, 0, -43, -23, 24, -9, -22, 13, -4, -19, -12, 24, -7, -19, -11, 3, 18, -18, 2, -17, 6, 4, 13, 2, 13, -14, 10, -6, 4, -1, 12, -3, 18, -14, -5, -7, -18, -12, -6, 6, 14, 23, -14, 6, 10, -2, -16, 0, -24, 2, -2, 0, 5, -23, -41, -8, -14, 4, -30, -7, 6, -8, -27, -25, -1, 9, 1, 27, 8, -5, 11, 12, -6, -14, 2, -32, -23, 16, -42, 12, 3, 4, -10, 6, -9, -5, -4, -13, -10, -3, 4, 5, -2, -6, -24, -15, -5, -19, -9, 7, -9, -5, 6, 4, -10, -14, 7, -3, -6, -19, 16, -4, -13, -2, 32, 16, 8, -16, 35, 3, -19, -22, -3, -1, -2, -10, 8, 3, -32, -1, -10, -21, -1, 0, -12, -25, -5, -14, 1]
5944Aj3k0J4%LK1j3j9M0m9L1j1MJ2M0pl5mJ8j9l1J8M8jl9J6ljoJ9m7LL7j4J7j2
5980bK2l1L4j5j1LoLK4k8J4oJ5l9K7j4LPJ4J6l1ML6l2Qj7Ml0L6j8j9QK3j1Ok6
6016b9N5m6L6ll2J8j1RmPOlMlRpj1Jj0J4k0NK5kJ8j7Qj4J0j4O%opL8j0rj3mJ1
6056EK0l1jj6J8l3K9K3k9L2k5J1MQJnjqK2k1k3J8LoK2nKj6K0j3Pj0RMj7%J4l3
6094b1L4J1j6kJ0j3Pml0L1k1ppM1l3J7J3l9K3J7l0J4Pk3QmL5k6J5j7MK1j4OJ3
6129B0oj0L0j4lMj1L8o4L8k2PNj3Qk1mJ8prK9Jj8kJ6k9K5qKJ9l6J5oK8j5J6j0
6166A1j3k0N5l2ljLRk4JRj1J8J0k7J3MJ8j8l5L9k4K8j8K0j2k0K3k6J8LK4oK3k5
6201A4j4KOQj9MOK3k0%j7K9n0N6k3Pj2J6j6j0KJ5j4J8j1k1M6l5K3j8K3k9L5j0
$$ y = [1, -12, -32, -18, -18, -15, 6, -7, -26, 14, -35, -4, -15, -11, 1, 41, 34, -1, -5, 13, -6, -37, -19, 29, 28, -11, 5, 2, 1, -5, 14, -33, -30, 7, -7, 10, -2, 20, -11, 23, 8, -3, 0, -6, -3, 21, -7, 7, 1, 16, -23, 4, -10, -7, 0, 14, 30, -1, 3, 39, 7, 15, -2, 2, -28, 8, -10, -29, -21, 2, -9, -3, -29, 26, -20, 16, 13, -19, -1, -12, -3, -7, 0, 6, 3, 7, 4, 13, 6, -5, -4, -14, 0, -20, -15, 10, 8, 26, 9, 17, 3, 13, -1, 5, 5, -1, -8, 30, 20, 11, -2, -6, 5, 25, -6, -7, -23, -5, -38, -9, 14, -15, 17, -8, 3, 7, 15, 16, 11, 10, 2, 24, 3, -20, -2, 1, -5, 17, 12, 14, -2, 18, 5, 12, 2, 11, 15, -2, -2, 12, -21, 13, 24, 8, 6, 16, 3, 10, 6, -24, 7, -14, -21, -28, 13, -20, -3, 10, -29, -6, 11, -19, -5, 2, -21, -13, -17, 18, -8, 7, -10, -6, 15, 1, 7, 20, 14, 4, 34, 20, 17, 21, 10, 48, -16, 22, 0, 7, 12, -1, 7, -14, -18, 0, -7, -16, 13, 14, -4, -6, 10, -19, 6, -2, 0, 19, -17, -2, -8, 20, 5, 21, 11, -2, -22, 33, 1, -2, -3, 0, 9, -15, -14, -5, -16, 2, 12, -15, -2, 2, 20, 2, -33, 6, -18, 10, -8, 12, 0, -20, 3, -23, -5, -2, 22, 16, 39, 14, 0, 2, 8, 16, -3, 1, 7, 30, 10, 10, -7, 22, -28, 28, 5, 12, 0, 16, 0, -10, -8, 7, -7, 11, 0, -21, 25, -10, 13, -5, 18, -11, 24, 14]
6235A4kj4qKJ3j6MK5l5QOOJKJ1k9M6j4m3J8PlJ0J0k3KmJ2l2J0J0k7L8j4K4k9K9
6272A5j7lj2J3L3l8njK4Nk5J6KMj2qJ1k7L8%j3K2j7J0l6J9L0j1k9J3L9l1l6L4
6306Gl8MK9J1Rk1Rj3Omnj8OJ4L7l4L4l3M4m0j8QJ1k7J6J3J0jNk7J1RK0m3MPlq
6344ikk2J3K1j3K5j1OlPl6K8j7j5LK6j5J0k3oK2Qj1J4OJ1qj0RKLl3L0jRPkn0L5
6383Hj3PQj1J3%k2J1Ro1M5JLJ7j5Ql7M2J2l8J3k1OJ0%K7k1oJ0k8jPJ8KL5j7j9
6420BNj9J2MOJ5j9K8j3k9K4l1J2K1l5J1oj1K3pj6KJ6J1k6QK0Nll4J2L1l4J9M0
6455D4n5J4rM0k4k2K2j4qk3P5n1L4%k7J4l4N2m3lJ9j1Pj4K0j9J1j8K0k2J8J0k
6488A%OQj7Qj5nJ8nJ2l4NjJ7k2L3j0K1j8PJ2l0J2j0%j5M5j2j8J0jj0j0K3Pj2j8
$$ y = [14, 12, -2, -10, -8, 5, -11, -7, 18, -17, -9, -3, 3, 4, 6, 17, -12, 34, 20, -23, -5, 2, -1, 9, 19, -4, -2, -6, 6, -26, -16, -6, -33, 5, -9, 15, -14, 15, -2, -5, -17, -4, 29, -9, -14, -15, 9, 14, -11, 5, 7, 11, -1, -9, 2, -25, 13, 13, 0, 22, 5, 15, -21, -2, 28, 17, -12, 1, 40, 9, -27, 7, -31, -27, 2, 13, 22, 1, 10, -3, 3, -1, -6, -24, -18, -4, 33, -1, 33, 0, 44, 4, -14, -6, 5, -22, -6, 7, 17, 16, 21, -6, 5, 14, 34, -9, -5, 2, -1, -9, -11, -33, -20, 1, -12, 13, 2, 8, 5, 12, -24, 4, -13, -28, -25, 1, -14, -4, -27, -33, -11, -3, -14, 0, 6, 17, 9, -1, 8, 10, 13, -20, 10, 9, 18, 25, 23, -27, 8, -5, 2, 10, -1, 12, 12, -10, 1, 10, -51, -6, -5, -2, 15, 0, 8, -29, 13, 25, -13, 0, -21, -15, -5, -5, 22, 1, -5, 5, -23, -24, -17, 1, 3, 38, 21, 2, 7, -12, 0, 4, 10, 25, 6, 34, 21, -8, 16, -15, -3, 18, -17, -6, -12, -23, 0, -7, -23, -21, -5, 6, -20, -12, 8, 13, 10, -24, -12, 19, -15, 4, 44, -11, 3, -6, 34, 10, -12, 10, -4, -12, -35, 40, -11, 23, 23, -4, 10, -24, 28, -15, -18, 1, -10, -3, -17, 3, -16, -5, -23, -3, -25, -7, 3, 1, 1, 7, 15, -2, 6, -9, -14, 4, -1, 11, -23, -18, -19, -2, -24, 9, -1, 20, 2, 9, 21, -9, 3, -7, -7, -22, 23, 11, -7, 3, 2, -8, -18, 5, 12, 0, -18]
6525a8K0L1l2Jj4NK4J2l8pJ8j7L3Kk4L1j4nl5L5Rkpk0MJ8j1j7LJ9K5nl6j5K3j
6561eJk9PM5pl5M4m0K3Qk7LK6qPk5K1KpkN1l7NMk3J4k2MRJ6k0j7J5Kj3K5Om0J2
6600gJ4j2k0K6mk0PlK4k4J0K3j9OqnJ7j3K1Jj0K0Lj3J4kpk%q%j7J1j1Rj2K2j6
6638ej6J4%j3K2JLm8O5l7rNK0J4j5kJ4Pk4J2J7j3l5K3J6k2QJpJj8J4JJ8J4Ml4
6675dJ5l4KK7ol%rJ1JK%j3j0J3j7K4JK9j3M1o0oJ3J4oj5J3m8L8jj5K1Oj6K0Jj6
6713@lpJ7j0J5Jl6qK6jNJ7j4nRl3L4k7J5j5Rj0K0qNJ2k0L6qk9K8k2Kj4M1j4pm
6751co%PRl1O3m1rK5oJ0n0O0l8J0kj5J8l3L0nj2j4J3K7j4j4POLrJ8mlJ2q%Jj4
6790a2J0J4J2j3pLj3LJ8Nl8JK1K3m0J6pJ7l1K6m9N3J7k2j1rL7l3K0k1O8o5L7k4
$$ y = [-18, 2, 33, 1, 2, -12, -7, 17, 29, -9, -16, 2, -15, 18, 20, -4, 27, 13, 8, -27, 8, 17, 15, 8, -12, -8, 10, -1, -18, -15, 4, 29, 24, -12, -27, -4, -5, -4, -33, -26, 19, 12, -23, 21, -19, 4, 12, -15, -12, 14, 6, 13, -12, 9, 11, 4, 2, 53, 16, 21, 25, 2, 16, -6, -2, 7, 23, 3, -14, 1, 3, -10, 15, 21, -19, -7, 7, -5, -25, 1, -3, -23, -16, -19, 5, -19, -9, 14, -5, 1, -7, -12, 5, -8, 13, 14, 4, 24, 27, 14, 28, 26, 19, 17, 17, 9, 9, -8, 3, -8, 1, -11, 11, -5, -21, -7, -7, -20, 2, 3, 6, -42, 23, -14, -23, -18, 2, 16, 1, -1, 13, 20, -4, 8, 25, 12, -23, 0, 16, -6, 2, 3, -4, -3, -21, -7, -6, 12, 26, 30, -4, 11, -23, -21, 6, 0, -3, -3, -12, -1, 0, 2, 2, -11, -21, -8, -25, -1, 0, 29, 16, 57, -3, -9, 4, 18, 12, -3, 10, -38, 0, -1, -16, 5, 11, -5, 15, 16, 0, -3, -10, 7, -3, 12, 13, -23, -31, -5, -6, -1, 16, 2, -3, 6, -27, 7, -20, -5, -20, -11, -21, -1, -9, -4, 8, -12, 24, 16, -13, 15, -7, -5, -19, 22, 8, 1, -3, -9, -9, -2, 7, -24, 39, -2, -11, 14, 8, 18, -32, 28, -10, 0, -2, -17, 1, -32, -2, -7, -19, -33, -20, 7, -7, -21, -14, -8, -5, -14, 4, 0, -3, 9, 1, 1, 2, -12, -2, 12, 24, 11, 4, 7, -6, -3, 15, 20, -18, -17, 4, 27, -13, 3, -4, 13, -18, 8, -41, 12, 29, 7, -4, -13, 24, -9, 11, -10, 58, -7, 30, 6]
6824Fk2J5j9ONL5k6L5j2k6rOJ4l7J8OJ4k2LJ9Kj4J2J2k6qL2l3KJ0Nj0jJ9j8J1
6860Dj4K3j4J4k5KJ5j9RJ0j7J7qJ7j2mj3M9k1k6L4omk0K4j3J4jlm6J3K0j0K8j0
6895Gl2K4j9J1jKNJ3K2l2Lj4K0kj6J9k9M4l3L3j2j9K8oqOj3mL9Kmm2lJ5nk2M2
6932A9j9poJ%j7L8k5J0k8K7LK9m5L0j6J0k8KJ4Kj5K1RPrJ9J3k9j6MJ1k6L0k6L3
6968B0k5k0J9L0l1MK3k4k5M1mJ1k4J1j8L3k0kJ0j9QkK5Kkk1LNj1K8k6J7j4PpK9
7004C1k5k6L5rj4rJ8k6K9Pj6J7k4K8j7j8KPJ7j0j3J0K4j1J8j1J2Qn2L1pJ3k2K6
7038B3l3J6j4Qk0M2j9NQj1nK3j6Oj6rJ0MlrLJ0k5mLM5k7MMJ8k6J3j8J7k7KN2k0
7076A4mj4J6K4l9mK5k3J8%J0k2J7kj9J2Lj3rqoM7j4j5Pp%PR%k2J6J3qmJ7n3M4
$$ y = [6, -16, -1, -20, -14, -9, 26, 0, 35, 23, -3, -12, -6, 8, -29, -11, -5, 9, -13, -10, 9, 11, -3, 9, 21, -5, -13, 19, -14, -12, -2, 3, -7, -8, 11, -7, 4, -10, 13, -1, 13, -12, -10, 5, -14, -5, 5, -12, 5, -3, 14, 2, -2, -15, 34, 13, -13, 21, 15, 11, -9, 15, 2, 16, 15, 12, -34, -21, -1, -11, 17, 7, -25, -1, -20, -9, -10, -8, -3, 10, 32, 0, 3, -11, 9, 7, -9, 10, -19, 25, -8, 25, 13, -6, 22, 16, 8, 14, 1, -3, 36, 38, 34, -8, -11, 4, -1, -23, 19, 0, -7, -13, -12, -12, -29, 9, -16, -6, -34, -7, -4, 25, -20, 10, -6, 4, -24, -22, -8, -6, -21, 0, 9, 16, 7, 26, 39, 10, -6, -2, 9, -17, 13, -13, 20, -5, -25, -6, 24, -7, -3, 20, -4, -29, 12, 8, 19, -5, 6, -12, 21, 1, -1, 9, -10, -2, -4, 21, 23, 21, 0, 3, 8, -3, 25, -1, 16, 2, 9, 2, 31, 6, -20, 15, 6, -8, -17, 1, -25, 4, 11, -5, 12, -12, 16, -1, -19, -17, -10, 7, -3, -16, -6, 18, 7, 25, 14, 26, 34, -18, 13, 6, 19, -3, 23, -10, 6, -8, 0, -20, 22, 3, 8, 16, 5, 0, 23, 7, 13, -3, -12, -2, 2, -1, -10, -7, 3, -22, -26, -23, 22, -5, -1, 3, 21, -5, 8, -10, 7, -20, -18, 34, 14, 10, -4, 12, 36, -3, -7, 18, -5, 13, 13, 23, 1, 18, 16, -3, 9, 12, -1, -10, -18, -24, 23, 9, -6, 1, -6, -6, 1, 10, 10, -12, 4, 17, 9, 5, 22, -31, 13]
7114A3qLRk5L7k3MmK8l0j4jJ7j1Oj1J1Pk0K3qnRk2K8j6K4lk9J2KK0l9K4oKk1O
7152a1mj7M5k9K8rJ9Km8M5j5k8N1m6L2k2L3j7NopNJ5k2LNrLjM0m3J2kjj2J3j8
7189a1J3Qj2N%Nl1J2RJ8l3l2M5JQJ2l4J5jK6qj4JQmJ3pRj2j7L4j8j0k1K1lj7R
7227a3KJ6jl0M2m3L0k2K8k6L4k6JJ5j6j5M9k7Rl3M9l7K8oJ6k5J7nJ0j9k7J6K8
7260A9k2J5J4pn2J5K8rL6l7L9m8L2lj1k6QnjJ7JKj7J1j4J5J0nmK1ok3J8lj3rj4
7297b8K0Jl%K5lJ5k7mnNJjrJK7m0J0%M3k3j7J9Olk5K0J7k4QrJ4k1NQJ8pj1M%k7
7338b0J9j2Rj4J7qRmrK5PNo4K7K4k3LJ5L0n2jK7lJ5j7j8jK7k6L0l4QMK4n3L2l
7375eJ9Qj2k2J2Jj7J4LJ4k8J8j5JoL1j8nJqK9k8K5l9K0j4K4J4l7QL7k6Oj2J6o
$$ y = [13, 5, 8, 17, -8, 29, 6, 10, 6, 34, 4, -10, -11, 6, -5, 1, -10, 1, 8, -12, 11, 3, -2, 7, -15, 13, -3, 21, 18, -11, 1, 3, 23, -16, 8, 2, 4, -17, -11, -15, -32, 13, -16, 12, 3, 22, 24, -24, 21, 6, -22, 29, -17, 15, -7, 26, 9, 14, 8, 1, 6, 21, -1, 2, 7, -2, 1, 0, 40, -3, 9, 7, 6, -6, 7, -11, 2, 10, -2, 3, 3, 8, -23, -11, -2, 16, -17, -49, -4, -3, 5, 17, -17, -2, -3, 23, 15, 1, 2, 10, 6, 19, 12, 21, 9, -8, 26, 8, -2, -23, -2, -5, -22, -13, -11, 5, 4, -26, 16, -27, 3, -19, 9, -17, 17, -9, -8, 7, -9, -24, 25, -2, 7, -26, 23, -14, 14, 8, 24, -1, 16, 11, 21, 2, -25, -9, 19, -3, 12, 26, 19, -33, -18, 10, 1, 37, 0, 39, -9, 23, 20, 9, -17, -9, -14, -15, 2, 3, 5, -12, -1, -15, 0, 10, 5, 1, 22, 16, -7, 11, 8, -5, -14, -28, -8, -7, -10, -10, 15, 12, 27, 0, -4, -9, -4, -3, -4, -13, -12, 15, -25, -15, -15, 28, 5, -12, 7, 13, 10, -15, 5, 22, -2, 6, -3, 11, -10, -5, 3, 21, 14, 3, 7, 7, -20, -1, -13, -4, -18, -1, -9, 0, -4, -13, 12, 19, 24, -40, -13, 11, -12, -9, 6, 36, -16, -17, 10, 7, 22, 5, -13, -14, 13, -13, 17, -17, -9, -5, 19, -34, -2, -5, 14, 22, 10, -12, 0, 1, -16, -2, 1, 15, -13, 5, -10, -9, -15, 16, -2, -7, -6, -14, 15, -13, 12, -27, -7, -21, 3, 17, -20, -12, 25, -1, 5, -7, 9, 3]
7411CpJK1k1lrJ0J4qQpJ1jk1LJNm%K1j1r%pJ6j3J5j0j3KJ7ojl7M8k0j9M3k0J2
7451Dk9K5J3Nj3j5K1j2J1j2J0j1L0m8K8k1k3N2k3j1J9JpjJJ9j9pO%JrK2jnKj5
7488a2kJ7k3J9J2l9L3nKj8K4j6rqK2K9Kn7N2k6jLj4qJ8J7j8K1Mk6k0RL9l7J7j1
7524a0J3j5Rj4Rj6J2J4J9m9K0%J1K3l6K7k1LMmRk4M2l5J6Nm2L4k2J6j9K8qj6J2
7559elk5K8Nj2oL5l0J7mK1m1mK2p%K6j9J0j8JJ0K6j7j3l1L2J1k2OJ1K3j0LlJ3
7595C0m7oJ0MoML4l3J8n2N1J4k3j0LNL8l0m2K6J3qqKK6Rj4k5L1j7k2J9J4k2j0
7630b4M2j7%lj9mK9lOj3J7j5K1k9jK3j4nj5rK3%mj6L0ooK8K0l6k6K1j7L0Mk3J7
7667FK7j2k6j1J1Lj7L1qk2K3K4jpk1rpK2qmKPj5J7l4N0j7plMNj4Kj5RJ9j1J%R
$$ y = [3, -4, -3, 18, -3, -6, -15, -5, 9, 1, 9, 2, 13, 12, -9, -6, -5, 0, -4, -4, 17, 6, -3, -3, -10, 6, -7, 8, -2, -15, -13, 4, -2, -3, -40, 8, -12, -31, 12, -8, 4, -25, 0, 13, 18, 5, -10, 11, -1, 10, -2, 8, -3, 27, -21, 7, -14, -37, 15, -8, -19, 0, 1, -6, -7, -6, 13, -6, -13, -7, -7, -6, -15, 7, 6, 1, 3, -12, -14, 3, -20, -1, 11, -28, 5, 0, 2, -16, 8, -8, -17, -25, -3, 26, 28, -29, 23, -3, -4, -1, -15, -23, -5, 12, -6, 15, 19, -7, -27, -18, 21, -16, 1, -10, 3, -12, -3, -17, -8, -24, -12, 2, 21, -28, -8, -8, 3, 26, -10, 17, -4, -1, 3, -1, 8, -16, 26, -9, 7, 12, -30, 4, -18, -2, -21, 7, -1, -17, -5, -8, -33, -5, 0, -12, -18, 17, -13, 4, 0, 21, -20, -24, -2, -9, -9, 17, -2, 8, -10, -9, 1, 27, 10, -3, -34, -2, 9, -13, -7, 4, 27, 17, 20, 17, 30, -17, -23, -13, -9, -15, -11, 23, -10, 8, -44, 7, 21, -2, -12, -9, -4, 34, 4, -38, -12, 1, -7, -15, -13, 13, 22, 8, -17, 14, -3, -25, -6, 8, -14, -24, 18, 1, 1, -2, -21, -25, 4, 1, 7, -6, 11, -4, 17, -12, -13, 10, -4, -9, -24, -33, -10, -10, -14, -30, 0, -6, -12, 16, 36, 0, -26, -5, -22, 8, 12, -11, 6, 33, 21, -5, -16, -5, -2, -19, 12, 4, -18, 5, 29, 28, 21, 0, -9, -16, 6, -2, -6, -4, 3, -12, 5, -29, 21, 4, -3, -6, -2, 3, -11, -9, -24, -15, 4, -7, -6, -6, 3]
7707Cj3JK8lpmk3K5J5j0Oj6Qk4nJ6qL5j6mJJJQk3Mj2NK7KNjk2J9m0K3rJ5j7k7
7747c6M1Mk0Lj3K0j8J7J1Mj9jk%nQPj9J9J1ml1J8K0j1m3L6j9J4oL4j7J2j4j8J
7783a6K4K1l5QRJ4j6k5K0Ll0K5mpOJ1k8L1k1K1j3j4K0nk8K0kK1j0k1K5j4kNrj
7819a7J0lK0j6K4k0lMmj2L4l1L0k4j1k1N0J2j1K1n4J1J7j7Jk1M1k3L2k1Qk1J4
7852aMm1M9l6M3j7J3k5K6l6L3l5RK4j1J5j3mkKNK1j6K3l6oK2m1N2oj8mL7k4K1
7887B7j2k4K5k9K8roJj3K2J3k5j5j9J5LMML0nj2n3N2%llj0K4j7L5j4oj8JJ3k0
7923a6L4Ll4J4l3K6l7N5j1LOj8K6k6K0Jk4%J7mJ4j8LJ8k9k1K3K8Lj7J4j7j0rL4
7958A8j4j9K5J3ONkk8lk5lK2k3N1j0jj8K4k1qPk2J4J6Nk0OqJ1j5L1j5J6Rol5J7
$$ y = [3, -10, -9, 19, 16, 9, 5, -18, 7, 22, 12, 18, 2, 10, -14, -19, -3, -11, 24, 8, 4, 5, 6, 7, 15, -8, -4, -16, -11, 16, 18, 23, 22, 0, 19, -21, 2, -7, 8, -9, -36, 5, 9, -11, -8, -21, -1, -19, -2, 9, 13, -6, -7, -9, -9, -14, -6, 1, -18, 1, 12, 8, -23, -5, 15, 4, -39, -3, -22, -8, -14, 20, 3, 15, 1, -17, -16, 8, 29, -6, 2, 11, 25, 9, -16, 4, 7, -23, 2, -2, -9, -3, 8, -20, 11, -10, 11, -2, -16, 4, -1, -29, -9, -11, 10, 0, -21, 4, -10, -12, -7, -16, -17, -7, -10, 10, -6, 18, -2, -5, -1, -5, -17, 17, -14, 16, -8, -19, -40, 10, 22, 11, 32, -22, -11, 6, -11, -10, -31, 10, -13, 19, -2, 6, -15, -1, 3, -38, 11, -25, 18, 1, 14, -11, 15, -21, 12, -23, -14, 10, -1, 14, 1, -3, -5, -3, 2, 23, 7, 30, -6, -12, 10, -31, 21, 15, -3, -7, 30, 6, 27, 15, -9, 16, -13, 15, 6, 0, 1, -12, 10, 23, -2, -17, -36, -21, -18, -14, -10, 20, 15, 3, -50, 2, 2, -1, -4, -14, 10, -7, 28, 14, 8, -10, -9, 4, -16, 18, 21, -13, 1, -32, -6, -43, 12, 1, 4, 10, -8, 18, -8, 12, 13, -11, -11, 6, 2, 16, -2, 1, 19, -10, -31, -8, 20, 23, 6, 20, 3, -7, -16, 18, 4, -15, 10, 23, 29, 34, 32, 4, 1, -24, -27, -5, -28, 23, 13, 12, -6, 18, -3, -11, -4, -26, -12, 4, 9, -11, -5, -13, -2, -17, 14, -1, 15, 24, 18, -17, 0]
7995@K4l2J5j7J6kj4JrJ9J9j7j5J7%k7N0k6QnJ0l5jL3j1mj2L1j5Kqj4j6K0K2K3
8031C0k4kOpkmrQJ0J0j7Mjk5J1J4Kk4K1Mjl0ONKL3on0K8Mk6K2k4K7l0M7j4Joj1
8071a8J1MJ0nj0K7l1k3N6k3J4Qk8K0qL3k7rj6L0n0L6J3oj%j4rjmJ4K2ol1rRM2
8108B0k9jJ4k2J8jK1%k5NnOkj3J4Oj6J1j3J5J9oj8k3NM3m1K8Lnj7lJ3k8J3j5J1
8145a8MOj1K2J4l1rK0lJj7K9Nm0L9%Rj4pk4j1K2pJ7nPnj0J9nJ1J2l6Rj1Ql0J2
8183b8L3j8J4rorL5J
$$ y = [0, 24, -8, 7, -10, 6, 4, -10, -9, -18, 1, 20, 3, -12, 5, 5, -22, 28, 2, 10, 5, 15, -20, -21, 12, 1, -3, -15, 16, 1, 3, -5, -19, -35, -15, 7, 30, 6, 4, 10, 3, 1, -3, -12, -4, 6, 16, -1, 3, 2, -23, -12, 2, 4, -20, 1, 5, 4, -26, -20, -15, -13, 20, 14, -36, -8, -4, -30, -8, -32, -5, -35, 12, -2, -1, -7, -18, -7, -3, 7, 2, -8, 19, -12, -35, 21, -2, 12, 20, -8, 12, 4, 37, 10, 1, -15, 15, -35, 1, 14, 8, 7, 7, -7, -16, -17, -21, -7, 15, 9, -22, -31, -22, 20, -9, -10, 4, -18, 0, -1, 20, 20, -5, 0, -5, 1, -1, -14, 0, 6, -10, 1, -12, 3, 22, 16, -2, -25, -20, 23, -18, 10, 13, 8, -9, -12, 1, -27, -14, -29, -18, -14, -8, -19, 3, 17, -14, -23, -3, -6, -5, -22, 7, 12, -28, 11, 11, 20, 6, -1, -25, -36, -14, -21, -4, -9, -2, -7, -17, 2, -3, 8, 20, -16, -7, -18, -10, -40, -28, 5, -13, 1, -8, -14, -23, 12, 13]
8191A3
$$ Imaginary data points
##PAGE= N=2
##DATA TABLE= (X++(I..I)), XYDATA
0@%%%%%%%%%%%%%%%%%%%%%%%%%%%%%%%kQj4J6j6J6j6J6j6J6j9K6l1L2l2L4m0M6
49B4m9N2n8O5p2Q0q8R7j08J22j38J56j79K10k49L02l81N10p52J363o070j0823
71a5986J3207J3936l855j2107l28P401K091n069k506L190M240l77n006m672K188
86c653P149K752o114n789K669N576q95l498J803L562k605n024J554N999R23m828
102d19k841K460K807r01k914l60K986K166k914m717R94O554K440n889n150L796
118a902O579r87o105j125M960K593l032l486M55K636J599r41k688j342K324K636
134B174j614l278J235M095m10m434o51M299J951l048k042J968J274k017j157K253
150E98J750j865k670j2J900J490Q9j385j738K79K265Q06j790p11K231J027k794
$$ y = [0, 0, 0, 0, 0, 0, 0, 0, 0, 0, 0, 0, 0, 0, 0, 0, 0, 0, 0, 0, 0, 0, 0, 0, 0, 0, 0, 0, 0, 0, 0, 0, -2, 6, -8, 8, -8, 8, -8, 8, -8, 8, -11, 15, -16, 16, -16, 18, -22, 24, -25, 27, -31, 34, -38, 42, -46, 51, -57, 65, -73, 83, -96, 114, -135, 167, -214, 296, -456, 907, -5163, -15986, -2779, 11157, 7302, -4805, -5133, 2268, 4359, -710, -3216, -26, 4214, 3837, -1169, -5841, -3653, 3496, 6248, 134, -5655, -2986, 2590, 1695, -1803, 0, 3562, 957, -4067, -2513, 3486, 4409, -419, -3260, -800, 2007, 1106, -1808, -2168, 818, 2984, 70, -4647, -3653, 2901, 5341, -548, -5698, -1902, 4677, 3690, -2415, -3540, 1420, 4013, 981, -2505, -2050, 586, 2185, 1244, -1444, -2786, -462, 2174, 560, -2718, -1483, 2612, 2202, -2232, -2883, 1416, 3367, 319, -1723, 245, 1519, -498, -1655, 598, 2348, 483, -2187, -2199, -299, 1191, 1280, -105, -1843, -1564, 701, 1507, -283, -994, 1237, 2264, -530]
167e30k398K437L859n70m058j881K004K515L3j550j053M31Q55j05r00L39J851
184A279O03k166j984J477K849K09k340j107Q71O95m64j50N94K6q56o47J23Q08
202a80Q62O4j048q72P34J322j4j014N9R55k38j320o2J478O20j389j281N13J171
221C60R8p60m31L50N33J61m64m24N71R59j98j167k12J192O42j028j041N72R73
240F86k32j091k24O35M68j95m10j52K36M44J01l45q5N27K99n07n93M93P74k75
260E54q94j44N41J02m33r3M08j5m37j78L99M55O9k23l18K8L85L88j67m78rL74
282C14o7n71q9N87J74o12n56L03O37J02l13k32R4K88J71m5p8R1J81j41k75n1L36
305B48J23l73l34R8J86k3j59J8O5Ok9Q9J77P1j6k0n4N3R7P4j98j51J26L8k22j76
$$ y = [-530, -2928, -491, 3368, 2798, -1260, -3141, -1137, 1378, 1411, -139, -1192, -761, 94, -11, -911, -572, 1279, 1882, -284, -2268, -791, 2058, 2267, -73, -1180, -309, 386, -78, -228, 366, 392, -464, -1111, -988, -180, 682, 746, -302, -1174, -440, 882, 868, -146, -87, 868, 630, -690, -752, 726, 1346, -43, -1324, -811, 360, 458, -302, -733, -383, 150, 311, -153, -577, -6, 953, 755, -412, -624, 568, 1210, 182, -859, -287, 686, 454, -637, -861, -226, 242, 47, -363, -515, -279, 165, 266, -79, -164, 363, 662, 155, -438, 55, 829, 554, -340, -484, 57, 159, -274, -367, 41, 26, -411, -589, -190, 265, 334, 111, -207, -179, 206, 594, 427, -51, -60, 314, 247, -324, -413, 174, 348, -264, -820, -517, 120, 222, -91, -323, -229, 59, 230, 185, 107, 198, 379, 238, -37, -88, 248, 371, -2, -336, -238, -52, -75, -234, -216, -151, -145, -174, -85, 92, 163, 147, 127, 73, 126, 223, 297, 99, -52, 74, 112, -110, -286]
331b86J64J26j47k43J36K15M2j24L5J29J00N9k7m4J4J8N8p2j95l8J51m7k19q3
355b78J76L8j21n8J30J24m3M1J02ql0R2M1n0r9j0Q5l2j33j25M6K2n3l7J3j8N3
382a32Q6O5m2PJ21J08j8j08JJ01Jr0j16n1K8K1o1q8l2L8K9K6O2k2l2J22J48k2
410A50r3J1J25R2j88j76O9J04k2j64j34O6L6L8j8rp8R7J56Q1j23o3J71J49r2j81
436DJ0J50lj29r1j2l9NL0%j10q1J50J81l4j77M7K45R5j40j29J22J14q0o3o9m6
463e0k7K4N4q8j80N1K21M7j69j06K13J93p1j11OJ44P6j02m8l9l6k0L5K3j46j57
489b63Q4J73J2k25m7K35J61j06j00O5J69K0q8LPk9KJ5l4k01n8J95J19k08j53P1
515a81K53m6j16LJ68L5j00O5P3op3k8P7n0j77n9J98L6k56j50J44K58o3j78K3J09
$$ y = [-286, -122, 4, -143, -386, -250, -35, 7, -117, -82, 47, 147, 206, 179, 135, 149, 167, 225, 153, -42, -80, 71, 24, -195, -278, -102, -64, -185, -243, -113, 11, -32, 9, 111, 103, 73, 165, 206, 156, 57, 47, 132, 100, -33, -158, -112, -90, -143, -180, -167, -185, -132, -46, 19, -23, -16, 105, 213, 195, 87, 88, 189, 190, 100, -16, -67, -39, -18, -79, -167, -199, -161, -132, -106, -44, -66, -98, 24, 172, 150, 57, 68, 193, 285, 97, -79, -10, 94, 72, -92, -226, -160, -124, -86, -104, -113, -191, -94, 62, 143, 20, -43, 128, 277, 185, 4, 14, 164, 161, 32, -59, -71, -110, -105, -75, -75, -185, -266, -116, 65, 31, -146, -99, 146, 241, 101, -28, 94, 208, 128, 65, -4, -50, -77, -53, 1, -87, -267, -216, 5, 52, -117, -223, -10, 183, 112, 1, 7, 151, 227, 125, 77, 38, 2, -18, 17, 40, -106, -263, -179, -6, 6, -219, -266, -31, 130, 24, -76, -11, 158, 178, 90, 93, 100, 71, 73, 88, 54, -147, -205, -10, 109, -99, -252, -181, 72, 26, -90, -87, 81, 116, 16, 81, 154, 148, 75, 47, 124, 74, -103, -162, 36, 72, -184, -334, -190, 68, 5, -173, -150, -41]
541d1M9O3O3l0j14K4J74L6j78j49R5J71j75j99K2K24K9k66n7J51J47MJk1ko9J39
568I1J40m2j90j09J62J09j25j71K2N5J0j07j5R3P7j4l2k0J1J20J20M9k01j23Q4
593fK79J0l03j65J33J54j14j34KR6j3j07O4J31qJ7j3K9q2J7J75J31k22k15K5K02
619H3O0j47j13m7qN1J16J6n6r0O3J36m0j1J00J20j29j89L3J88R5j19k35o7Q2J11
645CK3j02m6k8K3Q6Q5rpk9mL0N5KN8m1j45q7J02J19rj10j25m5N4J09J32o4j55
674a25l9J65J68m4j24R4M5j09r4J20J46p3j94j42R4J26J8q0o7o5J3J63M5Mk1j0
700A4k1l2J14Q0k7j07j43N6J28j2o6m6m3l6LJ08R7j0j30l8O3J88O8r6j36J3R4
727H3K1o4J5Mn5j68m9J35J76o6j87j19J17J95R6q3j19K9J02q%J4J01p8j67p8J68
$$ y = [-41, 8, 71, 134, 104, -10, 14, 188, 224, 46, -103, -8, 163, -12, -211, -189, 35, 64, -202, -259, -108, 39, 43, 44, 23, 21, -48, 91, 231, 189, -1, -110, 52, 161, 36, -135, -113, -58, -48, -155, -170, -77, 0, -14, -46, -66, -55, 65, 185, 234, 33, -90, -6, 273, 283, -20, -185, -52, 102, -12, -146, -144, -48, -61, -168, -104, 27, 19, 36, 23, 52, -30, -13, 162, 293, 71, -144, -119, 83, 143, -4, -117, -164, -172, -121, -5, 11, -45, -135, -72, 64, 24, 13, 113, 233, 104, -85, -52, 136, 231, 112, -123, -190, -108, 3, 26, -76, -122, -150, -127, -41, 44, 35, 28, -1, -5, 25, 80, 82, 140, 99, -46, -133, -31, 88, 79, -31, -156, -201, -147, -38, 94, 30, -125, -164, 1, 169, 125, 1, 95, 140, 31, -63, 57, 203, 130, -64, -206, -112, 14, 32, -48, -115, -180, -167, -4, 41, 45, 24, 14, -7, -39, 75, 155, 128, 21, -122, -66, 62, 50, -16, -62, -105, -141, -138, -30, 67, 57, -73, -111, -48, 140, 208, 112, -24, -11, 83, 104, 40, 55, 59, 4, -164, -213, -78, 98, 32, -155, -274, -157, 38, 134, 51, -68, -39, 63, 55, 55, 69, 170, 92, -75, -153, 15]
754A5J02k3k34p0Q9P4O0pj0k3j2K2P8P5K0r7j08j0J65P7j07j83J1O4%q8K4R1P
783Bj60n6J34K34N7k31r9Q0J88L4j02j03N4Lj4q7J0J12m2j35p7J03J63N1j76m1
809i8O6J01M1l5NK4m1r2JR9M7j34j22j6J07P0n1r7L4P8k8oJ9J21L1j01j30J33
837B6J31K0j50j56N7J73n0r9o3M7N6o0p1P4J32k3q1r0J45J11Lq7n1L1N8n9n2n
865c3N2l3r6kO5K8K3j08J5Q7O8k3o6K8M0Mn7N3M8Op1j02J1J02j1p8q2Q3L2km4
896f3nM2R6l7l5kQ5Q5j05j15LJ22k3n6r5L0L1J3k6k4M7PJm2N8L5J2J2l7LO0Rl9
929D7l7K3j7o3l5P9pn5n8N7M3M1m3rL7N2qRk6OM7m8j9m1K1KJq0j2N3J5j2l2qR7
964B0j8J1NK4K3j9PM5n5l0oJ7k8m0m5O1Jj1m3lO4l3J8J4L1K3qk1M1j7k9J8M2p4
$$ y = [15, 117, 94, -140, -210, -121, -47, 13, 6, -4, -27, -39, -17, 61, 136, 156, 59, -49, -59, 106, 183, 76, -107, -96, -32, -32, -120, -96, -5, 2, -158, -214, -80, 154, 211, -20, -119, -39, 149, 183, 81, -22, 32, 35, 21, -66, -56, 56, 14, -121, -198, -95, 68, 119, -57, -98, -32, 69, 110, 75, 80, 104, 63, -29, -28, 71, 118, -16, -138, -154, -47, 23, -28, -125, -91, -13, -41, -47, -28, 93, 124, 23, -107, 26, 157, 177, 27, -129, -72, 101, 51, -48, -111, -64, -8, -68, -139, -65, 67, 44, -37, -127, 18, 129, 132, 45, -6, 25, 83, 24, -28, -33, 19, -14, -110, -112, -47, -19, 4, -104, -89, -2, 66, 43, -23, 5, 45, 49, -8, 45, 93, 99, 28, -74, -63, 39, 28, -50, -132, -49, -17, -19, -63, -68, -26, 70, 33, -2, -4, 81, 166, 61, -54, -51, 71, 48, -8, -103, -73, -42, -29, -55, -79, -32, -25, -24, -66, -8, 27, 39, 51, 14, 17, 77, 86, 47, 10, 33, 16, -47, -82, -3, -10, -65, -123, -66, -23, 18, -25, -34, 3, 55, 47, 56, 30, 36, 83, 35, 16, -25, -4, -2, -1, -81, -93, -40, -25, -37, -69, -77, 20, 2, 13, 18, 42, 65, 46, 53, 98, 43, 13, 7, 24, -4, -44, -89, -28, -27, -38, -81, -84, -20, -53, -35, -21, 10, 33, 25, 4, 45, 28, -1, 17, 59, -15]
998a5l1PM5on7k8M5K7l8J5L6J2l1P1K9m0k1LP2j2p1n6O6K1p2o5K5N8k5l8L3K3
1030a8%qJ9N9o4QM5K0l6lj1K8n5j7LK6l0j5L3qj0m2L9Q1j9m8MR0J2l2l6QM3m8
1064A8m4rK3%mn2Qk0K3L6Rl1lM6M4pn5L8L5Km7JJ3l7m2j1P2mn4k6K9N0k3lPO3
1100D5k0j6kN4%j0k1m4J5K2Oo6k0%QJ9p2J7P3J5l0j1L0N6J4k3lrk3L4l0%j7k7
1134c6k0K3J2Mj2j8kL0K4J5KpoL8k9k2M9Rm9Jl4J2J7k6n8J1K3orL4oN1%j4J2L
1170A6L1j0%l9J9j0J7l9j4ONk1kK1j7k9M7M5rjKjJ5K7l7J9j0l2j5l8O9o1J1j2
1204d7MK1l5K2L8m5K3KK3NK1lOQjj8kk7Qmk9pKJ0l3K1QL5J0k1j3M7lJ0j2PLj1
1242B3j4k3J3lm5K1Ok4NNJ2lK0K4pPJ7kJJ1qJ2k7j7j0j1j3J8j3l0oJ3K3l7M4j0
$$ y = [-15, -46, -39, 6, 0, -57, -85, -40, -13, -51, -36, 0, 12, -19, 52, 81, 41, 20, 23, 95, 83, 12, -44, 22, 43, -29, -94, -69, -11, -36, -74, -41, -18, -18, -26, -7, 52, -12, -4, 41, 61, 25, 22, 11, 39, -16, -33, -30, -4, -34, -49, -16, -24, -34, -76, -37, 44, 25, -23, -19, 71, 83, 51, 15, 23, 66, 18, -26, -35, -12, -12, -16, -68, -60, -80, -57, -21, -12, -43, -46, 0, 44, 37, -18, 20, 55, 57, 10, 11, 24, -13, -55, -66, 6, 2, -52, -78, -49, 1, -22, -25, -18, 45, 25, 9, 7, 61, 61, 51, 30, -14, 1, 23, 29, -37, -57, -57, -49, -30, -102, -85, -12, 3, -27, -38, -8, 48, 62, 39, 36, 27, 4, 38, 8, 8, -9, -36, -56, -33, -21, -17, -29, -47, -49, -19, 5, 20, 22, 15, 9, 47, 18, -4, 45, 54, 5, 6, -28, -16, 1, -25, -83, -72, -49, -55, -64, -30, -36, 15, 15, 1, 13, 16, 47, 37, 37, -2, 17, 7, 24, -15, -29, -23, -18, -39, -41, -20, -37, -66, -19, 26, 17, 16, 18, 17, 32, 59, 22, 41, 31, -1, -16, -54, 15, -46, -35, -47, -43, -22, -57, -35, 3, -42, -19, -17, 6, 11, 32, 29, 35, 43, 42, 24, 22, -5, 3, -1, -30, -37, -35, -25, -58, -37, -29, 6, 16, -5, -18, 29, 26, 36, 24, 31, 34, 23, 9, -14, -1, -4, -49, -28, -22, -46, -41, -36, -24, -27, -7, 17, 10, 17, 34, 32, 33, 44, 36, 48, 21, 4, -6, -17, -30, -12, -25, -55, -61, -48, -25, -62, -18, -28]
1278b8jM1oK7nJ6j8k8nMOmn5MMK0Rj2k6J1L0OjL3J1Kj9%L1%K5m9m8nM2j6j3j2
1316b9k9OJ9j7L7L0j5k1PL8J4Rm4j4j9L4pkl4K1Rnl6L8j3Oj7MM9J4J8n4J6J3L1
1351E7k9j0J6l6kk4rO2j0n4o%MPL2KJ5j7j9L2j3M0rKl4lM3j1l5o3K5J5kMJ2M0
1387B2m2rJ7K9M7m0l0QN2j8ml6pJ4j8J5j3Rkn0pqP2J5J6q1J8L7J4Ql4K6Rj2j5
1422BJ7j3Qo1K2J3QJ2k7j9JM8J4rl5K0OnJ7%K5j5j7l8JO3p9J1qJ8Lk1OL7mJ7m0
1459b2RN9%j0m8L3j7K4k6j0j4J0Jj7J6jnKm0L5RN5j7m2K0K5k8MJ4k9M4p1J7lL4
1494A1k6k7j5L0K6k0j0J9L1KkR%l8N1ll1mJ9k2k1j6%K8j2k6N3k4j9K0pP2k7J4
1528C5n9L0j1M8n1j2K5Mj9pj7kQk4PRK9j2K8j1J5POJ0Lk9k4L0nl1J3j8Rk9J3J3
$$ y = [-28, -29, 12, 6, 33, 28, 44, 26, -2, -7, -3, 3, -1, -56, -52, -48, -28, -19, -31, -57, -46, -16, -10, -11, 22, 33, 35, 16, 16, 47, 47, 72, 23, -25, -30, 12, -4, -17, -29, -58, -52, -33, -50, -13, 17, 2, -19, -12, 26, 40, 49, 5, -9, -28, 6, -1, -3, -37, -16, -7, -12, -48, -10, -23, -17, -34, -30, 19, 33, 51, -3, 13, 26, 57, 28, 18, 34, -2, -4, -28, -37, 25, 15, -39, -45, -45, -41, -34, -2, 0, 15, -2, -21, 11, -2, 38, 29, 31, -3, -6, 37, 26, -9, -72, -47, -32, -34, -30, -18, 22, -20, -29, -12, 17, 64, 24, -6, 2, 54, 36, 32, -4, -11, 3, -15, 0, -13, -4, -6, -56, -63, -71, 1, 16, 32, -49, -31, 6, 20, 28, -6, 20, 29, 17, 2, 19, 6, 14, -47, -25, -12, -4, 8, -19, -38, -37, 11, 25, 16, -19, 1, 7, 2, 19, 19, 44, 29, 12, -26, -25, 38, -41, -30, -38, -20, -17, -38, -32, 5, 1, 18, -22, -13, 46, 46, 36, -12, 21, 4, 28, 2, -8, -22, -12, -11, -28, -12, -13, -18, -16, -56, -21, -12, 43, 26, -16, 4, 29, 1, 5, 19, -10, 34, -37, -20, -23, 11, -15, -42, -57, -27, -1, -21, -31, -12, 19, 21, 19, 28, 28, -10, 41, 38, 7, 3, 22, 0, -21, -37, -37, -9, -21, -47, 6, -18, -37, -17, -24, 48, 21, 35, -24, 6, -5, 43, -8, -20, 5, 9, -10, -17, -34, -36, -28, -52, -45, -36, -7, -19, 9, -2, 13, 20, 26, 36, 39, 10, -14, 16, 11, -20, -7, -25, -16, -45, -32, -19]
1564a9Pj2k5L7oK1l9M3jk6J0K8j3j7J8k2k0MmqJ0pMK3K6j5J1oj1N8p2N6j3%km
1600A4K4m1nj5J8j2k3J5Pnj0mM7k8K4l0K4rL3l1LK0K3k7k3jjL0n0M5m1NK0j8K2
1635@k9L4L2m1M0oJ1k8J2lm3K3j7j4L5m1%jJ9k4K6j6RJ4J5rJ3J1rj1JQj6j0M2
1670B7m2Koo%oJ7j2L5L2m3jQK0%j6%jJ4K0n5qJ2Qpk0oj7L9j8kLM4m5K1kJ6K3j2
1709A6oJ2k2j5K9j2j8oj3J3j6K8KMj8npM3lJ7J0k7j2k1J5j0J2Kl1J2L8k4j2Rk9
1744d5J8K1nlL2j9Pj2J8Jj5MLJ5l8J3Jj0oNRk5L2j8L6k4lL2J6kLm1NJ1k5Nlk0
1782b7j3M2l1OQJ0j6KkJ1L1ll3K3j9O1o3K7rk2M6oj8pj7j8L4j4kp%J4j7L6rk5
1818b7L3L0l6Jj1J1m1j0N4k8J4k1J3Kj2RrjM9k2K6j7L1j3NlJ8k1k6pJ6k5L7n3
$$ y = [-19, -12, -24, -49, -12, -18, 3, -36, 7, 6, -20, -10, 18, 5, -12, 6, -16, -36, -32, -36, -44, -34, -41, -37, -14, 12, -3, 8, 2, -9, 49, -23, 33, 20, 20, 18, 14, 38, -3, -8, -23, -5, -17, -40, -25, -18, -23, -33, -37, 10, -18, 6, -24, 0, -9, 24, -7, -4, 16, 39, 12, -11, -12, -13, 17, -33, 12, -29, -24, -4, -22, 0, -29, 5, 37, -4, 36, 30, 41, 13, 25, 22, -21, 2, -15, -29, 6, -35, -35, -36, -17, -41, -15, -31, -22, -8, 7, -2, 11, 22, 13, 2, 3, 11, -5, -15, 27, -15, -13, -19, -25, -25, -31, -14, -26, 9, 41, -2, -3, 5, 25, 25, 9, 9, 8, 22, 42, -13, -21, -9, -1, -8, -28, -34, -51, -12, -30, -32, -29, 15, -30, -9, -11, 5, 28, 16, 10, 22, 0, -15, 14, 2, -16, -22, -35, -22, -38, -10, -8, -4, -22, -27, -34, 9, 6, 23, 33, 6, -6, -27, -12, -22, -10, -8, -39, -27, 11, -13, -25, -16, -45, -27, -6, -11, -14, 18, -1, 6, -6, 12, 13, -2, 2, 5, 20, -18, -5, -4, -14, -20, -15, -6, -31, 1, -17, 19, -5, -8, 24, 40, 38, 41, 0, 5, 16, -9, -4, -7, -27, -40, 2, -29, -23, -15, -5, -21, -19, -21, -10, 21, 18, -15, 8, -11, 50, -13, 14, 5, -17, 29, 23, 5, -2, -19, -37, -3, -17, -19, -26, -26, -12, -29, 7, -2, -27, 6, 36, 0, 1, -10, 1, -40, -50, 4, -24, -10, -31, -18, -16, -28, -19, -28, -29, 20, -2, 24, 7, 38, 25, 30, 27, 45, 24, -2, -9, 7, -18, 19, -34]
1852c4J9J8j8Oj1L7n0K1RK1%j9oJ8LKk3j1Rj7RJ2j2LjOJ3m7M4NK1k9K5lNj4K0
1889C1Lk8rKmJJ8l3J2j2MKqjJ1j0L2k9K9%Rnj9J8k5L0j1k1K8l2J0j0kkK3j0N0
1926D2k4NK0l2K3ol8K3O%J3m1oK8qj8qJJ2mQk6K1knJ1rQJ6lJ2k9J1j3J1KkrK9
1965A9j0j8j0QNOJ5j6K7qJ1Pl6KpOk6j0M3l4nL6m2K1k3K4j9NJ7Pkl4M1nKJ6J2
2002B5J2m2LK5k8QrKj1K1J4j8lnJ6k5J0NJ5j8J5PNl8J%K8k9k3L1qOm2qO3Jj1m
2040imJ6j2M4l0J6j8NQl9LK9j4P%j6LJ8l0jNL2mK1lj0Jk0j2K5l1K7j6KpJj7M5
2078A5j5Oj9L3n0MK9MJ3Opj1K4j5k6j2L4j9L4rm1K9%J4l2J1N0o7L3k2nJ4mPpO
2114EJ5k7j2nK3k6J4k5N0j1Kk4J6kPJ5nJ3l7K4K5j4l6L8j7kj2L1j7J6l9Jj0J3
$$ y = [-34, -15, 3, -15, -9, -20, 17, -33, -12, -3, 18, 18, -1, -7, 11, 14, 16, -7, -18, -9, -26, -17, -5, -17, -14, -15, -9, 4, -43, 1, 6, 27, -2, 23, 20, 25, 11, 31, 34, 6, -3, -1, -5, -4, 14, -19, -7, -19, -15, -13, -21, -22, -11, -21, 11, -18, 11, 11, 20, 15, -4, 14, -11, 19, 8, -13, 15, -17, -7, -17, -19, -21, 2, -8, 42, 18, 23, 43, 11, 34, 28, -10, 13, 19, 19, 32, -9, -15, 13, 5, -13, -21, -20, -8, -12, -4, -30, -9, -11, -16, -5, -14, -6, 10, 7, 19, -10, 1, -12, -1, 1, -1, -10, 19, 9, -9, -19, -11, -6, 0, 15, -1, 26, 18, 29, 36, 0, 2, -5, 1, -25, -35, 8, -26, -31, 5, -37, -16, -39, -15, -34, -29, -12, -5, -7, -41, 0, -5, -3, 13, 25, 37, -5, -2, 23, -5, 3, -6, -4, -15, 6, 20, 2, -1, -6, 10, -15, -5, 0, 15, -3, 12, 19, 24, -14, -13, -13, 15, -14, -37, -6, -14, -8, -50, -58, 5, 6, -5, -9, -13, 3, -9, 35, 5, 21, 3, 8, 16, -23, -20, 9, -5, 2, 2, -14, -11, 7, -23, -24, -19, 13, 9, 30, 27, 17, 18, -2, -14, 11, -20, 7, -9, -7, -14, -13, -30, 15, 0, 6, -13, 20, -30, -26, 3, 7, 20, 26, 19, 8, 32, 17, -9, -21, 13, -6, 28, 19, -22, 7, 7, 21, -11, 0, 50, -17, 16, -6, -11, 3, -1, 6, -1, 5, 20, -7, -19, -24, -1, -27, -13, -38, 12, 1, 3, -21, -5, -7, 0, 15, 10, 23, -14, 10, 35, 21, -15, 23, 6, 4, -8, 23, 6, 22, -17, -16, -26, -13]
2148a3K1k0PJ8j1j5MNK8l4klj1K8k1j4QJ7qK1nMPl4K0J2j1K7J0j9K7m4K9k5j8
2183a5KL0J5j5pk2pL5J1l6J9l3LL7Pj0l0J0K4k1Jl4J1mJ7j7J4Oj0oPnK4j0%J9
2219A0PJrj1rJ9kJj9K6j8oOJ1k6j1j0K5J3%l6M1K1k5LkJ8j4oMk4L0Kj3Rmj4Rm
2258gJ0Rj3J4k9L2Qk7K5JrnmK1Kl0%J1j9k1K6kloJ6mRk0PK7Om0J4PJ7Rk2pl2J4
2298a5J2j2J9lJ7m2L6j4J3oj5K8Kj3MK1m3L6j5Kk5J3NmqjJ0ql2M2j4J0j1J1J6
2333A6k5K7k2K4opJ0K3k6k9K2kPj0K8m6pL4Lk9M6pj4l1K5L2k2Jl4K2Mk1J3J5k6
2368a2NRj8J2mJ3k2PJ6K0l5J2J4LKrMl3QK5qM0q3J4L0j7LNLj8J7J9k7K1j7L5l4
2405@Ok4L2l1MJ7ql8L2j2jJ6J0jrJ4J3m7N5nJ2Mj9L2m6J3l1K8KKk5j6K2RqpJ6
$$ y = [-13, 8, -12, -5, 13, 2, -13, -9, -4, 24, -10, -12, -15, -26, 2, -19, -33, -25, -8, -16, 5, 0, 4, 11, -23, -3, 9, -2, 25, 35, 16, 43, -1, 28, 3, -15, -13, 17, 32, 17, 10, -12, -19, 16, 27, -9, 10, -23, -20, 17, 24, 14, -16, -6, 18, -3, -2, -36, -25, -29, -12, -29, -15, -9, -19, -25, -18, -23, 1, -9, -9, 10, 17, 18, 9, -2, -11, 8, 6, 7, -12, 14, -4, -10, -4, 7, -19, -30, -40, -15, -2, -2, -38, 3, 24, -1, 2, 0, 18, 4, -2, 2, -22, 8, 10, -3, 6, 2, -12, -3, -7, 3, 12, -1, 13, -16, 16, 24, -3, 22, 23, 14, 9, 5, 26, 28, -2, -2, 9, -10, -31, -5, -7, -10, -16, 0, -4, 5, -15, -8, 19, 25, -15, -1, 6, 23, 32, 10, 3, -29, -15, -3, -15, 4, 1, 18, -24, 12, -2, 11, 5, -10, 18, 20, 7, 11, 32, -11, 25, 10, 12, -13, 0, 5, 1, -7, -8, 2, -6, -38, 4, -10, 0, -11, 0, 16, -9, 18, -4, 20, 14, 7, 17, 40, 14, -15, 7, 5, 12, 2, 30, -16, -23, 11, 14, -15, 31, 24, 10, -21, 4, 36, 14, 15, -19, 3, 7, -14, -1, 14, -12, -7, 2, -16, -4, -8, 5, -17, -10, 6, 26, -9, 3, 17, 20, 22, 13, 17, -16, -8, 17, 9, 49, -34, -20, 10, -7, -4, 1, 4, -14, 3, 22, -5, 16, -1, 34, 0, 6, -18, 14, -17, -13, 4, -4, -42, -10, -22, -23, -7, 3, 2, -7, 7, 20, -27, 28, 23, 35, 39, 20, 52, 6, 19, -12, 16, 18, 20, -5, -21, 1, 10, 2, -5, 11]
2442A1j2j8QMLQm2L6J3k3kJ9l0M4k2K3Lm1K0l1OK6J7Rk0Rk5L8l4J2J6l3J5nj8
2477a6J3j2J7j6J7o2O4l3J6lKj0K5k4J0J8J3j3pJ2k1L5m2lJpJ9LRj5j4K6K3k8
2511cPK3j7L6l1JJ0nj5J6l2J1nk3j0J6L6k2j7L4k4kJ1Kj5K4rPJ9j7Jq%lLjlmm
2550a3pL4qj5NK4nk2J0nK7k7j8J2j2j9K6OK0l1J2j2rK0pj6J7RmJ0j2J2J5j2J5
2585B0k0j0OPJl8M4m8M6J8Pl2Qj8J6KJ0rj6j6oL3j3L6j4m2K3oK7m8J7J3JMLrj6
2622a9K4Lj4j5nK1k7P2j9j1oj5M2l3K6m1L4j1Jj2jKK4j1k6J0j5L0kKJ2Jk3pJj2
2658b0K5l7K7k2J9K3k2j7K4J2j0j4Nk4M1Rj6Ko%K2lj8Pmj4JjmJ5J3l0K0j2K8n
2694A4j3J7%j5pj2NLLl1L2Ok2K2rk0L1Qk0LJ1k0K7%j5L6l8L7j3l2j0K4k3noL6
$$ y = [11, -1, -19, -11, -7, -4, 4, -38, -2, 11, -12, -14, 5, -25, 19, -3, 20, 23, -18, 2, -29, -23, 3, 20, 29, 9, 18, -7, 31, -3, 9, 25, -8, 7, 2, -16, -3, -15, 2, -14, 3, -59, 5, -28, -12, -15, -13, -23, 2, -22, -12, 6, 19, 6, -1, 11, -10, 25, -17, -20, -19, -26, -7, -4, 5, -10, -24, 2, 25, -3, 4, 27, 10, 46, 15, 16, 26, 21, 6, 22, -10, 1, -4, -27, -37, -21, 15, -7, -24, 10, -14, -16, -5, -3, -18, 6, -3, 4, 23, 6, 7, -1, -1, -4, -1, -2, -5, -9, -13, -20, 14, 6, -9, -4, 20, 15, -7, 3, -2, 25, -2, -20, -8, -20, -39, -13, -7, 13, -18, -6, -18, -27, -7, -14, -30, -13, -4, -8, 2, -10, 2, 17, 5, 20, 0, -10, -4, 3, 4, -34, 10, -38, 8, 26, 33, 1, 9, -9, 7, 9, 19, 10, -6, -22, -28, 5, -8, 28, 14, -28, -5, -11, 16, -32, -15, -2, -1, 3, 6, -3, -19, 5, 8, -6, -21, -26, -5, -32, 40, 21, 10, 4, -11, 31, -2, 24, -17, 17, 6, 7, -5, -6, -4, 20, 9, -17, -7, -22, 8, 6, 8, 20, 21, -2, -9, -8, -20, 5, -32, -5, -27, -8, 15, -7, -24, 0, 12, 2, -12, -7, -31, 10, 19, 3, 5, -1, -1, 21, 18, 0, 7, 3, -11, -10, -11, -15, 0, 13, -17, 3, -9, 19, 14, 1, 18, 18, 3, -4, -16, -11, -8, -5, -36, -4, 2, -20, 2, -7, -27, 4, 12, -8, -5, 6, -14, 13, 13, -2, 34, -4, 33, 20, -12, -22, 2, -21, -26, -32, 4]
2730Dm5K4qL6j0KmJ0j2K0Mm8L6j3k0J2%Rnjj5Mj8N3j5j6K4k5L7k5L2Oj6qmJ9k6
2767bJ2j5OK5m0MK7o6K8K2m4M1j0j0J5k2K8k6OM6k5lj2J4k5K1jqJ2J7k4k0J9l
2801a3L5nLk5K4lrJ2m1O1l1%kpK3m7J2Qk6M0k9K7n5M0KKml3N0J6k2j7PkKJ0jK0
2839B2k5l0L3jpN%J7n1M7Kj9M4k2jj9j3QK3j6k4J4J0k0L2j8mJj5J6oJ9j8J9j%
2875Bj9OL0j3nj9J2j3JJ0OnJ6pKJ3j2k4J5L9l1j4J0j7M1l2rJ5JnKpj8nK5JMoj1
2914b1N4j1j4j7j4N0l1J5j0J2l4j3jK8J4l7J3K9jj8J5oj4J6Oj9J5J0L3n2oQj7
2947a8lJ8Lj3Lj0L2Jm8K0Nj1K4L2m4QlRJ0mK2m6K5j7NkK6j1j8j4J9rk8L2rK5m0
2984b9M9k8K2J0k5rJ5NQk9QKK3k1l4J2KL0k8oM9k3m4M6Qk6J9J5rj5J7qj6J9l6
$$ y = [4, -41, -17, -25, 11, 1, 3, -1, 9, -3, 17, 21, -27, 9, -4, -24, -12, -12, -3, -8, -9, -24, -20, -38, 15, 0, -16, 8, -17, 20, -5, 27, 33, 17, 9, 5, 24, -2, 10, -5, 1, 26, -14, -10, 17, -49, -21, 1, -43, -2, -12, -22, -7, -29, -1, -27, -21, 25, 0, -3, -15, -1, -26, -5, -6, -14, -2, 15, -9, -29, -10, -13, 22, 17, 20, -5, 19, 16, 7, 19, -22, 39, 8, 8, 6, -1, 22, -25, -13, -5, -31, 9, -20, 7, -48, -8, -6, -4, -8, -41, 9, 25, 3, -14, -7, -9, -7, 3, 2, 22, -3, -33, 0, -1, -8, -3, -3, 14, -37, 10, 12, -7, 37, 15, 14, -5, -18, -10, 13, -3, -27, -13, -3, -23, 9, -9, -13, -12, -27, -11, -17, 2, -16, 3, 2, 2, -17, -11, 19, 6, 1, -18, -6, -19, -18, -8, -2, -7, 9, 2, 4, 17, 5, -19, -4, 35, 4, -10, 0, -17, 24, -8, -17, -2, -1, -6, -4, -11, -29, -34, -9, -8, -4, -10, -21, 33, 22, 8, -9, -23, 27, -4, 11, 1, 13, -21, -34, -35, -7, 7, -30, -17, 12, 11, -7, 8, 2, -12, 4, 10, -9, 6, 16, 49, -3, -9, -1, -18, -21, -3, 0, -13, -10, -20, 12, 13, -35, -15, -10, -21, 3, 35, -9, -1, -4, 5, 15, 11, 33, -13, 12, -5, 0, -2, 24, 13, -5, -19, 0, -9, -37, -5, -14, 11, -29, 20, -8, 14, 24, -1, -10, 5, 10, 18, -11, -3, -1, 22, 1, -33, -21, -19, 11, -17, -23, 26, 3, -41, 5, 13, -13, 6, 21, 12, -3, 14, 6, -10, 9, -27]
3019b7LJ8QJ0k3J6m1K0rK8qNpqL0j7l3K5j8L1k7OK7k8L1j1J1Lnj0O7n8oJK3j8
3055IJ3orl7L2Ok6L7k4mj8M5m5J2K4k1j3j2N3j3j7kJ8j0NnNj8M3l5MJ6l5J1M4
3090B7m5K3L6k5k4rJ1N2k7j8J5k2J0j6Qjk6K8PPJ9n2lJ6Mj5K1pk6K6qJ1MPl7Q
3126b1M0l2J6Mnj0j5M3pj4rK3Lmj9K2j4k7M3l4J4L0j8j9J%k6pK9Qj0nPMj5L5j1
3163@J2j3Rj3j0OLk1L2j4j1L2j3J0nj2K3nj7J2J2j5RrK0j5qJ7k0rl1L5l2RL2l9
3199c9L3l0J8k3N2l0J0pkJ4k5J2L2j6%PNK0j8oK9k1j9NJ1l0J2M0l5J9qpj9L6j5
3234Ej2NRm4L7J4qk0Kj0PJ3%jjK5j2j5L6l1L2nk7LLqOJ3rk9K4rNrK1j6qJ1j4K4
3274GpK0nj3k6K0Rj0k3K2k5Lkj0L2j4J2k5M2l2J1M4k3j5PmM2m5J4lJ8k3J3k3J4
$$ y = [-27, -24, -6, 2, 12, -11, 5, -36, -16, -25, 3, -5, 0, -7, -15, 15, -2, -35, -10, -28, 3, -24, -18, 9, -19, 12, 1, 12, 15, 10, 0, 67, 9, 3, 4, 27, 9, 22, 16, 7, -30, 2, 8, -18, 19, -5, -9, -27, 18, -27, -15, 9, -12, -25, -37, 16, 3, -14, -16, 2, -8, -3, -8, -3, -21, 22, -13, -9, 7, -28, -17, 27, -18, 5, 41, 16, -8, -17, -6, 46, 19, 1, 16, -6, 4, -12, -4, -5, -31, -3, 4, 11, 30, -22, -25, -9, -5, -20, 1, -6, -32, -6, -14, -3, 1, 8, -29, -21, 19, -13, 3, 7, 2, -8, -23, 20, 13, -1, -10, 13, 16, 12, -7, 15, 1, -26, 17, -17, -3, 27, 9, -10, -9, -9, -35, -42, -13, -5, -15, -20, -13, -9, -24, 11, 0, 12, -1, 8, -5, -15, -9, -6, -27, 5, -9, -20, 12, -1, 9, 4, -8, 15, 10, -7, 5, 17, 2, 11, 2, 22, 7, -1, 16, -4, -13, -44, -9, -41, -32, 0, -39, -6, -36, -18, -41, 11, -19, -9, -16, -18, -4, -29, -17, 15, -1, -1, 6, 11, 31, 13, 7, 36, 15, -4, 1, 12, -18, -6, 34, -1, 18, 10, 3, -16, 20, 5, -7, -2, 7, -37, 0, 14, 6, -14, -12, -22, -15, -2, -2, -3, -4, 21, 9, -6, 30, -1, 31, 26, -1, 2, 5, -3, 3, 16, 7, -22, 2, -7, -2, -11, 10, -6, -14, -3, -17, 7, 0, 20, 15, 2, -24, -4, 5, -5, -28, -6, -31, -28, -30, -40, -8, -22, -10, -35, 7, -25, -14, 30, 7, -8, -1, -5, 37, -8, 6, 3, 21, -2, 11, -12, 2]
3309Bj3JK8rKk8L1j5j4K0lnMJ4j3Nk4L1l4K2OnJpj5J4J2Jk2P%J9j8OJ9j4j6KJ2
3348DnOKl9M8jknj4J0j9j7J3M3k5Ol0K3oLjJ1Ok0J2pKLMQj6Lj9J3NK4k5J0K8m0
3388dQmk5K5K9Oj0k4kJ3L%j4l5L5k3J6Lkk0J9NMnRj8J3lJ8ompj0N0l1kMj1nMl
3429dK3QJ7k2nK0j7j2K2k1Pj5j3kJ9kK3l6jKOJ4k4K8k2J4j3pJ4JNj1J4qk7%K0
3466eRk0K7ll4M4ok4J1K7l2pPk3O2l1j4J7k6PRJ7j9J0l6L0k0K3j1J3J%l1K8Qj0
3502bK3l7L6m7M4k2pj0J0K3j7MJ2J0l0kL3k1pL8k2mMj1jJ0%k0j1K5j6J2k1J1m
3537a7lk7M9k2K3J5l0lK5j8Kk1K1J8j2Mk3L8k5L0k0K7m3K5nj1RlJ8knj1%j9PN
3573dkJK3n1L5njJ2j4nJ8Lj7K5kQj5k2K5J7ok2J5LKk2kj9J2K8l5kL9m0j%NK1K7
$$ y = [2, -11, -10, 18, 9, 11, -17, 14, -1, -15, 5, 2, -3, 1, 15, 2, 7, -17, 14, -20, 2, 8, 3, 4, -3, -18, -4, 8, 9, -13, -6, -6, 13, -5, 1, 20, 6, -10, -8, 4, -1, 5, 7, -32, 16, 15, 13, 8, -6, 4, -15, -32, -19, 24, -1, 5, -25, -2, -8, -5, -6, 5, 11, -9, 3, -4, -2, 1, 5, 13, -3, 0, -19, -6, -1, 23, -2, 8, 36, -4, 4, 0, -25, 0, 29, 35, 25, 1, -1, 12, 15, 15, 1, -34, 1, -22, -6, -3, -5, -25, -6, -1, 3, -2, 7, -11, 2, -1, 17, 11, 7, 0, -10, 40, 9, 7, 11, 0, -5, -1, -4, 19, 27, 44, 22, 17, 37, 20, 8, 30, 9, 16, 1, -12, -14, 5, 3, 26, -10, -11, -9, -3, 11, -13, 15, -7, 7, -6, -13, 1, 2, 7, -4, 10, 2, -25, -25, -5, 4, -16, 11, 8, -26, 18, 12, -12, -1, 26, -6, -13, -6, -29, 33, 2, -12, 5, -21, -14, -5, 12, -7, 3, -33, -3, -23, 0, -11, 2, 3, 3, -28, 0, 8, -2, 21, -16, 20, -27, 17, -5, -12, -22, -12, 11, -6, -2, 10, 20, -10, -12, 21, 0, -7, 31, 9, 5, 9, -2, -3, 7, 7, -13, -24, 1, -15, -3, -24, -13, -17, -20, -47, 2, -20, 3, 18, -12, -15, 10, -8, -6, -27, -6, 12, 0, 4, -19, 19, -6, 24, 4, 31, -12, 13, 8, -3, 6, 3, 21, 19, 14, 3, 3, -16, -9, -4, -6, -5, 18, -33, 2, -3, -4, 8, -6, -11, 7, 10, -7, 18, 16, 24, 9, -13, 12, 29, 23, 1, 16, 19, 21, -1, -3, -22, -10, 18, -17, -19, 20, -20, -21, -21, -16, 5, 32]
3612C2m0J0j9qkJJ6J5k0K5m5K5OlrOk9M2J5k3K7j9oQqJ2J5rj5L2k8k1J4krNJ5
3649FqOk3L2l3L5k5lkK0j7J0K1rj4rPJ9K2j6j0j7pL5j5K2l1PK4Pk3k1K3Kl3K6
3685Hj0J5j7J1j0j5KK6Pk3%j9j0O2j9j1k0NL9nMRl1j4L0mlk3L1j1J2j2Pj3mK2
3721A6j8OK8j7K4l6j9M2pJ2m7K8J2l2KJ2j2j6K7Mj7J1J1l3N6l1j6L2k2J4rK0j5
3754A0l4QlL8MKk9j2J5K0j9J1Oj6kL2j5mk3J9j6k0J1K8j2j3J4j9J4J8k8QmJ6K
3789Gk1OJ1pJ4kJ1j7J9k0PJ4k0pK2j4J3l6L2qlJ7k6K6k2L4l8K6j0l6K4Mk6K7J2
3824A3k0Mm3O0o0M9j6K9ml5J7MJ2kk1J5J1j1K8l8K9l6MPM6j6l5MJ5l8L0kK4om0
3859b2JOL0ll5MkMJ0J5pj4K2j9pLJ8j7J5NRj3L1k0J8J7k8J1j7j7mQj0J1l0M3%
$$ y = [32, -8, 2, -17, -25, -27, -26, -10, 5, -15, 10, -35, -10, -4, -7, -16, -10, -39, 3, 18, -5, 22, 3, -3, 5, -3, 9, 24, 15, 0, 32, 4, -17, -3, -5, -14, -9, 6, -2, 4, -19, 13, -20, 15, -10, -13, -15, 5, -12, -2, 19, 10, -4, -13, -6, 13, 35, 19, 9, -8, -15, 20, 5, 27, -4, 3, 27, 34, 11, -10, 13, 15, -18, 8, -2, 13, -4, 7, -3, -18, -16, 10, 17, -6, -6, -25, -35, 27, 8, -3, -23, -18, 21, 16, 20, 29, -2, -16, 14, 10, 7, -16, 15, 4, 16, 4, 11, -2, -6, 16, -2, 4, 32, 15, 39, 3, -16, 26, 19, 31, -16, 12, 24, -8, -6, 6, -6, -22, 5, 9, -8, 3, 14, -19, 37, 6, -10, 22, 0, 14, 5, 25, 10, -24, -16, -19, 19, 23, 25, -4, -16, -1, 19, 0, 11, 17, 1, -1, 31, 16, 12, -11, 8, -8, -28, -17, 11, -1, -14, 0, -19, -5, 13, -15, -7, -11, 5, 7, -14, -8, 3, -4, 10, 8, 19, 2, 21, 1, 8, 22, 2, -5, 17, 3, 16, -20, 12, 4, 1, 18, -8, 18, -4, 30, -8, 18, 8, -28, -4, 0, -26, 1, 13, -7, -3, -46, 14, -46, 3, -13, 16, 12, -23, -6, -2, 10, 8, -13, 2, 13, 2, 30, -8, 21, -15, -11, -4, 42, 26, -9, -5, 10, -28, 2, 0, 24, 18, -22, -21, -15, 15, 12, -23, -19, -21, -17, -7, 8, 1, -13, 9, -10, -17, -14, 4, -13, 2, 7, 16, 3, 34, 14, 32, 49, 21, 32, 15, -2, -6, 2, -8, 3, -27, 16, 16]
3896A6Jj6jlPQkj9J1J8l4K1Nj5nK7m2J9KJ7rj2QoL8k7J8j4J5qJ1lj7J7Kl8nL3
3934A8k7M0l8mnnK3j2K7k0J9l2J1j7K1Kj2J4J8n6J7L2l8K4JoK5Kj8j0M0n1L3j8
3968bJ6kpj1K1J6k4Kk3J0nQoJ9m%j8kPk0K8j2K6k2RK3l4Jj8Oj0J2njL5k9K2J5
4006B1m6N1k3qK9%j6k7K0%Jj0rL7mj9kQj4jJ2K0m6K8j7%lmJ4L2l2PkoK1Lj6kK
4045aJ7k9LJ9l2M0Pj6LJ0J6k5K8m1PmJ4j3J6k0K1k0Nk1KJ5k3L0m0K8j0Qk3%K9
4080@Ql1PK5Mk1K0J3l2K0mk4QQRk7kM0k1pjmK0J3l1J5j4MMJ8l5J6l6N0Ll0J2J
4118bl3L0%l2K5k0J4llP%K8Pkk6LK0k0j2K8J5j1j7Jpj3J5N%j2j1L5%pj8K3m3K6
4156a0l0L4Orjj3QJ6Kokj0K7l3K6Lj7%M2j7qj4J6Pkm6L0K2rl8L2Mj1%j4M3j9p
$$ y = [16, 17, 1, 0, -3, 4, 12, 10, -9, 2, 20, -14, 7, 12, -3, -8, 19, -23, -4, -2, 15, 6, -6, 2, -4, 34, 7, 25, 11, 26, 18, 29, 26, 9, 26, 28, -10, -15, 18, -9, 31, -7, -11, -16, -21, 2, -10, 17, -3, 16, -16, -5, -22, -1, 1, -11, 3, 21, -35, -18, 14, -24, 0, 1, -5, 20, 22, 4, -6, 34, -17, 16, -2, 14, 12, 5, -6, 15, 31, 7, 9, -14, -4, -9, -1, -7, 12, 8, 8, -10, -12, -5, -25, 3, -9, 17, -5, 4, 27, -7, -6, -24, -18, -28, -16, -21, -22, 13, -16, 6, 21, -25, 26, 3, -5, 24, 24, 8, -19, 1, 1, 2, -8, -17, 20, 16, -3, -5, 3, -11, -12, 0, 20, -26, 2, -15, -15, -18, -22, -8, 24, -8, -1, -3, -9, 12, 15, -1, -3, -1, 16, -13, -10, 9, -23, 17, 24, 8, 11, 21, 37, 12, 40, -1, 6, 2, 16, 3, 19, -1, 20, 0, 5, -16, -14, 1, -22, 8, -32, -4, -14, -6, -29, -29, 0, 8, -23, -16, 9, 13, -8, 12, 25, -7, 13, 9, -15, -7, 1, 10, -17, -19, 21, 0, -7, -8, -12, 8, 21, -10, 5, -9, -5, -1, 17, -18, -2, -38, 12, 15, -15, -3, -2, -35, -5, -5, -37, -12, -32, -18, -21, -24, -17, -17, 11, 18, 16, -10, -7, 13, -7, -19, 9, 24, 13, -4, -3, -10, -23, -8, -3, -3, -15, -26, 9, 9, 2, -16, 7, -36, -10, -40, -6, 0, -9, -10, -23, -15, 1, 3, -3, -5, -15, 12, -21, 5, 8, -9, -9, 33, 16, 8, -6, 10, 17, 15, -31, -1, 21, 12, -26, 6, 10, -1, -1, -15, 28, 9, 2]
4194Bj2JJ9mk2OM%k3KMK0%oK4Kj1KK0nJ1l0J8Rl3Lk0J3J6j4NRn1QK7L4j4k9QL
4234dl3N0km5J6kj0LJ3J1JmoQJ9jj9mOj2K7PpMl0MK0%jJ8m6K4Oojkl2L0j5K9l2
4275a8mK8l6RJ2L7l1Pj2j0J0JJ6k1pJ9L8n5K7k5RK0k8K7pl3L4Ol8K4NK0Om6N7
4310D1o0k2L5KkNj1J0l7K2j2J6k2K8%K5k4L0j8l8M1l7K8j6ML0pnPj9J0qnPJ8N
4346B1m6K8k1L4l3LPj4J9J1j0j1m%Nj2QqL5j7qJ%K2j8J7j7qL7m7M1j6j7K0J1p
4382Fjj6JJ7Mj6mkK3k1Jk3L8k1%J6k4K6Rk9J3j2J8J6k5LqnJ7j5J7k1LLNjJ6l0
4420b2J8OJ1k5MK6j1j5N8n6k2K9K3J0l8QKpPNj7Rj9k6M1J8j4k0K1kpl1J5%RL4
4456B2k2j8jL6o7P9l3lL3pj5nJ0J0jk8K7rnkk6K1LJ2j1lJ2k6RqL0J9m2j5J8mj
$$ y = [2, -10, -9, 10, 6, -16, -10, -6, -6, -29, -27, -23, -3, -3, -9, 15, 17, 6, 8, 28, 23, 34, 4, 22, 31, -2, 1, -19, -6, 10, -4, 1, 10, -41, -33, -6, 28, 14, -15, -7, -4, -37, 13, 11, -34, -18, -20, -30, -27, -14, -3, -2, -6, -12, -4, 15, 14, -5, -9, -3, -15, 12, 19, 12, 16, -14, -10, 10, 10, 9, 27, -19, 5, 11, 5, 4, 2, -30, 0, -15, 14, -18, -22, 6, -30, -21, -9, 28, -3, 4, -8, -18, -8, -7, 9, -12, -19, 0, 38, -17, 10, -15, -6, 14, -14, 13, 6, -27, 7, 13, -25, -1, 4, 24, 30, -16, 41, -19, -41, -6, -4, -6, -1, -12, -2, -39, -17, -29, -13, -35, -7, -7, 18, -6, 24, 6, -32, 9, -28, 0, -16, -12, 18, 11, 6, 13, -6, 4, -4, -9, -2, 16, 21, -25, 3, -18, 16, -17, -14, -7, -21, -2, 9, -1, -12, -16, -16, -11, -23, -15, -23, 12, -5, -13, -12, -12, 10, -8, 9, -8, -16, 21, -26, 15, -1, -18, 2, 13, 6, 5, -11, -10, 7, 11, -5, -9, -11, 12, -9, -8, -31, 7, -14, -14, 2, -22, 4, 13, -16, -3, -15, 3, 19, -6, -3, -11, -16, 1, -14, 3, -18, -15, -12, -7, -8, 8, -22, -4, 2, 13, -12, -8, 18, 7, -8, 50, -6, -28, 1, 24, 34, -4, 4, 6, -1, 6, 11, -6, 3, -16, -42, -1, 17, 3, -17, 4, 2, -5, -36, -21, -21, -12, 22, 0, -18, -19, 17, -50, 29, -4, -7, 26, 19, 4, -1, 9, 19, 18, -10, 17, 8, 3, 1, -25, -4, -1, 11, 0, -3, 9, -17, -8, -16, 14, 33, -9, -24, -6, -10, -11]
4493a1K4rk1J4OOqk0J3QMk0M5l0oK3k3J6nj8J7jnJ4Ll0J4l9J5K0J4j6Pmk4N6m8
4530a9j4J9rK8l2K1J2lj8JK4k9Nk3M9jkk1L5jk4mK1j7Nk3K9j0k0J2qkJ6kJ8k6
4566a3m0L8J0J0j2rj6K4lp%j9K6j7L9l3K5j4Jj5M2m2M6k3KPk0j6M5j2k9K2j1L3
4600A9k7K9rjn1M0PRk9nRj0qlM2ok6M5l1lK9k4j8J1j3O0m4j4K5j4RJOk0QJ8J3
4637B4k2K2J5m3jK4l2j3M1j1j0J6ll4L9l8KK0mj4M4l7k4K3k7L0K0Ll7L6m0L8n6
4670d9N2J8m6K8J7l8QK7Ql2kllRJ1rj3K5kj6K0l1mK6j5j4lL7%m2RoK7k4L4lK4
4707B5m2JK7om0L0J1mRj6j0J9pmL2k2J9j8JnLJ1j9MMjl%k3kN%JLj5K5J1rmJ3K
4748Fj6j1J0J3ljOj7M1k5J7J2k2pj1K3j6K8m6K5j4J0nMmmk3M1l4lK9J2l8Oj5L0
$$ y = [-11, 13, 4, -17, -3, 3, 9, 1, -19, -6, 2, 6, -14, 31, 1, -5, 18, -5, 11, 6, -12, 5, 4, -1, 13, 16, -14, 0, -39, -24, -4, 10, -6, 1, -3, -27, 29, -19, -33, -14, -23, 5, -27, -6, 6, 3, -15, -14, 10, -19, -14, -37, 12, 11, 9, -12, 23, 22, -2, -6, 15, -2, 3, -20, 9, -1, -21, -9, -17, -19, -3, -5, 13, -13, -53, -15, -5, 5, -7, -16, -32, -8, -11, -18, -18, -37, -11, -28, 11, -22, 3, -11, -10, -25, 17, -25, 21, -2, 0, 7, -13, -29, 16, 4, -25, -3, -14, 19, -8, 21, 12, 11, -40, 0, 7, 16, -13, -18, -9, -19, -27, -30, 12, 6, -20, 25, -6, -9, 20, -4, -22, -11, -24, 36, -8, -22, 3, -11, -2, -1, 5, -15, -7, 11, 24, 2, 24, 39, -4, -5, 19, -13, -26, 15, 4, -6, 10, 7, -27, 12, -26, -24, -4, -8, -22, 22, -15, -39, -16, -43, -13, 7, 10, -27, 9, -31, 7, -49, 3, 21, -25, 3, 20, -18, -10, 17, 25, -7, -9, -12, -15, -6, 5, -4, -17, 8, 6, -10, 10, -21, -25, 1, -14, -28, -31, 6, 6, -36, -27, -33, -6, -30, 4, 1, 25, -17, -16, 11, 5, -35, -5, 6, 2, 11, -5, -15, 4, -3, -7, 25, 3, 22, 4, 5, 0, 3, 14, -5, -1, 3, 2, -1, -1, -24, -26, -21, -21, -20, -17, -32, -7, 4, -5, -9, 4, 6, -10, -21, -11, 2, -1, -2, 4, -13, 28, 3, 20, 32, 10, 3, -8, 15, -1, 27, -19, 6, -8, 2, -3, 1, -3, -7, -30, 11, -23, -26, 3, 15, -23, -17, -32, -2]
4784bm1N8j8l0K1k1J9j7J9Qj6L2j2NqJJ7nkJ5l1j5K9j2L2l7pJ4pqLk3M5nLj0j6
4821b2K0l1N6m4L2l4QK1k1J2k1K7m5P1k2l1K9J0l2L2j4K1j7rK3J3l8rJ6KOKj8
4854gj6J0J9rJoPk5L6LrJ5k1j7K0K1j5Rl0J2Kj0oK2j8mMM7k5Rlllj3Ok2QJ7pk4
4894b5M8l0Pj2rK1j5J7oj2j6nK2mK7j7lOqoJ5J4m3N0K0l4R%qKjK0j4Rk2nPOlj1
4934iM0m0Mj3lJ7J0o3N1mj4J4rlj2M9p5O0qLj0j5J2J4j7J0L4j1jj6J2mmk3QL6
4970B0j4Jnk1J5K4Jl4M2j4k1j3J0K0l4K7k0qPK8m0JMQMj0K4j9LMj3J1K8lk6J8
5006EJ2j5lJ2mj3L5k3rmlJ5jOj9JJ1rRqOmj2K9rj5J1LnkMj6N7l5oK7j9kj9K2l
5047Gj3QK5m3QK1orOoj1QP%k7M3j2kmK9j1k5K4j2Pm4J2M5k3k1Rj3M0l1J9ql%K
$$ y = [-2, -43, 15, -3, -33, -12, -33, -14, -31, -12, -4, -20, 12, 0, 5, -3, -2, 15, 10, 8, 23, -8, -23, 6, -6, 26, -11, -18, -4, -11, -19, -16, -39, 6, 1, 4, -6, -22, -2, -33, 23, -21, 11, -23, -15, 6, -15, -3, -24, 3, -42, 29, 7, -24, 5, 15, -17, 15, 1, 22, 5, -4, 19, 32, -6, -15, 1, 3, 9, 11, -7, -23, -13, 6, -3, -2, -8, -1, -26, 10, 13, 4, 19, -2, -19, 1, 22, 7, 16, -14, -2, 0, -10, -16, 6, -12, -16, -12, 35, 10, 19, 16, 13, 10, -3, 3, -19, -11, 6, -1, -25, 23, -7, 0, -12, -21, 0, -15, 2, -4, -16, -32, -37, -15, -19, 8, -9, -12, -6, -14, -20, -5, 9, -34, 16, 36, 2, 11, 11, 3, 5, 4, 24, 10, 19, -3, -8, -1, 5, 2, -9, 31, -9, -5, -18, -21, -4, 6, -57, -6, -10, -24, -10, -19, -22, -34, 15, -60, 0, -8, -5, -15, -30, -18, -4, -21, -11, 23, 12, 11, -5, 7, 3, -1, -24, -16, 20, 6, 7, 2, -19, -4, 20, 21, -13, 29, 15, -6, -19, -9, 11, -23, 4, -16, -24, -17, 11, -29, -28, -24, -16, -12, -22, 2, -17, -14, -10, -23, -12, 16, 13, -13, 5, 17, 2, -1, 11, 7, -6, 29, 6, -3, -7, -10, 5, 4, 10, -9, -8, 3, -6, 3, -5, 1, -3, -15, 14, 5, -10, 1, 4, -1, -3, 1, -15, 42, 7, 1, 28, 9, 7, -12, 10, 7, -6, 2, 27, -16, -8, 13, 7, -2, 4, -2, -13, -5, 2, 2, -25, 18, 6, 4, 0, 29, 18, -7, 17, 5, 12, -32, -20, 25, 2, -19, -10, -23, 17, -14, 5, -3, -6, -6, -4]
5086dpK3j1J1nKL1l3Njok9K8k4K2qk0J2NL1k0jj5LPJ8oLj5j7L3j9jRj8J6K0n5
5124c6M3nkMj3J2Rk7JK9j1kPqj0K0J0k5lk1M8m5J0Rkjkj7J4J7j9jK4K0k1k0jJ4
5162aqj0L2j0k1jJ7J6%j1K%Q%j6j1M7k9MnJ1J5j6l2K9j2PJ9m7NJ3kpLJk7M3nj0
5201ij8LL3ql1jL7jOk7j6M7Lk6K5k2PJ2l0J2J8l0L9j9j8Kj5L6l7M0lj4jrmMlN
5239a3k4K3J9j3jkJ4lK3k8jJ7Kj7lJ8Lj1J8m4J8JPK%k5RmQM1m1K1j1J2k4JOJ7
5277A5k9j4J4k5K8k2L2j3L4m0j1L0nK2k2Ok5N3lok4J3J8%j6rQj9MOlKoK3J0l1
5313eM0l3j4l2N3j1j7J9Ml3J1qK6j0j0K8k4j5K9j1M5k7N%k3K3l3J5kJ3k3L1nP
5347A3K3k9j6PJ5kj0MJPk4j5L9m1J3QLk7ML2oj3j9M1%ljknj8L4j6j3O2o0MJ6K2
$$ y = [-4, -11, 12, 1, 12, 7, 9, 40, 7, 12, 11, 5, -24, 4, -20, 2, -6, -26, -14, -9, 22, 2, 1, -14, -11, -4, 14, 8, 11, -4, -21, 12, -7, -8, 1, -17, -1, 19, -36, 7, 2, 0, 4, -9, 3, 12, -15, -14, 15, 4, 2, 9, 1, -9, 11, 21, -4, -7, -28, 20, -25, -15, -6, -8, -9, -11, -28, -14, 3, -16, -17, 7, 27, 6, -14, -15, -1, -9, -19, 13, 3, -18, -19, -2, 14, 14, 3, 5, 5, 13, 13, -3, -14, 33, 4, 8, 3, 14, 29, 13, -19, 10, -2, 5, 24, -23, -18, -5, -7, -14, -11, -10, -37, 6, 1, -9, -27, -24, 9, 1, -30, -31, 6, 5, 11, -16, -32, 15, 18, -8, 17, -5, 2, 14, -16, -4, 14, -16, 23, 4, -14, -12, -27, 9, -28, 12, 9, -5, -6, -15, -19, -15, -18, -13, -37, -14, 5, -8, -9, -11, 3, 0, 23, -5, -6, 11, 13, -4, -7, 11, 14, 3, 21, -23, -5, -4, 3, 5, 5, -20, -11, -15, -7, 34, -7, 14, 3, 15, -9, -8, -2, 15, -14, -28, -14, -39, -11, -33, -1, -14, 20, -20, -31, -1, -6, 16, -6, 0, -25, 28, 25, 19, -5, 8, 26, 26, 10, 1, 9, -10, -6, 0, -3, -1, -7, 16, 26, -5, 35, 2, -12, -44, 9, -2, -19, 0, 4, -29, -18, -26, 0, -10, -20, 8, -16, -31, -2, -13, 32, 5, 10, 10, -13, 10, -23, -8, -10, 3, -20, 11, 6, 13, 36, 7, -9, -2, 13, 11, 1, 5, 6, 13, -11, -26, 13, -28, -15, -7, -4, -31, -27, 5, -1, -14, -33, 8, 8, 5, 4, 2, -3, -21, 13, -3, -16, 46, -14, -10, 6, 28]
5385B8l3L5k7j0K3Nk0j7L4k1J0j1qJ6j9J7J1j8K2l9QJ1l4K4J7J3l2kM7ok0j5l
5418a4K4k1k6N0J8l0J8k0K8j2lk3J8J8l8J6J5qj6rLj2J6J2j4J1Kmqj2oJ0J5Qj8
5453a2Ol2L0j2kJ5j0Qj3K7j6l2M3j1J2%L0J4l2J2l4J5rQj8RNmRj5NROm1L2l1M
5490b5M9n0N1m0Oj9K0j7J5K0l0K5j5J4K6l9J6rK6m1M7j9NK6m4J3oJ1j4j1L0k6
5522eNj5Pk4J3J4J2j4%k0mN0k7mpkJ8l4L4J2oKQj4jm0M1j7K8jPk0pJJ3K3k4J1
5560A3qmj2J0j5K3j9L0k8nJ3j4J4m2L6pJ2j8M3l2J0L7o8J7qM5m1NJ7j2J5nK4l8
5594a2RJQkj2JJJ2j2J6k%k4Ojj1PK9l2J0RMj6j8kJ2NJ3nOQj4j6K7PjkK4l0QQl5
5636a6J9L3j8k1K5J1m9M9j3k1J6m2K4M9l8k5K3j7Rnooj5K6k4K6j2J4Lj9K6j6m
$$ y = [28, -5, 30, 3, -7, 16, 21, 1, -16, 18, -3, 7, -4, -12, 4, -15, 2, 13, -5, 17, -22, -14, -3, -37, -13, 4, 17, -15, -17, 30, 24, 4, -11, -14, 10, -11, -37, 13, 31, 1, 19, -1, 27, 15, 12, -11, 7, 25, -13, 3, 18, 10, -6, -15, -12, -24, -8, 4, -10, 1, 3, -1, -9, -21, -27, -17, -2, 6, -12, -6, -38, -8, -20, -22, -7, -17, -9, -22, 5, -11, -43, 0, -11, 1, 1, 31, 45, 13, 25, -9, 6, -3, 5, -13, -4, 1, -3, 6, -9, -4, 5, 11, -30, 2, -29, -25, 24, -26, 25, -15, -9, -28, -8, -25, -10, 10, -20, 5, -10, 4, 30, -9, 7, -2, 24, -17, 30, 11, 16, 42, -2, 11, 5, 16, 2, -9, 21, -5, 0, -15, -8, -32, -19, -5, 7, -7, -7, -27, -31, 19, -8, -12, -19, -21, -3, -37, -3, 9, 3, 5, 13, -1, -2, -42, -1, -18, 10, 9, 16, -4, -11, -10, 3, 26, 2, 13, 5, 1, -11, -1, -16, 7, -12, 18, -10, -15, -2, -16, -2, -44, -8, -15, -3, -21, 22, -10, 0, 37, -31, -14, -22, 23, -18, -13, 4, -8, 7, 2, 26, -12, -3, -2, 6, 4, -8, -7, -6, 6, -6, 10, 8, 8, -16, -10, -11, -22, -15, 14, -18, -8, 1, 5, -11, -29, -31, -19, -14, -1, -6, 0, 8, -6, -22, 5, 12, 11, 9, 33, 3, 11, 19, -16, 3, 36, 18, -3, 22, 33, -16, 33, 20, -1, 15, -27, -3, 46, 8, -17, 6, -11, -2, -7, -13, -19, -34, -8, -32, -6, -18, -4, -1, -20, 6, -10, -14]
5669a4J6l3L8jrk0L8j3K2k0j6L6jlk9J1k1Mj5M3k7K0NJ7m7K4J%J0l8J5%OL7n1
5704a5J3j4NMj6M7j2k1KQMPj6J5k8qK7PMj8PmJ3j9k7M7l3M6l7Rj7J8K7m6J0J2
5740Ak4OL7j3k4k5L2K1j6kM2n2ML6j2qK7j0jrlmRJJ5j5J2j2l3J8K4k6pRj3J3R
5777GQm2K7J1j9k4L0KLj9K0J4j5j4rK4k6RK0k1K0j2%L8l3K8l3J0Rk3M0ln7K9K
5812ARl6J7qJ7%j0KrL3k3PoJ4l0nJ8nkPK9k2J6j7Lj3%Oj2pJ9OqK5j8NK0Pk7l2
5852b9L2j0L8n0K3Jk2MRoK2Km1J4K4j4J1j6k6L6j2J3j1pJ5RQqk9K5J9l8RK4kq
5888Ij6NJ8rJ6k3Oj5J5M7o3K2m3L4m5J5N5k0l6OK9k7RqOJ8k0J2J2Lnjl9mM8pM
5925Hk2nL2l4L5LQk9KRj2K8l3M6l1J3%m6LJ6J0j2J0K2ok4J5%rJ7rJ4m8L2l0M2
$$ y = [-14, 2, -31, 7, 6, -3, -23, 15, 2, 24, 4, -12, 24, 23, 20, -9, 2, -19, -15, -30, 13, -14, 6, 11, 28, -19, 5, 6, 6, 16, -22, -7, -7, -1, 36, -15, -2, -16, -11, -7, -23, 24, 12, -9, -7, 1, 5, 12, -4, 11, -17, -25, 2, 9, 13, -5, 2, -2, 11, -8, -35, 12, -21, 25, -12, -3, -20, -2, 25, -21, -11, 1, -23, -17, 20, 7, -17, -42, -10, 11, -5, -7, 35, -17, -13, 23, 11, 3, 30, 20, 19, 10, 7, 3, 12, 13, 28, 13, 25, 13, -20, -2, 22, -4, -11, -2, -15, -2, 7, 15, -27, 0, 11, -8, -32, -2, 0, 3, -16, 4, 18, 3, -11, -20, 4, -22, -13, 7, -14, 6, -6, -6, 32, -1, 27, -6, 4, 13, -10, 30, 27, -30, -1, 1, 10, -26, -9, -17, 0, 0, -10, -8, -17, 16, -7, 0, -6, 8, -22, -27, -9, -14, -16, -9, 20, -2, 14, -3, 0, -13, -13, -7, -19, -26, -7, -1, -9, 16, -2, 3, 23, 30, 3, -29, 3, -7, 31, -19, 4, 5, -17, -13, -4, -10, 12, 14, -27, -13, 11, -3, 8, -8, -34, 2, -10, 3, -8, -15, 0, 9, 17, 9, -20, 5, 24, -14, -5, 19, 17, 9, -7, -2, 16, 7, 23, 0, 6, -9, 6, 53, -10, 12, -31, 3, -42, -27, 28, 8, -28, -22, 7, -20, -11, -19, -13, 5, -15, -3, 9, 12, 7, 6, -33, -37, 11, 4, 8, -14, -19, 13, -21, 14, 17, 25, -4, -2, 7, -5, 23, -10, 36, 5, 18, 18, -28, -25, -9, 1, -11, -1, 21, 15, -9, 6, 6, -3, 14, 5, 19, -29, 3, -27, 15]
5961A5JKl5OM4j9PJJk0nPj2%J4Kj1J2k2J9pk8pNJ4K8j8J9k2jK7j3k2JK4l1J6j7
5999b5K2mj8K4J5j6oL9l3J3K5k9J0l8K7Jk8jL0k8NPNkk7K5jJ2j3J2j4J3k0qK6
6034@Oj0pj1K3j4l7M7MK6k9RLpNK7k4k5M9k5oj4nlK0MK0k6j1J2jj1nmK8k9J4M
6072crj4jJ9k3N3j7rnrL3l1lJ9Qj1j7J8%J3Pj2J3j1J0m2M8oj8l5K1PK1l2OJ3k1
6109b0L1j2n2L2J7l0K1j2L0J0l2J9nJ1j0lk7K3qJ6J0j6J2rK0LOk9jK1j6N%J3Q
6144B6m9K6M2o6MJ2Rk5NKj7pNK3J0Oj2k8L6j5K1j6%J8k0K3j0ok4RNJ6oJ8pkJ1
6181A7k1J8k0PjmJ2j1L3l7K1m1%L2mQl3K0k0K5j6L6l5K2K5m0L%K9k3k0oNJM4n7
6217c1O6j7j7mljK5nl0J2J3%m5M6j1KOmrNmk9M3k8LK1ml1K4qrL3k4K3nJ3Pl0J4
$$ y = [15, 16, 18, -17, -11, 33, 14, 21, 22, 23, 3, -2, 5, -7, -7, 7, 9, -2, 10, -12, 7, 0, -28, -35, -30, -16, 12, -6, 13, -9, -10, 17, 4, -18, -17, 7, -24, -8, -25, -3, -7, -25, -1, 14, -2, -8, 31, -2, 11, 36, 7, 17, -21, 6, 7, -21, -22, 8, -20, -15, -8, -3, -5, -32, -7, -8, 4, -9, 3, -11, 2, -18, -26, 0, 6, -4, -11, -22, 1, -13, -50, -3, 1, 27, -2, 7, 10, 3, 8, 35, 11, -14, 35, 10, 4, -10, -15, -18, 2, 6, 26, 0, -11, 1, 0, -11, -16, -20, 8, -21, -7, -3, -12, -26, -27, -8, -31, 22, 5, -4, -9, -18, 15, -16, -19, 0, 8, -3, -20, -2, -2, 11, 18, 6, 19, 8, 18, -24, 24, 18, 0, -35, -14, -7, 14, -18, -12, 1, -20, 11, -1, -53, -21, -4, -34, -13, -25, 5, 15, -17, 2, -3, 8, -2, -5, -32, -9, -17, -1, 9, -7, 5, -4, 16, 19, 25, -4, -5, 16, 0, 5, 5, 18, 26, -23, 3, 45, -21, -17, -5, 4, -21, -16, -14, -31, -38, -33, -10, 0, 6, -6, -34, 2, -13, 8, -8, -8, 10, -10, 13, 3, -3, -27, -18, -13, 3, -3, 15, 8, 6, 17, -4, 14, -6, 1, 0, -4, 8, -3, 30, -7, 14, -27, -27, 5, 1, 9, -24, -4, -24, 1, -15, 21, -14, 8, 33, -7, -4, -4, 25, 2, -18, -24, -19, -18, 26, -31, 35, 18, 1, -3, -6, -7, 18, 13, -17, -5, 8, 8, -37, 9, -2, 0, 6, 2, -7, -2, -6, -35, 8, -20, -17, 4, 0, -31, -7, -15, -24, 9, -15, 8, 3, 16, 23, -7, 7]
6256GK7l2LJ5k4K3k1j0K6nk1J8j3k1jK8j3L5k9J8%k6L5l4J4K5l3Nk2J0kJ7nMJ0
6291Hj0J8l0jL6rl3M2j2rJ6qj7L1m7L9km9L1J4k9K5pJ1l8L9l0J3Ll4M9j3j7L2
6325A2j0nj9K4l1nL5%j3j1J1K1j6OkjJ3lj6K2J7j9mOj7K2k8k%J4k7K9jk9RoJ3
6362a1j5K5j0qK8j4j1nJ7noJ1k0K6pJ4orMj7J6L1m8K6pj7J7K1oj1K1k4j9J9l3
6397c3J2M4j2nj2j2J7j6k3L7j0qJ0J9l4J5qoJ6K1k8M6l1NlRk2K4j4JL1l4K3k1
6431bL8l3J1j4K5rj9K7k0k9O%PJ8Rl6Ok3K6J5j4moL8j7j0L1k4j4M7j8l9L2Lk6
6466a8J7nk7K6J8J8l6j2K5Oqk7M3j9jRl1L3j7J8k4NmK2l6K1OJj3J9j2j3J0jJ4
6501GJ0j7j1N2o6J1J4mK5J5k6Mj2mMmj1Kj4O5l9K0k4Kj8lJ8R%qj5J2k2J3K9k1
$$ y = [7, 34, 2, 5, 20, -4, 19, -2, -12, 14, 9, -12, 6, -7, -28, -29, -1, -14, 21, -8, 10, 10, -16, 19, -15, -1, 24, -9, -4, -26, -16, -18, -1, -6, -2, 8, -2, 16, -14, -15, 21, 12, -21, 21, 9, 0, 16, 8, -9, 22, -25, 14, 12, -37, -6, 8, -21, 4, -3, 8, -30, 9, -21, -8, -5, -39, 10, -3, -20, 12, 2, -3, -22, 2, -29, -34, 1, 1, -12, -23, -12, 9, -7, -1, -3, -4, 9, 6, -10, 12, 29, 10, 6, 12, -5, 17, -11, -13, -13, 1, -26, 3, 2, -27, -18, -24, -11, -26, -1, -11, -19, 9, -5, -16, -21, -4, -9, -15, -4, -24, 2, -5, 9, 3, -6, -2, -19, -3, 28, -20, 6, -1, -18, -1, 20, 14, 3, 24, 0, -19, 0, -33, -21, 23, 11, 6, -6, -18, -1, -17, -40, -3, -13, -21, -11, 8, -26, -11, -19, -25, -9, 12, -16, 30, -1, 4, 1, 10, -12, 12, -2, -1, 30, -4, 19, -2, 36, 3, 14, 0, 25, 16, -3, 24, 4, -25, -19, -19, -12, 6, 15, -21, -15, -38, -12, 3, -11, -15, -21, 17, 0, -10, 21, -3, -17, 30, 12, -27, 5, 8, -18, -1, -6, -33, -7, 11, 29, -7, -19, 6, 12, 4, -23, 20, 1, 0, 9, -22, 11, -6, 12, -12, -7, -11, 11, -25, -4, 2, 3, -10, 9, -3, -16, -6, -7, 7, 17, 0, -11, 41, -25, -14, 0, -4, 21, 36, 10, 14, 2, -2, 2, -2, -13, -11, -25, 40, 1, 21, -3, -1, -19, -22, -4, 5, 5, -3, -18, -6, -28, -15, 14, -7]
6537gK0Ll8%J4J3Q%l7L9j5mpOJ8j3K2k9J1JloMRm0L4J3%l3K5k6J7rjROj0J0l0
6576b6K0Jj3K0j9K4mj0qK8j3mK1k3J4K2l4LK8l0kQPj4k3K7j8K8k0Rj2J5Pnk3K0
6612A%K5l2kLj4K4Oj4j1J1J5k3J7qJ6KpJj7J5k4K0J6k9nJ4Lj4Rj0J4J3k3nJ2L1
6649C0l0rkJ2j3J8l2JJ8J8J8o4K0J6j7J0%J3Lj2kQrRrj1LK4Pkk7MJ8J0l2RmJ7
6687A1j2j3J3lK0l7L4nNMl2kJ7J2Pj8K6k1k7K4qoj9L3j1%J5kPQk9K6k6NJ6On1
6724c3K9K0jl3L5m3LMK1JmoJ9okj3mQLk1M3l2NMP%J1nj5L1k0M1l2Lpojj1J0J7
6764B0j7mqM6m2J5j1Pj2J6J3j0j1j7lNJ0j1J1oNK1k2rJ1K4n5N1l3R%NJ1LJ3j3
6800A2j8RNj6K9j9knL5l1K0jj6J7kk3J3J4n1K0J4JJ3l6nNJ2J4k3nL2l1jK4Jk7
$$ y = [-7, 13, 16, -22, -22, -8, 5, 13, 13, -24, 15, 0, -4, -11, -5, 13, 0, 22, -7, 4, 5, 2, -4, 0, 9, -31, 3, 16, 16, -17, 8, -18, -1, -10, -11, -2, 4, -6, 4, -26, -6, -5, -18, 2, -17, 7, 3, -7, -15, 13, 0, -4, 17, -6, 8, 30, -4, -1, 27, -3, -5, 3, 10, -4, -27, 0, -18, 10, -10, -1, -13, 2, 9, 4, -19, 1, 1, 26, -6, -8, -5, -19, 5, 11, -3, -14, -3, 12, -11, 6, -2, 14, 16, 9, 10, -7, 8, -16, 4, 20, -9, -14, 0, 3, -11, -2, -12, 2, 15, -8, -13, -1, 30, 0, -9, -11, 1, -12, 6, -26, -25, -7, 11, 29, -35, -15, 1, -16, -6, -6, 7, 10, -2, -4, 4, -5, 4, -5, -16, -13, 11, 18, 16, -11, -7, 11, 21, -11, -2, -6, 11, -1, -14, -1, -4, 16, -21, 13, 8, 13, 17, -15, -17, 0, 12, 19, 1, 27, 6, -21, 3, -5, -11, -30, 3, -8, -8, 7, 5, 12, 20, -9, 17, -9, -4, 12, 18, -33, -4, 16, 15, -18, 17, -26, -23, -19, 2, 3, -1, -7, 12, 6, 4, -9, -13, -5, -2, -23, 20, -12, -7, -3, 4, 4, 15, 10, -5, 26, 6, 47, 15, 18, 11, 5, 4, -7, 3, 20, 3, -1, -9, 37, -5, 10, -1, 6, -6, 10, 23, 13, 2, -15, -18, -13, -3, -14, -3, -9, -4, 17, -5, -14, -3, 21, -34, 17, -16, -7, -7, -2, 9, 12, 25, 12, -6, 3, 8, -8, 21, 2, 0, -5, 30, -1, 19, 18, 2, 19, 17, -6, 7, 21, -30, -10, 4, 5, 18, -18, -23, -18, -6, 8, -15, -20, 12, -19, -20, 4, 5, -22]
6836b2J8NL1l7K2j2j6lK7k4j5L0Nj2Kj1K5m8J5J5l1M2k3K9k8L7k4l7M4Nj0Jj2
6869a2Q%kJ8Jk9%M0j0m2N9j8%j0MJ2k6mN0k6k2J1Jj3j1J9k0M4j1mnNk9K4Nkm6
6906d1L9Mj1k%JOj0lJ4K2j3Rj1l7L0k4KL3M1n0qOj0L5l8nK6l0nL8Lpj2L4nj8k
6944ARm7NJ8lrMJ0mJ3j4J9rJ4mJ6Rqj9kJ5J1k0Rjk5J3L2k2J8j4j6knJ7j7L0m5
6982b3OjK2k9nM5j8qnNJ8j8J1k2L1k9K0j5J3mJ3mKk9QM0m3M2l7L0k1kJ8j3L7l5
7018@MJ4j8pJmk0L2k6J7j3MJ5j0nPJ0j0lj0K8j0%lJ4j7M3l8jJ4j3J0j0J1%MLl1
7056a8QK3J3j6nj1L1lm6J9J7q%Lj1j8J2j1%PK6ok2j0L5k0NQj1K3l9M2l1K7j6m1
7092d4M1OQMlKj0rJjpL4Ll6J2oL2k6lJ4l4J0RrJ7m6M3j8JJ7jJ7qj4j3L7j6j1K0
$$ y = [-22, -4, 1, 32, -5, 17, 5, -11, -14, 13, -11, -26, 4, 9, -3, -1, -12, 13, -35, -20, -5, -36, 6, -17, 12, -16, 21, -3, -40, 4, 9, -1, 0, -12, -4, -4, -6, 12, 13, -16, -16, 24, 14, -28, 31, 13, 13, 3, 7, 19, -7, -11, 39, 13, -9, 2, 3, -10, -21, -2, -22, 22, 11, 7, 2, 7, -22, 2, 7, 5, -41, -2, 2, -9, -11, -11, -10, -4, -14, -17, -3, 19, 6, 15, 4, -33, -3, -27, -25, 8, 49, -1, -9, -3, -13, 22, -16, -21, 5, -25, -30, 8, 11, 4, -8, 26, 21, 3, 1, 10, -37, -32, -14, -17, -26, -22, -12, -16, -3, -17, 2, -7, 7, 3, 19, 28, 20, 1, -1, 14, 25, 5, 14, 13, -12, 1, 33, 11, 29, 15, -1, -3, -8, 9, -8, 22, -23, -17, -18, 4, -25, -30, 15, -3, -11, -16, -11, 7, -11, 0, -22, 9, -20, 0, -15, -2, -6, 7, 3, 5, -24, -16, 24, -19, 23, -14, 16, -5, -7, 11, -2, 35, 0, 4, 18, 0, -7, -6, -10, -30, 2, -24, -7, -20, -16, -1, -11, -16, -9, 1, -9, -12, -22, 6, -4, -4, -7, 7, -10, 33, -5, -6, 8, -5, 5, -5, 6, 6, 10, 13, -18, -10, 13, 26, 10, 5, -6, 25, 22, -24, -5, 12, 4, 4, 7, -4, -22, -10, -21, -21, -14, 12, 6, -16, -26, 9, -11, -6, 2, -9, 14, -25, 17, -14, 13, -3, -44, -3, 3, 11, 15, 12, 14, 4, -5, -4, -5, -12, 22, 25, -11, 1, -5, 27, 1, -2, 12, -22, -12, -3, -12, 5, -41, 2, -16, -15, 2, 1, 18, 10, -4, -17, 20, 4, -7, 13]
7131A3j4L2m1L3k3QmNmQJ1%m7J0j1J7L0j5j0K3k1rqJ6rj1K8mrk5N2j7oomL6k0
7168Dj2J6QmkmLpJ8j1k5J1mJ5jNJOl9O5m1qj5Rk1M1Pl3J9NPk4j2RJ5k8K5K2l5
7207a5kK3Nj8LJ8j8K1k5lL1j8J6m6N0k4pjKmN7m0J0j8MMj3Lj7L5mk0J0J1mk5j0
7244b9K0kK0k8OJ2j1qOK7rj3J9j4l1M3j2K3k4%KKoM6o1L6j9k2lL9lJj0j9J2k1
7280c1K2j5K2Kj2j1J1lMQpj0L0Kj8J5n4L7K9mm3K4lJJ4opmQj9L1l1Jj3K7j1J6
7317Bqj9L2Ml1M1k8K9l2lJ6nJ2J2l7PK1k8L4m0L0rlK8jpk2K1pj6Om6K7L3k1J9
7353A1nJ2l5jpL4j7JrjK0%l3NnL3j6Oj9L7k0%MJ0%k3L1j3Rpk4J3oK7k3KJNJk1
7393b3L3n6K5KK3K3l2ko%QnK1k4J1lMJ0Kk0oJ1%JjMOk4J2L0jl4j4M3oJ3j9Rk7
$$ y = [13, -1, 31, -10, 23, 0, 8, 4, 9, 5, 13, 24, 24, -23, -13, -24, -7, 23, 8, -2, 21, 0, -9, -17, -1, -10, -21, 7, 3, -6, -31, 21, 4, -2, -8, -12, 24, 4, -8, 8, 16, 12, 10, 6, 9, 2, 20, 9, -16, -5, -9, 6, 5, 10, 11, 17, -22, 43, 2, -6, -21, -12, -33, 8, 15, -18, 1, 6, 13, -11, -23, -14, 1, -27, -2, 20, -15, -17, 6, 11, -7, -4, 14, -4, 17, -8, -11, 20, 2, 18, -28, 22, -2, -9, -10, -8, -12, 45, 5, 15, -3, 1, 5, -8, -5, -22, 13, 9, -11, -1, 10, 6, -19, -29, -9, -11, 9, -19, -13, -1, -12, -20, -14, 13, 4, -9, 10, -4, -35, 8, -4, 19, -5, -5, -3, -1, -7, 39, -22, 14, -5, -27, -30, 9, 6, 7, -3, -22, -10, -31, -9, -24, -2, 0, -12, -23, -12, -15, -11, -3, -10, -20, 10, 12, -6, 9, -45, -8, 21, 17, -26, -2, -5, -4, 10, 4, -3, -7, 1, -18, 13, -18, -17, -30, -3, -14, 2, -6, -25, 7, 11, -20, 21, -7, 22, -10, -13, 3, -2, 10, 22, -15, -8, 13, -15, 19, -21, 9, 0, -3, 25, 24, 17, -5, 16, 9, -7, -1, -47, -20, 13, -8, 11, 6, 18, -17, -18, -25, 9, -8, -7, -16, -17, 3, 3, -30, -25, -30, 3, -13, -7, -26, 11, -9, -9, -5, 5, 5, -18, 13, 0, 9, 2, -22, -9, -15, 12, -11, -9, -8, -3, -2, -23, 10, -46, -21, -19, 4, 27, -5, -7, -13, -13, -5, -10, 11, -13, -2, -5, -1, 9, 11, -9, -15, -4, -4, -3, -4, 0, 6, -18, -6, 24, 23, -11, -25, 18, 12, 25, 6, 15, -12]
7432a2L5j4k3J1J2Kj4%kRJ7pk3oj1QK2%Pk1%jlJ0j5J8K5pj5j2J1oPL4l1KqpJ5
7471GJ4m0N1j3Oj6j7Jlj4K3Kj8J8k2J3J9j0qqlJ1K0m0K2j1K5Llpk2jK1J4J5k1
7507Hj6J2jK5j1k9K2j4K0rjOj1LMonJ5k4J1j7PJ9j2jk4L3qJ2oK7l5J0k8K1oJ0
7544AroL8m5J5JJK5k9K0jM%jk3L5l6J9nlKj2QJopRoLrKK5k3Oj3J0k0M6j8nK2l9
7586b3OJ1J6j6J1qM8p0K7j%LOk5L5k4J2nNQk1nqJ4J7pqj4jK2lj2j1O3m3k4OQK1
7625A0Ok2qJ5OJ8k7M7j4j6%jKj4ooRjK6k3%mJ7j8j4OJ3k3K1qJ6PK4m5rMK2Jk5
7664a4K5k2J1Kjj7oJ6K1NKqmJ5j1pk4J9k2K3j3J1k1J4Qj2OjPrJ8m7K8j8K2Kk2
7701b4NJ5KJ2mj1K1l4K5qK4l1RnM0j2Lk0olJ5j0qJ1j1j6M6ol3oK2%j8oM6j2j8
$$ y = [-12, 23, 9, -14, -3, 9, 11, -3, -3, -5, 4, 21, 14, -9, -15, -26, -18, 4, 4, 11, -10, -10, -11, -14, -4, -19, -1, 24, 17, 2, -10, 1, -5, 2, 36, 5, 7, -1, -8, 7, 21, -19, 32, 19, 25, 9, -8, -7, -10, -24, -1, 1, -17, 1, -21, -8, 11, 1, -7, -15, -18, -7, 13, -27, -5, -16, 9, 12, 9, 2, -20, -21, 0, 14, 29, 8, -8, 4, 3, 28, 17, -12, 10, -4, 16, 7, 6, 12, 1, 4, 8, 2, -3, 12, -12, -1, -18, -11, 8, -4, -5, -29, 4, -4, 8, 2, 29, -6, 4, -24, -3, -9, 1, -8, -14, 24, -21, -6, -5, -4, 21, -8, 12, 11, 15, 15, 14, -9, 26, -10, 9, 4, 1, 3, -9, -1, 0, -6, -13, -4, -10, -7, -16, -14, 11, -12, -6, -19, -9, -29, 17, -1, -6, 16, -23, -17, -6, 10, -6, 5, -3, 45, -25, 2, 1, 1, 4, 10, -15, 20, -4, 8, 3, 8, 16, -5, -10, -18, -4, 13, 6, -2, -16, -17, 5, 2, -10, -21, 42, -1, -25, -19, -11, 10, 16, -6, -14, 1, 7, 25, -2, 45, 31, 15, 15, 14, 16, 2, -4, -10, -1, -2, 24, 1, 1, -3, 14, -4, -18, -12, 1, -22, -1, -9, 7, 14, 38, -7, -16, -12, 10, 11, -14, 11, -11, 0, 2, 1, -16, -22, -6, 15, 20, 22, 14, 10, 25, 14, 7, -17, 2, -20, 3, -10, 1, -20, -6, 2, -10, -4, -5, 2, -7, 11, -36, -8, -26, -4, -2, -24, -19, -4, -2, 10, 6, -5, 16, -18, 7, -1, 23, -8, 1, -4, 36, 24, 27, 7, 1, -2, 13, 3, -5, 6, -5, -21, 25, 19, -14, -20, 2, 2, -16, -22, 24, 12, -6]
7738fJ8Mk6OrkoJ8nMk7J2M5m6J0KM9l5kj0M3k1j8J9MMk2j5QK4j4j4J5Kk6J8K5
7775B6j3j9k2J4NmQJ5k6KPk9OK3K2j9J5lmk5PJ9mk1K0JqJ6J6l6L1j7j8LJ3K4k2
7812CLj2RK2k5J1ok8J1J7j4qL2k7J1qK0k0L8k7rMJ0j0oK4kJ7k4j5J1NjkOmnk0
7850a9mL9j4mopQkK3qk4KK0k0RL4nj1j1j1K0l0J3j4M0kj1Nj1PJmj1L%k0K2L2j7
7889A2k2L8l0J1lKk1K8l3K8j4k2L7l0jJ8lqk0J1L2j0j7J6J5l2J7%JkPqRqj6lK5
7926DrQNpOMkNmLqM%j8nJ0NJ3j8oKj7K6oj2J0K4J0j7j0qmj6J8NK7j4l0J7JJ1k4
7968a7K6Ll3K9lPnqj3J8j1J1Nj1j0J2J1n6M4mJNlj5L4l4Rj4M7j5pmj2LrL3J1j9
8006FPm%J4k7J3j1K0j8L3l0Km%l9L2j0QKPk7L9Rl1K9k2k2oL6k2OprK2%mmJL2l6
$$ y = [-6, 12, 16, -10, -4, -13, -15, -21, -3, -8, -4, -31, -19, 26, -20, -10, -8, 41, 6, 4, -6, 37, 16, -2, 17, 21, 25, 3, -12, -4, 20, 6, -8, 7, 9, -17, 1, 26, 13, -6, -28, -14, -9, -13, -5, 10, -16, -14, -7, -36, -30, -7, 15, -4, 11, 8, 4, -21, -14, 5, 1, -20, 0, 1, -7, 9, 25, -11, 20, 3, -15, -12, 1, 25, 3, 6, -6, 3, 25, 0, 11, 5, -23, -12, 5, -9, -17, 15, -12, -1, -9, 11, -9, 29, 2, -7, -3, 7, -3, -9, 15, 13, 30, 6, -9, 2, 7, 6, 4, 10, 6, 1, -19, -23, 16, 2, -2, -8, -15, -7, -9, 14, 6, -18, -16, 4, -16, -7, 27, 22, 11, 0, -11, 9, -21, -8, -22, 18, 16, 5, 10, -1, 6, 7, 3, -8, -5, -5, -25, -3, 29, 12, -10, 28, -2, 9, 6, 8, -13, 15, -18, 10, -4, -26, 11, -19, -20, -2, -5, -13, -33, -22, 10, 0, -17, -1, 14, -18, -1, -1, 0, -2, 5, -3, 6, -2, -18, -21, 4, -5, 3, 8, 1, 7, 11, 9, 14, 10, 13, 5, 9, 9, -9, -14, -4, 1, 14, -4, -10, -8, -25, 1, -5, -17, -7, 17, 27, 10, 0, -8, -12, -28, -10, -5, 22, 8, -22, -5, -4, 7, -17, 9, 12, -21, 8, 5, 12, 7, -1, -14, 4, -7, 4, 9, -2, -12, 0, 11, -45, -1, -5, -4, 1, -2, -17, 17, -17, -8, -22, 25, 10, 3, -1, -13, -10, -19, 14, 25, 6, 13, 9, 9, 23, -4, 9, -2, 18, 0, 33, 3, 5, 1, 1, -38, -6, -16, -8, -6, 1, -26, 13, 22, -9, 20, -2, -24, -30, 6, -16, -10, -17, -26, -4, -4, -8, -12, -11, 21, -15]
8046a5N6l4KlQLm2J6RRj1nQPm7O0k2j1J9J0l8L9Jk8qkpL6ql4J0LK2l7M4k5RK1
8084A5Rk5Qj0J2j7K5oj2j3L1j8oL9m0K7pj2Pj4MJPnLj1K1l0j5LK4J0ml4OOL7j4
8122Bk3j5M7J%Qn1J8L4m3L1MNj3LLJ6k8J5ql9L1QqLk1JK3Rj3j2Mrl8M8j%k8KL2
8162bnpK2k5LOoK7J4k8j4L0J2j6j8M0Lm7J1J4j5PK0l1KJ4j3j1l0
$$ y = [-15, 41, 7, 9, 6, 14, 17, -25, -9, 0, 9, -2, -7, 1, 8, -39, 21, -1, -12, 7, 17, -21, 18, 19, -9, -17, -19, -26, 10, 2, -32, -22, -19, 3, -34, 10, -15, -6, 15, 24, -1, 7, -3, 9, -8, 17, 11, -1, -14, 17, -1, -7, 32, -8, 19, 12, 0, 7, -7, -3, -2, 5, 0, 3, -8, 13, -17, -32, -29, -5, 5, 1, -33, -27, -21, 16, 2, -21, -36, 11, 12, 12, 20, -31, -13, 21, -22, 9, 13, 18, 5, 8, 11, 27, -1, 14, 6, -33, -2, 6, -2, 1, -20, -19, 4, 13, 0, -12, -8, -17, -55, -7, -8, -8, -36, -34, -2, -7, -14, 8, -17, -14, -8, -14, 13, 27, -1, -15, 15, 27, 11, -7, 33, 36, -11, 0, 14, -1, 6, 26, -5, -3, 11, -2, -13, -43]
8191d3
##END NTUPLES=NMR FID
##END=
