##TITLE=1H_Pr Tol
 CDCl3
 8 sc, 
 18.08.2022
##JCAMPDX= 6.0         $$ Bruker NMR JCAMP-DX V2.0
##DATA TYPE= NMR FID
##DATA CLASS= NTUPLES
##ORIGIN= UXNMR, Bruker Analytische Messtechnik GmbH
##OWNER= root
$$ XWIN-NMR		Version 3.5
$$ Thu Aug 18 10:23:02 2022 Russian Standard Time (UT+4h)  she@DPX200
##.OBSERVE FREQUENCY= 200.1313499994
##.OBSERVE NUCLEUS= ^1H
##.DELAY= (6, 6)
##.ACQUISITION MODE= SIMULTANEOUS
##.ACQUISITION SCHEME= undefined
##.AVERAGES= 8
##.DIGITISER RES= 18
##SPECTROMETER/DATA SYSTEM= spect
##.PULSE SEQUENCE= zg30
##.SOLVENT NAME= CDCl3
##.SHIFT REFERENCE= (INTERNAL, CDCl3, 0, 15.7039)
##AUDIT TRAIL= $$ (NUMBER, WHEN, WHO, WHERE, WHAT)
$$ ##TITLE= Audit trail, XWIN-NMR		Version 3.5
$$ ##JCAMPDX= 5.01
$$ ##ORIGIN= Bruker BioSpin GmbH
$$ ##OWNER= she
$$ F:/spectra/data/she/nmr/H-F/1/audita.txt
$$ ##AUDIT TRAIL=  $$ (NUMBER, WHEN, WHO, WHERE, WHAT)
(   1,<2022-08-18 10:21:53.12 +0400>,<she>,<DPX200>,
      <created by zg, POWCHK disabled, PULCHK disabled
       configuration hash MD5:
       00 E9 B6 7A A2 85 ED C7 34 08 36 98 17 FE 4E 26
       data hash MD5: 16K
       66 CD B5 DD B3 B5 1C D1 4C 8D A9 2A 27 A4 AF 3D>)
$$ ##END=
$$ 
$$ hash MD5
$$ 03 2B 1B F2 32 E2 AC EC 09 AD A3 71 A8 5F A9 FB
##$RELAX= 
##$RELAX= 
##$RELAX= 
##$RELAX= 
##$RELAX= 
##$RELAX= 
$$ Bruker specific parameters
$$ --------------------------
##$DU= <F:/spectra>
##$EXPNO= 1
##$NAME= <H-F>
##$PROCNO= 1
##$TYPE= <nmr>
##$USER= <she>
##$AMP= (0..31)
100 100 100 100 100 100 100 100 100 100 100 100 100 100 100 100 100 100 
100 100 100 100 100 100 100 100 100 100 100 100 100 100 
##$AQSEQ= 0
##$AQ_mod= 1
##$AUNM= <au_zg>
##$AUTOPOS= <>
##$BF1= 200.13
##$BF2= 200.13
##$BF3= 200.13
##$BF4= 200.13
##$BF5= 200.13
##$BF6= 200.13
##$BF7= 200.13
##$BF8= 200.13
##$BYTORDA= 1
##$CFDGTYP= 0
##$CFRGTYP= 5
##$CHEMSTR= <none>
##$CNST= (0..31)
1 1 145 1 1 1 1 1 1 1 1 1 1 1 1 1 1 1 1 1 1 1 1 1 1 1 1 1 1 1 1 1 
##$CPDPRG= <>
##$CPDPRG1= <>
##$CPDPRG2= <>
##$CPDPRG3= <>
##$CPDPRG4= <mlev>
##$CPDPRG5= <mlev>
##$CPDPRG6= <mlev>
##$CPDPRG7= <mlev>
##$CPDPRG8= <mlev>
##$CPDPRGB= <>
##$CPDPRGT= <>
##$D= (0..31)
0 1.2 0 0 0 0 0 0 0 0.06 0 0.03 0 0 0 0 0.0002 0 0 0 0 0 0 0 0 0 0 0 0 
0 0 0 
##$DATE= 1660803712
##$DBL= (0..7)
120 120 120 120 120 120 120 120 
##$DBP= (0..7)
150 150 150 150 150 150 150 150 
##$DBP07= 0
##$DBPNAM0= <>
##$DBPNAM1= <>
##$DBPNAM2= <>
##$DBPNAM3= <>
##$DBPNAM4= <>
##$DBPNAM5= <>
##$DBPNAM6= <>
##$DBPNAM7= <>
##$DBPOAL= (0..7)
0.5 0.5 0.5 0.5 0.5 0.5 0.5 0.5 
##$DBPOFFS= (0..7)
0 0 0 0 0 0 0 0 
##$DE= 6
##$DECBNUC= <off>
##$DECIM= 32
##$DECNUC= <off>
##$DECSTAT= 4
##$DIGMOD= 1
##$DIGTYP= 9
##$DL= (0..7)
0 120 120 120 120 120 120 120 
##$DP= (0..7)
150 150 150 150 150 150 150 150 
##$DP07= 0
##$DPNAME0= <>
##$DPNAME1= <>
##$DPNAME2= <>
##$DPNAME3= <>
##$DPNAME4= <>
##$DPNAME5= <>
##$DPNAME6= <>
##$DPNAME7= <>
##$DPOAL= (0..7)
0.5 0.5 0.5 0.5 0.5 0.5 0.5 0.5 
##$DPOFFS= (0..7)
0 0 0 0 0 0 0 0 
##$DQDMODE= 0
##$DR= 18
##$DS= 0
##$DSLIST= <SSSSSSSSSSSSSSS>
$$ [...]
##$SUBNAM2= <"">
##$SUBNAM3= <"">
##$SUBNAM4= <"">
##$SUBNAM5= <"">
##$SUBNAM6= <"">
##$SUBNAM7= <"">
##$SUBNAM8= <"">
##$SUBNAM9= <"">
##$SW= 18.0517283424941
##$SWIBOX= (0..15)
0 0 2 0 0 0 0 0 0 0 0 0 0 0 0 0 
##$SW_h= 3612.71676300578
##$TD= 16384
##$TD0= 1
##$TE= 0
##$TE2= 300
##$TE3= 300
##$TEG= 300
##$TL= (0..7)
0 120 120 120 120 120 120 120 
##$TP= (0..7)
150 150 150 150 150 150 150 150 
##$TP07= 0
##$TPNAME0= <>
##$TPNAME1= <>
##$TPNAME2= <>
##$TPNAME3= <>
##$TPNAME4= <>
##$TPNAME5= <>
##$TPNAME6= <>
##$TPNAME7= <>
##$TPOAL= (0..7)
0.5 0.5 0.5 0.5 0.5 0.5 0.5 0.5 
##$TPOFFS= (0..7)
0 0 0 0 0 0 0 0 
##$TUNHIN= 0
##$TUNHOUT= 0
##$TUNXOUT= 0
##$USERA1= <user>
##$USERA2= <user>
##$USERA3= <user>
##$USERA4= <user>
##$USERA5= <user>
##$V9= 5
##$VALIST= <valist>
##$VCLIST= <CCCCCCCCCCCCCCC>
##$VD= 0
##$VDLIST= <DDDDDDDDDDDDDDD>
##$VPLIST= <PPPPPPPPPPPPPPP>
##$VTLIST= <TTTTTTTTTTTTTTT>
##$WBST= 1024
##$WBSW= 4
##$XGAIN= (0..3)
0 0 0 0 
##$XL= 0
##$YL= 0
##$YMAX_a= 302026
##$YMIN_a= -378902
##$ZGOPTNS= <>
##$ZL1= 120
##$ZL2= 120
##$ZL3= 120
##$ZL4= 120
##$ABSF1= 10
##$ABSF2= 0
##$ABSG= 5
##$ABSL= 3
##$ALPHA= 0
##$AQORDER= 0
##$ASSFAC= 0
##$ASSFACI= 0
##$ASSFACX= 0
##$ASSWID= 0
##$AUNMP= <proc_1d>
##$AZFE= 0.1
##$AZFW= 0.1
##$BCFW= 1
##$BC_mod= 2
##$BYTORDP= 1
##$COROFFS= 0
##$CY= 11.3945322036743
##$DATMOD= 1
##$DC= 2
##$DFILT= <>
##$DTYPP= 0
##$F1P= 2.36226072786647
##$F2P= -0.459571619588291
##$FCOR= 0.5
##$FTSIZE= 0
##$FT_mod= 4
##$GAMMA= 1
##$GB= 0.15
##$INTBC= 1
##$INTSCL= 1
##$ISEN= 128
##$LB= 0.24
##$LEV0= 0
##$LPBIN= 0
##$MAXI= 10000
##$MC2= 0
##$MEAN= 0
##$ME_mod= 0
##$MI= 1.114404
##$NCOEF= 0
##$NC_proc= 0
##$NLEV= 6
##$NOISF1= 3.799351
##$NOISF2= 2.8
##$NSP= 1
##$NTH_PI= 0
##$NZP= 0
##$OFFSET= 15.70392
##$PC= 1
##$PHC0= -18032.23
##$PHC1= 2.600681
##$PH_mod= 1
##$PKNL= yes
##$PPARMOD= 0
##$PSCAL= 0
##$PSIGN= 0
##$REVERSE= no
##$SF= 200.130013532006
##$SI= 16384
##$SIGF1= 3
##$SIGF2= 2
##$SINO= 400
##$SIOLD= 16384
##$SREGLST= <1H.CDCl3>
##$SSB= 0
##$STSI= 0
##$STSR= 0
##$SW_p= 3612.71676300578
##$SYMM= 0
##$S_DEV= 0
##$TDeff= 0
##$TDoff= 0
##$TI= <>
##$TILT= no
##$TM1= 0
##$TM2= 0
##$TOPLEV= 0
##$USERP1= <user>
##$USERP2= <user>
##$USERP3= <user>
##$USERP4= <user>
##$USERP5= <user>
##$WDW= 1
##$XDIM= 8192
##$YMAX_p= 0
##$YMIN_p= 0
$$ End of Bruker specific parameters
$$ ---------------------------------
##NTUPLES= NMR FID
##VAR_NAME=  TIME,          FID/REAL,        FID/IMAG
##SYMBOL=    X,             R,               I
##VAR_TYPE=  INDEPENDENT,   DEPENDENT,       DEPENDENT
##VAR_FORM=  AFFN,          ASDF,            ASDF
##VAR_DIM=   8192,          8192,            8192
##UNITS=     SECONDS,       ARBITRARY UNITS, ARBITRARY UNITS
##FACTOR=    0.0002768,     1,               1
##FIRST=     0,             0,               0
##LAST=      2.2672688,     0,               0
##MIN=       0,             -378902,         0
##MAX=       2.2672688,     302026,          0
$$ Real data points
##PAGE= N=1
##DATA TABLE= (X++(R..R)), XYDATA
0 0 0 0 0 0 0 0 0 0 0 0 -8 8 -8 8 -8 16 -16 24 -24 32 -40 48 -56 64 -78 88 -104 120 -137 160 -183 208 -237
33 -237 268 -302 341 -383 429 -480 535 -596 663 -735 814 -901 995 -1098 1212 -1335 1470
50 1470 -1619 1785 -1966 2169 -2396 2652 -2943 3276 -3664 4117 -4662 5325 -6157 7236 -8697
65 -8697 10793 -14077 19968 -33818 139268 -78338 -363697 59263 252078 5975 -173553
76 -173553 29029 118839 -5492 -87848 -23919 7189 53256 81172 -19860 -160478 -54680
87 -54680 144672 93577 -108972 -83296 61618 34636 -66631 -14910 59886 17505 -26084
98 -26084 -3709 -29522 -39820 63776 105760 -39751 -118945 10589 98597 7195 -46391 18313
110 18313 28654 -30759 -23003 17026 7659 9490 32526 -19261 -84150 -9776 94727 24762
122 24762 -83461 -18494 59566 -26417 -70645 57475 88909 -67768 -92728 67095 72718
133 72718 -76021 -44298 107533 47872 -116461 -58178 103453 66755 -60394 -39981 33054
144 33054 6944 -24317 11343 20099 -13505 -3604 11774 -31873 -35435 46938 56336 -46505 -69494
157 -69494 28044 50063 -28423 -26051 42816 14853 -52182 -13469 45712 13121 -21302 9884
169 9884 13727 -27546 -13748 37149 22352 -21819 -11584 9591 -9464 -11073 23280 16951 -25814
182 -25814 -19106 14142 -3156 -19205 20735 27831 -34930 -41393 31956 35779 -36367 -22863 51068
195 51068 18339 -63749 -21798 68315 34337 -48886 -27949 33619 18608 -18255 -3996 15279
207 15279 4801 -3530 -6452 -16697 -3040 32947 18500 -42639 -38091 30963 36013 -27800 -31914
220 -31914 24190 20372 -29856 -19119 24297 14824 -11032 -908 1742 -15911 1810 33915 10234
233 10234 -30622 -10577 27788 10609 -18249 -1350 19432 2671 -16201 -6491 4307 4275 8872
246 8872 1522 -23075 -18902 19659 22211 -20048 -24497 17308 17037 -24982 -17417 26009 19007 -18918
260 -18918 -14402 11292 7255 -3073 7853 8690 -8934 -6815 10121 7049 -4539 1288 8307 -4647
274 -4647 -11815 3253 9658 -3756 -5380 3383 -5297 -15390 3468 18486 -5008 -22386 2096
287 2096 16382 -7181 -14648 11021 16628 -8571 -14986 6079 12921 2407 -753 212 -2333 1233
301 1233 6785 2115 -4557 2581 7881 -5860 -13649 3743 15041 -2206 -15926 -2893 8064
314 8064 -3612 -7620 4883 3631 -9322 -5029 5191 588 -3753 4942 5750 -6767 -6198 8329
328 8329 8569 -1141 -2162 2749 1486 -1696 2131 5492 382 -2400 224 -1158 -4006 667 5976
343 5976 -1529 -10385 -3079 5617 -1821 -6440 2382 3769 -6049 -6593 4181 5705 -1617 -1161 1993
358 1993 -350 -808 3765 4391 1026 -96 1598 626 -719 1982 4457 307 -3940 -2310 1363 397
374 397 -1607 18 -1636 -5698 -1912 3101 -1455 -5539 838 4335 -3537 -7082 1841 8098 2287
389 2287 -4659 -3887 2805 7812 3063 -4328 -1888 6349 5893 -3930 -6500 4136 10233 280 -11529
404 -11529 -5996 8453 7038 -6748 -9338 331 4121 -1021 -5254 -3380 616 3439 -15 -6343
418 -6343 -4165 6147 8085 -1831 -7262 -506 8333 6158 -2911 -3990 4424 6208 -679 -4089 1556
433 1556 3935 683 -1423 -2131 -2459 -835 2806 952 -4837 -6584 -727 4771 733 -6791 -5003 4187
449 4187 4476 -3490 -5334 1954 5292 2820 -636 -3687 -1706 7666 10050 -2704 -12493 476 16701
464 16701 6499 -15180 -11250 13658 16150 -11564 -20706 4668 19833 -775 -19715 -7907 10982
477 10982 8826 -5697 -11029 -3610 6994 8600 -3292 -12184 -1541 15187 10339 -12205 -14395
490 -14395 11359 22068 -2166 -20605 -1729 20587 7672 -14892 -8764 10214 9144 -5338
502 -5338 -9185 -713 4541 1816 -2545 -5546 -4874 1200 6394 58 -10040 -5340 9698 6557 -9544
517 -9544 -7053 9589 8337 -6996 -5540 8903 6528 -6562 -1508 10685 2572 -11348 -1596 15947
531 15947 4355 -18120 -7130 18028 8639 -17668 -12072 12548 10414 -10555 -11388 3131 6282
544 6282 436 -2610 -4961 -4260 5184 10756 -2329 -15282 -443 19419 7448 -17826 -10378 18429
558 18429 16788 -12861 -17511 8283 18114 -671 -14766 -4513 9196 6457 -4473 -8439 -2479
571 -2479 4998 4823 -2817 -9143 -3449 8353 7984 -8140 -12814 5044 16224 -522 -15871 -1243
585 -1243 16566 5106 -12889 -3804 12891 6511 -9608 -4049 9968 3127 -8991 -880 8943
598 8943 -1760 -11352 993 9890 -2558 -11126 149 6707 -1242 -5322 -250 1658 -596 1663
612 1663 1902 -3785 -3562 7074 8030 -5615 -8957 6667 13537 -2265 -12054 893 12116 3495
626 3495 -8373 -5173 4883 6003 -1187 -7200 -4901 3993 5997 -2966 -9517 -2820 6135 4552 -5478
641 -5478 -8481 1111 9407 3041 -9093 -6320 8881 11007 -4339 -10924 2853 13642 2760 -10765
655 -10765 -3002 10653 5714 -6843 -5168 4377 3708 -2386 -3068 -1081 -1060 593 1304 -3158 -4777 740
671 740 3284 -1903 -4165 189 2734 -198 -2095 541 1628 726 907 1771 38 -661 2565 4009
687 4009 -773 -2710 2330 4005 -1273 -3173 1310 1859 -1846 -2136 -82 -588 -1260 -689 -961 -1733 -1007
704 -1007 -35 -612 -822 -254 -193 -138 789 868 176 75 1486 2636 167 -1031 2358 3692 -892 -2604
722 -2604 1885 3204 -1249 -3104 1151 2127 -1873 -2993 -531 493 -936 -1933 -1504 -459 745 -268
738 -268 -2333 -1109 1593 1278 -1426 -1025 1917 3081 -119 -1414 1735 3030 358 -896 1522 1840
754 1840 -118 -678 1241 3 -1128 -226 201 -1156 -1487 -429 -404 -991 -1584 -936 -523 50 -152 -1389
772 -1389 -658 1127 1226 -63 -661 973 2559 1081 -856 603 2419 1402 -89 316 1216 146 246
789 246 616 -837 -1096 711 357 -2068 -2076 -224 555 -1365 -2000 -773 140 272 -1150 -1045 316 808
807 808 527 -8 -459 1433 2637 687 -1055 693 3149 1465 -1925 -209 2747 699 -1395 -871
823 -871 499 437 -534 -1543 -1423 -113 785 -1051 -2743 -701 1354 -63 -2408 -872 1476 1412 -1202
840 -1202 -1028 1709 2223 -50 -193 1034 1384 748 1315 385 -1015 1283 2009 -662 -2024 245 1323
857 1323 -858 -2065 -754 -249 -699 -969 -781 -1464 -993 369 222 -1549 -1270 1402 1601 -867 -663 1680
875 1680 1890 70 454 1452 549 578 2327 915 -1917 -76 2768 408 -2908 -1135 1974 322 -2552
892 -2552 -1775 -304 -188 -639 -916 -1674 -1437 978 1547 -1602 -2676 1375 3588 -311 -2837 780 3807
909 3807 1286 -1342 186 1686 1568 1363 -358 -1537 452 2575 -209 -3136 -643 2211 -677 -2946
925 -2946 -387 515 -1501 -1540 965 -433 -3134 -340 3313 -27 -4283 -94 5087 910 -3445 674
941 674 4093 161 -1336 1812 1147 -2006 749 3987 -805 -4619 1035 5384 -1309 -6350 -447 4893
957 4893 62 -5336 -2210 2507 1038 -1884 -2056 -1173 274 2171 639 -2624 -1435 3661 3304 -1970
973 -1970 -2568 2170 3892 1345 -1903 -2033 1843 4415 124 -5130 -1649 5605 2664 -6134 -4364 4590
989 4590 2944 -5023 -4096 2641 1371 -3305 -426 2513 -2060 -2867 3627 3686 -4990 -3360 6526 4568
1005 4568 -5877 -2897 6985 3691 -5157 -1221 5941 488 -4907 1486 4800 -2934 -4996 3195 3986
1020 3986 -4900 -5558 3298 3998 -4122 -4449 1798 2371 -1702 -1579 681 -65 179 2258 570 -2310 434
1037 434 3818 1266 -1872 -727 2386 2329 298 -1813 -1997 2327 3794 -2456 -5921 1160 6048 -1056
1053 -1056 -7921 -447 6302 -742 -6791 -446 4000 -1369 -3509 1982 1632 -3405 213 5457 -440
1068 -440 -5722 2864 8040 -1567 -6831 3890 8105 -2612 -6042 3703 5247 -3316 -3602 3328 1955
1083 1955 -4387 -1412 3755 -1016 -4781 581 3282 -2428 -4088 1888 2336 -3018 -1656 2899 607
1098 607 -2746 1048 3120 -447 -1458 1745 2169 -606 79 2026 96 -463 1725 319 -2282 -200
1114 -200 2827 -1259 -4452 334 3618 -2085 -4869 1046 3054 -2637 -3433 1815 1445 -2964 -425 3073
1130 3073 -744 -2936 2491 3965 -2754 -2734 4792 3841 -4095 -1678 5207 1573 -4342 -435 4251 -399
1146 -399 -4124 990 2781 -2508 -3116 2161 974 -4078 -1546 3260 -649 -4453 855 3670 -1687
1161 -1687 -3146 2729 2802 -2501 -925 3562 986 -2283 1255 3014 -756 -1462 2794 1621 -2700 -773
1177 -773 3176 152 -3583 129 2668 -1521 -3695 790 1907 -2475 -2547 1948 733 -2896 -308 2543
1193 2543 -1151 -2204 2145 2672 -1968 -902 3205 1410 -2513 129 3432 -170 -2421 1841 2594
1208 2594 -1723 -1982 2622 1210 -3519 -1454 2816 29 -3881 -477 2411 -1446 -3260 1521 1684
1223 1684 -2512 -1317 2496 593 -2903 704 3325 -686 -2049 2188 2550 -1468 -851 2535 937
1238 937 -1967 -42 2632 -477 -2332 779 1781 -2138 -2314 1459 805 -2780 -1621 2061 -16 -2871
1254 -2871 117 1802 -1353 -1481 1707 1240 -1782 -290 2799 498 -1502 1306 2660 -620 -1460 1740
1270 1740 1568 -1917 -506 2037 21 -2613 -57 2128 -1188 -3078 343 1792 -2260 -2255 1298 599
1286 599 -2231 -725 1662 -314 -1675 1344 1889 -1132 -603 2569 1395 -1448 258 2813 382 -1858
1302 -1858 705 2015 -530 -1354 997 958 -1578 -1290 1457 82 -2670 -646 1712 -913 -2553 717
1318 717 1405 -1448 -1412 1400 926 -1186 -113 1803 482 -899 855 1498 80 -75 1400 852 -922
1335 -922 -255 1421 242 -1104 10 1001 -655 -1668 512 85 -1835 -774 694 -279 -1731 196
1351 196 973 -1214 -910 994 678 -1019 62 1857 628 -776 631 1848 72 -568 1262 1402
1367 1402 -687 -762 1115 852 -1436 -903 1345 -67 -1576 -555 795 -521 -1419 -217 267 -988
1383 -988 -585 841 -123 -964 11 1188 378 -530 506 985 478 237 336 849 447 347 595 -299 -285 466
1403 466 32 -977 -747 370 -258 -1178 -495 431 -672 -1034 -85 -194 -1067 -391 964 284 -910 417
1421 417 1263 516 -800 530 1372 637 -232 304 1176 508 -561 472 837 -588 -416 618 354 -841
1439 -841 -733 168 184 -1230 -1411 -116 148 -445 -1037 -231 619 109 -532 132 804 355 315 413 615 35
1459 35 476 1154 307 -229 295 939 341 -947 -659 913 518 -1390 -1071 274 176 -1226 -1374 291 118
1478 118 -910 -546 100 -16 -595 131 1064 114 -667 677 1500 491 -1078 560 1659 312 -1260
1495 -1260 565 1415 65 -1327 263 1016 -428 -1634 239 470 -1326 -1000 260 507 -1366 -1419 760
1512 760 671 -1115 -817 1054 980 -583 -321 1345 677 -743 442 1560 320 -331 412 1205 -46 -968
1530 -968 358 960 -167 -1174 -22 837 -347 -1373 -310 529 -514 -1299 -359 567 -214 -1061 82
1547 82 484 -393 -324 482 761 -275 -121 1062 1486 -151 -466 1234 1311 -671 -611 921 560 -798 -900
1566 -900 620 374 -1399 -575 313 41 -1407 -580 640 -42 -1317 -148 876 -2 -1147 363 1313
1583 1313 40 -596 602 1185 -112 125 662 1032 -311 -11 791 499 -284 -409 283 180 -706 -575
1601 -575 -57 67 -689 -613 -286 -161 -594 -425 163 186 -184 -93 126 312 69 216 587 608 49 347 703
1622 703 642 -121 248 863 173 -118 4 492 -121 -712 -420 134 -516 -1151 -547 89 -666 -734 -92 391 -220
1643 -220 -520 411 685 -238 -225 626 714 -36 228 986 377 119 421 629 430 197 99 428 -103 -448 -110
1664 -110 -17 -351 -690 -245 -382 -675 -411 -319 -460 -394 92 -50 43 206 333 136 175 489 309 145 329 846
1686 846 200 -8 355 354 -139 -222 465 362 -388 -369 133 -230 -655 -297 341 -717 -718 -234 242 -540 -952 435
1708 435 279 -514 -231 767 443 12 260 653 401 89 373 659 230 -90 377 512 -33 -162 -214 102
1728 102 -234 -366 -328 135 -290 -476 -325 -402 -376 -19 -289 -292 202 133 -99 297 511 284 48 242 717 153
1750 153 293 441 251 -217 192 370 228 -30 -392 318 -545 -663 -575 292 -593 -786 -297 11 -529 -478 191
1771 191 210 -344 -73 343 338 -14 382 567 461 385 353 408 604 54 269 550 249 111 -184 25 4 -193
1793 -193 -194 34 -405 -265 -407 -497 -87 -127 -313 -180 -6 78 -303 -177 126 279 257 90 540 307 198 229
1815 229 648 404 -303 41 596 -216 -276 190 303 -300 -519 -262 -106 -758 -823 -220 -229 -632 -487 237 300 -355
1837 -355 -363 200 303 -23 42 507 928 -135 329 540 591 -157 173 734 283 -51 -83 316 -175 -358 -201
1858 -201 -105 -329 -393 -374 -222 -245 -401 -242 -80 -26 -338 -410 112 161 -141 17 507 203 127 96 835 634 -230
1881 -230 421 874 320 -402 118 608 -120 -642 -70 449 -568 -767 -125 176 -816 -642 88 27 -280 -583
1901 -583 461 470 -311 -278 484 377 -270 121 703 419 -203 52 518 208 -1 48 220 87 -212 -98 93
1922 93 51 -378 -692 125 -70 -584 -433 -169 74 -500 -42 308 261 -441 112 590 365 -132 202 691 454
1943 454 -383 136 801 -12 -281 98 772 -185 -572 207 230 -444 -463 -169 169 -361 -677 -70 -140 -356 -533
1964 -533 205 259 -436 -128 463 320 -415 3 601 480 -36 362 669 304 -44 205 500 226 -271 81
1984 81 92 -142 -511 -226 35 -290 -644 -289 -30 -138 -572 -348 178 -95 -456 -227 588 417 -280 96 790
2005 790 335 -253 212 860 311 -259 242 560 -253 -351 464 289 -385 -419 -34 253 -630 -600 -24 156 -510
2026 -510 -337 152 -28 -596 -123 345 17 -413 97 575 53 123 526 689 -22 459 504 319 87 -55 108
2047 108 77 -97 -292 -175 -273 -14 -90 -450 -36 -383 -267 -289 -290 -139 -458 -421 360 207 -365 -106 676 306
2069 306 -69 81 729 193 -183 340 735 -242 -476 417 653 -434 -498 384 171 -550 -503 122 -175 -789
2089 -789 -515 160 -217 -814 12 251 -137 -107 221 350 -270 93 800 317 196 370 505 145 -283 167
2109 167 163 12 63 424 -19 -366 -166 -67 -268 -157 176 40 -731 -193 332 -489 -532 283 332 -581 -415 282
2131 282 490 -567 98 650 260 -168 205 881 74 -472 630 455 -383 -145 339 223 -708 -451 405
2150 405 -388 -976 -129 203 -472 -653 202 -7 -233 -329 548 -57 -316 63 530 -20 -42 466 499 -191 167
2171 167 474 269 -376 325 309 -456 -281 136 -248 -465 -189 426 -161 -921 -22 135 -257 -843 413 314
2191 314 -441 -16 465 66 -482 171 886 -30 -220 698 867 -114 -487 745 604 -307 76 688 -11 -598
2211 -598 124 348 -399 -709 75 222 -529 -445 207 -107 -356 -110 381 -206 -425 125 269 -470 30 637
2231 637 127 -328 364 405 151 -57 447 420 -259 45 358 -101 -478 -44 295 -550 -854 389 253 -707
2251 -707 -621 200 -110 -825 -166 597 -177 -394 476 520 146 -202 535 312 -272 124 966 402 -578 382 681
2272 681 -95 -284 141 377 -471 -380 168 63 -621 -117 139 -299 -817 -30 373 -420 -202 297 243 -289 61
2293 61 601 265 -287 420 621 -357 -168 659 271 -437 195 661 -107 -471 128 342 -580 -690 258 -50
2313 -50 -742 -436 271 -318 -556 1 179 -198 -263 303 540 -77 -171 412 433 -155 183 431 159 -66 369
2334 369 422 152 -332 45 121 -618 124 -38 -179 -453 250 119 -654 -220 289 -280 -232 -161 247 -516 -218
2355 -218 391 273 -251 -208 950 268 -144 174 752 -28 -131 418 321 -256 -393 476 522 -398 -261 157 53
2376 53 -578 -297 275 64 -452 117 67 -436 -286 125 109 -141 -72 528 348 -146 233 515 47 -1 394 172
2398 172 -247 233 117 -20 212 416 226 -343 274 140 -37 -393 -19 -42 -417 -592 -27 170 -243 -194 387
2419 387 -25 -329 160 601 71 5 491 575 -42 25 258 378 -262 -53 333 162 -420 -103 279 6 -437
2440 -437 -116 96 -390 -393 -101 16 -244 -677 -22 68 -8 137 -14 78 -115 72 118 207 102 162 96 290 132
2463 132 83 300 237 179 56 127 146 70 -259 -107 136 -113 -189 -115 -18 -139 -475 -180 433 -250 -91 197 64
2486 64 -14 -159 205 94 -16 139 267 246 -263 153 186 -81 -351 -63 271 -465 -58 199 87 -567 -144
2507 -144 -213 -472 -346 -341 1 -35 -128 -63 -108 -156 213 -60 136 -32 149 220 315 57 141 90 163 211 228 82 34
2532 34 278 -54 -269 -214 53 -299 -427 -346 -155 -272 -63 -305 -365 -1 215 -177 17 -63 144 410 -64 237
2554 237 43 156 227 156 220 36 119 43 -35 38 -159 82 -143 -198 11 -159 -88 -174 -374 28 -207 -257 -291 -62
2578 -62 -327 85 -130 -68 -84 -111 121 256 245 94 253 153 -45 286 486 97 -72 60 0 157 -179 -250
2600 -250 22 -59 -322 0 -84 -34 -197 -251 79 -90 -94 -76 174 333 -167 265 119 80 -50 -45 192 182 -77 303
2624 303 108 114 -40 134 336 -279 8 105 69 -348 -572 -237 -94 -389 -168 36 -264 -248 -18 48 -318 -234
2646 -234 169 421 304 322 -197 66 242 -127 278 219 207 84 143 217 18 386 -222 -25 -346 -309 -233 -92
2668 -92 -402 -150 -140 -66 -63 -447 168 163 -52 -325 -39 192 -8 -93 396 49 -94 -13 320 79 -236 106 406
2691 406 246 -109 196 95 -28 -48 -180 -151 -145 -328 -164 96 -118 -238 104 59 40 -9 -43 25 -304 117 308
2714 308 152 156 92 -71 141 60 164 90 141 -181 -200 -13 65 -26 -272 -226 38 -224 -448 -73 341 -321 -203
2737 -203 -36 -30 -252 -393 95 102 51 -293 314 389 -99 152 247 181 -229 -55 366 165 -266 -44 367 -131 -517
2760 -517 -27 107 -320 -266 181 -394 -225 -185 -88 110 -201 -284 213 164 -84 86 168 218 39 -328 143 275
2782 275 -40 119 118 73 -12 158 -108 -79 -49 -308 -39 362 -114 -287 -35 92 -322 -84 -26 345 -194 -351
2804 -351 169 238 27 -17 250 223 -3 2 639 47 88 331 243 -17 -339 345 217 -182 -214 -52 395 -270 -373
2827 -373 237 -120 -369 -300 -56 -184 -20 -273 -56 64 -281 31 138 81 179 179 244 205 65 75 219 380 -293
2850 -293 239 -96 122 -223 -136 -12 21 -254 -204 103 -119 -373 -238 143 -30 -356 -198 222 -19 38 -183
2871 -183 106 -41 -203 238 63 -92 119 377 442 19 -112 244 165 32 -293 103 15 -357 -166 262 124
2892 124 -9 -343 94 112 -207 -368 -48 -94 -203 -318 -123 -322 88 -107 98 162 310 33 -1 36 172 164
2914 164 -34 81 -150 -2 46 -241 -276 -349 -244 -54 -344 -388 185 -141 -527 -193 394 -19 -402 -162 -5
2935 -5 -185 -129 -51 327 -149 -17 407 -13 -240 441 279 309 -129 -78 381 196 -327 29 146 -53 -288 -292 88
2958 88 -208 -202 327 66 -142 -186 119 5 -11 -163 165 289 -51 -35 231 306 41 -123 393 -73 -76 -21 164
2981 164 47 149 52 -145 381 -316 -272 -64 301 -155 -380 -152 61 -300 4 0 114 17 6 -23 -5 -32 -119
3004 -119 26 157 -139 -43 329 -251 69 48 67 -73 -59 213 223 122 -388 136 -119 -30 -57 -9 -202 -205 -143 -29
3028 -29 78 -372 -173 -73 187 -31 -56 269 100 169 154 221 42 210 256 78 100 -109 203 52 37 -250 184
3051 184 40 -241 -193 -149 -86 -98 -215 23 -235 -253 -11 272 6 -172 148 -126 -54 -18 -74 -47 196 5 8 -68
3075 -68 -164 170 51 547 97 -230 -1 57 -52 -65 -157 -2 -2 23 -102 -17 -67 -362 -355 106 -197 26 -63 36 81
3100 81 77 -87 121 -133 10 52 193 77 192 214 -55 142 -27 23 -217 -97 -6 169 -332 42 61 -16 -212
3123 -212 -224 -4 -60 11 -60 290 -94 14 170 168 63 -145 472 242 423 121 97 -224 254 -30 382 -44
3145 -44 -42 -253 25 -103 -287 -38 -55 -49 -254 -239 -273 -23 102 -60 39 -208 -38 417 -10 26 115 200 -136 102
3169 102 154 -230 265 207 66 -7 92 385 -70 -364 130 41 -306 136 18 -97 -143 -76 -157 -209 -226 -118 67
3192 67 -173 -115 67 166 49 -47 21 130 12 96 136 60 78 65 373 306 44 60 89 -193 -80 210 -228 -108
3216 -108 -50 75 -202 -240 -68 -61 -158 -424 -166 -227 113 36 -127 -114 -157 106 -20 13 -199 353 -33 -144 269
3239 269 181 -25 12 257 14 -160 -7 152 -170 -305 -238 14 -27 -312 -179 -135 -100 -31 88 36 -262 253 158
3262 158 38 26 -219 106 126 -89 170 121 -56 -64 301 -61 -87 -47 16 -97 -15 -201 -284 -275 -239 -57 -185 -366
3286 -366 -84 -25 -74 114 41 153 133 43 25 267 305 45 60 66 23 366 150 16 21 209 177 -261 276 34 -175
3311 -175 -197 73 29 -573 -167 148 -209 -598 -161 292 -99 34 249 237 -15 -101 212 102 36 4 24 -68 -58
3334 -58 -117 282 53 -184 139 8 -143 -55 56 -178 -4 -242 -315 -223 -143 168 38 -255 -30 -40 47 -93 -69
3357 -69 166 -173 35 282 128 -163 -42 154 295 96 203 234 -187 -25 -8 160 -81 -18 49 -91 -178 -284
3379 -284 303 -56 -338 -95 96 27 -65 -52 275 -79 -75 242 41 23 -296 27 46 -181 167 265 -149 74 357
3402 357 191 -57 40 142 -206 0 129 -262 30 -54 23 61 -274 -132 4 -62 37 -17 -73 -11 189 328 -127
3425 -127 -62 377 196 -281 -112 103 -44 -280 -130 287 88 -227 157 94 206 -356 182 370 42 -280 161
3446 161 -83 -195 50 -142 52 -201 31 204 6 112 -125 128 309 13 356 135 153 99 -48 -65 192
3467 192 120 75 -110 -143 35 39 28 -155 147 -125 -224 -134 -281 -256 -49 -92 186 -332 60 72 -174 -122 71 150
3491 150 -153 -102 157 -76 -138 -31 205 116 -94 133 20 96 -128 -37 -231 -128 -98 12 116 -171 -348 293
3513 293 54 -194 -123 21 -56 202 -80 -5 174 100 -34 122 -28 -109 -9 32 8 -69 2 312 -119 -39 -48 -99
3537 -99 -331 -324 -61 -272 22 -92 -203 -45 61 -43 -118 -79 195 -251 -65 184 -23 13 97 342 90 174 228
3560 228 -21 27 21 62 247 105 187 -81 -186 -201 -59 -45 -376 -87 27 -7 -61 -9 -72 137 167 108 282 -108
3584 -108 184 67 -80 110 367 36 63 5 10 69 -14 55 173 119 102 -171 81 -165 -230 98 -122 -331 246
3607 246 -144 36 -96 -342 82 -17 -73 50 -370 -21 -115 155 164 -140 -182 71 107 -259 190 150 211 193 -61
3630 -61 -46 -134 -19 -57 -61 32 131 -156 -323 -201 -70 -181 28 -129 -6 103 -36 133 -51 58 -184 -90 148
3653 148 33 61 54 -180 -20 15 -37 -191 87 62 94 30 181 -130 -33 48 101 -347 22 -91 76 -171 -162 136
3677 136 -97 -166 25 14 -211 103 125 90 64 -33 -26 -63 -249 -48 11 -2 238 -167 -110 117 -220 -13 -170 -15
3701 -15 -242 -141 -177 -35 -55 -142 -5 -99 -207 -95 -63 5 -417 149 94 11 67 -23 252 223 16 -110 -112 -46 -121
3726 -121 144 -86 -37 -275 -137 211 -204 14 -84 -12 95 -263 -31 142 -150 -68 -216 -94 -140 -32 18 274
3748 274 -133 -147 36 18 -41 -58 132 452 107 174 85 112 -233 -57 100 98 -47 19 188 -384 -241 191 203 -409
3772 -409 58 41 165 -13 78 145 101 -10 126 -264 270 111 109 108 9 -167 202 -4 322 84 -30 -96 12
3795 12 -222 -90 -174 -39 207 -388 -50 119 27 92 18 187 -85 257 -215 103 -104 84 159 49 87 243
3817 243 78 26 -22 5 18 -7 -76 -36 -186 80 -79 -73 146 -347 95 23 -156 -226 -21 -63 -150 -142 -38 259 -104
3842 -104 79 10 9 144 -140 139 -73 87 -94 -16 43 -223 251 -170 -241 -3 -38 -8 125 -13 -97 -23 -42 78
3866 78 -177 68 -104 -179 -29 10 189 132 -2 137 90 -119 -170 182 122 215 -182 33 56 76 -39 -45 94 100 143
3891 143 161 -39 -157 -35 310 -139 -175 -323 -111 -48 -71 -145 -143 53 -221 313 92 -88 68 -72 151 19
3913 19 -3 1 -6 147 35 120 -143 -45 -116 -184 18 365 3 -86 140 6 -46 -166 128 -34 47 -34 -72 -45 2 1
3939 1 36 6 42 65 146 6 -181 244 339 153 -35 -94 -174 -8 -144 -57 89 -170 -263 -41 -36 -54 85 -181 -138
3964 -138 141 -36 60 3 75 156 -198 -13 78 111 74 17 70 -93 -91 166 165 164 37 126 -89 74 -149 37 -50 55
3990 55 -348 -144 199 -63 -51 -110 15 -117 201 -353 -68 -174 77 117 -140 13 153 69 298 -4 84 -57
4012 -57 25 168 365 117 -69 107 38 109 120 -115 74 -42 -13 -312 -200 75 56 -187 190 -407 -91 48
4034 48 -52 151 -72 -53 130 129 -164 270 149 61 282 71 168 -30 -133 195 121 175 91 -68 82 -215 -94
4057 -94 -57 -84 -116 61 159 21 115 84 -33 189 19 130 83 -75 2 119 158 -41 -99 -97 231 -29 253 -4
4081 -4 46 4 4 240 -48 -153 121 -88 -132 -73 22 81 -13 -102 1 -139 -96 -68 1 6 78 -26 -96 138 6 80 81
4108 81 221 53 -74 256 -105 113 -55 -40 113 23 -132 -76 -591 -61 -19 16 -49 -43 -217 9 -103 14 289
4131 289 31 -194 74 209 -76 -27 3 164 -47 143 103 77 34 -8 6 120 12 -210 247 5 -208 -78
4153 -78 -17 96 151 -166 -174 -128 4 -12 -66 -37 135 -189 -92 127 94 188 349 -39 148 -140 -122 174 -204 136
4177 136 -260 -76 -49 -47 13 -82 -37 -41 -135 -89 -226 -157 16 -30 -40 -28 -236 -120 -159 161 3 98 48 135 120 -231
4203 -231 95 316 92 -188 225 -47 216 -215 127 -18 -73 -132 294 -45 -33 -195 160 73 -17 -66 -74 -18 -103
4226 -103 122 -124 8 -14 -198 189 259 40 181 128 154 167 192 58 131 -118 43 -35 -21 12 -351 -125 98
4249 98 -5 3 80 12 -122 -148 -196 8 188 -204 -86 20 45 67 42 -128 64 -312 89 -36 74 212 111
4272 111 267 10 107 109 -169 -37 -38 -8 -50 -97 93 -18 -62 143 -141 -40 -212 -170 41 -109 -131 -46 -154 21
4296 21 38 34 199 336 203 72 -51 -112 90 54 252 -20 -137 -4 -105 -144 -297 -62 -114 76 -224 -135 193
4319 193 64 -95 167 -44 -65 247 -80 -68 63 112 157 103 -35 -151 127 351 142 81 -11 -102 141 6 3
4342 3 20 51 49 -65 -78 337 193 41 -54 -281 51 -16 -199 -93 -14 177 209 -76 43 49 124 121 116 -104 42 423
4368 423 -28 291 29 -169 -100 -183 142 214 -79 -4 82 -284 -124 17 -166 -44 -108 -273 23 -159 -128 230
4390 230 -379 119 -146 49 -69 257 -26 -36 241 -7 86 156 138 62 -21 -65 -116 7 10 108 90 -80 -41 3 53
4415 53 -207 -108 96 142 -163 -74 8 -211 18 166 -8 11 139 -50 126 -76 79 78 -149 29 153 138 107
4438 107 2 -130 -62 147 -118 -77 -234 41 -111 -125 90 -103 -120 99 -89 -267 67 112 94 126 82 -117 83
4461 83 -49 142 -247 200 -70 11 70 -219 -25 -61 -381 -166 -83 -238 80 157 -184 -107 -18 -90 236 -248 64
4484 64 177 185 -146 -111 133 62 -150 113 142 108 -291 12 218 125 -59 -4 5 84 182 216 -243 -40 -171 -175 158
4509 158 -108 -145 107 188 -205 120 -71 17 -52 114 127 103 78 60 -151 81 287 90 -48 32 122 35 -26 78
4533 78 -85 -66 223 41 -222 18 -147 -93 11 -143 -155 -296 -60 41 -30 -27 -135 -29 -77 -331 248 125 236
4556 236 -11 -163 45 143 77 -40 28 -30 -3 31 -32 -116 232 213 -84 -156 78 -34 14 23 -44 -38 0 248 -180 -119
4582 -119 -160 -146 -8 104 70 -118 215 52 92 40 265 409 12 -17 -23 -136 -244 -70 -354 132 78 56 -135
4605 -135 22 -1 -119 -166 76 -48 -29 -99 265 -54 144 65 -26 282 117 -65 37 138 -89 -39 62 -15 -147
4628 -147 -19 -106 19 -149 80 -221 -106 -169 -50 -59 -183 -132 -86 -139 -191 337 -57 61 22 27 16 -27 347 -34
4652 -34 152 228 227 78 -218 -42 309 92 11 142 116 -4 -4 96 -22 -32 9 -142 -271 -264 7 -91 224 -56
4676 -56 -34 41 -89 -144 5 207 114 -53 -115 -3 232 -320 -175 267 170 128 -21 63 449 71 -25 477 -19
4699 -19 370 9 -2 -84 40 -105 250 -266 54 124 -39 -201 -139 138 -105 -140 -229 48 134 -127 171 -11 -77
4722 -77 -12 75 -327 -162 -10 -103 16 141 -110 -220 38 -121 167 -16 13 -154 -178 -230 -140 23 56 48 10 -17
4746 -17 215 -27 114 193 -107 67 9 -71 106 -183 -64 345 -41 -53 116 -10 140 179 -288 101 -273 -159
4768 -159 69 171 -218 149 253 -146 -51 89 -25 90 -6 171 81 59 42 21 73 205 -123 -176 146 -5 -13
4791 -13 -21 120 -94 -82 -31 -25 55 -167 -333 49 273 -17 230 -212 178 -163 -30 -77 -362 155 62 -272 49
4814 49 61 364 153 -189 178 -22 126 42 93 72 -68 -201 -67 31 47 -123 -121 17 -68 66 95 -48 13 91
4838 91 -328 39 -39 -3 -52 -25 -15 34 25 -182 91 -7 78 92 73 121 -166 178 -167 -89 126 51 -24 -282 -5 -257
4864 -257 78 -157 257 119 42 -220 -47 -132 -25 309 -2 -102 -128 -187 159 413 -71 12 190 188 123 -92 172
4887 172 69 -11 91 -24 -288 -198 261 -50 51 -195 85 107 -144 -34 -320 -15 -8 -178 90 9 20 -68 -86
4910 -86 25 -76 264 -252 101 59 70 181 -53 209 -32 20 170 71 -135 -92 -12 -4 -209 -163 -230 -119 -329 196
4934 196 -102 -96 122 18 -82 -197 -25 115 -180 194 -34 289 57 -56 18 -77 260 -26 48 216 40 65
4956 65 -196 -179 -144 -283 112 -109 9 -21 18 -74 -151 -74 7 -235 61 -29 10 -29 -60 -75 208 315 -110 -95 309
4981 309 -23 -37 -18 116 20 72 14 -17 -43 20 336 195 134 -7 16 -158 29 -250 210 -92 -163 -27 206 83
5005 83 -63 92 112 1 171 -276 -34 -39 10 273 -239 69 -163 159 85 -114 -45 -181 -25 -209 -152 -187 -267
5028 -267 79 -132 -32 -45 46 10 -23 -281 74 -254 140 174 -76 -12 -145 -117 178 147 -61 -116 257 117 94
5051 94 106 27 -3 201 -50 -137 -106 173 -96 -20 -82 -69 -48 -123 123 -196 -75 -103 -7 -23 95 -131 263 16 -5
5076 -5 7 198 82 29 153 29 70 -187 52 12 -219 25 119 129 20 -167 179 -109 -197 -70 -86 197 140 71
5100 71 141 101 159 173 -4 136 70 119 66 -231 121 54 99 101 -57 30 122 16 45 276 -166 -30 -37 -159 76 -59
5126 -59 45 -200 215 -192 35 88 69 150 7 52 66 221 6 87 106 -269 -165 216 235 -66 -145 74 110 -131
5150 -131 124 -52 146 -2 5 14 -206 -185 -164 -81 -128 14 -116 157 169 208 196 1 71 219 163 142 132 -254 -49
5175 -49 -26 25 78 243 -101 -43 -65 34 21 -202 -35 -128 -185 90 49 -170 -109 58 -63 -150 -24 178 103 -366 262
5200 262 191 236 -159 113 169 -106 195 13 46 141 -103 -70 -157 -49 210 22 61 -135 -119 -8 -84 -72 -63 -73 -276
5225 -276 -210 -135 63 146 -62 102 -88 87 -82 75 -50 -147 -134 -112 -106 -72 76 264 -46 -93 284 -131 89
5248 89 -168 -77 -11 -48 64 -46 22 -67 -111 70 287 169 22 -13 67 -78 -20 138 174 -340 220 -22 -6 131
5272 131 117 169 188 -7 -170 -136 -86 11 -124 147 -1 187 -47 261 -200 -44 20 236 -109 141 213 -73 -151
5295 -151 -28 25 78 99 -96 79 24 43 -107 39 -112 -79 111 129 99 -140 -156 -76 -111 9 68 116 4 -156
5319 -156 -267 -17 -6 -36 124 109 -110 -2 125 -169 -187 97 77 56 86 24 229 84 -74 81 -56 17 -2
5342 -2 50 47 49 83 -19 151 -191 36 49 -6 -108 -68 102 210 161 35 143 -27 -57 104 157 15 27 -64 48
5367 48 -9 247 -38 218 50 75 7 -107 -188 -155 -162 -49 -29 -104 133 -22 136 -50 98 -176 -25 77 -34
5390 -34 -147 51 -253 157 21 61 -116 74 34 91 46 -29 -2 144 56 -52 34 -105 -119 -411 -205 -107 -58 -167
5414 -167 39 -89 -47 -215 28 -251 -51 -168 -47 -24 6 1 139 -65 60 52 120 216 -35 192 -245 -3 98
5437 98 52 -147 -298 -43 67 -96 14 -35 12 -117 42 -126 -116 66 -2 -211 -237 146 53 171 188 36 -6
5460 -6 234 26 -258 -72 -42 177 -216 -52 -43 93 -12 52 129 74 156 198 -41 238 -256 -130 19 -214 -232 -113
5484 -113 -112 -69 67 -101 -100 -159 32 133 295 -103 32 81 -30 111 -254 116 276 62 42 -36 -127 225 118
5507 118 -75 -29 -148 -72 16 67 104 -103 103 122 88 58 -22 105 -31 84 -53 148 92 207 84 43 89 20
5531 20 -26 -36 36 -159 -207 7 -9 -96 193 -3 101 -17 -257 -155 -42 266 -111 -96 -270 122 -99 130 -78
5554 -78 9 -173 82 202 22 81 59 53 -256 54 90 -10 -122 -40 156 -18 67 130 2 -462 89 273 62
5577 62 97 -20 -125 -174 194 -183 -324 108 64 28 -151 127 61 -112 174 252 198 75 255 87 210 69 -96
5600 -96 84 152 -115 -234 -83 -10 43 181 -238 66 -74 -172 -130 -283 -53 -107 -197 -68 357 -176 -22 -165 33
5623 33 84 1 228 57 28 -100 -76 -16 -268 36 -45 -104 -61 150 -186 -52 -81 89 7 -154 -167 -127 -209 -42 -55
5648 -55 153 11 -344 35 -63 43 66 -70 249 48 -47 16 137 -121 -159 89 -81 -13 -30 -258 30 46 97
5671 97 -302 76 -234 -85 -77 -90 -329 175 -125 196 -114 -35 41 150 -104 210 172 16 412 66 -44 278
5693 278 -48 -181 18 -25 164 -123 -26 -403 104 8 -35 312 38 132 82 -28 -19 -43 -49 172 52 -97 144 -135
5717 -135 295 -86 214 42 -19 44 138 241 -96 2 2 -2 -275 50 106 -104 -179 -92 -128 73 23 -197 -69 -145 -22
5742 -22 46 61 55 -167 122 45 121 -60 -131 48 -90 -119 -79 271 21 -71 -217 -47 240 -43 -141 -12 -66 217
5766 217 144 56 -150 -165 46 118 40 169 -20 -151 -18 122 71 324 -104 120 32 -182 4 -162 102 102 -121
5789 -121 -76 243 17 -69 117 -50 -34 -268 -1 66 -91 -151 -362 62 113 -358 -10 -22 -83 81 -259 14 167
5812 167 -122 210 115 102 14 62 170 -52 22 -92 -187 -95 -173 -2 45 38 -2 -49 -177 -301 -254 25 8 -81 173
5837 173 -139 88 -47 367 -21 276 -102 91 -113 -139 248 243 245 -191 105 -114 73 16 82 136 84 84 229 -35
5861 -35 -28 74 9 -19 -253 -216 183 -93 -343 -21 -133 -29 -66 43 198 24 0 -82 167 -142 288 -157 -69
5884 -69 -94 310 -59 250 -17 -15 -10 -31 32 -47 43 21 -125 -269 -174 155 -110 -63 172 -82 -54 66 51 -103 -21
5909 -21 155 170 85 26 238 117 43 179 -64 75 142 156 -44 -36 12 -122 -103 -135 -220 -27 118 103 58 61 16 -46
5935 -46 -20 -44 -39 -180 6 11 -66 162 109 -68 55 -40 6 -97 55 28 5 149 66 95 256 231 -16 -275 -46
5960 -46 144 -71 6 -110 -92 127 -46 -102 -106 61 132 205 54 -25 -29 80 131 102 66 -44 -174 -94 211 200 156 -16
5986 -16 -108 169 18 19 -49 40 11 -5 -78 -151 -261 -69 -169 -37 102 -139 -132 82 135 155 115 -31 -211 -90 -87 -48
6012 -48 50 -9 -196 124 -54 -35 -24 -17 -150 -22 106 117 173 -140 -13 31 32 -75 -72 71 36 102 108 57 11 -138 48
6039 48 -63 11 -70 123 19 45 -138 -30 163 -64 -109 -72 12 -117 23 5 -152 -23 -96 105 99 281 19 66
6063 66 -313 -56 -35 31 110 -19 209 27 17 215 49 -126 -74 -43 -86 -100 138 123 37 189 55 -77 -35 -47
6087 -47 109 61 -267 242 -40 -95 -69 -130 190 -152 -111 15 -90 -48 33 24 214 36 56 -105 130 -92 -7 51
6111 51 -37 -166 -158 61 73 118 -197 36 43 -80 115 -42 -135 -176 81 -48 136 71 -51 132 76 140 5 88 -88
6136 -88 -75 133 30 -81 106 151 -238 -143 -11 115 40 187 248 -17 162 -98 -92 24 -109 -40 117 13 -113
6159 -113 97 -254 78 11 276 5 14 -111 70 -95 -159 224 113 73 -302 -132 67 153 64 -89 -201 48
6181 48 66 -70 76 -22 44 -78 -334 -39 -87 -160 44 -223 -167 -36 186 31 -12 92 -28 -8 71 -8 -90 1
6205 1 15 13 -65 -118 -35 -43 291 123 -41 205 95 -8 -121 94 44 -190 103 -162 -160 -369 10 -55 -128 -126 15 98
6231 98 -33 -47 159 214 19 102 -123 -79 -262 161 -180 -28 2 51 90 -36 -166 3 -137 -145 -25 53 -25 105
6255 105 -91 -140 97 67 -21 -338 89 40 44 43 -42 326 -121 129 -70 76 -45 -236 -43 -92 -74 150 141 152 137
6280 137 -55 338 -91 228 -148 -169 86 165 111 -349 147 260 -257 -11 12 -32 -359 223 -118 185 -65 -96
6302 -96 -85 -282 -19 151 71 99 42 -80 53 61 -74 117 209 -194 -35 -37 -35 -10 14 18 -66 -129 25 -7 -31 12 110
6329 110 199 92 -18 220 -15 -12 212 -98 -42 208 -52 89 -30 -139 -216 -28 -63 -271 -96 245 142 -35
6351 -35 18 -25 144 -73 41 -35 43 -177 57 -129 133 74 -95 167 -17 105 -63 136 -30 73 -90 53
6373 53 -100 152 -70 -248 -29 -102 -274 7 -65 -32 143 33 -315 -11 1 125 79 -30 -65 -11 8 -26 28 -44
6397 -44 34 131 75 -80 5 70 -146 -73 -108 87 -61 37 -97 191 404 -234 0 -148 -180 -69 -68 -185 -171 36
6421 36 42 157 11 36 100 112 -180 55 144 189 167 75 -80 37 96 224 208 -162 -81 -224 -100 -2 70 48 72 -89
6447 -89 -316 -46 -93 69 71 -226 18 -115 -230 -156 -127 -124 148 119 -167 89 420 -220 -128 -23 -84 231 40 -81
6471 -81 -86 120 50 -117 198 -79 -238 95 -3 143 168 -31 34 -25 -124 40 290 2 137 80 260 94 163 -47
6495 -47 68 145 -74 10 -54 -80 18 200 63 -58 -21 137 -47 -94 9 -96 -164 -10 -147 -102 102 12 452 51
6519 51 -39 88 -276 214 254 344 -192 202 -180 102 77 169 -166 109 40 7 187 -94 -175 57 -271 -14 -6 -153
6543 -153 -69 -76 -136 -173 40 172 83 155 45 87 96 1 -21 93 71 10 113 -7 -275 -110 -89 -241 -70 169 -147
6568 -147 -128 4 -111 -150 -155 38 -109 -305 -39 136 237 219 -32 -83 42 -20 -14 -105 49 -82 -93 -50 6 113
6592 113 24 222 71 195 -79 137 62 -472 -23 316 -149 -25 -118 32 -96 -216 263 228 -130 13 57 86
6614 86 161 -93 181 235 -72 -10 183 -225 -135 153 -124 57 67 24 -30 -16 100 -34 277 -65 -156 -119 91 -55
6638 -55 16 9 -55 -102 -275 -121 -69 60 164 51 -130 125 162 5 -130 -168 17 6 -142 27 -32 76 -200 25
6662 25 156 -230 117 4 -61 -54 42 -20 -178 107 -107 -17 158 -93 64 171 152 215 -76 100 41 -5 35 -88
6686 -88 87 -114 104 32 4 -230 59 -141 -65 330 60 36 148 71 -185 -93 -53 -203 -93 -198 -1 -221 -5
6709 -5 -26 94 103 -158 -89 -190 -57 66 -125 -171 -90 -198 43 207 2 -155 -170 150 18 -62 -148 -209 -173 3
6733 3 -14 195 -93 -14 -203 -111 -205 -108 -3 -73 -147 -231 -133 -27 -45 -98 -44 -9 24 0 126 107 -1 4 177 111 -83
6760 -83 236 101 -60 -10 -274 -159 -58 -80 -107 132 -86 -377 -58 73 87 -121 -80 119 246 25 -108 -221
6782 -221 175 109 29 -31 114 -12 -36 -28 45 -31 -293 86 -70 -173 -288 -10 141 -148 70 -43 16 -15 11 24
6806 24 -41 -54 -103 -117 115 166 63 167 -69 -152 11 -34 -213 -149 17 136 68 270 -75 186 2 -125 -69 -192
6830 -192 -55 -132 -15 -122 139 1 -318 157 225 -81 -27 -152 -131 224 146 153 77 -38 -10 -161 -95 -30 -112 -90
6854 -90 134 -117 -9 208 -8 81 86 187 -197 -47 126 45 -14 151 57 -88 -6 90 -19 77 164 47 -208 179
6878 179 -97 13 -137 -20 103 79 193 -105 269 92 73 -252 -49 -66 -199 -27 -17 93 30 -302 96 94
6900 94 42 -121 -114 -30 -196 140 45 -126 -181 233 299 72 89 -88 -96 3 29 167 -48 -89 41 173 16 -342 -60
6925 -60 -201 -87 -29 118 -72 227 -79 229 114 194 -14 -246 124 7 4 -139 -64 -27 38 17 -72 -22 306 317
6949 317 19 -66 -29 -35 297 15 -139 148 6 -306 180 -42 86 -114 30 54 -30 -186 54 -11 -91 132 117
6972 117 16 169 -50 74 -239 8 101 -6 -133 -136 -57 50 -29 -64 10 142 -38 31 77 -22 43 15 97 -194
6996 -194 -313 -60 17 111 -11 -77 78 -22 221 -133 329 182 206 -160 -32 174 -9 123 49 124 102 -77
7018 -77 27 -192 225 -216 69 62 -169 -107 232 71 -192 127 -9 119 73 -30 -220 -148 120 -182 160 169 67
7041 67 -31 210 -79 132 21 -16 -35 71 -92 -161 217 -346 97 -73 176 -36 -10 177 29 -131 -202 -180 -131
7064 -131 77 -186 19 -55 162 254 379 71 40 -301 6 36 -79 -161 -14 -27 258 -153 -47 -21 -39 129 -359
7087 -359 54 4 -143 -22 102 -73 68 199 -86 -283 -173 -7 -36 -245 95 -116 225 2 158 131 -88
7108 -88 -136 96 34 33 170 162 34 -17 8 59 63 -83 115 -58 142 -200 48 -14 -54 48 84 -30 -22 -4 -20 -105 26
7135 26 41 139 -117 -146 -181 76 -166 -82 -17 368 175 56 -179 -272 120 -123 109 -64 87 -65 -252 156 -173
7158 -173 -34 -208 -220 -36 6 -2 81 126 99 -67 -5 -76 -111 111 257 26 13 -43 -156 67 -351 25 -69 -13 -64
7183 -64 67 169 -21 -74 -119 -166 -191 41 54 -23 4 -40 -76 -100 -22 -26 -133 86 -40 108 -81 70 -41 205 -6
7208 -6 9 -10 22 41 109 -47 -81 51 45 -171 106 -80 161 -50 40 -32 -33 373 6 217 -211 -135 36 -346 49
7233 49 126 283 232 146 131 -11 11 -216 -27 2 -80 55 -289 -38 110 51 70 -140 -213 -139 -217 -122 -109 -18 -95 208
7259 208 -4 -79 -189 38 -173 102 132 59 -17 -74 236 194 -51 33 -42 110 141 -87 -264 -176 -200 -175 136 -128
7283 -128 2 -237 164 -216 -13 193 -82 142 -65 -150 -58 -176 132 206 185 -170 132 -86 -23 314 -96 -57
7305 -57 -75 66 -167 6 -54 28 -36 124 -158 -143 -153 141 -212 -277 49 48 -24 109 -61 209 -287 -6 7 230
7329 230 36 -19 33 -58 -189 -49 -11 113 190 67 53 -198 18 105 73 26 -291 146 55 -206 -236 166 -28 -123
7353 -123 124 2 27 -110 130 131 171 -8 48 65 -184 47 75 -22 -73 -146 -41 35 -136 -111 -83 -232 -53 -67 -87
7378 -87 -117 -115 -125 -21 -61 105 95 -79 -209 55 43 114 158 130 85 46 -170 75 104 -83 101 368 -92 220 237
7403 237 -79 51 -230 91 -155 110 123 13 18 -13 100 123 -116 -130 -40 -9 -163 201 -77 -48 120 300 43
7426 43 -170 -164 -15 68 8 28 157 63 140 227 24 -250 -49 97 135 138 1 106 -11 65 -213 63 -5 -56 27
7451 27 375 -139 -13 102 177 222 157 97 72 174 101 46 62 -100 -12 -53 19 104 61 113 128 -139 -29 -105 43 -171
7477 -171 64 -8 222 -166 -102 -82 42 -112 -97 151 210 181 -130 36 -77 35 -289 -27 -197 -21 -248 331
7499 331 44 -49 -26 42 184 149 -138 -186 91 183 -104 -228 58 -103 -65 38 -8 -174 -115 -185 -11 -8 -156 203
7523 203 34 31 -143 104 -26 -144 203 161 43 104 -81 -196 -9 2 -198 -81 -34 -283 -211 -43 32 -193 115
7546 115 88 123 -132 -95 72 50 -149 4 -92 76 -189 -37 -221 0 20 34 72 160 -242 18 -174 -115 -30 -40
7570 -40 -93 -124 -206 -45 19 -15 -55 -52 173 41 2 100 -46 -251 223 38 236 -101 37 207 -84 65 53 285
7594 285 35 67 191 187 -13 150 18 69 -164 57 -127 -99 -147 -160 -134 -53 48 27 180 58 74 205 -161 -17
7618 -17 109 -50 -63 43 76 180 -33 -95 -48 139 19 -76 32 -25 205 -168 129 -14 53 -166 -32 -146 78
7641 78 166 -309 18 214 -59 -83 125 -45 -16 37 57 -77 -289 -196 182 58 -49 -34 97 62 -11 -92 94 175
7665 175 214 -11 -28 -216 -128 41 -201 -35 33 -73 -218 -33 -138 -161 91 26 -1 193 -37 100 -123 61
7687 61 -47 -22 -120 -6 -180 -97 64 -29 -63 -219 25 -290 220 154 108 53 -150 296 -280 -14 -96 -55 -168 94
7711 94 121 -109 330 -105 128 106 92 -198 -96 69 -155 -16 185 66 102 -71 -85 80 90 -24 -63 -35 -90
7734 -90 -18 -90 -29 67 -237 72 -290 -23 161 178 25 -1 -64 -21 19 129 153 -31 -73 -60 117 134 -116 -113 63
7759 63 -138 -1 -111 -49 73 -105 -225 77 22 51 -58 42 -33 -163 102 17 -118 -106 100 -104 -206 151
7781 151 69 -229 256 -145 50 95 -128 11 129 -224 -55 49 99 -115 127 -38 6 -158 32 -11 -9 67 104
7804 104 102 -84 132 80 21 -171 -82 -85 -202 83 142 -191 -32 -141 -312 145 102 -12 -17 -87 246 -157 78 201
7828 201 -59 -74 11 96 -130 138 -126 32 -103 72 85 185 -144 -145 189 4 154 -21 -126 -135 50 -160 246
7851 246 -37 127 312 15 8 -87 358 124 12 -119 -14 -238 -13 0 54 -318 -183 98 -51 238 -189 121
7873 121 37 -117 -90 74 -238 40 -137 49 -13 89 37 41 257 -23 -94 50 -4 -39 124 -69 -146 -53 -51 72
7897 72 -261 -100 -120 -72 42 -42 112 192 6 369 62 -110 20 2 -87 165 175 94 17 104 -47 113 11 -30
7921 -30 67 31 127 -176 -99 -56 -103 153 45 -104 240 1 262 -222 -9 -11 71 -19 22 -58 -56 -260 -50 -167 -114
7946 -114 108 20 400 5 -43 -87 -32 145 -222 -74 76 99 -306 -194 -139 190 204 -24 -116 -141 -55 75 -103
7969 -103 -27 73 28 1 -7 -286 -135 -250 -38 76 45 -151 -82 123 -158 178 80 13 -25 105 150 -259 160 -45
7993 -45 60 143 -9 -14 132 -47 339 115 -39 -69 46 -37 42 168 66 -37 114 77 146 -176 92 7 -294
8016 -294 -282 30 124 -89 140 -153 -41 112 137 -49 -143 -45 -203 168 -170 57 228 148 -203 -127 34 -121
8038 -121 307 5 74 12 100 24 235 6 70 -44 -292 136 -234 12 -119 41 18 107 -27 -158 33 226
8060 226 36 -15 -286 -26 -79 136 196 126 8 53 80 -91 53 -182 67 317 -7 -1 -72 20 50 121 -30 -155
8084 -155 90 -88 -42 -90 -6 80 79 65 -27 37 128 -11 -90 -9 -223 2 -74 49 240 -20 25 -29 -40 128 -70
8109 -70 -45 -85 -135 228 93 -187 222 91 -67 -12 -13 -251 -36 -185 -5 152 -138 36 -18 52 85 198 -59
8132 -59 -175 68 52 -24 3 81 251 -21 -17 -26 -60 38 83 148 9 -196 -278 211 -5 -68 2 -86 164 325 -66 42
8158 42 -108 282 -19 24 -95 169 175 107 -6 -263 325 -46 -90 -71 21 -31 201 39 124 80 19 -320 131 16
8182 16 -47 -154 -47 168 140 93 161 79 50
8191E0
$$ Imaginary data points
##PAGE= N=2
##DATA TABLE= (X++(I..I)), XYDATA
0 0 0 0 0 0 0 0 0 0 0 0 0 0 4 -8 8 -8 8 -16 16 -17 24 -25 32 -40 48 -51 60 -72 80 -91 105 -120 136 -153 172
35 172 -194 217 -242 270 -301 335 -372 410 -455 502 -557 614 -676 744 -819 903 -995 1096
53 1096 -1210 1340 -1487 1652 -1845 2073 -2342 2671 -3078 3604 -4303 5285 -6767 9254 -14164
68 -14164 27521 -139468 -378902 84027 302026 -8789 -211479 19037 142040 -13172
78 -13172 -102326 1559 56957 51410 40093 -38035 -126151 -12189 162375 82890 -129922 -95310
90 -95310 78241 56607 -65713 -23973 61186 10570 -53301 -19536 -6664 -17851 48307 71658
102 71658 -59576 -120158 23520 113989 4232 -68913 6229 37313 -23861 -20932 31849 23210
114 23210 1079 13322 -15610 -57652 9151 95936 20823 -91533 -26969 68151 -4689 -64318
126 -64318 41654 76766 -68899 -97832 63437 82019 -71627 -59138 89816 41312 -115828
137 -115828 -52665 114976 66924 -80753 -53936 46461 25978 -23261 8306 25888 -10963
148 -10963 -11778 12752 -12528 -20408 42945 46385 -50390 -67547 35110 60476 -28194 -40115 31808
161 31808 15571 -52154 -15845 49735 13550 -35052 -3787 15258 -19282 -11370 36597 20725
173 20725 -28912 -16902 17038 4394 -5936 20539 16489 -24781 -18599 21013 10360 -14855
185 -14855 12369 21851 -30986 -37856 31542 38054 -35252 -32386 40266 16643 -60605 -20676 66792
198 66792 27762 -60733 -32986 41200 24737 -23280 -8509 18841 5710 -8225 -3621 -2885 5667
211 5667 28164 12201 -38191 -28083 38386 38991 -28969 -35347 23806 23751 -29719 -21715 25685 14879
225 14879 -20612 -11619 3118 -9261 -199 24936 3230 -34368 -11215 30384 12716 -20555
237 -20555 -3629 20791 3549 -16102 -1705 13935 8911 4344 -594 -16039 -9673 22825 21312
250 21312 -20143 -25322 16472 18628 -23505 -19176 23825 15737 -25705 -20074 12902 9915 -7803
263 -7803 -187 4650 -9458 -7893 11009 9082 -5013 -977 7732 -1293 -7649 7124 14159 -1427
277 -1427 -6269 4516 692 -8556 4810 16847 -4907 -22520 1360 17493 -6614 -17214 7375
290 7375 13237 -12817 -18315 6302 13405 -2500 -7396 -1816 -1069 1473 6218 2344 -3785 2102 7740
305 7740 -2423 -8615 7634 16706 -1520 -14409 300 12489 -166 -7910 3997 4119 -9207
318 -9207 -6343 5547 1377 -6106 336 2449 -8395 -7692 6835 6984 -5095 -5908 1926 2159 -981
333 -981 1829 5470 778 -2383 1478 2452 83 3102 6905 -371 -7839 -366 8879 1022 -6763 1044
349 1044 3636 -5953 -6848 3480 4503 -4526 -5597 164 -1141 -1992 1095 1946 -1849 -2520 287 995
365 995 274 2471 4036 529 -2687 344 4652 3443 255 643 697 -2448 125 4362 -154 -5011
381 -5011 -86 3217 -3721 -7469 1361 6222 -1398 -8150 -4674 2632 5013 -575 -6347 -2844 5515
396 5515 4652 -4190 -4687 5563 9868 -472 -9278 -1273 11900 8415 -6756 -7636 4084 6992 -768
411 -768 -4850 -1640 1894 2348 -2288 -6744 -3666 5041 4612 -6029 -9212 -754 7044 3136 -5852 -5370
427 -5370 4028 5758 -1623 -4134 2463 5700 1349 -1452 249 850 2538 4169 1503 -3263 -4034 2229
443 2229 5443 -50 -7067 -4192 4143 3490 -5751 -6888 1092 3676 -1249 -4602 -4512 -1369 5936 6035
459 6035 -5290 -11075 2779 16052 4610 -14584 -7324 16248 15387 -11051 -17176 9503 22121
472 22121 -1994 -19786 -3746 15808 8024 -9091 -11430 -490 7866 4776 -7188 -12507 -694
485 -694 12335 4246 -14999 -13234 11395 18123 -7155 -21367 1098 22064 5961 -16774 -6991
498 -6991 14392 10809 -6271 -7697 3628 8253 2405 -3228 -3497 -1144 3203 5247 -1618 -9694 -4218
513 -4218 8791 4774 -11279 -8495 8340 6730 -9376 -8342 7193 5709 -7918 -4075 9154
526 9154 2633 -10046 -1000 15108 4205 -15996 -4293 19493 9281 -16858 -9531 15789 11784
539 11784 -11425 -11017 6595 8667 -1973 -5661 -4167 -2049 4140 6347 -5266 -14156 263 16515
553 16515 3092 -19255 -8911 18547 14295 -15299 -16532 11903 19195 -3305 -15403 -687 13305
566 13305 6892 -6164 -7068 1456 7104 3842 -4529 -7258 -604 7886 4859 -9479 -12061 5337
580 5337 13572 -3881 -17227 -1637 15600 2964 -15063 -4629 13048 5679 -10492 -4727 10695
593 10695 4590 -8276 -431 10045 502 -9064 2207 11293 -1379 -10308 1396 8500 -915 -6636
607 -6636 -817 2388 -1146 -1420 -178 -3847 -3831 4591 4396 -7230 -8898 6003 11451 -3979 -12490
622 -12490 2414 13435 2260 -9160 -3043 8145 7224 -1899 -5812 -751 6625 6117 -3075 -7779
636 -7779 -72 7275 2961 -6867 -7616 2065 7800 -387 -10939 -5976 8208 7885 -7680 -11683 3135
651 3135 12247 78 -12121 -2417 11699 5813 -7534 -4249 6811 6064 -2369 -1926 2030 1764 1637
666 1637 1441 -1936 -3049 1756 3791 -2184 -4936 -498 2070 -1471 -3612 -958 366 -1031 -1269 -37
682 -37 -866 -1506 1292 2681 -1302 -2602 2416 4267 -429 -2195 2480 3952 -233 -474 1594 1420 185
699 185 109 57 -535 -487 299 -833 -1427 -949 -709 -1186 -1199 -576 -1413 -1354 79 550 -1372 -1930 1471 2401 -1015
720 -1015 -2108 2339 3885 -385 -2091 2227 4114 -333 -1538 1448 2338 56 -1093 -622 521 668
736 668 -856 -2271 -1652 683 26 -2882 -2023 636 946 -1843 -2857 508 2469 -613 -2127 807
752 807 2033 -67 -312 1836 1439 -138 1174 1649 192 34 1026 1068 -105 -365 -340 -4 3 -505 -1596
771 -1596 -1585 160 -205 -1569 -1548 -419 1047 -606 -1948 -462 1537 534 -1008 -76 1396 912 339
788 339 1484 645 105 1863 1672 -596 -451 1334 1614 -735 -1690 65 385 -377 -1297 -1571 -621 84
806 84 -880 -1572 -1392 -165 828 -573 -2093 -108 2400 909 -2237 3 3020 1517 -899 371 2215
823 2215 1829 519 -276 323 1185 1667 -543 -1795 -91 1382 -313 -2639 -1689 868 -12 -2594 -2406
840 -2406 627 715 -1290 -1845 204 802 -128 222 191 -273 1351 2405 221 -457 1524 2641 689 -648
858 -648 530 1404 404 -75 -330 -691 -190 218 -565 -1983 -1774 347 563 -2123 -1987 231 952 -1174
876 -1174 -1364 624 84 -84 1219 809 -1345 487 3309 1183 -1958 99 3461 1664 -1651 -292
892 -292 1666 1017 -305 -551 -940 -751 417 487 -2043 -3434 477 2296 -1499 -4019 27 2643 40
909 40 -2643 -539 1777 1185 764 -173 -958 1391 3124 513 -1999 746 3908 580 -2068 592 2110
926 2110 -451 -1071 635 67 -2817 -1002 2324 -541 -4613 -974 3782 -451 -4762 -600 3488 -271
942 -271 -2946 932 1624 -1585 310 3511 -45 -3493 1910 5982 -268 -5076 1352 6161 407 -4642
958 -4642 -1244 3806 1408 -2900 -2051 -325 376 683 -1049 -3242 -1531 2491 1744 -3480 -3480 1930 3339
975 3339 -526 -2767 -1443 2552 3680 52 -4039 -219 6472 3004 -5153 -2821 5820 4063 -4412
990 -4412 -3328 3561 2327 -3741 -1358 2425 -1677 -3675 1970 2601 -5196 -4225 5217 3679 -6673
1005 -6673 -4371 6668 3524 -5931 -1797 5888 1716 -4764 1233 5784 -1125 -3683 3784 5168 -3586
1020 -3586 -4210 4019 4610 -3604 -4521 2407 3130 -2466 -2564 257 44 -1264 -10 -680 -3028 -110 2694
1037 2694 -6 -3198 -809 2486 1996 -531 -1606 -269 3013 3816 -1385 -4144 2588 6490 -762
1052 -762 -6563 578 7193 -177 -6497 -104 4894 -801 -4293 683 1522 -3451 -1589 3741 -1039
1067 -1039 -6666 1262 6391 -2538 -7755 2995 7986 -2554 -6461 4091 6631 -2686 -3696 4379
1081 4379 3724 -3042 -1062 4480 705 -3915 813 3749 -1988 -4106 1820 2716 -3129 -3221 2041 463
1097 463 -3349 -802 1544 -1297 -2386 903 1349 -1538 -603 1776 573 -804 1579 1377 -1171 1085
1113 1085 3357 363 -2806 1292 4374 -772 -4050 1441 3732 -2538 -3622 1941 1848 -3177 -1762
1128 -1762 2199 -888 -3921 1113 2726 -3192 -3590 3739 3118 -4142 -2472 4898 1829 -4131 -555
1143 -555 5200 666 -3260 1373 3797 -1432 -2277 2692 2043 -3365 -1385 3806 24 -4117 -51 3257
1159 3257 -1955 -4060 1391 2224 -3054 -2386 2181 767 -2797 -53 2644 -759 -2065 2333 2140 -1904
1175 -1904 -420 3504 1268 -2768 567 3992 -177 -3019 1539 2999 -1643 -2465 1660 1190 -2991
1190 -2991 -994 1967 -1140 -3231 710 1549 -2626 -2293 2520 1244 -3044 -564 3267 132 -2384
1205 -2384 1365 2956 -996 -1438 3006 2363 -2428 -730 3661 959 -3225 -74 3271 -789 -3257
1220 -3257 836 1882 -2396 -1993 1660 -111 -3068 -243 2436 -1362 -3011 1319 2078 -1817 -1623 2507
1236 2507 1383 -1954 -219 3087 351 -1828 1398 3038 -1167 -1919 2036 1777 -2139 -1334 2353 291
1252 291 -2841 -429 1997 -1237 -2301 677 814 -2506 -1371 2057 11 -2471 184 2127 -562
1267 -562 -1574 1497 1764 -1338 -612 2500 958 -1548 318 2905 165 -2070 922 2357 -1202 -1947
1283 -1947 1329 668 -2340 -1037 1529 -568 -2484 -112 1122 -1577 -1796 1432 626 -2214 -539 2219
1299 2219 743 -1777 465 2478 -17 -935 1599 1931 -892 -505 1887 1107 -1710 -271 2014 -381
1315 -381 -2300 336 1668 -1509 -2051 722 637 -1926 -696 889 -425 -1788 153 1087 -753 -799 919
1332 919 1004 -569 80 1687 726 -638 750 1745 -28 -755 1140 1043 -746 -348 937 234 -1424 -48
1350 -48 806 -1058 -1643 659 471 -1593 -740 928 -170 -1558 -57 1289 -477 -1204 1134 1327 -519
1367 -519 -585 1589 991 -695 -204 1835 787 -1218 65 1319 -49 -835 408 509 -1012 -966 332
1384 332 -271 -1493 -823 357 -446 -1056 -290 716 -73 -484 -64 482 230 373 469 195 348 943 645
1403 645 -459 -16 1223 491 -743 -21 1011 48 -633 179 102 -997 -701 612 -350 -1400 -906 393
1421 393 -298 -1321 -132 919 163 -896 -42 1159 345 -32 636 1484 201 -80 851 829 -202 108
1439 108 828 840 -419 -577 590 587 -742 -1011 -349 210 -261 -1347 -530 20 -572 -517 -149 -48 -516 -448
1459 -448 610 150 -426 490 1010 612 -304 48 1561 1201 -645 -73 1240 1008 -795 -731 587 770
1477 770 -1008 -674 262 -355 -1076 -318 77 -454 -1349 -495 875 -559 -1383 -59 1397 287 -1408 265
1495 265 1689 260 -873 969 1745 18 -756 1119 1433 -303 -822 803 957 -728 -1152 548 727
1512 727 -1440 -1336 409 234 -1397 -1094 688 410 -1222 -342 758 76 -576 629 1115 264 -640 720
1530 720 1568 254 -713 681 1402 529 -968 -6 1023 -101 -993 -66 641 -327 -1013 -407 81 -571
1548 -571 -1213 -9 235 -553 -1157 523 562 -694 -679 1030 1017 -693 -227 1200 1237 -455 -60 1232 1125
1567 1125 -688 -60 898 293 -741 -438 732 110 -1382 -426 572 -442 -1284 -168 485 -677 -1195
1584 -1195 481 327 -382 -725 578 597 -277 -385 925 778 -207 5 628 662 -89 -40 662 522 -180 -107
1604 -107 421 -46 -513 -525 -210 -233 -531 -338 -403 -32 -508 -484 58 79 -374 -417 455 189 -302 83 869 328
1626 328 -213 352 1048 441 -142 510 669 439 -309 204 602 -269 -829 -48 351 -486 -961 -154 -112 -592
1646 -592 -778 288 174 -883 -525 320 54 -336 267 684 116 24 446 819 568 264 589 699 255 112
1666 112 382 170 -28 127 -33 -294 -469 -129 -439 -458 -279 -311 -540 -320 -148 -361 -506 78 278 -400 -340
1687 -340 522 612 164 216 569 630 94 -9 1124 576 -347 31 466 -27 -639 222 401 -471 -736 210 -10
1708 -10 -829 -735 153 -6 -575 -477 199 -132 -476 -241 895 280 141 316 444 271 48 645 747 261 248
1729 248 308 213 61 210 26 -74 -89 -13 -272 -520 -159 -86 -676 -327 -106 -420 -314 -135 22 -139 -172 429
1751 429 412 196 78 558 194 -12 398 906 283 -3 321 662 256 -260 -27 299 -245 -355 -9 -19 -678
1772 -678 -603 -176 -185 -674 -524 -87 -92 -219 -152 73 430 194 231 396 371 215 343 351 454 250 388 403 62 387
1796 387 424 -316 -232 67 -138 -241 -66 -266 -481 -332 -4 -186 -430 -319 16 -248 -333 -143 112 234 -280
1817 -280 73 572 226 80 454 795 55 85 557 327 -236 -94 464 146 -272 -431 -162 63 -671 -674 83
1838 83 -203 -665 -470 -4 11 -505 -112 315 -235 -317 186 517 251 275 450 1035 308 43 258 253 185 -57
1860 -57 113 207 159 -283 -48 -91 -58 -580 -436 38 -247 -629 -438 107 -126 -418 -403 367 -68 -122 188 628
1882 628 319 -394 201 1038 390 -213 533 651 122 -266 243 638 -287 -342 258 481 -703 -605 331 -42
1902 -42 -730 -445 59 77 -698 -462 343 -121 -352 80 713 280 53 259 783 271 206 413 522 364 -170
1923 -170 -58 667 287 -20 -248 205 -5 -492 -574 -162 -66 -631 -307 -169 44 -721 -77 395 134 -360 -84
1944 -84 633 212 -137 361 537 62 -436 440 856 -23 -286 334 320 -27 -342 102 295 -347 -416 95 131
1965 131 -623 -348 64 54 -629 -457 135 -12 -517 -186 456 223 96 161 363 268 -30 211 550 273 188
1986 188 236 595 141 -447 -408 141 120 -523 -450 -74 -2 -287 -412 42 -96 -713 -349 159 -206 -672 159 505
2008 505 206 -442 16 483 381 -422 641 782 102 4 548 917 -263 -36 474 157 -421 -330 217 279
2028 279 -811 -551 219 -307 -676 -104 -200 -93 -672 -305 41 -349 151 224 197 44 177 619 669 188 14
2049 14 305 247 48 -125 186 97 233 -36 -53 -192 210 -264 -602 -157 12 -581 -623 234 14 -549 -286 590
2071 590 -24 -467 -119 631 -11 -432 512 727 166 -164 725 467 35 -194 586 282 -460 -191 541 -294
2091 -294 -860 -154 562 -614 -838 -26 -33 -411 -426 339 30 -365 74 25 51 32 190 380 13 -22 541 431
2113 431 -172 480 239 -42 -192 453 8 -425 32 221 -341 -555 138 314 -597 -679 188 -78 -873 -333
2133 -333 393 -64 -584 7 608 23 -437 548 610 72 -280 461 539 -355 28 677 93 -427 -58 629 -233
2154 -233 -603 -19 204 -679 -475 327 51 -550 -213 347 -509 -471 89 183 -299 10 395 241 -484 210 508
2175 508 89 -19 660 401 -186 347 765 257 -554 64 667 -429 -728 68 207 -893 -621 427 69
2194 69 -901 -191 670 -378 -556 203 288 -437 -539 482 571 -367 -49 798 205 -212 -18 742 -84 -380
2214 -380 485 629 -378 -214 323 -80 -631 -201 374 -401 -625 -53 133 -429 -319 205 -56 -585 -171 70
2234 70 -64 -252 498 558 -164 99 530 392 -80 -14 897 -31 -496 419 492 -482 -443 294 85 -662 -330 347
2256 347 -285 -755 -128 156 -593 -591 248 418 -484 -145 426 262 -446 37 527 101 -438 485 653 -198 -113
2277 -113 377 182 -406 212 291 136 -287 63 55 -455 -461 274 -74 -688 -301 184 -392 -404 60 184 -397 -226
2299 -226 487 364 -332 94 687 136 -407 421 646 35 -263 720 475 -457 -150 401 134 -445 -121 458
2319 458 -589 -605 36 141 -626 -233 -2 137 -629 52 506 -114 -191 105 390 185 -60 317 373 -75 218
2340 218 328 8 -164 318 113 -105 -89 431 80 -524 -106 391 -359 -553 -30 77 -606 -324 526 -57
2360 -57 -622 19 455 72 -355 297 756 153 -198 331 314 -201 -79 603 407 -380 -202 546 -10 -381 -137
2381 -137 218 -340 -310 99 47 -405 -510 93 6 -286 -398 309 153 -124 63 54 -35 -103 95 79 -4 140 170
2404 170 248 207 506 89 -288 203 109 -285 -135 335 64 -297 -422 98 -240 -475 -323 141 -264 -523 -9
2425 -9 195 -2 -216 -60 693 -173 -6 535 331 -106 98 605 -96 39 186 282 -178 -131 -50 327 -424 -186
2447 -186 -138 -207 -404 -140 43 -55 -237 -358 -38 -84 60 -249 73 207 107 386 242 146 210 197 135 262 211
2470 211 -128 -116 210 182 -201 160 370 -109 -379 -284 164 -147 -538 -55 -68 -573 -298 61 -37 -328 -408 291
2492 291 30 -246 -14 276 -308 -172 275 358 33 222 478 299 38 196 401 49 -237 -42 170 37
2512 37 -114 -124 -181 -161 -287 -184 -252 36 -120 76 71 -219 110 50 231 -29 211 7 327 182 308 -14 176
2535 176 332 -30 8 130 -183 46 230 -130 -68 -266 -62 16 -173 -137 69 79 -218 -280 47 -279 101 14
2557 14 -11 -14 84 -75 281 162 29 123 231 161 50 185 23 -32 102 317 -184 -193 -30 -196 -255 -58 -29 -228
2581 -228 -209 -239 -225 -20 75 -95 -6 -140 -6 -109 62 109 284 119 7 116 -51 179 160 120 -6 235 228
2604 228 -180 -306 -84 -213 21 -171 -207 -230 -86 68 -451 -78 -259 26 -50 195 90 -289 224 178 -93
2625 -93 -25 320 134 -162 -36 412 70 134 -54 255 144 -194 -88 98 53 -271 -161 -275 -185 -267 -67 133
2647 133 -319 -309 -125 -192 -193 86 -312 259 142 64 -123 193 205 -151 45 278 150 -1 175 319 -53 -265
2669 -265 185 52 -89 -178 -39 207 -324 -549 -168 131 -241 -499 147 54 -299 -71 257 107 -61 -2 382
2690 382 56 -81 91 212 97 -216 220 244 64 -130 -137 46 -93 -153 81 -107 -360 88 67 -37 19 -384
2712 -384 -184 -63 -169 -3 -47 206 156 108 300 107 133 -109 108 151 91 61 115 150 77 -37 261 241 -255 -544
2736 -544 12 212 -99 -318 4 111 -293 -290 202 103 -127 -312 291 72 -73 -10 348 345 -199 116 428 106
2758 106 20 506 435 -177 -87 126 215 -182 -62 90 -36 -417 -86 48 -72 -316 -133 -6 -131 -204 -43 28
2780 28 -81 -187 -41 -46 47 18 -15 8 200 151 55 37 45 -1 -83 14 148 -257 -165 105 157 -234 -273 49 58 -466 -62
2807 -62 220 -264 -97 -276 189 62 -213 95 259 -3 -212 249 296 86 25 117 236 27 -212 492 460 -134
2829 -134 -14 -51 -8 -125 -114 -102 -268 -83 -114 55 -111 -338 -320 -63 67 -348 47 112 -8 -118 43 211
2851 211 180 124 102 188 295 86 -26 252 172 -59 -98 131 -37 -35 -426 202 -7 -120 -122 39 -181 -422 -190
2874 -190 -53 -91 -298 -189 190 234 -307 316 278 -69 -143 247 109 -187 2 212 85 -124 211 191 -187 -26
2896 -26 34 73 -200 -354 38 -19 -185 -211 -59 147 -189 -108 -200 16 25 -223 -110 -122 30 -148 396 142 2
2919 2 -275 368 314 25 -170 138 365 121 -262 -113 230 -33 -189 -43 189 -303 -435 -300 390 -381 -346
2940 -346 -93 -78 -181 -381 208 154 100 -8 184 57 -70 139 597 192 -328 -117 176 48 7 381 -190
2961 -190 -48 173 2 256 -172 22 -100 253 -176 -62 -145 -47 74 -155 138 188 -59 -87 316 -179 -128 131
2983 131 65 204 -5 -33 -67 207 -53 -170 63 178 -67 -116 39 189 -13 -182 13 -280 -488 -236 26
3004 26 11 -251 -29 342 123 -4 20 286 218 110 191 323 69 -42 267 156 -126 -17 201 193 -21 -205
3026 -205 -249 -145 -159 -144 3 34 -185 -273 -166 77 -183 -40 108 -67 -81 83 -88 -112 -103 122 329 16 71
3049 71 27 151 110 -173 121 297 -30 18 104 -151 49 227 -204 34 -146 93 12 -279 -116 -75 -110 -52 -75
3072 -75 -102 -19 -151 21 80 135 242 57 163 41 69 180 294 16 -18 81 -218 157 -93 178 -88 -42 -185
3095 -185 -157 -191 -151 -64 18 158 -115 13 -147 161 181 -265 -237 -11 43 -108 256 283 99 -158 16 235 -144
3118 -144 182 153 224 40 53 181 95 -48 -303 -131 -91 33 -153 44 150 -133 -249 -50 20 -408 -175 136
3140 136 -87 -106 150 142 38 -54 -79 -26 161 98 232 99 39 56 160 -13 -22 5 -133 -177 -145 -122 -208 -110 -91 -19
3166 -19 9 171 -98 162 -8 169 28 125 114 215 219 -38 198 -24 80 -121 416 135 -233 166 112 182 -135
3189 -135 -221 -2 -275 -337 88 147 -80 -358 177 37 -55 -86 -42 -121 9 3 90 152 -200 33 6 19 -84 188
3213 188 145 -71 -82 13 85 -98 -34 38 -357 -101 -22 -85 -176 -96 34 -453 -115 63 -148 133 178 -66 68 -17
3237 -17 37 145 58 -25 259 50 -120 270 238 281 -354 23 210 120 -406 44 214 -284 -152 239 169 -214 -61
3260 -61 56 -45 -127 -116 -51 -319 -430 222 240 72 -127 -17 120 -156 190 283 -129 213 -131 88 56 -92
3282 -92 -143 -30 -320 72 223 -213 -309 112 -23 -58 -148 72 47 -333 -326 70 57 -50 3 -16 -188 -12 183 46
3306 46 215 520 160 -16 -80 257 218 9 -177 124 334 -210 -100 -19 -59 -244 -164 -28 -96 -137 22 115 -52
3329 -52 -65 115 47 -6 -246 119 83 -7 105 110 -118 27 80 -33 -193 65 338 -51 -249 -125 185 -164 -75
3352 -75 275 -215 -75 -401 -142 -257 -228 88 -40 -203 -274 -30 -120 -277 174 154 69 -229 112 238 303 -112
3374 -112 214 396 272 -177 -54 4 -101 81 178 22 -409 -241 125 -132 -16 -239 -110 -196 -150 113 -189
3395 -189 -39 -52 132 -276 -225 245 294 -223 -169 204 77 118 -106 59 -200 25 169 13 60 89 78 -173 92
3418 92 123 216 -241 -337 -38 -177 44 -87 -80 59 -153 356 -94 50 -28 86 -75 -119 291 334 168 -266 -56
3441 -56 129 38 9 44 -119 -102 69 -35 -8 -293 -172 81 -55 -148 -366 -60 -179 51 80 -205 -171 -310 53
3464 53 225 36 93 96 121 220 -80 118 260 183 75 -108 -413 173 125 155 86 135 45 -130 -22 34 -58 -113 -2
3489 -2 80 -64 -308 127 4 192 34 -32 123 -257 21 -31 153 47 -36 -41 -33 -229 -22 -50 3 -182 68 87
3513 87 -124 31 -142 28 -186 -260 -41 -403 10 -48 51 -173 62 7 -36 -99 203 47 107 84 61 119 -32 300
3537 300 -88 253 16 268 43 -91 132 -106 -283 -101 111 -5 -162 -247 -86 195 -113 -198 131 -105 0
3558 0 -140 137 186 129 196 31 -8 156 78 11 -123 52 86 218 158 94 156 56 -250 -3 -57 -67 91 -116 -62
3583 -62 -257 -89 -272 -67 -100 -272 152 -233 -120 121 47 272 24 100 1 -40 -110 -32 178 97 105 100 34 -66 -36
3608 -36 -31 101 -269 -205 -119 -148 -66 -183 -243 -11 -62 -187 -106 160 -146 126 -59 104 -21 36 254 96 81 138
3632 138 -50 47 144 -76 -287 -159 -22 14 -151 -48 -225 126 -135 -108 -119 29 29 -47 146 246 71 -89 -101
3655 -101 40 109 286 -90 82 61 143 301 54 155 99 101 83 83 241 132 2 175 -109 -19 94 26 90 -35
3679 -35 76 118 -201 -167 4 53 -221 196 -69 -212 -85 -164 352 -195 -164 5 52 168 43 -55 8 -293 292
3702 292 -25 44 165 180 -20 39 -100 -68 -29 -26 -212 -436 -90 226 -18 12 -9 -273 -14 263 73 151 120 -27
3726 -27 22 33 168 82 216 231 -52 -18 44 188 -139 -57 268 75 -104 -81 96 -273 -36 185 -271 23 -299
3749 -299 185 184 -181 -60 -119 -69 -47 9 203 200 -76 56 128 92 -39 162 121 26 159 87 8 -79 -44 8 -19 -222
3775 -222 53 44 -18 59 -64 -28 -28 -162 62 129 101 107 28 -110 -79 -57 -85 -111 -66 -188 -27 -106 73 171 -37 -48 74
3802 74 60 -301 27 -23 -351 -209 -312 61 119 -274 -103 18 95 -220 24 -161 -65 34 261 -65 120 214 128
3825 128 -89 80 68 67 -119 67 25 140 -80 -39 -133 179 -123 -136 -49 -239 60 216 -102 7 -288 -27 -102
3848 -102 -208 -111 55 -121 20 291 10 1 -24 -185 64 28 150 -1 -133 -134 -72 -18 -16 -168 -60 -235 -33 -145
3872 -145 -239 -115 -28 64 -136 -214 -151 146 46 -44 11 249 115 18 319 23 125 17 144 190 -188 92 -78
3895 -78 51 -188 32 142 -43 22 -55 -116 -3 -180 -76 54 10 -295 -22 -102 126 -65 -8 63 23 150 37
3918 37 -54 17 77 204 231 -105 25 -32 249 207 14 -9 120 -29 43 -77 63 -91 -81 -234 14 90 -20 -27
3942 -27 -47 -86 91 -57 -157 161 -103 86 91 131 -58 -9 27 116 43 79 -48 37 -88 44 -394 95 -277 -17
3966 -17 -286 -256 215 -252 -149 -77 -113 -85 14 251 -609 -145 17 -102 -106 122 11 347 213 122 97 -37 -199
3989 -199 249 155 -412 -109 67 195 -306 0 -30 136 22 101 32 -351 -166 92 -73 -52 -285 -51 138 95
4011 95 102 97 44 -35 56 10 173 -45 144 -19 64 -88 94 131 161 162 36 375 -90 -82 116 -136 -68 84 123 71
4037 71 -136 108 -2 92 -159 -257 -71 12 112 225 -182 160 -139 123 77 32 -38 -7 319 222 154 88 180 -248
4061 -248 202 -197 141 -102 2 -122 -117 79 90 -86 -179 138 10 346 59 6 22 30 136 115 -317 -30 113
4084 113 -132 245 155 81 -4 24 257 103 -146 9 122 -285 -13 29 101 51 -242 145 -91 150 -68 160
4106 160 -3 58 88 52 210 142 127 -53 233 166 252 8 160 148 225 366 238 140 -131 -230 0 -171 65 5
4130 5 -120 -261 -229 182 -202 -92 -67 -151 161 94 234 -37 37 91 90 3 9 145 66 -80 -20 110 18 102 -151 133
4156 133 -199 -19 67 -136 140 43 -56 -228 137 -4 -45 -349 11 -377 -128 85 -122 11 -90 0 226 154
4178 154 -286 26 167 74 -57 -14 23 -125 -53 130 -91 -30 101 -69 -18 20 -27 -178 85 39 209 -177 54
4201 54 40 48 165 -130 51 79 95 -85 21 -158 20 230 167 -100 103 -65 -148 10 -29 -139 -106 -206 54
4224 54 -84 -176 104 -219 -70 -24 100 60 49 199 111 -140 144 81 -140 83 147 -64 -30 264 189 136 316 236
4248 236 -33 237 -5 86 -39 23 -152 -32 96 8 39 -15 36 -3 -69 -19 99 -65 -163 -267 7 -37 78 1
4272 1 215 85 206 -49 36 75 -75 -146 -166 196 165 121 176 -135 -60 115 118 -66 -100 -67 -62 -312 -168 9 -146
4297 -146 99 23 179 256 258 317 9 79 77 88 -71 -19 165 37 178 265 185 -181 89 -4 -82 162 -88 -26 -79
4322 -79 -66 -9 192 -55 -134 -302 143 -90 -131 163 -164 -117 -124 3 181 -15 194 207 -69 6 118 276 37
4345 37 4 56 220 411 62 -69 -28 78 -170 -39 -87 -90 76 111 -76 -157 16 -172 114 -64 -35 243 279 44
4369 44 336 105 160 94 89 -100 -159 170 -14 -142 -41 -33 -233 -446 -68 91 -86 -241 68 -82 -176 -12 -83
4392 -83 -10 -11 -25 263 -22 43 -199 167 41 295 40 69 63 162 314 169 81 -14 281 -88 -103 124 75 -49 -128
4417 -128 74 -52 -195 -66 -32 -187 -140 -186 192 1 13 -40 74 15 156 74 23 79 20 -57 34 280 212 72
4441 72 -12 45 -49 211 192 32 39 -181 107 94 156 -48 95 143 188 -280 -85 284 -7 -330 96 -49 -225 193
4465 193 9 -69 346 -229 -91 -133 136 216 63 63 -55 -51 -153 -50 14 -184 -1 105 -3 -14 -31 11 75 -3
4489 -3 -255 -147 20 -84 -58 337 -136 -47 -154 102 -1 -30 83 270 -126 -150 116 45 102 98 31 91 -2 -17 117
4514 117 -39 -97 -215 -8 -199 -80 -84 -32 159 64 -88 -59 -114 -56 56 88 -55 -352 35 -114 -36 -30 194 -22
4538 -22 -111 119 79 -133 -187 45 3 85 -20 129 74 166 62 -211 -147 -130 68 -38 -311 -131 98 -62 -39 20
4562 20 -14 96 268 543 120 -36 98 99 210 129 -264 142 -122 -36 -8 -41 -4 -217 -65 -89 116 -213 -62
4585 -62 151 56 170 -51 10 -126 197 -75 222 137 123 48 351 47 -450 -151 149 38 -138 -29 66 -181
4607 -181 87 -136 -269 272 83 -186 -100 363 -84 -96 -30 -108 12 -336 -217 -144 99 -93 -207 97 -118 49
4629 49 84 245 -101 221 -10 129 -63 58 180 87 89 129 -239 -57 -268 -175 -203 -56 -38 39 186 -49 97
4652 97 -82 88 -21 53 126 136 6 71 129 267 3 133 -63 206 191 76 -41 230 -69 -24 134 -44 41
4675 41 -107 77 56 -120 -204 59 -6 -123 10 -35 -22 -70 11 -309 195 -73 138 25 81 16 226 -98 -137 -41
4699 -41 110 -43 -6 -31 -69 51 -41 -13 172 -121 34 233 -85 -22 116 -277 118 68 99 57 115 -43 224 132
4723 132 66 39 -45 51 -162 -111 13 154 35 142 -108 2 6 -114 110 -9 -44 -73 -123 -331 109 123 144 -33
4747 -33 75 17 -190 16 194 17 -10 -142 88 -34 238 -4 121 -50 3 193 131 141 -43 -249 -241 207 21
4770 21 -230 24 -14 127 100 153 -104 -59 43 11 -127 84 -150 -42 76 -19 116 192 199 35 -71 -11 -38 58
4794 58 76 51 -1 -118 143 -130 124 -102 218 127 -122 -82 122 2 -87 -43 -10 70 42 61 -50 -130 -69 53 -39
4819 -39 134 -153 -5 127 119 -111 117 -44 199 219 -114 -275 -122 73 -90 -351 79 74 -182 15 -155 -74
4841 -74 41 -58 -46 -62 63 123 -23 -209 -178 278 -129 -46 -12 -6 71 -28 102 102 -6 40 -17 92 -17 -44 -112 -137
4867 -137 54 3 176 -304 -97 -210 -19 -200 -9 -96 -210 31 -149 -97 1 -73 -224 119 75 33 -34 -3 36
4890 36 154 -3 -221 153 69 45 132 -78 -58 -151 -149 150 -18 -239 -231 -189 -212 56 16 -215 143 26 99 112 58
4915 58 30 36 43 252 -202 68 59 -92 91 443 30 36 131 -68 144 -29 -68 98 -74 -177 84 -280 -109 -188
4939 -188 -140 -21 -104 60 -23 -218 36 6 -102 -37 -119 -210 95 17 70 177 132 -198 60 -210 -211 76 -11 215
4963 215 -27 -65 -8 146 19 148 -362 95 26 -174 173 -33 -31 -1 12 -75 96 41 161 -162 145 101 -157
4986 -157 191 243 137 -98 123 39 141 -35 -110 157 -35 -197 -41 -68 107 -197 -142 -90 -97 189 34 -90 -113
5009 -113 -13 -248 47 -71 -359 19 -77 8 295 228 152 105 60 179 232 -40 -88 242 5 187 26 -223 166
5032 166 -56 218 40 -219 96 -84 -41 -181 -32 -50 -19 92 -11 149 -111 -104 135 7 87 -247 13 -127
5054 -127 -115 -213 253 -23 77 -128 188 289 -45 39 57 -186 17 -254 -13 20 -150 -201 47 -220 214 28
5076 28 -97 27 207 259 -103 -179 -93 -35 -1 -190 -133 217 107 -167 -311 103 131 -411 64 -31 -192 53 130
5099 130 169 -179 252 -74 -140 -36 83 144 -65 49 -1 -110 -28 183 -64 -9 41 -152 195 15 -152 -40
5121 -40 144 -40 -94 -64 -167 -65 -343 -54 -135 116 122 -166 -216 -119 13 -183 122 184 214 -150 1 101 54 -15
5145 -15 -190 183 133 -34 60 -84 175 46 -1 72 211 -209 -127 108 171 -67 -110 169 103 -5 -196 166 135
5168 135 61 -146 58 273 6 -93 -90 95 -255 96 256 -78 11 -39 59 -49 62 145 249 220 163 -140 25
5191 25 -97 -24 -26 -48 194 -72 -310 -30 -70 163 -77 62 -49 -14 196 131 -141 66 -65 13 41 -117 -157 88
5215 88 64 22 -42 -231 34 24 120 -96 -49 94 26 -8 -102 -221 183 -109 48 46 -4 -5 108 -265 117 -51 -123
5240 -123 -15 106 -53 -44 142 82 -67 1 -86 204 167 -49 9 308 106 -38 79 43 -106 -188 -169 -99 71 -74
5264 -74 180 -61 -243 245 -44 18 200 -2 79 -74 37 108 88 55 107 8 -42 -202 132 45 20 -18 -43 -182
5288 -182 -25 -8 -251 -133 -212 -76 122 -21 184 -32 -279 -62 -51 -98 64 -156 -52 133 -35 11 227 96
5310 96 6 -55 -37 -89 -264 -15 -182 -265 -20 -145 -42 -171 152 12 63 134 271 -267 -95 -81 291 21 198
5333 198 -145 117 165 -116 97 93 193 146 -83 16 215 95 19 -167 325 -19 -56 95 -79 -18 -132 113 5
5356 5 -86 19 -245 43 455 9 -82 12 71 -283 -302 213 -171 -178 15 123 65 314 -173 120 224 -189 79
5379 79 -274 -159 49 -79 -35 65 141 75 -105 -103 25 -14 46 0 -31 -225 6 240 -107 47 48 284 92 185
5403 185 -14 250 -107 218 109 24 38 239 123 41 -218 125 -319 11 171 -231 85 -68 -193 -5 -233
5424 -233 -239 -41 -85 153 255 50 -206 -112 7 32 71 54 183 418 31 262 36 132 65 204 106 1 31 93
5448 93 -41 -137 -148 -47 124 -110 60 32 -55 -93 -349 -68 -90 29 101 41 -121 -88 51 -125 189 20 87 72
5472 72 17 114 -143 -282 -43 -438 -119 -13 103 53 216 163 87 -202 71 -26 3 17 -165 -118 -72 74 312 62
5496 62 229 94 127 -180 -252 51 293 299 279 162 -121 92 -54 -64 -5 15 -92 -135 -35 -5 -3 200 -347 -113
5520 -113 65 255 -61 269 92 5 -80 -206 -19 211 205 69 253 -95 214 -35 -13 115 -133 73 158 -7
5542 -7 35 -55 132 -56 273 -135 67 169 -226 -289 80 -197 20 -56 229 11 23 -25 95 203 -268 113 189
5565 189 206 176 -245 -71 -24 -199 -112 80 116 -46 -111 240 82 -86 63 243 -60 -64 -97 -197 96 46 54 -174
5589 -174 -137 -7 278 -52 39 96 -66 16 -104 93 -58 157 250 216 101 172 -40 -138 -118 -146 -240 23 -56 134
5613 134 37 -12 145 -34 15 -153 -55 -8 -161 6 -108 97 -160 54 125 173 121 174 -5 191 88 -245 222
5636 222 108 -151 10 243 -231 46 2 -15 -40 -177 -118 -31 -3 -40 -61 59 44 201 -116 22 -90 109 147
5659 147 173 163 -261 -61 34 -67 291 -285 -16 40 -97 -2 20 169 41 -47 -110 120 105 20 -75 -19 27 -163
5683 -163 32 -244 51 59 174 172 -134 7 30 -116 -240 84 -48 -36 226 151 149 29 -84 112 -40 261 -158
5706 -158 -81 -58 -153 -130 -176 64 -14 78 -204 139 124 -349 208 68 -175 -22 -2 -42 174 95 81 110 71 -14 72
5731 72 105 102 131 101 100 -11 -43 -24 348 107 40 -41 -125 79 -17 -92 49 -139 -17 -192 -198 131 9 -49 33 -9 75
5758 75 63 -97 59 105 -88 63 60 92 1 -100 -4 -20 31 126 56 90 -141 109 101 125 -192 80 106 -165 -95 -71
5784 -71 -146 38 160 9 -30 39 6 -100 59 -39 51 36 127 358 -134 23 42 -230 -33 -164 154 134 146 -39
5808 -39 -49 13 -122 -30 -330 -250 4 99 -128 -120 -159 197 17 -28 15 -43 35 -15 127 46 -62 -119 33 2 25 16 111
5835 111 56 -94 114 13 -114 156 -259 275 -143 52 -103 -196 -107 -72 61 84 -44 -10 -93 -58 121 60 69 114
5859 114 102 131 92 34 101 -118 87 95 -208 34 -164 -42 -170 -13 -98 -248 -32 -202 147 -300 -39 -105 41
5882 41 -174 -76 81 -39 157 -151 -50 255 -23 220 120 34 -63 115 -55 224 82 -128 150 -154 9
5903 9 -151 -157 -41 -63 50 -60 -84 73 10 -45 -373 43 206 157 79 -63 144 158 -341 -117 -62 -156 -47 81
5927 81 -32 -35 164 40 19 78 200 -229 -68 -101 -28 -82 44 24 71 -83 199 -49 36 232 -168 -43 169 157
5951 157 42 189 -149 47 226 -65 -219 -58 68 77 -151 -250 -23 286 35 -150 22 -139 94 81 -33
5972 -33 6 112 154 -156 280 78 60 41 -87 59 -9 -97 -285 302 -8 267 179 -193 -69 161 -109 -211 283
5995 283 47 222 53 25 -24 122 134 -186 -201 -472 -112 -169 310 -108 -309 -165 -2 -3 -290 55 262 62
6017 62 69 -188 33 36 -268 -20 21 84 -31 -136 -34 -49 22 25 -227 144 -180 222 -2 153 -181 112 141 -139
6041 -139 -65 125 18 29 359 -138 33 19 -31 125 194 66 209 174 207 -132 99 168 166 -45 -186 212 4
6064 4 14 -146 -37 -131 -133 93 -185 -118 -98 -72 -128 44 -264 128 -3 169 109 24 85 -4 -125 23 58 -9 173
6089 173 -24 172 -162 42 -45 110 -250 -138 -100 96 -19 87 -238 118 -36 -51 -33 201 156 358 30 -278
6111 -278 -18 160 -151 30 29 -197 -28 -44 176 72 155 9 40 23 -62 -104 -146 106 32 -241 -313 301 95 -162
6135 -162 141 -103 277 -94 135 -91 72 -132 107 243 93 -253 -7 211 174 -81 42 98 -225 16 -125
6156 -125 348 -33 -56 -45 -62 -153 13 13 -88 32 -156 -85 117 1 -116 115 -4 -62 -92 -33 17 171 -218 145
6180 145 59 -58 -113 -55 110 -61 -155 60 338 -167 -142 165 -47 -67 -215 -44 64 73 28 -112 -76 195 105 -230
6204 -230 -20 -139 2 -21 148 257 144 97 -26 63 119 97 -205 163 162 36 -149 223 65 -289 -12 -145
6226 -145 -168 -68 47 16 -112 -37 -97 -240 -132 -165 -4 -79 -225 113 -59 32 -2 204 72 -22 109 333 -92
6249 -92 -96 84 -65 -1 -93 -198 -54 -56 -18 111 -8 152 -114 283 -134 -113 -67 23 44 113 -171 52 30 -5 -24
6274 -24 -20 263 147 131 283 124 6 -127 -76 98 -158 -22 -91 223 -17 94 9 -8 59 -180 82 -95 -271
6297 -271 4 -83 199 70 -7 -78 -37 38 114 -165 274 44 139 228 27 -144 94 119 -251 38 -75 -208 -240
6320 -240 -78 -98 -60 -37 32 -371 -108 -187 -16 -192 13 9 36 -73 96 -44 84 115 35 118 182 -42 4 329
6344 329 94 -24 -55 -84 61 222 -63 191 47 62 -226 -79 -88 -63 119 -265 -162 220 226 -34 -54 -73 214
6367 214 -119 178 216 66 259 40 20 60 -162 343 141 89 -101 16 19 -79 -113 -98 13 -85 213 81 -126
6390 -126 -13 160 37 -26 48 -30 -140 -184 -180 145 -121 -37 206 11 -209 161 412 -181 -76 -133 42 -252 -106
6413 -106 92 -76 47 -89 137 31 65 24 99 -276 233 -84 44 -217 119 93 68 -30 -201 340 -139 49
6435 49 144 -27 179 -105 -216 -7 8 316 56 59 -121 -82 35 -218 -194 119 168 -119 -78 9 4 -131 160 -123
6459 -123 -26 133 -22 -165 -52 -30 20 -27 177 195 29 -72 39 51 -47 38 127 259 111 86 -13 155 -131 58
6483 58 -67 18 163 160 -155 -95 -84 92 53 -331 -228 108 -169 -246 52 48 181 78 94 128 177 -25 184 -233
6507 -233 25 81 -125 135 154 -69 7 111 -16 49 -237 64 -54 137 -161 25 31 140 -172 -26 -57 43
6529 43 -164 136 81 22 289 92 160 259 -1 5 -41 -93 89 1 130 20 160 -35 16 -313 113 92 138 -191
6553 -191 -203 -56 -463 200 88 -26 30 -201 -209 -31 53 65 70 -62 -243 2 349 276 78 -59 122 19 131
6576 131 -19 85 -14 -63 -26 153 170 -189 -171 -46 174 -224 -24 44 32 1 -80 -94 82 97 275 45 -70 -118
6600 -118 243 119 279 71 20 -38 -83 77 257 64 -112 -75 -130 327 -84 49 -107 70 190 -25 268 -46
6622 -46 3 173 -90 96 124 115 -48 76 136 -56 156 6 100 22 -130 62 194 6 -125 18 75 37 -167
6645 -167 -59 -6 29 -130 72 -22 63 -48 79 -207 -46 34 -263 -171 293 -96 227 -34 -34 -210 -36 143 -128
6668 -128 -61 117 99 7 -265 103 38 2 -91 -198 152 -119 -167 -75 -11 -42 -247 6 176 74 153 104 74 -87
6692 -87 181 179 159 -94 -46 -24 -55 123 -3 -3 -125 -47 129 -51 -37 -28 88 119 19 155 196 -85 67 -150 161
6717 161 -115 14 65 212 89 232 -15 -63 242 -399 -41 -70 190 -212 194 321 77 457 26 -124 -197
6738 -197 -138 -170 -20 97 33 19 -212 -37 -115 113 -85 -250 88 -241 5 3 -134 199 154 -23 184 -15 -43
6761 -43 -58 139 364 -31 213 29 62 3 189 -118 74 278 161 -19 39 34 -15 -132 -256 -178 -85 49 -162
6784 -162 30 71 149 75 168 29 324 170 140 -5 62 -64 0 5 379 -20 50 -34 -200 224 -159 81 84 61 -219
6809 -219 -113 -38 -181 -84 -244 6 -241 -17 179 93 -32 277 51 -80 -51 140 -177 -3 70 171 -273 55
6831 55 267 45 201 -10 242 -2 -104 -227 -85 -104 53 38 -14 -75 -78 -194 -86 234 -132 -36 75 -173 67
6854 67 39 -175 182 12 98 79 -36 -48 224 -77 7 -356 -150 -3 100 33 -5 -54 -28 -72 203 123 -32 -6
6878 -6 -13 9 -189 -84 -29 115 174 -153 124 153 48 -146 7 186 -56 157 -94 -88 -114 -42 -86 -70 -338 -409 -91
6903 -91 -187 91 -61 -236 43 96 273 -113 -24 -142 142 47 55 -51 15 20 73 200 82 -283 36 81 284 67
6927 67 -39 -220 63 48 111 122 -166 88 7 -88 -38 82 7 -117 -191 -37 -7 249 -110 -240 69 127 165 -135
6951 -135 -87 100 18 -122 190 -140 178 -78 -32 18 -37 98 -9 33 21 326 23 338 -241 58 178 23
6973 23 142 227 -255 -97 9 -21 172 -132 -96 -112 15 -203 62 -86 18 -156 2 -339 35 223 -23 70
6995 70 4 -271 -119 306 -3 26 38 -287 -188 -13 -115 -158 -5 -179 72 47 -232 157 12 208 47 -49 -171
7018 -171 -218 202 -61 98 -138 31 -184 -185 117 -54 143 151 5 -43 47 -93 296 -155 -30 -172 201 139 -7
7041 -7 13 -81 -128 -183 92 -177 40 188 3 35 83 -72 290 0 12 63 -37 90 119 -44 113 225 -17 241
7065 241 8 -30 -60 3 42 -198 -104 234 -279 95 88 80 26 255 4 -181 257 385 -91 109 279 -123 -94 -9
7089 -9 16 64 -234 199 -113 349 -31 84 12 -116 49 -229 71 13 -107 43 -29 -41 172 19 68 282 104
7112 104 -17 307 4 -81 238 -66 46 -213 -111 152 -207 99 -225 -170 45 -40 0 -138 -219 -69 -208 -97
7134 -97 -24 236 85 -115 -134 39 272 225 -81 83 184 -19 144 11 -63 -136 -98 114 -106 -104 188 -71 -168
7157 -168 -71 -19 52 31 191 -28 -78 -124 -98 99 -87 -153 205 -106 -136 -31 -101 280 -155 -8 70 -100 210 36
7181 36 1 7 -156 81 127 -92 52 -77 245 70 -109 216 -87 -184 -64 -152 126 -10 111 105 -210 73 147
7204 147 88 -121 -139 19 15 17 -169 176 172 -175 -4 -126 25 42 86 -35 5 155 169 -39 -122 -225 -20 -255
7228 -255 94 168 -203 -38 100 -122 43 59 -38 -100 -10 -187 166 48 110 -76 133 205 -87 12 91 25 -70 -16
7252 -16 -79 108 -51 -43 119 -152 -213 -8 1 -124 -44 -197 145 132 55 -37 -117 -14 -20 -144 -115 208 115 34 225 138
7278 138 -63 214 -13 -60 85 -191 -103 265 -93 -201 -97 34 -168 -132 45 113 -287 -98 124 -143 75
7299 75 -49 -53 60 -249 25 82 25 134 34 169 72 -112 -42 155 -169 -15 266 181 137 45 165 4 123
7322 123 -65 54 -8 -186 83 102 180 -162 8 -33 -93 177 152 100 -52 -82 128 76 -148 124 130 14 91 42
7346 42 -111 289 -7 43 -103 137 -83 61 -259 -118 -27 -203 32 -172 82 83 -50 93 -5 -28 -103 81 83
7369 83 202 262 -152 -77 -100 67 118 64 3 -176 94 15 -49 -78 -231 -7 -72 8 -25 108 120 47 -107 21 25 -60
7395 -60 2 -25 105 -109 122 -94 -124 105 299 -8 -41 180 112 -158 -165 16 -75 143 -84 91 111 102 71 -51
7419 -51 -80 -123 -255 1 203 -78 -1 -148 185 -110 54 -290 -110 -72 95 97 72 133 -76 -65 -147 -27 -81 131
7443 131 51 -87 50 102 -86 15 -61 -62 18 -2 -337 22 100 85 -18 -83 23 -75 119 -122 -89 76 -66 -45
7467 -45 -188 -275 -274 119 42 28 23 -74 -137 207 6 126 231 -117 88 -70 -131 -134 149 -78 28 -53 34 -140 106
7492 106 -64 -130 -126 139 -177 -37 -11 -208 -1 0 -6 -36 23 -118 41 -207 263 -28 -71 57 78 -179 -141 -16
7516 -16 25 113 -82 -180 -165 -102 2 -42 53 -107 -27 -208 3 -39 -129 -23 145 131 -27 -15 190 59 121 -20 -19
7541 -19 -98 -117 -16 -56 -91 -356 -115 -107 -331 -20 -68 -113 -96 29 29 250 -34 -92 57 -62 -60 -208 127 -68 -7
7566 -7 -18 -28 -198 158 -29 -39 -196 138 -63 13 -90 -141 -74 190 -34 60 148 267 111 61 -115 -242 79 8
7590 8 -139 -124 -119 -187 72 24 -264 -55 185 -59 -67 162 95 111 193 49 -15 -198 116 192 -139 -130 217 276 179 248
7616 248 -72 60 -140 0 -294 224 -18 -143 84 -82 -180 264 156 64 -157 -142 -31 53 10 -86 128 -245
7638 -245 211 183 49 151 247 -14 -81 -261 -11 -23 -136 214 -194 -159 -132 161 -156 -229 203 27 -95 -70 264
7661 264 101 186 24 70 70 -18 143 -165 -43 232 107 18 -17 2 -95 -119 -9 -156 86 -114 -49 -92 -61 -99 -201
7686 -201 93 147 190 -27 -252 204 54 161 -54 -48 230 -66 49 -79 -30 46 10 -7 94 101 156 -72 93 69
7710 69 26 -204 -182 -127 174 -97 -12 11 -119 95 53 -126 -103 62 76 35 172 90 -376 139 168 94 -81 -427
7734 -427 -40 76 -88 1 86 8 160 128 -26 70 -48 80 38 -216 113 54 28 65 36 -152 -92 118 146 156
7758 156 344 157 -143 16 -63 -41 -261 45 234 -97 -192 207 -316 -139 50 186 180 118 70 -276 -118 -60 -153
7781 -153 -149 125 -78 116 34 120 -132 143 281 -179 192 -57 -165 117 76 149 127 286 128 104 50 153 -187
7804 -187 17 12 -57 -44 -245 78 45 66 201 24 36 177 180 129 -39 185 -81 27 -106 79 -27 22 167 10
7828 10 -6 139 81 -94 -35 99 -73 370 -7 51 170 109 90 57 -211 -105 -87 46 -146 -120 70 171 37
7851 37 -131 53 -69 -11 197 -229 -59 -32 -32 77 261 145 -75 101 37 31 -15 38 -121 -170 71 67 0 134 83
7876 83 172 -226 -70 187 339 19 -41 45 -68 22 56 27 231 76 -184 6 64 190 -8 79 -270 88 248
7899 248 480 -158 42 -24 105 129 -262 -251 25 239 29 -99 116 -11 201 -73 198 -14 -288 10 10 248
7921 248 -129 -116 162 -80 -58 79 54 27 98 14 92 25 -55 -8 -494 216 -92 18 -13 61 7 -154 108 -331
7945 -331 23 -88 166 -155 90 315 -199 -50 -280 35 -61 76 40 -4 -71 -115 142 96 60 -114 42 -124
7967 -124 -180 -192 -24 89 6 80 -106 -118 38 109 94 -76 -234 192 -255 -51 23 39 96 -113 48 -7 210 49
7991 49 -38 18 -58 72 -185 5 -78 -2 -90 -295 106 -43 -113 228 -309 -11 -56 30 -2 -296 -147 -234 -139 65
8015 65 128 92 84 -54 -14 120 -116 -87 126 -42 35 212 -3 -47 -57 -46 -113 -152 39 -137 -70 397 69 -35 28
8040 28 26 204 11 55 -60 -10 -78 135 109 246 -141 -397 203 -149 26 215 74 20 254 22 -84 7 26
8063 26 43 -85 -136 -100 -94 82 -86 -118 -123 24 107 194 -18 15 68 124 185 -60 83 -8 -26 -103 23 30 30 -14 -1 -174
8091 -174 -99 239 -3 -103 30 -42 237 19 -178 -78 102 19 14 -17 -52 47 99 88 -226 -140 -85 3 238 127
8115 127 -7 47 2 -109 -21 -31 -52 10 13 24 -5 -1 161 149 74 13 169 -123 19 56 70 101 116 -63 -60 -104 123
8142 123 45 -127 -129 107 -64 -105 -29 -14 79 -51 237 -111 -107 -86 175 -26 -102 38 111 13 32 188 -175 -125 -36
8167 -36 -74 -209 91 -266 -26 -70 20 111 -25 -107 -11 146 -89 25 -76 -94 -206 -34 235 -67 145 283 6
8190FL
8191I
##END NTUPLES=NMR FID
##END=
