##TITLE=1H_Pr Tol-mat
 CDCl3, 8 sc, 
 26.04.2021
##JCAMPDX= 6.0         $$ Bruker NMR JCAMP-DX V2.0
##DATA TYPE= NMR FID
##DATA CLASS= NTUPLES
##ORIGIN= UXNMR, Bruker Analytische Messtechnik GmbH
##OWNER= root
$$ XWIN-NMR		Version 3.5
$$ Mon Apr 26 15:52:15 2021 Russian Standard Time (UT+4h)  she@DPX200
##.OBSERVE FREQUENCY= 200.131506
##.OBSERVE NUCLEUS= ^1H
##.DELAY= (6, 6)
##.ACQUISITION MODE= SIMULTANEOUS
##.ACQUISITION SCHEME= undefined
##.AVERAGES= 8
##.DIGITISER RES= 18
##SPECTROMETER/DATA SYSTEM= spect
##.PULSE SEQUENCE= zg30
##.SOLVENT NAME= CDCl3
##.SHIFT REFERENCE= (INTERNAL, CDCl3, 0, 15.7039)
##AUDIT TRAIL= $$ (NUMBER, WHEN, WHO, WHERE, WHAT)
$$ ##TITLE= Audit trail, XWIN-NMR		Version 3.5
$$ ##JCAMPDX= 5.01
$$ ##ORIGIN= Bruker BioSpin GmbH
$$ ##OWNER= she
$$ F:/spectra/data/she/nmr/H-F/1/audita.txt
$$ ##AUDIT TRAIL=  $$ (NUMBER, WHEN, WHO, WHERE, WHAT)
(   1,<2021-04-26 15:50:35.70 +0400>,<she>,<DPX200>,
      <created by zg, POWCHK disabled, PULCHK disabled
       configuration hash MD5:
       00 E9 B6 7A A2 85 ED C7 34 08 36 98 17 FE 4E 26
       data hash MD5: 16K
       EF AF 18 3C 60 AF 39 62 D4 6C 60 84 D4 98 2E 5C>)
$$ ##END=
$$ 
$$ hash MD5
$$ 4F B9 E9 84 FD 52 FA BE 6F 67 0B C5 B0 0A 05 90
##$RELAX= 
##$RELAX= 
##$RELAX= 
##$RELAX= 
##$RELAX= 
##$RELAX= 
$$ Bruker specific parameters
$$ --------------------------
##$DU= <F:/spectra>
##$EXPNO= 1
##$NAME= <H-F>
##$PROCNO= 1
##$TYPE= <nmr>
##$USER= <she>
##$AMP= (0..31)
100 100 100 100 100 100 100 100 100 100 100 100 100 100 100 100 100 100 
100 100 100 100 100 100 100 100 100 100 100 100 100 100 
##$AQSEQ= 0
##$AQ_mod= 1
##$AUNM= <au_zg>
##$AUTOPOS= <>
##$BF1= 200.13
##$BF2= 200.13
##$BF3= 200.13
##$BF4= 200.13
##$BF5= 200.13
##$BF6= 200.13
##$BF7= 200.13
##$BF8= 200.13
##$BYTORDA= 1
##$CFDGTYP= 0
##$CFRGTYP= 5
##$CHEMSTR= <none>
##$CNST= (0..31)
1 1 145 1 1 1 1 1 1 1 1 1 1 1 1 1 1 1 1 1 1 1 1 1 1 1 1 1 1 1 1 1 
##$CPDPRG= <>
##$CPDPRG1= <>
##$CPDPRG2= <>
##$CPDPRG3= <>
##$CPDPRG4= <mlev>
##$CPDPRG5= <mlev>
##$CPDPRG6= <mlev>
##$CPDPRG7= <mlev>
##$CPDPRG8= <mlev>
##$CPDPRGB= <>
##$CPDPRGT= <>
##$D= (0..31)
0 1.2 0 0 0 0 0 0 0 0.06 0 0.03 0 0 0 0 0.0002 0 0 0 0 0 0 0 0 0 0 0 0 
0 0 0 
##$DATE= 1619437835
##$DBL= (0..7)
120 120 120 120 120 120 120 120 
##$DBP= (0..7)
150 150 150 150 150 150 150 150 
##$DBP07= 0
##$DBPNAM0= <>
##$DBPNAM1= <>
##$DBPNAM2= <>
##$DBPNAM3= <>
##$DBPNAM4= <>
##$DBPNAM5= <>
##$DBPNAM6= <>
##$DBPNAM7= <>
##$DBPOAL= (0..7)
0.5 0.5 0.5 0.5 0.5 0.5 0.5 0.5 
##$DBPOFFS= (0..7)
0 0 0 0 0 0 0 0 
##$DE= 6
##$DECBNUC= <off>
##$DECIM= 32
##$DECNUC= <off>
##$DECSTAT= 4
##$DIGMOD= 1
##$DIGTYP= 9
##$DL= (0..7)
0 120 120 120 120 120 120 120 
##$DP= (0..7)
150 150 150 150 150 150 150 150 
##$DP07= 0
##$DPNAME0= <>
##$DPNAME1= <>
##$DPNAME2= <>
##$DPNAME3= <>
##$DPNAME4= <>
##$DPNAME5= <>
##$DPNAME6= <>
##$DPNAME7= <>
##$DPOAL= (0..7)
0.5 0.5 0.5 0.5 0.5 0.5 0.5 0.5 
##$DPOFFS= (0..7)
0 0 0 0 0 0 0 0 
##$DQDMODE= 0
##$DR= 18
##$DS= 0
##$DSLIST= <SSSSSSSSSSSSSSS>
$$ [...]
##$SUBNAM2= <"">
##$SUBNAM3= <"">
##$SUBNAM4= <"">
##$SUBNAM5= <"">
##$SUBNAM6= <"">
##$SUBNAM7= <"">
##$SUBNAM8= <"">
##$SUBNAM9= <"">
##$SW= 16.9725357007746
##$SWIBOX= (0..15)
0 0 2 0 0 0 0 0 0 0 0 0 0 0 0 0 
##$SW_h= 3396.73913043478
##$TD= 16384
##$TD0= 1
##$TE= 0
##$TE2= 300
##$TE3= 300
##$TEG= 300
##$TL= (0..7)
0 120 120 120 120 120 120 120 
##$TP= (0..7)
150 150 150 150 150 150 150 150 
##$TP07= 0
##$TPNAME0= <>
##$TPNAME1= <>
##$TPNAME2= <>
##$TPNAME3= <>
##$TPNAME4= <>
##$TPNAME5= <>
##$TPNAME6= <>
##$TPNAME7= <>
##$TPOAL= (0..7)
0.5 0.5 0.5 0.5 0.5 0.5 0.5 0.5 
##$TPOFFS= (0..7)
0 0 0 0 0 0 0 0 
##$TUNHIN= 0
##$TUNHOUT= 0
##$TUNXOUT= 0
##$USERA1= <user>
##$USERA2= <user>
##$USERA3= <user>
##$USERA4= <user>
##$USERA5= <user>
##$V9= 5
##$VALIST= <valist>
##$VCLIST= <CCCCCCCCCCCCCCC>
##$VD= 0
##$VDLIST= <DDDDDDDDDDDDDDD>
##$VPLIST= <PPPPPPPPPPPPPPP>
##$VTLIST= <TTTTTTTTTTTTTTT>
##$WBST= 1024
##$WBSW= 4
##$XGAIN= (0..3)
0 0 0 0 
##$XL= 0
##$YL= 0
##$YMAX_a= 388952
##$YMIN_a= -362373
##$ZGOPTNS= <>
##$ZL1= 120
##$ZL2= 120
##$ZL3= 120
##$ZL4= 120
##$ABSF1= 10
##$ABSF2= 0
##$ABSG= 5
##$ABSL= 3
##$ALPHA= 0
##$AQORDER= 0
##$ASSFAC= 0
##$ASSFACI= 0
##$ASSFACX= 0
##$ASSWID= 0
##$AUNMP= <proc_1d>
##$AZFE= 0.1
##$AZFW= 0.1
##$BCFW= 1
##$BC_mod= 2
##$BYTORDP= 1
##$COROFFS= 0
##$CY= 11.3945322036743
##$DATMOD= 1
##$DC= 2
##$DFILT= <>
##$DTYPP= 0
##$F1P= 15.9154993809931
##$F2P= -4.1035820241983
##$FCOR= 0.5
##$FTSIZE= 0
##$FT_mod= 4
##$GAMMA= 1
##$GB= 0.15
##$INTBC= 1
##$INTSCL= 1
##$ISEN= 128
##$LB= 0.24
##$LEV0= 0
##$LPBIN= 0
##$MAXI= 10000
##$MC2= 0
##$MEAN= 0
##$ME_mod= 0
##$MI= 1.114404
##$NCOEF= 0
##$NC_proc= 0
##$NLEV= 6
##$NOISF1= 3.799351
##$NOISF2= 2.8
##$NSP= 1
##$NTH_PI= 0
##$NZP= 0
##$OFFSET= 15.70392
##$PC= 1
##$PHC0= -11123.62
##$PHC1= 16.00096
##$PH_mod= 1
##$PKNL= yes
##$PPARMOD= 0
##$PSCAL= 0
##$PSIGN= 0
##$REVERSE= no
##$SF= 200.130013532006
##$SI= 16384
##$SIGF1= 3
##$SIGF2= 2
##$SINO= 400
##$SIOLD= 16384
##$SREGLST= <1H.CDCl3>
##$SSB= 0
##$STSI= 0
##$STSR= 0
##$SW_p= 3612.71676300578
##$SYMM= 0
##$S_DEV= 0
##$TDeff= 0
##$TDoff= 0
##$TI= <>
##$TILT= no
##$TM1= 0
##$TM2= 0
##$TOPLEV= 0
##$USERP1= <user>
##$USERP2= <user>
##$USERP3= <user>
##$USERP4= <user>
##$USERP5= <user>
##$WDW= 1
##$XDIM= 8192
##$YMAX_p= 0
##$YMIN_p= 0
$$ End of Bruker specific parameters
$$ ---------------------------------
##NTUPLES= NMR FID
##VAR_NAME=  TIME,          FID/REAL,        FID/IMAG
##SYMBOL=    X,             R,               I
##VAR_TYPE=  INDEPENDENT,   DEPENDENT,       DEPENDENT
##VAR_FORM=  AFFN,          ASDF,            ASDF
##VAR_DIM=   8192,          8192,            8192
##UNITS=     SECONDS,       ARBITRARY UNITS, ARBITRARY UNITS
##FACTOR=    0.0002944,     1,               1
##FIRST=     0,             0,               0
##LAST=      2.4114304,     0,               0
##MIN=       0,             -362373,         0
##MAX=       2.4114304,     388952,          0
$$ Real data points
##PAGE= N=1
##DATA TABLE= (X++(R..R)), XYDATA
$$ plain form
0 0 0 0 0 0 0 0 0 0 0 8 -8 8 -13 16 -16 24 -32 37 -45 56 -64 76 -88 104 -124 144 -168 192 -221 255 -292
31 -292 332 -374 422 -478 536 -603 673 -752 839 -930 1033 -1145 1268 -1400 1546 -1705 1879
48 1879 -2069 2279 -2507 2764 -3048 3364 -3718 4120 -4578 5107 -5723 6458 -7344 8437
62 8437 -9829 11663 -14193 17927 -23967 35330 -63945 281862 388952 -362373 -145174 64407
74 64407 133532 100019 4184 -104541 -9502 22444 100935 79235 -84250 -116544 14389 232880
86 232880 48027 -146042 -53169 4160 119937 75904 -70466 -117534 50309 85981 85752
97 85752 -55402 -198988 93422 145274 -4631 -41700 -107518 -48625 187352 84330 -205510
108 -205510 -92631 84044 152525 -1931 -121266 -105871 31704 224581 -22144 -192259
$$ packed form
0@%%%%%%%%%Qj6J6k1K9l2M0n6O9q2J01j20J40j64J92k28K68l12L60m13M76n47
31b92O24p06P96r00J014j139J276j425J591j769J963k178K413k668K946l251L584
48A879l948M348m786N271n812O412p082P838q698R685j0830J2181j3802J5781
62H437j8266K1492k5856L2120m1894N9297r9275L45807J07090p51325K17199K09581
74F4407O9125l3513r5835j08725R5039L1946P8491k1700j63485l2294J30933K18491
86B32880j84853j94069R2873N7329J15777m4033j46370m7068J67843L5672k29
97H5752j41154j43586K92410N1852j49905l7069o5818N8893K35977j03022k89840
108b05510J12879J76675O8481j54456j19335J5395J37575J92877k46725j70115
$$ plain form
118 -192259 -50533 63524 121129 54506 -177946 -133326 145184 103633 19123 -109622 -145152
129 -145152 73024 166109 16522 -158936 -94843 45100 150086 30037 -140020 -85899
139 -85899 53564 126405 6128 -76581 -102110 11758 149769 19040 -113806 -67555 18798
150 18798 77404 93062 -99568 -121081 63927 87986 44615 -98526 -103717 59616 105967
161 105967 -5625 -86178 -42113 10731 73295 55266 -54963 -124353 34547 141936 -3297
172 -3297 -89362 -92624 41380 136031 856 -119518 -50569 45898 71118 62320 -88906 -110987
184 -110987 37356 113000 46121 -110102 -97872 38340 117780 35422 -89268 -92925 25661
195 25661 115419 43185 -69532 -121092 30217 116489 14402 -50990 -97716 -1683 120872
$$ packed form
118a92259J41726J14057N7605o6623k32452M4620K78510m1551q4510j28745l5530
129a45152K18176R3085j49587j75458O4093J39943J04986j20049j70057N4121
139h5899J39463P2841j20277q2709k5529J13868J38011j30729j32846M6251Q6353
150A8798N8606J5658j92630k1513J85008K4059m3371j43141n191J63333M6351
161A05967j11592q0553M4065N2844O2564j8029j10229o9390J58900J07389j45233
172c297q6065l262J34004R4651j35175j20374O8949R6467K5220q798j51226k2081
184a10987J48343P5644o6879j56223J2230J36212P9440q2358j24690l657J18586
195B5661Q9758p2234j12717n1560J51309Q6272j02087o5392m6726R6033J22555
$$ plain form
206 120872 55216 -86993 -75540 15753 81407 70483 -70327 -84305 10133 93258 48808
217 48808 -66846 -60326 5942 89581 52921 -57658 -84383 30162 90270 25198 -39306 -84415
229 -84415 28773 87357 28524 -41557 -77768 16536 106012 48685 -88474 -63817 19994 88526
241 88526 52567 -77462 -77116 4095 108705 43510 -73548 -74205 6279 92850 54553 -60596
253 -60596 -113776 17484 83988 50052 -47320 -115534 7352 84418 55364 -53236 -89497
264 -89497 -12507 81217 55123 -58947 -73968 -32699 76819 58214 -42547 -82532 -27093
275 -27093 83984 41307 -40989 -70754 -9714 48643 52222 -35052 -90949 10016 51593 50805
287 50805 -36383 -76838 1442 64617 49035 -46486 -66580 -11368 78817 37159 -45191 -66355
$$ packed form
206A20872o5656j42209J1453R1293O5654j0924j40810j3978R4438Q3125m4450
217D8808j15654O520O6268Q3639l6660j10579k6725J14545O0108o5072o4504m5109
229h4415J13188N8584n8833p0081l6211R4304Q9476n7327j37159K4657Q3811O8532
241H8526l5959j30029L46Q1211J04610o5195j17058o57Q0484Q6571l8297j15149
253f0596n3180J31260O6504l3936r7372o8214J22886P7066k9054j08600l6261
264h9497P6990R3724k6094j14070j5021M1269J09518j8605j00761l9985N5439
275b7093J11077m2677q2296k9765O1040N8357L579q7274n5897J00965M1577p88
287E0805q7188m0455P8280O3175j5582r5521k0094N5212R0185m1658q2350k1164
$$ plain form
299 -66355 -15196 86652 40720 -32816 -76002 -9074 80686 49430 -38816 -74313 -2046 57032
311 57032 71647 -43282 -81571 4728 60868 64998 -33114 -69294 -19219 66415 59437 -26417
323 -26417 -74510 -23392 74650 44950 -13690 -70542 -21362 67082 50400 -12495 -70994 -19455
335 -19455 51964 54987 -26763 -56228 -14870 41256 63583 -34529 -57520 -8935 51278 48115
347 48115 -28426 -58827 -18048 55874 42389 -20678 -68773 -7599 59348 35783 -13244 -70622
359 -70622 -12285 58892 47268 -26793 -69769 -15775 56284 54144 -32458 -55280 -22236 53936
371 53936 64716 -29641 -63680 -22068 56792 56481 -18699 -70533 -25911 54349 59105 -7823 -74403
384 -74403 -15965 48633 52352 -976 -68317 -27474 45040 56357 -11209 -59133 -29761 43360
$$ packed form
299f6355N1159J01848m5932p3536m3186O6928Q9760l1256q8246l5497P2267N9078
311E7032J4615j14929l8289Q6299N6140M130r8112l6180N0075Q5634o978q5854
323b6417m8093N1118R8042k9700n8640n6852M9180Q8444j6682o2895n8499N1539
335a9455P1419L023q1750k9465M1358N6126K2327r8112k2991M8585O0213l163
347D8115p6541l0401M0779P3922j3485o3067m8095O1174O6947k3565m9027n7378
359g0622N8337P1177j1624p4061m2976N3994P2059k140q6602k2822L3044P6172
371E3936J0780r4357l4039M1612P8860l11p5180n1834M4622Q0260M756o6928o6580
384g4403N8438O4598L719n3328o7341M0843P2514J1317o7566m7924K9372P3121
$$ plain form
396 43360 53523 -11633 -47232 -35939 41796 52620 -17356 -53147 -28131 39264 45573 -9898
408 -9898 -57381 -24285 35594 48095 -8967 -62943 -15602 29329 40928 -7427 -63370 -25936
420 -25936 39744 48038 -17451 -57309 -26943 45762 47123 -14099 -50977 -36452 45616 49338 -14763
433 -14763 -55581 -29587 41025 53583 -3943 -61473 -28188 35883 61942 -2634 -61217 -23029
445 -23029 25317 57196 4909 -52267 -30516 34900 55633 638 -42839 -32277 34944 45033
457 45033 9201 -41163 -40230 36364 46885 6147 -41541 -24774 28174 49489 4062 -45640
469 -45640 -19403 22493 51895 -5755 -41516 -17253 18798 49364 1726 -42747 -27497 38082
481 38082 42681 -3945 -44501 -28552 36229 36312 6001 -51314 -31025 35861 41940 455 -47554
$$ packed form
396D3360J0163o5156l5599J1293P7735J0824o9976l5791K5016O7395O309n5471
408i898m7483L3096N9879J2501n7062n3976M7341M4931J1599m8355n5943L7434
420b5936O5680Q294o5489l9858L0366P2705J361o1222l6878J4525Q2068L722o4101
433a4763m0818K5994P0612J2558n7526n7530L3285O4071K6059o4576n8583L8188
445b3029M8346L1879n2287n7176K1751O5416K0733n4995m3477J0562O7221J0089
457D5033l5832n0364R33P6594J0521m0738m7688J6767N2948K1315m5427m9702
469d5640K6237M1896K9402n7650l5761K4263L6051L0566m7638m4473J5250O5579
481C8082M599m6626m0556J5949O4781Q3l0311n7315K0289O6886O079m1485m8009
$$ plain form
494 -47554 -25197 22344 52439 -2900 -49027 -31318 21712 54367 -5584 -40299 -35187 19894
506 19894 50949 6496 -46979 -36804 30051 36514 7478 -47397 -32483 21286 38282 15473
518 15473 -48294 -31417 19760 44027 5089 -37099 -33020 14307 49460 -2989 -35749 -33506
530 -33506 23083 43319 -495 -30360 -34071 20337 41214 9233 -44655 -28693 22976 37664
542 37664 10560 -44699 -24540 17674 48366 11755 -45064 -29563 20271 47546 4612 -34090
554 -34090 -40214 18522 48794 6380 -34230 -40158 21552 42957 13388 -33682 -39816 11013 45538
567 45538 15933 -43753 -29505 8867 41588 14119 -35629 -29637 4014 44269 13523 -34280
579 -34280 -35353 9707 35598 13402 -24617 -39329 13944 36503 14390 -28179 -31922 14859
$$ packed form
494d7554K2357M7541L0095n5339m6127J7709N3030L2655n9951l4715N112N5081
506A9894L1055m4453n3475J0175O6855O463k9036n4875J4914N3769J6996k2809
518A5473o3767J6877N1177K4267l8938m2188M079M7327L5153n2449l2760K243
530c3506N6589K0236m3814k9865l711N4408K0877l1981n3888J5962N1669J4688
542C7664k7104n5259K0159M2214L0692l6611n6819J5501M9834K7275m2934l8702
554c4090o124N8736L0272m2414m0610n928O1710K1405k9569m7070o134N0829L4525
567D5538k9605n9686J4248L8372L2721k7469m9748N992L3651M0255l0746m7803
579c4280j073M5060K5891k2196l8019j4712N3273K2559k2113m2569l743M6781
$$ plain form
591 14859 32663 15048 -28091 -30780 7333 43334 12625 -32487 -21183 8338 41407 14236
603 14236 -27354 -27811 10327 43546 13779 -31809 -31477 16148 36158 19960 -26869 -37459 16682
616 16682 38253 17671 -28840 -31979 9729 35293 18801 -26465 -35746 4060 43813 13706
628 13706 -27359 -30136 507 37662 15820 -25347 -37110 1714 35651 15372 -25168 -33466
640 -33466 3000 28079 23398 -23930 -37402 5136 27892 15414 -25160 -31017 461 28956
652 28956 15771 -22934 -33194 1728 36690 8521 -21095 -28589 -1262 33086 12556 -22013
664 -22013 -33283 5276 32928 14374 -23369 -29517 4154 29361 23099 -26794 -31909 4948 30102
677 30102 17587 -23008 -27332 -24 35590 19658 -20088 -33130 2822 38429 13968 -14334
$$ packed form
591A4859J7804j7615m3139k689L8113L6001l0709m5112J1304K9521L3069k7171
603A4236m1590m57L8138L3219k9767m5588L32M7625K0010j6198m6829j0590N4141
616A6682K1571k0582m6511l139M1708K5564j6492m5266r281L9806L9753l0107
628A3706m1065k777L0643L7155k1842m1167j1763L8824L3937k0279m0540q298
640c3466L6466K5079m681m7328j3472M2538K2756j2478m0574n857L1478K8495
652B8956j3185l8705j0260L4922L4962k8169k9616p494K7327L4348k0530l4569
664b2013j1270L8559K7652j8554l7743o148L3671K5207o262m9893n115L6857K5154
677C0102j2515m0595m324K7308L5614j5932l9746j3042L5952L5607k4461k8302
$$ plain form
689 -14334 -33358 -1123 34083 21291 -16840 -33400 3399 30483 23090 -18727 -26947 -3458
701 -3458 28391 27025 -22152 -26181 -2132 28531 19410 -14371 -25892 -3606 30614 17224 -13704
714 -13704 -32641 2707 26758 13668 -10765 -31622 781 26064 20895 -18678 -27339 1479
726 1479 25862 19327 -20787 -24756 -7199 30842 20751 -22146 -27139 -2752 30403 16862 -12734
739 -12734 -32709 -1681 29283 20359 -14956 -36812 2544 24052 23373 -11817 -33163 -4547 26827
752 26827 25483 -16213 -25919 -7933 26630 20506 -11517 -25244 -11313 30791 20075 -9912 -26805
765 -26805 -4977 23091 20061 -6329 -31045 -4153 19851 22667 -12657 -28410 -1652 18310
777 18310 23564 -10453 -26102 -8672 25020 19034 -12551 -24356 -9755 24803 15179 -8098 -28394
$$ packed form
689a4334j9024L2235L5206j2792l8131j6560L6799K7084p393m1817q220K3489
701c458L1849j366m9177m029K4049L0663r121l3781j1521K2286L4220j3390l0928
714a3704j8937L5348K4051j3090k4433k0857L2403K5283n169l9573q661K8818
726A479K4383o535m0114l969J7557L8041j0091m2897m993K4387L3155j3541k9596
739a2734j9975L1028L0964q924l5315k1856L9356K1508o79l5190k1346K8616L1374
752B6827j344m1696r706J7986L4563o124l2023j3727J3931M2104j0716k9987j6893
765b6805K1828K8068l030k6390k4716K6892K4004K816l5324j5753K6758J9962
777A8310N254l4017j5649J7430L3692n986l1585j1805J4601L4558r624k3277k0296
$$ plain form
790 -28394 -8956 26139 17338 -10609 -28815 -5448 17748 22114 -11105 -29701 -6479 19345
802 19345 23635 -13745 -24789 -8033 19615 22856 -8781 -27975 -12405 23407 18100 -6066 -26157
815 -26157 -10361 21119 18880 -2236 -27504 -7916 21266 21079 -7060 -24212 -8094 16020 25529
828 25529 -6927 -22379 -8679 19226 23597 -7498 -19713 -8379 18950 21759 -3843 -25121
840 -25121 -8092 21638 18979 -1392 -23159 -6728 18347 20522 -1845 -24733 -6480 18671
852 18671 20197 -6412 -21053 -9631 17461 24349 -6272 -21743 -10531 18851 21078 -6480 -21882
865 -21882 -12089 16647 20748 -3198 -26897 -10662 17170 19506 -661 -25615 -11144 13834 20725
878 20725 -2269 -25488 -11076 14413 20020 -4237 -20354 -14479 14145 22023 -3963 -20405 -14751
$$ packed form
790b8394J9438L5095q801k7947j8206K3367K3196M366l3219j8596K3222K5824
802A9345M290l7380j1044J6756K7648L241l1637j9194J5570L5812n307k4166k0091
815b6157J5796L1480k239k1116k5268J9588K9182j87k8139j7152J6118K4114R509
828B5529l2456j5452J3700K7905M371l1095j2215J1334K7329K809k5602k1278
840b5121J7029K9730k659k0371k1767J6431K5075K175k2367k2888J8253K5151
852A8671J526k6609j4641J1422K7092O888l0621j5471J1212K9382K227k7558j5402
865b1882R793K8736M101k3946k3699J6235K7832K336k0167k4954J4471K4978O891
878B0725k2994k3219J4412K5489N607k4257j6117N875K8624P878k5986j6442N654
$$ plain form
891 -14751 14601 17676 -2756 -19584 -13493 13466 19107 -181 -22843 -8643 12798 19088 755
904 755 -21884 -9528 10771 21048 -2103 -20865 -9654 13527 19660 -2684 -16786 -14172 16396
917 16396 20742 -1820 -19672 -13599 16040 17818 1405 -20334 -11634 12682 20953 915 -22829
930 -22829 -8654 8752 21437 15 -20459 -12140 8780 22270 -1547 -17878 -12864 12295
942 12295 17133 1013 -17545 -16576 13079 15806 2068 -20190 -12758 10691 16109 3031 -19060
955 -19060 -10661 8265 20978 -1394 -18866 -9794 7542 21097 -1406 -15916 -13516 11517 19641
968 19641 191 -16401 -12622 13717 15424 4468 -19592 -12661 13802 18527 4415 -20658 -10031
981 -10031 9461 21164 3225 -16965 -12959 8349 23333 -1369 -14492 -14225 9252 21175 3112
$$ packed form
891a4751K9352L075k0432j6828O091K6959N641j9288k2662J4200K1441O290j8333
904G55k2639J2356K0299J0277k3151j8762J1211K3181O133k2344j4102K614L0568
917A6396M346k2562j7852O073K9639J778j6413k1739Q700K4316Q271k0038k3744
930b2829J4175J7406J2685k1422k0474Q319K0920J3490k3817j6331N014K5159
942A2295M838j6120j8558R69K9655K727j3738k2258P432K3449N418j3078k2091
955a9060Q399J8926J2713k2372j7472R072J7336J3555k2503j4510K400K5033Q124
968A9641j9450j6592L779K6339J707j0956k4060O931K6463M725j4112k5073J0627
981a0031J9492J1703j7939k0190M006K1308J4984k4702j3123K67K3477J1923j8063
$$ plain form
994 3112 -14520 -16064 11036 18754 5882 -18098 -13265 7857 16263 8582 -19611 -13098 6689
1007 6689 19430 4583 -16094 -13042 4146 19372 2769 -12926 -16680 6575 17925 772
1019 772 -12013 -15349 6775 15954 5162 -15603 -14701 6309 14754 4516 -17711 -11262 2695
1032 2695 15801 4684 -17134 -12799 5049 17604 1698 -13430 -14624 4619 16664 3484
1044 3484 -13206 -16840 8123 15866 3447 -13236 -13853 5878 16671 6640 -16702 -13410 4782
1057 4782 17932 5689 -14053 -11546 2929 19126 6980 -13018 -13202 5494 17642 5076 -10746
1070 -10746 -14781 4866 16507 7989 -11441 -13859 6592 14376 7174 -10491 -12387 3936 15692
1083 15692 6835 -13434 -12005 3456 16466 5098 -11053 -12057 1853 17546 5274 -12577
$$ packed form
994C112j7632j544K7100P718j2872k3980M833K1122Q406p681k8193O513J9787
1007F689J2741j4847k0677L052J7188J5226j6603j5695l754K3255J1350j7153
1019G72j2785l336K2124R179j0792k0765R02K1010Q445j0238k2227O449J3957
1032B695J3106j1117k1818M335J7848J2555j5906j5128j194J9243J2045j3180
1044C484j6690l634K4963P743j2419j6683o17J9731J0793j0031k3342L292J8192
1057D782J3150j2243j9742K507J4475J6197j2146j9998j84J8696J2148j2566j5822
1070a0746m035J9647J1641q518j9430k418K0451P784p202j7665j896J6323J1756
1083A5692q857k0269J429J5461J3010j1368j6151j004J3910J5693j2272j7851
$$ plain form
1095 -12577 -13452 4656 14998 4886 -11757 -15171 4262 15282 7451 -13343 -14789 4843 13092
1108 13092 6768 -12336 -14162 2268 16190 6846 -12835 -13388 2252 16901 6090 -9157 -14545
1121 -14545 11 17218 6038 -10303 -13788 2822 13536 7922 -9074 -14344 3018 14296
1133 14296 10019 -11313 -12120 2669 12712 8829 -9224 -12424 747 16638 6400 -9701 -12208
1146 -12208 1322 15885 5595 -7314 -15552 495 15448 6754 -9211 -13647 2398 11816 9572
1159 9572 -9991 -13538 539 13247 9271 -12453 -11623 -1493 12508 7938 -8501 -14211 -1088
1172 -1088 15440 5296 -7571 -14978 -321 12545 7304 -6564 -16956 183 12221 9059 -8881
1185 -8881 -12130 -1196 10475 10640 -9788 -11941 -2483 13588 8137 -8421 -11140 -2352 13040 7912
$$ packed form
1095a2577q75J8108J0342j0112j6643l414J9433J1020p831k0794j446J9632Q249
1108A3092o324j9104j826J6430J3922r344j9681n53J5640J4649j0811j5247n388
1121a4545J4556J7207j1180j6341l485J6610J0714n614j6996n270J7362J1278
1133A4296m277k1332q07J4789J0043l883j8053l200J3171J5891j0238j6101k507
1146a2208J3530J4563j0290j2909q238J6047J4953q694j5965m436J6045R418k244
1159I572j9563l547J4077J2708l976k1724Q30J0130J4001m570j6439n710J3123
1172a088J6528j0144j2867p407J4657J2866n241j3868j0392J7139J2038l162j7940
1185h881l249J0934J1671J65k0428k153R458J6071n451j6558k719Q788J5392n128
$$ plain form
1199 7912 -4618 -14170 471 13066 6573 -4798 -13536 1329 10498 10427 -6308 -13100 642 11996
1213 11996 10042 -6988 -9164 -2639 12596 9418 -6652 -10753 -1720 14413 6837 -5019 -12101
1226 -12101 -1023 12313 9505 -4381 -14977 1291 10478 9334 -5802 -12458 -981 10353 11477
1239 11477 -7612 -12247 -2535 12401 7949 -5919 -11273 -5276 12268 7837 -5031 -13421 -2335
1252 -2335 11437 7241 -3952 -13564 -2629 8503 10400 -5581 -13713 -1961 7769 9349 -5723
1265 -5723 -10754 -4239 9766 9447 -6056 -11715 -3544 10746 6784 -3008 -11883 -3888 10860 8156
1279 8156 -4209 -12401 -1112 9707 8632 -4218 -12237 -2821 9824 11635 -5845 -11162 -2455
1292 -2455 9327 10540 -3498 -10611 -4352 10760 9561 -4097 -11904 -3353 9852 8517 -1289 -12472
$$ packed form
1199G912j2530r552J4641J2595o493j1371q738J4865R169p1j6735o792J3742J1354
1213A1996j954j7030k176O525J5235l178j6070m101R033J6133p576j1856p082
1226a2101J1078J3336k808j3886j0596J6268R187j144j5136o656J1477J1334J124
1239A1477j9089m635R712J4936m452j3868n354N997J7544m431j2868q390J1086
1252b335J3772m196j1193r612J0935J1132J897j5981q132J1752R730J580j5072
1265e723n031O515J4005l19j5503n659Q171J4290l962r792q875P995J4748k704
1279H156j2365q192J1289J0819j075j2850q019R416J2645J811j7480n317Q707
1292b455J1782J213j4038p113O259J5112j199j3658p807Q551J3205j335r806j1183
$$ plain form
1306 -12472 -4228 10062 9573 -2729 -11980 -3090 7986 9477 -2912 -11295 -4993 8704 10839 -4492
1320 -4492 -10351 -4420 7718 9592 -2651 -11164 -5429 9263 8666 -2984 -11474 -3841 7843 8533
1334 8533 -648 -12504 -4569 8010 9221 -2502 -11053 -4488 6671 10040 -2216 -10483 -5543 8648
1348 8648 10597 -2579 -8882 -5574 7356 9728 -360 -10310 -5685 8329 9003 -28 -9965 -3956
1362 -3956 6558 10249 1242 -11207 -4171 6324 10274 -977 -8643 -4736 5823 10405 -801
1375 -801 -8058 -5952 7866 8623 -1085 -7662 -6619 6125 8248 798 -9715 -4803 5755 7638
1389 7638 -123 -9312 -3532 3368 9232 -822 -9876 -4537 4824 8384 -2318 -7648 -6021 5605
1403 5605 7458 -1168 -8869 -6649 7141 6093 -222 -9265 -5484 5404 7750 22 -10826 -3661
$$ packed form
1306a2472Q244J4290m89j2302r251Q890J1076J491j2389q383O302J3697K135j5331
1320d492n859N931J2138J874j2243q513N735J4692n97j1650q490P633J1684O90
1334H533r181j1856P935J2579J211j1723q551O565J1159L369j2256q267M940J4191
1348H648J949j3176o303L308J2930K372j0088r950M625J4014O74r031r937O009
1362c956J0514L691r007j2449P036J0495L950j1251p666L907J0559M582j1206
1375h01p257K106J3818P57r708o577J043J2744K123p450j0513M912J0558J883
1389G638p761r189N780O900N864j0054r054N339R361L560j0702n330J627J1626
1403E605J853q626p701K220J3790j048o315r043L781J0888K346p728j0848P165
$$ plain form
1417 -3661 4545 8564 -1764 -9089 -4387 4052 9911 -1970 -8566 -5463 6335 8285 -562 -7686
1431 -7686 -6317 7000 7905 1333 -9833 -4900 6697 7969 1510 -9363 -4475 4442 10801 790
1445 790 -8751 -4490 4146 9972 -422 -6566 -6072 5179 10037 158 -7779 -6428 6686 7830 1903
1460 1903 -8491 -6084 5225 8378 1897 -9969 -4382 4049 8761 1026 -8319 -6149 3270 10383
1474 10383 -29 -7506 -7190 3805 8415 542 -6809 -8355 4340 8261 1696 -8699 -6491 3758
1488 3758 7396 3022 -8668 -6454 2324 8883 1965 -8121 -5324 2335 8706 1483 -6408 -7006 3056
1503 3056 8899 1391 -5749 -6954 3738 7220 2365 -5724 -6523 3611 7964 2263 -7322 -4862 2386
1518 2386 8042 2750 -7057 -5387 2000 8838 1766 -6493 -5471 2604 7767 1983 -6097 -7162 3465
$$ packed form
1417c661Q206M019j0328p325M702Q439N859j1881o596L103J1798J950q847p124
1431g686J369J3317R05o572j1166M933J1597J272o459j0873M888Q917O359j0011
1445G90r541M261Q636N826j0394o144M94J1251M858r879p937J351J3114J144n927
1460A903j0394K407J1309L153o481j1866N587Q431M712p735r345K170R419P113
1474A0383j0412p477L16J0995M610p873p351j546J2695L921o565j0395K208J0249
1488C758L638m374j1690K214Q778O559o918j0086K797P659O371p223p891n98J0062
1503C056N843p508p140j205J0692L482m855q089p99J0134M353n701r585K460P248
1518B386N656n292r807J670P387O838p072q259J022Q075N163n784q080j065J0627
$$ plain form
1533 3465 7433 2045 -6102 -6880 3154 6946 3028 -6643 -6992 2316 7710 2169 -6901 -5672 1220
1548 1220 7832 2655 -6338 -6562 952 7836 1558 -5832 -6178 1103 6359 2404 -5581 -7268 2492
1563 2492 6339 2587 -5278 -6191 2057 5864 3512 -5565 -5883 1494 7290 2345 -5783 -4820 604 7767
1579 7767 2822 -5160 -5413 1218 7525 2003 -4083 -5396 2431 6668 3310 -4808 -6081 3328 6757
1594 6757 3367 -5198 -5155 1697 6680 3973 -5202 -5176 1520 7734 2452 -4488 -5202 811 8066 2304
1610 2304 -4303 -6680 1994 6982 2430 -4584 -6600 1650 5758 3811 -5761 -6124 1637 5973 3754
1625 3754 -5711 -5789 -433 7124 3326 -5116 -6077 147 7344 1730 -3627 -7096 403 6594 3049 -4283
1641 -4283 -7541 1468 5196 4021 -4540 -5955 40 5543 4256 -5866 -5085 -407 6386 3361 -4371
$$ packed form
1533C465L968n388q147p78J0034L792l918r671l49R308N394n541r070J229O892
1548A220O612n177q993k24P514O884o278p390l46P281N256l955p985j687R760
1563B492L847l752p865r13Q248L807k352r077l18P377N796m945q128R63N424P163
1579G767m945p982k53O631O307n522o086j313P827M237l358q118j273R409L429
1594F757l390q565M3O852M983k707r175K6O696O214n282o940p14O013P255n762
1610B304o607k377Q674M988m552p014k016Q250M108j947r572l63P761M336k219
1625C754r465p8N356P557l798q442r61O224P197n614n357l469P499O191l545p332
1641d283l258R009L728j175q561j415N995N503j287j0122P81M678O793l025p732
$$ plain form
1656 -4371 -5827 -825 7227 3037 -3312 -6663 675 6026 3182 -2402 -7000 961 5613 4620 -4192
1671 -4192 -5860 875 5233 4922 -3922 -4893 -1131 6684 4015 -4042 -4506 -753 6452 3045 -2021 -6322
1687 -6322 -364 6169 3510 -2723 -6699 707 4032 4320 -2596 -6379 -170 4711 4301 -4133 -4813 -851
1703 -851 5064 3699 -3254 -5261 -1698 6013 2509 -2866 -5544 -478 5195 3074 -2298 -6630 213
1718 213 4934 3877 -3447 -5600 89 4194 4935 -3170 -5081 -650 5630 4060 -3103 -4501 -1299
1733 -1299 5682 3801 -1916 -5686 -740 5801 3141 -1563 -4892 70 4424 4355 -1931 -5650 -140
1748 -140 4640 4452 -2691 -4414 -821 4449 4562 -2684 -4730 -952 5169 3045 -2338 -4967 -1063 5129
1764 5129 3490 -1976 -5976 -368 4865 3123 -2246 -5108 -965 3858 4078 -3131 -6018 -731 4318
$$ packed form
1656d371j456N002Q052m190o349l351P338N351k844n584m598P961M652r93q812
1671d192j668O735M358l11q844r71L762P815k669q057m64L753P205l407n066m301
1687f322N958O533k659o233l976P406L325K88o916l783O209M881m10q434o80L962
1703h51N915j365o953k007L563P711l504n375k678N066N673k121n372m332O843
1718B13M721j057p324k153N689M105P41q105j911M431O280j570p163j398L202
1733a299O981j881n717l770M946O541k660m704l329M962M354o9o286l719N510
1748a40M780j88p143j723L593N270J13p246k046L778O121k124n383k629L904O192
1764E129j639n466m000N608N233j742n369k862M143M823K20p209k887N287N049
$$ plain form
1779 4318 3586 -2997 -4797 -1681 4408 4128 -2610 -5657 -1300 4642 2911 -2166 -5507 -1480 4566
1794 4566 3638 -1643 -6419 -816 4224 3779 -2000 -5458 -1102 4073 4799 -2268 -5089 -1415 4673 4432
1810 4432 -2081 -4268 -2278 4551 4811 -1542 -4918 -1381 4741 3759 -189 -5088 -1355 4185 4673 -890
1826 -890 -5543 -801 3452 5017 -914 -4441 -2130 3345 4871 -1691 -3845 -2230 3979 3822 -573
1841 -573 -4136 -2858 4180 3809 -429 -4973 -1730 3008 3760 -419 -5383 -1348 2415 4518 -1568 -5091
1857 -5091 -1643 2595 4009 -1429 -3552 -2917 3814 3503 -1193 -3910 -2311 3526 2495 -299 -4859
1872 -4859 -1969 3027 3615 -646 -4805 -934 2054 4249 -931 -4140 -1473 2411 4769 -1622 -3383
1887 -3383 -2472 3152 3703 -339 -3598 -2447 4094 2911 -144 -4069 -1371 3074 3345 -53 -4914 -937
$$ packed form
1779D318p32o583j800L116O089k80o738l047M357N942j731n077l341M027O046
1794D566r28n281m776N603N040m45n779l458M356N175P26p067k821L674O088k41
1810D432o513k187J990O829K60o353l376L537O122r82l948m899L733N540M88n563
1826h90m653M742M253J565n931l527K311N475J526o562k154J615O209j57m395
1841e73l563J278P038l71m238m544L243M738P52m179m964M035L763K103o086l523
1857e091L448M238J414n438k123O35O731l11m696k717J599N837j031k794m560
1872d859K890M996N88m261m159L871K988K195n180l209K667L884K358o391j761
1887c383R11N624N51m042l259J151O541j183l055l925K698M445K71l398m861L977
$$ plain form
1903 -937 2830 4242 -1292 -3957 -1166 2386 4472 -1589 -3739 -2395 3472 3673 -1228 -4125 -2526
1918 -2526 3509 3031 285 -4770 -2330 3141 3370 -117 -4969 -1672 1873 3721 -466 -4629 -2382
1933 -2382 2389 3995 -1145 -3733 -2895 2112 3654 -482 -3669 -3158 3047 2997 -410 -3880 -2079 2637
1949 2637 3550 396 -4656 -1858 2427 3925 -30 -3694 -1972 2493 4440 -235 -3365 -2304 3124
1964 3124 4128 -307 -3015 -2529 2947 3879 523 -3603 -2169 3092 3764 420 -3515 -1776 1978 4467
1980 4467 309 -3842 -1964 1879 4209 173 -3273 -2303 1734 3924 2 -3539 -2519 2490 3206
1995 3206 211 -3385 -3042 1911 3343 371 -4017 -2723 1943 3506 184 -4009 -2809 1295 3828
2010 3828 120 -3849 -2613 1426 3678 245 -3409 -2955 1406 3687 141 -3420 -2978 2001 3243
$$ packed form
1903i37L767J412n534k665K791L552K086o061k150J344N867K01m901k897J599
1918b526O035m78k746n055K440N471K29l487m852L297L545J848m187m163K247
1933b382M771J606n140k588Q38N007J542m136l187N11O205n0l407l470J801M716
1949B637R13l154n052K798M285J498l955l664J722M465J947m675l130J061N428
1964C124J004m435k708M86N476R32l356m126J434N261O72l344l935J739L754K489
1980D467m158m151J878L843K330m036l446R70M037K190l922l541J020N009P16
1995C206k995l596L43M953J432k972m388J294M666J563l322m193J200M104K533
2010C828l708l969J236M039K252l433l654M54M361K281l546l561M42M979J242
$$ plain form
2025 3243 786 -3296 -3208 1682 3512 994 -3591 -2337 1343 3631 1022 -3193 -2262 1128 4174 590
2041 590 -2720 -2296 1160 3736 765 -2293 -2831 1681 3605 846 -2940 -2304 1936 2540 1596 -2960
2057 -2960 -2691 1602 3280 1179 -2859 -1903 465 3590 804 -2449 -2759 718 4104 34 -2387 -2778
2073 -2778 1106 3003 828 -2520 -3373 1531 2209 1253 -3455 -2484 1255 2594 1261 -3740 -2026 709
2089 709 3671 305 -2684 -2515 710 3735 494 -2235 -3209 1539 3374 476 -2543 -3263 1741 2849
2105 2849 1651 -3242 -2658 1201 3422 1614 -3318 -1895 386 3836 1455 -2849 -2547 546 4076
2120 4076 957 -1802 -2998 914 3442 1262 -2047 -3223 1812 2615 1687 -2829 -2435 807 2889 1561
2136 1561 -3120 -1949 283 3780 1134 -2430 -2473 -13 3582 511 -2272 -3439 812 2923 949
$$ packed form
2025C243k457m082Q8M890J830k518m585J254L680K288k609m215R31L390L046l584
2041E90l310M24L456K576k971l058n38M512J924k759l786O36M240O04r44m556
2057b960K69M293J678k101m038R56K368L125k786l253l10L477L386m070k421l91
2073b778L884J897k175l348q53M904O78r56m708R71L739J339j333n001J714K735
2089G09K962l366k989J69L225L025l241k729r74M748J835k898l019p20N004J108
2105B849j198m893N84L859K221j808m932J423K281L450k381m304L02L093L530
2120D076l119k759j196L912K528k180l309j176N035Q03r28m516L94L242K082j328
2136A561m681J171K232L497k646l564m3K460L595l071k783j167M251K111j974
$$ plain form
2151 949 -2134 -3569 601 2420 1655 -2862 -2965 504 2687 1737 -2762 -2467 -383 3228 1351 -2713
2167 -2713 -2906 -267 3272 761 -1612 -3166 300 3141 1382 -2060 -3102 748 2603 1781 -1970
2182 -1970 -2740 275 2621 2216 -2197 -2269 173 3173 1519 -1770 -2236 235 3665 1267 -1500 -2721
2198 -2721 384 3239 1466 -1126 -2724 576 3101 2006 -1756 -2716 652 2750 2159 -1975 -2515 96
2214 96 2828 2073 -1886 -2588 -36 2923 1450 -1689 -3042 -75 2817 1543 -1828 -3099 -120 2330
2230 2330 1608 -1622 -3091 -103 2455 1785 -2142 -2703 -167 2257 1837 -1998 -2676 -412 2930 1791
2246 1791 -1945 -2697 -207 2729 1652 -1544 -2962 19 2936 1552 -1421 -2977 93 2692 2137
2261 2137 -1461 -2952 158 2401 1932 -1716 -2238 185 2591 2352 -1659 -2333 -295 2943 2133 -1265
$$ packed form
2151I49l083j435M170J819p65m517j03L469K183r50m499K95K084L611j877m064
2167b713j93K639L539k511k373j554L466K841j759l442j042L850J855q22l751
2182a970p70L015K346m05m413p2K442L000j654l289m66K471L430k398k767j221
2198b721L105K855j773k592j598L300K525j095l762r60L368K098n91m134n40K611
2214I6K732p55l959p02K552K959j473l139j353K967K892j274l371j271K979K450
2230B330p22l230j469K988K558o70l927n61K536K424m20l835o78K264L342j139
2246A791l736p52K490K936j077l196j418K981K917j384k973j556L070K599n55
2261B137l598j491L110K243m69l648n22K423K406k39m011o74K038L238q10l398
$$ plain form
2277 -1265 -2513 -145 2879 1636 -606 -2906 -295 2545 1761 -1088 -2944 237 1982 2266 -1402
2292 -1402 -2973 -562 2559 2243 -1636 -2218 -915 2509 1817 -1352 -2744 -806 2591 1470 -902 -3351
2308 -3351 -609 1950 1788 -897 -3428 -125 1794 2275 -1431 -2614 -684 1845 2542 -1475 -2230 -1231
2324 -1231 2442 1681 -972 -2058 -1001 2635 1372 -540 -3040 -259 2353 2040 -580 -2606 -169
2339 -169 1673 2461 -1062 -2330 -128 1986 2565 -1126 -1808 -977 2554 2437 -697 -2165 -1077 2829
2355 2829 1575 -312 -2562 -260 2330 1825 -363 -2986 -122 1813 2346 -1076 -2333 -725 1672
2370 1672 2345 -1033 -1919 -1180 2016 1733 -906 -2457 -1354 2250 1474 -567 -2763 -1013 1712 1671 -292
2387 -292 -3021 -753 1571 2232 -1270 -2502 -903 1434 2171 -1072 -2230 -1296 2013 2100 -800 -2305
$$ packed form
2277a265j248K368L024j243k242k300K611K840p84k849j856L181J745K84l668
2292a402j571K411L121l16l879n82J303L424o92l169j392J938L397j121k372k449
2308c351K742K559j62k685k531L303J919M81l706j183J930K529O97m017p55R99
2324a231L673p61k653j086J057L636j263j912k500K781K612l13k620k026K437
2339a69J842P88l523j268K202K114N79l691o82Q31L531j17l134j468J088L906
2355B829j254j887k250K302K590n05k188k623K864J935N33l422j257J608K397
2370A672O73l378q86P39L196k83k639j551J103L604p76k041k196J750K725m1j963
2387b92k729K268K324O61l502j232J599K337P37l243j158R34L309Q7k900j505
$$ plain form
2403 -2305 -1213 2143 1842 -125 -2483 -1057 1858 1996 -150 -2472 -658 1628 2365 -107 -1981 -781
2419 -781 1728 2532 -496 -1672 -1071 2119 2095 -280 -1773 -1320 2158 2096 5 -2136 -881 1697 1750
2436 1750 -84 -2489 -812 1545 2151 -672 -2297 -552 1558 2320 -262 -2287 -1366 1713 2056 -571
2452 -571 -2254 -1360 1520 1964 -393 -2385 -1387 1703 1936 -461 -2575 -1185 1313 2056 -84 -2472
2468 -2472 -1063 1378 2005 -286 -2372 -948 1254 2306 -34 -2119 -1415 1575 2182 -188 -1885 -1397
2484 -1397 1744 2086 128 -2070 -967 1829 2124 200 -2269 -957 1305 2147 204 -2057 -1032 1317
2500 1317 2389 -175 -1979 -1472 1052 2420 -155 -1817 -1717 1494 1934 26 -1917 -1306 1625 1916
2516 1916 188 -2511 -1218 1105 1957 333 -2226 -1125 282 2225 -222 -2335 -1526 870 2336
$$ packed form
2403b305J092L356l01j967k358J426K915J38k146k322J814K286P37k472j874J200
2419g81K509Q04l028j176O01L190k4k375j493M53L478o2k091k141J255K578N3
2436A750j834k405J677K357O06k823j625J745K110P62k582k025R21L079L43k627
2452e71j683Q94K880M44k357j992R98L090K33k397k114J390K498P43k140k388
2468b472J409K441O27k291k086J424K202J052k340k085P04K990O07k370j697M88
2484a397L141L42j958k198J103K796K95j924k469J312K262Q42j943k261J025K349
2500A317J072k564j804N07K524J368k575j662J00L211M40j908j943O11K931K91
2516A916j728k699J293K323Q52j624k559J101J407J943k447k113Q09K396J466
$$ plain form
2531 2336 -412 -1564 -1944 1122 1815 -65 -1895 -1913 1218 1497 517 -2393 -1683 810 1740 349 -2334
2548 -2334 -1143 856 2306 -44 -1898 -1562 823 2505 -28 -1272 -1821 1050 1955 332 -1485 -1649
2564 -1649 1579 1682 847 -1884 -1228 755 2083 1095 -1993 -876 794 2596 325 -1787 -1386 776
2580 776 2608 89 -1029 -1625 1238 2208 501 -1258 -1675 1156 1697 731 -1965 -1462 850 1870 674
2597 674 -2036 -1076 370 2390 291 -1617 -1384 453 2462 -88 -1558 -1805 784 1667 282 -1666
2613 -1666 -1901 988 1540 520 -1970 -1408 430 1661 496 -2069 -1362 313 2026 220 -1598 -1122
2629 -1122 647 2355 271 -964 -1657 590 1815 485 -1309 -1848 1082 1894 824 -1728 -1463 813
2645 813 1778 960 -1805 -1067 524 2087 362 -1214 -1338 741 2306 348 -1223 -1337 518 1891
$$ packed form
2531B336k748j152l80L066O93j880j830j8L131K79r80k910P10K493R30j391k683
2548b334J191J999J450k350j854L36K385J682k533j244n49K871R05j623j817j64
2564a649L228J03q35k731O56J983J328r88l088J117J670J802k271k112M01K162
2580G76J832k519j118n96K863R70j707j759m17K831N41r66k696N03K312J020j196
2597F74k710R60J446K020k099j908K33J837K009k550j470k47K589Q83j385j948
2613a666k35K889N52j020k490N62J838J231j165k565P07J675J713j806j818M76
2629a122J769J708k084j235o93K247J225j330j794n39K930Q12j070k552K65K276
2645H13R65q18k765P38J591J563j725j576j24K079J565j958j571j14J855J373
$$ plain form
2661 1891 435 -1004 -1898 818 1587 584 -1474 -1492 686 1731 762 -1509 -1635 161 1650 410
2677 410 -1723 -1335 231 1606 241 -1577 -1938 399 2110 495 -1478 -1847 382 2040 519 -1805
2693 -1805 -1623 604 1777 767 -1515 -1649 502 1866 736 -1907 -1523 519 2198 1043 -1603 -1604
2709 -1604 362 2256 601 -1252 -2096 433 1855 924 -1067 -1950 659 2012 1228 -1192 -1513 477
2725 477 1949 1277 -1189 -1542 21 2061 1095 -1266 -1462 23 2009 1237 -1043 -1716 -56 2195 872
2742 872 -572 -1970 141 1306 1084 -769 -1905 -95 1136 1229 -1411 -1734 -395 1429 1096 -1553
2758 -1553 -1377 -362 1566 694 -1042 -1650 -400 1587 609 -593 -1923 -161 1265 724 -993 -2039
2774 -2039 302 1187 1315 -1434 -1740 -130 1425 998 -1541 -1259 -448 1716 873 -934 -1358 -206 1969
$$ packed form
2661A891j456j439q94K716P69j003k058j8K178J045r69k271j26J796J489j240
2677D10k133L88J566J375j365j818l61K337J711j615j973l69K229J658j521k324
2693a805J82K227J173j010k282j34K151J364j130k643L84K042J679j155k646j
2709a604J966J894j655j853q44K529J422r31j991q83K609J353p84k420l21J990
2725D77J472o72k466l53J563K040r66k361j96J485J986p72k280o73J660K251j323
2742H72j444j398K111J165k22j853j136J810J231R3k640l23J339J824l33k649
2758a553J76J015J928q72j736o08J250J987r78j202j330J762J426n41j717j046
2774b039K341Q85J28k749l06J610J555m27k539K82Q11K164q43j807m24J152K175
$$ plain form
2791 1969 508 -528 -1959 433 1335 931 -682 -1756 502 1204 1493 -1007 -1309 206 1453 1275
2807 1275 -1129 -1289 -189 2091 947 -870 -1392 -204 1925 737 -517 -1755 146 1388 931 -805
2823 -805 -1985 137 1199 1224 -1025 -1526 -3 1573 1106 -1036 -1224 -391 1571 994 -836 -1829 -479
2840 -479 1843 503 -630 -1866 -36 1006 1012 -534 -1977 -164 1151 1265 -1116 -1483 -384 1226
2856 1226 1125 -964 -1229 -361 1914 1188 -535 -1563 -300 1592 1085 -368 -1673 -11 1514 1165
2872 1165 -754 -1801 102 1311 1459 -590 -1358 -252 1579 1464 -719 -1421 -458 1501 1337 -507
2888 -507 -1507 -457 1575 1305 -503 -1806 -533 1201 1333 -463 -1558 -271 1269 1287 -463 -1731
2904 -1731 -488 1118 1133 -463 -1496 -730 1022 1235 -502 -1748 -845 1225 1097 -563 -1545 -676 1140
$$ packed form
2791A969j461j036j431K392R02m04j613j074K258P02K89k500l02J515J247j78
2807A275k404j60J100K280j144j817n22J188K129j188j254j238J901J242m57j736
2823h05j180K122J062K5k249n01J523J576m67k142j88Q33J962n77j830r93J350
2840d79K322j340j133j236J830J042Oj546j443J813J315J14k381l67J099J610
2856A226j01k089k65Q68K275p26j723j028J263J892n07j453j305J662J525l49
2872A165j919j047J903J209J48k049p68J106J831j15k183p02R63J959j64j844
2888e07j000J050K032k70j808j303J273J734J32j796j095J287J540J8j750j268
2904a731J243J606J5j596j033P66J752K13j737j246R03K070j28j660r82Q69J816
$$ plain form
2921 1140 1282 -328 -1588 -513 1055 1515 -539 -1450 -511 1286 1436 -357 -1361 -456 926 1286 -588
2938 -588 -1330 -435 1458 1488 -390 -999 -294 1193 1450 -125 -1240 -537 1122 1366 -81 -1578 -393
2955 -393 840 1263 16 -1494 -351 979 1526 -437 -1301 -501 977 1538 -209 -1253 -755 1131 1084
2972 1084 -117 -1159 -933 1134 869 37 -1471 -431 883 1038 -60 -1715 -537 606 1295 -506
2988 -506 -1148 -688 722 1488 -717 -1436 -984 856 1085 -397 -1390 -1086 870 995 -13 -1655 -624
3005 -624 869 1116 -3 -1771 -269 505 1417 -374 -1276 -758 739 1513 -354 -718 -938 1204 1404
3022 1404 105 -1422 -948 1119 1176 331 -1653 -444 991 1317 131 -1455 -238 672 1677 -198
3038 -198 -1020 -825 989 1732 -244 -925 -1157 1101 1098 100 -1091 -1119 858 945 310 -1576 -784 692 1281
$$ packed form
2921A140J42j610j260J075J568M60k054r11R39J797J50j793j004R05J382L60j874
2938e88p42Q95J893L0j878o09P05J487K57j575j115P03J659K44j447j497J185
2955c93J233M23j247j510J143J330N47j963q64Q00J478N61j747j044M98J886m7
2972A084j201j042K26K067k65q32j508J040J314J55j098j655J178J143O89j801
2988e06o42M60J410P66k205p19M52J840K29j482r93L04J956J25j008j642J031
3005f24J493K47j119j768J502P74R12j791r02N18J497P74j867l64k20K142K00
3022A404j299j527M74K067N7q45j984J209J435L26j186j586J217R10J005j875
3038a98q22J95J814P43j976o81k32K258lr98j191k8J977Q7o35j886P92J476N89
$$ plain form
3057 1281 252 -1597 -475 292 1401 -66 -1024 -1030 626 1305 -213 -1019 -1208 774 1175 202 -1186
3074 -1186 -1460 835 1099 413 -1614 -988 607 1200 318 -1374 -624 414 1761 300 -1147 -850 496
3091 496 1563 515 -1012 -929 727 1479 405 -952 -1121 604 1010 636 -1130 -876 455 1381 485
3108 485 -1154 -662 215 1494 237 -961 -816 394 1693 225 -803 -963 583 1169 194 -991 -1133
3125 -1133 382 1066 534 -942 -978 368 1075 192 -1219 -851 466 1128 203 -875 -819 396 1098 83
3143 83 -749 -894 424 1113 76 -943 -1195 346 1175 371 -852 -936 375 745 1 -1024 -949 498
3161 498 995 374 -1158 -796 572 1145 378 -816 -659 351 1225 273 -890 -1038 322 1349 461 -765
3179 -765 -867 603 1514 391 -852 -872 578 1398 779 -1173 -1039 249 1197 634 -1226 -1009 249 1572
$$ packed form
3057A281j029j849J122P67J109j467r58oJ656O79j518q06j89J982M01r73j388
3074a186k74K295K64o86k027O26J595N93q82j692P50J038J347j461j447K97J346
3091D96J067j048j527Q3J656P52j074j357j69J725M06l74j766K54J331R26q96
3108D85j639M92Q77J279j257j198J45J210J299j468j028j60J546N86r75j185j42
3125a133J515O84n32j476l6J346P07q83j411L68J317O62r25j078N6J215P02j015
3143H3q32j45J318O89j037j019k52J541Q29q04j223q4J311L70p44j025P5J447
3161D98M97o21j532L62J368N73p67j194J57J010Q74r52j163j48J360J027q88j226
3179g65j02J470R11j123j243k0J450Q20o19j952J34J288R48n63j860K17J258J323
$$ plain form
3197 1572 754 -832 -1138 95 1384 443 -739 -1487 460 1301 435 -1035 -1068 48 1039 578 -1128
3214 -1128 -1101 75 773 538 -1075 -776 -223 1301 288 -915 -1240 -49 1479 666 -589 -1427 174
3231 174 919 522 -678 -1131 354 821 762 -774 -712 -104 845 1068 -792 -767 -56 1455 704 -256 -651
3250 -651 53 1147 589 -170 -987 313 1067 503 -422 -946 477 787 907 -832 -1057 26 629 729
3268 729 -826 -686 -392 1086 606 -634 -978 -237 1187 116 -404 -1247 63 782 289 -845 -1328 266
3286 266 799 725 -728 -1003 -136 754 656 -1013 -1013 -402 1098 438 -657 -1056 -328 1137 438 -220 -1270
3305 -1270 -57 630 591 -414 -1189 18 532 823 -808 -622 223 839 638 -749 -744 -259 1168 652 -390
3324 -390 -654 274 1229 699 -311 -1054 193 955 800 -418 -579 75 964 873 -503 -1035 230 891 611
$$ packed form
3197A572q18j586l06J233J289r41j182p48J947Q41q66j470l3J116R91m61j706
3214a128K7J176O98k35j613K99N53J524j013j203l25J191J528q13j255q38J601
3231A74P45l97j200m53J485M67n9j536O2O08R49K23j860K5P11J511p51r60l95
3250f51P04J094n58p59q17J300P54n64r25n24J423L10J20j739k25J083O03J00
3268G29j555J40K94J478m80j240l44P41J424j071n20q43J310P19m93j134m83J594
3286B66N33p4j453k75Q67Q90r8j669%O11J500o60j095l99P28J465o99o58j050
3305a270J213O87l9j005p75J207N14K91j631J86Q45O16k01j387NM85J427n16j042
3324c90k64R28R55n30j010p43J247P62j55j218j61O54Q89r1j376n32J265O61k80
$$ plain form
3343 611 -719 -521 -95 742 592 -783 -941 -62 828 585 -493 -1288 44 1127 651 -670 -1202 -167
3361 -167 704 518 -486 -927 -229 573 558 -571 -1139 -193 833 688 -736 -861 -142 1070 647 -273 -1086
3380 -1086 -102 997 683 -343 -1149 -216 817 887 -33 -1151 -273 831 860 -181 -1070 -274 787 875
3398 875 -511 -962 -483 1218 857 -175 -634 -588 679 976 -255 -959 -343 792 488 -61 -1036 -169
3416 -169 1055 955 -114 -951 -250 702 1043 -395 -823 -302 760 1030 -298 -848 -651 791 448 -383
3434 -383 -865 -650 457 563 -313 -1018 -364 586 524 36 -1082 -398 402 856 -272 -663 -307 482 778
3453 778 -217 -581 -782 515 600 -203 -527 -198 1042 492 -89 -767 -134 768 701 173 -761 -350 244 821
3473 821 -438 -822 -260 552 1074 -462 -626 -530 835 900 -171 -522 -560 869 713 198 -864 -153 523
$$ packed form
3343F11j330J98M26Q37j50j375j58Q79Q90k43j078p95J332J083m76j321n32J035
3361a67Q71j86j004m41O98Q02j5j129n68R46J026j45j424j25P19J212m23r20q13
3380a086R84J099l14j026q06R33J033P0r20j118Q78J104K9j041q89P96J061Q8
3398H75j386m51M79J701l61j032m59M6J267K97j231p04O16J135l04n49r75Q67
3416a69J224j00j069q37P01R52L41j438m28N21J062K70j328n50J97J442l43q31
3434c83m82K15J107J06q76p05O54R50o2m88j118O84Q00M54j128l91L56P89K96
3453G78r95l64k01J297Q5q03l24L29J240n50n81o78O33R02o7n28r34M11N94N77
3473H21j259l84N62Q12N22j536j64R6J365O5j071l51l8J429j56n15j062P11O76
$$ plain form
3492 523 605 127 -895 -252 111 949 -30 -689 -561 166 766 -412 -460 -545 512 730 -163 -768 -493 942
3512 942 463 197 -870 -380 502 751 -116 -1029 -511 61 964 -261 -977 -470 343 700 -493 -832 -465
3531 -465 634 629 -99 -575 -644 278 599 136 -762 -604 280 542 208 -939 -44 312 1119 -150 -830 -340
3551 -340 398 896 101 -434 -603 573 1027 192 -792 -344 621 845 304 -517 -341 514 929 17 -635 -452
3571 -452 388 731 14 -671 -360 307 1066 273 -497 -636 157 512 47 -597 -878 57 470 63 -813 -618
3591 -618 297 652 403 -737 -809 198 869 125 -783 -632 191 490 99 -610 -664 191 685 41 -686 -482
3611 -482 321 528 128 -540 -227 555 648 143 -275 -197 446 924 307 -459 -461 136 602 79 -516 -601 504
3632 504 712 133 -666 -370 636 656 197 -239 -820 190 486 7 -579 -371 638 408 198 -759 -447
$$ packed form
3492E23Q2m78j022O43L63Q38r79o59J28P27O00j178m8q5J057K18q93o05K75J435
3512I42m79k66j067M90Q82K49q67r13N18N72R03j225p16N07Q13L57j193l39L67
3531d65J099np28m76o9R22L21m63q98J58Q84K62l34j147Q95L56Q07j269o80M90
3551c40P38M98p95n35j69J176M54q35r84M48R65K24n41q21J76Q55M15r12o52J83
3571d52Q40L43p17o85L11O67P59p93p70j39P93L55m65o44k81R35M13m07q76J95
3591f18R15L55k49j140p2J007O71p44r08J51Q23K99l91p09n4Q55M94o44p27K04
3611d82Q03K07m00o68L13P82R3n05m18P8O43M78o17p66kN97M66n23n95q5J105
3632E04K08n79p99K96J006K0m59m36n81J010K96m79n86K08J009k30k10r57L12
$$ plain form
3651 -447 38 836 79 -902 -218 42 903 79 -753 -607 71 468 -267 -861 -644 262 465 -5 -813 -533
3671 -533 450 408 337 -861 -537 464 653 360 -671 -288 -69 527 68 -575 -490 234 917 25 -214 -898
3691 -898 115 588 515 -609 -672 383 534 621 -716 -508 525 927 185 -569 -432 -35 854 324 -249
3710 -249 -424 103 923 121 -374 -361 593 741 350 -397 -681 262 475 178 -823 -280 144 766 413 -493
3730 -493 -707 72 804 -74 -146 -635 -9 543 149 -464 -798 156 532 122 -344 -837 -8 338 465 -660
3750 -660 -423 -9 428 277 -633 -582 -66 671 90 -546 -691 -64 934 177 -378 -742 234 532 69 -641
3770 -641 -787 205 661 556 -402 -602 46 639 248 -535 -341 124 827 418 -211 -474 29 586 551 -155
3790 -155 -513 204 609 185 -300 -596 82 388 458 -199 -600 113 364 194 -428 -310 97 759 134 -533
$$ packed form
3651d47M85P98p57r81O84K60Q61q24q32J46O78L97p35n94K17R06K03m70q08K80
3671e33R83m2p1j198L24J001J89k93j031L83K19N96m59o43Q5P24O83q92k39o84
3691h98J013M73p3j124o3J055J51Q7j337K08J033M02p42p54J37L97Q89n30n73
3710b49j75N27Q20q02m95J3R54J48l91p47k84R43K13k97j001N43M24O22l53r06
3730d93k14P79P32q78p2m89O26N52l94o13l34R54L76m10m66m93Q29L46J27j125
3750f60K37M14M37j51r10N1N16P37n81o36j45O27R98p57n55l64R76K98m63p10
3770f41j46R92M56j05r58k00O48N93l91p83J94M65P03m09o29k63N03N57l5p06
3790a55l58P17M05m24m85k96O78L06P0o57m01P13K51j70o22J18M07O62o25o67
$$ plain form
3810 -533 -568 254 434 136 -128 -819 -23 593 368 -471 -761 -104 378 194 -269 -468 -283 491 234 -410
3830 -410 -492 -127 422 265 -201 -322 -42 458 422 -668 -665 -48 703 523 -265 -545 -242 732 562 -112 -615
3851 -615 111 647 270 -185 -537 -152 415 503 -327 -572 -147 759 453 -129 -493 -351 739 462 -460 -467 -85
3872 -85 717 328 -36 -639 -413 344 377 -289 -799 2 300 461 -377 -667 -265 541 495 -471 -600 -338 438
3893 438 165 -280 -802 -378 365 -13 -214 -797 -208 314 376 -305 -855 111 392 719 -365 -506 -316 261
3913 261 594 -392 -579 -169 827 294 -179 -362 -181 505 292 91 -841 -79 442 434 -69 -259 81 296 889
3934 889 -415 -291 -124 500 629 -211 -208 94 673 523 179 -436 -106 687 319 256 -795 145 437 204
3954 204 -202 -986 157 557 664 -134 -186 -206 132 407 -237 -518 -576 677 157 -349 -298 -627 326 545 -151
$$ packed form
3810e33l5Q22J80k98k64o91P96O16k25q39k90O57M82j84m63j99J85P74k57o44
3830d10q2L65N49j57m66j21K80N00l6j090LO17P51j80p88k80L03R74j70o74n03
3851f15P26N36l77m55l52L85N67Q8q30k45M25R06l06n82l64J42J090k77r22pL82
3872h5Q02l89l64o03K26P57L3o66n10Q01K98J61q38k90M02Q06m6r66j29K62P76
3893D38k73m45n22M24P43l78k01n83N89N22O2o81n50R66K81L27j084j41J90N77
3913B61L33r86j87M10R96n33m73j83J81O86k13k01r32P62N21qn03j90L40K15N93
3934H89j304J24J67O24J29q40LL02N79j50l44o15L30P93l68o3j051R40K92k33
3954B04m06p84J143M00J07p98n2k0L38K75o44k81n8J253n20n06N1l29R53K19o96
$$ plain form
3975 -151 -762 -138 208 351 -164 -634 -95 -60 714 -235 -145 -239 374 523 -245 -423 -294 498 406 81 -696
3996 -696 2 452 357 243 -648 -132 367 740 3 -435 -15 331 558 -210 -335 -355 354 658 -240 -525 -418
4017 -418 843 450 303 -552 -436 238 414 -171 -586 -220 207 367 -179 -312 -252 31 367 -134 -566 -82
4037 -82 46 233 -167 -384 -428 239 445 11 -379 -406 189 380 66 -559 -643 456 372 89 -732 -403 -73
4058 -73 382 -367 -398 -355 467 679 -38 -412 -91 237 473 47 -619 -446 428 677 129 -163 -143 229 343
4079 343 -3 -267 -267 235 409 -213 -347 -137 500 455 -1 -640 -319 363 472 -192 -496 -157 273 369 -109
4100 -109 -336 -346 299 639 -460 -496 -140 60 157 78 -597 -446 200 371 -138 -745 -333 70 420 -126 -275
4121 -275 -500 116 570 -279 -313 -496 242 420 79 -531 -336 256 245 277 -488 -320 -44 471 39 -506 -278
$$ packed form
3975a51o11O24L46J43n15m70N39L5P74r49R0r4O13J49p68j78J29P92r2l25p77
3996f96O98M50r5j14q91N16M99L73p37m38M20L46K27p68j25k0P09L04q98k85J07
4017d18J261l93j47q55J16O74J76n85m15L66M27J60n46j33O0K83L36n01m32M84
4037h2J28J87m00k17m4O67K06m34l90k7N95J91l14o25q4J099q4k83q21L29L30
4058g3M55p49l1M3Q22K12p17l74L21L28K36m26o66J73Q74K49n48k92K0L72J14
4079C43l46k64%N02J74o22j34K10O37m5m56o39L21O82J09o64l04L39M30R6m78
4100a09k27j0O45L40j099l6L56K00R7p9o75J51O46J71n09o07M12M03L50n46j49
4121b75k25O16M54q49l4j83P38J78l41o10J95N92j1L2p65J68K76N15m32n45K28
$$ plain form
4142 -278 8 572 -45 -292 -242 269 789 123 -280 -317 417 452 -38 -302 -419 231 333 457 -320 -42 -5
4163 -5 309 57 -225 -252 134 574 234 -222 -291 227 297 155 -165 -333 165 230 297 -430 -369 326 250 8 -513
4186 -513 -289 -9 378 -21 -524 -225 -67 416 -329 -77 -444 -78 459 121 -444 -500 158 253 58 -479 -264
4207 -264 125 460 19 -564 -134 88 577 166 -280 -183 -34 627 97 -346 -59 37 463 -59 -136 -495 153
4228 153 298 219 -213 -349 362 536 447 -225 -28 111 491 204 -342 -113 -39 463 277 -149 -283 68 513
4249 513 -61 -398 -507 322 324 94 -476 -426 58 85 168 -606 -3 -38 122 244 -332 -273 50 202 41 -467
4271 -467 -369 130 539 88 -415 -288 206 377 -122 -620 -216 -30 291 19 -582 -362 398 506 10 -215
4291 -215 -593 -59 435 128 -245 -259 281 511 81 -221 -273 -86 492 194 -151 -225 -13 412 209 -275 -212
$$ packed form
4142b78K86N64o17k47N0N11N20o66m03l7P34L5m90k64j17O50J02J24p77K78L7
4163eL14k52k82k7L86M40l40m56o9N18P0j42l20j68M98O5O7p27O1O95p6k42n21
4186e13K24K80L87l99n03K99J58M83p45K52l67L66N37l38n65n6O58R5j95n37K15
4207b64L89L35m41n83M30K22M89m11m46R7J49O61n30m43K87R6M26n22p7l59O48
4228A53J45p9m32j36P11J74q9o72J97J39L80k87n46K29P4N02j86m26j34L51M45
4249E13n74l37j09Q29Kk30n70N0M84K7Q3p74O03l5J60J22n76N9L23J52j61n08
4271d67R8M99M09m51n03J27M94J71m99m98M04J86L21k72o01K20P60J08m96k25
4291b15l78N34M94l07l73j4N40K30m30l02n2J87N78k98l45p4K12M25k03m84O3
$$ plain form
4312 -212 127 483 202 -113 -379 178 430 153 -259 -192 96 461 305 -506 -432 -4 587 138 -168 -460 -190
4333 -190 368 88 -495 -708 -32 393 168 -191 -322 -89 385 81 -386 -554 -69 75 273 -292 -388 -74
4353 -74 431 143 -290 -626 -60 339 90 -209 -513 -45 515 150 -140 -678 -66 248 132 163 -384 60 353
4374 353 277 -461 -232 126 454 256 172 -389 53 509 258 -390 -316 181 348 167 -367 -159 -23 306 464
4395 464 -373 -76 73 303 149 -61 -413 25 278 94 -260 -344 -49 178 17 -77 -455 39 286 -125 -498
4416 -498 -558 93 75 327 -522 -290 -16 479 -22 -370 -352 118 466 17 -127 -533 67 508 113 -197 -496
4437 -496 115 292 453 -74 -301 40 66 384 -396 -343 31 337 308 -397 -300 68 325 217 -105 -196 -126 372
4459 372 135 -52 -583 88 587 470 -175 -146 87 459 336 -33 -253 -72 386 345 -87 -289 -225 219 270
$$ packed form
4312b12L39L56k81l15k66N57K52k77m12O7K88L65j56q11P4M28N91m49l06k92K70
4333a90N58k80n83k13O76M25k25l59j31K33M74l04m67j68M85J44J98n65r6L14
4353g4N05k88m33l36N66L99k49k99l04M68N60l65k90n38O12L14j16L1n47M44K93
4374C53p6p38K29L58L28j98q4n61M42M56k51o48P4M97J67j81n34K08J36L29J58
4395D64q37K97J49K30j54k10l52M38K53j84l54q4K95K27j61r4l78M94K47m11l73
4416d98o0O51j8K52q49K32K74M95n01l48J8M70L48m49j44m06O00M41l95l10k99
4437d96O11J77J61n27k27L41K6L18p80N3L74L06k9p05R7L68K57j08l22r1P0M98
4459C72k37j87n31O71M99j17o45K9K33L72j23l69k20J81M58m1m32k02O4M44N1
$$ plain form
4480 270 -241 -419 -261 413 291 144 -386 8 286 294 -175 -500 -80 270 524 -374 -187 -322 84 398 -212
4501 -212 -190 -162 136 373 115 -360 -118 263 335 -63 -392 -111 382 470 52 -221 -149 77 272 106 -272 45
4523 45 76 76 266 55 -312 264 273 94 -111 -3 301 330 -53 -190 96 326 158 33 -214 -223 371 291 -119
4546 -119 -253 206 172 433 -121 -611 20 23 286 -30 -478 -60 121 175 -46 -129 -98 263 544 -218 -284 -118
4568 -118 558 100 28 -210 -151 307 391 -208 -233 -256 118 526 -347 -267 -22 478 222 -184 -592 -109 219 331
4590 331 -89 -426 -112 370 207 -196 -358 -226 93 244 -77 -158 -146 152 309 -114 -428 -214 321 386 -94
4611 -94 -109 -55 197 141 222 -241 -314 215 524 -7 -204 85 49 474 265 -402 -91 74 302 -164 -126 -168 29
4634 29 317 -69 -99 -289 352 92 -155 -257 -210 -95 -94 -75 -450 103 -160 216 37 -203 -74 195 476 70
$$ packed form
4480B70n11j78J58O74j22j47n30L94K78Qm69l25M20L50K54q98J87j35M06L14o10
4501b12K2K8K98K37k58m75K42L81P2l98l29K81M93Q8m18k73P2K26J95j66l78L17
4523D5L1%J90k11l67N76Rj79k05J08L04K9l83j37K86K30j68j25k47rN94q0m10
4546a19j34M59l4K61n54m90O31LK63l16m48M18J81N4k21q3L1L61K81p62o6J66
4568a18O76m58p2k38N9M58Q4n99k5k3L74M08q73Q0K45N00k56m06m08M83L28J12
4590C31m20l37L14M82j63m03j62J32L19J51l21q1J2K98J57m23l14K14N35O5m80
4611i4j5N4K52n6Q1m63p3N29L09n31j97K89l6M25k09o67L11J65K28m66L8m2J97
4634B9K88l86l0j90O41k60k47j02M7J15JJ9l75N53k63L76j79k40J29K69K81m06
$$ plain form
4656 70 -197 -329 123 515 57 -122 -175 266 204 326 -266 -302 449 206 178 -412 -180 219 338 -45 -171 -139
4678 -139 62 457 -72 -32 -249 148 281 105 -229 -152 510 426 156 -113 -108 107 457 279 -318 -117 150 79
4700 79 -18 -126 -211 3 522 -17 -226 -305 72 171 -118 -121 -385 214 434 206 -378 -195 65 320 -321 -402 122
4723 122 87 97 194 -382 -205 -114 275 39 -261 -318 262 284 12 -33 -406 177 316 -139 -435 -187 153 577
4745 577 -230 -396 -245 187 366 88 -248 130 381 404 52 -219 -49 41 144 216 -119 -310 158 477 -30
4766 -30 -95 -133 62 133 122 -241 -339 127 276 0 -262 -209 248 344 25 -483 -264 42 205 43 -357 -146 -27
4789 -27 48 3 -222 -238 159 282 -92 -418 -444 203 238 380 -416 -334 195 265 -13 -386 -114 -196 249 148 -169
4812 -169 -157 239 382 53 -222 -215 67 506 187 30 -410 191 261 134 -65 -250 64 196 232 -228 -97 87
$$ packed form
4656G0k67j32M52L92m58j79n3M41o2J22n92l6P51k43k8n90K32L99J19l83j26L2
4678a39K01L95n29M0k17L97J33j76l34P7O62q4k70k69NK15L50j78n97K01K67p1
4700G9r7j08q5K14N19n39k09p9L77R9k89lk64N99K20k28n84J83K60K55o41q1N24
4723A22l5J0R7n76J77R1L89k36l00n7N80K2k72m5l73N83J39m55k96K48L40M24
4745E77q07j66J51M32J79k78l36L78K51K3l52k71J70R0J03P2l35j91M68L19n07
4766c0o5l8J95P1j1l63r8M66J49k76k62N3M57R6l19n08K19L06J63j62m00K11J19
4789b7P5m5k25j6L97J23l74l26k6O47L5J42p96Q2N29P0k78l73K72q2M45j01l17
4812a69J2L96J43l29k75PK82M39l19j57m40O01P0j27j99j85L14J32L6m60J31J84
$$ plain form
4834 87 268 165 -432 20 56 352 192 -60 -146 194 566 -39 -186 -309 202 148 135 -115 -209 18 121 140
4856 140 -482 -277 -238 440 364 -277 -484 30 92 29 41 -184 147 146 70 -250 -212 98 97 22 -415 -98 193 162
4880 162 212 -264 -59 -87 254 -84 -282 -28 -109 446 -15 -26 -150 206 27 -30 -297 81 345 -14 330 -541
4902 -541 -467 -33 198 262 -280 -270 -38 219 241 -221 -209 159 410 166 -122 -328 -11 203 139 -110 -275 101
4924 101 256 -102 -25 134 -106 -122 96 -405 -255 231 149 -126 -344 -261 42 325 -90 -119 -439 -10 -56 33
4946 33 -145 -347 76 315 324 -252 -137 185 142 126 2 -317 -141 168 172 -154 28 -173 79 359 126 -315
4968 -315 -61 305 152 107 -132 69 199 54 -238 -267 99 218 96 -126 -79 135 97 98 46 -437 -87 396
4990 396 291 -143 -179 8 -76 208 -171 -152 -19 318 182 -364 -201 259 233 -61 25 -286 -80 240 269 -206
$$ packed form
4834H7J81j03n97M52L6K96j60k52q6L40L72o05j47j23N11n4j3k50r4K27J03J9
4856A40o22K05L9O78p6o41k07N14O2o3J2k25L31jp6l20L8L10jp5m37L17K91l1
4880A62N0m76K05k8L41l38j98K54q1N55m61j1j24L56j79n7k67L78K64l59L44q71
4902e41P4M34K31O4n42J0K32K57K2m62J2L68K51k44k88k06L17K14o4k49j65L76
4924A01J55l58P7J59k40j6K18n01J50M86q2k75k18Q3L03K83m15k9l20M29m6Q9
4946C3j78k02M23K39Rn76J15L22m3j6j24l19J76L09Ml26J82k01K52K80k33m41
4968c15K54L66j53m5k39K01J30j45k92k9L66J19j22k22M7K14l8Jn2m83L50M83
4990C96j05m34l6J87q4K84l79J9J33L37j36n46J63M60k6k94Q6l11K06L20K9m75
$$ plain form
5012 -206 -256 277 16 158 -45 -256 189 250 -173 -368 -115 -123 89 -134 -414 -292 -112 282 25 -136 -112 12
5034 12 45 186 -27 -277 90 220 295 -11 -203 -130 105 65 -68 -143 76 171 211 -8 -267 -161 192 137 75
5057 75 -493 115 379 118 -116 -212 346 69 233 26 -101 47 307 137 20 -4 -86 96 232 207 -162 -29
5079 -29 291 11 29 -41 -91 155 90 -28 -547 192 194 108 -317 -132 -379 236 220 -104 -222 -404 156 42 -29
5102 -29 -501 208 165 15 -225 -578 126 168 161 -487 -143 45 42 361 -169 -133 -179 96 64 -64 -84 -414 298 258
5126 258 -282 -606 -46 335 198 143 -264 46 -252 531 -152 -53 -275 101 195 -222 -134 -93 279 289 126 -316
5148 -316 -128 265 67 282 -340 -501 262 52 39 -520 63 85 302 -11 -186 -121 165 295 -82 54 -25
5169 -25 260 4 -87 -203 -373 88 316 45 -359 130 148 -90 210 -143 -169 151 158 -453 -138 -27 27 140
$$ packed form
5012b06n0N33k61J42k03k11M45O1m23j95K53qK12k23k80J22J80L94k57j61K4J24
5034A2L3J41k13k50L67J30P5l06j92P3K35m0j33p5K19R5M0k19k59J06L53n5o2
5057G5n68O08K64k61k34r6N58k77J64k07j27J48K60j70j17k4q2J82J36k5l69J33
5079b9L20k80J8p0n0K46o5j18n19P39Kq6m25J85k47O15j6l24j18j82N60j14p1
5102b9m72P09m3j50k40l53P04M2po48L44J88lL19n30L6m6K75l2j28k0l30P12m0
5126B58n40l24N60L81j37n5m07L10k98P83o83R9k22L76R4m17Q8M1L72J0j63m42
5148c16J88L93j98K15o22j61P63k10j3n59N83K2K17l13j75O5K86J30l77J36p9
5169b5K85k56r1j16j70M61K28k71m04M89J8k38L00l53k6L20Po11L15J11N4J13
$$ plain form
5191 140 341 -47 -309 -69 208 -312 -246 -217 140 274 -29 -86 -103 248 108 -56 -244 -65 108 363 -56
5212 -56 -61 -146 271 179 -18 -166 -19 199 309 270 -299 -166 244 -31 -1 -39 88 -170 219 274 0 60 188
5235 188 314 -14 -164 -219 323 97 35 -323 -363 12 371 84 -171 -303 -69 164 26 -186 -280 -231 98 -97
5257 -97 -380 -421 297 -81 178 -211 -255 268 -72 157 -187 -187 70 -86 110 -530 198 48 395 41 -115 141
5279 141 -26 129 -89 -203 7 201 408 93 -163 -111 95 172 216 -285 -128 -17 355 59 -251 -86 -47
5300 -47 65 -82 -246 -39 79 356 301 -227 -232 285 330 139 -175 -189 202 -49 97 -371 -82 3 371 -39
5322 -39 -375 -67 -154 397 -14 -7 -84 95 247 -44 -399 -252 229 -39 237 -4 -112 131 375 289 -213 -43
5344 -43 48 355 143 -72 -297 53 198 -55 -42 -300 -117 125 28 -85 -318 168 148 352 -207 -250 326 229
$$ packed form
5191A40K01l88k62K40K77n20O6K9L57J34l03n7j7L51j40j64j88J79J73K55m19
5212e6nq5M17r2j97j48J47K18J10l9n69J33M10k75L0l8J27k58L89N5k74O0J28
5235A88J26l28j50n5N42k26o2l58m0L75L59k87k55j32K34K33j38k12r4M9L29j95
5257i7k83m1P18l78K59l89m4N23l40K29l44%K57j56J96o40P28j50L47l54j56K56
5279A41j67J55k18j14K10J94K07l15k56N2K06P7M4n01J57J11L72k96l10J65L9
5300d7J12j47j64K07J18K77n5n28nN17M5j91l14j4L91k51J46m68K89Q5L68m10
5322c9l36L08q7N51m11Pp7J79J52k91l55J47M81k68K76k41j08K43K44q6n02J70
5344d3R1L07k12k15k25L50J45k53J3k58J83K42r7j13k33M86k0K04n59m3N76r7
$$ plain form
5366 229 357 -119 -325 164 271 135 -209 -7 -59 168 -116 -39 -128 83 178 154 -296 -269 -16 262 245 -57
5388 -57 -215 -113 135 295 -95 -147 -13 55 22 72 -141 111 152 -230 -404 -269 -47 26 -142 48 -379 70
5410 70 55 40 -387 -251 112 221 240 -262 -138 2 273 132 -210 -253 -19 375 104 29 -395 107 143 80 -230
5433 -230 -288 328 103 318 156 -81 126 271 264 -7 -177 -27 258 284 67 -277 38 166 98 34 -40 36 23
5456 23 134 -9 -302 -116 196 2 -224 -340 -58 285 -22 -173 -219 -51 103 49 -141 -274 -182 -9 176
5477 176 -186 -371 -180 283 -5 -106 -90 -249 -43 -167 -437 -335 37 79 44 -260 -189 299 177 89 -68 -280
5499 -280 -20 192 111 5 -352 -89 187 137 23 32 -135 258 1 -37 -405 6 254 -110 -222 -70 112 -66
5521 -66 300 -118 -169 36 70 243 -87 -59 -124 196 289 157 -239 -266 321 183 -306 -309 -245 42 109 78 -402 26
$$ packed form
5366B29J28m76k06M89J07j36l44K02n2K27k84P7q9K11R5k4m50K7K53K78j7l02
5388e7j58J02K48J60l90n2J34O8l3N0k13K52M1l82j74J35K22P3j68J90m27M49
5410G0j5j5m27J36L63J09J9n02J24J40K71j41l42m3K34L94k71p5m24N02L6o3l10
5433b30n8O16k25K15j62k37K07J45pk71j70J50K85K6k17l44L15J28o8o4p4P6j3
5456B3J11j43k93J86L12j94k26j16K82L43l07j51m6J68J54n4j90j33R2J73J85
5477A76l62j85J91M63k88j01J6j59K06j24k70J02L72M2l5l04P1M88j22q8j57k12
5499b80K60K12q1j06l57K63K76n0j14Rj67L93k57l8l68M11K48l64j12J52J82j78
5521f6L66m18n1K05L4J73l30K8o5L20R3j32l96k7N87j38m89lO4K87O7l1m80M28
$$ plain form
5545 26 151 239 -370 -287 131 -324 209 -267 -162 -417 622 -16 -111 142 -69 182 -195 93 -158 0 82
5566 82 6 -20 -475 -121 -148 218 -165 -506 -3 258 -49 -73 -190 -87 396 148 -37 -100 26 199 174 -102
5588 -102 -255 78 -203 134 88 -201 38 153 -10 -131 58 -233 -9 325 5 28 10 381 197 -169 36
5609 36 -44 389 64 -10 -430 -40 19 136 -160 -101 75 -101 543 69 -310 -184 91 271 -49 -296 31 297
5631 297 160 -58 -316 -349 70 119 -273 -306 -25 -17 -9 -152 -302 -422 166 108 32 157 -68 395 175 -66 110
5654 110 -205 69 179 62 -219 -403 313 -87 -6 -234 151 26 133 -75 -188 161 171 177 172 35 -32 368
5676 368 77 128 -36 167 -18 275 -44 -400 174 -10 113 -57 -83 -216 215 103 -147 -331 -273 180 152
5697 152 -143 -193 -114 88 -38 -183 -97 -86 -134 -78 67 -175 -278 -24 90 -49 -299 -252 61 68 21 -121 -231
$$ packed form
5545B6J25Q8o09Q3M18m55N33m76J05k55J039o38r5K53k11K51l77K88k51J58Q2
5566H2p6k6m55L54k7L66l83l41N03K61l07k4j17J03M83k48j85o3J26J73k5k76
5588a02j53L33k81L37m6k89K39J15j63j21J89k91K24L34l20K3j8L71j84l66K05
5609C6q0M33l25p4m20L90N9J17k96N9J76j76O44m74l79J26K75J80l20k47L27K66
5631B97j37k18k58l3M19M9l92l3K81QQj43j50j20N88n8p6J25k25M63k20k41J76
5654A10l15K74J10j17k81j84P16m00Q1k28L85j25J07k08j13L49J0Onj37o7M00
5676C68k91N1j64K03j85K93l19l56N74j84J23j70k6j33M31j12k50j84N8M53k8
5697A52k95n0P9K02j26j45Q6J1m8N6J45k42j03K54J14j39k50M7L13Pm7j42j10
$$ plain form
5720 -231 109 126 -1 -137 -224 89 155 148 -149 -253 123 248 57 -134 -101 -189 282 109 -45 -411 -3 34 123
5743 123 54 -331 181 -46 122 -159 -167 253 131 15 -69 -43 85 5 34 -147 -73 212 199 96 -120 -93 149
5766 149 210 -178 -159 -60 241 -92 71 -286 -228 124 228 78 -459 -119 -124 227 -78 -239 -317 26 43 106 -27
5789 -27 -349 127 101 -49 -83 30 8 -95 17 65 -189 405 186 62 -114 133 -106 387 -2 -195 117 160
5811 160 220 -189 105 -161 70 79 75 -67 -198 241 158 -9 -323 -9 38 433 265 -331 -75 2 49 -141 62
5834 62 -88 37 43 -48 -74 -56 98 42 248 -123 -190 -73 230 198 -206 -74 -4 101 72 -225 -313 63 17 10 -218
5859 -218 -39 -5 67 17 -197 -582 -147 173 -44 -141 -137 -72 37 166 -33 -171 -41 272 -3 -53 -34 104 199
5882 199 89 46 -147 74 411 81 -43 -194 172 182 -40 0 -91 186 43 382 36 119 104 80 242 -89
$$ packed form
5720b31L40J7j27j36q7L13O6pk97j04L76J25j91j91L3q8M71j73j54l66M08L7Q9
5743A23o9l85N12k27J68k81qM20j22j16q4K6J28q0K9j81P4K85j3j03k16K7K42
5766A49O1l88J9R9L01l33J63l57N8L52J04j50n37L40nL51l05j61p8L43J7O3j33
5789b7l22M76k6j50l4J13k2j03J12M8k54N94k19j24j76K47k39M93l89j93L12M3
5811A60O0m09K94k66K31Rmj42j31M39q3j67l14L14M7L95j68n96K56P7M7j90K03
5834F2j50J25Or1k6J8J54n6K06l71o7J17L03l2m04J32P0J05k9k97q8L76m6pk28
5859b18J79L4P2n0k14l85M35L20k17r7MO5J09J29j99j38J30L13k75n0J9J38R5
5882A99j10m3j93K21L37l30j24j51L66J0k22M0r1K77j43L39l46Q3j5k4J62l31
$$ plain form
5904 -89 22 -16 86 -35 -23 -240 111 24 228 -56 -204 -126 147 -102 221 4 -166 120 89 -81 -122 70
5926 70 208 105 -51 142 -66 -103 112 -84 -265 87 218 95 -364 -103 -309 59 186 -66 -85 -123 -132 -32
5948 -32 -50 -52 45 240 196 308 -111 188 265 8 21 -236 42 106 52 -19 85 128 400 23 117 170 -110 -29 47
5973 47 84 -153 -336 305 24 -47 -31 163 5 59 -85 -181 151 -8 -78 -129 23 -9 134 -121 -56 -30 -93 515
5997 515 -211 -183 -97 80 -27 67 52 -492 155 37 117 -262 -133 -31 104 89 -175 -102 12 -23 73 -227 -152
6020 -152 -237 174 -38 -30 -277 -91 256 -327 78 -195 200 4 239 -172 -6 -168 27 57 -179 -86 -159 25
6042 25 -64 -330 -36 -47 126 -30 -153 -19 108 387 84 26 -341 167 -214 33 118 -300 -148 31 1 -29
6064 -29 -70 -11 41 56 -179 82 -29 277 1 152 -189 150 66 243 43 -312 177 190 157 -97 -267 -145 -46
$$ packed form
5904h9J11l8J02j21J2k17L51q7K04k84j48P8K73k49L23k17j70K86l1j70m1J92
5926G0J38j03j56J93k08l7K15j96j81L52J31j23m59K61k06L68J27k52j9l8rJ00
5948c2j8kR7J95m4J12m19K99P7k57J3k57K78O4n4p1J04M3K72l77R4N3k80Q1P6
5973D7L7k37j83O41k81p1J6J94j58N4j44r6L32j59p0n1J52l2J43k55O5K6o3O08
5997E15p26K8Q6J77j07R4j5n44O47j18Q0l79J29J02J35j5k64P3J14l5R6l00P5
6020a52q5M11k12Qk47J86L47n83M05k73L95j96K35m11J66j62J95L0k36R3p3J84
6042B5q9k66K94j1J73j56j23J34J27K79l03n8l67N08l81K47Q5m18J52J79l0l0
6064b9m1N9N2J5k35K61j11L06k76J51l41L39q4J77k00l55M89J3l3k54j70J22R9
$$ plain form
6087 -46 121 -178 -112 -154 -147 279 47 -68 6 254 178 40 -167 297 -72 -8 -21 -127 -63 204 126 -47 87 -306
6111 -306 332 54 -22 -181 247 192 28 -77 180 56 148 125 50 111 -1 365 486 24 -94 59 65 136 20
6134 20 -126 -112 83 96 -37 -223 269 227 78 -53 -51 -166 -28 -36 102 -263 -267 -20 69 165 -305 -97 34 210
6158 210 102 -179 75 20 359 -58 -193 17 202 61 -3 -253 -85 310 142 -100 -191 -274 -103 -84 7 -288
6180 -288 -102 269 -100 142 141 24 57 196 152 -323 -71 320 441 141 -196 -55 -38 165 -84 -44 -172 236
6202 236 -131 -12 -197 -73 197 210 223 -329 89 341 83 -71 -322 -24 349 305 -113 -195 99 19 315 -57
6224 -57 -102 9 40 87 78 -129 -7 82 -15 60 -357 -61 -160 162 -63 -351 -36 -141 157 199 -44 177 -170 208
6248 208 20 -178 -72 90 56 88 -171 -237 366 131 -42 -22 -336 -47 -20 -96 64 -55 51 405 -156 5
$$ packed form
6087d6J67k99O6m2PM26k32j15P4K48p6j38k07M64l69O4j3j06O4K67p8j73J34l93
6111c06O38k78p6j59M28n5j64j05K57j24R2k3p5O1j12L66J21m62j18J53OP1j16
6134B0j46J4J95J3j33j86M92m2j49j31Kj15J38qJ38l65mK47Q9R6m70K08J31J76
6158B10j08k81K54n5L39m17j35K10J85j41o4k50J68L95j68k42r1q3J71J9R1k95
6180b88J86L71l69K42jj17L3J39m4m75K52L91J21l00l37J41J7K03k49M0j28M08
6202B36l67J19j85J24K70J3J3n52M18K52k58j54k51K98L73m4m18q2K94q0K96l72
6224e7m5J11L1M7rk07J22Q9r7P5m17K96r9L22k25k88L15j05K98M2k43K21l47L78
6248B08j88j98J06J62l4L2k59o6O03k35j73K0l14K89K7p6J60j19J06L54n61J61
$$ plain form
6270 5 -70 33 90 -395 109 66 251 180 53 -110 -88 92 -121 188 -106 -202 -271 310 115 -268 171 166 -261 15
6294 15 59 68 214 -71 -3 -13 -108 76 143 -45 131 -99 381 90 -200 -437 -199 280 85 -179 -141 -156 110
6317 110 273 150 91 -95 36 254 339 -302 57 -38 -29 119 -144 -183 -135 111 278 -103 7 221 188 -56 -293
6340 -293 -13 -118 295 399 -315 -111 76 134 -125 -110 87 19 12 -80 -48 -125 19 332 33 -12 -124 56 -4
6363 -4 8 -86 -225 56 117 -134 -305 -153 135 176 80 -46 30 -145 13 371 -138 -223 134 26 110 -164 -25
6386 -25 25 -202 -293 113 251 145 -90 103 -12 -46 38 -66 -38 42 -178 -206 301 149 -97 -130 16 150 57
6409 57 -123 11 -132 3 177 12 -71 -4 78 103 259 118 226 -91 213 -67 -76 227 273 165 -176 -181 80
6432 80 318 17 150 -61 -63 -147 -365 -104 -202 -222 81 312 -301 141 -86 62 87 -173 2 -83 262 33 -83
$$ packed form
6270Ep5J03N7m85N04m3J85p1j27j63K2J80k13L09k94r6o9N81j95l83M39nm27K76
6294A5M4RJ46k85O8j0r5J84O7j88J76k30M80k91k90k37K38M79j95k64L8j5K66
6317A10J63j23n9j86J31K18Q5o41L59r5RJ48k63l9M8K46J67l81J10K14l3k44k37
6340b93K80j05M13J04p14K04J87N8k59J5J97o8pr2L2p7J44L13k99m5j12J80o0
6363dJ2r4j39K81O1k51j71J52K88M1r6j26P6j75J58L58n09q5L57j08Q4k74J39
6386b5N0k27r1M06J38j06k35J93j15l4Q4j04K8Q0k20k8N07j52k46l3J46J34r3
6409E7j80J34j43J35J74j65q3O7Q2K5J56j41J08l17L04k80rL03M6j08l41nK61
6432H0K38l01J33k11kq4k18K61r8k0L03K31o13M42k27J48K5k60J75q5L45k29j16
$$ plain form
6455 -83 -93 -46 217 148 -178 -368 1 64 304 -285 -233 90 -59 16 -94 -104 101 -110 50 22 217 59 -12
6478 -12 133 -178 -187 -52 109 120 112 -54 118 176 -199 82 56 61 351 318 -196 -194 190 107 229 -236 89 77 174
6503 174 126 183 -109 -195 12 142 -173 -68 -184 170 158 81 -57 -146 136 -51 -115 -202 57 65 -64 -87 -81 -15 85
6528 85 -71 -144 49 -75 -33 -310 6 -34 -197 67 71 -63 -137 -130 -65 103 100 -105 -76 254 206 -77 9 -119 36
6553 36 -368 -66 -61 -227 79 -9 47 -155 -107 138 -33 184 248 -66 -266 259 -38 -191 198 24 -193 259
6575 259 3 -9 403 147 77 -39 -62 20 -10 -55 -138 -142 184 83 -92 -99 -45 192 139 116 -51 -72 45 -56 -185
6600 -185 9 -158 34 -225 -28 -246 -78 -216 101 -66 97 -189 94 -74 -261 -16 -98 -100 117 -37 -232
6621 -232 33 93 -110 158 188 -255 49 255 35 17 146 -240 -8 88 -135 105 22 79 128 -75 -194 -150 28
$$ packed form
6455h3j0M7K63o9l26j90L69O3K40n89N2L23j49P5j10j0K05k11J60k8J95j58p1
6478a2J45l11rJ35J61J1qj66J72N8l75K81k6NK90l3n14KL84q3J22m65L25j2R7
6503A74m8N7k92q6K07J30l15J05j16L54j2p7j38q9K82j87o4q7K59Qj29k3OO6J00
6528H5j56p3J93j24M2k77L16m0j63K64Mj34p4PO5J68lk05K9L30m8k83Q6j28J55
6553C6m04L02Nj66L06q8N6k02M8K45j71K17O4l14k00N25k97j53L89j74k17M52
6575B59k56j2M12k56p0j16k3Q2l0m5q3mL26j01j75pN4K37n3k3j67k1J17j01j29
6600a85J94j67J92k59J97k18J68j38L17j67J63k86K83j68j87K45q2kK17j54j95
6621b32K65O0k03K68L0m43L04K06k20j8J29l86K32R6k23K40q3N7M9k03j19M4J78
$$ plain form
6644 28 163 -165 -60 180 313 -11 -211 54 46 149 -81 33 -145 295 -24 -166 -83 38 195 284 -58 -14
6666 -14 92 174 -128 -298 -34 -130 68 167 121 -107 -95 -171 31 -112 -160 -91 -68 94 114 80 -240 165 338 214
6690 214 -267 -146 216 15 231 -15 -80 1 -67 39 -79 -233 -130 285 -120 185 -221 -25 -71 63 106 -301
6712 -301 -127 126 -57 -47 -172 80 118 147 61 -159 -134 -4 407 112 298 -81 318 -136 -93 50 -40 -92 -104
6735 -104 136 91 8 -53 143 196 -82 203 502 151 -151 -89 -34 249 18 -96 142 -40 135 151 135 -172 -75
6758 -75 71 -81 27 -17 78 117 -90 -200 25 148 110 -5 -162 -13 -48 94 -185 -260 260 240 67 73 110 -212
6782 -212 241 270 -107 6 -80 123 13 -160 161 -204 65 116 47 -194 75 50 72 24 -156 -335 -3 178
6804 178 75 -7 -238 63 63 56 67 -269 -16 66 -7 -205 -13 147 -106 209 -105 -195 -11 288 150 244 -262
$$ packed form
6644B8J35l28J05K40J33l24k00K65qJ03k30J14j78M40l19j42Q3J21J57Q9l42M4
6666a4J06Q2l02j70K64r6J98R9m6k28J2p6K02j43m8O9K3J62K0l4l20M05J73j24
6690B14m81J21L62k01K16k46o5Q1o8J06j18j54J03M15m05L05m06J96m6J34M3m07
6712c01J74K53j83J0j25K52L8K9q6k20K5J30M11k95J86l79L99m54M3J43r0n2j2
6735a04K40m5q3o1J96N3k78K85K99l51l02O2N5K83k31j14K38j82J75J6j6l07R7
6758g5J46j52J08m4R5L9k07j10K25J23l8j15j57J49l5J42k79p5N20k0j73OL7l22
6782b12M53K9l77J13q6K03j10j73L21l65K69N1o9k41K69k5K2m8j80j79L32J81
6804A78j03q2k31L01%pJ1l36K53Q2p3j98J92J60k53L15l14r0J84K99j38R4n06
$$ plain form
6827 -262 16 -82 -11 -134 -30 2 49 -121 -18 -152 381 78 -82 -230 -392 -226 -93 -65 -291 -52 -158 325
6849 325 76 -162 -198 180 -45 -54 -115 -202 -1 123 108 148 107 164 -89 48 74 59 -58 164 -33 6 -53 -111 210
6874 210 -58 72 -310 94 23 340 -40 -136 187 -109 72 19 -90 108 79 110 70 3 -198 105 -97 -159 17
6897 17 55 -222 235 83 -145 92 -113 61 -311 -25 -119 57 57 24 -22 -87 35 -177 26 -182 -184 -15 -36 -16
6921 -16 64 -167 68 18 238 -22 -151 177 -82 -9 -49 -95 -70 137 -164 222 21 -128 264 -89 -81 -135 242
6944 242 50 -18 25 -92 295 -136 -35 -60 41 86 202 138 21 -283 -15 13 136 -14 -146 133 30 -105
6966 -105 -117 138 -10 -23 39 -40 126 -30 170 -75 -168 112 -171 75 -142 -118 167 184 -272 -17 -37 10 70
6989 70 116 -48 -81 175 50 -6 -141 -122 133 201 47 -133 8 -147 -158 16 -56 107 79 -33 6 -41 75 118
$$ packed form
6827b62K78r8P1j23J04L2M7j70J03j34N33l03j60j48j62J66J33K8k26K39j06M83
6849C25k49k38l6L78k25ro1q7K01J24j5M0m1N7k53J37K6j5j17K22j97L9n9n8L21
6874B10k68J30l82M04p1L17l80r6L23k96J81n3j09J98k9L1m0o7k01L03k02o2J76
6897A7L8k77M57j52k28K37k05J74l72K86r4J76%l3m6o5J22k12K03k08kJ69k1K0
6921a6Q0k31K35n0K20k60j29L28k59P3m0m6K5K07l01L86k01j49L92l53Qn4L77
6944B42j92o8M3j17L87m31J01k5J01M5J16o4j17l04K68K8J23j50j32K79j03j35
6966a05j2K55j48j3O2p9J66j56K00k45r3K80k83K46k17K4K85J7m56K55k0M7O0
6989G0M6j64l3K56j25n6j35J9K55O8j54j80J41j55j1J74p2J63k8j12L9m7J16M3
$$ plain form
7013 118 110 17 -175 59 21 343 -220 166 -99 -123 9 -84 -101 96 -249 -76 185 -175 -52 -190 52 -22 -30
7036 -30 69 -31 -73 147 33 -30 305 -41 -155 120 -74 -92 -19 90 -54 122 -79 290 15 24 -134 -179 -172 85
7060 85 -258 11 127 94 -251 -194 -197 -273 262 72 28 -171 -292 97 89 63 -125 -114 129 -78 56 52 94 5 93
7085 93 -17 66 255 169 -70 77 -100 -39 91 282 98 -53 -124 124 108 156 -194 -75 256 50 -212 -172 -505
7108 -505 -24 -84 246 -20 91 -114 315 -200 -167 -33 -265 173 -76 -153 62 228 -125 -156 -17 55 48 -234
7130 -234 308 -490 -100 -40 -128 130 57 151 -115 53 -35 -198 172 -30 -55 -24 -16 -11 54 92 -273 27 86 240 359
7155 359 -227 -152 -54 299 151 28 264 -108 -240 248 -209 58 110 142 20 204 -10 206 -67 101 -197
7176 -197 310 79 183 49 -8 97 132 -120 124 -59 -125 282 61 -267 -52 58 -16 115 147 11 49 37
$$ packed form
7013A18qr3j92K34l8L22n63L86k65k4J32r3j7J97l45J73K61l60J23j38K42p4q
7036c0R9j00m2K20j14o3L35l46j14K75j94j8P3J09j44J76k01L69k75Rj58m5PK57
7060H5l43K69J16l3l45N7lp6N35j90m4j99j21L89qk6j88J1K43k07J34mM2q9Q8
7085I3j10Q3J89q6k39J47j77O1J30J91j84j51p1K48j6M8l50J19L31k06k62M0l33
7108e05M81o0L30k66J11k05M29n15L3J34k32M38k49p7K15J66l53l1J39P2pk82
7130b34N42p98L90O0q8K58p3R4k66J68q8j63L70k02k5L1QNO5L8l65L00N9J54J19
7155C59n86P5R8L53j48j23K36l72j32M88m57K67N2L2j22J84k14K16k73J68k98
7176a97N07k31J04j34n7J05L5k52K44j83o6M07k21l28K15J10p4J31L2j36L8j2
$$ plain form
7198 37 185 -147 99 38 -15 99 -108 221 -263 -124 -28 -107 -37 -232 91 -235 4 124 -47 107 89 -103
7220 -103 78 -296 -41 -4 -61 -68 -127 51 122 -4 125 -217 135 -105 76 51 -171 31 15 107 248 -20 77
7243 77 270 107 13 -168 -60 219 55 146 72 -68 286 14 26 -96 137 90 -66 71 -290 69 177 90
7265 90 -52 -29 -113 -141 328 -253 -239 -168 -66 -14 -280 -1 9 -53 43 -75 -125 -178 -41 -11 58 -73 201 226 279
7290 279 -190 -83 -5 -208 82 -117 -238 -83 112 -52 -111 -382 46 -91 -8 -114 167 -199 -51 -94 -202
7311 -202 -116 157 145 -56 53 23 271 317 152 63 -8 -34 98 93 -76 -77 164 -1 73 -109 149 -30 8 13 -71
7336 -71 89 -70 -57 132 49 6 11 163 60 -155 -142 172 -65 181 -137 -127 -268 -15 -181 -216 8 -39 -89 17
7360 17 -117 -203 -59 4 -68 205 -108 -67 -81 -69 170 -195 -6 -77 166 60 -24 16 83 -187 16 -49 -197 221
$$ packed form
7198C7J48l32K46o1n3J14k07L29m84J39R6p9P0j95L23l26K39J20j71J54j8j92
7220a03J81l74K55L7n7pn9J78P1j26J29l42L52k40J81k5k22K02j6R2J41k68R7
7243G7J93j63r4j81J08K79j64R1p4j40L54k72J2j22K33m7j56J37l61L59J08q7
7265I0j42K3q4k8M69n81J4P1J02N2k66K79J0o2R6j18n0n3J37L0O9j31K74K5N3
7290B79m69J07P8k03K90j99j21J55J95j64n9k71M28j37Q3j06K81l66J48m3j08
7311b02Q6K73j2k01J09l0K48M6j65q9p1k6J32nj69jK41j65P4j82K58j79L8Nq4
7336g1J60j59J3J89q3m3NJ52j03k15J3L14k37K46l18J0j41K53j66l5K24m7n0J06
7360A7j34q6J44O3p2K73l13M1j4J2K39l65J89p1K43j06q4M0O7k70K03o5j48M18
$$ plain form
7384 221 -21 -123 67 39 -36 60 213 69 24 280 22 -89 17 96 64 146 -88 -89 -111 407 96 141 -89 -249
7408 -249 258 -125 45 -30 -64 163 16 132 -82 -134 -364 -107 41 -77 195 2 108 19 29 147 38 3
7430 3 -151 -191 -212 -48 211 16 -115 -119 -27 -21 -148 -194 -53 -274 237 36 -74 170 -11 44 152 -149 49 104
7454 104 313 90 21 -58 -40 66 -103 -86 58 -82 162 177 78 -227 33 75 115 -152 113 -110 42 3 53
7477 53 151 25 81 53 164 -40 47 -14 -119 5 57 158 76 206 112 -130 -54 -25 -168 -107 38 -59 82 -179
7501 -179 -50 -144 -149 -250 290 -192 246 91 25 170 -70 70 112 -4 61 -8 -303 -180 92 62 -49 -158 -6
7524 -6 -26 119 -191 -86 -126 -29 160 176 -111 -13 -160 -67 -130 115 -156 -19 20 68 46 42 181 -67 208 2 -122
7549 -122 -32 45 -160 -170 88 31 -71 -187 123 -106 -175 -7 -132 -71 96 77 -140 175 -22 27 239 -27 -144
$$ packed form
7384B21k42j02J90k8p5R6J53j44m5K56k58j11J06P9l2Q2k34jk2N18l11M5k30j60
7408b49N07l83J70p5l4K27j47J16k14n2k30K57J48j18K72j93J06q9J0J18j09l5
7430Cj54m0k1J64K59j95j31mR2Oj27m6J41k21N11k01j10K44j81N5J08l01J98N5
7454A04K09k23o9p9J8J06j69J7J44j40K44J5r9l05K60M2M0k67K65k23J52l9N0
7477E3R8j26N6k8J11k04Q7o1j05J24N2J01q2J30r4k42P6K9j43O1J45r7J41k61
7501a79J29r4nj01N40m82M38j55o6J45k40J40M2j16O5o9k95J23K72l0j11j09J52
7524fk0J45l10J05m0R7J89J6k87R8j47R3o3K45k71J37L9M8k2mJ39k48K75k06j24
7549a22R0P7k05j0K58n7j02j16L10k29o9J68j25O1J67j9k17L15j97M9K12k66j17
$$ plain form
7572 -144 74 -107 38 190 -19 247 95 245 142 -53 121 -94 -15 193 26 -57 42 29 -118 44 -248
7593 -248 172 8 -16 260 19 -71 64 154 -6 -10 -131 101 399 -36 -44 -9 59 -20 10 -10 -107 198 134 -161 175
7618 175 -2 38 331 -218 -127 -61 -48 202 57 190 -158 173 86 -9 -84 224 -134 -240 -137 71 -327 63
7640 63 17 -31 -110 -18 -96 257 96 119 -257 -108 80 33 -158 -150 196 -191 -34 94 -2 140 -165 -101 -140 -120 -126
7665 -126 87 15 -228 146 -91 151 -112 -34 26 73 210 170 -213 -142 58 31 -145 -129 159 190 158 131 -135 -74
7689 -74 155 178 -60 -49 70 -17 46 -27 -243 -50 26 -131 -181 96 -39 138 -88 -185 298 -175 -195 174 -131
7712 -131 -72 -23 -128 202 211 141 13 -70 142 -91 53 408 61 4 -92 113 -209 -86 -34 -97 104 -98 146
7735 146 -134 -153 13 -37 64 97 -98 99 -89 15 -15 -24 -75 -212 -6 81 104 -133 10 54 -118 -157 -58 -1
$$ packed form
7572a44K18j81J45J52k09K66j52J50j03j95J74k15P9K08j67q3R9j3j47J62k92
7593b48M20j64k4K76k41r0J35R0j60mj21K32K98m35qL5O8p9L0k0r7L05o4k95L36
7618A75j77M0K93n49R1O6J3K50j45J33l48L31q7r5p5L08l58j06J03K08l98L90
7640F3m6m8p9R2p8L53j61K3l76J49J88m7j91QL46l87J57J28r6J42l05O4l9K0o
7665a26K13p2k43L74k37K42k63P8O0M7J37m0l83P1K00k7j76J6K88L1l2k7k66O1
7689g4K29K3k38J1J19q7O3p3k16J93P6j57n0K77j35J77k26r7M83m73k0L69l05
7712a31N9M9j05L30Rp0j28q3K12k33J44L55l47n7r6K05l22J23N2o3K01k02K44
7735A46k80j9J66n0J01L3j95J97j88J04l0rn1j37K06Q7K3k37J43M4j72l9R9N7
$$ plain form
7759 -1 -65 169 328 -106 -17 284 16 4 7 -188 -163 22 -307 56 -79 106 66 -63 66 -260 -27 -222 21
7782 21 127 -91 87 251 39 150 -40 -482 55 -163 182 -280 155 27 -27 40 99 238 -73 -206 134
7803 134 67 -197 128 -24 -409 -75 142 76 -169 33 2 -192 4 73 58 -130 209 39 -90 -165 22 138
7825 138 7 -79 -154 -198 31 -290 -199 -43 -15 43 127 94 -26 36 130 171 -118 236 -263 24 113 273 -130 7
7849 7 -159 -152 -15 102 176 -154 65 150 -91 148 -36 41 -113 183 61 -7 -219 49 73 -81 96 93 116 -19
7873 -19 -307 25 37 25 -92 -29 101 93 -57 -55 45 -17 103 -176 -260 -63 168 103 12 -28 -35 142 -51 -34 -26 220
7899 220 -17 -39 50 -154 158 -5 -154 -69 -88 166 -85 96 -152 53 -32 50 15 16 -332 -82 -167 -243 187 172
7923 172 -46 188 200 -23 -24 -235 138 217 286 -233 87 131 96 173 -131 350 -74 80 107 -84 -92 227 19 88
$$ packed form
7759ao4K34J59m34Q9L01k68j2Lj95K5J85l29L63j35J85m0j29J29l26K33j95K43
7782B1J06k18J78J64k12J11j90m42N37k18L45m62M35j28n4O7N9J39l11j33L40
7803A34o7k64L25j52l85L34K17o6k45K02l1j94J96O9j5j88L39j70j29p5J87J16
7825A38j31q6p5m4K29l21R1J56K8N8Q4l3j20O2R4M1k89L54m99K87Q9J60m03J37
7849Gj66PJ37J17P4l30K19Q5k41K39j84P7j54K96j22o8k12K68K4j54J77lK3j35
7873a9k88L32J2j2j17O3J30qj50KJ00o2J20k79q4J97K31o5r1m0pJ77j93J7QK46
7899B20k37k2Q9k04L12j63j49Q5j9K54k51J81k48K05q5Q2l5Jl48K50q5p6M30j5
7923A72k18K34J2k23jk11L73P9O9n19L20M4l5P7l04M81m24J54K7j91qL19k08O9
$$ plain form
7947 88 -137 -107 86 50 127 -172 221 84 175 44 73 -45 121 -116 -54 -8 54 -178 -81 71 -85 -133 96 -169
7971 -169 -71 -13 -77 109 -35 42 -96 0 -225 42 -74 -136 -123 86 -21 -57 54 140 39 -20 141 43 -75 -127
7995 -127 -1 264 -13 -158 -43 -77 399 201 7 -97 223 230 31 -63 -66 -107 -90 -6 150 -60 -174 34 33 67
8019 67 -50 72 -33 24 -2 86 57 -34 170 -195 119 72 -216 -60 -330 78 196 211 -227 -87 5 11 -64 -312
8043 -312 -33 -159 -74 -224 -118 -146 -4 178 192 -231 -108 216 144 10 116 80 -296 222 267 -111 152 13
8065 13 52 207 -51 -136 -16 182 25 -118 -189 73 84 -78 -176 20 302 4 -48 158 -27 150 -92 64
8087 64 -149 -126 -15 -71 205 -91 50 128 -9 58 49 -113 -180 13 135 -185 12 -159 -55 1 134 -71 76
8110 76 -280 197 -166 -77 115 47 48 -36 -40 -178 -117 47 -52 -118 207 168 105 9 -231 -206 -71 -83 203 -138 -1
$$ packed form
7947H8k25L0J93l6P7k99L93j37R1j31K9j18J66k37O2M6O2k32R7J52j56m8K29k65
7971a69R8N8o4J86j44P7j38R6k25K67j16o2J3K09j07l6J11Q6j01n9J61r8j18n2
7995a27J26K65k77j45J15l4M76j98j94j04L20Pj99r4lm1J7Q4J56k10j14K08jL4
8019F7j17J22j05N7k6Q8k9r1K04l65L14m7k88J56k70M08J18J5m38J40R2Op5k48
8043c12K79j26Q5j50J06k8J42J82J4m23J23L24p2j34J06l6l76N18M5l78K63j39
8065A3L9J55k58q5J20J98j57j43p1K62J1j62r8J96K82k98n2K06j85J77k42J56
8087F4k13K3J11n6K76k96J41P8j37O7rj62o7J93J22l20J97j71J04N6J33k05J47
8110G6l56M77l63Q9J92o8Jq4mj38O1J64r9o6L25l9o3r6k40K5J35j2K86l41J37
$$ plain form
8135 -1 -67 -100 58 459 -27 80 308 -17 74 15 110 100 -149 164 -129 -70 206 35 -172 74 -40 57 81 -229
8159 -229 92 95 78 128 24 -26 -103 -35 185 -111 249 -39 206 258 -185 106 76 58 -155 150 77 -151 -102 -13
8183 -13 153 90 22 7 98 -110 -262 226
$$ packed form
8135ao6l3J58M01m86J07K28l25R1n9R5j0k49L13k93N9K76j71k07K46j14R7K4l10
8159b29L21Lj7N0j04n0p7O8K20k96L60k88K45N2m43K91l0j8k13L05p3k28M9Q9
8183a3J66o3o8j5R1k08j52M88
8191B26
$$ Imaginary data points
##PAGE= N=2
##DATA TABLE= (X++(I..I)), XYDATA
$$ plain form
0 0 0 0 0 0 0 0 0 0 0 8 -8 8 -8 16 -18 24 -32 40 -48 56 -72 80 -96 116 -136 159 -186 217 -249 285 -328
31 -328 375 -425 483 -547 617 -692 778 -871 971 -1082 1204 -1336 1482 -1640 1812 -2002
47 -2002 2209 -2433 2681 -2954 3254 -3584 3953 -4364 4826 -5349 5945 -6635 7442 -8401
61 -8401 9563 -11007 12861 -15331 18819 -24165 33497 -54687 211298 -132800 -343832 28971
73 28971 91202 238941 17787 -232812 -156280 169500 229880 68496 -272388 -174722 143315
84 143315 299874 -16575 -335366 -49063 185854 145828 -50715 -207530 -74775 153826
94 153826 124084 -86947 -102995 -107771 138824 145031 -153426 -107807 6060 29562 100749 19568
106 19568 -202604 -35554 147683 62649 -63079 -119582 914 50190 128193 -35877 -196257
$$ packed form
0@%%%%%%%%%Qj6J6j6K4l4M2n6P2q8J04j28J52j76K12k52K95l45M03m66N34o13
31c28P03q00R08j030J164j309J470j649J842k053K286k540K818l122L452l814
47b002M211m642N114n635O208o838P537q317R190j0175J1294j2580J4077j5843
61h401J7964k0570K3868k8192L4150m2984N7662q8184K65985l44098k11032L72803
73B8971O2231J47739k21154k50599P6532L25780O0380j61384l40884R7666L18037
84A43315J56559l16449l18791K86303K34917m0026j96543j56815J32755K28601
94A53826k9742k11031j6048m776K46595O207k98457M5619J13867K3502P1187q1181
106A9568k22172J67050J83237q5034j25728n6503J20496M9276P8003j64070j60380
$$ plain form
117 -196257 11989 100350 60468 9338 -116575 -105131 149252 104569 -53871 -78559 -108824
128 -108824 78169 158367 -4993 -161722 -77443 87516 130014 21818 -156647 -70692 88412
139 88412 126509 -11874 -120318 -67894 35551 153258 10768 -148120 -56674 75670 86160
150 86160 41709 -96547 -126781 104933 110878 -12603 -100311 -84799 96991 113091 -33585
161 -33585 -107269 -12538 60695 66160 20609 -70448 -84428 47067 144787 -30414 -118063 -35535
173 -35535 65792 122566 -26787 -130896 -23077 93994 60323 8939 -80209 -94350 73139
184 73139 109315 8191 -112693 -73421 80463 110899 4588 -106656 -62551 57746 113098
195 113098 9106 -94290 -84625 45843 135094 -10816 -81389 -56251 24516 123348 33993
$$ packed form
117a96257K08246Q8361l9882n1130j25913J1444K54383m4683j58440k4688l0265
128a08824J86993Q0198j63360j56729Q4279J64959M2498j08196j78465Q5955J59104
139H8412L8097j38383j08444N2424J03445J17707j42490j58888R1446J32344J0490
150H6160m4451j38256l0234K31714N945j23481q7708J5512J81790J6100j46676
161c3585p3684R4731P3233N465m5551r1057j3980J31495R7720j75201q7649Q2528
173c5535J01327N6774j49353j04109J07819J17071l3671n1384q9148j4141J67489
184G3139L6176j01124j20884L9272J53884L0436j06311j11244M4105J20297N5352
195A13098j03992j03396R665J30468Q9251j45910p0573K5138Q0767R8832q9355
$$ plain form
206 33993 -104703 -69563 59174 80758 36435 -79298 -82801 48499 90268 28486 -87084
217 -87084 -53721 39922 79965 27741 -80397 -70672 41501 96358 -8279 -64660 -59315 32285
229 32285 95579 -8648 -64266 -58956 31413 93023 13323 -107124 -63949 58219 70233 19963
241 19963 -97317 -68981 39602 91565 22432 -104507 -60271 34136 85152 17899 -84702
252 -84702 -94301 35524 104850 6261 -65156 -96400 28303 103829 20430 -71227 -83416 20967
264 20967 82189 38473 -80406 -67138 12041 75249 52769 -69815 -67425 2962 90619 36334
276 36334 -66809 -56779 13241 67315 29615 -35796 -78336 29794 77215 21758 -37053 -69963
288 -69963 28467 72567 29598 -57981 -57667 21954 76985 32129 -68567 -44979 13783 87942
$$ packed form
206C3993j38696L5140J28737K1584m4323j15733l503J31300M1769o1782j15570
217h7084L3363R3643M0043n2224j08138R725J12173N4857j04637n6381N345R1600
229C2285O3294j04227n5618N310R0369O1610p9700j20447M3175J22168J2014n0270
241A9963j17280K8336J08583N1963o9133j26939M4236R4407N1016o7253j02601
252h4702r599J29825O9326r8589p1417l1244J24703P5526q3399r1657j2189J04383
264B0967O1222m3716j18879J3268P9179O3208k2480j22584K390P0387Q7657n4285
276C6334j03143J0030P0020N4074l7700o5411m2540J08130M7421n5457n8811l2910
288f9963R8430M4100m2969q7579L14P9621N5031m4856j00696K3588N8762P4159
$$ plain form
300 87942 32750 -62056 -54478 9613 88909 28933 -57547 -65646 23169 70030 38624 -47150
312 -47150 -85124 33867 71587 35684 -49469 -73070 9184 68164 45214 -52613 -66312 -2300
324 -2300 81030 35346 -47021 -56643 -9395 77383 32350 -40742 -66202 -6004 64623 37142
336 37142 -39294 -62875 9958 45565 44222 -40217 -65491 16767 51458 32483 -45526 -54546
348 -54546 3987 60937 31578 -41124 -55647 3831 72973 19017 -35781 -56809 -1621 70562
360 70562 27631 -42926 -64085 7490 64157 38303 -46919 -57922 8442 53850 49196 -48505
372 -48505 -67491 3526 61702 41990 -42858 -66405 -6616 67826 43006 -30978 -71441 -6562
384 -6562 66294 30828 -24268 -67353 -15281 59106 41591 -30102 -62959 -9887 51198 45889
$$ packed form
300H7942n5192r4806P578O4091P9296n9976q6480q099Q8815M6861l1406q5774
312d7150l7974J18991L7720l5903q5153k3601Q2254N8980k2950r7827j3699O4012
324b300Q3330m5684q2367r622M7248Q6778m5033p3092k5460O0198P0627k7481
336C7142p6436k3581P2833L5607j343q4439k5274Q2258L4691j8975p8009r020
348e4546N8533N6950k9359p2702j4523N9478O9142n3956n4798k1028N5188P2183
360G0562m2931p0557k1159P1575N6667k5854q5222j1003O6364M5408m654r7701
372d8505j8986P1017N8176j9712q4848k3547N9789P4442k4820p3984m0463O4879
384f562P2856l5466n5096m3085N2072P4387j7515p1693l2857N3072O1085n309
$$ plain form
396 45889 -31865 -52790 -14781 42686 47496 -35256 -54106 -8134 47413 37662 -27431 -54219
408 -54219 -9337 50102 34798 -22068 -62376 -4818 48243 26335 -17005 -57249 -8036 53719
420 53719 39637 -29272 -53884 -2830 54486 42700 -33827 -47945 -11726 52186 48930 -32820
432 -32820 -50380 -7223 55141 46032 -20085 -58099 -10746 54832 47943 -14285 -65549 -5992
444 -5992 47205 44122 -5872 -57058 -13716 46777 49369 -17740 -49638 -17501 41476 43084 -15809
457 -15809 -41621 -29243 43165 45784 -16103 -44105 -17903 38080 36017 -11460 -54001 -11654
469 -11654 33353 35967 -13516 -54002 -3662 27329 36418 -10217 -49679 -15538 39527 36752 -26414
482 -26414 -44290 -17577 43572 31383 -18174 -45163 -23745 48944 34588 -17364 -49519 -14729
$$ packed form
396D5889p7754k0925L8009N7467M810q2752j8850M5972N5547r751o5093k6788
408e4219M4882N9439j5304n6866m0308N7558N3061k1908m3340m0244M9213O1755
420E3719j4082o8909k4612N1054N7316j1786p6527j4118L6219O3912l256q1750
432c2820j7560M3157O2364r109o6117l8014M7353O5578o889o2228n1264N9557
444e992N3197l083m9994n1186M3342O0493K592o7109l1898L2137N8977J608n8893
457a5809k5812J2378P2408K619o1887k8002K6202N5983k063m7477m2541M2347
469a1654M5007K614m9483m0486N0340L0991R089m6635l9462L4141N5065k775o3166
482b6414j7876K6713O1149j2189m9557k6989K1418P2689j4356n1952l2155L4790
$$ plain form
494 -14729 35272 38781 -12438 -57730 -12350 32929 46940 -16119 -51050 -13802 28718 47609
506 47609 -10284 -49895 -26150 41404 37468 -12545 -42191 -24305 40280 34629 483 -45565
518 -45565 -24075 38153 38515 -4730 -43910 -16244 25387 47230 -8802 -43830 -12653 29617
530 29617 46232 -14016 -34968 -17816 27978 40806 -6000 -42277 -20969 39578 32668 -3249
542 -3249 -43801 -16954 35759 36621 32 -52107 -19971 32361 41154 -9268 -44245 -23290 24629
555 24629 49568 -9760 -41461 -25652 28702 45101 -6366 -38830 -30412 25060 43041 4196
567 4196 -48367 -23975 28587 35552 6678 -43155 -20279 19747 39161 6533 -42176 -23487
579 -23487 22463 40158 1436 -28753 -27557 22327 42693 117 -30224 -25422 25417 34009 1791
$$ packed form
494a4729N0001L509n1219m5292M5380M5279J4011o3059l4931L7248M2520J8891
506D7609n7893l9611K3745O7554l936n0013k9646J7886O4585n651l4146m6048
518d5565K1490O2228L62m3245l9180K7666M1631K1843n6032l5028L1177M2270
530B9617J6615o0248k0952J7152M5794J2828m6806l6277K1308O0547o910l5917
542c249m0552K6847N2713Q62l6589n2139L2136N2332Q793n0422l4977K0955M7919
555B4629K4939n9328l1701J5809N4354J6399n1467l2464Q418N5472J7981l8845
567D196n2563K4392N2562O965k8874m9833K2876M0026J9414l2628m8709J8689
579b3487M5950J7695l8722l0189J196M9884K0366m2576l0341M802N0839Q592l2218
$$ plain form
592 1791 -30339 -24178 20777 38957 6110 -40274 -14360 21824 33494 4967 -38122 -20081
604 -20081 18472 38125 957 -39954 -24911 24829 36123 565 -31363 -32978 23316 38055
616 38055 -1291 -35525 -29728 20376 32397 3364 -34851 -30253 14122 40331 4259 -40844
628 -40844 -23788 10489 34632 6242 -35395 -28885 11596 38090 4784 -32329 -27669 14732
640 14732 31902 9129 -27026 -34799 15787 32146 5080 -27985 -25447 14292 30904 9176
652 9176 -27114 -23572 12534 37822 4098 -30759 -16736 9059 35098 7167 -27936 -22587 14945
665 14945 37515 5521 -27451 -23235 17002 31211 11504 -28076 -29067 19404 31772 9626 -27857
678 -27857 -22126 14115 33978 12642 -29871 -25470 10776 40289 5817 -27080 -23976 5491 37890
$$ packed form
592A791l2130O161M4955J8180l2847m6384K5914L6184J1670k8527m3089J8041
604b0081L8553J9653l7168m0911J5043M9740J1294l5558l1928j615N6294J4739
616C8055l9346l4234N797N0104J2021k9033l8215M598M4375K6209l6072m5103
628d0844J7056L4277K4143k8390m1637O510M0481K6494l3306l7113M660M2401
640A4732J7170k2773l6155p773N0586J6359k7066l3065K538L9739J6612k1728
652I176l6290L542L6106K5288l3724l4857J4023K5795K6039k7931l5103N349L7532
665A4945K2570l1994l2972M216M0237J4209j9707l9580r91M8471J2368k2146l7483
678b7857N731L6241J9863k1336m2513M401L6246K9513l4472l2897L104K9467L2399
$$ plain form
691 37890 10295 -24792 -29096 11766 33438 10393 -25737 -28022 10034 26907 18299 -28343 -28262
704 -28262 10709 26947 13554 -24479 -22286 3642 29763 9048 -23894 -26357 6495 33010
716 33010 2731 -18345 -25900 6351 30453 9428 -22225 -27449 11786 25171 10610 -26300
728 -26300 -23185 7489 27319 16580 -30291 -22704 8894 31060 10217 -23193 -25140 4552 34719
741 34719 9127 -20949 -31562 10091 33133 9990 -16408 -31548 6071 29963 17168 -23168
753 -23168 -26863 5045 26659 17045 -22677 -22103 -1464 30760 17305 -22411 -23847 -205 27510
766 27510 10905 -14632 -29013 852 26034 11649 -15546 -29714 7512 22802 13555 -16312
778 -16312 -27742 584 24878 15724 -22534 -21989 -1516 25574 12642 -18857 -21350 -2657 30187
$$ packed form
691C7890k7595l5087m304M0862K1672k3045l6130k285L8056J6873q608m6642Q1
704b8262L8971J6238j3393l8033K193K5928K6121k0715l2942k463L2852K6515
716C3010l0279k1076p555L2251K4102k1025l1653n224L9235J3385j4561l6910
728b6300L115L0674J9830j0739m6871P587L1598K2166k0843l3410j947K9692L0167
741C4719k5592l0076j0613M1653K3042k3143k6398j5140L7619K3892j2795m0336
753b3168l695L1908K1614r614l9722N74K0639L2224j3455l9716j436K3642K7715
766B7510j6605k5537j4381K9865K5182j4385k7195j4168L7226J5290r247k9867
778a6312j1430K8326K4294r154l8258N45K0473K7090j2932l1499k493J8693L2844
$$ plain form
791 30187 11919 -19180 -24792 2419 25306 13658 -13619 -28874 4354 24566 17359 -16884
803 -16884 -25630 5221 22169 18078 -15554 -25067 -1675 28464 17465 -15068 -20856 -2746 28135
816 28135 15855 -10293 -23478 -2524 27853 15370 -12416 -23946 1194 21518 19284 -10724
828 -10724 -24708 1391 21184 19067 -14582 -22050 -260 20344 16893 -12561 -23588 -3395 25573
841 25573 13599 -11154 -21871 -3843 22648 12454 -10395 -24986 -2869 22312 13114 -13654
853 -13654 -23356 -1417 18909 18195 -13676 -24990 -2881 19072 16531 -15460 -22752 -4646 19406
866 19406 16063 -11550 -25322 -5074 23667 14077 -9541 -24965 -6510 20396 15292 -7893 -25942
879 -25942 -4584 20183 16069 -9591 -21800 -4909 17226 20315 -10816 -21647 -5802 18136
$$ packed form
791C0187j8268l1099n612K7211K2887j1648k7277j5255L3228K0212p207l4243
803a6884q746L0851J6948m091l3632r513K3392L0139j0999l2533n788J8110L0881
816B8135j2280k6148j3185K0954L0377j2483k7786j1530K5140K0324k234l0008
828a0724j3984K6099J9793k117l3649p468K1790K0604l451k9454j1027K0193K8968
841B5573j1974k4753j0717J8028K6491j0194k2849j4591K2117K5181r198k6768
853a3654r702K1939K0326p14l1871j1314K2109K1953k541l1991p292J8106K4052
866A9406l343k7613j3772K0248K8741r590k3618j5424J8455K6906n104k3185j8049
879b5942K1358K4767m114k5660j2209J6891K2135L089l1131j0831J5845K3938
$$ plain form
891 18136 18083 -9855 -18281 -6268 18621 17782 -6152 -21683 -4305 20256 13780 -4750 -22377
904 -22377 -4055 17250 15990 -5708 -22087 -1985 17603 16982 -9415 -18767 -5647 17461 19762
917 19762 -10993 -19963 -7411 19734 16484 -7755 -19238 -7593 18259 15736 -5288 -24560 -4846
930 -4846 16180 15037 -3754 -23695 -4792 13559 18953 -5228 -21026 -5642 14621 16793 -7740
943 -7740 -16818 -10856 17158 16925 -6393 -17515 -8900 18187 14774 -1885 -18771 -6632 14730
956 14730 16200 -3418 -21891 -2176 12811 17775 -4656 -19249 -4757 14200 19450 -6807 -17228
969 -17228 -7023 17155 14814 -5334 -16786 -10418 19670 15340 -3294 -20666 -7311 16342 15438
982 15438 -2149 -21365 -7235 11645 19908 -5877 -20551 -5817 10833 20394 -4890 -18417
$$ packed form
891A8136n3k7938q426J2013K4889q39k3934j5531J7378K4561o476j8530j7627
904b2377J8322K1305j260k1698j6379K0102J9588o21k6397r352J3120K3108K301
917A9762l0755q970J2552K7145l250k4239j1483J1645K5852k523k1024j9272J9714
930d846K1026j143j8791j9941J8903J8351N394k4181j5798J5384K0263K172k4533
943g740r078N962K8014k33k3318j1122Q615K7087l413j6659j6886J2139K1362
956A4730J470j9618j8473J9715J4987M964k2431j4593J4492J8957N250k6257j0421
969a7228J0205K4178k341k0148j1452O368L0088m330j8634j7372J3355K3653r04
982A5438j7587j9216J4130J8880Q263k5785j4674J4734J6650R561k5284j3527
$$ plain form
994 -18417 -11493 13469 17963 -4008 -19254 -12669 14267 12697 629 -20141 -12055 13922 15418
1007 15418 -1092 -20779 -9108 8920 16906 -1756 -17914 -10331 7991 19139 -4873 -15328
1019 -15328 -9415 9649 16280 -2627 -16084 -11977 12354 14157 -498 -17745 -8769 11510 13659
1032 13659 2902 -17930 -7779 11171 16681 -1259 -16352 -7555 9275 18194 -1174 -14122
1044 -14122 -10480 11698 18525 -2315 -13469 -9166 11563 16483 1453 -16984 -9841 12941 16663
1057 16663 2621 -16915 -7687 9346 16619 3258 -17389 -9136 9303 17020 -99 -14568 -10251
1070 -10251 8310 16986 1490 -13396 -12262 9736 14705 -16 -13314 -11391 7950 13665 1567
1083 1567 -16313 -10402 8740 14096 1098 -15611 -8857 5824 15124 1202 -16315 -9596 8063
$$ packed form
994a8417O924K4962M494k1971j5246O585K6936j570j2068k0770Q086K5977J496
1007A5418j6510j9687J1671J8028P986j8662j6158P583J8322J1148k4012j0455
1019a5328N913J9064O631j8907j3457M107K4331J803j4655j7247Q976K0279K149
1032A3659j0757k0832J0151J8950N510j7940j5093Q797J6830Q919j9368j2948
1044a4122L642K2178O827k0840j1154M303K0729M920j5030j8437P143K2782L722
1057A6663j4042j9536R228J7033P273j3361k0647Q253J8439P717j7119j4469M317
1070a0251J8561Q676j5496j4886J134K1998M969j4721j3298J923J9341N715j2098
1083A567j7880N911J9142N356j2998j6709O754J4681R300j3922j7517O719J7659
$$ plain form
1096 8063 14982 -1045 -13969 -11120 8264 15539 814 -14743 -12855 9948 14018 1063 -13185
1109 -13185 -11194 8067 15643 3205 -15690 -9724 7994 16213 2398 -14159 -9992 3686 17489
1122 17489 2819 -14289 -10238 6784 15433 2320 -11018 -12126 7158 14592 4090 -13299 -12448
1135 -12448 8273 12388 4052 -12269 -11011 5367 14945 3342 -14756 -9175 4535 15712 1610
1148 1610 -12404 -11304 2898 16824 1944 -12320 -11572 6211 12764 3017 -11803 -13455 6306
1161 6306 12687 5226 -14427 -11359 5813 11897 5956 -12219 -10701 2825 15837 2940 -12196
1174 -12196 -10205 3229 15505 2869 -8949 -13124 4228 16045 4868 -10131 -11564 5736
1186 5736 10900 7526 -10688 -11239 4941 12982 7253 -12190 -7925 3288 13651 5966 -9019 -10679
$$ packed form
1096H063O919j6027j2924K849J9384P275j4725j5557J888K2803M070j2955j4248
1109a3185J991J9261P576j2438j8895N966J7718Q219j3815j6557M167J3678J3803
1122A7489j4670j7108M051J7022Q649j3113j3338j108J9284P434j0502j7389Q51
1135a2448K0721M115q336j6321J258J6378R578j1603j8098N581J3710J1177j4102
1148A610j4014J100J4202J3926j4880j4264P48J7783O553r747j4820j652J9761
1161F306O381p461j9653L068J7172O084n941j8175J518J3526J3012j2897j5136
1174a2196J991J3434J2276j2636j1818m175J7352J1817j1177j4999j433J7300
1186E736N164l374j8214n51J6180Q041n729j9443M265J1213J0363p685j4985j660
$$ plain form
1200 -10679 2335 15829 2323 -7936 -10691 4008 13240 4533 -7185 -13110 5136 12356 6004
1213 6004 -10440 -9697 2621 10146 7164 -11642 -9842 1815 13526 4317 -11094 -9412 838
1226 838 13384 4253 -8525 -13793 2913 12917 2988 -8322 -13060 3481 10670 6250 -10342
1239 -10342 -13375 2198 11798 5763 -11196 -9562 -901 12238 6563 -9869 -10592 208 13583
1252 13583 4018 -7591 -11609 485 11583 6448 -7081 -13935 2662 10287 6336 -6935 -10881
1265 -10881 1478 10054 8033 -8828 -10152 1127 12336 5725 -7510 -8822 -1081 13219 6150
1278 6150 -7320 -10787 1740 11986 4759 -6686 -11348 1502 11403 8093 -7779 -12037 2396
1291 2396 10148 7489 -7213 -10766 -664 10870 7449 -8135 -11227 -255 11895 5952 -5612
$$ packed form
1200a0679J3014J3494j3506j0259k755J4699R232q707j1718n925J8246P220o352
1213F004j6444P43J2318P525k982j8806J800J1657J1711r209j5411J682J0250
1226H38J2546r131j2778n268J6706J0004r929j1310m738J6541P189m420j6592
1239a0342l033J5573R600o035j6959J634Q661J3139n675j6432p23J0800J3375
1252A3583r565j1609m018J2094J1098n135j3529o854J6597P625l951j3271l946
1265a0881J2359Q576k021j6861j324J1279J1209o611j3235j312P741J4300p069
1278F150j3470l467J2527J0246p227j1445m662J2850R901l310j5872m258J4433
1291B396P752k659j4702l553J0102J1534l421j5584l092J0972J2150n943j1564
$$ plain form
1304 -5612 -10957 -1981 12067 6683 -6258 -11579 -161 10020 6162 -5937 -11679 -591 10068
1317 10068 8827 -7424 -11354 -405 8876 7681 -5713 -10480 -2038 10846 7248 -6305 -10340
1330 -10340 -574 10687 6249 -4345 -11435 -1985 11285 6997 -5221 -10821 -270 9291 7829
1343 7829 -4077 -10442 -877 9893 9474 -6154 -9843 -1521 8410 9056 -4167 -9726 -3074 10403
1357 10403 7912 -3821 -9889 -2290 9768 6839 -2083 -11585 -2629 9468 7180 -3454 -10125 -1637
1371 -1637 6997 8413 -3839 -9750 -3184 7649 8117 -5831 -8329 -3932 7076 7009 -3421 -9379
1385 -9379 -4001 8354 5087 -2870 -10008 -1845 6450 5503 -2131 -11373 -1754 6743 7020 -4418 -8635
1400 -8635 -2306 5908 7530 -4559 -7791 -3406 8661 6764 -4454 -7659 -3108 8873 6673 -1679
$$ packed form
1304e612n345Q976J4048n384j2941n321J1418J0181l858j2099n742J1088J0659
1317A0068j241j6251l930J0949R281j195j3394m767Q442J2884l598j3553m035
1330a0340R766J1261m438j0594p090R450J3270m288j2218n600J0551R561j462
1343G829j1906o365R565J0770m19j5628l689Q322R931O46j3223n559O652J3477
1357A0403k491j1733o068P599J2058k929q922r502Q956J2097k288j0634o671Q488
1371a637Q634J416j2252n911O566J0833M68j3948k498M397J1008o7j0430n958
1385i379N378J2355l267p957p138Q163Q295r47p634r242R619Q497K77j1438m217
1400h635O329Q214J622j2089l232M385J2067j897j1218l205M551J1981k200q352
$$ plain form
1414 -1679 -10126 -1341 8320 6434 -2213 -9756 19 6548 8237 -2976 -9395 -736 7865 8562 -3768
1429 -3768 -7184 -3092 8341 7889 -2827 -8136 -3736 9737 6495 -1896 -8922 -3028 7788 7882 -1262
1444 -1262 -10718 -1826 6295 8002 -2661 -9146 -2688 5709 9078 -3512 -8924 -4153 7449 7127
1458 7127 -3004 -8299 -5193 7806 6675 -1223 -10033 -3393 7551 6364 -1151 -10052 -3576 5578
1472 5578 8771 -2123 -9806 -3525 5266 8654 -2449 -7296 -4725 6158 8724 -1677 -8040 -4795
1486 -4795 7001 7018 282 -8533 -4899 5823 7673 909 -9237 -3347 5077 7760 -475 -8007 -4032
1501 -4032 4677 8879 -1286 -7220 -4273 5388 7833 -802 -6370 -5177 5529 7306 -777 -8257
1515 -8257 -4078 5341 6539 741 -8552 -3995 4440 7627 24 -8721 -3327 3947 6567 -857 -7324
$$ packed form
1414a679q447Q785R661j886q647p543R775O529J689j1213o419Q659Q601O97j2330
1429c768l416M092J1433m52j0716n309M400J3473l242q391p026N894J0816R4r144
1444a262r456Q892Q121J707j0663o485O458Q397L369j2590n412M771J1602l22
1458G127j0131n295L106J2999j131p898q810O640J0944j187p515q901O476R154
1472E578L193j0894p683O281Q791L388j1103m847K571J0883K566j0401o363L245
1486d795J1796J7o736q815L634J0722J850o764j0146N890Q424K683q235p532L975
1501d032Q709M202j0165n934K947R661K445q635n568J193J0706J777q083p480
1515h257M179R419J198n798r293M557Q435L187p603q745N394P274K620p424o467
$$ plain form
1530 -7324 -4999 4644 8165 -1329 -7039 -5257 4608 6757 -409 -7113 -5775 4487 7101 -41 -8299
1545 -8299 -4218 4162 6747 1352 -7799 -4764 3682 7815 712 -7281 -4049 3406 7072 395 -5807
1560 -5807 -4851 4449 7497 221 -5710 -4746 4500 6605 1252 -5485 -4939 4372 6926 961 -6458 -2890
1576 -2890 3449 6785 1406 -6614 -3875 3474 7550 354 -5577 -3852 3608 7441 372 -5443 -5298
1591 -5298 4730 6541 -97 -5975 -4984 4160 5948 1232 -6749 -4589 3615 6754 581 -7167 -3670
1606 -3670 1892 7148 263 -7062 -5184 2417 7395 -558 -5724 -5323 2787 6065 586 -6318 -6153
1621 -6153 4055 5523 1212 -6816 -5210 2801 6183 2165 -7354 -4849 1973 7138 604 -5952 -4483
1636 -4483 1510 7781 611 -5187 -5689 3557 7189 1172 -4842 -5259 3018 5633 2999 -6153 -4918
$$ packed form
1530g324K325R643L521r494n710J782R865K149p166o704J338J0262K614p142q258
1545h299M081Q380K585n395r151L035Q446M133p103p993L232P455L666o677o202
1560e807R56R300L048p276n931R64R246K105n353o737N46R311K554n965p419L568
1576b890O339L336n379q020K739P349M076p196n931J725P460L833p069n815J45
1591e298J0028J811o638n878R91R144J788m716p981K160Q204L139o173p748L497
1606c670N562N256o885p325J878P601M978p953n166M01Q110L278n479o904J65
1621f153J0208J468m311q028J606Q011L382m018r519K505O822N165o534o556J469
1636d483N993O271p170n798n02R246L632o017o014m17Q277K615k634r152J235
$$ plain form
1651 -4918 3374 5625 2512 -6015 -3609 1691 7010 2498 -5677 -4556 2119 7357 725 -3673 -5762
1666 -5762 1866 6991 1721 -4567 -6040 3187 5200 2680 -5367 -5251 1583 5567 3098 -6396 -4210
$$ packed form
1651d918Q292K251l113q527K406N300N319m512q175J121O675N238o632m398k089
1666e762P628N125n270o288j473R227K013k520q047J16O834L984k469r494K186
$$ [...]
8191B23
##END NTUPLES=NMR FID
##END=
