##TITLE=1H_Pr Tac 5-8
 CDCl3
 8 sc, 
 17.10.2022
##JCAMPDX= 6.0         $$ Bruker NMR JCAMP-DX V2.0
##DATA TYPE= NMR FID
##DATA CLASS= NTUPLES
##ORIGIN= UXNMR, Bruker Analytische Messtechnik GmbH
##OWNER= root
$$ XWIN-NMR		Version 3.5
$$ Mon Oct 17 16:00:48 2022 Russian Standard Time (UT+4h)  she@DPX200
##.OBSERVE FREQUENCY= 200.1313499994
##.OBSERVE NUCLEUS= ^1H
##.DELAY= (6, 6)
##.ACQUISITION MODE= SIMULTANEOUS
##.ACQUISITION SCHEME= undefined
##.AVERAGES= 8
##.DIGITISER RES= 18
##SPECTROMETER/DATA SYSTEM= spect
##.PULSE SEQUENCE= zg30
##.SOLVENT NAME= CDCl3
##.SHIFT REFERENCE= (INTERNAL, CDCl3, 0, 15.7039)
##AUDIT TRAIL= $$ (NUMBER, WHEN, WHO, WHERE, WHAT)
$$ ##TITLE= Audit trail, XWIN-NMR		Version 3.5
$$ ##JCAMPDX= 5.01
$$ ##ORIGIN= Bruker BioSpin GmbH
$$ ##OWNER= she
$$ F:/spectra/data/she/nmr/H-F/1/audita.txt
$$ ##AUDIT TRAIL=  $$ (NUMBER, WHEN, WHO, WHERE, WHAT)
(   1,<2022-10-17 15:59:46.15 +0400>,<she>,<DPX200>,
      <created by zg, POWCHK disabled, PULCHK disabled
       configuration hash MD5:
       00 E9 B6 7A A2 85 ED C7 34 08 36 98 17 FE 4E 26
       data hash MD5: 16K
       11 74 7A 4E 31 1E 41 B7 37 56 8C 5D 13 24 D6 19>)
$$ ##END=
$$ 
$$ hash MD5
$$ 5E C4 45 62 C1 90 A4 E3 F3 58 A3 25 BA E3 27 7C
##$RELAX= 
##$RELAX= 
##$RELAX= 
##$RELAX= 
##$RELAX= 
##$RELAX= 
$$ Bruker specific parameters
$$ --------------------------
##$DU= <F:/spectra>
##$EXPNO= 1
##$NAME= <H-F>
##$PROCNO= 1
##$TYPE= <nmr>
##$USER= <she>
##$AMP= (0..31)
100 100 100 100 100 100 100 100 100 100 100 100 100 100 100 100 100 100 
100 100 100 100 100 100 100 100 100 100 100 100 100 100 
##$AQSEQ= 0
##$AQ_mod= 1
##$AUNM= <au_zg>
##$AUTOPOS= <>
##$BF1= 200.13
##$BF2= 200.13
##$BF3= 200.13
##$BF4= 200.13
##$BF5= 200.13
##$BF6= 200.13
##$BF7= 200.13
##$BF8= 200.13
##$BYTORDA= 1
##$CFDGTYP= 0
##$CFRGTYP= 5
##$CHEMSTR= <none>
##$CNST= (0..31)
1 1 145 1 1 1 1 1 1 1 1 1 1 1 1 1 1 1 1 1 1 1 1 1 1 1 1 1 1 1 1 1 
##$CPDPRG= <>
##$CPDPRG1= <>
##$CPDPRG2= <>
##$CPDPRG3= <>
##$CPDPRG4= <mlev>
##$CPDPRG5= <mlev>
##$CPDPRG6= <mlev>
##$CPDPRG7= <mlev>
##$CPDPRG8= <mlev>
##$CPDPRGB= <>
##$CPDPRGT= <>
##$D= (0..31)
0 1.2 0 0 0 0 0 0 0 0.06 0 0.03 0 0 0 0 0.0002 0 0 0 0 0 0 0 0 0 0 0 0 
0 0 0 
##$DATE= 1666007985
##$DBL= (0..7)
120 120 120 120 120 120 120 120 
##$DBP= (0..7)
150 150 150 150 150 150 150 150 
##$DBP07= 0
##$DBPNAM0= <>
##$DBPNAM1= <>
##$DBPNAM2= <>
##$DBPNAM3= <>
##$DBPNAM4= <>
##$DBPNAM5= <>
##$DBPNAM6= <>
##$DBPNAM7= <>
##$DBPOAL= (0..7)
0.5 0.5 0.5 0.5 0.5 0.5 0.5 0.5 
##$DBPOFFS= (0..7)
0 0 0 0 0 0 0 0 
##$DE= 6
##$DECBNUC= <off>
##$DECIM= 32
##$DECNUC= <off>
##$DECSTAT= 4
##$DIGMOD= 1
##$DIGTYP= 9
##$DL= (0..7)
0 120 120 120 120 120 120 120 
##$DP= (0..7)
150 150 150 150 150 150 150 150 
##$DP07= 0
##$DPNAME0= <>
##$DPNAME1= <>
##$DPNAME2= <>
##$DPNAME3= <>
##$DPNAME4= <>
##$DPNAME5= <>
##$DPNAME6= <>
##$DPNAME7= <>
##$DPOAL= (0..7)
0.5 0.5 0.5 0.5 0.5 0.5 0.5 0.5 
##$DPOFFS= (0..7)
0 0 0 0 0 0 0 0 
##$DQDMODE= 0
##$DR= 18
##$DS= 0
##$DSLIST= <SSSSSSSSSSSSSSS>
$$ [...]
##$SUBNAM2= <"">
##$SUBNAM3= <"">
##$SUBNAM4= <"">
##$SUBNAM5= <"">
##$SUBNAM6= <"">
##$SUBNAM7= <"">
##$SUBNAM8= <"">
##$SUBNAM9= <"">
##$SW= 18.0517283424941
##$SWIBOX= (0..15)
0 0 2 0 0 0 0 0 0 0 0 0 0 0 0 0 
##$SW_h= 3612.71676300578
##$TD= 16384
##$TD0= 1
##$TE= 0
##$TE2= 300
##$TE3= 300
##$TEG= 300
##$TL= (0..7)
0 120 120 120 120 120 120 120 
##$TP= (0..7)
150 150 150 150 150 150 150 150 
##$TP07= 0
##$TPNAME0= <>
##$TPNAME1= <>
##$TPNAME2= <>
##$TPNAME3= <>
##$TPNAME4= <>
##$TPNAME5= <>
##$TPNAME6= <>
##$TPNAME7= <>
##$TPOAL= (0..7)
0.5 0.5 0.5 0.5 0.5 0.5 0.5 0.5 
##$TPOFFS= (0..7)
0 0 0 0 0 0 0 0 
##$TUNHIN= 0
##$TUNHOUT= 0
##$TUNXOUT= 0
##$USERA1= <user>
##$USERA2= <user>
##$USERA3= <user>
##$USERA4= <user>
##$USERA5= <user>
##$V9= 5
##$VALIST= <valist>
##$VCLIST= <CCCCCCCCCCCCCCC>
##$VD= 0
##$VDLIST= <DDDDDDDDDDDDDDD>
##$VPLIST= <PPPPPPPPPPPPPPP>
##$VTLIST= <TTTTTTTTTTTTTTT>
##$WBST= 1024
##$WBSW= 4
##$XGAIN= (0..3)
0 0 0 0 
##$XL= 0
##$YL= 0
##$YMAX_a= 597584
##$YMIN_a= -946986
##$ZGOPTNS= <>
##$ZL1= 120
##$ZL2= 120
##$ZL3= 120
##$ZL4= 120
##$ABSF1= 10
##$ABSF2= 0
##$ABSG= 5
##$ABSL= 3
##$ALPHA= 0
##$AQORDER= 0
##$ASSFAC= 0
##$ASSFACI= 0
##$ASSFACX= 0
##$ASSWID= 0
##$AUNMP= <proc_1d>
##$AZFE= 0.1
##$AZFW= 0.1
##$BCFW= 1
##$BC_mod= 2
##$BYTORDP= 1
##$COROFFS= 0
##$CY= 11.3945322036743
##$DATMOD= 1
##$DC= 2
##$DFILT= <>
##$DTYPP= 0
##$F1P= 2.36226072786647
##$F2P= -0.459571619588291
##$FCOR= 0.5
##$FTSIZE= 0
##$FT_mod= 4
##$GAMMA= 1
##$GB= 0.15
##$INTBC= 1
##$INTSCL= 1
##$ISEN= 128
##$LB= 0.24
##$LEV0= 0
##$LPBIN= 0
##$MAXI= 10000
##$MC2= 0
##$MEAN= 0
##$ME_mod= 0
##$MI= 1.114404
##$NCOEF= 0
##$NC_proc= 0
##$NLEV= 6
##$NOISF1= 3.799351
##$NOISF2= 2.8
##$NSP= 1
##$NTH_PI= 0
##$NZP= 0
##$OFFSET= 15.70392
##$PC= 1
##$PHC0= -18038.44
##$PHC1= 17.00069
##$PH_mod= 1
##$PKNL= yes
##$PPARMOD= 0
##$PSCAL= 0
##$PSIGN= 0
##$REVERSE= no
##$SF= 200.130013532006
##$SI= 16384
##$SIGF1= 3
##$SIGF2= 2
##$SINO= 400
##$SIOLD= 16384
##$SREGLST= <1H.CDCl3>
##$SSB= 0
##$STSI= 0
##$STSR= 0
##$SW_p= 3612.71676300578
##$SYMM= 0
##$S_DEV= 0
##$TDeff= 0
##$TDoff= 0
##$TI= <>
##$TILT= no
##$TM1= 0
##$TM2= 0
##$TOPLEV= 0
##$USERP1= <user>
##$USERP2= <user>
##$USERP3= <user>
##$USERP4= <user>
##$USERP5= <user>
##$WDW= 1
##$XDIM= 8192
##$YMAX_p= 0
##$YMIN_p= 0
$$ End of Bruker specific parameters
$$ ---------------------------------
##NTUPLES= NMR FID
##VAR_NAME=  TIME,          FID/REAL,        FID/IMAG
##SYMBOL=    X,             R,               I
##VAR_TYPE=  INDEPENDENT,   DEPENDENT,       DEPENDENT
##VAR_FORM=  AFFN,          ASDF,            ASDF
##VAR_DIM=   8192,          8192,            8192
##UNITS=     SECONDS,       ARBITRARY UNITS, ARBITRARY UNITS
##FACTOR=    0.0002768,     1,               1
##FIRST=     0,             0,               0
##LAST=      2.2672688,     0,               0
##MIN=       0,             -946986,         0
##MAX=       2.2672688,     597584,          0
$$ Real data points
##PAGE= N=1
##DATA TABLE= (X++(R..R)), XYDATA
$$ [...]
$$ plain form
1774 194 182 330 278 471 -185 417 -45 -207 35 164 -56 183 -233 -276 -76 -167 -172 -182 -16 -189 -40 -99 73
1797 73 -125 -20 -61 -86 145 211 -22 176 443 -61 268 259 95 111 306 11 -111 84 -176 -90 106 -125 -154
1820 -154 47 -85 -40 -111 -244 -206 294 -198 -90 148 -1 18 240 169 143 171 206 38 150 111 -324 162 279
1843 279 106 -81 187 -33 34 43 99 -115 8 -388 -162 60 -222 -191 -111 -214 -12 81 5 -28 141 139 126 310
1867 310 103 215 -61 332 22 -28 -18 -44 45 245 30 -68 169 -129 -30 -65 -55 -4 -166 -62 -41 -210 -93
1890 -93 -166 13 -173 60 -99 -183 80 278 120 64 121 265 235 -3 244 171 105 212 -14 -125 53 -299 17
1913 17 70 -7 -128 -47 -41 -367 -147 -120 -239 -208 -37 -212 7 70 -82 114 162 -201 262 153 7 -63 275 226
1937 226 25 42 289 144 -14 234 76 -66 -128 -115 -30 -41 -175 -82 -95 -378 -397 -232 -250 55 39 -2 -88 22
$$ packed form
1774A94j2J48n2J93o56O02m62j62K42J29k20K39m16m3K00r1nj0J66j73J49n9J72
1797G3j98J05m1k5K31O6k33J98K67n04L29rj64J6J95k95j22J95k60Q6J96k31k9
1820a54K01j32M5p1j33L8N00m92J08K38j49J9K22p1k6K8L5j68J12l9m35M86J17
1843B79j73j87K68k20O7RN6k14J23l96K26K22k82L1Q0j03K02R3p6l3J69kj3J84
1867C10k07J12k76L93l10n0J0k6Q9K00k15r8K37k98R9l5J0N1j62J04K1j69J17
1890i3p3J79j86K33j59q4K63J98j58n6N7J44l0k38K47p3o6J07k26j11J78l52L16
1913A7N3p7j21Q1Ol26K20K7j19L1J71j75K19O3j52J96M8l63M63j09j46p0L38m9
1937B26k01J7K47j45j58K48j58j42o2J3Q5j1j34R3j3k83j9J65j8L05j6m1q6J10
$$ plain form
1961 22 72 118 159 -42 178 142 305 446 153 212 410 -15 66 277 -48 -207 19 -135 82 144 44 -110 -258
1984 -258 -120 -282 -87 -32 -184 -6 -133 228 -148 -58 65 287 123 162 193 128 94 75 147 -76 172 121 175
2007 175 -134 76 -31 -267 -259 -215 -4 -62 -262 -28 -139 -111 187 24 30 -289 -49 -110 -194 64 117 76 132 365
2031 365 229 267 83 -68 68 193 75 150 -30 153 -172 -253 88 -86 -230 -56 -24 -171 -29 -95 -88 -272
2053 -272 149 20 53 -61 -230 -41 66 -38 111 13 -43 -145 263 176 195 -42 140 211 151 149 191 32 -27 -145
2077 -145 -184 -108 -232 9 -468 228 -297 83 -134 1 40 43 104 -9 -89 110 -50 -15 258 296 130 166 -79
2100 -79 -45 -57 -46 25 -112 -314 -61 59 -180 32 -103 -16 -351 -285 -20 -335 35 47 5 16 194 -34 17 287
2124 287 30 -85 151 214 124 -70 -67 -143 130 -53 34 81 -43 -4 234 -110 -180 -70 -87 -27 -71 -74 -190 41 -81
$$ packed form
1961B2N0M6M1k01K20l6J63J41k93N9J98m25Q1K11l25j59K26j54K17O2j00j54j48
1984b58J38j62J95N5j52J78j27L61l76R0J23K22j64L9L1o5l4j9P2k23K48n1N4
2007A75l09K10j07k36QM4K11n8k00K34j11K8K98j63Ol19K40o1q4K58N3m1N6K33
2031C65j36L8j84j51J36J25j18P5j80J83l25q1L41j74j44J74L2j47J42o6Pj84
2053b72M21j29L3j14j69J89J07j04J49r8n6j02M08q7J9k37J82P1o0kM2j59n9j18
2077a45l9P6j24K41m77O96n25L80k17J35L9LO1j13q0J99j60L5K73L8j66L6k45
2100g9L4j2J1P1j37k02K53J20k39K12j35Q7l35O6K65l15L70J2m2J1J78k28N1K70
2124B87k57j15K36O3r0j94Lp6K73j83Q7M7j24L9K38l44p0J10j7O0m4lj16K31j22
$$ plain form
2149 -81 -269 107 -26 -198 -3 101 195 101 73 146 97 115 95 126 504 222 110 111 90 -45 -416 -47 -191 -337
2173 -337 3 -227 -202 -169 -263 52 -229 -362 23 208 83 88 434 84 44 297 214 198 429 4 160 226 128
2196 128 59 -109 81 -152 -67 14 -153 0 -8 -307 104 107 112 -111 16 -5 -47 -68 164 -32 86 -200 76 182
2220 182 107 88 148 75 171 215 24 149 206 112 -147 105 -183 -127 -193 -317 -77 -79 -104 -36 -125 -65 -121 -106 -47 -320
2246 -320 -201 -17 -60 -67 238 237 182 266 64 97 431 234 130 198 293 162 1 -78 -186 -111 -136 -1 -104 -212
2270 -212 -78 121 51 194 24 80 158 -229 -179 -36 -163 265 56 48 65 68 50 181 214 222 60 85 198 10 154
2295 154 39 118 -288 -367 -210 -90 100 -139 -87 -135 47 53 37 -71 -189 19 -159 -108 -100 24 116 372 115 -115
2319 -115 71 65 68 197 147 11 65 -172 -1 -29 97 73 21 -181 -47 -27 -177 36 -62 -123 20 46 101 -230 -177
$$ packed form
2149h1j88L76j33j72J95J04R4r4k8P3m9J8k0L1L78k82j12Jk1j35l71L69j44j46
2173c37L40k30K5L3r4L15k81j33L85J85j25NL46l50m0K53q3j6K31m25J56O6r8
2196A28o9j68J90k33Q5Q1j67J53qk99M11LNk23J27k1m2k1K32j96J18k86K76J06
2220A82p5j9O0p3R6M4j91J25N7r4k59K52k88N6o6j24K40kk5O8q9O0n6J5N9k73
2246c20J19J84m3pL05jn5Q4k02L3L34j97j04O8R5j31j61p9j08P5k5J35j03j08
2270b12J34J99p0J43j70N6P8l87N0J43j27M28k09qJ7Lj8J31L3Qj62K5J13j88J44
2295A54j15P9m06p9J57J20J90k39N2m8J82Oj6j08j18K08j78N1QJ24R2K56k57k30
2319a15J86oLJ29n0j36N4k37J71k8J26k4n2k02J34K0j50K13r8o1J43K6N5l31N3
$$ plain form
2344 -177 186 106 155 -75 -8 130 65 151 83 79 -128 304 -29 111 -191 -32 -23 139 1 221 -54 -32 192 -176
2368 -176 -223 -30 -55 -33 -282 152 130 -158 79 -38 339 151 110 -163 42 86 194 -137 -33 -149 -33 106
2390 106 377 -90 33 -34 -315 -3 135 -241 -91 -76 -10 97 12 -362 -183 -40 99 43 -8 185 -20 -147
2412 -147 -14 -9 -97 86 23 37 -119 29 209 165 -47 -37 -24 -267 -187 -162 58 -194 -114 138 -131 -293 -234 -64
2436 -64 -162 -212 -338 -259 -80 -357 -63 106 -124 -25 79 249 -83 -101 0 -35 323 2 -92 2 33 46 22 54
2460 54 -65 3 -117 -116 -182 5 -81 -121 56 -140 -124 -47 92 -62 -124 89 52 24 198 84 115 368 86 60 -90
2485 -90 -18 26 19 118 -212 1 -259 -41 51 11 -323 12 -226 -294 123 -331 -123 132 53 150 62 115 141 -254 -12
2510 -12 21 276 275 -101 -78 132 -104 171 10 -90 -134 42 80 -198 -10 180 -269 -62 -192 -270 -263 -275 -324 -64
$$ packed form
2344a77L63q0M9k30O7J38o5Q6o8mk07M32l33J40l02J59RJ62j38K20k75K2K24l68
2368a76m7J93k5K2k49M34k2k88K37j17L77j88m1k73K05M4J08l31J04j16J16J39
2390A06K71m67J23o7k81L12J38l76J50J5O6J07q5l74J79J43J39n6n1J93k05j27
2412a47J33Nq8J83o3J4j56J48J80m4k12J0J3k43Q0K5K20k52Q0K52k69j62N9J70
2436f4r8n0j26P9J79k77K94J69k30R9J04J70l32j8J01l5L58l21r4R4L1J3k4L2
2460E4j19O8j20Jo6J87q6m0J77j96J6P7J39j54o2K13l7k8J74j14L1K53k82k6j50
2485i0P2M4pR9l30K13k60K18R2m0l34L35k38o8M17m54K08K55p9R7q8N3K6l95K42
2510a2L3K55jl76K3K10k36K75j61j00m4J76L8k78J88J90m49K07j30p8Pj2m9K60
$$ plain form
2534 -64 -158 52 5 -202 -233 317 71 152 117 64 85 35 206 190 -212 189 -88 -4 -73 -29 139 -157 -42 20 -331
2559 -331 -218 20 -52 -313 -209 109 61 237 17 -121 94 -72 -88 319 -52 -158 176 78 -249 -4 196
2580 196 66 248 -73 240 -81 88 37 -63 -1 68 -30 -121 156 -131 -271 -12 -127 -40 -333 18 -96 135
2602 135 96 14 15 147 172 258 -41 -57 100 -98 219 16 -104 91 199 31 -93 260 -452 -90 132 -86
2624 -86 153 -40 15 -256 -145 -236 -44 114 -113 -28 -51 82 365 18 81 146 -22 162 154 -97 75 -9 -47 41
2648 41 114 7 -95 -232 53 -94 -120 -146 -157 133 -36 -239 -53 88 51 -202 -143 19 -140 -55 39 99 275
2671 275 56 35 17 65 117 206 202 183 -12 4 -148 -42 41 -102 -195 -44 130 -234 -135 -7 -157 -76 -119 -172 -18
2696 -18 366 171 -6 65 -30 76 175 160 30 85 -206 152 -158 -122 -113 0 -118 45 -91 -14 -235 -189 -407 -384
$$ packed form
2534f4r4K10m7k07l1N50k46Q1l5n3K1n0J71j6m02M01k77Q4o9M4J68k96J15O2l51
2559c31J13K38p2k61J04L18m8J76k20j38K15j66j6M07l71j06L34r8l27K45K00
2580A96j30J82l21L13l21J69n1j00O2O9r8r1K77k87j40K59j15Q7k93L51j14K31
2602A35l9q2JJ32K5Q6k99j6J57j98L17k03j20J95J08j68j24L53p12L62K22k18
2624h6K39j93N5k71J11r1J92J58k27Q5k3J33K83l47O3O5j68J84qk51J72q4l8Q8
2648D1P3j07j02j37K85j47k6k6j1K90j69k03J86J41l7k53N9J62j59Q5R4O0J76
2671B75k19k1j8M8N2Q9mj9j95J6j52J06Q3j43r3J51J74l64R9J28j50Q1m3n3J54
2696a8L84j95j77P1r5J06R9j5j30N5k91L58l10L6RJ13j18J63j36P7k21M6k18K3
$$ plain form
2720 -384 -133 -230 -215 -165 1 192 -183 -109 -24 -69 212 -27 -207 165 -6 -43 194 -14 313 -86 192 -8
2742 -8 73 203 64 2 48 -19 -120 -27 156 -140 175 -132 -32 105 44 -25 -31 -109 51 178 346 10 -27 -31 119
2767 119 -65 270 132 192 178 1 30 -84 162 -57 -11 -161 34 -209 -90 -9 -61 -69 -112 54 -139 -245 -84
2790 -84 -48 -181 258 16 41 135 42 157 97 -81 94 354 138 238 244 243 -214 297 2 -2 -103 -73 -156 280 -8
2815 -8 38 -118 -215 43 165 -131 84 -233 -118 28 -41 -99 125 80 97 66 132 -123 -17 20 28 26 -52 177 153 -167
2841 -167 -227 244 188 -137 -51 55 -140 95 -161 -227 56 141 -79 -64 28 -7 4 218 -68 38 54 57 85 110 -209
2866 -209 -87 -120 -110 160 -39 -296 -107 134 -185 72 -126 -212 -278 -192 -239 -25 -43 -306 56 -134 -281 -57
2888 -57 -35 -75 -133 50 -83 -140 -179 4 142 259 32 30 -217 -89 -136 185 -96 206 -21 -185 -190 29 -155 38
$$ packed form
2720c84K51r7J5N0J66J91l75P4Q5m5K81k39j80L72j71l7K37k08L27l99K78k00
2742hQ1J30j39o2M6o7j01R3J83k96L15l07J00J37o1o9op8J60J27J68l36l7mJ50
2767A19j84L35j38O0j4j77K9j14K46k19M6j50J95k43J19Q1n2qm3J66j93j06J61
2790h4L6j33M39k42K5R4r3J15o0j78J75K60k16J00Ojm57N11k95mj01L0q3M36k88
2815hM6j56r7K58J22k96K15l17J15J46o9n8K24m5J7l1O6k55J06L7Qkp8K29k4l20
2841a67o0M71n6l25Q6J06j95K35k56o6K83Q5k20J5R2l5J1K14k86J06J6LK8K5l19
2866b09J22l3J0K70j99k57J89K41l19K57j98q6o6Q6m7K14j8k63L62j90j47K24
2888e7K2m0n8J83j33n7l9J83J38J17k27kk47J28m7L21k81L02k27j64nK19j84J93
$$ plain form
2912 38 -120 -181 -39 -101 -248 -50 69 135 119 73 60 45 92 -123 71 141 111 51 -36 -59 -21 233 108 136 -6
2937 -6 -47 -153 50 -40 -166 -5 -121 -34 74 46 -8 -212 327 -106 -68 -123 6 13 -133 -47 51 30 290 -65 -179
2962 -179 -111 -55 122 204 -64 -84 36 -257 11 146 31 21 82 292 -98 -138 -83 17 -127 198 216 -15 -97
2985 -97 10 210 -36 -21 -114 127 63 -128 82 -176 -26 259 14 168 1 57 -211 57 -132 23 -84 -74
3007 -74 -36 -215 132 -64 -174 -107 121 258 115 219 195 -33 65 114 31 -17 311 262 114 -14 -147 -98 333
3030 333 -239 43 167 -207 63 145 203 -218 -135 -150 -259 149 21 93 -117 -158 -50 170 97 -104 181 -34
3052 -34 -90 -57 -65 -44 103 -17 40 50 45 52 -283 294 -79 -38 -141 -12 116 -102 82 76 -71 -51 -188 -138 20 -146
3078 -146 -12 70 93 -36 79 37 21 98 -24 -42 196 91 -87 -120 -86 -201 7 -202 -126 27 151 -89 -91 306
$$ packed form
2912C8j58o1J42o2j47J98J19O6j6m6j3j5M7k15J94P0l0o0q7k3L8K54j25K8j42
2937fm1j06K03r0j26J61j16Q7J08k8n4k04N39m33L8n5J29Pj46Q6R8k1K60l55j14
2962a79O8N6J77Q2k68k0J20k93K68J35j15j0O1K10l90m0N5J00j44L25J8k31q2
2985i7J07K00k46J5r3K41o4j91K10k58J50K85k45J54j67N6k68K68j89J55j07J0
3007g4L8j79L47j96j10O7K28J37j43J04k4k28R8M9q3m8L28m9j48j28j33M9M31
3030C33n72K82J24l74K70Q2N8m21Q3j5j09M08j28P2k10m1J08K20p3k01K85k15
3052c4n6L3qK1J47j20N7J0nPl35N77l73M1j03J29J28k18J84oj47K0j37N0J58j66
3078a46J34Q2K3j29J15m2j6P7j22j8K38j05j78l3L4j15K08k09P6J53J24k40kL97
$$ plain form
3102 306 44 66 -108 117 -255 -49 -192 -85 2 54 33 24 -26 -142 -97 41 -31 171 241 -286 91 98 -4 27
3126 27 -54 159 112 -98 -153 -289 13 113 60 -207 -183 -196 -202 25 -95 -234 393 -49 32 -21 -167 -93 36 102
3150 102 224 108 111 -222 -40 24 34 10 -204 257 107 75 110 -52 -172 64 -6 42 15 -228 -123 18 84 -57
3174 -57 123 217 -38 218 -45 302 161 135 54 324 -24 3 -220 27 109 -169 420 -139 -156 -66 206 -28 57
3197 57 -91 -420 -191 33 -155 67 77 -82 -71 89 -262 -99 -60 -152 -11 7 -206 -79 64 -187 394 -38
3219 -38 65 -318 -70 39 61 -75 124 33 25 147 -145 -122 -35 140 113 -238 141 11 -80 64 -26 58 -421 -65
3243 -65 171 28 -38 102 2 200 92 -163 114 147 -58 -55 192 -22 35 12 87 4 -155 46 80 -151 -83 -4
3267 -4 9 119 127 43 44 -77 5 196 -14 -67 91 -173 -33 40 -183 -67 -74 30 -65 -140 -82 222 143 -8 16 -116
$$ packed form
3102C06k62K2j74K25l72K06j43J07Q7N2k1rn0j16M5J38p2K02P0n27L77Pj02L1
3126B7q1K13m7k10n5j36L02J00n3k67K4j3oK27j20j39O27m42Q1n3j46P4J29O6
3150A02J22j16Ll33J82O4J0k4k14M61j50l2L5j62j20K36p0M8k7k43J05J41O6j41
3174e7J80R4k55K56k63L47j41k6q1K70l48K7k23K47Q2k78N89n59j7R0K72k34Q5
3197E7j48l29K29K24j88K22J0j59J1J60l51J63L9r2J41J8k13J27J43k51N81m32
3219c8J03l83K48J09K2j36J99r1qJ22k92K3Q7J75k7l51L79j30r1J44r0Q4m79L56
3243f5K36j43o6J40j00J98j08k55K77L3k05LK47k14N7k3P5q3j59K01L4k31O8P9
3267dJ3J10Qq4Jj21Q2J91k10n3J58k64J40P3k23J16pJ04r5p5N8L04p9j51K4j32
$$ plain form
3293 -116 -193 -134 4 -39 121 -26 112 -21 65 -21 21 -57 105 63 141 -91 -254 81 -134 -2 -208 -122 -50 -290
3317 -290 7 92 -172 9 -79 -147 25 -36 2 -107 47 -150 -40 -154 19 -112 -211 -61 -65 -125 0 -81 123
3340 123 74 -242 75 91 109 -26 292 -102 87 -116 268 58 69 94 -166 -89 -77 -124 -62 -216 197 149 -69
3363 -69 -71 131 65 -68 40 249 -117 -19 140 -19 124 -77 154 171 -20 77 -198 -437 -22 118 111 -106 -119
3386 -119 154 60 -198 -122 212 47 -254 95 -11 -44 -19 -33 262 -33 -97 -152 78 -213 25 128 -48 -67 26
3409 26 -27 -11 6 -31 56 -322 -106 87 133 65 -60 -14 10 -74 242 72 10 94 -130 -63 -94 125 28 215 -160
3434 -160 -204 -91 -64 168 -230 -87 136 -25 115 -197 -275 120 58 -131 11 64 96 -111 187 74 -39 -213
3456 -213 -104 -11 -110 -155 113 -212 -112 -32 358 75 -122 81 115 35 19 -76 194 -146 196 172 -99 5 67
$$ packed form
3293a16p7N9J38m3J60j47J38j33Q6q6M2p8J62m2P8k32j63L35k15J32k06Q6P2k40
3317b90K97Q5k64J81q8o8J72o1L8j09J54j97J10j14J73j31r9J50mo0J25q1K04
3340A23m9l16L17J6J8j35L18l94J89k03L84k10J1K5k60P7J2m7O2j54M13m8k18
3363f9kK02o6j33J08K09l66R8J59j59J43k01K31J7j91R7k75k39M15J40pk17j3
3386a19K73r4k58P6L34j65l01L49j06l3K5j4K95k95o4n5K30k91K38J03j76j9R3
3409B6n3J6J7l7Q7l78K16J93M6o8j25M6K4q4L16j70o2Q4k24O7l1K19r7J87l75
3434a60m4J13K7K32l98J43K23j61J40l12p8L95o2j89J42N3L2k07K98j13j13j74
3456b13J09R3r9m5K68l25J00Q0L90k83j97K03L4q0j6r5K70l40L42k4k71J04O2
$$ plain form
3479 67 0 53 28 -29 158 -37 162 -97 81 -271 -305 -31 60 18 -24 98 -215 150 -14 -128 -248 -156 275
3502 275 18 -153 175 -162 85 -248 -362 -94 37 87 88 -171 -118 162 153 -94 38 191 49 17 150 222 162
3525 162 -95 -204 1 -150 -59 84 169 47 -230 131 -81 -142 -167 -179 -274 110 -17 -109 0 -85 -160 55 -20
3548 -20 -119 -118 -131 114 -171 135 -33 112 268 -7 -2 -97 -121 103 39 -237 17 78 -189 -153 -24 129 -83 -7
3572 -7 81 210 -41 -140 -14 -284 19 -110 88 217 37 -217 130 -289 21 91 110 -13 41 22 156 65 -12
3595 -12 -64 45 -189 164 95 84 -108 -131 -29 -62 28 -112 -79 -251 37 -135 -135 -22 -2 80 -95 122 173 32
3619 32 118 -70 -18 41 -211 -65 82 203 -69 125 14 -76 -304 -133 290 125 265 93 -143 19 -62 109
3641 109 185 55 -29 125 68 -147 7 -61 -260 70 -180 5 -87 -111 65 252 52 -83 237 -72 -180 44
$$ packed form
3479F7o7N3k5n7J87j95J99k59J78l52l4K74R1m2m2J22l13L65j64j14j20R2M31
3502B75k57j71L28l37K47l33j14K68J31N0Jk59N3K80rk47J32J53j42l2J33P2o0
3525A62k57j09K05j51R1J43Q5j22k77L61k12o1k5j2r5L84j27r2J09q5p5K15p5
3548b0r9Jj3K45k85L06j68J45J56k75Nr5k4K24o4k76K54O1k67L6J29J53k12P6
3572gQ8J29k51r9J26k70L03j29J98J29j80k54L47m19L10P0J9j23N4j9J34r1p7
3595a2n2J09k34L53o9j1j92k3J02l3R0j40L3j72K88j72%J13K0Q2j75K17N1j41
3619C2Q6j88N2N9k52J46J47J21k72J94j11r0k28J71M23j65J40j72k36J62q1J71
3641A09P6j30q4J54n7k15J54o8j99L30k50J85r2k4J76J87k00j35L20l09j08K24
$$ plain form
3663 44 -37 110 -26 -181 104 203 49 -82 -71 25 -61 120 119 48 165 7 38 -166 -182 -40 -219 7 -144 -236
3687 -236 75 -203 -93 104 -173 64 2 137 -78 -51 81 23 79 -143 50 -7 218 -85 29 152 -84 100
3709 100 -141 25 389 14 11 179 -293 -133 128 -15 180 108 -166 204 -51 102 -118 -129 134 -161 151
3730 151 -47 280 -79 -43 66 78 102 4 63 -237 -9 -56 5 71 60 128 -76 -120 300 -31 -67 103 79 -307
3754 -307 56 -146 -94 49 100 133 6 -131 51 -12 -116 15 -68 35 48 6 163 -8 -68 -103 37 -71 -40
3777 -40 180 56 -245 -68 172 123 169 27 110 -177 -123 26 62 75 195 50 -378 -55 -227 -36 -128 -175 78
3800 78 -223 -39 -61 54 -147 -128 -291 97 129 105 -285 41 -281 -93 -71 156 109 10 99 -96 -110 72 145 -13
3824 -13 -303 59 184 41 175 86 29 -177 287 71 66 -147 127 21 16 -186 215 43 -88 -80 -59 -5 148 195
$$ packed form
3663D4q1J47j36j55K85R9j54j31J1R6q6J81jp1J17j58L1k04j6J42j79K26j51r2
3687b36L11k78J10J97k77K37o2J35k15K7J32n8N6k22J93n7K25l03J14J23k36J84
3709A00k41J66L64l75lJ68m72J60K61j43J95p2k74L70k55J53k20j1K63k95L12
3730A51j98L27l59L6J09J2K4r8N9l00K28m7O1O6j1O8k04m4M20l31l6J70k4l86
3754c07L63k02N2J43N1L3j27j37J82o3j04J31q3J03J3m2J57j71o0l5J40j08L1
3777d0K20j24l01J77K40m9M6j42Q3k87N4J49L6J3J20j45m28L23j72J91r2m7K53
3800G8l01J84k2J15k01J9j63L88L2k4l90L26l22J88K2K27m7r9Q9j95j4J82P3j58
3824a3k90L62J25j43J34q9n7k06M64k16nk13K74j06nk02M01j72j31QK1N4J53M7
$$ plain form
3848 195 12 -182 -17 133 31 -20 235 -25 -9 -92 -49 276 -51 81 -156 170 -151 -55 -108 102 130 41 -15
3871 -15 -2 51 -134 -329 -97 134 -20 150 195 -174 -123 254 106 -347 19 -115 -241 65 -20 109 -4 -38
3893 -38 -58 -86 -228 60 -75 145 87 -13 153 259 362 -136 -72 6 87 -8 71 -69 130 51 -147 75 -64
3916 -64 78 -30 47 59 77 102 2 -123 -38 -200 -119 80 257 -53 106 74 -226 129 223 -192 129 50 190
3939 190 -113 -189 74 176 -132 163 66 -268 139 34 -176 32 204 -48 -71 64 23 -261 3 -128 16
3960 16 19 24 5 45 -97 92 -208 -110 84 -83 94 -103 15 59 91 69 238 141 205 -8 -154 -36 -94 -56 89
3985 89 58 11 -135 -92 134 275 -97 -24 117 74 -105 -84 31 50 128 253 461 -132 92 258 -145 131 101
4008 101 91 98 -86 177 -80 -153 40 -4 35 124 259 87 87 183 42 -20 120 -48 -266 -23 158 -84 -61 278
$$ packed form
3848A95j83j94J65J50j02n1K55k60J6q3M3L25l27J32k37L26l21R6n3K10K8q9n6
3871a5J3N3j85j95K32K31j54J70M5l69N1L77j48m53L66j34j26L06q5J29j13l4
3893c8k0k8j42K88j35K20n8j00J66J06J03m98O4P8Q1r5P9j40J99p9j98K22j39
3916f4J42j08P7J2J8K5j00j25Q5j62Q1J99J77l10J59l2l00L55R4m15L21p9J40
3939A90l03p6K63J02l08K95r7l34M07j05k10K08J72k52k3J35m1k84K64j31J44
3960A6LNj9M0j42J89l00R8J94j67J77j97J18M4L2k2J69r7O4k13j46J18n8L8J45
3985H9l1m7j46M3K26J41l72P3J41m3j79K1J15J9P8J25K08n93K24J66m03K76l0
4008A01j0Pj84K63k57p3J93m4L9Q9J35j72%R6j41o2J40j68k18K43J81k42K3L39
$$ plain form
4032 278 -153 134 81 164 51 -156 34 -127 271 -150 -117 26 86 33 106 170 11 -97 117 111 -130 132 -58
4055 -58 -65 -4 -144 -284 16 310 -27 40 -37 -112 -71 -121 -59 -229 -106 -143 -77 171 -44 -89 74 88 -80 167 -122
4080 -122 -143 46 -168 -95 1 -116 -29 -44 -100 -222 -161 206 91 77 -6 106 -2 19 107 13 134 9 150 239
4104 239 -110 107 -150 112 -143 -208 62 58 11 -91 -216 160 98 116 201 117 -294 325 -5 -45 -13 -80 138 -274
4128 -274 -28 -192 -29 10 -80 7 -196 34 -217 123 14 35 -52 10 15 104 -16 -134 -29 30 38 -221 -145 -230 -164
4153 -164 -80 16 -56 142 89 1 -6 -12 98 113 152 -34 -52 26 -77 -85 -27 218 20 -41 192 12 73 -211 -41 35
4179 35 136 113 35 -31 -207 171 30 156 -264 -141 3 -158 -69 44 111 188 -10 -102 169 59 279 -210 -220
4202 -220 122 17 39 -11 117 -274 14 52 -23 22 30 82 194 383 213 146 -84 -432 80 -224 141 -21 67
$$ packed form
4032B78m31K87n3Q3j13k07J90j61L98m21L3J43O0n3P3O4j59j08K14ok41K62j90
4055e8pO1j40j40L00K94l37O7p7p5M1n0O2j70J23l7O6K48k15m5J63J4j68K47k89
4080a22k1J89k14P3R6j17Q7j5n6j22O1L67j15j4q3J12j08K1Q8r4J21j25J41Q9
4104B39l49K17k57K62k55o5K70mm7j02j25L76o2J8Q5q4m11O19l30m0L2o7K18m12
4128b74K46j64J63L9r0Q7k03K30k51L40j09K1q7O2NQ9j20j18J05N9Qk59P6q5O6
4153a64Q4R6p2J98n3q8poJ10J5L9j86j8P8j03qN8K45j98o1K33j80O1k84J70P6
4179C5J01k3p8o6j76L78j41J26m20J23J44j61Q9J13O7P7j98r2K71j10K20m89j0
4202b20L42j05K2n0J28l91K88L8p5M5QN2J12J89j70o7k30l48N12l04L65j62Q8
$$ plain form
4225 67 -58 -90 34 -24 82 134 91 -64 52 -90 155 -153 370 228 155 -53 118 -57 27 -36 -271 2 -15
4248 -15 151 -31 98 150 341 182 98 73 -14 49 -109 97 -77 -225 30 161 -166 -90 49 -17 -3 124 99
4271 99 -6 -166 -39 -141 -136 -57 -130 172 -124 -21 34 -58 101 -194 -40 128 113 -9 142 149 -79 -19 -66 -198
4295 -198 267 -85 -32 0 -95 -192 -212 78 154 90 -7 -115 -76 116 151 -153 84 22 -108 62 112 -90 190 -13
4319 -13 2 9 -42 -98 126 112 -178 87 -114 68 -35 209 46 -149 14 -23 6 -17 33 -98 -62 311 -44 41
4343 41 102 -145 -36 274 43 5 137 -111 -238 92 -185 -47 -14 266 -138 -134 -4 -80 83 -30 -246 -25
4365 -25 -57 -223 80 151 -83 -76 -56 -82 -21 -25 67 42 71 -96 111 -140 -22 77 55 75 79 50 -75 -24 101 -236 48
4392 48 60 155 -103 23 35 -56 28 -124 -325 185 -52 198 -54 -195 40 133 -117 21 93 86 197 199 -60 -87
$$ packed form
4225F7j25l2J24n8J06N2m3j55J16j42K45l08N23j42p3k08J71j75Q4o3k35K73j7
4248a5J66j82J29N2J91j59q4k5q7O3j58K06j74j48K55J31l27P6J39o6J4J27k5
4271I9j05j60J27j02NP9p3L02k96J03N5r2J59k95J54J68j5j22J51Pk28O0m7j32
4295a98M65l52N3L2r5r7k0K90P6o4r7j08L9J92L5l04K37o2j30J70N0k02K80k03
4319a3J5Pn1n6K24j4k90K65k01J82j03K44j63j95J63l7K9k3N0j31L6L73l55Q5
4343D1O1k47J09L10k31l8J32k48j27L30k77J38L3K80m04MJ30p6J63j13k16K21
4365b5l2j66L03P1k34PK0k6O1mR2k5K9j67K07k51J18R9k2K0Mk9j25N1J25l37K84
4392D8J2R5k58J26J2r1Q4j52k01N10k37K50k52j41K35R3k50J38P2pJ11Kk59k7
$$ plain form
4416 -87 -182 -29 149 170 23 108 -154 70 111 -10 266 -109 134 117 -261 -42 168 192 -77 -114 110 286 56
4439 56 -98 -114 -35 8 -57 16 113 54 184 -70 90 108 -193 162 96 182 1 111 67 -9 32 -160 -118 -38 32 -13
4465 -13 -150 237 103 -180 159 -116 -6 -410 -1 32 27 -55 134 79 80 -133 108 73 -65 -157 218 -26 12 -137
4489 -137 53 -166 -150 -245 87 -95 -48 25 -113 -46 234 -56 -55 69 130 67 3 141 108 3 50 5 94 64 -10
4514 -10 10 -34 163 296 168 220 -67 19 -45 -166 -110 -27 283 -14 -322 27 5 139 58 -38 45 -2 -18 -175 -191
4539 -191 138 -166 -112 -13 204 -78 -54 230 -49 207 -62 -95 113 6 107 13 -46 212 140 125 212 -30 2
4562 2 100 -44 -19 -60 152 95 -103 -130 82 8 -34 -233 -252 -28 -24 -102 -181 60 -87 109 -55 92 -13 -15 98
4587 98 198 -114 181 -69 97 71 -48 -110 29 12 -58 -163 26 -9 -204 133 5 -273 184 -17 63 -65
$$ packed form
4416h7r5J53J78K1j47Q5k62K24M1j21K76l75K43j7l78K19K10K4k69l7K24J76k30
4439E6j54j6P9M3o5P3R7n9J30k54J60J8l01L55o6Q6j81J10m4p6M1j92M2Q0P0m5
4465a3j37L87j34k83L39k75J10m04M09L3nq2J89n5Jk13K41l5j38r2L75k44L8j49
4489a37J90k19J6r5L32j82M7P3j38O7K80k90JJ24O1o3o4J38l3j05M7m5Q9l0p4
4514a0K0m4J97J33j28N2k87Q6o4j21N6Q3L10k97l08L49k2J34q1r6Q3m7j6j57j6
4539a91L29l04N4R9K17k82K4K84k79K56k69l3K08j07J01r4n9K58p2j5Q7k42L2
4562BR8j44K5m1K12n7j98k7K12p4m2j99j9K24Mp8p9K41j47J96j64J47j05kJ13
4587I8J00l12K95k50J66k6j19o2J39j7p0j05J89l5j95L37j28k78M57k01Q0j28
$$ plain form
4609 -65 150 112 -38 72 1 -198 202 -1 -72 274 -262 -175 1 82 115 51 -112 -5 55 67 -99 106 -110
4632 -110 -100 -82 96 112 -151 -416 5 126 50 150 123 63 20 119 -269 -151 289 -87 -27 30 146 46 -21 -69
4656 -69 -95 -102 -358 216 -67 -59 -116 146 188 -40 3 -20 164 -95 300 268 -63 -28 47 -108 -63 -16 -122 1 25
4681 25 -178 -66 42 -56 -59 40 -3 -20 -9 -148 -23 -230 109 136 -81 -152 -211 -74 -111 -80 160 -75 -124 -83 86
4706 86 -115 -76 -106 26 -105 208 -51 29 102 -50 163 -61 117 16 201 -130 -159 6 -257 -10 -346 15
4728 15 -44 -89 194 199 -20 96 -19 6 186 51 57 110 -90 -27 72 12 -98 -339 8 -146 -207 -48 144 -62
4752 -62 -103 -285 -85 -14 -251 -173 -36 -199 8 140 -48 -46 -154 -115 241 64 -162 323 -23 -52 16 -195 41
4775 41 93 -86 -291 330 -174 75 103 -80 86 80 -144 -7 229 -338 105 -59 -43 281 78 236 -82 -154
$$ packed form
4609f5K15l8j50J10p1j99M00k03p1L46n36Q7J76Q1L3o4j63J07O0J2j66K05k16
4632a10J0J8J78J6k63k65M21J21p6J00k7o0m3R9l88J18M40l76O0N7J16j00o7m8
4656f9k6pk56N74k83Qn7K62M2k28M3k3J84k59L95l2l31L5P5j55M5M7j06J23K4
4681B5k03J12J08r8lR9m3j7J1j39J25k07L39K7k17p1n9J37l7L1K40k35m9M1J69
4706H6k01L9l0J32j31L13k59Q0P3j52K13k24J78j01J85l31k9J65k63K47l36L61
4728A5n9m5K83Nk19J16j15K5J80j35ON3k00O3R9o0j10k41L47j54o1J59J92k06
4752f2m1j82K00P1k37P8J37j63K07J32j88Kj08L9L56j77k26M85l46k9O8k11K36
4775D1N2j79k05O21n04K49K8j83J66ok24J37K36n67M43j64J6L24k03J58l18p2
$$ plain form
4797 -154 215 -115 -188 -66 103 122 -34 -62 54 112 265 27 -145 -47 188 121 -5 42 89 -25 -105 56 32
4820 32 114 -249 29 113 -230 173 87 166 82 164 168 85 152 103 55 81 29 2 -291 -105 -215 -169 -79 -84 -25 -301 -252
4847 -252 74 79 -99 111 -22 -111 78 -143 93 238 -97 -79 95 -256 120 228 227 -96 -219 191 276 -79
4869 -79 65 -250 71 139 -73 -290 55 -139 -90 95 -145 -47 -48 43 -122 -93 167 152 -44 80 -98 235 -28
4892 -28 -154 -59 -1 -101 -332 133 -72 -192 97 -342 -177 -26 -136 -36 76 25 -175 121 -20 0 -248 30
4914 30 -129 46 -64 -39 -270 -46 185 14 3 -42 -5 106 -28 211 -28 -89 98 -267 54 -43 33 -252 51
4937 51 184 8 -36 204 -131 -71 -205 -128 68 -31 54 -172 135 75 -28 -81 146 -26 -112 267 77 18 -5 -9
4961 -9 -164 -287 -55 -157 138 -177 41 139 127 -190 49 -97 -71 -31 32 -49 34 -161 81 -180 -136 -320 204
$$ packed form
4797a54L69l30p3J22J69J9j56k8J16N8J53k38j72R8K35o7j26M7M7j14q0J61k4
4820C2Q2l63K78Q4l43M03q6P9q4Q2Mq3O7m9m8K6n2k7k93J86j10M6R0nN9k76M9
4847b52L26Nj78K10j33q9J89k21K36J45l35J8J74l51L76J08jl23j23M10Q5l55
4869g9J44l15L21O8k12k17L45j94M9J85k40R8jR1j65K9K60j5j96J24j78L33k63
4892b8j26R5N8j00k31M65k05j20K89m39J65J51j10J00J12n1k00K96j41K0k48K78
4914C0j59J75j10K5k31K24K31j71j1m5L7J11j34K39k39o1J87l65L21r7P6k85L03
4937E1J33j76m4K40l35O0j34P7J96r9Q5k26L07o0j03n3K27j72q6L79j90n9k3m
4961ij55j23K32j02K95l15K18R8j2l17K39j46K6M0O3q1Q3j95K42k61M4j84N24
$$ plain form
4984 204 38 -9 133 53 22 239 -240 83 -175 -99 89 67 166 195 44 129 84 -115 197 -137 -191 22 75 -166
5008 -166 13 -113 0 279 309 -97 52 15 -185 83 137 -176 14 -174 244 -17 -236 -115 38 15 -16 -107
5030 -107 -89 236 -28 -270 90 98 -197 243 78 -75 -14 -182 174 -199 55 -24 -129 -123 -151 216 -114 -218 31
5053 31 131 -84 -112 -103 88 49 -103 59 -55 -229 -8 73 193 -235 -259 269 7 -43 -39 88 -59 143 62 227
5077 227 120 11 -70 31 -11 40 -50 -75 -143 -227 -91 -59 -44 104 -194 -233 71 -108 174 -22 -184 -41 -151
5100 -151 -6 -172 -74 -18 -83 -22 162 -41 -219 333 174 159 53 -268 34 5 -179 -204 21 89 39 -175 233
5123 233 251 87 100 158 -364 33 68 44 -53 161 63 -19 288 -179 4 83 31 235 -102 43 65 -284 142 287
5147 287 -81 39 70 54 72 169 -142 -104 -86 31 -216 -85 28 57 38 152 82 -254 217 25 172 -101 -64
$$ packed form
4984B04j66m7J42q0l1K17m79L23k58P6J88k2R9K9j51Q5m5j99L12l34n4K13N3k41
5008a66J79j26J13K79L0m06J49l7k00K68N4l13J90j88M18k61k19J21J53k3l1r1
5030a07J8L25k64k42L60Qk95M40j65j53O1j68L56l73K54p9j05Ok8L67l30j04K49
5053C1J00k15k8RJ91l9j52J62j14j74K21Q1J20m28k4N28k62n0MJ27j47K02q1J65
5077B27j07j09q1J01m2N1r0k5o8q4J36L2J5J48k98l9L04j79K82j96j62J43j10
5100a51J45j66R8N6o5O1J84k03j78N52j59j5j06l21L02k9j84k5K25O8n0k14M08
5123B33J8j64J3N8n22L97L5k4r7K14r8q2L07m67J83P9n2K04l37J45K2l49M26J45
5147B87l68J20L1j6J8R7l11L8J8J17k47J31J13K9j9J14p0l36M71j92J47k73L7
$$ plain form
5170 -64 -103 -17 16 56 104 -39 -190 193 -54 -24 -191 123 60 -5 -15 -175 14 -179 32 74 86 59 -53 -20 94
5195 94 21 -312 -96 -328 113 -106 126 -152 -118 -50 48 20 -168 -258 25 24 253 143 -51 89 -107 171 70
5218 70 161 142 -44 146 54 -4 -148 -46 181 129 186 11 -174 8 18 -233 120 129 -44 -69 -23 146 156 163 -44
5243 -44 266 14 -76 80 -119 -68 16 -137 16 38 -105 -31 73 -262 2 -36 -46 -75 -142 -6 -27 96 -91 -158
5267 -158 -69 -72 60 154 -2 -45 -140 64 40 18 -110 -139 -23 -85 -189 19 -15 -305 -39 144 -190 65 86 256
5291 256 -102 255 -114 36 -13 106 210 163 -89 19 25 105 -91 -107 41 138 -67 -81 79 158 152 -266 -49 -90
5315 -90 -30 -46 -121 108 -48 142 100 41 -31 -300 -40 -101 23 50 128 -63 31 -103 368 137 -183 177 -138 105
5339 105 103 251 -22 -64 -43 -3 -115 237 295 146 -169 27 -41 -65 -283 6 31 43 27 67 62 44 7 111 20 -30
$$ packed form
5170f4l9Q6L3M0M8j43j51L83k47L0j67L14o3o5j0j60J89j93K11M2J2k7j12L3J14
5195I4p3l33K16k32M41k19K32k78L4O8R8k8j88r0K83jK29j10j94J40j96K78j01
5218G0R1j9j86J90r2n8j44J02K27n2N7j75j85J82J0k51L53Rj73k5M6J69J0Pk07
5243d4L10k52r0J56j99N1Q4j53J53K2j43P4J04l35K64l8j0k9o7J36k1J23j87o7
5267a58Q9lJ32R4j56m3r5K04k4k2j28k9J16o2j04K08l4k90K66J83l34K55K1J70
5291B56l58L57l69J50m9J19J04m7k52J08OQ0j96j6J48R7k05j4J60P9om18K17m1
5315i0O0j6p5K29j56J90m2n9p2k69K60o1J24K7P8j91R4j34M71k31l20L60l15K43
5339A05kJ48k73m2K1M0j12L52N8j49l15J96o8k4k18K89K5J2j6M0nj8l7J04r1n0
$$ plain form
5365 -30 8 -155 51 246 167 12 -22 9 118 -45 105 90 -82 -15 135 -98 -18 126 59 -34 -87 65 11 -48
5389 -48 -131 116 151 -211 -59 -21 272 -181 195 18 -56 161 85 -53 -147 114 184 -122 -117 -73 -157 -23 140 65
5413 65 107 40 7 -16 -223 -183 115 43 -58 221 157 153 -174 57 61 76 -140 142 131 18 88 36 59 -307 24 -13
5439 -13 -102 -41 74 80 -175 76 -149 -91 65 329 217 -14 41 -73 -4 6 171 -28 187 -59 71 -36 -62
5462 -62 -208 84 -212 21 -68 -47 87 186 -6 243 135 -178 68 191 -5 -183 -127 86 142 95 164 -192 77
5485 77 21 -61 23 199 -9 -107 -97 221 -160 156 167 -31 49 84 121 188 103 -182 -69 -4 -156 1 -18 -232 -58
5510 -58 15 63 -243 249 279 -52 -107 -31 -50 -110 103 84 -108 21 253 181 -90 215 227 -110 176 405 124 -38
5534 -38 15 225 -95 -347 -38 -22 -93 136 25 140 120 238 -22 92 -76 -104 -99 120 -92 -118 42 -209 28
$$ packed form
5365c0L8j63K06J95p9j55l4L1J09j63J50j5j72O7J50k33Q0J44o7r3n3J52n4n9
5389d8q3K47L5l62J52L8K93m53L76j77p4K17p6j38r4K61P0l06NM4q4J34J63p5
5413F5M2o7l3k3k07M0K98p2j01K79o4ml27K31MJ5k16K82j1j13P0n2K3l66L31l7
5439a3q9O1J15Ok55K51k25N8J56K64j12k31N5j14O9J0J65j99K15k46J30j07k6
5462f2j46K92k96K33q9K1J34R9j92K49j08l13K46J23j96j78N6K13N6m7O9l56K69
5485G7n6q2Q4J76k08r8J0L18l81L16J1j98Q0L5L7O7q5k85J13O5j52J57j9k14J74
5510e8P3M8l06M92L0l31n5P6j9o0K13j9j92J29K32p2k71L05J2l37K86K29k81j62
5534c8N3K10l20k52L09J6p1K29j11J15k0J18k60J14j68k8NK19k12k6J60k51K37
$$ plain form
5557 28 113 62 104 147 14 -64 30 56 43 -56 -138 124 89 233 79 49 -197 13 222 -156 102 -88 -51 -156 -286
5582 -286 105 -20 -139 203 5 10 31 -76 41 119 -179 208 -21 116 85 174 -82 -313 11 76 -38 49 163
5605 163 45 -125 70 175 -69 24 -18 294 -29 -47 128 3 7 175 54 -166 249 -163 -193 -149 54 -290
5627 -290 -153 -25 287 -19 53 -1 -153 -125 42 -194 1 37 -46 126 -45 -61 33 -15 -258 -3 113 -116 6
5650 6 -81 83 -20 -231 -235 80 -193 63 190 320 -50 91 22 -107 -111 164 91 -63 -174 -13 -39 104 -186
5673 -186 -25 -59 -139 231 61 406 112 -127 62 -1 115 -21 37 -6 -30 125 156 66 -40 -222 -105 -140 -50
5696 -50 -83 -180 252 47 -3 -171 105 -41 -86 -22 -27 -12 245 -39 145 47 98 -140 -99 40 -54 -116 -83 -9 65 123
5722 123 -111 215 -76 -78 -85 257 -366 -142 -201 41 -18 -6 326 -207 135 89 -291 172 217 110 -222 128 -123
$$ packed form
5557B8Q5n1M2M3j33p8R4K6j3r9q2K62l5J44j54l0k46K10K09l78K58j90L7j05j30
5582b86L91j25j19L42j98NK1j07J17P8k98L87k29J37l1Q9k56k31L24O5j14Q7J14
5605A63j18j70J95J05k44R3m2L12l23j8J75j25MJ68j21k20M15m12l0M4K03l44
5627b90J37J28L12l06P2n4j52K8J67k36J95L6q3J72j71j6R4m8k43K55J16k29J22
5650Fq7J64j03k11mL15k73K56J27J30l70J41o9j29mK75p3j54j11J61k6J43k90
5673a86J61l4q0L70j70L45k94k39J89o3J16j36N8m3k4J55L1r0j06j82J17l5R0
5696e0l3r7M32k05n0j68K76j46m5O4nJ5K57k84J84r8N1k38M1J39r4o2L3P4P4N8
5722A23k34L26k91kpL42o23K24n9K42n9J2L32n33L42m6l80M63M5j07l32L50k51
$$ plain form
5745 -123 120 16 23 65 -239 -130 -80 -80 172 189 -59 34 -27 4 -149 -71 -148 42 2 85 -135 229 93 -131 -88
5770 -88 -12 63 -59 20 124 -182 -9 -60 30 -41 165 -89 75 -53 -81 33 -253 -132 -131 -212 51 102 -66 -125
5794 -125 -171 4 -9 -34 97 -165 -62 41 187 100 35 85 -174 -129 193 190 25 81 -265 188 -206 -92 137
5817 137 88 144 -272 -127 -33 -185 87 -285 -114 79 -5 282 -2 58 51 -52 109 -145 -91 -22 -66 -97 32 -236
5841 -236 154 -14 18 39 -182 155 -89 -86 80 -12 -97 148 -275 -99 -213 33 -134 -32 -182 -69 -117 194
5863 194 78 -11 34 63 -70 -14 -73 -225 -146 -85 -81 108 -9 -242 165 -18 -97 33 -166 49 46 -220 29 -12
5887 -12 35 -83 58 -68 257 215 194 20 157 -152 -87 -33 82 53 132 90 -91 -122 110 -165 -83 18 -61 -209
5911 -209 -41 1 -134 33 157 -1 113 78 -92 -19 -214 139 -151 -25 -148 -196 67 157 39 84 38 -198
$$ packed form
5745a23K43j04PM2l04J09N0%K52J7k48R3o1L1j53P8p7J90m0Q3k20L64j36k24M3
5770h8P6P5j22P9J04l06J73n1R0p1K06k54J64j28k8J14k86J21Jq1K63N1j68n9
5794a25m6J75j3k5J31k62J03J03J46q7o5N0k59M5L22lj65N6l46M53l94J14K29
5817A37m9N6m16J45R4j52K72l72J71J93q4K87k84O0pj03J61k54N4O9m4l1J29k68
5841b36L90j68L2K1k21L37k44LJ66r2q5K45m23J76j14K46j67J02j50J13m8L11
5863A94j16q9M5K9j33N6n9j52P9O1MJ89j17k33M07j83p9J30j99K15lk66K49m1
5887a2M7j18J41j26L25m2k1j74J37l09O5N4J15k9P9m2j81l1K32k75Q2J01p9j48
5911b09J68M2j35J67J24j58J14l5j70P3j95L53k90J26j23m8K63R0j18M5m6k36
$$ plain form
5933 -198 79 -138 23 16 229 180 88 -267 65 -18 -119 -69 -38 11 -12 -80 -49 -60 142 24 -286 40 82 -182
5957 -182 -93 6 161 -134 -122 25 -149 -32 -23 86 -72 -158 -122 -298 136 -137 -11 81 -63 33 35 57 83 183
5981 183 -142 -127 66 122 77 -70 -48 77 -28 58 -73 125 4 -271 -163 41 -179 119 45 165 106 82 251
6004 251 -232 -309 38 10 28 -206 70 42 163 219 37 198 -12 100 237 -143 203 253 -71 36 -115 10
6026 10 62 106 -54 -147 -34 3 124 226 55 -247 -53 196 5 -30 49 53 -13 20 -132 -188 175 124 129 79 -252
6051 -252 87 85 202 -86 -47 157 -168 241 -24 14 112 -114 89 2 105 -9 -54 -191 84 34 -76 -46 10
6074 10 40 201 6 -140 31 32 13 -43 -49 -2 43 -1 23 -185 -43 74 110 24 -21 169 97 -64 121 -185 -175 -103
6100 -103 -131 64 -41 20 40 24 -117 180 -87 -17 73 15 172 -148 56 43 -112 190 80 134 -18 -38 -129 8
$$ packed form
5933a98K77k17J61pK13m9r2l55L32q3j01N0L1M9k3o8L1j1K02j18l10L26M2k64
5957a82Q9R9J55k95J2J47j74J17RJ09j58q6L6j76M34k73J26R2j44R6KK2K6J00
5981A83l25J5J93N6m5j47K2J25j05Q6j31J98j21k75J08K04k20K98p4J20n9k4J69
6004B51m83p7L47k8J8k34K76k8J21N6j82J61k10J12J37l80L46N0l24J07j51J25
6026A0N2M4j60r3J13L7J21J02j71l02J94K49j91l5P9Mo6L3j52n6L63n1Nn0l31
6051b52L39kJ17k88L9K04l25M09k65L8R8k26K03q7J03j14m5j37K75n0j10L0N6
6074A0L0J61j95j46J71Jj9n6oM7M5m4K4k08J42J17L6q6m5J90p2j61J85l06J0P2
6100a03k8J95j05O1K0j6j41K97k67P0R0n8J57l20K04j3j55L02j10N4j52k0r1J37
$$ plain form
6124 8 -292 -120 -27 -36 -271 -41 53 -76 222 10 -147 -4 -65 -154 -184 56 60 58 146 -34 269 -51 27 -59 -30 50
6150 50 -101 -90 -41 76 80 104 117 85 56 210 -192 -36 -134 -126 -52 -5 5 -53 -227 150 -209 114 144 82 -93 62
6176 62 23 15 281 -55 -59 16 -246 -30 216 -158 -64 -286 5 143 -62 -146 249 231 89 -43 -78 -239 -83 154
6200 154 119 83 165 -103 -57 3 -18 -9 53 -91 28 53 -49 -235 -40 258 107 198 -106 70 -30 -4 141 -46
6224 -46 283 -62 122 48 -136 -14 7 27 107 -67 -221 -86 78 39 74 64 -146 104 -59 -63 -90 -115 -206 67
6248 67 -80 -22 -108 -60 392 -23 44 80 92 42 44 132 173 -14 100 -38 -92 92 -113 249 32 -81 11 -41 -57
6273 -57 126 -52 -129 59 66 -180 22 -4 -149 7 -178 -280 217 76 347 241 93 126 46 -58 102 61 69
6296 69 -55 -146 69 28 112 -6 224 19 -103 121 -56 -63 50 -27 -88 120 136 154 -23 -110 -95 -127 128 -281
$$ packed form
6124Hl00J72R3rk35K30R4j29K98k12j57J43o1q9l0K40MkQ8j80L03l20P8q6K9Q0
6150E0j51J1M9J17MK4J3l2k9J54m02J56r8QP4M7J0n8j74L77l59L23L0o2j75J55
6176F2l9qK66l36mP5k62K16K46l74R4k22K91J38k05q4L95j8j42j32l5j61J56K37
6200A54l5l6Q2k68M6O0k1RO2j44J19K5j02j86J95K98j51R1l04J76j00K6J45j87
6224d6L29l45J84p4j84J22K1K0Q0j74j54J35J64l9L5j0k10K50j63mk7k5r1K73
6248F7j47N8q6M8M52m15O7L6J2n0KQ8M1j87J14j38n4J84k05L62k17j13R2n2j6
6273e7J83j78p7J88Pk46K02k6j45J56j85j02M97j41K71j06j48L3q0j04J60m1Q
6296F9j24r1K15m1Q4j18K30k05j22K24j77pJ13p7o1K08J6J8j77q7J5l2K55m09
$$ plain form
6320 -281 9 -49 -3 19 -222 16 178 187 30 63 212 129 166 -68 -192 -273 142 -132 82 -32 -109 -173 -115 -6
6344 -6 30 63 -89 126 234 260 -92 179 153 128 39 44 176 -50 58 -27 204 224 85 -336 57 -37 -193 23
6368 23 -114 159 80 102 51 92 54 -106 -247 44 247 186 16 -189 -214 109 246 81 40 -15 -258 230 -18
6391 -18 -14 160 -14 -113 -248 25 183 -205 54 89 -96 33 43 42 21 2 -27 -49 179 -14 31 101 -15 63 -154
6416 -154 -90 -66 121 57 -72 -74 98 -6 170 -149 -79 -40 -189 -219 -212 -139 -370 17 174 -149 -4 -315 -28 68
6440 68 130 -64 -95 -2 9 23 7 -115 8 124 -182 -31 75 -183 -120 53 -65 -186 61 143 86 105 -1 25
6464 25 56 -68 -115 31 -81 -25 143 -122 203 103 -99 119 -87 -196 -149 167 26 -29 -199 -12 51 -34 82
6487 82 -30 15 47 -53 -164 -233 -124 -183 175 -61 -227 51 -24 89 -98 -210 -22 -108 146 14 148 -98
$$ packed form
6320b81K90n8M6K2k41K38J62Rj57L3J49q3L7k34j24q1M15k74K14j14p7o4N8J09
6344fL6L3j52K15J08K6l52K71k6k5q9NJ32k26J08q5K31K0j39m21L93r4j56K16
6368B3j37K73p9K2n1M1l8j60j41K91K03o1j70k05k5L23J37j65m1n5k43M88k48
6391a8MJ74j74r9j35K73J58l88K59L5j85J29J0jk1j9k9k2K28j93M5P0j16P8k17
6416a54O4K4J87o4j29kJ72j04J76l19P0L9j49l0PP3k31L87J57l23J45l11K87R6
6440F8O2j94l1R3J1J4j6j22J23J16l06J51J06k58O3J73j18j21K47Q2n7J9j06K6
6464B5L1j24m7J46j12N6J68k65L25j00k02K18k06j09M7L16j41n5j70J87O3q5J16
6487H2j12M5L2j00j11o9J09n9L58k36j66K78p5J13j87j12J88q6K54j32J34k46
$$ plain form
6509 -98 -14 -87 13 -128 204 -36 19 -36 1 119 21 102 -258 99 139 -19 -85 120 109 -91 -125 -168 35 -58 -280
6534 -280 -160 52 -63 34 195 3 -75 75 -13 294 -106 -64 102 -51 -2 -71 64 100 76 14 190 -54 219
6557 219 92 91 -61 -6 337 87 -17 48 -202 -10 14 91 131 122 68 25 -5 160 -36 -124 261 -139 39 131 183
6582 183 26 -9 -75 224 -215 100 -106 1 222 -15 213 -87 15 -27 95 -114 -277 -203 -56 157 120 104
6604 104 121 61 -173 175 13 -44 122 204 80 76 -47 68 -29 82 75 42 88 -24 311 103 -45 117 147 71
6628 71 2 -54 -97 -172 81 -5 290 141 38 191 79 -193 -103 -60 -28 -63 185 -78 -137 -103 101 80 76 120 185 27
6654 27 -146 -127 -127 -272 -199 -133 143 57 155 161 91 158 25 107 131 86 146 159 192 33 139 98 -36 12 127 -35 113
6681 113 27 77 65 178 322 -47 20 -125 7 -179 -112 -144 -211 0 -31 -58 -85 -77 -181 57 113 192 -100 -146 -66
$$ packed form
6509i8Q4p3J00j41L32k40N5n5L7J18r8Q1l60L57M0j58o6K05j1k00l4m3K03r3k22
6534b80J20K12j15R7J61j92p8J50q8L07m00M2J66j53M9o9J35L6k4o2J76k44K73
6557B19j27jj52N5L43k50j04O5k50J92K4P7M0rn4m3l0J65j96q8L85m00J78R2N2
6582A83j57l5o6K99m39L15k06J07K21k37K28l00J02m2J22k09j63P4J47K13l7j6
6604A04J7o0k34L48j62n7J66Q2j24mj23J15r7J11pl3M6j12L35k08j48J62L0p6
6628G1o9n6m3p5K53q6K95j49j03J53j12k72R0M3L2l5K48k63n9L4K04k1mM4O5j58
6654B7j73J9%j45P3O6K76q6R8Op0O7j33Q2K4m5O0J3L3j59J06m1j34M8J15j62J48
6681A13q6N0j2J13J44l69O7j45J32j86O7l2o7K11l1k7k7Qj04K38N6P9k92m6Q0
$$ plain form
6706 -66 -97 173 -14 -5 47 108 216 201 -65 -2 -196 125 78 -44 113 -26 -230 124 -145 -30 16 -54 6 114
6730 114 -109 215 29 38 -201 -159 -252 -212 128 -79 -35 25 -62 -129 6 75 -248 179 -283 205 -99 8 -199
6753 -199 -11 68 -89 22 -227 -63 -286 -127 109 -147 -171 249 218 103 -23 -97 47 -48 -41 81 202 112 -39
6776 -39 -75 85 15 87 31 99 223 54 132 -168 271 87 -244 74 118 15 -5 7 -59 -86 85 21 330 -49
6800 -49 9 -7 41 34 75 -63 253 25 -111 16 -65 -193 79 -46 -43 -61 -17 -85 183 -120 -9 31 -126 108 -15
6825 -15 -87 -261 -86 -134 93 67 -146 -90 -101 31 -132 -170 225 20 -22 -145 62 63 144 17 -115 206 112 -58
6849 -58 -37 19 13 -76 -74 -36 -134 98 -172 46 -128 -163 -102 118 -107 49 109 -82 -1 -13 41 -349 7 -384 -108
6874 -108 -107 48 47 134 -26 -30 13 285 -38 -36 279 -76 208 64 117 -240 67 61 -153 -151 -87 114 -239 -50 44 -184
$$ packed form
6706f6l1K70j87RN2O1J08j5k66O3j94L21m7j22J57j39k04L54k69J15M6p0O0J08
6730A14k23L24j86Rk39M2r3M0L40k07M4O0q7o7J35O9l23M27m62M88l04J07k07
6753a99J88P9j57J11k49J64k23J59K36k56k4M20l1j15j26p4J44r5PJ22J21r0j51
6776c9l6J60p0P2n6O8J24j69P8l00M39j84l31L18M4j03k0J2o6k7J71o4L09l79
6800d9N8j6M8pM1j38L16k28j36J27q1j28K72j25Lj8M4o8K68l03J11M0j57K34j23
6825a5p2j74J75m8K27k6k13N6j1J32j63l8L95k05m2j23K07JQ1j27j32L21r4j70
6849e8K1N6oq9KL8r8K32k70K18j74l5O1K20k25J56O0j91Q1j2N4l90L56l91K76
6874a08JJ55jQ7j60mM3K72l23KL15l55K84j44N3l57L07ok14KO4K01l53J89R4k28
$$ plain form
6900 -184 169 -35 -197 -220 2 -15 -74 62 56 107 -67 36 -28 -69 320 18 117 -256 15 -35 -11 -171 90 186
6924 186 261 176 135 -170 69 33 42 -115 -167 155 131 -238 -55 -27 -143 6 147 52 -41 -37 164 -150 -383 87
6948 87 53 87 37 217 -42 -52 -123 -48 -95 -260 242 -26 -180 145 -65 47 147 -48 12 -78 -199 -178 -246 125
6972 125 -177 45 63 -29 -63 -264 -83 -126 39 -59 -301 -171 -161 28 -214 39 -54 -128 19 11 14 63 137 167 -55
6997 -55 -270 -59 262 35 38 161 -227 225 2 -83 128 84 100 167 -53 -10 -8 169 4 218 31 113 108 202 82
7022 82 -64 -2 11 -194 18 222 -124 64 50 63 75 62 72 172 -146 -47 -128 -80 8 -42 -62 -303 257 58 -130
7047 -130 147 -70 -2 13 140 -176 29 46 -186 96 -52 -152 -52 -33 188 41 -5 -2 -225 -6 239 -98
7069 -98 -164 209 33 -150 20 -101 -280 -163 142 136 19 -34 -98 179 -155 -25 -83 -153 26 -118 62 -163 38
$$ packed form
6900a84L53k04j62k3K22j7n9J36oN1j74J03o4m1L89l02R9l73K71n0K4j60K61R6
6924A86P5q5m1l05K39l6Rj57n2L22k4l69J83K8j16J49J41r5r3MK01l14k33M70
6948H7l4L4n0J80k59j0p1P5m7j65N02k68j54L25k10J12J00j95O0r0j21K1o8L71
6972A25l02K22J8r2l4k01J81m3J65r8k42J30J0J89k42K53r3p4J47qLM9P4L0k22
6997e5k15K11L21k27LJ23l88M52k23q5K11m4J6O7k20M3KJ77j65K14j87Q2nR4j20
7022H2j46O2J3k05K12K04l46J88j4J3J2j3J0J00l18R9q1M8Q8n0k0k41N60j99j88
7047a30K77k17O8J5J27l16K05J7k32K82j48j00J00J9K21j47m6Lk23K19K45l37
7069i8o6L73j76j83J70j21j79J17L05oj17n3o4K77l34J30n8p0J79j44J80k25K01
$$ plain form
7092 38 133 186 -162 -129 83 -32 39 367 220 -14 -104 -238 110 55 -70 -33 25 194 186 72 -181 131 -44 -10
7116 -10 -72 -95 49 -102 -10 12 -60 53 68 232 49 19 -11 -243 41 -20 239 32 48 -38 -262 -143 70 -64
7140 -64 289 185 -81 -111 5 117 -111 8 173 -168 -25 -17 74 -168 314 101 256 62 -18 -51 171 -55
7162 -55 -18 298 92 56 101 102 5 59 -45 160 -163 62 81 -36 122 87 -146 -71 -278 131 39 133 -12 151
7186 151 -289 75 140 -155 136 -127 130 69 -7 -35 -127 11 -11 -57 143 1 -26 -90 368 -115 -37 30 162 -42
7210 -42 -77 159 41 190 6 -95 -145 25 112 90 -44 32 -175 71 -11 41 -67 77 -17 -254 41 -93 86
7233 86 36 -128 49 26 131 -60 -16 -81 -57 174 -93 222 68 11 -108 125 18 20 13 -64 -23 -86 0 -221 -101
7258 -101 -139 -27 -135 -96 -240 -18 -79 80 -156 -221 -21 50 139 -89 191 -126 113 58 6 -174 -214 41 -30
$$ packed form
7092C8R5N3l48L3K12j15P1L28j47k34r0j34L48n5j25L7N8J69qj14k53L12j75L4
7116a0o2k3J44j51R2K2p2J13J5J64j83l0l0k32K84o1K59k07J6q6k24J19K13j34
7140f4L53j04k66l0J16J12k28J19J65l41J43QR1k42M82k13J55j94q0l3K22k26
7162e5L7L16k06l6M5Jr7N4j04K05l23K25J9j17J58l5k33P5k07M09r2R4j45J63
7186A51m40L64O5k95K91k63K57o1p6k8r2J38k2m6K00j42k7o4M58m83P8O7J32k04
7210d2l5K36j18J49j84j01n0J70Q7k2j34P6k07K46q2N2j08J44r4k37K95j34J79
7233H6n0j64J77k3J05j91M4o5K4K31k67L15j54n7j19K33j07Kpp7M1o3Q6k21J20
7258a01l8J12j08L9j44K22o1J59k36o5K00P1Q9k28K80l17K39n5n2j80m0K55p1
$$ plain form
7281 -30 -20 -132 -70 -71 146 -38 147 -193 78 -105 81 173 108 182 57 87 71 -30 8 -245 -134 -37 92 102
7305 102 58 -16 -170 -35 -19 128 -144 -113 84 30 -200 -167 -238 -9 16 24 95 143 -46 141 281 -117 148 -198
7329 -198 -177 -182 205 139 109 -159 -101 -49 103 -81 -29 -53 7 -192 -56 -95 172 -89 -40 103 41 -206 17 20 -239
7354 -239 -28 -256 -243 11 146 -58 -177 -38 35 -10 -3 -28 -201 201 144 82 87 -128 19 154 32 146 91 -153
7378 -153 -18 -228 -128 162 -195 -35 80 135 -5 -4 48 163 57 -158 -40 -5 73 156 -276 -47 -56 97 69
7401 69 1 -16 46 183 152 -54 -74 57 -101 14 -147 -93 124 124 232 38 56 103 32 -67 -81 -198 -140 -24 127
7426 127 -165 65 -327 -158 -51 215 25 -46 -95 -24 71 -96 71 30 -127 -147 -162 7 133 -257 -92 80
7448 80 -13 131 167 22 -185 119 65 145 125 91 -1 54 -21 -64 23 -254 68 63 -185 -35 -144 50 -9 49 291
$$ packed form
7281c0J0j12O2jK17j84J85l40K71j83J86R2o5P4j25L0j6j01L8k53J11R7J29J0
7305A02m4p4j54J35J6J47k72L1J97n4k30L3p1K29K5QP1M8j89J87J40l98K65l46
7329a98K1nL87o6l0k68N8N2J52j84N2k4O0j99J36l9K67k61M9J43o2k47K23Lk59
7354b39K11k28J3K54J35k04j19J39P3m5Pk5j73M02n7o2Nk15J47J35j22J14n5k44
7378a53J35k10J00K90l57J60J15N5j40JN2J15j06k15J18L5P8Q3m32K29rJ53k8
7401F9o8j7O2J37l1k06k0J31j58J15j61N4K17%J08j94J8M7p1r9j4j17N8J16J51
7426A27k92K30l92J69J07K66j90p1m9P1R5j67J67m1j57k0j5J69J26l90J65J72
7448H0r3J44L6j45k07L04n4Q0k0l4r2N5p5m3Q7k77L22nk48J50j09J94n9N8K42
$$ plain form
7473 291 -35 -42 -61 -22 142 -97 156 -21 146 -119 43 45 -141 -187 23 156 26 135 -66 38 -15 342 -190
7496 -190 -119 175 122 16 -43 -243 -25 -67 -65 -53 3 36 188 -40 207 120 -76 119 -147 31 -257 38 -325
7519 -325 100 -91 -50 28 -46 -24 36 -46 -133 59 22 -114 55 -77 -207 50 -150 60 -114 -142 -198 -50 -131 104
7543 104 -19 52 -123 232 178 296 -19 -194 158 -214 20 -10 -163 77 97 79 -111 -99 -410 22 17 14 -167
7566 -167 30 149 14 53 -73 -196 -54 -62 -163 97 -157 30 55 103 -85 -224 -123 -13 4 47 -222 -108
7588 -108 18 86 -110 -54 -60 -135 251 39 -119 167 21 -107 -232 -95 -50 117 -124 -19 39 -57 -52 109 -72
7611 -72 27 -7 5 -58 77 51 -135 -4 4 -91 -152 69 134 48 -5 -94 18 -25 19 -231 351 98 41 250 42 46
7637 46 121 47 287 1 70 -269 -406 -34 184 99 -93 -47 -129 155 59 20 41 37 208 85 50 20 77 -6 139
$$ packed form
7473B91l26pj9L9J64k39K53j77J67k65J62Kj86m6K10J33j30J09k01J04n3L57n32
7496a90P1K94n3j06n9k00K18m2KJ2N6L3J52k28K47q7j96J95k66J78k88K95l63
7519c25M25j91M1P8p4K2O0q2q7J92l7j36J69j32j30K57k00K10j74k8n6J48q1K35
7543A04j23P1j75L55n4J18l15j75L52l72K34l0j53K40K0j8j90J2l11M32nlj81
7566a67J97J19j35L9j26j23J42qj01K60k54J87K5M8j88j39J01J10J7M3k69J14
7588a08J26O8j96N6op5L86k12j58K86j46j28j25J37M5J67k41J05N8r6NJ61j81
7611g2R9l4J2o3J35k6j86J31Qr5o1K21O5q6n3q9J12m3M4k50N82k53n7K09k08M
7637D6P5p4K40k86O9l39j37L72K18q5j92M6q2K84r6l9K1mJ71j23l5l0N7q3J45
$$ plain form
7662 139 249 -250 132 -7 -53 41 -143 -142 15 112 -92 -16 83 -34 6 -157 63 -90 38 -238 235 123 82
7685 82 -158 128 87 72 -3 21 -15 75 305 235 -137 -262 -103 -55 -9 175 -188 55 -6 -217 -150 -17 -39 -284
7709 -284 350 33 -111 43 -84 -96 -273 149 -124 270 169 -55 289 -14 0 -179 30 -80 -90 -125 -57 48
7731 48 -259 -73 -112 -80 -17 -219 122 221 -19 94 -100 -22 -239 -117 173 -188 -88 -70 -233 -16 232 76
7753 76 175 -230 -64 292 151 -148 203 -176 155 81 210 -156 39 147 -25 371 53 -209 -110 -64 29 -101
7775 -101 -98 -104 12 -20 -41 -26 -120 -42 134 132 159 -32 240 -207 -6 178 147 -156 195 84 144 -53 -89 160 123
7800 123 19 -248 55 -134 367 -211 -272 36 -50 155 -303 -301 242 36 -213 315 149 -322 41 -52 -147 6
7822 6 115 -68 45 -125 -100 -85 -240 165 -232 67 -105 -114 -253 -15 143 -77 134 -72 -19 -144 -85 -106 -33
$$ packed form
7662A39J10m99L82j39m6R4j84JJ57R7k04P6R9j17M0j63K20j53J28k76M73j12m1
7685H2k40K86m1j5p5K4l6R0K30p0l72j25J59M8M6J84l63K43o1k11O7J33k2k45
7709b84O34l17j44J54j27j2j77M22k73L94j01k24L44l03J4j79K09j10j0l5O8J05
7731D8l07J86l9L2O3k02L41R9k40J13j94P8k17J22K90l61J00J8j63K17K48j56
7753G6R9m05J66L56j41k99L51l79L31p4J29l66J95J08j72L96l18k62R9M6R3j30
7775a01LoJ16l2k1J5r4P8J76kK7j91K72m47K01J84l1l03L51j11O0j97l6K49l7
7800A23j04k67L03j89N01n78o1L08q6K05m58KN43k06k49N28j66m71L63r3r5J53
7822FJ09j83J13j70K5J5j55M05l97K99j72rj39K38J58k20K11k06N3j25N9k1P3
$$ plain form
7845 -33 -141 -82 -51 -352 70 170 71 13 28 93 -69 -8 -20 139 -146 -154 5 194 99 -57 -1 197 27 -168
7869 -168 94 -90 109 211 -53 -3 -36 34 228 -132 -120 -243 2 -14 -19 140 86 127 88 3 -151 141 149 188 -119
7894 -119 206 94 97 71 107 -100 24 47 -60 54 -41 228 -189 6 -59 -31 186 -70 -141 49 150 -23 315
7917 315 124 -341 -124 142 -88 38 54 54 -349 292 135 -39 -113 -440 88 -262 159 12 161 72 -250 248
7939 248 63 230 -118 -61 39 -9 -13 -81 204 33 -68 5 -36 -108 112 -155 202 -137 -54 -113 225 31 58 60
7963 60 13 -40 50 -129 -254 -74 -220 -134 86 239 -169 -281 -53 215 64 131 217 165 90 60 1 -24 -113 123
7987 123 -50 -22 164 -102 -302 -161 -25 -27 -73 -67 -14 -236 -33 101 17 179 170 -51 -52 126 -71 128 -55 -151
8011 -151 -207 95 -31 -256 230 87 99 76 23 9 60 3 120 -177 -42 -186 38 -42 -156 24 144 152 -105
$$ packed form
7845c3j08N9L1l01M22J00r9n8J5O5j62O1j2J59k85qJ59J89r5j56N6J98j70j95
7869a68K62j84J99J02k64N0l3P0J94l60J2j23K45j6nJ59n4M1l9q5j54K92QL9l07
7894a19L25j12Lk6L6k07J24K3j07J14r5K69m17J95o5K8K17k56p1J90J01j73L38
7917C15j91m65K17K66k30J26J6%m03O41j57j74p4l27N28l50M21j47J49q9l22M98
7939B48j85J67l48N7J00m8mo8K85j71j01P3m1p2K20k67L57l39Q3n9L38j94K7K
7963F0m7n3R0j79j25J80j46Q6K20J53m08j12K28K68j51O7Q6n2p5l0n9k5q9K36
7987A23j73K8J86k66k00J41J36km6ON3k22K03J34q4J62rk21jJ78j97J99j83r6
8011a51n6L02j26k25M86j43J2k3n3j4N1n7J17k97J35j44K24q0j14J80J20Qk57
$$ plain form
8034 -105 32 289 -136 34 246 38 -71 -7 -356 139 56 18 49 -100 -366 201 54 7 -132 98 -213 24
8056 24 49 -12 -48 -19 -61 35 -14 -175 32 -89 159 -219 18 175 -45 -216 32 -278 -60 16 86 78 164 79 116
8081 116 -166 110 -10 68 -49 -113 -165 76 -286 12 103 -6 123 159 -73 248 49 43 209 -131 -90 -132 -126 -12
8105 -12 32 -43 64 -217 -116 146 145 25 157 201 10 -143 -85 -135 108 1 119 -102 -98 -148 -58 -25 -185 -249 -90
8130 -90 232 63 270 -34 -162 56 -22 237 120 102 277 -195 -117 -140 93 -110 -6 7 -359 -66 -105 38
8152 38 5 17 18 29 181 101 -45 194 92 3 -330 -30 -47 -22 -35 -167 -20 16 -36 73 -12 58 -111 -61 61
8177 61 -213 57 -113 -164 -153 -41 48 125 -138 86 60 54 -41 -19
$$ packed form
8034a05J37K57m25J70K12k08j09O4l49M95q3l8L1j49k66N67j47m7j39K30l11K37
8056B4K5o1l6K9m2R6m9j61K07j21K48l78K37J57k20j71K48l10K18P6P0qQ6q5L7
8081A16k82K76j20P8j17o4n2K41l62K98R1j09J29L6k32L21j99oJ66l40M1m2OJ14
8105a2M4p5J07k81J01K62jj20J32M4j91j53N8n0K43j07J18k21Mn0R0L3j60o4J59
8130i0L22j69K07l04j28K18p8K59j17j8J75m72P8k3K33k03J04J3l66K93l9J43
8152C8l3J2JJ1J52q0j46K39j02q9l33L00j7K5j3j32J47L6n2J09q5P0j69N0J22
8177F1k74K70j70n1J1J12Q9P7k63K24k6or5K2
8191a9
$$ Imaginary data points
##PAGE= N=2
##DATA TABLE= (X++(I..I)), XYDATA
$$ plain form
0 0 0 0 0 0 0 0 8 0 0 -8 8 -8 10 -16 16 -24 32 -32 40 -48 61 -72 84 -98 114 -133 154 -178 204 -232 264 -303
32 -303 342 -383 436 -487 546 -609 680 -756 842 -935 1034 -1143 1263 -1394 1535 -1692 1863
49 1863 -2053 2262 -2494 2750 -3038 3361 -3731 4154 -4644 5219 -5909 6750 -7804 9164
63 9164 -10989 13571 -17499 24125 -37315 73192 -364532 -946986 443695 597584 -277785
74 -277785 -5267 363099 -182885 -3747 467024 -69339 -378991 221447 201319 -280019
84 -280019 -78397 179166 -65581 -53346 95481 -70342 -36982 180994 -96232 -299573
94 -299573 109227 191813 -277211 -199523 202138 -5860 -194896 161897 174046 -140339 39867
105 39867 207830 -77069 -30399 219661 -64088 -255466 77871 131006 -100333 -47737 -20688
$$ packed form
0@%%%%%%Qq%qJ6j6J8k6L2m0N6o4P2q8J09j33J56j82K12k47K87l32L82m36M96n67
32c03O45p25Q19r23J033j155J289j436J598j777J969k177K406k657K929l227L555
49A863l916M315m756N244n788O399p092P885q798R863j1128J2659j4554J6968
63I164k0153K4560l1070M1624o1440J10507m37724n82454J390681J53889q75369
74b77785K72518L68366n45984J79138M70771n36363l09652O00438k0128m81338
84b80019K01622K57563k44747J2235J48827j65823L3360K17976k77226k03341
94b99573M08800Q2586m69024P7688M01661k07998j89036L56793J2149l14385J80206
105C9867J67963k84899M6670K50060k83749j91378L33337N3135k31339N2596K7049
$$ plain form
116 -20688 -63273 171773 160762 -195470 -56994 269111 5302 -191211 78742 40517 -199526
127 -199526 -16027 91661 -151907 -99606 133542 -15047 -147028 86706 164593 -53628
137 -53628 -86190 72540 85458 933 -14791 -8789 4208 36578 21274 5115 41946 11282
149 11282 -47749 34541 82618 -54413 -87690 15955 -41093 -87311 49532 -4941 -187812
160 -187812 -21554 177573 -11093 -123139 57906 88371 682 46505 21840 -52065 46162
171 46162 71870 -65587 -35503 66703 -9937 -42128 31559 -11965 -30191 68617 11104 -108530
183 -108530 6541 104620 -37726 -95212 33088 37868 -53192 -7325 48058 -24650 -44445
194 -44445 35531 33726 -25183 -6333 13632 -18137 972 34865 -5222 -30312 1088 15306
$$ packed form
116b0688m2585K35046j1011l56232J38476L26105k63809j96513K69953l8225k40043
127a99526J83499J07688k43568N2301K33148j48589j31981K33734P7887k18221
137e3628l2562J58730J2918q4525j5724O002J2997L2370j5304j6159L6831l0664
149A1282n9031Q2290M8077j37031l3277J03645n7048m6218J36843n4473j82871
160a87812J66258J99127j88666j12046J81045L0465q7689M5823k4665p3905R8227
171D6162K5708j37457L0084J02206p6640l2191P3687m3524j8226R8808n7513j19634
183a08530J15071R8079j42346n7486J28300M780r1060M5867N5383p2708j9795
194d4445P9976j805n8909J8850J9965l1769J9109L3893m0087k5090L1400J4218
$$ plain form
206 15306 25724 22511 -38230 -27532 72845 38263 -70473 -8353 66611 -19260 -44473 32244
218 32244 -254 -47361 16860 15651 -54079 -11843 44078 -11791 -42196 4768 23700 10118
230 10118 -3350 -17778 3807 35740 6205 -22607 10459 21318 -12108 -2295 24780 -3164
242 -3164 -25864 10635 24294 -14982 -15424 19289 1644 -24915 10671 22822 -25062 -23528 21225
255 21225 8372 -23230 -9810 3340 1270 3300 -9584 -11464 17452 12192 -16797 1955 18005
268 18005 -6603 1128 19654 -11911 -16124 28589 16138 -26974 -4318 25758 3440 -11399
280 -11399 1540 1917 -2467 545 -3232 -7068 -5176 -4535 -3252 -1999 -6903 -6908 1329 1955 -5320 -2483
296 -2483 6453 3576 -4025 4329 13210 -486 -6075 12283 12597 -7850 -3850 11608 1399 -5677
$$ packed form
206A5306J0418l213o0741J0698J00377l4582j08736O2120P4964q5871k5213P6717
218C2244l2498m7107O4221j209o9730M2236N5921n5869l0405M6964J8932j3582
230A0118j3468j4428K1585L1933k9535k8812L3066J0859l3426R813K7075k7944
242c164k2700L6499J3659l9276m42L4713j7645k6559L5586J2151m7884J534M4753
255B1225j2853l1602J3420J3150k070K030j2884j880K8916n260k8989J8752J6050
268A8005k4608P731J8526l1565m213M4713j2451m3112K2656L0076k2318j4839
280a1399J2939L77m384L012l777l836J892O41J283J253m904nQ237O26p275K837
296b483Q936k877p601Q354Q881j3696n589J8358L14k0447M000J5458j0209p076
$$ plain form
310 -5677 3765 -333 -5311 5731 5037 -7559 -3762 3758 -890 -5013 -8002 -9794 -1417 -335 -12810
325 -12810 -8410 6740 2792 -3063 6749 9318 2777 7220 9999 140 -2218 5139 2272 -6443 -4108
340 -4108 2829 2009 -1111 2143 6141 4523 859 777 1360 -2423 -8350 -8800 -5847 -7674 -11388 -6531
356 -6531 -397 -1031 741 7123 7182 4577 9110 10499 1004 -2980 3517 2485 -6485 -7052 -637 1457
372 1457 51 638 3942 5957 4913 3039 2763 551 -4934 -6959 -5647 -8418 -11074 -6257 -2674 -4007
388 -4007 355 8672 7705 4204 8399 10103 3653 -212 -1084 -4201 -6649 -7452 -6509 -2370 -537 -1825
404 -1825 2230 10389 9195 4958 5628 4258 192 139 -2707 -9481 -9521 -4396 -3416 -4055 -1631 1542 4044
421 4044 5345 4009 3804 2301 -2762 -5363 -3638 -3552 -7326 -8103 -3498 2617 5040 5316 7045 9829
$$ packed form
310e677R442m098m978J1042o94j2596L797P520m648m123k989j792Q377J082j2475
325a2810M400J5150l948n855R812K569o541M443K779r859k358P357k867q715K335
340d108O937q20l120L254L998j618l664q2N83l783n927m50K953j827l714M857
356f531O134o34J772O382N9k605M533J389r495l984O497j032q970n67O415K094
372A457j406N87L304K015j044j874k76k212n485k025J312k771k656M817L583j333
388d007M362Q317r67l501M195J704o450l865q72l117k448q03R43M139J833j288
404a825M055Q159j194m237O70j370m066n3k846o774m0N125R80o39K424L173K502
421D044J301j336k05j503n063k601J725Q6l774p77M605O115K423K76J729K784
$$ plain form
437 9829 9162 8907 7418 1546 -2473 -3594 -6908 -8145 -5538 -6989 -9835 -4238 1415 2412 3966 2182
453 2182 -1414 4994 9158 -1445 -7215 -693 -821 -4803 -1082 -383 -3150 1463 5293 3808 5880
468 5880 5970 -39 89 3476 666 -2555 -3993 -6359 -2601 2445 -28 -2096 1212 3650 3854 3370
484 3370 1088 -430 -1653 -6064 -6118 -1978 -4151 -10319 -7568 -968 3273 4204 640 1185 9002 10734
500 10734 6613 5971 3327 290 5406 4658 -4970 -3182 1895 -5901 -6702 2553 -1520 -9227 -5375 -2627
516 -2627 -3156 50 -4341 -9825 -817 5399 -506 -1002 3624 2625 4638 8174 5156 3656 4854 2515
532 2515 2304 4389 1649 -1980 -3897 -4731 21 2122 -6952 -9617 -886 2189 -1195 -2448 -3393 22
548 22 4560 -267 -2526 2841 -125 -4987 1026 1832 -3539 546 1733 -4735 2425 10806 1947 -2654
$$ packed form
437I829o67k55j489n872m019j121l314j237K607j451k846N597N653R97J554j784
453B182l596O408M164j0603n770O522j28l982L721O99k767M613L830j485K072
468E880R0o009J28L387k810l221j438k366L758N046k473k068L308K438K04m84
484C370k282j518j223m411n4M140k173o168K751O600M241R31l564N45P817J732
500A0734m121o42k644l037N116p48r628J788N077p796q01R255m073p707L852K748
516b627n29L206m391n484R008O216n905m96M626r99K013L536l018j500J198k339
532B515k11K085k740l629j917q34M752K101r074k665Q731L075l384j253r45L415
548B2M538m827k259N367k966m862O013Q06n371M085J187o468P160Q381q859m601
$$ plain form
564 -2654 5474 6472 3449 3945 -340 -2359 1954 -892 -4025 -352 -2376 -7829 -3504 420 -1056 -2130
580 -2130 -5854 -6630 1966 3723 -4067 -4904 -1059 1299 5745 4839 -2043 2772 10781 6112 2950 6266
596 6266 3939 1085 1071 -1472 -1556 -909 -7684 -8777 -1350 -2010 -5848 -2725 -2926 -3139 4358 2723 -5026
613 -5026 529 5149 -1396 -1670 3113 402 -293 2250 215 2755 6804 903 -1602 4895 5035 -132
629 -132 -1227 -2219 -1805 1451 -1673 -5923 -1917 159 -1602 -761 -365 -449 1572 -849 -3568 966 1745
646 1745 -3937 -3500 -600 -462 2706 1571 -3552 1854 8643 2629 2 4551 2219 -9 3590 215
662 215 -3119 369 -1555 -4728 597 996 -5285 -2983 771 -1089 53 -200 -4665 -1235 3894 -389
678 -389 -3147 -360 1238 2153 1414 -1282 1405 4960 673 -1312 3423 3109 -320 700 -200 -1165 1545
$$ packed form
564b654Q128R98l023M96m285k019M313k846l133L673k024n453M325L924j476j074
580b130l724p76Q596J757p790q37L845K358M446r06o882M815Q009m669l162L316
596F266k327k854j4k543q4O47o775j093P427o60l838L123k01k13P497j635p749
613e026N555M620o545k74M783k711o95K543k035K540M049n901k505O497J40n167
629a32j095r92M14L256l124m250M006K076j761Q41L96q4K021k421k719M534P79
646A745n682M37K900J38L168j135n123N406O789o014k627M549k332k228L599l375
662B15l334L488j924l173N325L99o281K302L754j860J142k53m465L430N129m283
678c89k758K787J598R15p39k696K687L555m287j985M735l14l429J020r00r65K710
$$ plain form
695 1545 340 -3183 -519 162 -1576 0 -928 -2944 915 1296 -3950 -786 2619 -2111 -3209 1902
711 1902 582 -710 493 -886 282 3858 385 -1301 3010 2622 -108 2414 1657 -1113 1672 1793
727 1793 -2568 -1347 1471 -1002 -2375 -1427 -1169 -19 -615 -2958 -586 2098 -895 -1551 1341 -157
743 -157 -629 952 -649 -1060 1471 618 -478 1550 768 374 2635 919 -458 2298 1635 -2375 373
760 373 1959 -1881 -1649 463 -1162 -995 68 -1999 -1163 1666 -1356 -2227 467 -627 -2107 248
776 248 -827 -2033 1177 1622 -655 767 2101 1338 1832 1940 953 1804 1786 -515 -178 561 -995 -1035
794 -1035 -290 -1652 -1182 -318 -1595 -1386 139 -905 -1023 198 -734 -1256 362 -264 -1020 831 471 -605
812 -605 1447 1474 76 1840 1975 573 1611 1844 -596 -308 1183 -541 -950 -202 -1094 -958 -201 -1038
$$ packed form
695A545j205l523K664O81j738J576r28k016L859L81n246L164L405m730j098N111
711A902j320j292J203j379J168L576l473j686M311l88k730K522p57k770K785J21
727A793m361J221K818k473j373R48K58J150n96k343K372K684k993o56K892j498
743a57m72J581j601m11K531q53j096K028p82l94K261j716j377K756o63m010K748
760C73J586l840K32K112j625J67J063k067Q36K829l022q71K694j094j480K355
776B48j075j206L210M45k277J422J334p63M94J08r87Q51j8k301L37P39j556m0
794a035P45j362M70Q64j277K09J525j044j18J221r32n22J618o26p56J851l60j076
812f05K052K7j398J764J35j402J038K33k440K88J491j724m09P48q92J36P57q37
$$ plain form
830 -1038 -1029 64 -647 -931 209 -267 -1598 -503 36 -946 -402 784 -208 18 545 646 1475 1240 572
849 572 1349 1828 413 803 1126 -433 -657 173 -742 -1155 -884 -793 -996 -493 -932 -655 -122 -724 -723 508
869 508 -242 -1611 -10 647 -624 -107 948 278 755 1323 1199 1028 1578 1063 967 858 -188 -506 207
888 207 -719 -1777 -494 -258 -1172 -787 148 -38 -689 -412 16 115 -601 -270 -297 -558 -719 63 500 85
908 85 549 991 1263 966 1409 1129 740 284 64 101 -621 -1099 -1147 159 -663 -1103 173 368 -46 141 369
929 369 -279 -320 -50 -478 -1133 -764 -794 -886 -403 -97 615 785 830 810 1414 1324 675 301 563 117 -602 -109
951 -109 -124 -460 -66 280 131 38 263 -50 -532 -321 -324 -877 -1604 -1119 -493 -985 -815 -566 234 914 919 748
973 748 1188 970 1104 930 773 34 -38 2 -643 -394 40 136 -550 -537 662 858 -426 -557 207 -269 -933
$$ packed form
830a038RJ093p11k84J140m76j331J095N39r82N44J186r92K26N27J01Q29k35o68
849E72P77M79j415L90L23j559k24Q30r15m13K71R1k03N03m39K77N33o02JJ231
869E08p50j369J601O57j271N17J055o70M77N68j24j71N50n15r6j09j046l18P13
888B07r26j058J283K36r14L85R35j86o51K77M28R9p16L31k7k61j61P82M37m15
908H5M64M42K72k97M43k80l89m56k20L7p22m78m8J306q22m40J276J95m14J87K28
929C69o48m1K70m28o55L69l0r2M83L06P12J70M5k0O04r0o49l74K62m46p19M93
951a09j5l36L94L46j49r3K25l13m82K11ln53p27M85O26m92J70K49Q00O80Nj71
973G48M40k18J34j74j57p39p2M0o45K49M34R6o86J3J199J96j284j31P64m76o64
$$ plain form
994 -933 -523 -765 -924 -1058 -349 179 -3 -98 262 599 294 776 556 397 -361 308 969 -89 -981 500
1014 500 835 -34 -198 420 861 283 -58 114 -91 -584 -1128 -660 -869 -1179 -499 -602 -1154 -596 675 496
1034 496 -358 214 1080 1139 254 99 1041 879 -1 448 1207 -37 -246 643 609 -59 -117 -88 -590 -238 -215
1055 -215 -908 -1048 -1049 -484 90 -595 -1310 203 784 -275 -313 776 412 -173 112 453 670 602 -51 -217
1075 -217 725 604 553 429 -114 -190 852 326 -752 -109 98 -369 -681 -283 -347 -646 -780 -520 252 -232
1095 -232 -924 -47 651 30 325 519 -266 -7 1074 510 -45 453 850 220 297 104 304 77 -336 -587
1115 -587 313 181 -1001 -514 -99 -851 -594 -234 -821 -450 343 65 -506 49 101 38 416 246 426 1014
1135 1014 188 -72 807 908 -238 97 621 96 101 191 -43 -98 60 -363 -59 -220 -663 -178 -187 -824 -292
$$ packed form
994i33M10k42j59j34P09N28j82r5L60L37l05M82k20j59p58O69O61j058q92J481
1014E00L35q69j64O18M41n78l41J72k05m93n44M68k09l10O80j03n52N58J271j79
1034D96q54N72Q66N9q85j55R42j62q80M49P59j244k09Q89l4o68n8K9n02L52K3
1055b15o93j40jN65N74o85p15J513N81j059l8J089l64n85K85L41K17o8o53j66
1075b17R42j21n1j24n43p6J042n26j078O43K07m67l12L98o4k99j34K60P72m84
1095b32o92Q77O98o21K95J94p85K59J081n64n55M98L97o30P7j93K00k27m13k51
1115e87R00j32j182M87M15p52K57L60n87L71P93k78n71N55N2o3L78j70J80N88
1135A014q26k60Q79J01j146L35N24n25NR0k34n5J58m23L04j61m43M85ro37N32
$$ plain form
1156 -292 360 -728 -1052 426 -4 -560 244 214 152 582 299 68 754 423 265 409 321 -667 375 609
1176 609 -320 -479 147 -207 -548 217 51 -570 -407 -380 -139 417 -719 -586 526 -105 -445 322 253 -290
1196 -290 214 633 -100 241 514 322 82 374 295 569 195 -326 327 780 -406 -205 435 -69 -387 38
1216 38 -385 -427 -100 -252 -392 -109 -518 -530 393 2 -393 601 408 -292 352 816 -81 174 746 409 179
1237 179 215 128 231 421 -202 -156 496 -219 -552 13 -319 -500 -173 -251 -778 -165 -214 -475 -138 29 162 169
1259 169 -56 -179 582 616 -53 347 861 -174 47 200 1 -152 507 -229 20 444 -91 -127 91 -277
1279 -277 -445 -100 -282 -741 -16 -450 -915 -150 -65 -527 48 620 -108 274 321 -140 403 619 315 209 571
1300 571 198 -10 445 -45 -100 400 125 -484 111 -34 -594 -131 -201 -393 -134 -364 -570 217 -142 -399 -217
$$ packed form
1156b92O52j088l24J478m30n56Q04l0o2M30k83k31O86l31j58J44q8r88J042K34
1176F09r29j59O26l54l41P65j66o21J63K7K41N56j136J33J112o31l40P67o9n43
1196b90N04M19p33L41K73j92k40K92p9K74l74n21O53M53j186K01O40n04l18M25
1216C8m23m2L27j52j40K83m09j2R23l91l95R94j93p00O44M64q97K55N72l37k30
1237A79L6q7J03J90o23M6O52p15l33N65l32j81L27p8n27O13m9k61L37J67J33P
1259A69k25j23P61L4o69M00N14j035K21J53j99j53O59p36K49M24n35l6K18l68
1279b77j68L45j82m59P25m34m65P65Q5m62N75N72p28L82M7m61N43K16l04j06L62
1300E71l73k08M55m90n5N00k75o09N95j45n60M63p0j92K59k30k06P87l59k57J82
$$ plain form
1321 -217 129 -121 342 333 -81 98 417 308 45 694 295 288 408 208 84 135 17 76 307 -115 -225 -57
1343 -57 -111 -471 -94 -414 -572 -137 -268 -140 -136 143 -397 -61 185 -95 29 499 -43 26 583 198 164 286
1365 286 315 203 75 173 90 296 -118 -142 80 66 -414 -47 -57 -687 -330 -28 -193 -12 274 -71 -198 219
1387 219 -64 230 328 158 13 525 161 118 90 400 105 237 -33 80 -52 89 -226 89 99 -259 -39
1408 -39 -168 -435 -270 -128 -286 -251 64 -152 -303 147 -109 50 130 -53 65 258 528 146 280 356 -49
1429 -49 163 -51 135 157 84 29 291 -230 -269 -73 -103 -168 -261 -152 -367 -198 -208 -372 -60 140 -127 -186 -109 -268
1453 -268 -18 180 303 179 240 53 118 227 345 385 70 -85 -209 62 -152 88 164 12 -29 -439 -303 -460
1475 -460 -163 -356 -321 -425 -382 164 15 -160 127 -9 87 49 12 20 131 356 341 300 441 46 101 160 77 102
$$ packed form
1321b17L46k50M63rm14J79L19j09k63O49l99pJ20k00j24N1j18N9K31m22j10J68
1343e7n4l60L77l20j58M35j31J28MK79n40L36K46k80J24M70n42O9N57l85l4J22
1365B86K9j12j28R8q3K06m14k4K22j4m80L67j0o30L57L02j65J81K86l45j27M17
1387B19k83K94R8j70j45N12l64m3k8L10k95J32k70J13j32J41l15L15J0l58K20
1408c9j29k67J65J42j58L5L15k16j51M50k56J59Q0j83J18J93K70l82J34P6m05
1429d9K12k14J86K2p3n5K62n21l9J96l0o5r3J09k15J69j0j64L12K00k67n9P7j59
1453b68K50J98J23j24O1j87O5J09J18M0l15j55j24K71k14K40P6j52m1m10J36j57
1475d60K97j93L5j04M3N46j49j75K87j36R6l8l7QJ11K25j5m1J41l95N5N9q3K5
$$ plain form
1499 102 -75 62 -294 91 58 -181 -230 -442 -183 -127 -341 -237 -17 -158 66 -107 -13 138 -85 -42 276 50
1521 50 79 487 465 150 117 233 277 166 344 -45 -59 18 -157 109 -264 -127 -220 -185 -281 -72 -123 -201 -283 -300 -35
1546 -35 185 -22 -41 19 -75 122 308 127 -171 371 289 95 313 75 100 17 -230 -116 182 -321 74 125 -43
1569 -43 -60 -146 -434 -403 -353 78 -277 -145 -147 -156 64 285 -155 -124 81 -325 322 241 20 -79 13 308 60 375
1593 375 120 -48 245 166 -226 -207 -91 -97 -48 -72 -288 -35 -164 -239 -40 164 -72 -327 71 97 -173 98 -127
1616 -127 12 25 321 376 246 176 -46 130 336 -16 365 140 -89 47 253 -178 -109 -168 -249 -93 -285 -322
1638 -322 -178 -44 -223 -49 -19 -198 142 211 -176 -74 190 40 67 43 252 143 275 -84 -114 227 25 77
1660 77 169 -25 -204 -247 -72 -49 -47 -125 -297 -432 -210 -342 -298 10 -167 104 149 -120 162 90 24 -176 73 170
$$ packed form
1499A02j77J37l56L85l3k39m9k12K59N6k14J04K20j41K24j73R4J51k23M3L18k26
1521E0K9M08k2l15l3J16M4j11J78l89j4P7j75K66l73J37r3L5r6K09n1p8q2j7K65
1546c5K20k07j9O0r4J97J86j81k98N42q2j94K18k38K5q3k47J14K98n03L95N1j68
1569d3j7q6k88L1N0M31l55J32krK20K21m40L1K05m06O47q1k21r9R2K95k48L15
1593C75k55j68K93p9l92J9J16oM9k4k16K53j29p5J99K04k36k55L98K6k70K71k25
1616a27J39J3K96N5j30p0k22J76K06l52L81k25k29J36K06m31O9n9q1J56j92l7
1638c22J44J34j79J74L0j79L40O9l87J02K64j50K7k4K09j09J32l59l0L41k02N2
1660G7R2j94j79m3J75K3Kp8j72j35K22j32M4L08j77K71M5k69K82p2o6k00K49R7
$$ plain form
1684 170 -9 258 290 184 154 40 -20 117 287 269 -48 -29 -215 -43 -67 -257 -244 253 -497 -146 -350 -298 -149
1707 -149 50 21 -192 36 84 196 186 330 -153 202 -103 -2 203 366 349 89 56 -151 37 -192 -219 -204
1729 -204 -179 -208 -291 -49 -250 -210 20 -87 -150 27 -118 104 106 357 214 110 203 52 393 121 37 77 203
1752 203 -342 65 245 23 -61 176 -85 -256 231 -168 -176 139 -133 -175 231 -275 -91 -287 164 -84 -21 198
1774 198 -222 40 334 139 -35 216 306 42 281 124 78 59 159 60 341 145 -65 62 -172 -130 134 -101
1796 -101 -238 -284 -51 -246 -245 -22 -198 31 -83 29 -188 218 42 12 175 45 42 117 189 149 297 121 31
1819 31 5 -184 49 90 -244 -131 -147 -143 -131 64 -168 -64 -94 192 -98 34 97 -198 79 91 -298 -63 -90 22
1843 22 -64 204 -34 -179 248 401 13 177 209 147 -9 0 158 218 -299 -251 -425 -246 -445 -159 -4 -106 0
$$ packed form
1684A70j79K67L2j06l0j14o0J37J70j8l17J9j86J72k4j90J3M97p50L51k04N2J49
1707a49J99k9k13K28M8J12j0J44m83L55l05J01K05J63j7k60l3k07J88k29k7J5
1729b04K5k9q3K42k01M0K30j07o3J77j45K22KK51j43j04R3j51L41k72q4M0J26
1752B03n45M07J80k22q4K37k61j71M87l99qL15k72m2M06n06J84j96M51k48O3K19
1774A98m20K62K94j95j74K51R0k64K39j57m6j9J00r9K81j96k10J27k34M2K64k35
1796a01j37m6K33j95JK23j76K29j14J12k17M06j76l0J63j30lP5P2m0J48j76r0
1819C1k6j89K33M1l34J13j6MJ2J95k32J04l0K86k90J32O3k95K77J2l89K35k7J12
1843B2q6K68k38j45M27J53l88J64L2o2j56RJ58O0n17M8j74J79j99K86J55j02J06
$$ plain form
1866 0 -162 -133 -105 84 -71 -162 -14 -90 -69 118 199 -76 301 -31 115 460 83 -83 172 115 -3 237 -400
1889 -400 -105 -150 -333 -236 -1 57 -87 -188 -5 -102 -175 187 -320 150 9 -196 22 100 130 206 240 298 54
1912 54 194 -128 151 46 -161 -109 7 15 140 -150 -52 -158 -209 122 -127 -132 73 -140 -323 -84 -103 -325 10
1935 10 31 -95 -52 82 117 189 165 -63 260 109 198 294 223 -146 -95 42 136 -200 122 -210 -341 -146 -91 -220
1959 -220 -286 -49 -26 -186 125 -62 161 283 -22 5 42 -17 83 -65 -9 194 119 2 177 37 60 165 -25
1982 -25 -104 -24 109 -9 -119 76 -7 -227 -182 -433 -141 -230 -127 -208 -60 -150 -33 156 -47 17 -83 94 35
2005 35 288 144 234 194 80 182 -81 151 -84 -115 -4 179 -89 76 -132 -221 13 61 165 -64 -108 3
2027 3 83 -63 -125 -100 10 -140 124 -9 164 -126 -99 297 -13 -30 23 -24 121 101 18 -111 -332 10 -106 214
$$ packed form
1866@j62K9K8J89j55r1J48p6K1J87Q1k75L77l32J46L45l77j66K55n7j18K40o37
1889d00K95m5j83R7K35N8j44j01J83r7p3L62n07M70j41k05K18P8L0P6L4N8k44
1912E4J40l22K79j05k07N2J16QJ25k90R8j06n1L31k49nK05k13j83K39j9k22L35
1935A0K1j26M3J34L5P2k4k28L23j51Q9R6p1l69N1J37R4l36L22l32j31J95N5j29
1959b20o6K37K3j60L11j87K23J22l05K7L7n9J00j48N6K03p5j17J75j40K3J05j90
1982b5p9Q0J33j18j10J95q3k20M5k51K92q9J03q1J48r0J17J89k03O4j00J77n9
2005C5K53j44R0m0j14J02k63K32k35l1J11J83k68J65k08q9K34M8J04k29m4J11
2027CQ0j46o2K5J10j50K64j33J73k90K7L96l10j7N3m7J45k0q3j29k21L42j16L20
$$ plain form
2051 214 -168 -35 -206 -115 -34 -91 -60 -284 -229 -141 -115 -331 -130 -7 185 -18 282 83 -16 301 -128 -78 124
2074 124 -2 235 68 121 1 -35 129 129 -127 119 -323 -83 -211 -243 -256 -403 -348 -41 -45 -286 323 -46 -74
2097 -74 -16 -66 104 -240 122 26 -55 119 -59 240 41 -45 313 -198 -343 72 -220 -84 -260 -168 -88 -236 -235
2120 -235 -85 -86 -47 -359 -176 158 74 -113 -31 27 -226 -33 149 71 -31 -69 108 130 283 225 184 158 53 170
2144 170 -117 -163 -56 -94 -169 111 21 -90 -165 -9 65 173 -163 -106 56 -353 -34 -51 130 253 2 6 233
2167 233 -145 131 122 95 122 48 32 -25 46 -143 -124 -153 -354 -270 -199 -180 -47 -121 -161 -65 40 193 83 -375 -115
2192 -115 -284 198 -164 169 178 -225 12 -65 266 38 -28 13 -278 282 72 -62 -271 -163 -117 6 24 -94
2214 -94 -185 16 -300 -97 -113 -69 -14 -82 -252 -431 -66 96 -112 89 127 356 284 -183 116 388 217 -49 70
$$ packed form
2051B14l82J33j71R1Q1n7L1k24N5Q8K6k16K01J23J92k03L00j99r9L17m29N0K02
2074A24j26K37j67N3j20l6J64%k56K46m42K40j28l2j3j47N5L07mk41O09l69k8
2097g4N8n0J70l44L62r6q1J74j78K99j99q6L58n11j45M15k92J36j76R2Q0j48J
2120b35J50jL9l12J83L34q4j87Q2N8k53J93J82p8j02l8J77K2J53n8m1k6j05J17
2144A70k87m6J07l8p5K80r0j11p5J56P4J08l36N7J62m09L19j7J81J23k51MK27
2167B33l78K76rk7K7p4j6n7P1j89J9k9k01Q4P1J9J33p4m0R6J05J53j10m58K60
2192a15j69M82l62L33Rm03K37p7L31k28o6M1k91N60k10j34k09J08M6J23J8j18
2214i4r1K01l16K03j6M4N5o8j70j79L65J62k08K01L8K29p2m67K99K72j71k66J19
$$ plain form
2237 70 -67 -230 -39 -219 -241 -158 0 133 -130 162 -2 -43 -246 -69 -111 -74 -57 -125 245 -67 79 15 84
2260 84 -31 330 331 23 125 -41 37 -26 131 153 69 -198 -38 -13 171 -18 -300 -119 -82 51 -82 41 -125
2283 -125 -174 -212 -165 -76 145 3 53 139 -106 101 152 -1 14 194 225 127 42 41 191 183 -97 -94 -6 144 -128 -42
2309 -42 -182 -451 179 -98 -111 -310 137 -133 -224 -54 55 81 13 213 225 9 -3 551 301 -111 265 187 -26
2332 -26 19 142 14 -121 7 -19 193 -22 130 140 44 -340 25 90 -107 -191 -2 -198 -163 -106 -36 92 -39
2355 -39 19 66 -56 28 -50 -57 184 -18 258 160 97 -56 9 -154 -197 227 -172 -76 66 59 55 -95 -159 -84 -140 67
2381 67 -78 -60 -164 42 97 126 -274 57 13 214 -270 8 -17 -152 -121 36 -2 131 307 14 -277 184 -105
2404 -105 334 55 -1 -298 -5 -126 -125 -69 218 -139 -66 75 -39 -165 -6 -62 124 109 5 306 297 160 211
$$ packed form
2237G0j37j63J91j80k2Q3J58J33k63K92j64m1k03J77m2L7J7o8L70l12J46o4O9
2260H4j15L61Jl08J02j66P8o3J57K2q4k67J60K5J84j89k82J81L7J33j33J23j66
2283a25m9l8M7Q9K21j42N0Q6k45K07N1j53J5J80L1r8q5jJ50qk80LQ8J50k72Q6
2309d2j40k69O30k77j3j99M47k70r1J70J09K6o8K00J2k16j2N54k50m12L76p8k13
2332b6M5J23j28j35J28k6K12k15J52J0r6l84L65O5j97q4J89j96L5N7P0J28j31
2355c9N8M7j22Q4p8pK41k02K76r8o3j53O5j63m3M24l99R6J42pmj50o4P5n6K07
2381F7j45J8j04K06N5K9m00L31m4K01m84K78k5j35L1J57l8J33J76k93k91M61k89
2404a05M39k79n6k97K93j21JN6K87l57P3J41j14j26J59n6J86j5j04L01rj37N1
$$ plain form
2427 211 -54 9 -39 186 -48 2 148 -250 43 93 -27 -166 -146 -69 -155 -117 -39 -117 106 56 -123 -45 -188 32
2451 32 271 -91 183 23 -81 -131 151 168 -21 41 290 -3 7 47 -100 129 -245 95 -531 140 -77 -209
2473 -209 -5 162 -110 -361 -56 -115 -95 -98 111 241 -37 -208 61 -74 -31 253 62 192 -118 22 24 143
2495 143 -210 82 -97 116 -185 -20 -62 111 -51 230 -95 -119 30 135 -135 -28 -91 -287 67 -37 266
2516 266 145 152 -155 46 76 -11 61 26 35 45 -135 238 -219 -104 93 -85 197 -80 -263 -104 -284 -196 -438
2539 -438 -58 -195 110 -210 11 -79 136 58 113 187 105 126 312 9 37 249 87 209 122 128 -54 26 90 21
2563 21 15 237 -46 57 -27 -232 -217 72 -333 -222 -183 187 -121 48 -227 -64 -11 21 11 8 264 -66 -109 208
2587 208 154 -26 1 -42 -17 -30 74 -95 -112 91 148 -65 -36 -249 -285 -55 -143 -149 -53 141 27 -256 0 -52 227
$$ packed form
2427B11k65O3m8K25k34N0J46l98K93N0j20j39K0P7q6L8P8p8K23n0j79P8j43K20
2451C2K39l62K74j60j04n0K82J7j89O2K49k93J0M0j47K29l74L40o26O71k17j32
2473b09K04J67k72k51L05n9K0lK09J30k78j71K69j35M3K84j91J30l10J40KJ19
2495A43l53K92j79K13l01J65m2J73j62K81l25k4J49J05k70J07o3j96L54j04L03
2516B66j21Pl07K01L0q7P2l5RJ0j80L73m57J15J97j78K82k77j83J59j80Q8k42
2539d38L80j37L05l20K21r0K15p8N5P4q2K1J86l03K8K12j62J22q7Oj82Q0O4o9
2563B1oK22k83J03q4k05J5K89m05J11L9L70l08J69k75J63N3L2j0lK56l30m3L17
2587B08n4j80K7m3K5j3J04j69j7K03N7k13K9k13l6K30q8oR6J94j14k83K56n2K79
$$ plain form
2612 227 32 54 110 119 5 138 331 -22 101 203 -68 102 -51 74 -48 -149 8 -40 -231 -46 -23 -90
2634 -90 -273 8 -40 -285 146 131 24 88 -143 -100 87 60 91 -156 256 -83 88 214 79 116 -87 -165 -46
2657 -46 32 -52 67 -99 34 -120 -94 -223 190 63 -36 23 -193 -117 37 -66 -144 -11 -60 -16 164 409 -202
2680 -202 182 -113 -32 251 164 81 62 282 56 172 -187 -147 -62 -132 -174 -102 -231 -38 -217 23 -75 -92 5 -69
2704 -69 174 -94 -127 56 -141 530 103 302 43 19 64 -40 123 276 118 117 22 -117 -17 -171 64 174
2726 174 -44 -39 150 -150 -52 30 -15 323 76 -322 -211 192 187 -170 -59 16 -116 -69 57 68 107 109 137 88 188
2751 188 4 -17 23 -274 -40 -96 13 -141 -264 -156 -23 -215 -146 72 -240 -170 97 56 -229 248 -174 138
2773 138 -171 -214 140 -22 149 -59 121 -72 -70 238 -15 -78 -306 -198 -20 -51 -328 -105 -274 -284 -337 -71
$$ packed form
2612B27j95K2N6Rj14J33J93l53J23J02k71J70j53J25j22j01J57m8j91J85K3o7
2634i0j83K81m8k45M31j5j07O4k31M3J87k7L1k47M12l39J71J26j35L7k03p8J19
2657d6P8q4J19j66J33j54K6j29M13j27r9N9k16P6J54j03p8J33m9M4J80K45o11
2680b02L84k95Q1K83q7q3j9K20k26J16l59M0Q5p0m2P2j29J93j79K40r8j7R7p4
2704f9K43k68l3J83j97O71m27J99k59k4M5j04J63J53j58jr5j39J00j54K35J10
2726A74k18NJ89l00R8Q2m5L38k47l98J11M03nl57J11P5j32M7J26J1L9KK8m9J00
2751A88j84k1M0k97K34n6J09j54j23J08J33j92O9K18l12P0K67m1k85M77m22L12
2773A38l09m3L54j62J71k08J80j93KL08k53o3k28J08J78l1k77K23j69j0n3K66
$$ plain form
2795 -71 -109 119 159 154 -92 -50 42 189 56 -112 165 -115 134 -37 -124 172 108 -181 2 50 -154 107 147 21
2819 21 -6 -64 91 -267 159 -39 21 -308 -182 -210 110 -31 -180 187 -91 -187 73 252 -77 42 311 16
2841 16 217 92 197 157 -34 161 235 -87 -105 168 -206 -262 67 -56 141 -431 -97 168 -109 -202 152 215
2863 215 -282 -162 -78 209 -207 96 -185 -180 224 99 -86 14 201 -130 251 -183 -36 0 -128 -232 -130
2884 -130 11 170 -207 -107 76 66 226 5 -207 -183 38 45 -76 436 91 -151 55 25 -1 40 81 103 224
2907 224 -159 -87 175 -123 4 -125 -85 102 -20 184 -124 -16 -241 81 -202 55 -115 -123 45 235 59
2928 59 -63 -44 18 -36 43 49 177 146 47 -74 -156 -60 154 0 -33 136 -66 254 109 -87 -25 117 -82 126
2952 126 -82 2 244 -100 -26 -20 121 23 -227 -34 126 173 35 88 -49 180 262 -16 118 136 -71 -55 160
$$ packed form
2795g1l8K28M0nk46M2R2J47j33j68K77k80K49j71q7K96o4k89J83M8k04K61M0j26
2819B1k7n8J55l58M26j98O0l29J26k8L20j41j49L67k78r6K60J79l29J19K69k95
2841A6K01j25J05m0j91J95P4l22j8K73l74n6L29j23J97n72L34K65k77r3L54O3
2863B15m97J20Q4K87m16L03k81NM04j25j85J00J87l31L81m34J47L6j28j04J02
2884a30J41J59l77J00J83j0J60k21k12K4K21Pj21N12l45k42K06l0k6M1M1K2J21
2907B24l83P2K62k98J27j29M0J87j22K04l08J08k25L22k83K57j70qJ68J90j76
2928E9j22J9O2n4P9OJ28l1r9j21q2R6K14j54l3J69k02L20j45j96O2J42j99K08
2952A26k08Q4K42l44P4OJ41r8k50J93J60M7j38N3j37K29Q2k78J34J8k07J6K15
$$ plain form
2975 160 -27 -103 -21 -2 -59 -133 117 -79 -12 44 132 -44 95 -169 21 148 66 -277 23 -7 115 -151 9
2998 9 18 29 96 125 -192 84 -182 -187 -32 -11 -57 23 21 -160 -103 245 22 -89 100 -123 31 -234 -296 -163 -258 245
3024 245 116 -121 -155 100 -141 9 -99 -153 -18 -109 292 -44 -4 -55 -42 52 6 -162 -30 -256 -108 -22 31
3047 31 19 -81 -81 -260 -16 19 12 43 -159 -96 59 -246 21 179 -2 -65 193 -131 -4 -65 -263 50 128 3
3071 3 42 125 -107 79 106 -29 -41 55 -139 -74 143 81 -125 -134 -33 -48 -233 -15 7 -121 55 309 199 15
3095 15 92 -197 115 45 241 51 98 -111 79 341 -194 -37 -4 -143 466 18 236 75 -117 29 -108 -142
3117 -142 -111 -44 -48 -73 57 317 -39 190 -21 19 -58 -57 -221 93 57 0 -97 217 -129 57 -184 -61 -235 85
3141 85 111 74 -183 70 120 -22 -274 -80 77 -111 -101 33 229 -66 -61 -116 203 49 286 -181 14 -221 232
$$ packed form
2975A60j87p6Q2J9n7p4K50j96O7N6Q8j76J39k64J90J27q2l43L00l0J22k66J60
2998IRJ1O7K9l17K76k66nJ55K1m6Q0kj81N7L48k23j11J89k23J54k65o2J33r5N03
3024B45j29k37l4K55k41J50j08n4J35r1M01l36M0n1J3R4m6j68J32k26J48Q6N3
3047C1j2j00%j79K44L5pL1k02O3J55l05K67J58j81o3K58l24J27o1j98L13P8j25
3071CL9Q3k32J86K7j35j2R6j94O5K17o2k06rJ01j5j85K18K2j28J76K54j10j84
3095A5P7k89L12p0J96j90M7k09J90K62n35J57L3j39O09m48K18j61j92J46j37l4
3117a42L1O7mk5J30K60l56K29k11M0p7Jj64L14l6n7r7L14l46J86k41J23j74L20
3141H5K6l7k57K53N0j42k52J94J57j88J0J34J96k95Nn5L19j54K37m67J95k35M53
$$ plain form
3164 232 -1 -139 5 281 -44 -19 -226 163 -117 -200 64 -107 144 -97 -76 93 -21 -46 80 284 168
3185 168 73 -30 62 -65 -15 157 -59 341 10 167 9 40 -99 83 170 -92 209 97 205 10 144 42
3207 42 311 -114 -67 46 95 -37 17 137 62 67 24 24 260 -53 -23 -198 204 337 275 13 121 11 -112 16
3231 16 -18 -146 -118 -167 -313 90 80 -129 -205 38 -93 136 38 50 117 -9 -144 -7 -141 251 -19 -181 -343
3254 -343 96 65 -165 207 -155 -101 -73 102 -157 -274 59 3 -6 177 1 -31 -252 34 -132 -243 -81 117
3276 117 -129 -113 115 -80 -112 71 -23 207 -10 -138 -94 114 -192 -147 -145 -120 -42 -210 340 -208 -54 -203 -168
3299 -168 84 12 -19 -65 -50 108 47 -190 -86 25 180 -30 -82 132 -159 -60 7 216 -55 30 18 -48 17 -126
3323 -126 -159 -89 -96 -156 -52 56 -7 211 22 184 21 -300 236 -111 -57 21 -21 146 -164 -76 99 -86 6 32
$$ packed form
3164B32k33j38J44K76l25K5k07L89k80q3K64j71K51k41K1J69j14k5J26K04j16
3185A68r5j03R2j27N0J72k16M00l31J57j58L1j39J82Q7k62L01j12J08j95J34j02
3207D2K69m25M7J13M9j32N4J20p5Nm3%K36l13L0j75M02J33o2k62J08j10j23J28
3231A6l4j28K8m9j46M03j0k09p6K43j31K29r8J2O7j26j35J37j34L92k70j62j62
3254c43M39l1k30L72l62N4K8J75k59j17L33n6rJ83j76l2k21K86j66j11J62J98
3276A17k46J6K28j95l2J83r4K30k17j28M4K08l06M5KK5P8j68N50n48J54j49L5
3299a68K52p2l1m6J5J58o1k37J04J11J55k10n2K14k91R9O7K09k71Q5j2o6O5j43
3323a26l3P0po0J04J08o3K18j89J62j63l21N36l47N4P8m2J67l10Q8J75j85R2K6
$$ plain form
3347 32 53 -157 -255 7 92 -58 -60 80 -42 -55 -101 16 -50 -27 -107 -119 -188 -84 88 75 -92 12 143 -62 -246
3372 -246 -175 4 71 -89 -155 423 150 100 -42 123 98 24 91 69 -219 -256 -224 -234 -295 180 -66 -24 -7 -244 87
3397 87 -1 88 14 -39 -189 26 185 166 220 187 39 -37 69 -198 -95 119 275 306 178 -222 56 -96 -3 39
3421 39 -33 -34 270 20 -23 -97 -94 178 -290 -59 104 -138 196 143 -25 -146 -60 93 -107 28 217 -1 389
3444 389 256 -103 -143 16 -360 174 5 -41 139 126 76 40 52 38 -38 -61 96 -105 -103 60 59 34 28 -48 8 35
3470 35 13 -219 87 6 269 -47 352 5 6 39 -162 127 -70 14 -19 202 -127 230 106 181 -6 28 -55 -181
3494 -181 6 -42 -75 -304 -104 -26 -43 -88 125 73 -116 -19 -122 -58 61 223 -41 207 -13 143 82 112 95 -29
3518 -29 187 42 11 114 138 -24 43 207 -77 -38 43 -69 67 10 -121 -208 86 1 -112 -184 -16 -73 -195 -253
$$ packed form
3347C2K1k10r8K62Q5j50kJ40j22j3m6J17o6K3q0j2o9J04J72j3j67J04J31k05j84
3372b46P1J79O7j60o6N78k73n0j42J65k5p4O7k2k88l7L2j0o1M75k46M2J7k37L31
3397H7q8Q9p4n3j50K15J59j9N4l3j48p6J06k67J03K14J56L1j28m00K78j52R3M2
3421C9p2jL04k50m3p4LK72m68K31J63k42L34n3j68j21Q6J53k00J35J89k18L90
3444C89j33l59m0J59l76N34j69m6J80j3n0l6J2j4p6k3J57k01KJ63jk5op6N6K7
3470C5k2k32L06q1K63l16L99l47JL3k01K89j97Q4l3K21l29L57j24P5j87L4q3j26
3494a81J87m8l3k29K00P8j7m5K13n2j89R7j03O4J19J62k64K48k20J56o1L0j7j24
3518b9K16j45l1J03K4j62O7J64k84L9Q1j12J36n7j31q7K94q5j13p2J68n7j22n8
$$ plain form
3542 -253 -307 -110 30 -212 -47 29 168 -30 -9 -92 108 -25 279 128 -88 -253 84 53 -35 21 76 -93 296
3565 296 209 -258 115 260 -293 -47 42 156 12 -18 211 195 -171 73 148 -45 48 -16 149 -167 -118 -66 -149
3588 -149 24 175 -35 48 -266 -26 43 -154 -108 89 198 -135 -13 233 88 -265 208 35 -161 -35 123
3609 123 48 40 -137 -57 -142 -189 7 -192 87 69 147 200 69 -30 337 143 -228 150 233 224 114 15 -169 137 44
3634 44 87 -242 -85 24 -253 108 67 -138 26 -88 116 -322 -35 178 -68 -116 -141 -347 -267 153 -178 175
3656 175 195 -82 81 168 47 -6 132 59 35 32 270 5 -62 -83 69 -168 -167 158 154 215 34 -84 -271 -293 178
3681 178 24 135 -71 -76 203 151 148 -187 -11 -62 -35 -74 116 -60 205 -14 -75 117 -219 -103 48 147 -157
3704 -157 123 -41 -27 -49 104 -110 -88 66 -134 -171 -227 -104 -81 -160 161 -77 -26 91 -81 133 -61 -218 5
$$ packed form
3542b53n4J97J40k42J65P6J39j98K1q3K00j33L04j51k16j65L37l1q8N6N5j69L89
3565B96q7m67L73J45n53K46Q9J14j44l0K29j6l66K44P5j93R3o4J65l16M9N2q3
3588a49J73J51k10Q3l14K40O9j97M6J97J09l33J22K46j45l53M73j73j96J26J58
3609A23p5qj77Q0q5m7J96j99K79j8P8N3j31r9L67j94l71L78Q3rj10r9j84L06r3
3634D4M3l29J57J09k77L61m1k05J64j14K04m38K87K13k46m8k5k06Q0M20l31L53
3656A75K0k77J63Q7j21n3J38p3k4lK38k65o7k1J52k37JL25mO1j81j18j87k2M71
3681A78j54J11k06nK79n2ll35J76n1K7l9J90j76K65k19o1J92l36J16J51R9l04
3704a57K80j64J4k2J53k14K2J54k00l7n6J23K3p9L21k38N1J17j72K14j94j57K23
$$ plain form
3727 5 -241 -82 -17 19 -40 -148 69 126 -87 72 160 -154 181 -104 -208 51 -104 -64 -49 136 -117 -215 252
3750 252 -133 -76 -110 10 -41 31 -123 47 -294 -237 253 -226 59 -176 -178 161 19 64 -102 -222 180 -16 4
3773 4 -60 128 75 8 -136 234 -355 140 11 -7 4 -88 -42 -175 -452 -155 -194 -6 -34 381 117 -1 -65 30
3797 30 -4 -77 21 90 72 -193 17 -36 178 -154 -85 -87 88 -170 129 -216 10 -51 -66 3 -39 -262 -63 19 26 39
3823 39 136 -92 -130 159 -30 119 90 6 206 -34 46 150 -108 -233 -116 -7 -80 -122 -104 -15 112 161 -41 24
3847 24 75 276 -49 -1 -96 29 -51 -24 101 173 -48 168 -60 -99 109 -317 -163 -3 -22 78 -10 6 -284 -79
3871 -79 61 -60 -20 -174 -27 -154 47 12 -78 272 71 -41 134 -273 46 -193 -201 2 -66 231 32 -228
3893 -228 133 102 72 -195 30 40 264 -54 -63 318 -104 -291 24 -69 -180 -169 262 -5 -98 -73 80 -92 7
$$ packed form
3727Ek46J59O5L6n9j08K17N7k13J59Q8l14L35k85j04K59j55M0J5J85k53r8M67
3750B52l85N7l4J20n1P2j54J70l41N7M90m79K85k35kL39j42M5j66j20M02j96K0
3773Do4J88n3o7j44L70n89M95j29j8J1r2M6j33k77K97l9J88k8M15k64j18o4R5
3797C0l4p3R8O9j8k65K10n3K14l32O9kJ75k58K99l45K26o1j5O9m2k23J99Q2PJ3
3823C9R7k28l8K89j89J49k9q4K00k40Q0J04k58j25J17J09p3m2J8Q9J27M9k02O5
3847B4N1K01l25M8r5J25q0K7J25P2k21K16k28l9K08m26J54J60j9J00q8J6k90K05
3871g9J40j21M0j54J47j27K01l5r0L50k01j12J75m07L19k39qK03o8K97j99k60
3893b28L61l1l0k67K25J0K24l18rL81m22j87L15r3j11J1M31k67r3K5J53j72R9
$$ plain form
3916 7 -78 -89 -50 98 -195 -16 216 78 -45 -119 49 -177 36 -106 -13 -286 152 -43 19 -58 -54 19 -1 -129
3940 -129 68 253 -4 -58 -26 -95 70 -34 -57 -41 -20 -164 -64 73 -6 -46 -49 49 92 -39 -159 118 -52 35
3964 35 -260 -121 -211 -71 390 131 120 18 238 -40 148 -293 219 291 54 69 -125 -81 13 65 162 11 161
3987 161 -117 34 177 40 -68 -209 119 -114 -61 -222 218 231 -273 -326 100 -64 -140 36 143 -183 -59
4008 -59 132 -140 -158 4 -5 -109 -39 144 60 53 80 -34 -83 -8 149 100 -75 275 112 -65 207 -308 198 114
4032 114 4 -118 120 -139 37 -194 -257 102 65 76 -133 -196 -50 28 -202 -114 66 93 95 11 42 -74 -6 63
4056 63 3 85 -106 -92 -130 -68 29 236 -61 159 -73 -314 -207 127 -109 164 -70 309 -103 12 103 236 -71
4079 -71 -172 74 108 225 92 228 243 248 176 127 -30 318 109 -14 -191 -162 -130 27 132 40 -13 80 126 69 -144
$$ packed form
3916Gq5j1L9J48k93J79K32j38j23p4J68k26K13j42R3k73M38j95O2p7MP3k0j28
3940a29J97J85k57n4L2o9J65j04k3J6K1j44J00J37p9m0lR8M3j31j20K77j70Q7
3964C5k95J39r0J40M61k59j1j02K20k78J88m41N12P2k37J5j94M4R4N2R7j51J50
3987A61k78J51J43j37j08j41L28k33N3j61M40J3n04n3M26j64p6J76J07l26J24
4008e9J91k72j8J62rj04P0J83q4pK7j14m9P5J57m9j75L50j63j77K72n15N06q4
4032A14j10j22K38k59J76k31o3L59l7J1k09o3J46P8k30Q8J80K7Kq4L1j16O8O9
4056F3o0Q2j91J4l8O2R7K07k97K20k32k41J07L34k36K73k34L79m12J15R1J33l07
4079g1j01K46L4J17j33J36J5Np2m9j57L48k09j23j77K9L2J57J05r2n3R3M6n7k13
$$ plain form
4104 -144 -64 30 -113 -46 -51 -104 -12 -42 44 188 212 96 47 147 -89 61 369 -40 -145 112 41 137 -75 -89 29
4129 29 -5 107 10 106 144 -62 279 3 -42 -8 102 121 -170 185 158 -52 163 -79 -89 -144 77 157 206 -80
4153 -80 129 -128 324 -2 -58 -49 108 -74 56 -156 -59 -57 21 58 -157 224 11 -21 74 146 5 -119 -103 229
4177 229 -53 444 40 -31 1 -302 -130 -91 34 109 -16 20 -93 -142 -138 -14 150 362 -81 -117 25 -22 179
4200 179 271 205 -116 274 -85 113 243 186 157 -29 197 -29 53 -24 8 24 102 -112 -126 -53 91 10 16 246 -195
4225 -195 20 -414 144 74 -52 133 -81 -5 -86 -166 -154 -121 115 23 24 62 -25 -276 157 -76 -28 -237 276 -100
4249 -100 -214 -36 119 140 -97 6 -2 67 -39 -10 -247 -31 3 54 11 -22 39 -18 -78 -268 -93 -33 61 -127 -101
4274 -101 157 -2 44 -30 -214 -36 -27 116 -63 -56 23 -283 -43 94 150 -70 -218 11 -75 253 40 235 -208
$$ packed form
4104a44Q0R4j43O7nn3R2l0Q6J44K4j16m9J00k36J50L08m09j05K57p1R6k12j4J18
4129B9l4J12r7R6L8k06L41k76m5L4J10J9k91L55k7k10K15k42j0n5K21Q0M9k86
4153h0K09k57M52l26n6RJ57j82J30k12R7KP8L7k15L81k13l2R5P2j41j24J6L32
4177B29k82M97m04p1L2l03J72L9J25P5j25L6j13m9MJ24J64K12m43l6J42m7K01
4200A79R2o6l21L90l59J98J30n7k9j86K26k26Q2p7L2J6P8k14j4P3J44q1OK30m41
4225a95K15m34N58p0j26J85k14P6q1q0J2L3K36r2JL8q7k51M33k33M8k09N13l76
4249a00j14J78J55K1k37J03qO9j06K9k37K16L4N1m3l3O1n7o0j90J75O0R4j88K6
4274a01K58j59M6p4j84J78RJ43j79PP9l06K40J37N6k20j48K29q6L28k13J95m43
$$ plain form
4297 -208 -45 189 206 2 -128 10 -14 -6 162 87 -13 138 71 264 -167 189 97 117 26 -100 -96 132 -28 240
4321 240 -174 -64 141 -175 93 -73 176 -110 -205 194 -95 158 395 -39 -98 40 -380 246 -47 -39 -205
4342 -205 -5 -76 -128 136 -31 -42 29 -44 -109 -168 -43 172 -195 12 -132 214 154 218 128 112 -280 93 61 64 152
4367 152 237 -156 -227 35 -112 -248 92 -53 -155 -46 -201 82 33 198 120 53 -166 -121 121 56 105 33 -191
4390 -191 115 130 -54 -141 120 135 -7 10 43 19 141 -13 40 -340 88 202 -101 88 -87 347 107 -97
4412 -97 -271 257 106 -53 76 17 -139 -158 -39 -145 60 338 79 -23 203 73 -78 151 -6 45 -40 106
4434 106 -234 64 198 -102 28 -142 -64 24 -367 50 -70 -175 -296 -76 36 96 227 -53 -168 -33 249
4455 249 16 126 100 53 171 124 -48 123 86 194 18 -247 139 204 72 31 50 39 -306 47 73 -39 39
$$ packed form
4297b08J63K34J7k04j30J38k4QJ68p5j00J51o7J93m31L56r2K0r1j26MK28j60K68
4321B40m14J10K05l16K68j66K49k86r5L99k89K53K37m34n9J38m20O26k93Qj66
4342b05K00p1n2K64j67j1P1p3o5n9J25K15l67K07j44L46o0O4r0j6l92L73l2LQ8
4367A52Q5l93p1K62j47j36L40j45j02J09j55K83m9J65p8o7k19M5K42o5M9p2k24
4390a91L06J5j84q7K61J5j42J7L3k4J22j54N3l80M28J14l03J89j75M34k40k04
4412i7j74N28j51j59J29n9j56j9J19j06K05K78k59j02K26j30j51K29j57N1q5J46
4434A06l40K98J34l00J30j70P8Q8l91M17j20j05j21K20J12O0J31k80j15J35K82
4455B49k33J10k6m7J18m7j72J71l7J08j76k65L86O5j32m1J9j1l45L53K6j12P8
$$ plain form
4478 39 11 88 228 -171 -158 -8 39 34 -36 136 167 28 72 39 83 -247 40 51 275 238 -145 23 44 -148 51
4503 51 158 0 -65 -214 34 -90 83 237 -82 76 -218 11 -214 -40 -52 -107 242 77 -19 102 -98 -65
4525 -65 -178 105 2 29 -60 -76 53 67 -29 281 26 64 -161 -70 198 164 -282 -98 95 101 187 -157 91 -13
4549 -13 85 3 -26 -137 -9 392 243 -37 31 -59 -143 -103 -59 -99 -18 70 100 120 -93 -86 103 -54 -58 -77 -78 -197 27
4576 27 -121 -336 -174 -99 25 74 -133 137 -160 -63 4 126 145 -121 -9 -59 73 -99 32 220 93 -43
4598 -43 156 -94 22 -122 -61 175 -75 -229 68 -107 -136 124 -148 -150 219 -70 -37 11 192 -28 100 60 -82
4621 -82 135 -52 42 -120 274 186 11 -27 -97 95 -72 -303 -131 -81 45 -17 19 -75 -31 -190 157 -182 -251 -231
4645 -231 52 19 -123 153 -87 85 256 180 -54 193 80 -167 -53 220 -254 187 -121 234 -53 130 -40
$$ packed form
4478C9k8P7J40l99J3J50M7np0J72L1j39M4l3M4l30K87J1K24l7l83J68K1j92J99
4503E1J07j58o5j49K48j24J73J54l19J58k94K29k25J74j2n5L49j65r6J21k00L3
4525f5j13K83j03K7q9j6J29J4r6L10k55L8k25R1K68l4m46J84J93OQ6l44K48j04
4549a3R8q2k9j11J28M01j49k80O8r0q4M0M4m0Q1Q8L0K0k13PJ89j57mj9jj19K24
4576B7j48k15J62P5J24M9k07K70k97R7O7J22J9k66J12n0J32j72J31J88j27j36
4598d3J99k50J16j44O1K36k50j54K97j75k9K60k72kL69k89L3M8J81k20J28m0j42
4621h2K17j87R4j62L94q8j75l8p0J92j67k31J72N0J26o2L6r4M4j59L47l39o9K0
4645b31K83l3j42K76k40J72J71p6k34K47j13k47J14K73m74M41l08L55k87J83j70
$$ plain form
4666 -40 104 -174 203 -5 -64 65 -195 37 47 127 -140 93 -41 43 -67 195 37 133 -178 -1 295 216
4688 216 -115 -138 -131 59 124 -105 -29 -191 -41 -72 -35 12 69 -11 146 238 133 272 -95 157 202 19 48 -7 34
4713 34 34 -77 169 106 22 86 90 58 -81 189 -41 1 69 -359 -164 306 -171 198 -248 106 97 -43 -142 193 -68
4738 -68 -197 -110 -192 -79 15 -147 -18 -1 44 72 44 -339 -39 124 -156 -247 -157 97 -51 -276 -36 -101 32 145
4762 145 61 164 235 -131 -189 219 45 38 -20 -275 167 11 187 -97 96 120 108 120 74 -75 -32 140 138 322
4786 322 186 50 265 13 -66 -81 -426 116 -59 -38 -22 -57 183 -196 -218 -55 72 104 87 -112 -24 -160 27
4809 27 -185 2 222 -182 179 -32 -35 -34 49 60 -87 38 -94 0 21 -76 -16 -37 -43 -40 172 -108 -53 -133 53 109
4835 109 126 77 -157 167 6 151 72 -123 -189 224 -24 14 4 -170 75 53 205 99 -68 -71 101 -161 -57
$$ packed form
4666d0J44k78L77k08n9J29k60K32J0Q0k67K33j34Q4j10K62j58R6l11J77K96p9
4688B16l31k3PJ90O5k29P6j62J50l1L7M7N7q0J57R2j05J39l67K52M5j83K9n5M1
4713C4%j11K46o3q4O4Ml2j39K70k30M2O8m28J95M70m77L69m46L54rj40r9L35k61
4738f8j29Q7q2J13R4j62J29J7M5K8k8l83L00J63k80r1R0K54j48k25K40o5J33J13
4762A45q4J03P1l66n8M08j74pn8k55M42j56J76k84J93K4j2J2m6j49M3J72kJ84
4786C22j36j36K15k52p9j5l45N42j75K1J6l5K40l79k2J63J27L2j7j99Q8j36J87
4809B7k12J87K20m04L61k11lJQ3J1j47J25j32R4K1r7O0k1oLK12k80N5q0J86N6
4835A09J7m9k34L24j61J45p9j95o6M13k48L8j0j74K45k2J52j06j67lJ72k62J04
$$ plain form
4858 -57 28 -5 4 226 -223 -54 -1 -118 80 16 148 -424 15 -88 125 162 -13 -13 -73 5 254 41 -225 113
4882 113 -39 -191 2 102 -59 199 110 6 47 -78 -25 82 -213 -53 69 -149 -47 -183 -260 212 -243
4903 -243 -36 -171 48 -78 -52 -60 0 89 -65 22 -100 -226 -199 1 18 84 129 -27 95 132 23 117 -21 -52
4927 -52 378 228 216 -14 -122 81 72 -64 126 119 62 -94 63 224 -77 -40 311 -147 -200 -142 -116 -119 19 90 20
4952 20 16 179 88 -334 -88 -81 -18 -237 113 22 -26 135 152 -69 255 -39 -47 17 64 37 -14 148 199 -238 75 -9
4978 -9 167 -56 -218 3 -17 -52 -159 -1 -245 18 -4 263 140 -91 103 -290 -104 2 -284 54 364 40
5000 40 -44 12 87 -48 -32 61 -117 -159 -160 314 57 -9 -315 97 -160 -90 182 -121 -93 -290 -72 -65 -47 -93 -123 -110
5026 -110 -282 -8 -24 -61 5 196 -110 -28 250 16 -98 41 -19 48 -60 -25 -39 -127 -64 -103 -255 -346 -208 -134
$$ packed form
4858e7Q5l3RK22m49J69N3j17J98o4J32n72M39j03K13L7j75%o0P8K49k13k66L38
4882A13j52j52J93J00j61K58q9j04M1j25N3J07k95J60J22k18J02j36p7M72m55
4903b43K07j35K19j26K6qO0Q9j54Q7j22j26K7K00J7O6M5j56J22L7j09R4j38l1
4927e2M30j50j2k30j08K03rj36J90pn7j56J57J61l01L7L51m58n3N8K6lJ38P1p0
4952B0mJ63r1m22K46PO3k19L50r1m8J61J7k21L24k94qO4M7k7n1J62N1m37L13q4
4978iJ76k23j62K21k0l5j07J58k44K63k2K67j23k31J94l93J86J06k86L38L10l24
5000D0q4N6P5j35J6R3j78m2jM74k57o6l06M12k57P0K72l03K8j97K18PJ8m6l0J3
5026a10j72K74j6l7O6J91l06Q2K78k34j14J39o0O7j08L5j4q8O3l9j52r1J38P4
$$ plain form
5050 -134 97 -19 58 -300 151 -108 -209 11 163 -291 -20 -39 -76 17 -49 -114 -68 91 7 -37 25 -21 -212 -86
5074 -86 124 -47 41 -20 -150 -30 -71 219 -39 15 -24 304 10 -155 234 -52 -3 15 151 -98 124 93 201
5097 201 93 -23 -3 110 -126 -42 131 -5 78 -255 6 125 -52 3 11 237 -367 1 -279 134 297 13
5119 13 -51 -248 9 161 -51 238 -96 -132 -60 187 -348 -104 6 -88 -65 -17 -63 210 -138 122 -12 -153 84
5142 84 14 -20 126 81 -117 96 -137 225 27 19 -66 -18 140 109 86 285 164 30 120 -118 6 -39 -71 31
5166 31 -88 -74 32 -174 -244 150 -72 -129 39 -26 -265 100 -112 -250 -51 243 -9 -170 3 70 -130 177
5188 177 -132 186 -121 57 -236 292 237 47 95 -95 165 -86 -11 1 -23 -21 89 23 -28 72 29 116 -137 298
5212 298 -74 -113 -210 -189 -8 94 126 -68 -112 -392 35 -46 86 78 45 82 -88 -101 -86 99 180 6 1 207 -38
$$ packed form
5050a34K31j16P7l58M51k59j01K20J52m54K71j9l7R3o6o5M6J59q4m4O2m6j91J26
5074h6K10j71Q8o1j30J20m1K90k58N4l9L28k94j65L89k86M9J8J36k49K22l1J08
5097B01j08j16K0J13k36Q4J73j36Q3l33K61J19j77N5QK26o04L68k80M13J63k84
5119A3o4j97K57J52k12K89l34l6P2K47n35K44J10r4K3M8m6K73l48K60j34j41K37
5142H4p0l4J46m5j98K13k33L62j98qq5M8J58l1k3J99j21j34R0k38J24m5l2J02
5166C1j19J4J06k06p0L94k22n7J68o5k39L65k12j38J99K94k52j61J73O7k00L07
5188A77l09L18l07J78k93N28n5j90M8j90K60k51P5J2k4KJ10o6n1J00m3Q7k53M35
5212B98l72l9r7K1J81J02L2j94m4k80M27q1J32ql3L7j70j3J5J85Q1j74nK06k45
$$ plain form
5237 -38 -57 -169 -14 -74 165 -6 -88 -262 63 23 -25 -301 -74 50 -101 -44 126 -49 -25 -136 111 -17 28
5260 28 -176 281 -14 37 -142 19 -153 153 26 181 -204 158 -6 -61 126 50 -41 -50 -138 143 -80 160 53
5283 53 -30 89 -24 22 -39 186 -41 71 87 38 -50 16 96 -197 -46 -87 27 216 65 -187 16 -10 -105 -121
5307 -121 223 22 -59 30 21 151 118 -93 56 83 -97 106 109 41 232 -119 -10 -123 52 207 -70 35 -3
5330 -3 24 288 99 58 42 105 -13 -140 130 -41 20 -64 140 -253 -65 -62 -101 -6 -47 -7 -51 46 25 -25 -22 -102 202
5357 202 -97 -161 182 -35 373 18 186 -22 61 75 91 -183 323 92 -210 -41 8 91 -142 22 121 -81
5379 -81 195 229 128 42 323 -18 15 248 104 -206 52 163 -160 -33 36 185 -48 56 184 8 74 -62
5401 -62 152 49 -163 -153 -62 -8 237 -259 -19 57 -190 104 -96 -58 -201 -233 248 50 260 -1 -72 17 -53
$$ packed form
5237c8j9j12J55o0K39j71q2j74L25m0m8k76K27J24j51N7J70j75K4j11K47j28M5
5260B8k04M57k95N1j79J61j72L06j27J55l85L62j64n5J87p6r1rq8K81k23K40j07
5283E3q3J19j13M6o1K25k27J12J6m9q8O6Q0k93J51m1J14J89j51k52K03k6r5j6
5307a21L44k01q1Q9rJ30l3k11J49K7j80K03Lo8J91l51J09j13J75J55k77J05l8
5330cK7K64j89m1j6O3j18j27K70j71O1q4K04l93J88Ll9R5m1M0m4R7k1n0Lq0L04
5357B02k99o4L43k17M08l55J68k08Q3J4J6k74N06k31l02J69M9Q3k33J64R9k02
5379h1K76L4j01q6K81l41L3K33j44l10K58J11l23J27O9J49k33J04J28j76O6j36
5401f2K14j03k12J0R1N4K45m96K40P6k47K94k00L8j43l2M81j98K10k61p1Q9p0
$$ plain form
5424 -53 -334 231 203 5 53 223 -247 -4 43 175 -90 118 53 111 -254 -172 89 -123 -177 -136 107 62 135 290
5448 290 -44 -242 -84 -190 -49 -40 261 -74 -225 4 -87 60 37 -42 -73 49 237 -147 -2 -32 141 -67
5470 -67 -114 76 44 -65 120 -79 257 -75 61 -133 39 -96 -149 -206 -9 -46 164 -25 28 -6 1 -140 -5
5493 -5 -72 -135 213 -10 8 179 54 -87 -130 -9 129 -23 210 2 99 28 157 -146 18 -63 204 -123 215
5516 215 -95 45 86 -126 -100 82 138 -6 -278 -214 223 205 -215 -79 182 131 191 -329 147 136 -142 -7 158
5539 158 109 29 155 -175 12 -46 25 27 -110 -120 111 33 -76 43 -377 23 -29 114 -114 46 16 -43 92 46
5563 46 -134 -112 52 87 69 -52 -43 36 -92 -207 -2 58 -192 -77 33 -78 199 38 -120 -238 66 31 -31
5586 -31 86 -22 172 -44 -62 -29 -200 206 -151 -33 67 160 194 -8 112 -206 6 259 -159 -53 34 1
$$ packed form
5424e3k81N65k8j98M8J70m70K43M7J32k65K08o5N8l65Q2K61k12n4M1K43m5P3J55
5448B90l34j98J58j06J41RL01l35j51K29r1J47k3p9l1J22J88l84J45l0J73k08
5470f7m7J90l2j09J85j99L36l32J36j94J72j35n3n7J97l7K10j89N3l4Pj41J35
5493eo7o3L48k23J8J71j25j41m3J21J38j52K33k08R7p1J29l03J64q1K67l27L38
5516B15l10J40M1k12K6J82N6j44k72O4M37j8m20J36K61n1O0n20M76j1k78J35J65
5539A58m9q0J26l30J87n8P1Kj37j0K31p8j09J19m20M00n2J43k28J60l0n9J35m6
5563D6j80K2J64L5j8j21RP9j28j15K05O0k50J15J10j11K77j61j58j18L04l5o2
5586c1J17j08J94k16j8L3j71M06l57J18J00R3L4k02J20l18K12K53m18J06Q7l3
$$ plain form
5608 1 -135 34 -44 -95 -151 207 -91 72 102 94 -67 5 35 -161 -19 -96 358 -206 141 230 60 -1 132 -45
5632 -45 -159 57 4 -65 8 -339 -122 -47 61 -226 -22 -361 -208 -67 -14 169 -45 164 170 44 -115 -132 -58
5655 -58 285 -73 265 -59 70 -9 72 -176 -35 -19 -197 62 51 74 -227 -39 45 84 -4 275 -7 -13 -27 106
5679 106 109 -98 -159 38 259 45 -15 41 134 -146 -101 -69 -19 2 -156 -34 -28 -41 4 41 78 30 143 196 -187 1
5705 1 -4 -119 80 198 54 34 -170 -48 -42 31 204 -58 -50 -127 283 -38 59 -94 -96 -132 -110 207 -84 -108 27 238
5731 238 18 203 -63 199 20 -35 -66 -230 55 -222 163 135 -107 139 -120 88 309 -30 -132 -43 -16 119
5753 119 -55 -128 -24 51 -120 -155 -69 -60 251 -20 -22 -122 -74 -125 337 -29 108 87 -28 83 135 125 -100 139
5777 139 222 77 163 -147 -86 91 -94 116 -106 -52 180 -60 14 -173 -100 -218 -41 -58 -69 70 -66 -95 -100 176
$$ packed form
5608Aj36J69p8n1n6L58k98J63L0qj61P2L0j96J42p7M54n64L47Q9j70o1J33j77
5632d5j14K16n3o9P3l47K17P5J08k87K04l39J53J41N3J83k14K09Oj26j59j7P4
5655e8L43l58L38l24J29p9Q1k48J41J6j78K59j1K3l01J88Q4L9q8K79k82oj4J33
5679A06Lk07o1J97K21k14o0N6R3k80M5L2N0K1j58J22Oj3M5L7L7m8J13N3l83J88
5705Anj15J99J18j44k0k04J22OP3J73k62Qp7M10l21R7j53kl6K2L17k91k4J35K11
5731B38k20J85k66K62j79n5l1j64K85k77L85k8k42K46k59K08K21l39j02Q9K7J35
5753A19j74p3J04P5j71l5Q6RL11k71kj00M8n1M62l66J37k1j15J11N2j0k25K39
5777A39Q3j45Q6l10O1J77j85K10k22N4K32k40P4j87P3j18J77j7j1J39j36k9nK76
$$ plain form
5801 176 -262 -46 -71 60 -208 98 -122 -225 -135 346 -67 -131 94 -86 -21 207 65 43 30 -165 -224 240
5823 240 -81 -129 -184 7 -104 -44 -183 173 33 -68 23 48 2 20 215 -116 274 -3 -76 -6 253 6 70
5846 70 -83 -156 -97 26 44 47 -43 -65 -153 -83 4 -9 235 -191 61 -213 -23 304 -348 -5 49 -76 1 106 46
5871 46 113 91 -112 -25 89 94 36 20 -21 -24 -156 25 -44 -106 76 -168 162 111 52 -144 -2 -408 120 132 -60
5896 -60 10 -6 139 -17 250 -130 34 34 119 -95 -44 40 -19 -14 -57 -122 -92 -63 60 114 -84 87 107 -26 -71 452
5922 452 23 55 -66 289 147 110 82 121 -247 118 200 42 -62 10 -15 -231 -133 -151 186 -60 166 -73 -63
5945 -63 -39 142 -424 19 -103 3 -62 -5 -42 101 -245 247 -8 -172 -49 48 123 -73 -93 -133 -156 149 70 3
5969 3 171 48 105 -23 25 -3 64 -173 -313 -49 122 92 184 -263 -124 24 -85 45 -89 163 150 34 111
$$ packed form
5801A76m38K16k5J31k68L06k20j03R0M81m13o4K25j80O5K28j42k2j3j95n9M64
5823B40l21m8n5J91j11O0j39L56j40j01R1K5m6J8J95l31L90k77p3P0K59k47O4
5846G0j53p3N9J23J8Lr0k2q8P0Q7j3K44m26K52k74J90L27o52L43N4j25P7J05o0
5871D6O7k2k03Q7J14Nn8j6m1lj32J81o9o2J82k44L30n1n9j96J42m06N28J2j92
5896f0P0j6J45j56K67l80J64%Q5k14N1Q4n9Nm3o5L0K9J23N4j98J71K0j33m5N23
5922D52m29L2j21L55j42l7k8L9l68L65Q2j58j04P2k5k16R8j8L37k46K26k39J0
5945f3K4J81n66M43j22J06o5N7l7J43l46M92k55j64J23R7P5j96k0m0k3L05p9o7
5969CJ68j23N7j28M8k8O7k37j40K64J71l0R2m47J39J48j09J30j34K52j3j16P7
$$ plain form
5992 111 180 33 -197 99 -29 6 302 -49 145 -85 -17 135 117 86 -158 -72 -43 124 93 13 88 262 133
6015 133 -174 45 -80 36 -357 -3 75 -155 205 37 -220 82 -210 116 104 -241 168 89 -9 -142 24
6036 24 176 -3 110 -105 376 -42 -123 -115 -72 141 -14 108 70 -205 6 0 -61 221 253 -228 159 60 -60 -55
6060 -55 118 58 -183 154 -83 11 -43 34 -14 92 -100 25 132 -36 -116 -40 293 29 275 222 322 -121 35
6083 35 75 -136 -140 -3 54 128 -110 -30 177 -33 0 -83 193 189 418 -25 -206 -77 111 -68 -38 -4 9 64 279
6108 279 65 -38 48 143 85 234 46 5 112 -2 172 61 178 184 -4 -232 163 -115 16 -203 -38 -36 112
6131 112 160 -15 217 -87 -68 -50 -174 -206 180 -51 -108 -65 -152 66 22 -119 36 47 126 -185 -5 111 66 -66
6155 -66 12 -85 -193 -57 -23 -93 -19 -16 -34 -89 -6 -303 -3 27 123 -97 137 -146 -95 6 -221 -47 72 21 -87
$$ packed form
5992A11O9j47k30K96j28L5K96l51J94k30O8J52j8l1k44Q6K9J67l1q0P5J74j29
6015A33l07K19j25J16l93L54P8k30L60j68k57L02k92L26j2l45M09p9r8j33J66
6036B4J52j79J13k15M81m18q1QM3K13j55J22l8k75K11oo1K82L2m81L87r9j20N
6060e5J73o0k41L37k37R4n4P7m8J06j92J25J07j68q0P6L33k64K46n3J00m43J56
6083C5M0k11mJ37N7P4k38Q0K07k10L3q3K76mK29m43j81J29J88j79L0L4J3N5K15
6108B79k14j03Q6R5n8J49j88m1J07j14J74j11J17Oj88k28L95k78J31k19J65KJ48
6131A12M8j75K32l04J9J8j24l2L86k31n7M3q7K18m4j41J55J1P9l11J80J16m5j32
6155f6P8r7j08J36L4p0P4Lj8n5Q3k97L00L0R6k20K34k83N1J01k27J74J19n1j08
$$ [...]
8191a32
##END NTUPLES=NMR FID
##END=
