##TITLE=1H_Pr TUr-8
 200.13MHz, CDCl3,
 8 sc
 
 8.9.2025
##JCAMPDX= 6.0         $$ Bruker NMR JCAMP-DX V2.0
##DATA TYPE= NMR FID
##DATA CLASS= NTUPLES
##ORIGIN= UXNMR, Bruker Analytische Messtechnik GmbH
##OWNER= pz
$$ XWIN-NMR		Version 3.5
$$ Mon Sep  8 16:21:02 2025 Russian Standard Time (UT+4h)  she@DPX200
##.OBSERVE FREQUENCY= 200.1313
##.OBSERVE NUCLEUS= ^1H
##.DELAY= (6, 6)
##.ACQUISITION MODE= SIMULTANEOUS
##.ACQUISITION SCHEME= undefined
##.AVERAGES= 8
##.DIGITISER RES= 18
##SPECTROMETER/DATA SYSTEM= spect
##.PULSE SEQUENCE= zg30
##.SOLVENT NAME= CDCl3
##.SHIFT REFERENCE= (INTERNAL, CDCl3, 0, 14.3821)
##AUDIT TRAIL= $$ (NUMBER, WHEN, WHO, WHERE, WHAT)
$$ ##TITLE= Audit trail, XWIN-NMR		Version 3.5
$$ ##JCAMPDX= 5.01
$$ ##ORIGIN= Bruker BioSpin GmbH
$$ ##OWNER= she
$$ F:/spectra/data/she/nmr/H-C/1/audita.txt
$$ ##AUDIT TRAIL=  $$ (NUMBER, WHEN, WHO, WHERE, WHAT)
(   1,<2025-09-08 16:19:31.46 +0400>,<she>,<DPX200>,
      <created by zg, POWCHK disabled, PULCHK disabled
       configuration hash MD5:
       00 E9 B6 7A A2 85 ED C7 34 08 36 98 17 FE 4E 26
       data hash MD5: 16K
       D6 88 4F C4 94 13 82 15 77 0E 2B 4F A1 1F 0F 7C>)
$$ ##END=
$$ 
$$ hash MD5
$$ AB 6B D5 5D 9E D8 EB 53 94 B9 0F 71 9C 54 4A 46
##$RELAX= 
##$RELAX= 
##$RELAX= 
##$RELAX= 
##$RELAX= 
##$RELAX= 
$$ Bruker specific parameters
$$ --------------------------
##$DU= <F:/spectra>
##$EXPNO= 1
##$NAME= <H-C>
##$PROCNO= 1
##$TYPE= <nmr>
##$USER= <she>
##$AMP= (0..31)
100 100 100 100 100 100 100 100 100 100 100 100 100 100 100 100 100 100 
100 100 100 100 100 100 100 100 100 100 100 100 100 100 
##$AQSEQ= 0
##$AQ_mod= 1
##$AUNM= <au_zg>
##$AUTOPOS= <>
##$BF1= 200.13
##$BF2= 200.13
##$BF3= 200.13
##$BF4= 200.13
##$BF5= 200.13
##$BF6= 200.13
##$BF7= 200.13
##$BF8= 200.13
##$BYTORDA= 1
##$CFDGTYP= 0
##$CFRGTYP= 5
##$CHEMSTR= <none>
##$CNST= (0..31)
1 1 145 1 1 1 1 1 1 1 1 1 1 1 1 1 1 1 1 1 1 1 1 1 1 1 1 1 1 1 1 1 
##$CPDPRG= <>
##$CPDPRG1= <>
##$CPDPRG2= <>
##$CPDPRG3= <>
##$CPDPRG4= <mlev>
##$CPDPRG5= <mlev>
##$CPDPRG6= <mlev>
##$CPDPRG7= <mlev>
##$CPDPRG8= <mlev>
##$CPDPRGB= <>
##$CPDPRGT= <>
##$D= (0..31)
0 0.7 0 0 0 0 0 0 0 0 0 0.03 0 0 0 0 0 0 0 0 0 0 0 0 0 0 0 0 0 0 0 0 
##$DATE= 1757333970
##$DBL= (0..7)
120 120 120 120 120 120 120 120 
##$DBP= (0..7)
150 150 150 150 150 150 150 150 
##$DBP07= 0
##$DBPNAM0= <>
##$DBPNAM1= <>
##$DBPNAM2= <>
##$DBPNAM3= <>
##$DBPNAM4= <>
##$DBPNAM5= <>
##$DBPNAM6= <>
##$DBPNAM7= <>
##$DBPOAL= (0..7)
0.5 0.5 0.5 0.5 0.5 0.5 0.5 0.5 
##$DBPOFFS= (0..7)
0 0 0 0 0 0 0 0 
##$DE= 6
##$DECBNUC= <off>
##$DECIM= 32
##$DECNUC= <off>
##$DECSTAT= 4
##$DIGMOD= 1
##$DIGTYP= 9
##$DL= (0..7)
0 120 120 120 120 120 120 120 
##$DP= (0..7)
150 150 150 150 150 150 150 150 
##$DP07= 0
##$DPNAME0= <>
##$DPNAME1= <>
##$DPNAME2= <>
##$DPNAME3= <>
##$DPNAME4= <>
##$DPNAME5= <>
##$DPNAME6= <>
##$DPNAME7= <>
##$DPOAL= (0..7)
0.5 0.5 0.5 0.5 0.5 0.5 0.5 0.5 
##$DPOFFS= (0..7)
0 0 0 0 0 0 0 0 
##$DQDMODE= 0
##$DR= 18
##$DS= 0
##$DSLIST= <SSSSSSSSSSSSSSS>
$$ [...]
##$SUBNAM0= <"">
##$SUBNAM1= <"">
##$SUBNAM2= <"">
##$SUBNAM3= <"">
##$SUBNAM4= <"">
##$SUBNAM5= <"">
##$SUBNAM6= <"">
##$SUBNAM7= <"">
##$SUBNAM8= <"">
##$SUBNAM9= <"">
##$SW= 18.0517328524113
##$SWIBOX= (0..15)
0 0 2 0 0 0 0 0 0 0 0 0 0 0 0 0 
##$SW_h= 3612.71676300578
##$TD= 16384
##$TD0= 1
##$TE= 0
##$TE2= 300
##$TE3= 300
##$TEG= 300
##$TL= (0..7)
0 120 120 120 120 120 120 120 
##$TP= (0..7)
150 150 150 150 150 150 150 150 
##$TP07= 0
##$TPNAME0= <>
##$TPNAME1= <>
##$TPNAME2= <>
##$TPNAME3= <>
##$TPNAME4= <>
##$TPNAME5= <>
##$TPNAME6= <>
##$TPNAME7= <>
##$TPOAL= (0..7)
0.5 0.5 0.5 0.5 0.5 0.5 0.5 0.5 
##$TPOFFS= (0..7)
0 0 0 0 0 0 0 0 
##$TUNHIN= 0
##$TUNHOUT= 0
##$TUNXOUT= 0
##$USERA1= <user>
##$USERA2= <user>
##$USERA3= <user>
##$USERA4= <user>
##$USERA5= <user>
##$V9= 5
##$VALIST= <valist>
##$VCLIST= <CCCCCCCCCCCCCCC>
##$VD= 0
##$VDLIST= <DDDDDDDDDDDDDDD>
##$VPLIST= <PPPPPPPPPPPPPPP>
##$VTLIST= <TTTTTTTTTTTTTTT>
##$WBST= 1024
##$WBSW= 4
##$XGAIN= (0..3)
0 0 0 0 
##$XL= 0
##$YL= 0
##$YMAX_a= 519561
##$YMIN_a= -633535
##$ZGOPTNS= <>
##$ZL1= 120
##$ZL2= 120
##$ZL3= 120
##$ZL4= 120
##$ABSF1= 10
##$ABSF2= 0
##$ABSG= 5
##$ABSL= 3
##$ALPHA= 0
##$AQORDER= 0
##$ASSFAC= 0
##$ASSFACI= 0
##$ASSFACX= 0
##$ASSWID= 0
##$AUNMP= <proc_1d>
##$AZFE= 0.1
##$AZFW= 0.1
##$BCFW= 1
##$BC_mod= 2
##$BYTORDP= 1
##$COROFFS= 0
##$CY= -3
##$DATMOD= 1
##$DC= 2
##$DFILT= <>
##$DTYPP= 0
##$F1P= 0
##$F2P= 0
##$FCOR= 0.5
##$FTSIZE= 0
##$FT_mod= 4
##$GAMMA= 1
##$GB= 0.15
##$INTBC= 1
##$INTSCL= 1
##$ISEN= 128
##$LB= 0.25
##$LEV0= 0
##$LPBIN= 0
##$MAXI= 10000
##$MC2= 0
##$MEAN= 0
##$ME_mod= 0
##$MI= 1.114404
##$NCOEF= 0
##$NC_proc= 0
##$NLEV= 6
##$NOISF1= 3.799351
##$NOISF2= 2.8
##$NSP= 1
##$NTH_PI= 0
##$NZP= 0
##$OFFSET= 14.38212
##$PC= 1
##$PHC0= -1562.424
##$PHC1= 13.79228
##$PH_mod= 1
##$PKNL= yes
##$PPARMOD= 0
##$PSCAL= 0
##$PSIGN= 0
##$REVERSE= no
##$SF= 200.129724274929
##$SI= 16384
##$SIGF1= 3
##$SIGF2= 2
##$SINO= 400
##$SIOLD= 16384
##$SREGLST= <1H.CDCl3>
##$SSB= 0
##$STSI= 0
##$STSR= 0
##$SW_p= 3205.1282051282
##$SYMM= 0
##$S_DEV= 0
##$TDeff= 0
##$TDoff= 0
##$TI= <>
##$TILT= no
##$TM1= 0
##$TM2= 0
##$TOPLEV= 0
##$USERP1= <user>
##$USERP2= <user>
##$USERP3= <user>
##$USERP4= <user>
##$USERP5= <user>
##$WDW= 1
##$XDIM= 8192
##$YMAX_p= 0
##$YMIN_p= 0
$$ End of Bruker specific parameters
$$ ---------------------------------
##NTUPLES= NMR FID
##VAR_NAME=  TIME,          FID/REAL,        FID/IMAG
##SYMBOL=    X,             R,               I
##VAR_TYPE=  INDEPENDENT,   DEPENDENT,       DEPENDENT
##VAR_FORM=  AFFN,          ASDF,            ASDF
##VAR_DIM=   8192,          8192,            8192
##UNITS=     SECONDS,       ARBITRARY UNITS, ARBITRARY UNITS
##FACTOR=    0.0002768,     1,               1
##FIRST=     0,             0,               0
##LAST=      2.2672688,     0,               0
##MIN=       0,             -633535,         0
##MAX=       2.2672688,     519561,          0
$$ Real data points
##PAGE= N=1
##DATA TABLE= (X++(R..R)), XYDATA
$$ [...]
2254D81q46P0J403p40j301O50N89p11K84J131p26j197O12O46p14M77O15q94n66
$$ 481 -365 -295 1108 368 -933 -283 306 -405 -121 1010 284 -913 -301 345 -369 108 723 -171 -737
2273g37R56L11q28L18M17j001l01Q29L45l15j11L05p07q5J313k82n39L82l66l45
$$ -737 219 530 -298 20 437 -564 -865 -36 309 -6 -117 188 -519 -604 709 427 -112 270 -96 -441
2293d41P53j57q8j67R5R5l32J45N50m33j45L00m09J86R8K57l13j69L7L67k39J25
$$ -441 312 155 67 -100 -5 90 -242 -97 453 20 -125 175 -234 -48 50 307 -6 -175 -138 229 -10 115
2315A15L70o25J76NN4k18J74M5k5j20r7M17m86N48j64l56N3R5J53O8j89J58k41
$$ 115 485 -140 36 41 95 -123 51 96 71 -49 -146 271 -215 333 169 -187 -134 -39 114 182 -7 151 -90
2338i0n6K78K0l82K67K04m59k7L60R8m60K56O6j26j51K32M38p84J91L64j63k27
$$ -90 -146 132 152 -230 37 241 -218 -245 115 213 -247 9 75 -51 -202 30 468 -316 -125 239 76 -151
2360a51M96m1n03J39K68j35j42P7M9k70K55J34j65q6N07l99k95K81K49l67j75
$$ -151 345 304 -199 -60 208 73 -69 8 57 -213 42 176 11 -75 432 33 -262 19 268 -99 -274
2381b74O12o1m90M20J67m08Q1mk23j16L53k77o0r6N99l53l39P66ml35K5K43m77
$$ -274 338 277 -213 207 374 -34 47 43 -180 -296 57 -220 -280 -376 223 -130 -469 297 293 -42 -17 226 -251
2404b51L41L5j34k68N20r7l93L50M57r34L47K36l10j83N45J7l85L1K5k35O3M25
$$ -251 90 125 -9 -277 243 146 -247 103 560 -374 -27 209 -101 -284 261 278 -107 -76 -51 -286 -223 202
2426B02l4m25M96K52p59K01O03l78o23P71k90k79L09J3k39j43M21K55o68N29K14
$$ 202 168 -257 239 491 -268 -67 536 158 -465 306 16 -263 46 59 -180 -323 98 353 -315 214 428
2447D28n74R5Q37o86l55N15J3k99j56P11o95j75P33p9p85N99N50j214M16N89m21
$$ 428 -146 -51 786 100 -255 260 273 -26 -182 529 -166 -341 392 313 -472 127 677 -537 -121 468 47
2468D7m86L60L51q61M34J059o16o74P53k28p80R80N46j198k58R32n02p55J329
$$ 47 -439 -79 272 -589 -155 904 288 -386 367 139 -641 339 885 -313 -571 361 -141 -896 433
2487D33L74j354QJ029p72n80J629j76j123J00R20o79l5J314p88j229P82R39j282
$$ 433 807 -547 -539 490 -282 -862 767 591 -532 -432 488 -191 -226 1088 300 -929 -147 792 -490
2506d90p1J465j006j028J267M87q69MJ031j188q29J610N80j579N10J023j881j51
$$ -490 -561 904 -102 -1130 137 624 -245 -241 790 -398 -1227 383 963 -616 -106 917 -964 -1115
2524a115K202m70j117O61K50j664M91J925l42j667Q88M05j857J101K082j659j109
$$ -1115 1087 617 -500 161 411 -1253 -762 1163 821 -846 42 447 -1410 -309 1773 114 -995
2541i95J391k98j563J666J516j800j133J411nj474J844J193k661j60J401l61o73
$$ -995 396 98 -1465 201 1717 -83 -1216 195 190 -1284 560 1753 -908 -1068 333 -28 -701
2558g01J799J89k472j08J991n64j012K257l90k853J153J822r82q39K035p96k618
$$ -701 1098 1287 -1185 -1293 698 134 -878 1379 989 -1864 -711 1111 129 -710 1325 529 -2089
2575b089J788J651j474k71J834j764k062K076K184k130J44J192j921j034K702
$$ -2089 -301 1350 -124 -395 1439 -325 -2387 -311 1873 -257 -113 1079 -842 -1876 826
2590H26J000k462O14P98j939l39L366m15k558P52Q81j820N21K777n40k878R37
$$ 826 1826 -636 -22 776 -1163 -1502 1864 1449 -1109 -357 524 -1296 -775 2002 1462 -1416 -479
2607d79J009j720J205K377j783k557J976N24j621J475J806k291k141K418K82j290
$$ -479 530 -1190 15 2392 609 -1948 28 552 -1069 406 2212 -79 -2220 198 480 -810
2623h10J816R18l026j148K995P4j339J526L54k952k25K943j06j609J735j86l104
$$ -810 1006 1924 -1102 -2250 745 819 -520 1006 1360 -1592 -1817 1126 1020 -589 1146 960 -2144
2640b144R70K637p54j216J288p34k106J745K547j670j368J796j395j576K403J535
$$ -2144 -1174 1463 709 -507 781 47 -2059 -314 2233 563 -805 991 -404 -1980 423 1958
2656A958j977q45J529j314r70K957P63k782n86J690j177n72K996j88k874P21J249
$$ 1958 -19 -864 665 -649 -1619 1338 2101 -681 -1267 423 -754 -1326 1670 1482 -1392 -671 578
2673E78j140k12K821j049k586R25J331j235L79K082j784j996J602J299j329O19
$$ 578 -562 -774 2047 998 -1588 -663 668 -567 -188 1894 110 -1886 -284 1015 -314 305
2689C05J106j686j783K078J216j550M78R91j982r78K780L65j657O96L27k018o
$$ 305 1411 -275 -2058 20 1236 -314 164 1155 -827 -1805 975 1340 -317 379 706 -1312 -1318
2706a318K532j14j811P63K03j631O50K293q41j570J060m52q74J022J799j161j821
$$ -1318 1214 1100 -711 52 255 -1376 -726 1567 726 -844 216 -236 -1110 -88 1711 550 -1271
2723a271J539q3j122J233J138k018n07J200j26o41R66O44j459n24J353j47o98
$$ -1271 268 185 -937 296 1434 -584 -1091 109 -17 -658 308 952 -507 -1031 322 175 -523
2740e23J395K05k117L9J624j60o76Q79j30j576M13J450o93k92P46k26j609R67
$$ -523 872 1077 -1040 -1001 623 463 -213 666 536 -1040 -627 823 130 -162 584 358 -1251 -284
2758b84J071o20n08Q10n11q35J038O93r21l64R09p06n24J094M17j113kQ51j059
$$ -284 787 167 -341 469 -42 -877 161 854 -67 -431 478 -228 -752 342 759 -354 -356 495 -564
2777e64K8R58L43j191K91O52p59k02J275l71r86Q21j45m56J23Q72m54p80N85M44
$$ -564 -536 422 765 -426 -135 517 -242 -444 831 460 -526 295 150 -306 -183 689 235 -545 40 484
2797D84n59k9P40p80o43P83M89n90N3K14l78j43O58O8o23K64K34m71k58P19j31
$$ 484 -75 -104 636 -144 -787 -4 485 -105 -52 162 -216 -359 299 367 -256 8 242 -229 -487 232 101
2818A01m45L09qn4j98N66j44n20M95K40n62K46L39n51j66N84m1l67K9N21k80l93
$$ 101 -344 -35 -43 -97 -295 271 127 -393 102 342 -220 26 365 -186 -352 232 191 -176 -147 374 94 -299
2840b99N81J37o81kO63m75j5L15j35k54N67p5m66j1L29j91j03J41O8k46j72O79
$$ -299 282 419 -262 -264 399 -76 -91 224 89 -165 402 327 -139 -150 179 -12 -115 26 94 -152 -324 355
2862C55k52l34K22K2J2l00N13m13m6N50k53l19L88M7j01k87J92L14k98j42M80
$$ 355 103 -231 -9 13 25 -275 238 -175 -221 329 76 -243 145 192 91 -196 -4 310 12 -130 350
2883C50o25J97J04k18m4N80k86m52N86M4n74L6N73j12j84K3K20l68m8J42o8J10
$$ 350 -275 -78 26 -192 -236 344 58 -394 192 236 -338 -302 271 159 -25 -2 218 -150 -198 -56 -124 -14
2905a4J42o0m46N74p3j75j91K02K9m51L23L96o75K59N67k41m77L34N31r00J97
$$ -14 128 68 -378 196 123 -52 -243 -41 -12 -463 -140 256 -419 -160 407 166 -311 23 554 -346 -149
2926a49K38J2l12J31L32n10L41J60n26o1P37j17q48O03L14o57K20M10j24n32M10
$$ -149 89 101 -211 -80 252 -258 83 243 -283 -344 393 276 -572 31 345 -312 -92 318 194 -338 72
2947G2J59o87L76O04n85p4K63O4n25J48L99k30k58M90M0q05P00L92o54O0L06k15
$$ 72 231 -456 -80 524 -61 -135 128 192 -333 -185 214 -16 -274 216 256 -549 151 543 -111 -51 255 40
2969D0l10M59L13q18j85R40n63l95O78j12o64O69M56q89J82O55j00q32M75P26
$$ 40 -270 189 502 -316 -501 439 -124 -519 159 47 -617 52 508 -381 -199 456 356 -476 -1 725
2989G25r44j8R87q85o28J073M16r14K05O56j029j99M26P99j004L60L34p67KJ126
$$ 725 -219 -237 750 -135 -763 310 726 -188 17 673 -356 -555 -129 670 -334 26 360 -407 -405 721
3009G21l01p58M35K52o69k54J255k75r67M38N00j365N81J441o98j429J184K38
$$ 721 420 -338 97 349 -320 -574 681 406 -561 -123 377 -988 -407 1034 336 -1093 91 329
3027C29j003M01J158j070o71R49K03j038J002O18j238p37J303n3o13Q42M51j513
$$ 329 -674 -273 885 -185 -856 93 296 -742 260 878 -360 -1097 206 153 -460 382 833 -680
3045f80o7J414k49p83R30L6j749M91J426n86o77R48j86j097K48J720q68q05J153
$$ -680 -747 667 418 -365 565 601 -1148 -657 769 183 -494 454 268 -829 -581 1139 271 -534 619
3064F19o65j117J037J488j335l90O37m89p64J336J325j769l63O37m71q04K228
$$ 619 -46 -1163 -126 1362 27 -363 274 -215 -979 357 1682 -87 -450 187 -284 -1088 1140
3081A140J21j945K92R79r85k40J702k20j533k0J114r22J27J653q72j863R60R47
$$ 1140 1261 -684 -392 587 -398 -638 1064 844 -689 -709 405 -517 -390 1263 391 -1472 -512 435
3099D35r25N24J238j336j633J610J001j042N73N71j505j137K183N33j343M19L95
$$ 435 -490 34 1272 -64 -1697 -87 914 -128 445 1016 -489 -1626 557 1090 -253 166 561
3116E61j314k93J731K72j436O53K71j786K80K226l11j482Q65j36j368N76K060
$$ 561 -753 -1046 685 957 -479 174 445 -1341 -1061 1165 854 -628 237 101 -1267 -691 1369
3133A369p25j356R46J44j828J477J800j598j353J296k35r60J551J149j839j145
$$ 1369 644 -712 234 378 -1450 27 1827 229 -1124 172 -63 -1023 528 1677 -162 -1307
3149a307J397q3o39J445O07k346k03J544p1p10J610m89k386K42K033l81l29R04
$$ -1307 90 7 -632 813 1420 -926 -1129 415 344 -366 1244 755 -1631 -1389 644 263 -66 838
3167H38k07k342J102J914r21k79O65p70j432J087J574j164l11J014j182p79J430
$$ 838 631 -1711 -609 1305 384 105 770 0 -1432 -345 1229 65 -246 768 -414 -1193 237
3184B37J018j552p5R94j200k97J782N68j804l34J060j097m0J687J19k033N98M92
$$ 237 1255 -297 -372 622 -578 -875 907 1475 -329 -663 397 -700 -740 947 1066 -967 -369 123
3202A23p23L61J228m10j830O16J072q02M24J644j757j098P64P87p20N28P92j213
$$ 123 -600 -239 989 579 -1251 -635 437 -365 59 1703 -54 -1152 -388 399 -321 207 999 -214
3220b14r61J083O55p37K91P50j624n13J642M41j066N03M38j577J18J595j50j100
$$ -214 -1175 -92 563 -174 117 867 -757 -1270 372 813 -253 250 688 -889 -771 824 674 -426
3238d26O06K70j132J96J580p05j029Q79m20o87Q57J076r12n42L53r5o70J039N73
$$ -426 180 450 -682 -486 1094 389 -640 239 -181 -868 -11 1065 153 -389 -36 -131 -801 238 811
3257H11q04r39R77J21q10J054K42q66l66J126n51l42R56rj287O7Q30k56k75R84
$$ 811 7 -932 45 166 -644 410 652 -214 -580 546 -5 -347 609 600 -687 -620 210 -46 -321 663
3277F63n01p77N41N94m87k56P50n55p13O69L61k83m5K84m40n10P76L38m43l28
$$ 663 162 -615 -74 520 33 -223 527 -28 -741 -72 289 6 -39 245 -195 -705 71 409 -34 -362
3297c62O61n56l30Q50J8l41o3K26l97N1Q36m10m03j9M66p39J22R22l55o79P40
$$ -362 299 -257 -587 263 281 -60 -123 103 -294 -243 593 183 -220 -239 227 -512 -390 532 177 -502 238
3318B38j56n02P8P63l09o64O86J3l63K11M86m83k94M31q4n81O46j8p9l61M05K0
$$ 238 82 -420 -342 421 112 -552 134 147 -216 -5 481 -2 -296 135 51 -530 116 98 19 -342 63 83
3340H3k74P0L77n48K91M07l2l84J54o8m61L59J63k18L9L51k83l62J61K25o8l0
$$ 83 -191 -121 256 -292 -1 406 374 -10 144 76 -385 -26 137 -81 -42 309 26 -336 -175 50 -18 -48
3362d8k6n2K50k49Q0P4J3n1j6l02J02L6J30p5L27l15J23kk79K54k5l3J08j2r5
$$ -48 -74 -126 124 -125 -45 29 42 -9 -25 -327 -225 -189 -59 -134 193 -122 1 -1 -280 -26 -51 -84 24 12 -83
3387h3l1k66M15j1j28K2J34J52l4r2J65j95q6J43j18k83L67J45l14K52nj36J1
$$ -83 -114 -380 35 24 -104 -82 52 204 170 78 243 48 -38 105 -13 -296 71 216 -98 154 149 13 24
3410B4L7m4j4K15r2N0r1J54l52j2o4J60k7J16k59M5QO4j21J75m5r4K20J42J40
$$ 24 61 17 3 218 126 176 85 239 -113 -125 -189 -29 -56 60 -199 -154 -146 -82 -203 -28 -73 -167 53 195 335
3435C35n79L26J19j31k49L46k8N2j76M9l7j95J54R8j55J50K9l41M14o3j23q7j50
$$ 335 -244 82 201 70 -179 167 139 191 15 64 27 -168 -14 84 -71 79 108 -233 181 118 -5 -92 -242
3458b42N74n15R9K41K89m16j75J48m7MJ14j16k70n8M18k67R8K14k85L8J95M0k46
$$ -242 332 -183 -84 157 446 30 -145 3 -44 -40 74 -42 -312 -370 48 -219 -121 93 -192 -154 41 81 -165
3481a65K92k90L05j21K7K59n49Q1M79j61j38L08Q1l89N7L8k39j80L77M9k60J02
$$ -165 127 -163 142 21 48 307 -242 -161 318 157 19 327 408 19 76 114 -125 -305 72 121 -139 -37
3503c7K49j56Q7N5m39L94m64M01J1j26L17j05m92L02K3k70o1N95n86j20J84L55
$$ -37 212 56 143 198 -241 153 -311 90 101 -25 292 187 -305 -3 20 -250 -311 284 -302 -422 -238 117
3525A17j78K36J30k13m00M81Pl80J58J69m46k12P52L9l61Q4q3k98M01L24J29p90
$$ 117 -61 175 305 92 -308 173 180 -200 -42 127 -319 -531 221 260 -101 -17 -100 -398 3 327 456 -334
3547c34L24K17p15M76M18m2m42L3R4n95P14N34n40p22M36M22o20N94M37q88l89
$$ -334 -10 207 -508 -32 386 344 -98 -65 29 -566 148 682 142 -580 -144 278 -342 252 689 -199 -588
3568e88N80K62k64K09K12o97o95J309j21j71K95j7j008M03O77k09k52O7O4r91
$$ -588 -8 254 -10 199 411 -286 -981 328 207 36 331 314 -694 -291 386 177 -75 -8 56 -935
3588i35Q53P40k10o49Q10p12p90Q15P63l74p43R29o85p02J205K44m34n50M01n35
$$ -935 -82 658 448 -201 609 -103 -893 -78 685 311 -432 497 -188 -890 315 559 125 -425 -24 -559
3608e59j09J359J61j120j81N81n63M0J196p0j308K80P78n77J53R22o16j635J055
$$ -559 -668 691 852 -268 -449 132 -431 -391 805 735 -573 -293 485 -92 61 983 367 -1268 -213
3627b13J04k0K63P55p61j506J189J003j202O49L99j110m75J059O83p69M15J15
$$ -213 -109 -129 134 889 128 -1378 -189 814 -388 261 660 -450 -925 134 817 48 463 578
3645E78j082l64J173N44j165J97M54j425K40J776k52j143O17k86n76M46J270m11
$$ 578 -504 -868 305 849 -316 -119 335 -1090 -850 926 674 -469 148 -138 -714 -268 1002 591
3663E91r25P7N6p37J085J166j185r19O43J68n82P66J002j265p52R81k7o38J143
$$ 591 -334 -257 -201 -938 147 1313 128 -791 -148 20 -562 204 1206 -59 -811 170 143 -495 648
3682F48L28j564l37J277j53m80J121j00j817M01J334l24o26Q96n19j063N24J036
$$ 648 976 -588 -925 352 199 -281 840 740 -1077 -676 658 334 -292 604 85 -978 -454 582
3700E82p68p6N92k89j222Q90J290j134j36O64o09p27J236N84q08k38M71r05k03
$$ 582 -186 -262 330 41 -1181 -291 999 -135 -271 393 -216 -943 293 877 69 -169 302 -603 -806
3719h06J260P16j354k08N28p29p8J628l80j042K55L49m22Q0J228q78r52N79K66
$$ -806 454 1170 -184 -392 136 -593 -671 957 577 -465 -210 139 -283 -203 1025 147 -805 -226 40
3738D0p74P96Q44p32p98Q03R6o01L84P34r01n49J043K09j084Q56j7p61k48R57
$$ 40 -734 62 906 174 -624 179 275 -326 58 792 -109 -658 385 594 -490 366 349 -412 -660 297
3758B97M42r57L87M69j244j11J370l16m83J89j23o55N75P50m40n07O86q7q85N84
$$ 297 739 -218 169 638 -606 -717 653 337 -146 43 -80 -735 -160 590 150 -357 329 242 -643 -59
3778e9R12q96l13L82M5m91M52P30q82k84P66l40n59P56M38r05j97P19l1m82N25
$$ -59 853 -43 -356 26 71 -420 32 762 -120 -404 362 22 -537 219 657 -248 -445 274 243 -239 286
3799B86N1n81K8Q35p66M5L27l7q33N26M22k57l02O92m97l97M24M58o34j33Q97
$$ 286 337 -244 -216 619 -147 -102 225 188 -645 -119 303 46 -256 436 -61 -458 -34 424 -210 -343 554
3820E54l56n57N75J14l43j83M68l80J07K17j5l24J48J30j39m3n1L25l66J90O1
$$ 554 198 -359 216 330 -13 -196 272 -108 -1 216 201 -123 25 155 16 -27 -78 247 -119 71 132
3841A32j41k23N38m32r5K81K60n84l2N62l95M8J28j0N2r5K68m48k09N54k94N0
$$ 132 -9 -232 306 -126 -221 60 320 -264 -296 266 -129 -81 47 37 89 -6 262 -186 -395 159 -135 -85
3863h5M1K09k81J95k17K11j02K53N7n95K73K99l18p9J60r1j18L22J64l03k53L37
$$ -85 -44 165 -116 79 -138 73 -29 224 281 -314 -41 258 -60 -139 21 -70 -188 134 298 -5 -258 79
3885G9k08K08R3p4k23J91j90j30L09Kj65M5j21M07j81j27K39m39J83jN5K25k41
$$ 79 -129 79 172 98 -125 66 -124 -254 55 57 -108 -63 -184 223 42 -85 154 -285 -102 -103 -48 177 -64
3908f4J12K54k18j75O6n6K84j05j20r0K08J32j10j10j33J78j02L67l38k91M71
$$ -64 48 302 84 -91 -25 -81 203 98 -22 -112 96 228 118 8 -125 53 -49 318 -20 -311 160
3929A60j56L6K07j99J96j82J10k52J35J11l22M12k91K94l34k98L58J04Jk71K32
$$ 160 4 40 247 48 244 62 172 -80 55 166 -156 256 -35 259 -75 -373 -15 89 90 -181 51
3950E1L3N2k00j33J57J15j01J68j00p9MK7j44P8K92n00L83m14J95Q3J23L8m38
$$ 51 84 136 -64 -197 -40 75 -26 142 42 -37 -33 -6 -150 -72 220 -280 103 -311 -116 -33 90 128 -310
3973c10M68k08L9j39R6L00m6m4J53m00m2M7K05r0K7K15l54J95rl02K4K64J82Q
$$ -310 158 -50 -11 -150 -54 246 200 156 309 -91 -133 -86 119 29 56 271 -83 112 103 -199 -175 89 271 279
3997B79n59L95l31K63L39l24p4J66J8k62j69L06P3k10J3j25M2%L11j00j58M54
$$ 279 -280 115 -216 47 386 62 -12 154 172 -90 -259 47 120 -90 -77 -202 -160 -160 151 51 -107 347
4019C47j8n62L29j78J41l54L52K25o87L79J98k20j48J98j10j51N20q3n72L25K55
$$ 347 329 -233 96 -82 59 -295 57 282 -405 -26 172 -48 -196 2 -108 -259 261 178 -394 -69 186
4040A86j91K8K84k36l01j9N08k42n9L18l22l80M98J84l90j7M14l85m54K04P86
$$ 186 -5 23 307 71 -230 -249 259 17 -42 276 -46 -426 72 256 -134 -151 263 -122 -576 -372 414
4061D14o99K40N21p69KM40K92n99K14j02k68m4Q93k69p10P57Q9p64J06O66mo33
$$ 414 -285 -45 476 -293 -291 149 441 -158 56 -46 -314 -358 535 266 -444 313 402 -362 -256 410 406 -227
4083b27K2O89r10K65R16o27n40J37M14m29N15M62p40l95P12m9m68M49L67r68k63
$$ -227 -205 484 -426 -161 755 128 -412 -275 139 -290 225 687 -53 -448 264 215 -253 196 563 -405 -668
4104f68O49M30q44R49j47q45K13Q05q3n96P85p59p46O35P92l33q69R69j71q28
$$ -668 -19 411 -433 516 369 -476 -263 542 459 -137 648 -111 -857 -222 570 237 -632 337 166 -662
4124f62O66O63r22K5L73k43n77P69Q56j240p1N99m31o48J294J25r16J1M56n34
$$ -662 4 667 -255 -230 143 -100 -677 92 948 -292 -363 236 -195 -843 451 576 -340 -329 127 -407
4144d07k7J106R5j393M69N65q52K27J034l04j093L81O05o16L86P82o33j237Q83
$$ -407 -434 672 767 -626 -157 408 -444 -217 817 513 -580 -199 406 -210 176 958 325 -912 -29
4163b9K76l82M83M63j018o20J176q0l12L81L73j422j32J124O6o60N96J1q80j57
$$ -29 247 -135 348 811 -207 -827 349 269 -43 338 711 -711 -843 281 347 -313 283 294 -586 -743
4183g43J422k92q91R12n41p39O96P82l66o87Q49n11o14P54R61j271m40Q44q2o93
$$ -743 679 387 -504 408 -133 -872 -176 606 240 -447 402 -109 -723 31 992 -279 -719 125 43 -650
4203f50Q35Q27j381j53R51o41j94Q44M31j498K73Q27q04p7P82J30j073K14R24
$$ -650 185 1012 -369 -522 429 -212 -406 438 869 -629 -356 471 -333 -410 372 502 -571 -357 567
4222E67o65Q4P31n95q36K84R60n76k3N78l55j042R89N57o57j77O15p18o43J331
$$ 567 -98 -14 717 122 -714 -430 530 -46 -69 509 154 -888 101 658 1 -176 439 -279 -922 409
4242D09M36j038P9L63p07j98J244j14q53L93K1m20L8R40j97r25N62K55o47K11
$$ 409 845 -193 -114 249 -458 -656 588 474 -379 14 35 -385 -347 593 396 -529 33 288 -359 -148
4262a48O97m09o08K47K69n13O46N94j040J00L34m5n43O78L0n70k74Q26l33k56
$$ -148 549 140 -468 -221 48 -465 181 775 -265 -165 169 124 -419 259 289 -281 -555 271 -62 -318
4282c18N00K02p29j4Q86m92l57O62J70j032L74L31O6l28J95J9o05M83M29m01l34
$$ -318 182 384 -345 -359 527 35 -322 340 510 -522 -148 183 249 -79 116 135 -470 13 442 41 -293
4303b93M80j29n35L26O11n49O3L84o58M5K35M74m86l2K54k25K9L10k09l61J67
$$ -293 187 58 -477 -151 460 -89 -26 358 -300 -255 -20 454 -32 -64 190 -35 -6 304 95 -266 -99
4324i9L73k02l13M96j43m41M28MJ2q4J3J00l68M36k16K7j63M89m25l36L03K85
$$ -99 274 72 -241 255 112 -329 99 103 115 31 44 144 -224 212 -4 23 -140 349 -76 -412 -109 176
4346A76k66K79j55j7r1K99j64p34P08M30n96K36K9j54J07J36j15m35k9K28J20
$$ 176 -90 189 34 17 -74 225 61 -673 35 465 -131 105 134 -20 87 223 108 -327 -356 -128 -8
4367hl23M01j0R5j76L16m72%K95k10L83m53n7m5L09J72k29m8m4J45k05J26j17
$$ -8 -331 70 60 155 -21 295 -177 -177 118 -92 291 -162 -219 -264 45 217 -12 -60 -104 41 -164 -38 -155
4390a55J03k31J06J72J1J24j00k1K2j12J07m23M45J85k62k3J21R9l44N7J80r0
$$ -155 -52 -283 -177 -5 6 130 30 9 31 -81 26 -397 48 233 -29 -52 69 168 -176 -119 61 -29
4412b9K55k55R8J4k17K20Q4l0k15J59j2l9K77m43j03K73J01j20L2rP9M9k5j10
$$ -29 226 -29 69 83 -134 86 170 140 -75 84 72 33 310 -133 -236 37 138 18 50 41 120 169 144 34
4436C4j85L19l63Q5k70N85n2k00L7j33rJ50j97J74N5PJ16n5q6M6n5k5O7o3N5J10
$$ 34 -151 168 -195 -110 -380 205 153 -47 -10 -143 -152 -2 -199 -25 30 37 153 98 12 58 3 -22 45 -18 37 147
4462A47n7o3po8MJ64j84K36j62nJ86k91O1J20M03n95J08r2r7R0J48N8j72j09K04
$$ 147 90 27 20 -48 -44 120 -64 172 10 5 191 -100 -39 81 484 -111 -3 -95 -192 -102 46 104 -68 -177 27
4487B7n5J29j1k07K34j31j3k32L42n7J3K1p1m0J28k7Q9j27j23J53k8l6J58Jp3
$$ 27 -28 101 90 -117 117 -14 -27 -259 83 26 39 60 -11 -51 77 50 139 12 -111 42 14 -22 136 137 64
4512F4j64k1J36j21L24p8k93L41r2m3K6J72k17l01L61j56l19J86O48p22L63J38
$$ 64 -100 -121 15 -106 218 140 -153 188 96 53 79 251 34 -267 94 -62 -381 -195 453 -269 94 232
4534B32l65K5K83J28j99k90L79k4m95K03K54k33j27L93k69j62L26J46l59J60K13
$$ 232 -133 -108 175 303 104 -186 193 169 -326 -123 131 -102 -229 164 -105 -267 59 205 -154 6 219
4555B19j39J4k4K75n81J58R1l69K39P28n29l95L09j11K23J5L08o06j69K81M3j74
$$ 219 80 94 70 345 -236 -78 13 -356 -117 611 82 -313 -4 -115 108 123 431 -175 -344 -63 -20 -194
4577a94N66j65k90o04Q85j18m39N11P7l05j87N39j7m06J85K79m51o9O77j18p45
$$ -194 372 207 -83 -687 198 80 -359 152 229 -76 -263 276 259 -147 38 317 -134 -203 474 356 -389
4598c89L40K74p07L74M88l55j9oj94k48N28L71o99P4L18l36l48O89L80n77l92
$$ -389 -49 225 -482 -108 380 25 6 0 -194 -442 86 457 -242 -168 150 -186 -534 155 535 -42 -434
4619d34M85m00K87M46j07n36J80L40l42j20L92K04q15Q6P31m08l63J264p84o04
$$ -434 51 -349 -62 384 277 -259 -79 261 -81 -201 191 395 -420 -334 397 -11 -374 890 106 -498
4639d98N15K16l49J00O77p39l81N04K80l54J21O5k49n72Q38K61n58J21J01n13
$$ -498 17 233 -116 -16 661 -78 -459 45 325 -29 92 157 -92 -664 174 435 -123 -2 99 -414
4659d14J02P14q7l69j31L36m14J08Q32k14q18O5M12m72J20R63n43n77L75K45p12
$$ -414 -312 402 315 -54 -185 151 -263 -155 677 463 -355 -290 122 -350 -230 733 190 -387 -12 233 -479
4680d79N37O24q34l77K41L07n12O73M06j133j17Q02k33r4L58M6o90j58Q08P0k32
$$ -479 58 682 -152 -529 -288 19 -493 180 586 -547 -664 138 -95 -189 169 215 -475 -633 175 245 13
4701A3Q0K63n85P9O38k29n87Q08j49r54N39N42l99j13K77j72l89J33Q69p09j21
$$ 13 93 356 -229 -150 488 259 -328 480 331 -623 -84 458 59 -54 223 51 -338 -205 664 -45 -166
4722a66L39m01m33Q22J96p28L48J95p40L34O39p5o36J54K78k03j29N65Rq13p0
$$ -166 173 -228 -661 161 357 -371 -23 172 -568 -234 405 330 -306 -152 126 -77 -206 359 368 -445 -515
4743e15O20j13K01L09j62q07K72O91n86k58N66l50l53L39M86n89K02L14n67j5
$$ -515 105 -8 193 502 340 -467 -195 496 -90 -348 218 -132 -485 -146 340 -249 -47 267 -300 -315
4763c15O71j7m38M53K19p30k85N95j22j47L19l85m7j03N58m9m45L96k34k43n1
$$ -315 356 339 -99 354 573 -157 -442 153 31 -116 203 -182 -229 -332 226 177 -268 128 -106 -349 -400
4784d00Q90l60k46p4Kj88L97K97j29m79J18L07m16N46k32p2l94N93l8k20N15j42
$$ -400 490 130 -116 -190 -188 -376 21 318 189 -290 -172 135 -281 265 33 -39 -433 160 122 -98 417 275
4806B75l83J56P0j89J39K08l33o4M8J61l3N3o3L5k98J52j1j9J55o5Jn6j46N38
$$ 275 -108 48 118 -71 68 276 -57 -121 -73 88 55 108 45 80 -218 -66 -77 -96 59 -6 -5 -61 -207 331
4830C31m15J69j90O9K09k09K03l04M36k49M1l09N26k14pO0k71J58N8n9O8m01L65
$$ 331 -84 85 -105 -36 173 -36 167 -137 299 50 91 -218 308 94 87 147 -124 34 92 33 101 -300 65
4853F5j83J12l7J29k5j55o3MK60j69M24l13j12J8J32l03J13K86j69j59j0J69j64
$$ 65 -118 -6 -43 86 61 -94 -157 -153 107 -62 362 49 -63 -45 87 -216 -103 183 14 -145 -155 14 -150
4876a50J65O2N5j57K36k81J7R7J42k4j67J61l28L08j73J88l70L74M0j40m3J92
$$ -150 15 77 132 -25 211 -70 -53 44 186 162 -5 156 -172 136 -37 151 -219 155 195 55 12 204
4898B04r0j71K04R5ol73K17k70J19q8K35r8p2m2L1j26j11O69l85q5J38J34k50
$$ 204 114 -57 147 242 236 -137 80 -190 -71 -159 76 -22 -94 -136 -105 -231 -342 327 -58 -143 -5 129 -121
4921a21L41j32K53l60M7j05N5j74L71k39K13j87K35j74q8O7l8J30J38j45j60j03
$$ -121 220 88 341 -19 28 -77 -22 -196 175 -64 149 -38 197 23 -65 2 -36 94 232 87 -73 -176
4943a76J34r8L17j10j11j62J00K80m26K10K27k67J33J01j95N7l75K11J87k2k96
$$ -176 -42 -140 177 67 -44 -206 -106 174 -252 -42 185 -82 51 152 -43 14 -361 -150 37 15 -281
4964b81M95j26k37N15m88J9P2N1J9O8j69J02r7L36k73J38m87K53j1O3R7k41P2
$$ -281 214 88 -149 366 -122 -103 -31 20 39 107 -62 40 -57 279 6 144 -343 -90 -101 -38 59 -182 -110
4987a10R1j6k11L45j61J86k72K38j78O4j0j3k40L11J58k80M2K04k44K20l09K39
$$ -110 -19 -35 -246 99 -62 124 -148 90 -88 -24 -34 -47 -287 24 182 -98 -56 148 -96 124 -185 54
5009E4K7k89N04m84K07J46p2k54J87j23N6J36j04P0j53J05m1p9J15NO3m4J73k76
$$ 54 81 -208 296 -188 19 165 93 -161 26 -97 -41 95 -9 61 -92 13 -28 -107 8 13 76 32 205 -71
5033g1j82M92j04l78J74K85l73o3M6J35K5k20N13n07r9L56o1K3J27J48m4l95K76
$$ -71 -253 239 135 -243 -69 216 -157 -220 -174 -39 -14 -234 279 -228 -327 29 -32 -9 118 266 222 -173 103
5056A03P8m60M01L4k48J31K30j28n41N37k05O6r2N37m80k55J99K8j57J65K47k61
$$ 103 181 -279 122 156 -92 39 269 141 -400 137 -68 -2 -94 443 -37 -292 -93 -65 -222 -57 190 -71
5078g1j03M84l47n7R1j7j66J79M80k01p81O16p5k53K31K66k14k89M45m38J68M07
$$ -71 -174 310 -37 -94 -3 -20 -186 -7 473 272 -509 107 32 -221 10 276 62 -227 218 -220 -52 355
5100C55k3n99N9L32Q9j51q9M04n03l13K95N06l93O3j2n40M04N77l13k09N23o30
$$ 355 332 -267 -208 124 213 62 -27 377 -126 -439 -144 362 -31 32 20 -520 -116 461 148 -61 462 -168
5122a68k57L15N75k18k68K93P3p14Q9N51o1l23J59j73lJ57K75k31l30L98p8k48
$$ -168 -425 -110 465 247 -21 272 345 -369 -280 271 210 -113 46 -127 -130 27 302 71 -259 139 61 -187
5144a87P11L3r06J4M85l35k61Q18j91l37L9L93n48OR10o21m20L31M49j20k16N26
$$ -187 524 557 -349 -335 150 -185 -446 372 181 -156 -117 276 -272 -266 644 23 -397 -66 383 263 47 573
5166E73l46o86L37M77l10J75p4m64k6K80M76n59K09J78q11L09M72j76K7j70K23
$$ 573 227 -459 -122 355 45 220 146 -318 -344 -64 412 -147 62 240 -571 -262 210 34 61 -109 114
5187A14n96J30O54J23o61K05J05l82K00P56n38m00O02k50l01J83P12n45m93L88
$$ 114 -482 -352 302 425 -236 -31 74 -308 -108 648 110 -290 312 62 -239 -56 656 111 -382 6
5207FL9q13J167K66r41k09O17J2k42J77M81q68k33P64k41k26L18K02o97N2N50
$$ 6 45 -768 399 665 -276 -485 132 144 -98 79 560 -308 -541 223 -18 -244 74 276 -421 -369 181
5228A81J09o62N97j68m77R1R87o65k19M07k24m45Q50P2n21J1J20k04l82P62K54
$$ 181 290 -372 225 57 -420 -329 658 -7 -226 181 -43 -488 362 434 -87 -76 44 -160 -542 220 474
5249D74n73m52Q89o26k97Q48L00q81K03j0K31m75O17j61k95J91L21m51q7M61J34
$$ 474 -99 -551 338 -288 -585 263 563 -318 -115 -125 106 -369 248 87 -208 -17 304 -147 -234 227 361
5270C61r58N49P1j44J87N22o26n06L65K85Jk33N81p58j12M88J97n68L55J3m10
$$ 361 -597 -48 23 -121 66 588 -38 -544 -179 106 107 -126 455 -303 -415 73 270 -298 57 70 -340
5291c40l2L49L38m50R1K02l32l5M24J13m83O4K20l47p0O72m58l42P40p3n74J86
$$ -340 -372 -23 315 -135 -44 158 -174 -209 215 328 -155 -91 129 -218 -288 384 -74 -416 324 251 -323 -137
5313a37P16p21M7J74k48j55M08R3j81l25N74j96l20N62l0m98QN25l56r2J36M91
$$ -137 579 -142 -95 79 -169 -324 84 177 -4 -329 245 49 -271 291 261 -237 -229 296 -60 -152 -16 475
5335D75o72j25M37j55oN62l31m35L48K45l13q7J76n2n4k5L21k22l35K95n9J28
$$ 475 -197 -322 115 -40 -46 516 185 -250 98 343 30 -57 119 67 13 -12 309 87 -248 47 -12 116
5357A16J15P3k42j81L71l11n3K61P7l52O3K15j07m37O05j0k65l9J79j15k33L44
$$ 116 231 304 62 -119 252 -59 -112 149 226 -126 -63 152 45 -392 213 203 -62 -101 78 -37 -270 74
5379G4J74o36K97J76M9m53M78j67l14J69M79n29k9L96k30j03L16J23j38P9N6l61
$$ 74 248 -388 -91 85 134 -319 159 -8 -322 -153 326 -203 -232 164 -66 -169 147 270 132 211 267 -94
5401i4J30O8L5k65J11k61N1J55l9J69m69M53J24k32j76L59J29m92L88q1j75j90
$$ -94 36 104 139 -126 -15 -276 -225 -70 -109 60 -409 44 168 -64 -240 119 248 -244 144 63 -112 -302
5423c02N56j58j16O8M6k62p7J49k9K78j83K30n18K71Q1P9j31O6k79n0L89Lk72
$$ -302 254 96 -20 48 94 -168 -245 -96 -125 153 -30 200 -318 -47 34 113 -18 48 -231 -281 108 111 -161
5446a61K87n7K06l48kJ13j25rM19n74j49M68p4N6j10j24J02K41p5O2k17K02l18
$$ -161 126 69 275 -73 -75 38 -87 -96 323 -251 -400 68 -6 50 -60 -184 -82 159 84 146 -71 131 -187
5469a87j8M3K29k93j5L74p9j44O7j61J91o9J30j52K59j43j05P3J71N7m42O6K55
$$ -187 -205 -162 67 -226 -241 133 54 -90 -23 -184 7 -62 68 -84 175 32 -73 0 171 228 -214 -148 107
5492A07N2k19K68P0n06J41K55j70p5P0K6n2J10n6j89K24q4Mk60J63K36m3m5J44
$$ 107 159 -60 208 278 -228 -87 168 -2 -77 -7 19 -33 77 21 -168 56 -28 -24 -284 -121 115 72 27 171
5516A71j5j41j05K43l10J36O3Ll37J94L31J1l88N26j62l16J36q2k2k1Q7k12K24
$$ 171 156 15 -90 153 -157 -21 42 45 -292 -98 233 244 -144 382 220 -96 40 -42 -64 -85 2 -210 14
5539A4J31p6k58J48m5m4j62K50j26K11o9K62j21J44k55j06k57L31R1m09K55K05
$$ 14 145 69 -189 -41 -86 -130 -292 -42 -168 43 -26 236 115 259 4 -102 -359 -28 63 -346 -91 114
5561A14j39l16L85J48m41K08J64j54n4L16j5l03J41R7j18j97M88l21l16J10P6
$$ 114 -25 -341 44 192 -249 -41 123 -31 -85 231 216 -87 54 151 33 -164 324 3 -313 -203 -127
5582a27n3Q9J17k0j91J67J55M4Q9k25p0j51L45J30m74p9M52n63qN61j36k35J19
$$ -127 -180 -91 26 6 -185 -18 137 181 270 45 -25 -176 169 299 -175 -254 198 -365 -373 188 52 -183 -64
5605f4j17k03k9N43j07P6nl88J86j41Q61p15k20M44J07o69N82K62n65k7L49K8
$$ -64 -181 -384 -413 130 23 99 94 -294 -108 -249 612 -103 -323 121 228 -441 141 403 -162 -189 160 188
5627A88m64N31L81o14n38N54J71m78L22J14l89m2O63k70k91N40j21m98r8R31k17
$$ 188 -276 255 636 22 -516 38 209 -269 53 167 -222 -264 399 129 -162 378 257 -241 -339 592 375
5648C75o94O34k09o60M62N98o74MM81l32j58K29M01p06j94N87k50l31N36M71o71
$$ 375 -319 315 106 -554 -92 506 -168 -164 317 -15 -173 56 457 -249 -443 144 -106 -437 99 570 -101
5669a01j57M27n07q6N79K89p03k96J053r71M38L64J45q15J25K44k01P5N45j36
$$ -101 -258 169 -338 -424 155 444 -259 -555 498 -473 -35 329 474 -341 -216 28 -173 -98 447 311
5689C11o05M1O69m84o4P50o53m57M59M42m21M7M38o54p05J115R7o16J77M94q84
$$ 311 -294 -253 416 -68 -132 618 -35 -492 -33 409 -12 35 473 -181 -886 229 326 -290 -113 381 -503
5710e03n4Q02J01o91M54M12p78J3P43m87l55N94J08r01L97Q57m57q09N77R2m95
$$ -503 -557 245 346 -345 109 521 -257 -244 499 12 -343 251 359 -542 -145 712 255 -554 23 115 -380
5731c80L47O58l76o18O10N3n66L81M26q12m39N15M47p46O92K89q84J36O06n35
$$ -380 -33 625 249 -369 241 294 -272 109 535 -277 -716 -201 246 -500 192 481 -403 -267 339 -196
5751a96k24Q17r4q01O9P34l97k60P14j92j125P10N04k76N4K13m79k45N81N12o57
$$ -196 -420 397 303 -498 -429 305 -92 -352 362 170 -955 -245 259 -17 37 250 -229 -474 107 619 -38
5772c8R9K22m38m08M26M06l59o7N28p11k22Q55K8n61K53K46n29k66J002q2n81
$$ -38 61 283 -155 -563 -137 269 -90 -157 371 -340 -562 293 321 -240 13 259 -270 -536 466 384 -197
5793a97K32L23o59K76N43l31n19M28J14o12L42O08p19k99M69R7l84N85R2o79q8
$$ -197 35 358 -301 -25 518 187 -332 96 210 -402 -60 548 -171 -470 -1 96 -288 297 389 -290 -378
5814c78N94j07k5J78J2o01R1M78K3n99N36J35n89m4O62l06j44k66L87j07l0M70
$$ -378 216 109 84 262 274 -327 -236 242 265 -334 202 337 -252 -296 366 60 -84 -350 37 -70 -100 370
5836C70l67k91L80k4l87L89K32j01n59N65l45k00K85M04p14K90L43n48qK66J92
$$ 370 3 -288 92 68 -319 70 302 201 -358 207 -138 -338 -53 351 -363 -73 270 -278 -286 -20 172
5857A72l15o7M60r4j40P4q9j48l8K85k75K6K02n4l73K96K75q6k46K33k26j41L25
$$ 172 -143 -210 250 156 16 90 1 -147 -185 100 -175 -149 53 -1 -374 -78 197 111 -135 98 -128 -269 56
5880E6K22l71PK55j63k83M70j13m48M27K33n1n71L46K75n60M42R2m06J12J67j28
$$ 56 278 -93 -86 169 6 -277 193 80 -368 59 292 241 -330 16 291 -269 173 265 -141 -29 138 10
5902A0j73K78k48Q5K6J60k02K48k3q6p7j92J01l0Q9K5q1m38N51J41k35j52K81
$$ 10 -163 115 -133 -48 -22 138 -64 184 161 75 -2 -194 -93 -123 -34 -9 -90 -528 23 164 -71 -223 58
5925E8K2k14o6K81n2n4oj9p5J19j21N0J44O4Qm8j52J45Q2l64J38K9J28l4l16K18
$$ 58 80 -134 -200 81 29 -25 -31 -50 -125 -6 -127 -77 67 131 139 91 -61 84 166 -198 -60 -31 97 63 -253 -35
5951c5K07j90K50k70J96k42k27L5K54J25l09L9J44m8J44j1r1j38L12l11K41P4
$$ -35 172 -18 232 -38 158 -84 -311 -276 -22 103 -206 -167 -23 -71 73 62 -29 -167 145 -166 75 149
5973A49l42jK24L82l36l16M53k39L44m37J6P2J17J10m04K07K1k61J36J1m0mK94
$$ 149 -193 -194 30 412 76 -240 213 -26 318 -119 -103 -31 86 196 -208 -1 20 -241 -105 -94 -134 -138 156
5996A56l3k64J85M5o9mL6JLk48K24j44R3N6J34j82L0p9P0k32K83o3j49L61L0L0
$$ 156 123 -141 44 89 20 16 52 53 56 -192 32 -112 -19 37 171 -11 19 -60 10 -222 61 -2 -151 210 240 270
6022B70k74qq9J35o7m1OK86n8m1j42J23l7q4m8J35j49K40l56J56k8l66N45K9Q7
$$ 270 -4 -12 -101 34 -33 -74 -68 218 160 119 -23 100 63 -21 -69 66 -83 157 -199 -43 -71 -437 108 137 224
6047B24m08M91m00J64O8j77J68J4j7j40p2K46k46k0L13j4m98K50k8K68J6k51j92
$$ 224 -184 307 -93 71 139 -38 130 144 127 -13 -85 161 -85 -105 208 194 -304 -54 -82 186 202 -49 -241
6070b41M37j54M3j56M9j29K44j9Pm9J51m28N11j64j5M9l6j4j17km2K27q6J92m08
$$ -241 196 42 85 -71 -22 -151 93 74 81 32 183 -245 266 102 87 136 100 86 -31 -33 -75 152 66 258 -150
6095a50J3J74l2n8l1L06m03j5L33l5k53N74j40n13K49J7q4L45m06J4R9k40J23
$$ -150 -137 37 5 -53 -84 222 -181 -196 137 102 -151 423 283 -230 19 36 -48 297 -109 -95 4 -236 -113
6118a13J14J3J45k54j18K36K35m55n1M36l04l99K87M71k08m6J02k60L3N68j24
$$ -113 1 14 159 -95 -213 23 258 -197 -248 188 -116 -515 -228 243 35 -11 91 -169 -136 432 308
6139C08o36L49K2j09k60N28N8n46J45K18j18N1N78k67n91P8M11o23N47L86m11
$$ 308 -328 21 43 -66 -326 202 260 -286 -141 77 -41 10 588 321 -270 -192 219 -404 143 529 118
6160A18l77L72k36j7J02M24m11o09P63j58k9J52M06o82l79P77P3l59K58oo04N4
$$ 118 -259 113 -123 -140 -38 386 -25 -634 129 -29 -58 94 500 -182 -561 216 289 -70 188 182 -422 -368
6182c68M51J06k06N1K55q17J57R22o79J02L57l30o31O94L43k55k64K16j8m58L61
$$ -368 83 189 -17 34 289 -528 -371 551 -128 -26 331 1 -630 64 407 152 -112 104 86 -372 -11
6203a1O02p35k54O55l37J01M52j25l91L5Q7l39J10M70j32r2l29K82m02J27O54
$$ -11 591 -144 -398 257 -80 21 473 348 -43 -8 79 -260 -150 320 188 96 -233 49 -353 -226 428
6224D28j42q48N74L01o26K24M14m21l96O99j31o33J012L5n12n25O76j3n32M58
$$ 428 286 -562 12 313 -313 -89 325 -96 -492 207 76 -557 455 490 -22 -547 129 116 -416 42
6244D2N17q52j09O63k3n05K75J50q28K55Q21j34m54L10K46p45K18P00k88p92O79
$$ 42 559 -293 -402 261 238 -267 8 158 -670 -415 406 272 -182 128 374 -371 -153 547 259 -533 146
6265A46l10l03O97J89l20l60M38k10k88O44J57o56k64Q77l68l25P22k9p42M1K35
$$ 146 -164 -467 230 419 99 -261 177 -33 -321 323 480 -176 -440 437 69 -256 466 437 -305 -264 -29
6286b9N1j6L33k15m65L22J98r8j96N52k05o70L40N27m93m2J67j63n29L63O61n90
$$ -29 22 6 339 124 -341 -19 179 81 -115 437 232 -438 -98 429 -64 -106 61 -102 -631 -268 393 -197
6308a97J78M67o43J2L51J4k19q5L54l44O9K70J30n20J42l7j34nL99j80n2L40k00
$$ -197 -19 448 -195 -183 168 182 -37 -122 232 -112 -43 227 357 -163 -21 -58 -192 -197 202 22 -30 310 110
6331A10k28NK81om56L51K8k78K20M12m24l86Q0K88q3Q5K59k35k17K41K1p4J22
$$ 110 -118 -113 168 162 -294 57 85 -193 27 439 15 -371 -291 -3 -86 -1 258 23 -194 47 68 -6 116
6354A16j13M4j53K53R8j78K7J13k47j11L37L5m18K80m4k40j13M11j3j66J40j29
$$ 116 3 47 -106 147 245 67 94 207 -40 -151 186 221 -197 83 39 -201 -314 97 84 -82 58 -71
6376g1R3MJ02K25l19K6j0j90J41j65R1o2J88k07m3N3K33q9l76M38P9j61J02Jk47
$$ -71 22 26 128 353 34 60 50 -140 1 -164 -73 -135 53 -154 -197 -144 89 0 -376 62 141 -20 82 83 -164
6401a64J26K48k3l05K28k40%J57J22j39L9m5qk39J66K10j4l84N96l35KJ28Jj59
$$ -164 -38 210 187 -118 110 -130 -130 27 149 10 49 4 -4 -243 -77 133 119 -265 331 -4 -2 126 127 -32
6425c2p7J69r4l01J82J82j59j19J87R2j04K48o0m28K86J98%L5m62K76k1M1M2j81
$$ -32 -109 60 -34 -335 -153 29 -130 -249 -62 30 -74 174 114 -314 -28 170 170 205 -257 19 -2 39 81 -100
6449a00j40M35l89K53J9q0j52K70l45K98l28J46J58n28K90L37o8k05J64J08l87
$$ -100 -240 195 -194 59 78 -2 -154 116 -229 69 -259 -113 45 -483 -193 144 76 -129 35 143 -244
6470b44K54j01J89J17m09K43m8j40M7L3K03j18j07k42L41j86J88L3o4j80J15K28
$$ -244 10 -91 98 215 -194 49 1 -139 -92 -59 144 26 -81 -323 18 -168 20 53 -11 -191 -76 152
6492A52j19o8P2O0J1ol20K33N7J60k46N1j28J97j2j78j18J68O0o7n9K81p2q8J13
$$ 152 33 -35 37 97 108 102 -218 15 72 232 -14 37 -91 106 94 -84 -202 -34 26 -41 -100 181 109 21 134
6517A34p1q6R9l17K94J4K01L5l65P3Or0P5J94l32Q2K33n9m7pJ88m99K24J46l27
$$ 134 63 -23 76 -241 53 67 268 303 -62 11 17 -73 2 196 -136 -54 179 120 73 66 254 -245 -21 125 -202
6542b02J74K12j41L41k00%l94K37r8K33K8r3o6Rk1L2r1k17L59m5K5oR5j87q1K60
$$ -202 -28 184 43 384 184 184 -210 27 -71 162 190 97 31 40 19 51 -40 -257 102 57 82 76 171 -16 -97 163
6568A63J10k68L0J16k68J10K19k64J46J31L4m23j8M66l74J80K07o5n37K96nqK20
$$ 163 273 5 35 151 -117 -7 212 -52 94 225 259 -164 -182 284 -90 90 297 232 -305 -9 -14 -22 198
6591A98j39P5l96M37p1j17r8M39o77j04M05K35j79r8L05m09L16K01k52k23j69
$$ 198 59 134 -262 175 104 -13 -111 328 -349 -453 -48 187 8 -90 215 -194 122 323 71 -152 -321
6612c21M05j61Q8L54l80k61K79K45l27k08O24k45r1p2R7l52N15J54l51j81K64
$$ -321 84 -77 11 365 -15 -276 3 248 -79 -287 337 92 1 -71 26 -326 189 343 -8 -189 75
6633G5R8l95J94J86j29r1L19k64J49k10J45l94J75K13J0n1K12R0r01M48L90m27
$$ 75 173 -222 -28 158 29 -62 257 -7 142 -68 77 -317 -142 71 81 30 242 332 -569 -121 269 -158
6655a58Q8L50k86k19K70L66m34j78M29m46j17M22J62j72m7K20m31j94N49J22l54
$$ -158 -70 280 -6 -225 45 411 -23 -201 228 -218 -335 87 249 77 30 250 -181 -375 174 296 -58
6676e8O3L59p58M9P25l63m31M21K20l28J2N33k65n33N21q4k31K95K92l13m29K76
$$ -58 5 364 -394 -345 380 17 -414 7 227 -101 -89 444 179 -354 167 83 -148 147 439 126 -303 -27
6698b7o4j6L16o5l61JN89k00k39L07j98l40m5O42k79j88K61m2o65L35N49k41k54
$$ -27 -91 -107 209 144 -217 -216 373 173 -66 241 43 -297 -342 300 21 -167 94 52 -613 -278 271 30 -224
6721b24L70j52l57K04M89l50k29K13J80m34M36K13n97J67O1K32n51P07L4l12k18
$$ -224 146 -6 -363 -159 330 -20 -249 -36 144 -290 146 359 -238 -71 -10 222 -329 378 412 100 -118
6742a18J80n1j31L30L6n15K07N1r6L2M38k00l55K06J97n40K89M87l05m21M40l13
$$ -118 62 11 -120 210 246 -269 -62 -11 -107 -75 363 163 -192 14 211 -329 -40 447 142 -279 161 -152
6764a52J9P2L40k30j23K05K07l89NL02l22J1K71q8l96N10m7m75R6N09j55m99J58
$$ -152 -133 -61 279 49 -74 131 338 -51 -46 256 -66 -55 216 128 -268 242 195 -280 -184 325 170 -329 -171
6787a71L12k85k01P62k82m86M59k91q9K58J41j12j81M85l34k55L26K37j08k44
$$ -171 141 -144 -345 417 135 -351 108 -183 -272 -14 127 15 -166 319 -15 -270 56 293 185 -59
6807e9J56k16l5K09M6m40P7N53j51k34M18j47m32K42J21m24o2M53J42m40L43p
$$ -59 97 -119 -154 55 101 -339 -262 291 140 -94 324 177 -255 -13 108 -316 -378 75 217 -223 120 113
6829A13r0J09J70l25m0J20J98k34j61K49j13pj30L69k52J12J4q9j67L39nk15K46
$$ 113 23 132 302 -23 -63 57 255 21 -140 109 -4 -11 -141 228 -24 88 102 13 -154 185 180 -35 211
6852B11J66m20j79L63J79n51J13L87l90J43q9L48r05O30J67j86j01K60l14n5N94
$$ 211 377 -43 -222 141 320 -231 -118 269 -121 22 -67 281 -624 6 173 -13 -114 146 -168 -223 371
6873C71q1j95j03L2P5j55j77K87j69O6L97l49l26M92o1k59K38J11k9m90Q3K54
$$ 371 290 95 -8 24 99 -56 -233 54 -115 -49 348 -1 -327 165 104 -155 83 194 165 -325 -242 12
6895A2J96P9l90K8l4RL9j23L65n84K21M29k04K0k27J83%Q2ll7J3P2j02J54o2m0
$$ 12 208 287 -103 -75 -109 -100 -61 -184 181 -403 -182 247 43 63 -164 19 19 101 98 61 74 146 44 198 136 96
6921I6L90o44j24L55Q8l13J19P6nr7j26m6l0J62L10j7l31M38m81m2J56j5mL21
$$ 96 486 -158 -282 73 161 -152 -33 43 38 -59 -185 -231 -261 -99 211 194 -137 301 -180 -222 -66 -81 -85 236
6945B36j92K4j48J10K10k60j61M3J16k28R3L24l43L9J80J56o9m04K80q1P3l15
$$ 236 44 68 -80 30 240 -20 -181 -138 -22 -250 -157 167 -176 -137 43 199 130 -274 6 -75 -2 -317
6967c17K01J03J44j17j38P3j06K75l14K74k70M1K44k98K03J44l2j88L25l73J81
$$ -317 -116 -13 131 14 -124 -51 -157 118 -196 78 -192 -151 93 -205 -2 142 110 -78 247 -126 55
6988E5Oo9Q0jj75k9J1Q7n7o7K62q0j25J81L7L40j65k29k72o5M36k13j18K01m79
$$ 55 61 -8 72 71 -104 -133 -122 -35 -92 -159 103 23 -102 79 116 456 291 62 -210 -275 161 -52 -170 31 -448
7013d48L88J52r3j65M97m54K47L00l59k12K75l42M17j77l9K1k83M10J02j88j56
$$ -448 -60 92 -1 -166 331 -123 124 424 65 -147 128 -214 203 26 -13 8 -275 135 237 49 -107
7034a07J89k07j53K07K2Q3O1n1j97K3K59r4j30Q8J17j11R5l8k15K70l6K79n03
$$ -107 82 -125 -278 -71 -49 34 95 44 -153 -130 129 35 -95 -7 110 -1 94 56 -159 111 75 354 -149
7057a49K72j28j67n0M1J58M0j59M27j31o9j15J5K13k82J05k37j33M89Q3n11M42
$$ -149 123 -5 -172 -222 -181 -23 17 -142 285 154 85 -30 -15 198 -84 21 -216 -349 140 223 -288 154
7079A54o8k29QL47k41k60O53j81m0j47P1j43j46M38j81j07Ll2K2K73N3l77J18
$$ 154 86 -143 -135 212 -29 -289 364 183 143 -4 67 -76 -222 216 35 -72 -69 -101 -79 194 247 -130 -12
7102a2O5Q8k67K63K55k57j85K2K48l70m7M54k12n4M9j34J24J28J4l80K87l2P7
$$ -12 53 141 -126 137 392 135 -50 -28 220 -150 -197 257 45 -9 40 -94 30 158 172 -208 79 47 124
7125A24j3j68L71n05K94QM9m8j32K50k75J58N2l31R1J37R0k81J14J88rJ33m38
$$ 124 111 -57 314 -191 103 111 160 112 -20 230 -45 113 165 -166 -75 62 152 -129 -15 173 164 297 -141
7148a41j24Mk51N40k66N1O3J31l1m9L05j22l15K43lk58O68n0n13J49J38q4j88
$$ -141 -265 -261 -512 28 -238 -187 -124 7 -24 -73 232 110 -205 38 35 -223 445 395 -118 31 169 85 -103
7171a03K36k95P8o5m3L1L87r4k02k07N33l21K2k29N42m5o15M08J82Mm23N77m13
$$ -103 133 -162 -84 -149 -192 -161 226 132 -70 -277 256 -65 -43 -272 270 225 -390 18 200 204 -219 358 -55
7194e5j00M81n3n98K48J85l81Q4J00J74L4l6j92j34J43M45n20J05R1J4k49Q0L21
$$ -55 -155 326 273 -325 -77 108 -273 -189 -89 85 119 83 -109 -243 -100 345 -175 -70 21 35 -214 -134 187
7217A87j8k17j3J36l35O9K82l5m13N06l07J73j71L59m44J52K2K20j31J36J06l29
$$ 187 169 -48 -61 75 -260 -191 91 56 -357 149 -158 15 -156 203 -241 -89 -67 153 22 158 264 -65
7239f5j36L8K38j70R6J64k90K85K37m04j05R3j6j4J22m1l32K13K08j00o5Q8M03
$$ -65 -201 -163 75 -95 1 165 -125 160 397 -7 -112 -19 -35 -49 73 32 -300 -87 121 21 -44 44 447
7262D47l23NR4j76j96l2L19j56l9J71l31M9K79n0N3l38M69m93J03K66q5q3J01
$$ 447 124 129 223 47 -149 -181 138 -18 -57 114 -217 -168 111 61 114 -224 245 -248 -145 121 36 -47 54
7285E4J7r2K06k28L4j30J12K9k5P1nn3n1M6L33k98O4K7j55J05J7N2O6j12j13K90
$$ 54 71 -21 185 -43 -9 -139 -27 2 -23 48 43 -10 -61 -15 318 20 84 111 -44 61 78 130 196 84 -29 261
7311B61l03k4K41m24J17j61O1K74k01L69j53K18m3k46m1O0J51k72K75k06j12J20
$$ 261 -42 -66 175 -249 -132 -293 -232 42 -159 210 57 275 232 -14 -55 5 156 -116 159 -47 -159 -39
7333c9K14k09M5j0K5P8Q7k48K03J1j06l5m0J11Q1k31r6L0J09j00K82J08l46j34
$$ -39 175 -34 11 1 26 104 191 -57 146 157 51 16 -24 87 168 -63 -159 -129 -20 -120 162 270 -76 -210
7357b10J94k53K32KJ90k52J8K89j11n0ql6k03K49K93j96l28K27j1M4J02M8k06
$$ -210 -16 -269 -37 -35 155 -97 -79 210 99 49 41 5 -198 51 344 148 -180 47 36 80 182 230 24
7380B4k5K59k69Q4j28L1L0n0N1j38L31K17n50Q1q4j40K39j09L93O2l16K12j22
$$ 24 -1 258 -11 73 -55 -24 6 -44 7 -131 200 417 -133 -52 -136 -276 -37 -146 247 309 -7 205 83
7403H3j14J51r9k35K16J01m43M14JK55l88K0R6n2R3q1Q9k17n7o3m4K12R1J52m21
$$ 83 -31 120 21 -214 2 103 -340 74 75 330 -58 -38 58 6 99 18 107 -110 -167 -230 -274 -62 29 181 -240
7428b40K07j95J39r2K26J64j09rK28k17L5j52p3O3J28r1L1n7j18L6J15j4j36k49
$$ -240 -33 -228 -89 -181 45 209 100 91 319 102 137 -15 -88 -25 103 12 43 -14 -132 -96 19 5 -131 -380
7452c80K19J47j96J14J60Q8m11J58j46J88q6k8P1J53j17j8J55j44L3J72o6J33
$$ -380 -161 -14 -210 -96 64 152 -259 -101 -247 -59 -145 -173 -102 51 -66 -84 71 -73 -40 132 66 199
7474A99J4q8p0k58M81l07o8L44l72J03J2KQ0p3m18J88M72k14K28m99K00K23l07
$$ 199 213 125 55 -203 278 -29 -97 247 -125 -22 -10 -8 72 -1 -419 -231 241 27 255 -244 -44 179 -128
7497a28K24j69k9P3R6l9L02k29n3N8o2nJ13j63l9n9O6l7j68M48j36j6j3k87K12
$$ -128 96 -73 -102 -29 67 28 330 101 48 106 44 39 152 -11 -50 -109 -43 -80 -248 200 64 48 35 -252 -40
7522d0Oj01J90M8k20J31K52j2k40n6J4J52q9M1j01K06r2J23j81Rl5j4j25L85m18
$$ -40 -34 -135 55 103 -117 14 266 254 14 -42 -28 124 35 76 -25 181 89 212 31 40 5 -9 -134 251 -167
7547a67rM91j37k06j2Q3j58n9J19n7KJJ41J32n0k10J15j79q5P9m5j10N76k10k5
$$ -167 -176 315 178 -28 -40 43 -115 -174 -55 -112 -110 -109 32 164 114 -96 19 -160 -245 -166 -211 -321 255 45 20
7572B0j80J24q2OQ2k9l03M46l2K54m32L3m2K03j97J3K35m02L19r5J06k38J00k03
$$ 20 -160 -36 -118 -112 -30 -59 -362 84 52 306 -126 -93 -135 68 -129 -116 119 -283 36 -59 47 -191 -91 -294
7596b94K39J18n8P4J68l65j53J84l6P7J45j02J3J29l04j0K79J69n8k48P4o0j25
$$ -294 -55 63 5 79 247 -118 -271 -87 -123 -46 99 -3 10 139 -165 -175 104 273 215 -33 41 -19 -144
7619a44J65r6K21M6n0j29p1J15l05L90l35K86k07L5k11J62L9L62m01J69n0r1l
$$ -144 21 -75 146 192 142 13 -58 57 -248 142 -193 93 -114 -79 -290 -128 -89 273 -128 41 -9 -100 -103
7642a03j43J58j22K09J07j72K51p7k89K19k86LN05m10M12m85Q7K92k77M25k22
$$ -103 -246 -88 -210 -1 106 -66 185 108 -181 38 -248 -245 260 -150 262 -223 -136 156 -121 304 82
7663H2l03L40lj19M4J58j22j41J22k48K18k4J95j58l63J99L80l06o6R0N5R0j33
$$ 82 -221 119 116 -3 41 199 77 -64 58 -190 28 4 199 41 -322 -123 257 -49 -115 -25 30 120 -13
7686a3RJ25l9j93l3J71N8j98L38j82p8K23j90P4m2k8l6J7pK5K25k92m6r4K42J39
$$ -13 -4 121 82 -111 -144 27 85 -113 225 43 -35 188 -2 72 30 2 -34 -17 -24 1 226 -66 -112 -206 36 175
7712A75j29k34L86k36J41j27J72K5q6j39J40k85K11j59L68k47J19l79O9L20ql1
$$ 175 46 -188 198 -38 103 -24 148 173 87 -52 88 -197 14 -145 223 -24 95 -284 -215 105 97 66
7734F6l75K33j2J15Q0Lk05J00j55Q1J14K26m12J20K18j75j7J33m9j97K16k27M26
$$ 66 -309 -76 -88 27 107 110 -95 5 -150 -69 45 271 -141 -21 197 22 5 138 89 -108 108 -119 307
7757C07m74J05J82p6k23P6J94j73K17L0k71n7K12j90K37j0r4k18N42ml83K91j71
$$ 307 -167 -62 120 44 -179 -103 91 -82 135 165 -106 -163 49 -141 96 86 -8 -226 316 312 -71 220 49
7780D9m0j06J37K80k71j47J34m2j38K44J47j58l07J85j32M8K13Mk95p6L09j22
$$ 49 9 -97 40 320 49 -98 36 -6 -144 100 247 89 -218 -33 -165 -117 96 100 -195 -271 38 -84
7802h4j26L00k53j86L32M0n11M35L08l08k33K15n6K67k18L13j70m57M40r9m1L29
$$ -84 -210 90 -163 -349 -17 23 -488 -53 255 -53 -286 -71 -127 140 -78 235 65 -392 48 -51 -92 237
7824B37p6k55J39j44J47J10O9j08l33J8M68j06j43L04k28k56J18K59j78j77j31
$$ 237 161 -94 45 -99 48 158 227 119 -214 -196 272 166 23 327 99 -157 -39 220 42 -135 -266
7845b66M35l00K13j86K90k67J78P4m25L78J59k67l48L64o3l30M63j06k57K27J0
$$ -266 169 -131 82 -104 186 -81 97 171 -254 124 283 16 -332 32 -31 -361 102 -4 -261 -34 -24
7866b4ok47K16J04k02K36j91j75J54PK64m46K11N5l70M30J08j91j30J89J09p7
$$ -24 -30 -277 -61 43 -159 77 -114 -289 -135 -128 136 -310 -99 -44 -414 16 124 -67 -197 -8 101 24
7888B4k99K47K19l71M47k53j77J79J37j35k43K57J11j31J97k61K96k88L23k79
$$ 24 -275 -28 191 -180 267 14 -163 16 153 18 -225 32 143 12 209 -52 244 -44 279 0
7908@k44K94j15k26M97j43l6j29J52jq6j77J91K9j16j1K35n5j24j8J31Op8k08
$$ 0 -244 50 -65 -291 206 63 27 -102 50 49 -37 -214 -23 6 -110 -121 114 59 -65 -83 48 54 -24 -232
7932b32J60J83k03L6o7J91m1j37j58J89j1P9K94k53l22M77l8l99N77k10n6l4j31
$$ -232 -72 111 -92 -56 -123 68 27 -110 -268 -79 -90 -11 283 30 -292 185 147 -252 325 115 59 25 -106
7955a06L7P1J30l26K64l20Q0K54M4q8k45r3K31o0P6K98j50K5q4k19J65J42k64
$$ -106 -69 2 132 -194 70 -250 -170 84 128 40 -205 -298 -67 -127 -51 247 97 122 38 -181 -16 126 -138
7978a38RJ46k45K03L0q1k36N06k50n3M7J32Q6k17M20m26N9r8L34k88O4N5l24K37
$$ -138 -129 17 -228 -25 5 -76 -312 194 -56 -109 -62 70 156 -61 359 -67 -8 -106 228 -60 4 59 -265 -28
8002b8k2j8L07l16J4k3K9K22j00J63l01J21j83L04P8l39P6PK18k12k83L00j0j50
$$ -28 -50 -68 239 -77 -63 -86 -57 165 65 228 -73 48 -135 169 247 -92 -16 -9 209 -3 -286 14 4 -146
8026a46L31r7k35K15Nj45Mj60L16J13j13k1k96J01J18k85K41l2n9J23j16K57j01
$$ -146 185 88 -147 68 73 -72 -68 -228 88 201 88 67 -229 -128 -10 -295 -54 -86 -145 -22 -138 119 18
8049A8J01j35J02J49%m05K25J18k17Q4O7O7j55j16O7n8L86n35J78M18l22J91j42
$$ 18 119 -16 86 235 235 -170 55 173 -44 40 107 174 19 -97 -30 -88 298 -237 -59 359 37 228 86
8072H6L0k12J71P5qj74M14l62K8k9R2j08k47J24J95j31k21L77q5J49j37N6j33
$$ 86 116 -96 75 150 142 -32 382 20 48 19 111 3 -244 -120 75 -56 -277 100 15 164 27 83 -50
8095e0L2L7j30J48k6k60K77J72k94J64O6j02k18J15J17q2K27l41K06o2L1k4k37
$$ -50 -18 19 -111 37 11 -249 28 200 -94 70 136 34 -184 -69 48 -34 193 -148 58 -4 27 3 -234
8118b34K51P7j62j4Q1j92K51l9j65J77l23M02O3J01j76j01q7J10j01L94l99J70
$$ -234 17 94 -68 -82 -1 -193 58 19 -146 31 -292 110 173 274 98 -3 -90 20 -81 313 -86 84
8140H4L61q36M69p0O5j86L1J76o7j63K38J0k02M2N5j5J24L15n21lK49k96m4o3
$$ 84 445 -391 78 8 73 -113 -82 94 27 -136 102 112 -90 -48 7 -8 116 431 -90 -93 156 -140 -184 -247
8164b47M51j46j17j26L89k55K18q3J05m07J83P5J54j07j49o7j5J35j33J60OP7
$$ -247 204 58 -59 -185 204 -51 167 84 189 -218 -35 40 194 87 -62 -129 -144 -9 -142 18 24 101
8186A01k92N76l90%l
$$ 101 -191 385 -5 -5 -8
8191h
$$ Imaginary data points
##PAGE= N=2
##DATA TABLE= (X++(I..I)), XYDATA
0@%%%%%%%jJqJ6j6K4l2L4m2N6p2Q8j05J28j53J80k14K53k97L46m02M64n31O10
$$ 0 0 0 0 0 0 0 0 -1 0 -8 8 -8 16 -16 18 -24 32 -40 48 -57 71 -82 98 -116 137 -160 186 -216 248 -283 327
31C27o98P95r03J019j149J294j452J625j814K022k251K498k769L066l390L744
$$ 327 -371 424 -479 540 -609 685 -767 858 -956 1066 -1185 1313 -1456 1610 -1780 1964
47A964m129M550n014N525o086O704p393Q164r028J0005j1120J2412j3921J5709
$$ 1964 -2165 2385 -2629 2896 -3190 3514 -3879 4285 -4743 5262 -5858 6554 -7367 8342
61H342j7879K0574k4021K8611l5067M4879o1765R8702l23938K52157N28966m79199
$$ 8342 -9537 11037 -12984 15627 -19440 25439 -36326 62376 -261562 -9405 519561 40362
73D0362j55331R3463r9095o2741L43829K2177k73875J3608J65789j89824n3795
$$ 40362 -114969 -21506 -120601 -183342 160487 182664 -91211 -77603 88186 -101638 -155433
84a55433K45006O0462j35399R70j10177j23049K41300K62860k32367k48074J41598
$$ -155433 89573 150035 14636 15606 -94571 -217620 23680 286540 54173 -193901 -52303
95e2303R0298j22558J16648J48590k01955j16816J94551j7536j69352J53270J86086
$$ -52303 37995 -84563 32085 180675 -21280 -138096 56455 38919 -130433 22837 208923
106B08923j93122j68100J34082M9019q1071J32068R2839k32258j26070J77425
$$ 208923 15801 -152299 -18217 30802 -50269 81799 174638 -57620 -183690 -6265
116f265Q7790n1626J9013k1519j04838J8777R1620j5690N192P4311q9432j33466
$$ -6265 81525 29899 48912 27393 -77445 -58668 32952 17262 22454 96765 7333 -126133
128a26133J05316R1401r4679M3799J14070j66733j64273J81133J59856j23281
$$ -126133 -20817 70584 -24095 19704 133774 -32959 -197232 -16099 143757 20476
138B0476o4046P9714o8617p7538J37538O0015j15733J2249N8691r8174k3677J29836
$$ 20476 -43570 36144 -32473 -110011 27527 87542 -28191 -15942 42749 -55425 -79102 50734
150E0734J2694q0670K3415p869j00436O7876J54451q6798j24453R4133K5773j13350
$$ 50734 63428 -17242 6173 -1696 -102132 -34256 120195 33397 -91056 3077 28850 -84500
162h4500O3894J22371r2837q1486R2315k476j00198Q9641J17866j25115r5219
$$ -84500 -20606 101765 8928 -72558 19757 17281 -82917 6724 124590 -525 -95744
173i5744J10499J8846p5951P1066N3463j16733l7386J03449l579o9460O4676M6982
$$ -95744 14755 33601 -42350 28716 82179 -34554 -71940 31509 27930 -41530 23146 70128
185G0128j05899k4569R6472j4723m6698O8753L264j02197J5282R6096k7890n7242
$$ 70128 -35771 -60340 36132 21409 -25289 43464 46728 -55469 -40187 55909 28019 -29223
197b9223N5540J1315q7129K1878Q5310m8414n0091O4321L729p0941K5033N9971
$$ -29223 26317 37632 -49497 -27619 57691 9277 -40814 23507 27236 -43705 -18672 41299
209D1299l8605l1874N0094m069n9960L5438N3973m7437k4083L9644j4970k7811
$$ 41299 2694 -29180 20914 16845 -43115 -7677 46296 -1141 -25224 14420 -550 -28361
221b8361L6454J5451l9667k875L3520j6482k9344K9286J7268k4914M541Q243k2441
$$ -28361 8093 23544 -16123 -18998 14522 -1960 -31304 -2018 15250 -9664 -5123 3120 -19321
234a9321R613K5722j3013j4054J1255K552r190M846R607j1724l271J5376j1065
$$ -19321 -9708 16014 3001 -11053 202 2754 -6436 -1590 8017 -3707 -6978 8398 -2667
247b667j4531K1245N640j5171M621J268q247Q196Q650p429m978J1318L778j7115
$$ -2667 -17198 4047 9687 -5484 -863 405 -7842 354 9004 1575 -3403 7915 11693 -5422
261e422J144J6884q479l644J5430j3747j7511J6498J3332j2471p723J2594J167
$$ -5422 -4278 12606 4127 483 15913 2166 -15345 1153 14485 2014 -5709 6885 8052
274H052k1319M155K4260p918j1359J1918o879j4114J3858J8747q708j9350L194
$$ 8052 -13267 -9112 15148 7230 -4129 7789 910 -13204 654 19401 10693 -8657 -5463
287e463Q759j0185N775J7618j6370j4521J1971k693o008J5882O627j6500j0621
$$ -5463 3296 -6889 -1114 16504 134 -14387 -2416 -5109 -11117 4765 11392 -5108 -15729
300a5729J2095N565q800J1433R391k3525n362J9889l144p588R936J159j3031n946
$$ -15729 -3634 1931 -6869 4564 13955 -9570 -14932 4957 1813 -5775 4161 5320 -7711 -13657
314a3657J1795P998r670n12O705r168m234J0182N062J95m690j237L122p216J368
$$ -13657 -1862 6136 -3534 -4046 2659 -6509 -10743 -561 4501 4696 6 -1231 1891 -5325 -3957
329c957J5183k842j0694L605j235n446O120Q606l386j1149K164N807q710O325
$$ -3957 11226 8384 -2310 1295 60 -5386 734 9340 5954 -5195 -3031 2776 -5934 391
343C91J4790j3059j0447J2308r35n661J0841M917j3026p966J1110M067r862N831
$$ 391 15181 2122 -8325 3983 3048 -2613 8228 13145 119 -7847 3263 7330 -2532 3299
357C299P422j4724m918J0585j827k208N986j194m683l986K019Q257n63k766Ml187
$$ 3299 10721 -4003 -8921 1664 -163 -2371 3615 2421 -2262 -6248 -4229 4028 3465 699 703 -2484
373b484j009J260N140L720q913m987P592m200m121J3102l25j4390J000Q553k951
$$ -2484 -3493 -2233 2907 6627 -2286 -7273 319 -3881 -8002 5100 4775 -9615 -8615 -62 -3013
388c013j000J0635j341j8410M308J9851q737p968J3837o096j5722J3981J4009
$$ -3013 -4013 6622 5281 -13129 -8821 11030 2293 -5675 8162 2066 -13656 325 14334
401A4334j4903j0246J4468J058j7778J1824J9154k1555j2106K2442m47j7134J5005
$$ 14334 -569 -10815 3653 4711 -13067 -1243 17911 -3644 -15750 6692 6245 -10889 4116
414D116J4668k2122j1476K4402L735k3070J2427J7718l0065p946L4269n111k6346
$$ 4116 18784 -3338 -14814 9588 13323 -9747 2680 20398 -9667 -17613 16656 11545 -14801
427a4801J7641J4092l0414m726L6107n174l0117K1118J4954l6500L993L9078j7234
$$ -14801 2840 16932 -13482 -18208 17899 12725 -17392 3726 18680 -17820 -13827 25251 8017
440H017k5166K6667K894l5175J4014L7188k4802k6325L0822n22l7017K6232L5087
$$ 8017 -17149 9518 12412 -22763 -8749 28439 3637 -22688 8134 7612 -29405 -3173 31914
453C1914l6072j9206L0579p063k1957L0743J9777l8531j2143L0233r969j4492
$$ 31914 -4158 -23364 7215 152 -21805 8938 28715 -9816 -21959 8274 -1695 -16187
465a6187L7556K686m9298N068L2953j6571o957L3158p816m3678R354L2770j2252
$$ -16187 21369 24055 -25243 -20175 12778 -3793 -10750 22408 14592 -29086 -19732 13038 786
478G86k998K6976k3246l6449K9969K6600k0963L679J6666l2385k1457M1001K0036
$$ 786 -2212 24764 1518 -34931 -4962 21638 675 4354 21020 -11365 -32822 8179 28215
491B8215l2187K115K0660l5877j7451M9754J2194l1922P920N512l7426N714N4908
$$ 28215 -3972 -1857 18803 -17074 -34525 15229 27423 -4499 3421 8933 -28493 -22779 32129
504C2129l601m2589J2483R349l7082J9143N7188l0268m6675L0003P326l7576K8375
$$ 32129 28528 -14061 -1578 7771 -29311 -10168 47020 16752 -29923 80 7406 -30170 -1795
517a795M8694m0203m2377L3626N294l1481M2507L7669o5814l0703N3256o25k7347
$$ -1795 46899 6696 -35681 -2055 3239 -28242 14265 51934 -13880 -44583 8673 8048 -19299
530a9299M5582J4275p2918j1789O4013n676l3609M2223P260p2087M858O3005j7597
$$ -19299 26283 40558 -32360 -44149 19864 14188 -19421 22802 30062 -42025 -37167 25838 8241
543H241k1888M1792j3156o4747K3893O2957k2615k6586L3423j9422n2663M4610
$$ 8241 -13647 28145 14989 -49758 -25865 37092 14477 -12109 21314 1892 -50771 -6161
555f161N5131m2564k4153L3346k1848l7346M7817M1810m4467k1016L1316k3481
$$ -6161 48970 6406 -17747 15599 -6249 -43595 4222 46032 1565 -19451 11865 -11616
567a1616k7870N9468K9617n7830j5689L1321j9265p637N3743M592o1280m113L7398
$$ -11616 -39486 19982 49599 -8231 -23920 7401 -11864 -19501 34242 38834 -22446 -26559 10839
580A0839j8289n799N0694j0974o1639J2991L4905k0781O379L9602k8367n1486
$$ 10839 -7450 -13249 37445 26471 -35168 -22177 12728 -8053 -1674 37928 9561 -41925
592d1925K6440L5103k0188O323K7185m0764l7169M4795K4509k6521J1382J3730
$$ -41925 -15485 19618 -570 5753 32938 -7826 -44995 -200 24309 -2212 9170 22900
604B2900m5481j7110M9317J4993k8852Q742Q617m1935j382N2439m66k9254J3952
$$ 22900 -22581 -39691 9626 24619 -4233 4509 13126 -28809 -30191 22248 21782 -7472 6480
617F480l158l4705J8007M4398j4243k8698J4382l803k8508K6736L9374k9974k6061
$$ 6480 3322 -31383 -13376 31022 16779 -11919 2463 -1340 -29848 -3112 36262 6288 -19773
630a9773K2029o477j9660L2212K4513l4997j8682K3396m181j4630L3595J4871
$$ -19773 2256 -4221 -23881 8331 32844 -2153 -20835 2561 -1620 -16250 17345 32216
642C2216m4446j1215L0770p322j0156L1514J918m3179l165L1858m974r609K5260
$$ 32216 -12230 -23445 7325 3 -10153 21361 23279 -19900 -23065 8793 3819 -5790 19470
655A9470n719m1155J0367L4162j1652q315K1365j4492l1910J9635K9906j6130
$$ 19470 13751 -27404 -17037 17125 5473 -2842 18523 4031 -27879 -8244 21662 5532
667E532r928J8473j5507k7602K7169K6576k3965p923J5077j5167j4354K7820J5274
$$ 5532 -4396 14077 -1430 -29032 -1863 24713 748 -7175 7902 -7265 -21619 6201 21475
680B1475k5073n925J6109j2133r643K6680O193k5654R34J1943j2467m79K1729
$$ 21475 -3598 -9523 6586 -5547 -15190 11490 17683 -7971 -7037 4906 -7561 -8040 13689
693A3689k794k2310K302J2531p555O29J6168r247j7818R930R777p732L391R757
$$ 13689 10895 -11415 -9113 3418 -4137 -3508 12660 3413 -14405 -4475 5302 -2430 961 10718
707A0718r877j2364Q230R726m692J08N477j0650q239J2369O096o231L08L80o053
$$ 10718 841 -11523 -3293 6433 1741 1849 7326 -3324 -11563 806 6902 671 979 1359 -4694
722d694j399Q686L862o347k32K645o546J95J0263j454o226K171k79m383L175O180
$$ -4694 -6093 2593 6455 108 -124 2521 -4025 -3830 6433 4979 -1247 924 645 -3738 -563 5617
738E617l353o186K939K496n620L635O200o795l020N964j341l405M919K714n560
$$ 5617 2264 -3922 -983 1513 -4107 -472 5728 -1067 -4087 1877 536 -2869 2050 4764 -796
753g96k557M816k36l813N037J749q289M34N828l573p79M878j731n752J356M880
$$ -796 -3353 1463 1227 -2586 2451 4200 -4089 -3655 2173 -1400 -2179 2699 968 -4784 -3428 1452
769A452o44k100L810r05o538K983N911k691j510J701k176k299J797M302q20n090
$$ 1452 808 -1292 2518 1613 -4925 -1942 3969 1278 -232 1469 -707 -3006 -1209 3093 2273 -2817
785b817J838J306l780K782M190l102l153K053J835j340l54M321k104n349M397
$$ -2817 -979 327 -3453 -671 3519 417 -2736 -683 1152 -188 -542 3779 1675 -3674 723
800G23L404n528J262L875m093k936M137J785m099m02N006k997m903O354J703o151
$$ 723 4127 -1401 -139 3736 -357 -3293 844 2629 -1470 -1872 3134 137 -4766 1588 3291 -2860
816b860K916M214n499j419M751N47l441L65L472l802k812N921L7n459K607K029
$$ -2860 56 4270 -1229 -2648 2103 2650 -791 -426 3046 -756 -3568 2353 2390 -3069 -462 1567
832A567m039M47K853Q3k019L07J940j908j293M180J1l926J589J571k158J86J176
$$ 1567 -2472 -2025 828 911 -1108 -801 1139 -769 -2062 2118 2129 -1797 -208 1363 -795 -609 567
849E67lj512j230K553p77k112L550k22l034J575Q75p68Q42N91k55o68p57J882
$$ 567 564 -948 -2178 375 -402 -2514 1036 814 -2220 -645 230 -538 304 895 640 -28 -785 1097
867A097k13j076J303r31q40P89o47L27J068j864Q2J600j745K65K375r70j526Q59
$$ 1097 884 -192 1111 180 -660 129 -518 -191 877 -987 -905 695 -1050 -785 1590 620 -906 -47
885d7J850j501j479L807n37m864L446K537n221R4M995l182k680L454J181m910
$$ -47 1803 302 -1177 2630 2093 -2771 675 3212 -2009 -1915 3080 -102 -2782 672 1853 -3057
901c057Q74N716l504l993O503K22p090M280N079o130j456N500j620n813M278N346
$$ -3057 -2183 3533 29 -3964 2539 2761 -4329 -49 5030 -1100 -2556 2944 1324 -4489 -211 5135
917E135o830k389O783k865n575P639K851q147K56N392l055k750O447J982q216
$$ 5135 -1695 -4084 2699 -166 -5741 1898 4749 -3398 -3142 2250 -805 -3555 2892 4874 -3342
932c342K16O748m191k282Q159k203q523L381M929m426K72O061l387q623N204O574
$$ -3342 -3126 3622 -569 -2851 5308 3105 -5418 -2037 2892 -1534 -1262 4799 1412 -7211 -2007 4567
948D567n660l00P277n924p219Q166M157n790J385M338o870n262R033L653p620
$$ 4567 -1093 -1393 5884 -40 -7259 907 5064 -726 659 4997 -1873 -7135 1898 5551 -2069
963b069K777L915j0774j381J3151r67q030N055J170r984K718J2796l371r403O362
$$ -2069 708 4623 -6151 -7532 5619 4652 -3378 1677 2847 -7137 -4419 8377 5006 -4397 1965
978A965J90j1532P973J3459r981q159P902l109q243J1738J0337j3249q179J0196
$$ 1965 2155 -9377 -1404 12055 2074 -6085 1817 -1292 -9535 2203 12540 -709 -8888 1308
992A308k474p169J5219N515j7910k711J1217m464l102J4542p8j9898N76J4605
$$ 1308 -1166 -8335 6884 12399 -5511 -8222 2995 -1469 -4571 9971 9893 -10005 -9429 5176
1006E176n840l846J5754m304k1467O270J5337p008j546J1510p865j6919R643J6219
$$ 5176 -664 -4510 11244 6940 -14527 -8257 7080 72 -1474 10036 2171 -14748 -5105 11114
1020A1114r250l309J0984j1669j4633J7444J2703j3301j642Q733j3039j0238K0141
$$ 11114 1864 -1445 9539 -2130 -16763 681 13384 83 -1559 7174 -5865 -16103 4038
1033D038J0924j6274l007R538j3125n430K4482L491k0313J603P961j2254N53K2911
$$ 4038 14962 -1312 -4319 5219 -7906 -13336 11146 14637 -5676 -4073 3888 -8366 -7813 15098
1047A5098k384k2146L116J0006j2008L992K1854j0080k1460Q737P860r436Q479
$$ 15098 12714 -9432 -6316 3690 -8318 -4326 17528 7448 -14012 -5275 2585 -6851 1628
1060A628J5092j5367j7209J3447P664r657R573J0988k1619j2084J8908N008q866
$$ 1628 16720 1353 -15856 -2409 5255 -4402 5171 16159 -5460 -17544 1364 6372 -2494
1073b494R077M009k0782n716K0096L515r762Q020M0k0527K762K1892k653r355
$$ -2494 6583 10592 -10190 -15906 4190 7705 -2057 5963 6003 -14524 -11762 10130 7477 -1878
1087a878P595m741j6402R203K0676p217j1363P580n438j4428J5911J7671j4267
$$ -1878 5717 976 -15426 -6223 14453 7236 -4127 3453 -1985 -16413 -502 17169 2902
1100B902r849Q865o517q576J8534J2316j8400r072J1259m913o039K0287N624k3282
$$ 2902 -6947 1918 -4599 -13175 5359 17675 -725 -9797 1462 -3451 -9490 10797 16421 -6861
1114f861l440J2888n905j720J8263k333k2683J876J5060o807j829J7180p918k2284
$$ -6861 -10301 2587 -3318 -5038 13225 10892 -11791 -9915 5145 -1662 -3491 13689 5771 -16513
1128a6513R647J5721r281k81J3340j1928j7601J3746J4454j1186n73J0667j4073
$$ -16513 -6866 8855 -426 -707 12633 705 -16896 -3150 11304 118 -455 10212 -3861
1141c861j3173J9008R444j3388J608P162j4300o246J9964N600j5033J780O743
$$ -3861 -17034 1974 11418 -1970 -362 6800 -7500 -13746 6218 11818 -3215 -1435 5308
1154E308j3915j607K0773j10j6429M181N070j1872K670J7723m463j5581N304N923
$$ 5308 -8607 -10214 10559 10449 -5980 -1799 3271 -8601 -5931 11792 7329 -8252 -2948 2975
1168B975j0165M540J5323r668j3041Q592M198p588O298R991j1344j0223J0334
$$ 2975 -7190 -2650 12673 3005 -10036 -1444 2754 -4834 1464 11455 111 -10112 222
1181B22L774p705O461O859j4140n718J2925J301p419O738L071j3348j676J3598
$$ 222 3996 -3709 2752 9611 -4529 -10247 2678 3979 -3440 3298 6369 -6979 -8655 4943
1195D943k89p564O648Q94j2903K794J2677m142n576O247k190r916N863J0038o210
$$ 4943 4654 -2910 3738 4632 -8271 -5477 7200 3058 -2518 3729 1539 -8377 -2514 7524 1314
1210A314n094P052l716q170R301P286r447j836O697m851m528R082M068r755p53
$$ 1314 -3780 3272 -444 -8614 687 7973 -1474 -3310 3387 -1464 -5992 3090 7158 -2597 -3350
1225c350O819m674l865R541Q49j0139K219N589n022j051P496j702q157L250N959
$$ -3350 3469 -1205 -5070 4471 5320 -4819 -2600 2989 -2033 -3084 4412 2710 -5447 -2197 3762
1240C762n309o35P667l973p451N776M378o171J015N392m482n598O093L622n921
$$ 3762 -1547 -2182 5485 1512 -5939 -163 4215 -1956 -941 4451 -31 -5629 464 4086 -1835
1255a835L90N490n205m369P637J437o246K357M047n210k193O136O72n477K295
$$ -1835 -1445 4045 -1160 -5529 2108 3545 -2701 -344 3703 -1507 -3700 2436 3108 -2369 -74
1270g4M026o071j065O999k402m908M148J999m966N6N057k067m332M146K200m980
$$ -74 3952 -2119 -3184 3815 1413 -3495 653 2652 -2314 -2258 2799 732 -3600 546 2746 -2234
1286b234R69M623l589k282M257q9l438J976J873k794j689L632j98l151J880J958
$$ -2234 -1265 3358 -231 -2513 1744 1655 -1783 193 2066 -728 -2417 1215 1017 -2134 -254 1704
1302A704l915M80L438j556j507K117N0k078P98J860n20j892J864K55k520J338
$$ 1704 -2211 -1731 1707 151 -1356 761 811 -1267 -469 1391 871 -1021 843 1098 -1422 -84
1318h4J542k128M6J347o62p51N24M61q88m31J631Q0j510J474j01j635J570R27
$$ -84 1458 -670 -624 723 61 -690 -166 295 -593 -1024 607 687 -823 651 550 -1085 485 1412
1336A412j548k90J275m44j206O70J458j854p98K256r68j427J980K76j510M93J238
$$ 1412 -136 -426 849 405 -801 -131 1327 -527 -1325 931 -37 -1464 516 792 -718 -225 1013
1353A013j240l10J493j55j656Q31J590k005m25K471j485j564K008J81j913M71
$$ 1013 -227 -537 956 801 -855 -24 1566 -439 -864 1607 122 -1442 566 747 -1166 -695
1369f95J500r34j001J545R87k739P23K275j814j096K491o75j463J338N33j403
$$ -695 805 -129 -1130 415 1402 -1337 -614 1661 -153 -1249 1242 567 -896 442 975 -428
1385d28l22J404o0k140J137J522k468L05K197j340r19J666K63j693M89J942r46
$$ -428 -750 654 594 -1546 -409 1113 -1355 -1050 1147 -193 -1112 554 817 -876 -387 1555 609
1402F09j789J749N28k191R13K141k035q40J614l00j388O86J743j792j073K200
$$ 609 -1180 569 1097 -1094 -181 1960 -75 -915 699 399 -989 -303 1440 -352 -1425 775
1418G75k39k182J768J683k731pK632j660r98K120J23k566R4K725j451j807L210
$$ 775 536 -1646 122 1805 -926 -933 1699 39 -959 1161 1284 -1282 -1188 1537 86 -1721 1489
1435A489r62l264J803K657k128k56K485j783k546K371K613k700m33K893k557k707
$$ 1489 527 -2737 -934 1723 -405 -661 1824 41 -2505 -134 2479 -221 -654 2239 -318 -3025
1451c025M314J544m098N93K011k895j160M452O41m189J010K201l502l9N520j062
$$ -3025 1289 2833 -1265 -672 1339 -1556 -2716 1736 2377 -1812 -802 1399 -2103 -2142 3378 2316
1467B316m867K309K061l475N91M768j781n356K653K469l970J703M942l820n021
$$ 2316 -2551 -242 1819 -1656 -1065 3703 1922 -3434 -781 1688 -2282 -579 4363 543 -4478
1482d478M620J687l823J996M519m968m310N387K380m871K606L747o863k618P231
$$ -4478 142 1829 -1994 2 4521 -447 -4757 630 3010 -1861 745 4492 -2371 -4989 2242
1497B242N73m528K959J716o618j002Q176q13n192L893J142p916K086Q873l070
$$ 2242 2815 -1713 1246 2962 -3656 -4658 3518 2705 -2487 1406 2548 -5368 -3282 5591 2521
1512B521n156M072o3o458L838P780m543n607M427p91n510O404O213p635m143N617
$$ 2521 -2635 1437 1374 -5084 -1246 6534 1991 -3616 811 20 -5490 914 7127 -508 -4651 966
1528I66j291l891P005L785q566l008O537j162l302P607R18j0066l05O998k495
$$ 966 -325 -4216 2789 6574 -1992 -5000 1537 375 -2927 4680 5598 -4468 -4773 2225 -270
1543b70j144O316j879r142J596P951l125j760O503l881r000N668P193m550q57
$$ -270 -1414 4902 3023 -6119 -4523 3428 303 -1457 5046 1165 -7835 -2167 5026 476 -381
1558c81M577n354o530P970O063o442p76M498o840m291J0661L105q141N12L901
$$ -381 4196 -1158 -7688 282 6345 -97 -873 3625 -3215 -7506 3155 6260 -1881 -1369 2532
1573B532o818j527J1172R97r498J461L809o968J548J1239l321r631L485L106o054
$$ 2532 -4286 -5813 5359 6356 -3142 -1681 2128 -4840 -3292 7947 4626 -5005 -1520 1586 -4468
1588d468L699R286o136r243N405L492n966M898P564r457o958Q396J799n162N792
$$ -4468 -769 8517 2381 -6862 -1457 2035 -3931 967 8531 -926 -7884 512 2311 -2851 2941
1603B941M433j0918m270R696J180n424N703K371j1881p43J1058j365n168N450
$$ 2941 7374 -3544 -7814 1882 3062 -2362 3341 5712 -6169 -6912 4146 2781 -2387 3063
1617C063n11j0042K426J1114l041n301N261j570r251N874R872o117m953N682l079
$$ 3063 2552 -7490 -5064 6050 3009 -2292 2969 1399 -7852 -1978 7894 1777 -3176 2506 -573
1632e73o559P421P887q169m134N775k884m711Q956M641r886k375O285k976k629
$$ -573 -7132 289 8176 7 -4127 1648 -1236 -5947 3009 7650 -2236 -4611 1674 -1302 -3931
1647c931Q909J399j0290l13O695l616j552Q401j303j0644K909O171m140K70O719
$$ -3931 4978 6377 -3913 -4226 2469 -1147 -2699 5702 4399 -6245 -3336 2835 -1305 -1035 5684
1662E684m154q464M907N959m759K02O299o223o428P528L490n394J849L776o694
$$ 5684 1530 -6934 -2027 3932 -827 -625 5674 -549 -6977 551 4041 -1353 496 4272 -2422
1677b422l432P808K095n786K088K764p044j003Q966p67n555K630J215n988K003
$$ -2422 -5854 1954 4049 -1737 351 3115 -3929 -4932 4034 3267 -2288 342 1557 -4431 -2428
1692b428P222k036n591L373R56n489K921O704m622m327L779n7l747M065M279n596
$$ -2428 4794 2758 -2833 540 1496 -3993 -1072 5632 1010 -3317 462 405 -3342 723 5002 -594
1708e94l388M589K05l654M760K616o676j338N428j423k353M536L63o080L11N168
$$ -594 -3982 607 812 -2842 1918 4534 -2142 -3480 1948 525 -1828 2708 3071 -3009 -2698 2470
1724B470k137k138M300p03n979K509M686l193j011L680j967m309L415L490l201
$$ 2470 333 -1805 2495 1792 -4187 -1678 3008 -185 -1196 2484 517 -3792 -377 3113 -88
1739h8j045L534k543l455M659J773m054L35K672l015j571M233O85l388J94K327
$$ -88 -1133 2401 -142 -3597 1062 2835 -1219 -884 1788 -1227 -2798 1435 2120 -1268 -1074 1253
1755A253k292r04M023n14l406J627J230k232N37K599j424k284J640J224k333P61
$$ 1253 -1039 -1943 2080 1566 -1840 -213 1017 -1215 -678 1921 497 -1787 -147 1077 -1256 -495
1771d95K455k232j614K128K59j782J257J575k105o75J774Q9j296J008O55j689
$$ -495 1960 -272 -1886 242 501 -1281 -24 1551 -554 -1229 545 634 -662 346 1001 -688
1787f88n14K114p03r14J661m22j550N33J391j213KQ71j21j596Q04J391j228j13
$$ -688 -1202 912 209 -705 956 534 -1016 -483 908 -305 -303 568 447 -1149 -345 1046 -182 -295
1805b95J115q64q11J307o9p29M56M71q24l72R85k88r23Q65P88j584N68J285j243
$$ -295 820 -44 -855 452 383 -346 110 581 -243 -615 370 82 -841 24 812 -772 -204 1081 -162
1824a62l25O73K26p38J87R53r82l53Q65O1j010P66K84j223K93J188q12k37M79
$$ -162 -487 186 412 -326 -139 814 -168 -521 344 405 -605 161 445 -778 -485 703 -109 -346 133
1843A33Qo70N85O29q76k37J204o23q52P46J29n82K12Q12o83n10O80%o85O41O55
$$ 133 141 -529 56 685 -191 -428 776 153 -699 47 176 -406 -194 618 -65 -575 105 105 -580 61 716
1864G16j018j76O72m49j48N82M35p60j82M56r0l75O57L6n07j26M22o57L43K82
$$ 716 -302 -478 194 -255 -403 179 614 -146 -328 128 38 -337 320 356 -151 -277 145 -512 -169 113
1884A13k63k25L15J05j52j4K89J27m79RO55p09o6R08n93m7K44n1m42N2M06k01
$$ 113 -150 -375 -60 45 -107 -121 168 295 -184 -175 480 -229 -295 613 20 -27 217 166 -276 -224 182 -19
1906a9m46N87J81r93Q74J50m15j41P47k23l28j33M91l74p4L59Q2m92Q6K14q59
$$ -19 -465 122 303 -690 184 334 -81 -222 525 302 -26 -159 332 -42 -116 243 325 -167 -81 133 -726
1927g26L19P09l74L4K5r5l0k48P12J5o11K04L16k31j36L89L12o32n41Q02l10j94
$$ -726 -407 302 -72 -38 -13 -108 -138 -386 326 341 -270 -66 250 19 -117 272 584 -48 -589 213 -97 -291
1949b91O02K00j079K70N55l81j09N72R6r22J28P80n04m78J220r6j591R10P59o12
$$ -291 311 511 -568 -298 257 -124 -233 339 435 -487 -359 421 -83 -561 659 563 -1028 -118 641 29
1969B9n5P91q82j196R01J352p99k43N99o33j033J457P93j084k69O17o93q54J977
$$ 29 -26 765 -117 -1313 -412 940 141 -102 497 -136 -1169 288 1081 -3 -272 345 -348 -1202 775
1988G75Q03j864l47J336j413m43K114K17j856J42Q48j320J38K218j92k392P43
$$ 775 1578 -286 -633 703 -710 -1153 961 1178 -678 -536 312 -1008 -870 1348 1156 -1236 -493
2005d93J313j690M69K493j526k288J408J046j292O89J695j915k320K091J180j661
$$ -493 820 -870 -401 2092 566 -1722 -314 732 -560 129 1824 -91 -2411 -320 860 -801
2021h01J199J680l286j344L145N79j652J321M42l070m10L541r1j753J499r5l311
$$ -801 398 2078 -1208 -2552 593 1172 -480 841 1283 -1787 -2197 1344 1253 -500 999 904 -2407
2038b407R34L455q72k125J487n23k392J682L615k129j933J810n28k474K895K722
$$ -2407 -1473 1982 1110 -1015 472 -51 -2443 -761 2854 725 -1208 602 74 -2400 495 3217
2054C217l220j587J998q84j680L666J273l826r30K649j100j048L664L50m857M39
$$ 3217 -3 -1590 408 -476 -2156 1510 2783 -1043 -1973 676 -424 -1472 2192 2542 -2315 -1876
2070a876K732j144p6L110j221m230R95L227j713j18L015k115m090L003K310k347
$$ -1876 856 -288 -364 2746 1525 -2705 -1710 1517 -196 -314 2701 586 -3504 -501 1809 -538
2086e38O86K132l182k984M008K447k711L4K324l822k222N312J469l641L60J532
$$ -538 148 2280 -902 -3886 122 2569 -142 -108 2216 -1606 -3828 1484 2953 -688 -328 1204
2102A204l410n78N278M17m312J075J159l489Q58N178j516l756J482O05k560K005
$$ 1204 -2206 -2784 2494 2911 -1401 -326 833 -2656 -1798 3380 1864 -1892 -410 195 -2365 -360
2118c60M250k879l657K469R89k921K477L350m017k856L215N70k353L109J508m288
$$ -360 3890 1011 -2646 -177 812 -2109 368 3718 -299 -3155 60 630 -1723 1386 2894 -1394
2134a394j816L752M37j898K609N25m761k71M480r78j139K253n00m231J110M165
$$ -1394 -3210 542 979 -919 1690 2215 -2546 -2817 1663 685 -454 1799 1299 -2932 -1822 2343
2150B343j391j608K132j298l417K710L305k453j137K037j776k340L439K621l036
$$ 2343 952 -656 1476 178 -3239 -529 2776 323 -814 1223 -553 -2893 546 3167 131
2165A31j164K018j550j899L867J556l756l04J558j656m87L773k89l215K58J776
$$ 131 -1033 985 -565 -2464 1403 2959 -797 -1101 457 -1199 -1686 2087 1798 -1417 -1159 617
2181F17j623N5L524j344l363J444J521j687Q35K593k290k893K318J705k210J221
$$ 617 -1006 -951 2573 1229 -2134 -690 831 -856 -21 2572 282 -2611 -293 1412 -798 423
2197D23J566k695j956K753P49j391J009J093k802j058L090M13j847J133Q30k857
$$ 423 1989 -706 -2662 91 840 -551 458 1551 -1251 -2309 781 1194 -653 480 1310 -1547
2213a547P0L044l00j821R89J24k259O97K645j017j479Q33K74k013J604K119j503
$$ -1547 -1477 1567 1267 -554 435 559 -1700 -1003 1642 625 -854 -21 253 -1760 -156 1963 460
2230D60j402J370n31j142J692J211j849j106J727m16j262J864R16k362o7J146
$$ 460 -942 428 -103 -1245 447 1658 -191 -1297 430 14 -1248 616 1532 -830 -897 249
2246B49m21n43J311J75j744K04J481o53k47J142m88j541R54Q95p99k25P61m61
$$ 249 -172 -715 596 771 -973 -769 712 59 -188 954 466 -1075 -121 774 -25 -250 511 50
2264E0r51P39J034r53l38P00l99q26J081M06n73o7K99k03o03J108J48p92l1M03
$$ 50 -901 -162 872 -81 -419 281 -118 -944 137 543 -30 -97 202 -1 -604 504 652 -140 -171 232
2284B32m90j70P26Q9q10M72j48k05J33M55m4m60N1L21k36RN98k28n10J94O2q8
$$ 232 -258 -428 298 387 -423 49 -99 -304 -171 284 240 -220 -169 152 -84 -75 523 295 -215 -21 41 -47
2306d7J27L04k03o63L91R2O7j85K98l43rL49k22J15j95K75j19m12K23K87j64k35
$$ -47 80 384 181 -482 -91 1 68 -117 181 -162 -171 178 -44 71 -124 151 32 -380 -157 130 -34 -269
2328b69M05l81k08M22M6qJ36q7L4k3o8L23l50j78O65m94k62N35o9j82k03J28L05
$$ -269 136 -245 -453 -31 15 7 143 56 90 67 -1 322 -28 -206 459 -35 -297 238 169 -13 -216 -88 217
2351B17m35R7K11r9j26M31l11j95J68o7J29j82K66j18r7L48k9m63J10K95j34k2
$$ 217 -218 -121 90 -9 -135 296 -15 -210 -42 -109 20 -162 104 -14 -111 237 208 -255 -145 150 16 -6
2373fJ72j90l36L73Pl4k39M07nl20J46K95k22l04M39o8l57O35k59o11L43L87l97
$$ -6 166 -24 -360 13 20 -14 -253 154 149 -171 -25 270 48 -256 183 115 -242 393 134 -477 -134 253 -144
2396a44l79N37K02n82M40R0n67L71J55j9m62K33L28l30J53M02n25j43M28K09n37
$$ -144 -523 14 216 -366 74 164 -403 -32 123 104 -358 -125 203 -127 26 428 -97 -240 188 397 -140
2417a40K64J75n05M51j72J24m37J35K04l11J66P03o90j48M19j86l51M73k29r8
$$ -140 124 299 -206 245 73 197 -240 -105 99 -212 -46 657 -33 -181 238 52 -299 174 -55 -153
2437a53P3J67j35k70M18J23m29J68N14q95K29L55l60j88N10J63m56J37J20r4m42
$$ -153 -80 87 -48 -318 100 223 -206 -38 476 -419 -190 165 -195 -383 127 290 -166 -29 91 -3 -445
2458d45R77p6r14M72N81q94r7Q74j43o94K63K83o24L32Q44m28j121R86o8m71M80
$$ -445 532 456 -458 14 595 -299 -396 478 335 -359 -96 187 -437 -105 739 311 -810 176 108 -363 117
2479A17Q10j276k04Q11j13o55P57O09j279k73R25k74l97R12K09j600j46J809n89
$$ 117 927 -349 -553 258 145 -510 247 856 -423 -696 229 -45 -442 470 679 -921 -1067 742 153
2498A53m68Q62l9j552N61J489j039k14J376j118j125J217Q54j224k64J036p60
$$ 153 -315 547 508 -1044 -483 1006 -33 -247 1129 11 -1114 103 957 -267 -531 505 -255
2515b55r58J810M15j347J0J141j464j94K049j58k021J120J20q83p2J887l20j979
$$ -255 -1213 597 1012 -335 -325 816 -648 -842 1207 1049 -972 148 268 -615 -687 1200 880 -1099
2533a099P61P54j214K43K100j259j822J338O38j354J172J300j530j542J493O53
$$ -1099 -338 416 -798 -555 1545 286 -1536 -198 440 -914 258 1558 28 -1514 -21 632
2549F32j430J389Q89k536o89K376J16j121R85L36k444j51K789l51j434J312J47
$$ 632 -798 591 1480 -1056 -1745 631 747 -374 611 947 -1497 -1648 1141 790 -644 668 815
2566H15k622P48K662j152j261J450l12k170J361K434j719j298J622o63j830K202
$$ 815 -1807 -1059 1603 451 -810 640 328 -1842 -481 1953 234 -1064 558 -105 -1935 267
2582B67K074k499r96J794j036j130K681R82k773m48J686j107n85K772L1l394N87
$$ 267 2341 -158 -1154 640 -396 -1526 1155 2137 -636 -1084 602 -505 -1090 1682 1713 -1681 -1094
2599a094J457r77j65K346o46k793R91J564j390M79K130j455k655J753J657j748
$$ -1094 363 -614 -779 1567 921 -1872 -881 683 -707 -228 1902 447 -2208 -455 1202 -546
2615e46P34J603j836k248K488J183j891P85J173k362j117L026N10j641M40M07
$$ -546 188 1791 -45 -2293 195 1378 -513 272 1445 -917 -2034 992 1502 -139 301 708
2631G08k061m30L283K8k214Q34N69k657R98L216j197k404J472r1j601J408K268
$$ 708 -1353 -1783 1500 1528 -686 148 717 -1940 -942 2274 1077 -1327 145 54 -1547 -139 2129
2648B129j607j831J326J91j777J958J844k568j053J868l57j121K080Q44k994n58
$$ 2129 522 -1309 17 208 -1569 389 2233 -335 -1388 480 123 -998 1082 1926 -1068 -1626
2664a626K174l23r54K290k17l065K11K346o64l40J390o18k596J177K236j034m57
$$ -1626 548 225 -729 1561 1344 -1721 -1510 836 172 -168 1222 604 -1992 -815 1421 387 -70
2681g0J468j071k521J760K269j355o32J067j434j341K313J408j917n82J072j103
$$ -70 1398 327 -2194 -434 1835 480 -152 915 -519 -1860 453 1861 -56 -638 434 -669
2697f69j051K665Q51k317j3J034j379k39K531j99k090N00R28j400lK407p65j988
$$ -669 -1720 945 1796 -521 -534 500 -879 -1118 1413 1214 -876 -376 552 -848 -851 1556 791 -1197
2715a197N42J174j197L06J885j193j724J210J037j453O67J213j539j472J828L63
$$ -1197 -655 519 -678 -372 1513 320 -1404 -194 843 -610 57 1270 -269 -1741 87 450
2731D50r91J041P24k185m08J812L48j465R02M38j777K79J450J9p50N26J39j468
$$ 450 -541 500 1224 -961 -1369 443 791 -674 228 666 -1111 -832 618 637 -113 413 552 -916
2749i16O33J295n93r81Q44l15q52N62J367j239k74P41k72p19O32R82r67o24J114
$$ -916 -283 1012 419 -562 282 -33 -885 -323 1044 -195 -469 272 0 -719 -87 895 -72 -696 418
2768D18l02q00R88M13j047k71J092m49l27O80J67j130O8J017n89m16J015j45j177
$$ 418 116 -684 304 717 -330 -601 491 42 -285 395 562 -568 -500 517 -72 -488 527 382 -795
2787g95L80R87m49l36P65k90p34K66P43o99k00P12l69o79O45N19q08L61L88n82
$$ -795 -415 572 123 -213 552 262 -472 -206 537 -162 -362 350 -19 -698 -53 466 -342 19 407 -175
2807a75n33J111j12n36Q1M97k81n14R30j68p54L67O17o69k81Q39l87m86L67K49
$$ -175 -708 403 291 -245 -164 333 52 -462 468 300 -454 -87 530 -139 -420 419 32 -454 -87 162
2827A62n87J18N09Q6m08J46M1l45M47K6j31l52O16L05j049M12L87m08l21N51l11
$$ 162 -425 -307 202 288 -120 26 67 -278 169 195 64 -288 328 633 -416 -4 383 -25 -346 205 -106
2848a06j69N05P8l62l33P08l47j01l5M73k83j81K67j09J6Q9J74n71R7L86j46J5
$$ -106 -275 230 308 -54 -387 321 -26 -127 -162 311 28 -153 114 5 21 110 284 -287 -190 196 50 65
2870F5j33M04n41L73k01J5k14L91k19M3J2K95r6j17P4J30m34J69K45l40j61M61
$$ 65 -68 336 -205 168 -33 -18 -232 159 -60 -17 -5 290 194 77 151 281 -153 16 261 -79 -240 221
2892B21k22o3jP8l32L90K35k90m24N99r4k90M97L8l22l53N65Qm86L65K4l14o7
$$ 221 -1 -64 -65 13 -319 71 306 16 -408 191 97 -193 304 342 20 -333 232 240 -246 119 143 -171 -238
2915b38K69o9l15M95k4k36L44j05k34J18J26j21j35K90P9k62l02Q38m21p05R35
$$ -238 31 -38 -353 142 118 -118 226 121 -113 5 131 10 -125 165 244 -18 -320 518 97 -608 327
2936C27o93m5J17L73k37o3M05o1l75K09J78q2k29O18l21l58K52O5k14J60O94q19
$$ 327 -366 -411 -294 79 -158 -221 184 123 -252 -43 135 53 -176 442 121 -237 15 80 -134 26 720 -99
2958i9J2J69R2k11J14M03r05j62Q00J62o91L81N24p09m10O83k92j71O70oo75J64
$$ -99 -87 82 174 -37 77 480 -425 -587 213 375 -316 65 589 -120 -530 153 -139 -310 360 354 -321 -157
2980a57P65m81n18P29k48o05L20O59o16k78Q01P8r99M96Q47j144j76Q87l54m80
$$ -157 608 127 -391 338 90 -515 -195 464 -152 -430 371 449 -550 -54 793 -351 -527 360 6 -474
3000d74R38M49j043P6L91k48q07J416M1j303K49N43k24m74J210k05q87R7Q03q23
$$ -474 464 913 -130 -54 337 89 -718 698 739 -564 -315 228 4 -470 740 535 -352 -255 548 -275
3020b75O6J135l91j374Q56M13j154Q31O52o97j206J073Q16j819R37J217j277q07
$$ -275 -209 926 535 -839 17 430 -724 107 759 62 -1144 -71 745 -1074 -137 1080 -197 -1004
3038a004J386J46j000N75N72j439k86J943k52j004K32Q23j819J93K111n13j292
$$ -1004 382 528 -472 103 675 -764 -1050 893 641 -363 -131 692 -1127 -934 1177 664 -628
3055f28R32l49q56M49J711r35j226R26J83j192J175J071j228r08Q63J27q55J264
$$ -628 304 -45 -901 -452 1259 324 -902 24 207 -985 190 1261 33 -875 -12 115 -740 524
3073E24P96j810n88J100J88r03J547L33k005l86J757m08m67J296l00j803K57J579
$$ 524 1320 -490 -1078 22 210 -693 854 1187 -818 -1204 553 145 -322 974 674 -1129 -872 707
3091G07o41j77Q38j70j977R55J603j266L5R53q51j456J338J605j403m77J059j024
$$ 707 66 -111 727 557 -1420 -465 1138 -128 -93 860 9 -1447 -109 1496 93 -384 675 -349
3109c49j235K288Q91j959J09Q55j131m12J977K70j727j58R85j016l05K428n57
$$ -349 -1584 704 1595 -364 -255 600 -531 -943 1034 1304 -423 -581 404 -612 -917 1511 954
3126I54k026O28N76j081R20J711j233j533O34Q56r19O87J332j476j413J249M77
$$ 954 -1072 -444 132 -949 -29 1682 449 -1084 -450 406 -513 174 1506 30 -1383 -134 343
3143C43o94Q80P85j921j143J943O97j358Q76Q16k131m31K048j19q91P34N19k357
$$ 343 -351 529 1314 -607 -1750 193 890 -468 408 1224 -907 -1338 710 591 -300 434 953 -1404
3161a404J95J941J9j108P98m37j528R22J852n96j079P61n76q97J220J436j168
$$ -1404 -1209 732 751 -357 441 4 -1524 -602 1250 654 -425 336 -240 -1137 83 1519 351
3178C51j343J208l75j004J575J081j948n95J320o26l02J374O62k239j02J153n1
$$ 351 -992 216 -159 -1163 412 1493 -455 -1050 270 -356 -658 716 1378 -861 -963 190 139
3195A39n90J778m51j886j77J637n95k29J545r19j760Q40J331o12l43J066q13j399
$$ 139 -451 1327 876 -1010 -1187 450 -145 -374 1171 252 -1508 -668 663 51 -292 774 -39 -1438
3213a438J402P12r02J90O53r35p96J472P67j425M50M06j060n31J969j11r97kJ46
$$ -1438 -36 676 -226 -36 617 -318 -1114 358 1125 -300 150 556 -504 -1035 934 823 -174 -176 -30
3232c0o28R1J359j20j414M08O39r30M11J128n26j075M99L46q17N54J238j045r63
$$ -30 -658 -567 792 672 -742 -334 305 -625 -214 914 388 -687 -188 158 -659 -105 1133 88 -875
3251h75P60N28j033P72Q34j249p37J287j70j42L34N80j183m12R37L00p32N97K16
$$ -875 -115 413 -620 152 986 -263 -1000 287 117 -25 309 889 -294 -706 231 531 -201 396 612
3270F12j366M36Q27m69o11J161o31r73M22J368m40p92J023n79o04N77O11l28n95
$$ 612 -754 -318 509 40 -571 590 -41 -1014 -592 776 336 -456 567 -12 -616 -39 572 244 -351
3289c51O14m45m93Q74L44o58k54M33r8n08J073j71r24K80N94n81J08N16j11p75
$$ -351 263 -182 -675 199 543 -115 -369 64 -34 -542 531 360 -564 -284 310 -271 -163 353 242 -533
3309e33L97M07k86m32R88n73k83P00j76k98k03M21j09o07O17L32m07m20Q54l56
$$ -533 -136 271 -15 -447 541 -32 -315 385 209 -89 -292 129 20 -587 30 362 -45 -465 389 33
3329C3l13N49K4j09k7qj29m65N37P3m27K30J58j46o7L11j69l75N05j40l73L12
$$ 33 -280 269 293 184 157 149 20 -445 92 165 -262 -32 126 -20 -87 224 55 -320 185 45 -328 -16
3351a6J22Jk44J56J9Rj09N48o35P3K45j65k02J46L29k94j89L07m4mj39J63q9j24
$$ -16 106 107 -137 19 38 47 -62 486 -149 -76 169 4 -198 -52 277 -17 -206 101 57 53 -86 77 -12 -136
3375a36R1K9m23P11k55j18p4J36l37J95L42p1j02l7l1L63k02k36K31p4N9K5k74
$$ -136 -45 -16 -439 272 17 -101 -175 -39 -376 -181 161 90 -12 -49 -80 283 81 -155 76 2 61 86 -188
3398a88J14K53j35O8q7Q4k43J02k26j44L27l0k43J90J96O6k60O5J55kk00L74L5
$$ -188 -74 179 44 112 25 109 -134 -32 -258 -402 -75 -105 -348 -158 38 104 -156 -91 64 62 -138 236 271
3421B71l12J31j97J30m8L86l42oj99J99j94J51N7l38J41K55j84N3r8j51M30j24
$$ 271 -41 90 -107 23 -25 361 19 13 -186 13 -181 -30 27 -311 -170 85 -99 -46 -144 -295 135 11
3443A1J45J07l21K03j56j34pM00n17K64K18j67O4j41Q1m2j9J39m3k42J50J72k19
$$ 11 156 263 -58 145 -11 -145 -152 248 -269 -5 213 46 110 -31 50 8 -11 128 85 -157 -7 165 -54
3466e4j46L13J23j53j95M32j44l91L49k5k77K47r3j62O1L43j59l16L87m4j29m15
$$ -54 -200 113 236 83 -112 320 176 -215 134 109 -168 79 -14 -176 -115 228 69 -247 140 96 -33 -448
3488d48M40l0j44K20J74r5j12J1r4j36K34j18j92K31J32Q3j47J3j03j75L53mr8
$$ -448 -8 -38 -182 38 212 117 5 16 -78 -214 20 -98 -290 -59 73 156 9 22 -81 -256 97 93 -5
3511eJ38k35O3j29j27P09m18P2J92n63j07N65M3n47K52K38k47j48M00L31n70k93
$$ -5 133 -102 -39 -168 -295 414 -4 68 260 -303 -410 155 198 -349 -97 141 -106 -254 146 477 -93 -386
3533c86O53l99j71M52K61n27o0L37n40L49L33J61j003L28L41m04nQ17l15o39J98
$$ -386 267 -132 -303 149 410 -117 -177 160 -380 -31 302 463 -540 -212 129 -275 -280 537 222 -417 -219
3554b19K46J08O4L48m39o92P35J52k16ML41p31m21Q55K61o17K19M81p67j84Q20
$$ -219 27 135 199 547 108 -584 151 303 87 91 432 -299 -720 135 396 -221 -2 479 -288 -472 348
3575C48J89n55K70R0p61k8J105k88o28K97j61r08P69J126m43j055P24k62p38Q37
$$ 348 537 -18 252 342 -419 -447 658 370 -258 39 -122 -1030 -261 865 422 -633 91 -171 -909 -72
3595g2R59r37l59M47j51k64P22P71j075p52P85l44l68J357J18j201l96J006k70
$$ -72 887 -50 -409 38 -113 -377 345 1116 41 -711 74 -270 -638 719 837 -364 -760 246 -24
3614b4j88P32M0j244j76J113M5o21J083p95j143Q25R17l20j65M69q88j058J224
$$ -24 -212 520 560 -684 -860 253 298 -323 760 -35 -1178 -353 564 244 79 548 -340 -1398 -174
3633a74J150q18j85N17o81r84J515N68r62k07M60p44l97J633J44j046R7M72q48
$$ -174 976 158 -27 490 -191 -1175 340 908 -54 -261 199 -545 -942 691 835 -211 -114 358 -490
3652d90M4J318L0j570M06N78q99L52J335q85j080N80J000j130M42J294j192j167
$$ -490 -446 872 902 -668 -262 316 -583 -231 1104 219 -861 -281 719 -411 31 1325 133 -1034
3670a034J044M53q14L83R35j415o30N89P86p34N49O31j298n52J833k61m89L74
$$ -1034 10 463 -351 32 967 -448 -1078 -489 297 -437 112 743 -555 -1107 726 465 -24 350
3688C50j13q30k51J643l64n04L74Q6j379P49J168m59j021Q21p8j008O79J430j337
$$ 350 237 -593 -844 799 435 -69 305 391 -988 -239 929 470 -551 270 192 -816 -137 1293 -44
3707d4o28P80r1q19J327O28j362m92Q46j12p50J425L28j464m55J345m94m65J303
$$ -44 -672 108 17 -802 525 1153 -209 -701 145 33 -717 708 1036 -428 -883 462 -32 -497 806
3726H06jj758O2J172m14j17P50r0j204M57Q47m48L5N57p99q63J059N95o33m1L62
$$ 806 805 -953 -891 281 -133 -250 500 410 -794 -337 510 62 97 654 -145 -1008 51 646 13 -28 334
3747C34q22n96R94P78j035K4P55r36j42J330K5q26J33M02o34o2R73j67j221M14
$$ 334 -488 -1084 -90 688 -347 -323 432 -504 -646 684 709 -117 16 418 -216 -278 695 528 -693 -279
3767b79M92o29K55O65l90o70M82J60o19L93P71n55n17M34K44l94L63O04r36l56
$$ -279 213 -416 -161 504 114 -556 -74 86 -533 -140 631 76 -441 -7 237 -157 206 810 -126 -482
3787d82N94J8o05L83N10o33k70Q19l09p9K57J87o22l34J052n08k35K87K77p39
$$ -482 112 130 -475 -92 418 -215 -485 334 25 -54 203 390 -232 -566 486 -22 -257 30 307 -432
3807d32L66N84o09k84N04k5p47O84J39k38k55O42k32n43M87K86m42Q2M19l79n38
$$ -432 -66 518 -91 -375 129 104 -643 41 180 -58 -313 329 97 -446 41 327 -115 -33 386 7 -531
3828e31P39n0o4k66J38N4m36N62j92m60L77L16m93K95K85l1n87J70J78J1n0L32
$$ -531 208 158 94 -172 -34 20 -416 146 -46 -506 -129 187 -306 -11 274 243 -344 -174 4 15 -35 297
3850B97l59l55L71K43l73r1K72N3k16k4K38n0M8j29r5P1L3M57m46j56P2j38N3
$$ 297 -62 -417 -46 197 -176 -267 5 58 -158 -182 56 6 54 -75 -170 -99 -66 391 -55 -211 -139 -277 -224
3873b24K68K7k22J69J46l18J72%j31L0M0N9K7k99L95j07l0J64m4J55k69M07n14
$$ -224 44 71 -151 18 164 -154 18 18 -113 -83 -43 16 43 -256 139 32 2 166 122 277 8 415 -99
3896i9K73j1j3k41o5R7K55l24K72j84Mn1K25k86j2J25J38j30j86L64k93J02L05
$$ -99 174 163 150 -91 -156 -59 196 -128 144 -40 -36 -87 138 -148 -160 -35 103 -27 -213 151 -142 -40 265
3919B65l68J25j1j27L7j29K20K01l05L12j43j04lj73P9k0J25J79l14J13K62l67
$$ 265 -103 22 11 -116 -79 -208 12 213 -92 220 77 -27 -30 -203 -124 -144 -19 160 -154 -41 221 -146
3941a46n6J65J11J30O9k66J33k54NK50J18j14m41K78k05L74n4k02K88l79K54M0
$$ -146 -202 -37 74 204 273 7 140 -114 -109 141 259 145 -296 -18 -223 151 97 -105 183 -196 58 98
3963I8q6J55k9r0o6l07K02L10j78k15J35q2j70L24J45m6l85M58k66K67M8j15k28
$$ 98 12 167 138 48 -18 -325 -123 187 9 -206 -71 -153 -323 1 146 100 -285 173 -93 174 222 107 -121
3986a21J32J20j73K42r8m39m2L40k53J59p8J48O5O1pJ07m92K51M01n64N66k27
$$ -121 11 131 -42 200 102 -337 -379 -39 -292 -133 -211 -63 2 63 56 163 -329 -78 323 -241 325 98
4008I8J07m23R8K68l57%K29l0j36K70J09m45M52j74j13k34J47L69k89J37K22l94
$$ 98 205 -218 -120 148 -209 -209 20 -10 -146 124 233 -212 240 66 -47 -281 -134 235 -54 83 305 -89
4030h9j04O00l19k81M02k25k66j02N19J35l91K14J2n51M12M46l50k80L99M5o42
$$ -89 -193 407 88 -193 209 -16 -282 -384 135 270 -121 93 105 -446 -34 412 62 -218 181 226 -416
4051d16L24M62k45m47N12l10m65N17O11o76m6N45n79j15M23K60o23J70N62m52
$$ -416 -92 370 125 -322 190 -120 -585 -68 543 -133 -179 366 -213 -328 95 355 -268 -98 464 12
4071A2k89R51p3j199J98O23p05K47R57n43q59M35O28m60M5N66p86l86N64M30n24
$$ 12 -277 674 601 -598 -400 223 -482 -235 722 179 -680 -245 383 -77 -32 534 -252 -638 -74 356 -168
4092a68oP96j008k74Q15K54m05J81J89o02l21Q55K60p42M24J03q34J06J023j24
$$ -168 -174 622 -386 -660 155 409 4 185 374 -228 -549 306 566 -176 248 351 -483 -377 646 522
4112E22r21N45m4p38J57J287p14l23J67N7n32N34Q69q38m28L33n0n47P10P26p19
$$ 522 -399 146 102 -636 -479 808 94 -229 -62 -5 -537 -3 866 28 -400 -67 -117 -664 46 772 53
4133E3o51N79K35o73J109R8j209J5Q16o16lN56J68j235K56J013l87k51M65m41
$$ 53 -598 -19 216 -457 652 750 -459 -444 372 -244 -247 309 477 -758 -502 511 124 -127 338 -103
4153a03q35P59R43o80l00Q27o90q38Q40N34m80m0O44o16q08J150O82j210N1O90
$$ -103 -938 -179 764 84 -216 611 -79 -917 -77 457 -23 -63 581 -35 -843 307 989 -221 -170 520
4173E20p94p62J424L24j023n5N94q51L02J229l91r93O82J28r84M71J089o61p97
$$ 520 -274 -1036 388 712 -311 -366 228 -623 -321 908 517 -476 206 334 -650 -179 910 249 -548
4192e48N04k4l36O91O34j180n30J148j92p72J119K75j178j68P31k6m76O77M60
$$ -548 -44 -68 -404 287 921 -259 -789 359 167 -605 514 789 -389 -557 174 148 -328 349 809
4211H09j247j21R14j39n92Q12j40j000J95Q55j17l52N86m84o55N67Q62p46l42
$$ 809 -438 -559 355 216 -376 436 296 -704 -509 346 229 -123 463 -21 -676 -109 753 7 -335
4230c35N00l41m10O43O51p79k63O74n42l86R30M31j079j13N65l42l7O31J48j081
$$ -335 165 -176 -586 57 708 -71 -334 340 -202 -588 342 773 -306 -419 146 -196 -233 398 546 -535
4250e35L83M37o11K24M88J49j064L54O34p01Q6O19l22o23N40L8m02L05O25r04
$$ -535 -152 285 -326 -102 386 535 -529 -175 459 -242 -156 463 141 -482 58 96 -306 -1 624 -280
4270b80l37P02J36m94M89P4n01l74J091j37o51M06M06q02m4P24m6r31M42L11n99
$$ -280 -617 85 221 -273 216 290 -211 -585 506 369 -282 124 530 -272 -316 408 362 -569 -127 184 -415
4291d15K37O02j58n91P08j00o36M00N03o48k2N84m12l60N15k8l60l1O06m34j41
$$ -415 -178 424 266 -325 383 283 -353 47 550 -98 -120 464 52 -308 207 179 -181 -212 394 -40 -181
4312a81J47L37n99K60K5n3p1K87J19l84J43K87l09l14P08m30k10K99J43k52J31
$$ -181 -34 303 -296 -36 -11 -64 -135 152 271 -113 30 317 8 -306 402 -28 -238 61 204 -48 83
4333H3L83k45l55O2J25J3p4M47l61l52K42J25j03k64K34J33l19K15K34j32k74
$$ 83 466 221 -134 -72 53 66 -8 439 78 -274 -32 93 -10 -274 -40 93 -226 -11 223 91 -183
4354a83L69j60j59K97r0l02K19J81k12K5R6J52n18L57K97q70M28J17pjJ77n15
$$ -183 186 26 -133 164 74 -228 -9 172 -40 -15 81 233 -285 72 369 -501 -73 44 37 36 213 -302
4376c02M55p8K3k29J98n3M8k94o8N85n39K60j62P0O0J38m5l43p9M61j26k58K68
$$ -302 153 75 98 -131 67 14 62 -232 -300 285 -254 6 -156 -86 -26 112 67 -276 -355 106 -20 -278 -10
4399a0O9OK4R0j00j0o3L4n1K96l52J41l4L67p7r4l95J38O7l2r5K24k03k37O12
$$ -10 59 65 89 179 79 69 6 40 -11 285 -67 74 40 407 330 236 -159 -21 46 14 -81 143 -60 -297 315
4424C15n22O8K45P0k77j10K26J62k65K61o1j62j58JK80P7K6m36N41k17o2r0Q9
$$ 315 -207 -139 106 176 -101 -211 15 177 -88 173 112 -50 -208 -207 73 150 176 -260 281 64 2 -88 1
4447AJ36j93l2J50Q5m0r7np5J06q6R1r0J30m14J67K38J46k45j2J93O0n95M96k12
$$ 1 137 -56 -88 62 147 107 10 5 -70 36 -50 41 -49 81 -333 -166 72 218 -27 -39 154 214 -381 115 -97
4472i7j72J19Qn3K79m9l8l6j00J13j49N0N88m80j09J04J68L6q5R0j18K30o07L38
$$ -97 -269 -150 -142 -195 84 35 -3 -39 -139 -26 -175 -125 463 -17 -126 -22 146 182 97 187 69 299 -308 30
4496C0j63P2k73L71k6j23N00l33k14K13q8k4n3j27M2K64j32J59m37L11J03q8K96
$$ 30 -133 -61 -334 37 11 -112 388 55 -159 54 -34 -58 -111 -238 -196 68 -64 95 -342 -31 72 -16 280
4519B80q1k00lR7r8r4K46O1k72K5nK89m06P2M56m84P8M62m55k99L04K79l26J85
$$ 280 199 -1 -4 93 -5 -99 147 208 -64 -39 -44 245 -161 -89 367 -117 -39 423 -32 -331 -27 252 -74 111
4543A11K94n77K13J89l66qL21j71j84k28M14j72J49J06j4m11oM33K44n53K99N8
$$ 111 405 -172 41 230 -136 -144 177 6 -178 -406 8 -164 -15 91 77 -334 -340 93 337 -216 83 141
4565A41m38J09M56j12j01J78m8o20K99M70o39p8M24o9l30M18L79m12m8J58j59
$$ 141 -297 -188 268 156 55 233 185 -435 -136 334 -305 -383 41 -28 -358 60 439 27 -21 137 -22
4586b2o17Q85j28k81O9J10j65j74O05m4o13M59J2m66K09M69q1o23K73J48m67M33
$$ -22 -639 246 118 -163 -94 16 -149 -323 282 238 -375 84 96 -370 -161 308 227 -396 -123 25 -442 -9
4608iO95m62o48O75j47l51K86L75m41k83L27L28n21L14L67r69k9O51n6k73O63
$$ -9 686 224 -424 251 104 -247 39 414 -27 -310 17 345 -176 138 505 -464 -493 158 102 -171 492
4629D92k76o12J81O17m45J78L10j33r15N38L93m70l32P84k88l57L40O47q98J31
$$ 492 216 -396 -215 402 -43 135 445 312 -603 -65 328 -142 -474 310 22 -335 5 652 -246 -115
4649a15K12l01m91J087M0o51j13N90m52j83P26J66p56l6K88m00M50M67n4q43K68
$$ -115 97 -204 -695 392 432 -219 -332 258 -194 -377 349 515 -241 -277 11 -389 61 528 474 -369 -101
4670a01K62j36k23O45k67p39L80L85m39L70J97m62p10R18N2m51K96M94o91n97
$$ -101 161 25 -198 447 180 -559 -179 206 -233 137 334 -128 -838 80 132 -319 -23 471 -220 -817
4690h17J039L1m31L64r6l98k4M09K42l41L05j07o59L10P05k65m63L67m7n41K29
$$ -817 222 253 -178 186 90 -308 -332 77 319 -22 283 176 -483 -173 532 267 -196 171 124 -417 -188
4711a88O56k03o09L31J6n54Q00J38k86l88K33O8l82Q41K10j022J14M87k20k10
$$ -188 468 265 -344 -13 3 -551 249 387 101 -287 -54 14 -368 473 683 -339 -225 262 42 -168
4731a68O91r6o12k28N15J43n08M91k63k76KQ43l65j80J37jp54K64O36j55rJ38
$$ -168 523 427 -185 -413 102 245 -263 228 -35 -311 -309 534 169 -11 126 125 -629 -365 271 116 107 245
4753B45j82n58L99L83k17k75L35l58j21L84L22q88M78M9k02n8M68N1o11M71J30
$$ 245 63 -495 -96 287 70 -205 130 -228 -349 35 357 -531 -53 -4 -206 -264 204 255 -356 115 245
4774B45n79J60L61j51l55K71j6k47M18K05k03n09M28J45j97P4J88k37j60J48J58
$$ 245 -334 -174 187 36 -319 -48 -64 -311 107 312 109 -400 28 173 -24 50 238 1 -159 -11 147
4795A47l44J99M29o20r0L55J8j67K36J41l84k32N71j48j9K45l12k73J40L40l88
$$ 147 -197 2 431 -189 -279 76 94 -73 163 304 -80 -312 259 111 92 337 25 -248 -108 232 -156
4816a56M4P6J42k10J77J56j20k09P5o2J0Q7R0j09l96M97l06J74M36k42m3k09O3
$$ -156 -112 -36 106 -104 73 229 109 -100 -25 -87 -77 10 100 -9 -405 92 -214 -40 396 154 111 -98 -35
4839c5j32J72J05R6j95R3l6n7P1O0k74J50p2J38j63p4L47l23p8J80J63m9j19K02
$$ -35 -167 5 110 206 11 104 68 11 82 142 -132 18 -54 84 -79 -153 194 -129 -207 -27 136 87 -32 170
4863A70k31J35J54p0k43k17L02P2j78J47p4J1M6J77j46j20O7j51J40k27L65k75
$$ 170 -61 74 228 158 -85 -302 0 72 -106 41 -33 -22 24 201 55 -65 2 -149 -9 -236 129 -146
4885a46L49k90K7n5j39L5J35J00J03j33m6K3K52l22K44J9k89L2R7J25R7l13N0
$$ -146 203 -87 -60 -115 -254 -219 -84 16 119 -14 -60 -37 215 -107 137 156 -133 -101 -4 121 218 -95 -45
4908d5J30l05L58j81o2O0j32L94j27k67L19k01n4Q0J86j59K2L4j6k14L07l83K17
$$ -45 85 -220 138 -43 -105 -45 -177 217 90 -177 142 -59 -113 -33 153 -6 16 50 34 -180 127 -256 -39
4931c9J74J32n34L45P7o1k44K01J06m55K95K8M5j8J15j62L9j86R9L01k25k0J48
$$ -39 135 267 -267 78 155 94 -150 51 157 -298 -3 25 70 52 167 5 44 -142 -43 258 33 13 161
4954A61k60M9M1k26K87K32j28n62J02M66k00jR7k64J44Q6Q5l89R9K46m16K55J19
$$ 161 -99 -50 -9 -235 52 284 156 -406 -304 162 -38 -39 58 -206 -62 24 109 -280 -181 65 -351 -96 23
4977B3p4k38L46M1k27N2J72m09J45L08k62Q0k4N5J76j72L0K20M0k37K18l30j15
$$ 23 -51 -289 57 98 -129 -77 95 -314 -169 139 -123 -43 -67 -12 164 -8 22 242 282 45 263 -67 -182
5000a82R5k2K90l14q8N2M02j60J28j21j84K27j54J27k0j55KK2r8j47L00k4k36
$$ -182 -87 -109 181 -133 -221 -169 233 73 201 80 -104 123 -31 96 76 -79 -77 -55 -153 -300 0 -24 -260
5023b60P7N5J82l3J31R9m78K37K01l93L52m0k23N9K82r6k13q9L53m05J14J61m
$$ -260 -183 -128 54 21 152 251 -227 10 211 -182 170 130 -93 -34 248 152 -61 -150 203 -202 -88 73 69
5046F9k08M10m1k77L6M2R6j19K08k08k91K73M72p42K53j77J66m4K93k38K54j88
$$ 69 -139 271 230 -47 -11 31 127 8 216 8 -283 -10 462 -280 -27 -204 -38 -82 211 -27 227 39
5068C9J48r0l06J76K35l07k59N04l21J09J24j39M2k00N34k57PK12j63n02O41n8
$$ 39 187 97 -209 -33 202 -105 -364 140 -181 -72 52 -87 -45 -245 289 32 39 251 88 -414 227 169
5090A69n32K18O13n32j31R2M69n01J15L77l72j03Q9K79o02N07l1l14m6K34j3j79
$$ 169 -363 -145 468 -64 -195 -103 366 -135 -20 357 -15 -118 -29 250 -352 155 124 -190 -236 -2 -15 -194
5112a94P4N71p76N7L73j01k27K82q0l24L18N89n77j61L97p3m91M43M70l66p54
$$ -194 -120 451 -325 -268 105 4 -223 59 -21 -345 -27 562 -15 -176 221 148 -343 100 570 204 -550
5133e50N20j21k90O20j0k71J61J99l12l49O44qo04m9L96J16j73L46J3o54j22R50
$$ -550 -30 -151 -441 179 169 -102 59 258 -54 -403 241 233 -371 -420 -24 92 -81 265 278 -376 -498 452
5155D52m32J2L16m6p23L23N13l83k41N44l72m38N43L66l77k40M01l22k57N71K01
$$ 452 20 32 348 302 -421 -98 415 32 -209 335 -37 -475 68 434 57 -183 218 -104 -361 210 411
5176D11n22OL28o18l42J121O2p24J04M19j60k91P05o5p61K04L83n37K16O43l01
$$ 411 -111 -105 223 -395 -737 384 446 -278 -174 245 85 -206 499 434 -327 -123 260 -277 -61 582 281
5197B81q98O90J84k83L70J35k75p75O39N59q31K42N25n39p86J039lo65M36N07
$$ 281 -617 73 257 -26 344 479 204 -571 68 627 -204 38 563 24 -762 277 274 -391 45 552
5217E52p66m01R53r3o24N96j34l46j36P82j21n54M21q7n81P6R70k85l79P8J11
$$ 552 -214 -615 338 245 -379 217 83 -263 -399 383 262 -292 129 42 -539 -463 507 222 -157 -79 32
$$ [...]
8191d6
##END NTUPLES=NMR FID
##END=
