##TITLE=1H_Pr TUr-7
 200.13MHz, CDCl3,
 8 sc
 
 8.9.2025
##JCAMPDX= 6.0         $$ Bruker NMR JCAMP-DX V2.0
##DATA TYPE= NMR FID
##DATA CLASS= NTUPLES
##ORIGIN= UXNMR, Bruker Analytische Messtechnik GmbH
##OWNER= pz
$$ XWIN-NMR		Version 3.5
$$ Mon Sep  8 16:14:07 2025 Russian Standard Time (UT+4h)  she@DPX200
##.OBSERVE FREQUENCY= 200.1313
##.OBSERVE NUCLEUS= ^1H
##.DELAY= (6, 6)
##.ACQUISITION MODE= SIMULTANEOUS
##.ACQUISITION SCHEME= undefined
##.AVERAGES= 8
##.DIGITISER RES= 18
##SPECTROMETER/DATA SYSTEM= spect
##.PULSE SEQUENCE= zg30
##.SOLVENT NAME= CDCl3
##.SHIFT REFERENCE= (INTERNAL, CDCl3, 0, 14.3821)
##AUDIT TRAIL= $$ (NUMBER, WHEN, WHO, WHERE, WHAT)
$$ ##TITLE= Audit trail, XWIN-NMR		Version 3.5
$$ ##JCAMPDX= 5.01
$$ ##ORIGIN= Bruker BioSpin GmbH
$$ ##OWNER= she
$$ F:/spectra/data/she/nmr/H-C/1/audita.txt
$$ ##AUDIT TRAIL=  $$ (NUMBER, WHEN, WHO, WHERE, WHAT)
(   1,<2025-09-08 16:12:47.96 +0400>,<she>,<DPX200>,
      <created by zg, POWCHK disabled, PULCHK disabled
       configuration hash MD5:
       00 E9 B6 7A A2 85 ED C7 34 08 36 98 17 FE 4E 26
       data hash MD5: 16K
       C2 EC BA 30 51 B6 D2 AD 9D 86 BA 17 7C 9F 00 10>)
$$ ##END=
$$ 
$$ hash MD5
$$ 78 77 1B C3 87 C1 51 09 C3 5A C7 B9 21 98 5A 2A
##$RELAX= 
##$RELAX= 
##$RELAX= 
##$RELAX= 
##$RELAX= 
##$RELAX= 
$$ Bruker specific parameters
$$ --------------------------
##$DU= <F:/spectra>
##$EXPNO= 1
##$NAME= <H-C>
##$PROCNO= 1
##$TYPE= <nmr>
##$USER= <she>
##$AMP= (0..31)
100 100 100 100 100 100 100 100 100 100 100 100 100 100 100 100 100 100 
100 100 100 100 100 100 100 100 100 100 100 100 100 100 
##$AQSEQ= 0
##$AQ_mod= 1
##$AUNM= <au_zg>
##$AUTOPOS= <>
##$BF1= 200.13
##$BF2= 200.13
##$BF3= 200.13
##$BF4= 200.13
##$BF5= 200.13
##$BF6= 200.13
##$BF7= 200.13
##$BF8= 200.13
##$BYTORDA= 1
##$CFDGTYP= 0
##$CFRGTYP= 5
##$CHEMSTR= <none>
##$CNST= (0..31)
1 1 145 1 1 1 1 1 1 1 1 1 1 1 1 1 1 1 1 1 1 1 1 1 1 1 1 1 1 1 1 1 
##$CPDPRG= <>
##$CPDPRG1= <>
##$CPDPRG2= <>
##$CPDPRG3= <>
##$CPDPRG4= <mlev>
##$CPDPRG5= <mlev>
##$CPDPRG6= <mlev>
##$CPDPRG7= <mlev>
##$CPDPRG8= <mlev>
##$CPDPRGB= <>
##$CPDPRGT= <>
##$D= (0..31)
0 0.7 0 0 0 0 0 0 0 0 0 0.03 0 0 0 0 0 0 0 0 0 0 0 0 0 0 0 0 0 0 0 0 
##$DATE= 1757333567
##$DBL= (0..7)
120 120 120 120 120 120 120 120 
##$DBP= (0..7)
150 150 150 150 150 150 150 150 
##$DBP07= 0
##$DBPNAM0= <>
##$DBPNAM1= <>
##$DBPNAM2= <>
##$DBPNAM3= <>
##$DBPNAM4= <>
##$DBPNAM5= <>
##$DBPNAM6= <>
##$DBPNAM7= <>
##$DBPOAL= (0..7)
0.5 0.5 0.5 0.5 0.5 0.5 0.5 0.5 
##$DBPOFFS= (0..7)
0 0 0 0 0 0 0 0 
##$DE= 6
##$DECBNUC= <off>
##$DECIM= 32
##$DECNUC= <off>
##$DECSTAT= 4
##$DIGMOD= 1
##$DIGTYP= 9
##$DL= (0..7)
0 120 120 120 120 120 120 120 
##$DP= (0..7)
150 150 150 150 150 150 150 150 
##$DP07= 0
##$DPNAME0= <>
##$DPNAME1= <>
##$DPNAME2= <>
##$DPNAME3= <>
##$DPNAME4= <>
##$DPNAME5= <>
##$DPNAME6= <>
##$DPNAME7= <>
##$DPOAL= (0..7)
0.5 0.5 0.5 0.5 0.5 0.5 0.5 0.5 
##$DPOFFS= (0..7)
0 0 0 0 0 0 0 0 
##$DQDMODE= 0
##$DR= 18
##$DS= 0
##$DSLIST= <SSSSSSSSSSSSSSS>
$$ [...]
##$SUBNAM0= <"">
##$SUBNAM1= <"">
##$SUBNAM2= <"">
##$SUBNAM3= <"">
##$SUBNAM4= <"">
##$SUBNAM5= <"">
##$SUBNAM6= <"">
##$SUBNAM7= <"">
##$SUBNAM8= <"">
##$SUBNAM9= <"">
##$SW= 18.0517328524113
##$SWIBOX= (0..15)
0 0 2 0 0 0 0 0 0 0 0 0 0 0 0 0 
##$SW_h= 3612.71676300578
##$TD= 16384
##$TD0= 1
##$TE= 0
##$TE2= 300
##$TE3= 300
##$TEG= 300
##$TL= (0..7)
0 120 120 120 120 120 120 120 
##$TP= (0..7)
150 150 150 150 150 150 150 150 
##$TP07= 0
##$TPNAME0= <>
##$TPNAME1= <>
##$TPNAME2= <>
##$TPNAME3= <>
##$TPNAME4= <>
##$TPNAME5= <>
##$TPNAME6= <>
##$TPNAME7= <>
##$TPOAL= (0..7)
0.5 0.5 0.5 0.5 0.5 0.5 0.5 0.5 
##$TPOFFS= (0..7)
0 0 0 0 0 0 0 0 
##$TUNHIN= 0
##$TUNHOUT= 0
##$TUNXOUT= 0
##$USERA1= <user>
##$USERA2= <user>
##$USERA3= <user>
##$USERA4= <user>
##$USERA5= <user>
##$V9= 5
##$VALIST= <valist>
##$VCLIST= <CCCCCCCCCCCCCCC>
##$VD= 0
##$VDLIST= <DDDDDDDDDDDDDDD>
##$VPLIST= <PPPPPPPPPPPPPPP>
##$VTLIST= <TTTTTTTTTTTTTTT>
##$WBST= 1024
##$WBSW= 4
##$XGAIN= (0..3)
0 0 0 0 
##$XL= 0
##$YL= 0
##$YMAX_a= 258499
##$YMIN_a= -309974
##$ZGOPTNS= <>
##$ZL1= 120
##$ZL2= 120
##$ZL3= 120
##$ZL4= 120
##$ABSF1= 10
##$ABSF2= 0
##$ABSG= 5
##$ABSL= 3
##$ALPHA= 0
##$AQORDER= 0
##$ASSFAC= 0
##$ASSFACI= 0
##$ASSFACX= 0
##$ASSWID= 0
##$AUNMP= <proc_1d>
##$AZFE= 0.1
##$AZFW= 0.1
##$BCFW= 1
##$BC_mod= 2
##$BYTORDP= 1
##$COROFFS= 0
##$CY= -3
##$DATMOD= 1
##$DC= 2
##$DFILT= <>
##$DTYPP= 0
##$F1P= 0
##$F2P= 0
##$FCOR= 0.5
##$FTSIZE= 0
##$FT_mod= 4
##$GAMMA= 1
##$GB= 0.15
##$INTBC= 1
##$INTSCL= 1
##$ISEN= 128
##$LB= 0.25
##$LEV0= 0
##$LPBIN= 0
##$MAXI= 10000
##$MC2= 0
##$MEAN= 0
##$ME_mod= 0
##$MI= 1.114404
##$NCOEF= 0
##$NC_proc= 0
##$NLEV= 6
##$NOISF1= 3.799351
##$NOISF2= 2.8
##$NSP= 1
##$NTH_PI= 0
##$NZP= 0
##$OFFSET= 14.38212
##$PC= 1
##$PHC0= -1559.061
##$PHC1= 11.99228
##$PH_mod= 1
##$PKNL= yes
##$PPARMOD= 0
##$PSCAL= 0
##$PSIGN= 0
##$REVERSE= no
##$SF= 200.129724274929
##$SI= 16384
##$SIGF1= 3
##$SIGF2= 2
##$SINO= 400
##$SIOLD= 16384
##$SREGLST= <1H.CDCl3>
##$SSB= 0
##$STSI= 0
##$STSR= 0
##$SW_p= 3205.1282051282
##$SYMM= 0
##$S_DEV= 0
##$TDeff= 0
##$TDoff= 0
##$TI= <>
##$TILT= no
##$TM1= 0
##$TM2= 0
##$TOPLEV= 0
##$USERP1= <user>
##$USERP2= <user>
##$USERP3= <user>
##$USERP4= <user>
##$USERP5= <user>
##$WDW= 1
##$XDIM= 8192
##$YMAX_p= 0
##$YMIN_p= 0
$$ End of Bruker specific parameters
$$ ---------------------------------
##NTUPLES= NMR FID
##VAR_NAME=  TIME,          FID/REAL,        FID/IMAG
##SYMBOL=    X,             R,               I
##VAR_TYPE=  INDEPENDENT,   DEPENDENT,       DEPENDENT
##VAR_FORM=  AFFN,          ASDF,            ASDF
##VAR_DIM=   8192,          8192,            8192
##UNITS=     SECONDS,       ARBITRARY UNITS, ARBITRARY UNITS
##FACTOR=    0.0002768,     1,               1
##FIRST=     0,             0,               0
##LAST=      2.2672688,     0,               0
##MIN=       0,             -309974,         0
##MAX=       2.2672688,     258499,          0
$$ Real data points
##PAGE= N=1
##DATA TABLE= (X++(R..R)), XYDATA
0@%%%%%%%%%%%%%%Qj6J6j6J6k2L0l2L8m6N2o0P0q2R3j06J22j39J58j79K03k27
$$ 0 0 0 0 0 0 0 0 0 0 0 0 0 0 0 8 -8 8 -8 8 -14 16 -16 22 -24 28 -32 38 -44 49 -57 65 -74 84 -95 108 -119
36a19K54k85L19l56L93m36M84n36N93o54P22p96Q77r67J065j173J293j428J580
$$ -119 135 -150 169 -187 206 -230 254 -282 311 -343 379 -417 460 -507 558 -615 678 -750 830
55H30j751J945k169K432k742L116l579M168m945O020p609J0189j5066K7383j17512
$$ 830 -921 1024 -1145 1287 -1455 1661 -1918 2250 -2695 3325 -4284 5905 -9161 18222 -99290
70i9290k10684K77386K11646j18473j40862Q5643O4079r0524m0261Q9130j2061
$$ -99290 -309974 -32588 179058 60585 -80277 5366 69445 -21079 -61340 27790 15729
81A5729o9304O3425Q6115q4874j20097N6100J41845l5854j32902K4845J11775
$$ 15729 -53575 9850 95965 11091 -109006 -52906 88939 53085 -79817 -54972 56803
92E6803j984p2905k4430K9345J5302O121L4476n436p2424j7307N4687L0895j6616
$$ 56803 54819 -18086 -42516 -13171 2131 8252 42728 37292 -35132 -52439 2248 33143 16527
105A6527k2997L075Q339j6816K99J0365j5650R346M2008j119n2155l4693M0121
$$ 16527 -6470 -3395 4944 -11872 -11573 -1208 -16858 -7512 34496 33377 -18778 -53471 -13350
118a3350O0825k4403n1480J8824L6302r802l0174p101J8039L038M741K7078k2468
$$ -13350 47475 23072 -28408 -9584 26718 16916 -13258 -20359 -2320 718 5459 32537 10069
131A0069n7278J5771N9040m79m9979p801N5917J3140n8008j5128L7859J0968n692
$$ 10069 -47209 -31438 27602 27123 -22856 -30657 25260 38400 -19608 -34736 3123 14091 8399
144H399M711L46k1494k0110K5929K7820k6432j4803K6848L783k8136j4451K1171
$$ 8399 13110 13456 -8038 -28148 -2219 25601 -831 -15634 11214 14997 -13139 -27590 -6419
157f419K5347j3274j3442J4761n044j6838J0022J6838J264j5371o049J9010L32
$$ -6419 18928 5654 -7788 6973 1929 -14909 -4887 11951 13215 -2156 -8205 10805 11137
170A1137k1875K58J0644M406K175p579k693q0p422O808R246l816K256j13n365
$$ 11137 -10738 -10480 164 4570 6745 -834 -3527 -3607 -11029 -4221 5025 1209 3465 3352 -2013
185b013l0m350M021J5167k790q764k813n276M595M586l004L309j670k731L762
$$ -2013 -2043 -6393 -2372 12795 10005 1241 -1572 -6848 -2253 2333 -671 2638 968 -1763 1999
200A999j0265n024J6264O620o332p563R4J0774m348j2493J1202J1386n947n870
$$ 1999 -8266 -13290 2974 9594 3262 -4301 -4207 6567 2219 -10274 928 12314 6367 497
214D97m103K185J920o959P089R028j1279n907M709L250j838q068O353J8006p181
$$ 497 -3606 -1421 499 -6460 629 9657 -1622 -7529 -2820 430 -1408 -9476 -3123 14883 7702
229G702j5722K220N505M780j765k814Q739k330j1764J161J434L56N014J1J591
$$ 7702 -8020 -5800 -295 4485 2720 -94 8645 6315 -5449 -4288 -2854 -2498 2516 2527 4118
244D118k852j2502J610R852K704K687l613m854M998j679l072K637R30N739J455
$$ 4118 1266 -11236 -9626 226 2930 5617 2004 -2850 2148 469 -2603 34 964 6703 8158
259H158j1073j355L824j964K014J46m61L942m493k552K612n265K644Q441J177
$$ 8158 -2915 -4270 -446 -2410 -396 -250 -711 3231 -1262 -3814 -1202 -6467 -3823 4618 5795
274E795J260o218q997N599N913P24P20l919J846j46j0931K33J0836J582k352m074
$$ 5795 7055 837 -8160 -2561 3352 4076 4796 877 2723 2577 -8354 -8121 2715 4297 1945 -2129
290b129j805M189m447q97R610m44n074J199J122L078m481o912Q719N633m746k217
$$ -2129 -3934 255 -4192 -5089 4521 4077 -997 202 1324 4402 -79 -6991 1728 7361 2615 398
306C98k022J11K87n312L891Q446l352l448j653k544L125O86J981P700m074p599
$$ 398 -1624 -1513 -1226 -6538 -2647 5799 2447 -1001 -2654 -5198 -2073 -1387 594 8294 4220 -3379
322c379P47J103L988J202l575K666o93n557J832M7p46L654j521j992K611j426
$$ -3379 -2632 -1529 2459 3661 86 2752 2059 -3498 -1666 -1619 -2365 1289 -232 -2224 387 -1039
338a039J276j068l314N959K716l755K160o48l494j237n38O398M613q411l950K350
$$ -1039 237 -831 -4145 1814 4530 775 2935 2287 -1207 -2444 -2982 3416 8029 -382 -4332 -1982
354a982q50J120K27K136M601o453n476N786K211n5m00m18L201j922n631N083K962
$$ -1982 -2832 -1712 -1485 651 5252 -1201 -6677 -891 1320 1265 865 447 3648 1726 -3905 1178 4140
371D140m267j256m5L067K132o785j514L838q48J287J043k12J527m328k034N722
$$ 4140 -127 -1383 -1428 1639 3771 -3014 -4528 -690 -1538 -251 792 580 2107 -2221 -4255 1467
387A467Q61o84J520l011r5M9l066L634K870k462r56l343K12M610k177j844K655
$$ 1467 2328 1644 3164 153 58 107 -2959 675 3545 1083 127 -3216 -3004 1606 -571 -2415 240
404B40r23J038l83k354L705J72k322K523K62o61L05l368J460K675l953L20L152
$$ 240 -683 355 -28 -2382 1323 1495 -827 1696 1958 1297 1602 -1766 -306 2369 -1584 -1264 1888
421A888q56j730l946N31O660q91k900J251p67J037j91j588L918J312m052K87R46
$$ 1888 1032 -698 -4644 -4113 2547 1656 -1244 7 -760 277 86 -1502 2416 3728 -324 -37 909
438I09o28J01k500K647L258o011j491L245J098r9l163n19N743n81l412J063M19
$$ 909 281 382 -2118 529 3787 -2224 -3715 -470 628 529 -2634 -3153 2590 2009 -1403 -340 79
455G9J023M2j577K822O69n121N85K496m17l31k162J699K615m520k130L614J383
$$ 79 1102 1144 -433 2389 3058 -2063 -1478 1018 601 270 -1892 -193 2422 -2098 -4228 -614 769
472G69Q79j928k601M097J67k066J675M25l43j73j698J956P19m224J167K380p04
$$ 769 1648 -280 -2881 1216 1383 -683 992 1417 1074 901 -797 1159 1878 -2346 -1179 1201 497
489D97l78k445j15L833j202k608J630Q32J924q98l141K628J557k304J378j37p44
$$ 497 119 -2326 -2441 1392 190 -2418 -788 44 1968 1070 -2071 557 2114 -190 1188 1051 307
506C07J3j973J716K210l546o79J732J73M95k858l49M532m2l030P78L65J367L26
$$ 307 320 -1653 63 2273 -1273 -1952 -220 -47 448 -2410 -2759 1773 1731 -1299 -521 -156 1211 1537
524A537k402K256R19k935R55K78r46L25j443R22K429l071j447J870R76J079k052
$$ 1537 -865 1391 2310 -625 330 608 -338 -13 -1456 -534 1895 -1176 -2623 -753 223 1302 -750
541g50j664L753L67k044O85l39J085Q20k390Q81J000k243N7O16j80R21k232k6
$$ -750 -2414 1339 1706 -338 347 8 1093 1913 -477 404 1404 -839 -782 -166 -346 575 -1657 -1683
559a683L026k001j621J888R17J206j293k353K531J174j350O80r55J39R07k106
$$ -1683 1343 -658 -2279 -391 526 1732 439 -1914 617 1791 441 1121 166 305 1212 -894
575h94J9J859j304l51J11n19J670j305j544K944L81j750P5J02K890n86l881J784
$$ -894 -875 984 -320 -671 -560 -1079 591 -714 -2258 686 1067 -683 -608 -506 2384 1798 -2083 -299
593b99K840j333j340p34J079Q03l051K96L409j556j407J44L40J556j268j013L592
$$ -299 2541 1208 -132 -866 213 1016 -2035 -1739 1670 114 -1293 -1149 -809 747 -521 -1534 2058
610B058m09k768N49R72J464k05l015J283K082k119l31l83J18J179j572k08K165
$$ 2058 1649 -1119 -570 402 1866 1661 -1354 -71 2011 -108 -439 -822 -704 475 -1097 -1305 860
627H60j269q32R00n18J462j1j131J803r8j723O64o0Q54J088k682l90J039n27O71
$$ 860 -409 -1241 -341 -859 603 592 -539 1264 1166 -557 107 47 901 1989 -693 -1083 -44 -571 100
646A00o09p55J760m35j935J565Q94m98O4r80J889M47k282J223P35j030l07m80
$$ 100 -509 -1264 496 61 -1874 -309 585 87 151 -829 1060 1507 -775 448 1183 153 -154 -634
664f34R55J502k868p88K045j55j45p04O8J605q40k046K057P25O0r9j029J289L47
$$ -634 321 1823 -1045 -1833 212 57 -88 -792 -724 881 41 -2005 52 777 837 738 -291 998 1345
683A345k160J042J442j588k46q53N21J771k049r68K040j00n61m2j53J415m16j654
$$ 1345 -815 227 1669 81 -165 -1018 -497 1274 -775 -1743 297 197 -364 -406 -559 856 440 -1214
701a214J776O33m40n7j207P59J121k074K80J213q72k60p70K25J585p33j750J684
$$ -1214 562 1195 755 698 -509 250 1371 -703 -423 790 -82 -342 -1112 -887 698 -35 -1785 -101
719a01K46k91J0p18J678M81j630O19J53K53J34j292J74J146j270p16J269l99K25
$$ -101 145 -146 -136 -854 824 1305 -325 294 447 700 834 -458 -284 862 -408 -1124 145 -254 -29
738b9p59o78K587j17k251J197M66K25k24j199J572J034k395P4R15j43K12j336
$$ -29 -788 -1466 1121 1004 -1247 -50 416 641 417 -782 790 1824 -571 -497 418 275 487 -849
756h49J34J388j583o01J750l54l11l18k88J955K2j658Q26N30N7R3j217P27J105
$$ -849 -715 673 -910 -1511 239 -115 -426 -744 -1032 923 945 -713 113 643 700 793 -424 303 1408
775A408j940J28O52k97K12r21m30J763p96q51R42J06J95k00q25J666P30j864N54
$$ 1408 -532 -404 248 -49 163 -758 -1188 575 -221 -1072 -130 -24 171 -29 -854 812 1542 -322 232
794B32P4l2M55j127K9J454j155n14J97k70P64m06j028J697J01j115L98J15Q29
$$ 232 306 274 729 -398 -369 1085 -70 -584 -387 -657 107 -299 -1327 370 471 -644 -246 -131 698
813F98k40j258J308J213j821j31N13J88K95j606k16J663r36p07O73J0P46n82q51
$$ 698 458 -800 508 1721 -100 -231 282 470 765 -841 -1057 606 -330 -1037 -364 -354 392 -190 -1041
832a041J514J88j128K45N21M15M71j868M78J604j574k96K16K75N51j133p83J688
$$ -1041 473 661 -467 -222 299 714 1185 -683 -205 1399 -175 -471 -255 20 571 -562 -1345 343
850C43l74j066R78J80M56o14j016J775J06j009N86MM7M66j400L65J017p99n85
$$ 343 -31 -1097 -119 61 517 -97 -1113 662 768 -241 345 349 396 862 -538 -173 844 45 -540
869e40J20o0P40p77q72J400K67n37M51j59N20Mj183J030Q32j452N60o68R8Q82
$$ -540 -420 -480 260 -517 -1389 11 278 -259 192 33 553 557 -626 404 1236 -216 344 -324 -226 656
889F56j002l67Q99j50p42P5J6P90J31j148J047J85q46P84n13Q96M83j675J80J477
$$ 656 -346 -713 186 36 -706 -631 -615 175 306 -842 205 390 -456 328 -185 711 1194 -481 -301 1176
909A176j069n61L44l3Q17j249m58J427j90q39J27R6R56q7j021R39K85o92J61j96
$$ 1176 107 -454 -110 -143 674 -575 -1033 394 204 -635 -508 -412 544 457 -564 375 660 -32 129 -67
929f7M92N09j713L89R18l76m71j50n0P62n62p62J268q3l59L32k63J83N25r67N89
$$ -67 425 934 -779 -390 528 152 -319 -469 -519 243 -319 -1081 187 104 -255 77 -186 -3 522 -445 144
950A44M99n65M06m72l2R57j049p20O87L85k48l81m16J022N3j213Q55M97j56Pn26
$$ 144 643 78 484 12 -20 937 -112 -832 -145 240 -8 -389 -805 217 270 -943 -88 409 253 260 -266
971b66Q35M85j563L97J018m67l84o20K09J474j316q78P43K84J03l87k15Q29L04
$$ -266 569 1054 -509 -112 906 439 55 -565 -356 1118 -198 -1076 -333 -49 54 -333 -548 281 585
990E85r76M66P20m33k36l28O12M13j048l04Q91l18k24j41N8P27o84l12O18j65
$$ 585 -391 75 795 362 126 -202 410 823 -225 -529 362 44 -180 -321 -263 464 -220 -532 86 -79
1010g9P8o9k02O97L25j128J72O62k35rl51J47N59p87l55Q27o14L45l83l24J058
$$ -79 -1 -70 -272 425 750 -378 -206 456 221 212 -139 8 567 -220 -575 252 -362 -17 -400 -724 334
1031C34k03p42L42M60QQ9j96j30Q47j027J96K99k73L90n75q2Q32p58l65N37O9
$$ 334 131 -611 -269 191 199 288 92 -38 809 -218 -22 277 4 394 -181 -263 569 -189 -554 -17 52
1052E2l5j60p80J055L19q45N22L7L68m20l36K96O07q09j24K93n3K8k95jQ81l77
$$ 52 17 -143 -923 132 451 -394 128 165 533 113 -223 73 680 -129 -253 40 -13 15 -280 -281 600 223
1074B23o44L44j21J58K1l22N00P07j199L46n2J23L23p33J68N35o14k32K92n9L23
$$ 223 -421 -77 -198 -40 -19 -341 159 866 -333 13 -39 84 407 -326 -158 377 -237 -469 -177 -236 87
1095H7l32j29N05j92m80N30J4q3K43l73L65L34k32l29K71j43K21o19J60P86o36
$$ 87 -245 -374 131 -61 -541 -11 3 -80 163 -210 155 489 257 -72 199 56 277 -342 -182 604 -32
1116c2j54k10L32K56j30p98O06M70m86R6q4J16O22p48j07J005p83j33K21q0L34
$$ -32 -186 -396 -64 192 62 -736 -130 340 -146 -50 -134 -18 604 -144 -251 754 -29 -162 59 -21 313
1137C13n42l34P05J02q59K74M81j78k06n16R95L29p71K8M32k88M56q11L39O24
$$ 313 -229 -563 142 244 -615 -341 140 -38 -244 -760 235 564 -207 -179 253 -35 421 -390 -51 573
1157E73o44q8q5K84L02n38j90O09q1n03L32J7J6K62n98L89K67j07k28K46M1J48
$$ 573 -71 -159 -244 40 342 -196 -386 223 142 -361 -29 -12 4 266 -332 57 324 217 -11 235 276 424
1179D24o71j10N97j04o12J92j33O20k32o57M44M15k89J18l8K32K39o21J29M58
$$ 424 -247 -357 240 136 -476 -284 -417 203 -29 -686 -242 173 -116 2 -36 196 435 -186 -57 401
1199D01k25l08K46j95P12o65m24P05j74l15J0Q5K86l5n53N02Q4k52J42j40L26
$$ 401 176 -132 114 -81 631 -34 -458 247 73 -242 -232 -147 139 104 -449 53 137 -115 27 -113 213
1220B13N34j008r2P81m38r0j51L24p3o2j10K42J43l73j44j71M88K54m70L19K48
$$ 213 747 -261 -353 428 -10 -100 -251 73 0 -62 -172 70 213 -160 -304 -475 13 267 -203 116 364
1241C64m28N8j02K02L38n19j02K40r7K17k13L5J43m30k0J58L6J8J10l67M51M29
$$ 364 -64 -6 -108 94 432 -87 -189 51 -46 171 -42 -7 136 -294 -314 -156 -120 -102 8 -359 92 521
1263E21o71L23J0k4k1l83R8L14l12k83L70r9M9k39l16J002j67n09K24K90J3j02
$$ 521 -150 173 183 159 138 -245 -147 167 -145 -428 -58 -157 -108 -347 -663 339 172 -337 -113 177 190 88
1285H8l45N70o0n72K51L39L6j42j31p4L87n86k71N78j28N7l46J36M77j12m38R9
$$ 88 -257 313 253 -319 -68 271 307 165 34 -40 347 -239 -510 68 -60 -3 -349 -213 264 152 -286 -187
1307a87N94l25n8k51K86L08n86NM51k4j03l15j00M35j16l97K7L67K8k1j80K22
$$ -187 407 82 24 -227 59 367 -219 -214 237 213 110 -205 -305 130 14 -383 -356 11 39 18 -162 60
1329F0J44j88O1M7j7R6k72l32R83n89j82P2K59o8n4m90L88K47p26N29J13K31k83
$$ 60 204 16 77 124 107 203 -69 -401 582 -7 -189 -117 142 74 20 -470 -82 165 -561 -32 81 312 29
1352B9ooM51n73O3J28J8j16k10j07N54n05j06J68J47L2n25J73N97o2j63K1O4r1
$$ 29 23 17 468 -105 -42 86 104 -12 -222 -329 225 -280 -386 -218 -71 -39 -564 -391 206 144 -19 2 66 -25
1376b5J30k24L59K21o70m6J33K49J65m65k69O31j92j03J6J73P9j60k57M39K63
$$ -25 105 -119 240 461 -209 -255 -122 127 292 -173 -442 189 -3 -106 -90 83 162 2 -255 184 447
1397D47k65k71L89o6j02j85j56P52m05l08J76J19k21K07n34L89K3l26L57%K67
$$ 447 182 -89 300 234 132 -53 -209 543 138 -170 6 125 -96 111 -423 -34 -11 -337 20 20 287
1418B87o4l48K78N11n16j5k47K48J42n30k17P05k13k02r4K55R6j26m63L64L79
$$ 287 223 -125 153 664 148 133 -114 134 276 -254 -471 234 21 -181 -275 -20 76 -50 -513 -149 230
1439B30l91m6O27l14J65k61k07O04l73k39K28j58M37l59j41M99l02m23K07J69
$$ 230 -161 -207 420 106 271 10 -197 407 34 -205 23 -135 302 -57 -198 301 -1 -424 -217 -48
1459d8J37R6o63N26M04m36j48K22O2J90n27m7J85M01l97m4M7m9j1k42M82j63l0
$$ -48 89 185 -478 48 452 16 -132 90 152 342 -185 -232 -47 354 -43 -87 -40 -89 -100 -342 140 -23 -53
1482e3j27K71o4Q9k37O6N1K52n35L12R5J82k29j5l9N5l46R4k31O08m00r6L97k33
$$ -53 -180 91 27 116 -121 -55 -4 248 -287 25 120 302 73 58 19 74 -272 -178 -409 199 -201 -297 100 -133
1506a33j19M8J68L31J1o69N49Q1o0l18l22K53N31l02m01O46j27k40o3R6K31p3
$$ -133 -252 -204 -36 295 306 -363 186 267 207 -111 -433 -180 351 49 -352 294 167 -73 -136 -40 191 118
1528A18l37J79L46n40M23r1J55R9m00k84N43m65L93j18j76K24ql40L09K5m07J53
$$ 118 -219 -40 306 -234 189 98 253 352 -48 -332 211 -254 139 21 -155 69 61 -279 30 55 -352 -199
1550a99J28O2N1l52L37M27k96k05k3P0L52r1m38K53l14J24K8j2L36k53j90o5O47
$$ -199 -71 -9 42 -310 27 454 158 -47 -70 0 352 261 -177 76 -238 -114 -86 -98 238 -15 -205 -270 377
1573C77n99J40p3L82K47o05m1M22j06O9j87l48L26j90j14K26K23l55Q4M2J22k1
$$ 377 -222 -82 -155 227 474 -131 -172 250 144 213 26 -322 4 -186 -300 -74 149 -206 -122 -80 42 21
1595B1k63L98N6r9Mp6KL67n26J29J33J00k17n08M30j35m0j31N6J92j37K47o3K59
$$ 21 -242 156 212 113 117 41 43 410 -116 13 146 246 29 -479 -49 -184 -224 -355 -299 -107 -244 3 -60 199
1619A99R8m85J91K07j15n0j3J92j70Lm49K52j1J02Q3j17j37J95q2K34j32kJ17
$$ 199 297 -188 3 210 95 45 32 224 54 57 -392 -140 -151 -49 34 -83 -220 -25 -107 127 -5 -7 110
1642A10j06n6M60m30NM12k81K50l94r2K85j32j62J67K08P2j71l67O8N26o47oN19
$$ 110 4 -52 408 -22 -17 395 114 364 -30 -122 163 31 -131 36 244 316 145 -222 -154 372 -275 -281 238
1665B38j27K2l45J55M39k66Q7Lp1L19p44K26L20k22m77M34J43j30k31j87M32P0
$$ 238 111 133 -212 -57 382 116 203 206 135 454 -290 -64 256 34 -443 -9 134 4 -227 -414 18 88
1687H8l16M37j27j07L51m68J65J61r2n6j99K07J13m15J48J97j31n06N44Q2P6p6
$$ 88 -228 209 82 -25 326 -142 23 184 92 36 -163 44 157 -258 -110 87 -44 -550 -6 76 152 76
1709G6k66K83J28k31r7M09k74k6l23L70k3J52m86K40J69O8j13l64J93M7j07K13
$$ 76 -190 93 221 -10 -107 302 28 2 -321 49 26 178 -308 -68 101 169 56 -308 -115 -68 -175 38
1731C8q5J63q9N2j0J11j49O0j05L75l13K5k01K55j30J10j64Q6l0J44l36K36K34
$$ 38 -47 116 27 79 69 180 31 91 -14 361 48 73 -128 127 -3 107 -57 29 -1 143 -193 43 277
1754B77m58J87K85j17j53j43J34J28k47J0J92J4k9k36J01J03L0k76L03k81J18
$$ 277 -181 6 291 174 21 -122 12 140 -107 -97 95 109 80 -156 -55 48 78 -198 105 -176 -58
1775e8L97k05q4k79L45o5L21j85R9q7j85K75k85kj37P0r0K08k80K8K53l62K07
$$ -58 339 134 50 -229 116 51 372 187 286 199 14 289 4 2 -135 -65 -155 53 -227 -199 54 -308 -101
1798a01J10K22l78N5O5L95j87k62o3M42o1n80L72K44p9l13%P1K47k2o62Q88k61
$$ -101 9 231 -147 -92 -27 368 181 -81 -144 298 237 -343 29 273 194 -119 -119 -48 199 177 -485 403 142
1821A42k21k5M4R2l7k43K67L31k93k87J52m6M54l35ooJ56l14NK56J14k37q9k5
$$ 142 -79 -104 -60 32 -5 -248 19 350 57 -230 -78 -124 330 -5 -11 -17 139 -175 -170 86 200 -37 -126 -151
1845a51J1jJ13J46qK3l95K78j89J10k1K60l93M37j40m76M05j25J71o0p4J52p0
$$ -151 -140 -141 -28 118 110 133 -262 16 -173 -63 -84 176 -217 220 80 -396 9 -116 55 -5 -79 73 3
1868CJ93j61J23j60R1n8N3k35K33k33J67j35Q2Lk82O18l28j57n1L21l90L44j02
$$ 3 196 35 158 -2 89 31 84 -151 82 -151 16 -119 -37 -34 -316 302 -26 -183 -234 87 -303 41 -61
1891f1K03N6l00j4K40K16m14J36j31L52m97K15J40p9l19J42K05OJ94m48n6M33
$$ -61 142 198 -102 -116 124 340 -74 62 -69 283 -214 1 141 62 -257 -115 90 96 290 -158 -214 219
1913B19k50j52l1L79R2k19J80k65K58k63K05j74j46L6j60M40n8Q8r6l11O58m80
$$ 219 -31 -183 -214 165 257 38 218 -47 211 -52 153 -21 -167 -131 -291 149 91 179 83 -228 430 -50
1935e0k3R6J53p1Qk79P6M13k35k64L42Oj85l5l72J37K62j30K62J06rk26j24J04
$$ -50 -73 23 176 105 113 -166 -90 323 88 -176 166 172 -13 -48 -420 -283 -21 -151 111 217 208 -18 -142 -38
1959c8J96j59k91M90j71J18l66N09l8j59m1m5K7M8k6l61K68N7j88K72q1J86l50
$$ -38 158 -1 -292 198 27 145 -221 288 250 91 50 5 32 80 54 -307 -39 18 -170 102 21 207 -143
1982a43j30L77K27l44m5M28j81r2j1k25R5p7l8K18Q8q8l70J53J78L13l13p4K20
$$ -143 -273 104 331 -13 -58 370 189 97 86 -139 -44 -121 -159 59 147 59 -311 -158 20 333 20 -54 166
2005A66J74o5J10j0j05j21n00M78J74m29J05j59K16j64J23k44J87o4J39k51L44
$$ 166 340 275 385 375 270 149 -351 127 301 -128 -23 -182 34 -130 -7 -251 -64 -128 11 -240 104
2026A04J38l81K90j56J11r1m5K31J44l79k9OL5J25j37k10J07P8L6K49n8k72j11
$$ 104 242 -139 151 -5 106 15 -30 201 345 -34 -63 -57 -22 103 -34 -244 -137 -59 -23 226 168 -104 -215
2049b15N7K36R5J8k11J12j01j3NL8K4j52K8J21M6lq8l9M0L21m28J49j64K82P8
$$ -215 -158 78 173 191 -20 92 -9 -22 -17 21 45 -107 -79 42 88 85 -3 -42 -2 319 -109 40 -124 158 236
2074B36l56J92J27k25j08J83M8o8n0M2J11m72N2M02l14K10K67l79K8J60j96J77
$$ 236 -120 72 199 -26 -134 49 97 29 -21 21 132 -340 -288 114 -200 10 277 -102 -74 86 -110 67
2096F7j22P9K46j89NJ20j91K4j47J53L02k55o04M80%O9j69K22K29k21l03K57M7
$$ 67 -55 24 270 81 86 206 15 39 -108 45 347 92 -512 -32 -32 37 -132 90 319 98 -205 52 99
2119I9j13nJ09k74K50j35j07K71k82j45K85L01k08j1k25K03J94l15J65K75n8j09
$$ 99 -14 -19 90 -184 66 -69 -176 95 -187 -332 -47 254 46 35 -190 13 207 -108 57 332 274 165
2141A65K1l22J50k9J3L4M8L18k69m54L12N1j15j44M18r3j71K5j59J94J44j15j51
$$ 165 186 -136 14 -15 -2 32 80 398 129 -325 -13 38 -77 -221 197 104 -67 -42 -201 -7 137 22 -129
2164a29K35J97l61K84j68L5j2o5k9K09Q1l67l7J26Pl3k03M21j19n08M82L35l95
$$ -129 106 303 -58 226 58 93 81 16 -13 196 277 -90 -127 -1 6 -27 -230 191 72 -436 46 381 -14
2187a4L0J4J62O9l78%J86o2o1J00M1l16J70k99K74K01j48N7k69K56K48k39o9L41
$$ -14 16 30 192 261 -117 -117 69 7 -54 46 87 -229 -59 -358 -84 117 -31 26 -243 13 261 22 -47 294
2211B94l49j33o7M52N7k62j60J59q5J32k03K56j38N4J02j48J76n7M8k57L1m2K33
$$ 294 -55 -188 -255 197 254 -8 -168 -9 -94 38 -165 91 -47 7 109 -39 137 80 128 -129 -98 -140 93
2234I3o7J41k08J91j36j91K56l17NL81j35k5n2l69M87K75k75q3J81K04m88j22
$$ 93 26 167 -41 150 14 -177 79 -238 -233 148 13 -12 -64 -433 54 329 54 -29 152 356 -132 -254
2256b54L18J97m35n2M39j85P7j51l4O9J24k36J39l6j89M95k49j43L84p0j65q6
$$ -254 64 261 -174 -226 213 28 105 -46 -80 -11 113 -123 16 -20 -209 286 37 -106 278 208 43 -43
2278d3J68K9Q6J02l39k56K59PLJ02J34l70J47J08j42kP3J61j80j9j28J56j87K6
$$ -43 125 154 240 342 3 -253 6 13 16 118 252 -118 29 137 -5 -7 66 227 47 28 -100 56 -131 -105
2302a05N7k2J69K2l51J10Q7j10K79m4j65J32l32K98K49j49j00N9j24M06l39j05
$$ -105 -48 -70 99 121 -230 -120 -33 -143 136 92 -73 59 -273 25 274 125 25 84 -40 366 27 -78
2324g8n1L71l81J09j45m5L65l18L75k38O9J03j35P1L9r0m6J39M6j55J48m4K4k
$$ -78 -129 242 -139 -30 -175 -220 145 -173 202 -36 33 136 1 72 111 21 -25 114 160 5 153 109 133 131
2348A31l49P0K81k58M79o75M52l61P8J68L9k83L08k74L16j76o2O3J61l12M51j75
$$ 131 -218 -148 133 -125 354 -321 131 -230 -152 16 55 -228 80 -194 122 -54 -116 -53 108 -204 247 72
2370G2K5j33J16k53K15nNN5m31K54j02O8J80k82K18M8m2l4J70k75R7O0j78R4k77
$$ 72 97 -36 80 -173 42 37 42 97 -334 -80 -182 -114 66 -216 2 50 8 -26 144 -131 -34 26 -152 -58 -335
2395c35M75j19k02q3M07l19M8L77m07K53J06l77K88N8j79K1J12k9p3p0J56q8M02
$$ -335 140 21 -181 -264 143 -176 -128 249 -158 95 201 -176 112 170 -9 12 124 95 22 -48 108 20 422
2418D22n65J62l12K41K2j40L56j72m1j65L86k42K88k71j7K34l16J71J0J68m0m29
$$ 422 -143 19 -293 -52 -30 -170 186 14 -27 -192 194 -48 240 -31 -48 186 -130 41 51 219 179 -250
2440b50K56j00Q7n0J15j51L37j55k61K53K1n6j0L7J32K39k94r5J09k06p2L48l59
$$ -250 6 -94 -7 -57 58 -93 244 89 -172 81 102 46 36 73 205 444 150 55 164 -42 -114 234 -125
2463a25J75j55J74j39J24j25k29K81j02J72l56K31J13j65L19j72M1J10j61q2O0
$$ -125 50 -105 69 -70 54 -71 -300 -19 -121 51 -305 -74 39 -126 193 21 62 172 11 -71 -11
2484a1r1K73kl01L6R7mJ09l14J83j30K99j06K16k56j60J83O0n1P3J04m87M08l84
$$ -11 -102 171 169 -132 -96 1 -3 106 -208 -25 -155 144 38 254 -2 -162 21 81 30 103 207 -280 128 -256
2508b56J71J11j24K56l34NL19j68J4j15K45k16q5OL70k53P3J78l14K57lO6j10
$$ -256 -85 26 -98 158 -176 -171 148 -20 -6 -121 124 -92 -177 -171 199 -54 19 197 -117 140 137 203 93
2531I3o6l33L46l59K98j59N6J31N8Mk9L6jJ49j76Q1j43J30r7Q0j07o3J72nm60
$$ 93 27 -306 40 -319 -21 -180 -124 7 65 69 40 76 75 224 48 129 -14 116 19 99 -8 -71 101 96 -364
2556c64J16r8J45J59J81j88l28M62j53j06j39M52Q7m03K36j31N22m93k0M7q3L65
$$ -364 -248 -346 -201 -42 139 -49 -377 85 -68 -174 -313 139 226 -177 59 -72 450 -43 -63 -16 -99 266
2578B66n6j34o1k64O9p2K50K91m18K54N6j36K9k51J24J39J33k17p3K17n9l13K30
$$ 266 210 76 15 -249 -180 -252 -2 289 -129 125 181 45 74 -177 -53 86 219 2 -71 146 87 -226 4
2601DJ33k30K1j37K5K31rlP5n5o2L1L31j92N2k53J87N5j24j9l86R8J50L14l66
$$ 4 137 -93 -72 -209 -184 47 38 35 110 55 -7 24 355 163 215 -38 149 204 80 61 -325 -227 -77 237 -129
2626a29J91j36K56k64r8q0k1L12J72k14J5k47J43J89J3l61K46PK44k66q0O5J9
$$ -129 62 -74 182 -82 -180 -260 -281 31 203 -11 4 -243 -100 89 102 -259 -13 -6 238 -28 -108 -43 -24
2649b4m8j35J50j48L54j08Q2R7k09K3K00l13L22j71k77J11J18k43N6J08K50j41
$$ -24 -72 -207 -57 -205 149 41 123 220 11 34 234 -79 243 72 -205 -94 24 -219 -163 -55 195 54
2671E4l23K80J01k48K91l81J00K04lk29K81n1k34M43j50l0j91L1J58j76p2o8K16
$$ 54 -269 11 112 -136 155 -226 -126 78 75 -154 127 76 -158 285 135 105 -86 -55 103 -73 -145 -213 3
2694Ck20L82l17QM89j84k08O4k58M74k59J6K36J5m05N1n1K55r4j1J92k81O5k44
$$ 3 -217 165 -152 -144 345 161 -47 17 -241 233 -26 -10 226 241 -164 -113 -164 91 -3 -14 178 -103 -38 -282
2718b82M73m66L52k9j6L4M4k08j9K97o9j26j09L84k03N0j44j57L2K65l47L23j3
$$ -282 191 -275 77 48 32 66 110 -98 -117 180 111 -15 -124 260 57 107 -37 -194 -162 103 -244 79 66
2741F6kl34M42o5L04j48k42L8O9m53J57K98J31k79k78M09k38K31o9K00j04j78
$$ 66 64 -270 172 107 411 263 21 59 128 -325 -168 130 261 -18 -296 113 -125 106 37 237 133 -45
2763d5k2O4K27j79p4o8q2K58m06K93p4K54k89j50K92N1L8Kp8J69j9l2j22j32L32
$$ -45 -67 -3 224 45 -29 -97 -179 79 -327 -34 -108 146 -143 -293 -1 50 88 90 12 181 162 130 8 -124 208
2788B08l7N6j74J99j49k10L6L55j10k69M8J79l62K74j48J43Nm37L73m6J36k7k56
$$ 208 171 227 53 252 103 -107 -71 284 174 -95 -47 132 -230 44 -104 39 44 -393 -20 -66 70 43 -213
2811b13M10J06l69j4J44J42l14J7j37K34j44j6j02L48k92OL82m7o2k2k92J97K77
$$ -213 197 303 -66 -80 64 206 -108 -91 -228 6 -138 -154 -256 92 -200 -194 188 141 79 57 -235 -38 239
2834B39m86K25K97j78k42k7K24N6j81J79k49o0L32k45K5kMq8J84J00J38k28PK78
$$ 239 -247 -22 275 97 -145 -172 52 108 -73 106 -143 -203 129 -116 -91 -93 -89 -177 7 107 245 17 24 302
2858C02m74K31j78m6R8O4o8J49j57J4j8K0r5J19Qo3l20M99k22L5J96J2R6l48M33
$$ 302 -172 59 -119 -165 -67 -3 -71 78 -79 -65 -83 -63 -158 -39 -31 -94 -414 85 -137 -102 94 106 202 -146 287
2883B87j14r6k64K79n0jK04l71L12j02k14J94r3Q0Q3q2J32k13O7l1J96n5r0k5
$$ 287 173 77 -187 92 42 41 245 -126 186 84 -130 64 -29 51 134 52 184 -29 38 7 203 148 58 33
2907C3r1K46K2j25j31k78N57j38l58K34L7J4m9J28K91m42K0J11j00J6J85k7k50
$$ 33 -58 188 210 85 -46 -324 233 95 -263 -29 8 22 -27 101 392 -50 -30 81 -19 -3 182 155 -95
2930i5k73L52M9qq2j35oJ07J96M6j24l1M6q0j5k4J58j53J45M5R8j71J58k56j22
$$ -95 -368 -16 33 25 -57 -192 -198 -91 105 151 27 -4 42 -38 -53 -77 81 -72 73 118 216 45 203 -53 -175
2955a75J70j28K50k42J75J06k47l8L4L5QJ40l92L84j17j1J60L1j76N3L8Ll22K37
$$ -175 -5 -133 117 -125 50 156 -91 -129 -95 -60 -52 88 -304 80 -37 -48 112 143 -33 20 58 61 -261 -24
2979b4j39J32j62J03J23j29J75k8k00M32j74j74p5J31o7Jj45N33l05J07j22K48
$$ -24 -163 -31 -193 -90 33 -96 79 51 -149 283 109 -65 -140 -9 -76 -75 -220 313 8 115 -7 241
3001B41k89L56m20J41O1k40K38j70Q9j04N4kK03l13J81M1jK38l37J22M2r5j76
$$ 241 -48 308 -112 29 90 -150 88 -82 7 -97 -43 -45 158 -155 26 67 66 304 -33 89 131 36 -140
3024a40L02k21%M05q4n15K11j30O7P4K47j50k72K57j60o8K43j31J80q5k08K86
$$ -140 162 -59 -59 346 262 -253 -42 -172 -105 -31 216 66 -206 51 -109 -177 66 -65 115 30 -178 108
3046A08n7L8l87J93j76R4K31p2K4K20N8l90J75p4J80n2k48J07KJ4M4k75K62j76
$$ 108 51 89 -298 -105 -281 -187 44 -28 -4 216 274 -116 59 -15 165 113 -135 -28 -26 -12 32 -243 19 -157
3070a57R5j55Q7K04k76K00r6LK39l23J81N7j08K13j90J8J6m1j31L27k82O9O8J10
$$ -157 -62 -217 -130 74 -202 -2 -98 -95 144 -179 2 59 -49 164 -26 -8 8 -33 -164 163 -119 -50 18 128
3094A28j74n9Q9kj46K19K8k09J99j24l40M52o8M4p1L9k3O1j12j48K93p4Mj91L68
$$ 128 -46 -105 -16 -18 -164 55 83 -126 73 -51 -391 61 -7 37 -34 5 -18 43 -69 -217 76 2 6 -185 183
3119A83k47K12k93J76Q7l34K36j05K40j72j11L09J3p1P4k99J45j30J72k52K77
$$ 183 -64 148 -145 31 118 -216 20 -85 155 -17 -128 181 194 123 197 -102 43 -87 85 -167 110
3140A10nk72j45M17j49J78q4J18J34l09j06k90L91k32M9J33J42k09J23k73L75
$$ 110 105 -167 -312 105 -44 134 50 168 302 -7 -113 -403 -12 -244 -195 -62 80 -129 -6 -279 96
3161I6j09j4j06K39j19J11l08K98P2j36l0M8p1J53J52j70O5j39k27N1k2K5P1r2
$$ 96 -13 -27 -133 106 -13 98 -210 88 160 24 -6 42 -29 124 276 106 171 32 -195 -144 -166 -141 -70 -162
3185a62J05R8J3l37L72L3J34l21J0J00j29K8j6K82J3r1m72M15j84K88K4k95K83
$$ -162 -57 41 54 -283 89 122 256 -65 -55 45 -84 -56 -72 210 223 132 -340 75 -109 179 203 -92 191
3208A91m1r8n12N52j18J2M61l40k08KL7J50J67m46O7K87L6J25m30k24K95J06r5
$$ 191 150 52 -460 92 -26 -14 447 107 -101 -99 -62 88 255 -191 -124 163 199 324 -106 -330 -35 71 -24
3231b4j04K60m6J3j3j6J13n61N91j49j81J85k14K94k7Q0j97r1l15M49j63o0K81
$$ -24 -128 132 86 99 86 70 183 -378 213 64 -117 68 -146 148 121 201 4 -87 -402 47 -116 -176 105
3254A05k11l9r0o1O3R2K74k23K84J66l06m0J31M9l33R9n0K8%RM3P9k60J21P9J07
$$ 105 -106 -145 -235 -296 -233 -141 133 -90 194 360 54 14 145 194 -139 -40 -90 -62 -62 -53 -10 69 -191 -70 9 116
3280A16k20K89P3k99J4Jo5J81k08k3L2q4M05m18K1M11k19q1PL07j62k13N0K15
$$ 116 -104 185 258 -41 -27 -26 -91 90 -118 -141 -109 -193 212 -206 -185 226 7 -74 -67 240 78 -135 -85 130
3304A30K4m6p5n2l2NJ72Kj08k45K8K15L7j95r4M9K47k88K11N6p7J85j03j53r5
$$ 130 154 108 33 -19 -51 -46 126 128 20 -225 -197 18 55 -140 -234 -185 62 -226 -15 41 -36 149 46 -107 -202
3329b02M10p6m54J53p8L01j26L14n6k78K0j23J78k0k44K21L8J74j60N4P8j36J51
$$ -202 208 132 -322 -169 -247 54 -72 242 186 -92 -72 -195 -17 -37 -281 -60 -22 152 -8 46 124 -12 139
3352A39R3l8k09L30k72j10m5M05o69L57k18Q4K00j21P5j54K79m46K77J11j20Q4
$$ 139 232 194 -15 315 43 -67 -112 293 -376 -19 -237 -153 47 -74 1 -153 126 -320 -43 68 -52 32
3374C2r4K34p7n08K34M13k76L6q9l04P33k81k09O9J00j7P2Q3K0k47j96K85P9j0
$$ 32 -62 172 95 -413 -179 234 -42 -6 -95 -399 334 53 -156 -87 13 -4 68 151 171 -76 -272 13 92 82
3398H2K49m62M46k54k92P3M47j24k52P8J27k87p1L77P5j22p7k61J12K01M2l12
$$ 82 331 -131 315 61 -231 -158 289 165 -87 -9 118 -169 -240 137 212 90 13 -248 -136 65 107 -205
3420b05J80N4k99L65l24O30m13j45J03J23K11n81K73Pj42j82J59J94n1k10J58
$$ -205 -25 29 -270 95 -229 401 -12 -157 -54 69 280 -301 -28 -21 -163 -345 -186 8 -43 -253 -95
3441i5J89j33j9J3K01o5l2L9l31J92J5J42j71K00J19l53k6j2M04m18J73j80J24
$$ -95 94 -39 -58 -45 156 91 59 98 -233 -41 -26 116 -55 145 264 -89 -115 -127 277 -141 32 -148 -24
3464b4l3K86n5m11J74k09K47M8R4l12K78p9J45k14oj12J35n1k50L35K7J34j68
$$ -24 -57 229 174 -237 -63 -272 -25 23 117 -195 83 4 149 -65 -71 -183 -48 -99 -349 -14 13 147 -21
3487b1P7Kq5J85q0l10O25n00O1J59k23J46J50k09j27J37k20Q2L21o2j13K17mM7
$$ -21 56 58 -27 158 78 -232 393 -107 -46 113 -110 36 186 -23 -150 -13 -233 -151 170 108 -5 212 208 255
3511B55m13L9R2j79K19O1j73K4M3nj96P8K37k43QL13l9j48m1J13J13N6j43OK9
$$ 255 -158 -119 -27 -206 13 74 -99 -75 -32 -37 -233 -155 82 -161 -153 160 121 -27 -68 45 158 214 71 77 106
3536A06q1q8R5N0N6O0n1m36M11j76j76N0K20j22R0j45J52l15K13J20M3j54k5j34
$$ 106 25 -63 32 82 138 198 147 -289 122 -54 -230 -180 40 -82 8 -137 15 -300 -87 33 76 -78 -103 -237
3560b37N34m23K52m6j8N6n16J51L88k86J9K50j25j01J56J84k49J23j63l4O4k3
$$ -237 297 -126 126 80 62 118 -398 -247 141 -145 -126 124 -1 -102 54 238 -11 112 -51 -85 -21 -44
3582d4L78m19j44L88m30K07J07k24K87j51m9K45N8k43K17j24r2K58jm30K68L1
$$ -44 334 -85 -229 159 -271 -64 43 -181 106 -45 -94 151 209 -34 183 59 -33 225 224 -206 62 93
3604I3p8k62K25J98k79J35q2O0m11J32J61J75k60J43K39k43K43M5j83O8J55l92
$$ 93 15 -247 -22 176 -103 32 -50 10 -401 -269 -108 67 -193 -50 189 -54 189 234 51 119 274 -118
3626a18N2O5p2L6P3p6J9p4J91k54J70J3J6k52R4K79l22J05P2N2p2r2P1l5M7J02
$$ -118 -66 -1 -73 -37 36 -40 -21 -95 96 -158 12 25 41 -211 -117 162 -160 -55 17 69 -3 -95 -24 -59 -12 90
3652I0k09j01P8O9Q0n6o2J13Q8k57K71k58M1K31j3l07Q5M22k38j10q5K08J13l22
$$ 90 -119 -220 -142 -73 7 -49 -111 2 90 -167 104 -154 -113 118 105 -202 -117 305 67 -43 -128 80 193 -129
3676a29lK64l93J8K68j92J5R6K0O6J23l22J55k8KL7j26J01J38j36J8j47P2j5p8
$$ -129 -132 132 -261 -243 25 -167 -152 -56 -36 30 153 -169 -14 -42 -40 -3 -129 -28 110 -26 -8 -155 -83 -98 -176
3701a76J03J03j35J84j63Q4m2K42j47m13M57j68J27j82O4R6j42m5N53m88J6N4
$$ -176 -73 30 -105 79 -84 0 -42 200 53 -360 97 -71 56 -126 -62 34 -108 -153 400 -88 -72 -18
3723a8J09J46k94Q8J42j22O1kP5j93P7l45K65l7j20K1K22l6J24k01r1J29J26m0
$$ -18 91 237 -57 31 173 51 112 110 185 -8 69 -276 -11 -48 -168 -147 75 39 163 -38 -129 0 126 86
3747H6j91oL7R8M3q2j40J14J11j07J00L00m82l3K68p7k09K17j83K89j68n8K4L
$$ 86 -105 -111 -74 24 67 -15 -155 -41 70 -37 63 363 -119 -152 116 39 -170 47 -136 153 -15 -73 -49 -46
3771d6K10j44k9J05J39k97J79k25J47M0Rk60J00J67m12L00j52Q3M5l1J02n1P8
$$ -46 164 20 -9 96 235 -62 117 -108 39 79 88 -172 -72 95 -317 -17 -169 -86 -41 -72 30 -21 57
3794E7j1O8J6j26j14L17k92J41k27J52L3o7PM5L6q6j99Q4J17K37k06R4l52M02
$$ 57 46 114 130 4 -110 207 -85 56 -171 -19 14 -53 -46 -1 35 -51 -250 -166 -49 188 -18 76 -276 126
3818A26p4k17K95j87J71l39L07j50M4J17j63j6J52j97L08j7l15K32k57J25j41
$$ 126 52 -165 130 -57 114 -225 82 -68 -24 93 -70 -86 66 -131 177 160 -155 77 -180 -55 -196
3839a96P0k68L98K53k10P4j18l8l28L31L10m34l4J10J86J43j09k85K39K0j65r5
$$ -196 -126 -394 4 257 47 121 3 -35 -363 -32 278 -156 -190 -80 106 249 140 -145 94 114 -51 -146
3861a46K23k15r0L94j66P5j08J86j44j68K75J79l39K16l00L41k79Q2j01K5m0N1
$$ -146 77 -138 -228 166 0 75 -33 153 9 -159 116 295 -44 172 -128 213 -66 16 -85 -60 -100 -49
3883d9K49q2K39j37k56J18k81J92J4J7N3j83L6J06R1j28J33J21l55J6P7J34j53
$$ -49 200 118 357 220 -36 82 -199 -7 7 24 77 -106 -70 36 127 -1 132 253 -102 -86 -9 125 -28
3906b8K91n23N67l29M3L1k61N09q6j51R2j60J03j4J7l16Q0K95r0r6j15K42J71
$$ -28 263 -260 307 -22 21 52 -209 300 214 63 155 -5 98 84 101 -215 -135 160 70 -26 -141 101 272
3929B72l97J3J69k23J42K9q7J04J21k77J24J03k15m9J64n3j72K05K51k23k7m9
$$ 272 -125 -112 57 -166 -24 5 -82 22 143 -134 -10 93 -122 -171 -7 -60 -232 -27 224 1 -26 -75
3951g5M31k52l24K75J73k3r3j15k38R1N44n85J22J40j79J31K0J41l51J74n2L40
$$ -75 356 104 -220 55 228 205 112 -3 -241 -150 394 -191 -69 71 -108 23 43 184 -167 7 -45 295
3973B95J26j81m29J10L7l91M83p6P7N7o4Ol2Lk28K56j95q1J00J56n9K05l65L02
$$ 295 421 240 -189 -79 -42 -433 50 -26 51 108 44 50 18 21 -207 49 -146 -227 -127 29 -30 175 -190 112
3997A12k00M17l61O4J02r6J97j12KP1l88j45J68L67j58q9p0J64K2k96M18l29m6
$$ 112 -88 329 -32 32 134 38 235 123 125 196 -192 -337 -169 198 40 -49 -119 45 67 -229 189 -140 -186
4020a86L89k00j82N25l78J66r4l80L45P8k29L55l34K50j62q3k6J20J07k63P0k1
$$ -186 203 3 -179 346 -32 134 40 -340 5 83 -146 209 -125 125 -37 -120 -146 -26 81 -182 -112 -133
4042a33K95k94k3Q1K75j55n5j17K65j21M0L2k27L78n08O43m69j22K63P0l26k2
$$ -133 162 -132 -155 -74 201 46 -9 -126 139 18 58 90 -137 241 -267 376 -93 -215 48 118 -208 -230
4064b30L91q0o7k38m0J84J41l78K54L4k11L04k55J77J2J14l75K34m2j15N3L17
$$ -230 161 81 14 -224 -264 -80 61 -317 -63 -29 -240 64 -191 -14 -2 112 -263 -29 -71 -186 -133 184
4086A84k67J92k22L45L8k11l1j05j8K7K4O4m6O6q0J3J05m9j19J25J14k66k90M61
$$ 184 -83 109 -113 232 270 59 28 -77 -95 -68 -44 20 -26 40 -40 -27 78 29 -90 35 149 -117 -407 54
4110E4m6J55l84K47K7j60K34l35J58oL69l53k24L06nk23K41o8J36k33j8K53r3
$$ 54 8 163 -221 26 53 -107 127 -208 -50 -56 313 -40 -264 42 37 -186 55 -13 123 -110 -128 125 32
4133C2k4J72k62K79k89R6J09Jj69k30K65j47L63n6j09K16k26L5O6r9Rm5J42r5
$$ 32 8 180 -82 197 -92 4 113 114 -55 -285 -20 -167 196 140 31 247 21 56 122 23 32 -13 129 34
4157C4j00n4J96k26l0M22r7l30N7M6j22K33MK69k94J20k6j84J43m1J83k30L2K8
$$ 34 -66 -120 76 -150 -180 242 145 -185 -128 -82 -204 29 33 302 8 128 102 -82 61 20 203 -27 5 33
4181C3J56k0j84J34j65r7N4m8l2N40m74m7N02l70n1j30K69j23j22L30ol22Q7J16
$$ 33 189 169 -15 119 -46 -143 -89 -137 -169 371 -103 -150 352 -18 -69 -199 70 -53 -175 155 149 -173 -86 30
4205C0j35K64j23J15j57J38j09J58r8k78L2O3J79j87k52Q6P0K42p8j18O1J73Q0
$$ 30 -105 159 36 151 -6 132 23 181 83 -195 -163 -100 79 -108 -360 -274 -204 38 -40 -158 -97 76 156
4228A56n1J41k57j11J63j02L7O2Q5k82J87k89L03m69L11K64k89J45k13J23j51
$$ 156 105 246 -11 -122 41 -61 -24 38 123 -159 28 -261 42 -427 -116 148 -141 4 -209 -86 -237
4249b37K24p1J71l15o4L41l45r8M59R9j25j28K18J68m21J29K63j46k05l8nJ48
$$ -237 -13 -84 87 -228 -292 49 -296 -394 65 164 39 -89 129 297 -124 5 268 122 -83 -121 -126 22
4271B2M8L6K36m02O4l8N9p0l1K75k69K39j6l24J90j57K29P0rk99R4R9O4j56J7
$$ 22 70 106 342 -60 4 -34 25 -45 -76 199 -70 169 153 -171 19 -138 91 161 152 -147 -53 46 110 -46 -29
4296b9O3k91K4K10j69K51J47j86K64o20L15j07K44j34k93J98m1M21j02l06J95
$$ -29 34 -257 -233 -23 -192 59 206 20 284 -336 -21 -128 116 -18 -311 -113 -154 267 165 -141 54
4317E4l27J98j31K49M0k32N6M0j12L1p1J33l3J51Q8j96k22L34Q7l7k08J7PN1J04
$$ 54 -273 -75 -206 43 83 -149 -93 -53 -165 -134 -205 -72 -105 46 134 -62 -284 50 137 100 -108 -91 -84 -33 71
4342G1j04J58j11n1J03J53l39N7n1L4J33k88J48J17j97L96p8j47K87l20J15J50
$$ 71 -33 125 14 -37 66 219 -120 -63 -114 -80 53 -235 -87 30 -167 229 151 4 291 -29 86 236
4364B36k61N1k02n4M68k72J75l36P0J82P8r6p2K56k69o3m5r8M29n3j51J85j29
$$ 236 -25 26 -176 -230 238 -34 141 -195 -125 57 135 39 -33 223 -46 -109 -154 -252 177 124 -27 158 29
4387B9J76l05j7J71N3k80L39j60M6p9R0K3q8k39j05N17k14n8r4K08j55J87j32
$$ 29 205 -100 -117 54 107 -173 166 6 52 -27 63 86 -2 -241 -346 171 -43 -101 -195 13 -142 45 -87
4410h7OJ81k78l2K72p9j13L46N2j18l30M9K81r7J4l8J10k25J91j37J0Q9K05l58
$$ -87 -81 100 -178 -210 62 -17 -130 216 268 150 -180 -131 150 53 67 29 139 -86 105 -32 -22 67 272 -86
4434h6q2L4O8K05K63m85J95k50K95j85J48J8k05l84N65k45J92k64Q0q4j07K17
$$ -86 -168 -134 -66 139 402 -83 112 -138 157 -28 120 138 -67 -451 114 -131 61 -203 -123 -207 -314 -97
4456i7j00L00J6J86ql2m13L42l49k2L46k16R2N0M2J74o10M03J96l39J29m93N94
$$ -97 -197 103 119 305 297 265 -148 194 -155 -177 169 -47 45 95 137 311 -299 104 300 -39 90 -403 191
4479A91k85R3O5k09J52k40K84k6k77J44J04J79N0j13oJ10M0m96K27o0j2K62l87
$$ 191 -94 -1 64 -145 7 -233 51 25 -252 -108 -4 175 225 112 106 216 256 -240 -13 -73 -85 177 -210
4502b10L35or9j09J13j37qp2q4M9J50J12J27q3L0r4n0L15k59N5k30ML20p9j66
$$ -210 125 119 20 -89 24 -113 -121 -193 -277 -228 -78 34 161 78 108 14 -36 279 20 75 -155 -151 169 90 -76
4527g6j8Q1K63m62J50R4m3K80l27L32k54M4k51P2J29Rj04J60P3k19qJ67N2q9j2
$$ -76 -94 -13 250 -212 -62 32 -11 269 -58 274 20 64 -187 -115 14 23 -81 79 152 -67 -75 92 144 55 43
4552D3k66L15nj73P1j19J61j46K36l90J83L41l58J43p7N5K4J14k35o9K02O7k92
$$ 43 -223 92 87 -86 -15 -134 27 -119 117 -273 -90 251 -107 36 -41 14 38 152 -83 -152 50 117 -175
4575a75R9K27k93R1J54j70Qj49J91M7l3k1j51K83J05l61L5N9J99N4j89N7j43k69
$$ -175 -76 151 -142 -51 103 -67 -59 -208 -17 30 -3 -24 -175 108 213 -148 -113 -54 145 199 10 67 -76 -345
4599c45M33k64K68k1j04L17k68k77K17j9J38Q3K6r7j00j4J11J34l11P8j42j36
$$ -345 88 -176 92 71 -33 284 16 -261 -44 -63 75 158 184 87 -13 -27 84 218 -93 -15 -157 -293
4621b93L38j28J33j4q0N6P6l09N1K96j98J77j17k50M15j37L78k76l8j65M4N1j31
$$ -293 45 -83 50 36 -44 12 88 -221 -170 126 -72 105 -12 -262 153 16 394 118 80 -85 -41 10 -121
4644a21k57K78J74n7p4Q0j81k6m2L03j1k67L48j84N5K81n7l66J71k80L45k33J0
$$ -121 -378 -100 74 17 -57 23 -158 -184 -226 77 66 -201 147 -37 18 299 242 -124 47 -233 112 -121 -111
4667a11K8j12K08p4J66k69L87m22K89O0k48J78l2j21J23Jp6Rl8K51j18o5j0mP7
$$ -111 -83 -195 13 -61 105 -164 223 -199 90 150 -98 80 48 -73 50 51 -25 -16 -54 197 79 14 4 0 77
4692G7K7L6j5j19l7o0J36j44q6N13M9k24j32r6j70N9K23J21k31o7M21l23p9L14
$$ 77 104 140 125 6 -31 -91 45 -99 -185 328 377 153 21 -75 -245 -186 37 158 -73 -140 281 -42 -121 193
4716A93l66J80k61J09Kk27M79J44k49kj4p7J48l57L31p1K08k94J14k44J59j8J49
$$ 193 -173 7 -254 -145 -143 -370 109 253 4 2 -12 -89 59 -298 33 -38 170 -124 -10 -254 -95 -113 36
4739C6j87J74K59m71M19k39L9j59K54m2m6K02l65k7Q8J18p4R8o3k46L77j33J56
$$ 36 -151 23 282 -189 230 -9 30 -129 125 83 37 239 -126 -153 -65 53 -21 77 14 -232 145 12 168
4762A68k48J3Mr2L43L4l22L08n8L5l89j7j23L20N0p6L9n7P6j37n5J44J83J2j86
$$ 168 -80 -67 -63 -155 188 222 -100 208 150 185 -204 -221 -344 -24 26 -50 -11 -68 8 -129 -184 -40 143 155 -31
4787c1J33O6J1j15k4m3K0P6Lj90j73L7M23j82j71J71j33J0j66J94J5J92j28q2
$$ -31 102 168 179 64 40 -3 17 93 96 -94 -267 -230 193 11 -160 11 -122 -112 -278 -84 -69 123 -5 -87
4811h7L0k01K44N5k40rJ75Kj79M91k59O1j50j61K49r8k2P3K23k95%L13l00Q7N0
$$ -87 -57 -258 -14 41 -199 -208 -33 -31 -210 281 22 83 -67 -228 21 -77 -99 -26 197 -98 -98 215 -85 2 52
4836E2J1k68J03O0r3K14l6L7k76P5k35L45j57K44k9j71M6Pp5K17o8O3j65J30l1
$$ 52 63 -205 -102 -42 -135 79 43 80 -196 -121 -356 -11 -168 76 47 -124 -78 -71 -146 71 3 66 -99 31 0
4861@lj16j60L70j50J76rm0j98J62L5r8J56p8p5Q6j73K14j09k12K73l13N01l36
$$ 0 -3 -119 -279 91 -59 117 108 68 -130 32 67 -31 125 47 -28 58 -115 99 -10 -222 51 -262 239 -97
4885i7J30j40j0J37k50P4j20L17j77J11O6K47m52K54k8j77L08R9k14k26J99q2
$$ -97 33 -107 -117 20 -230 -156 -276 41 -136 -25 41 288 -164 90 62 -115 193 292 78 -148 51 -31
4907c1j85P7K15k0k56J71J95j65J22q8r7J09j73L32m37K69J22j99J39O3k43M8
$$ -31 -216 -139 76 56 -200 -29 166 1 123 35 -62 47 -126 206 -231 38 160 -39 100 163 -80 -32
4929c2j18K35O7k21L48k88M4k30K50J07k11m1J67j26K28m35K47J26n2K40k74k17
$$ -32 -150 85 152 -69 279 -9 35 -195 55 162 -49 -90 77 -49 179 -256 -9 117 65 305 31 -186
4951a86L4o6K06j17J17n8O3J67j97l81L93K81l77j31j37L42K32k00J6K1qJ4j51
$$ -186 -152 -218 -12 -129 -12 -70 -7 160 -37 -418 -25 256 -121 -252 -389 -47 185 -15 1 22 14 28 -123
4974a23K29j71P8O0j78L25k51l6pK32P2k05j68J73M6j16K38m74L05K1j48L03j26
$$ -123 106 -65 13 73 -105 220 -31 -67 -74 158 230 25 -143 30 76 -40 198 -276 29 50 -98 205 79
4997G9k93K64k86J14P8q3K48l25L2M8j8J91l55k1L94J19q2j32J61L9q8K22j51
$$ 79 -214 50 -236 -122 -44 -127 121 -204 -172 -124 -142 49 -306 -327 67 186 104 -28 133 172 84 306 155
5020A55k20pM30m83k46O25j43K8k67O02k29m42K94l0j02J28p0M6j72M5O6OJ9j1
$$ 155 -65 -72 358 -125 -371 254 111 139 -128 474 245 -197 97 67 -35 93 23 69 -103 -58 8 14 33 22
5044B2j13m0K19l33M23k9j37J88p3j86j83M07k44M52m36P9J67j66L3j83J25n2
$$ 22 -91 -131 88 -245 178 149 12 200 127 -59 -242 165 -79 373 -63 16 183 17 50 -133 -8 -60
5066f0J64O7o0n14K76K30k53K27qo0p1k68P2K49o4m9K70J14m55J08O0L68j94j68
$$ -60 104 171 111 -403 -127 103 -150 77 69 9 -62 -330 -258 -9 -73 -122 148 262 -193 -85 -25 343 149 -19
5090a9n3J10o4M4r5P4L9L5J16l10j68L75k25L06n2k69J48j40J82o0j04MJ28J4
$$ -19 -72 38 -26 18 -77 -3 36 71 187 -123 -291 84 -141 165 113 -156 -8 -148 34 -26 -130 -126 2 16
5114A6j21MR2j29L1k7kK54l82L53o9K6j30L37k64n4K02QJ26k52j7j53J27j67L00
$$ 16 -105 -101 -9 -138 -107 -134 -136 118 -264 89 20 46 -84 253 -11 -65 137 145 271 19 2 -151 -24 -191 109
5139A09K4m54J95M0JJ93k49J10K39l4k38R2N0O5r0J9q3J85k21K8j58n5N20k30
$$ 109 133 -321 -126 -86 -85 108 -141 -31 208 174 -64 28 78 143 53 72 -11 174 -47 -19 -177 -232 288 58
5163E8j04Qj85J38K27J72m66j7J46K84l14L90l24j4q4J92Kk39J3L48n22J65J75
$$ 58 -46 -38 -223 -85 142 314 -152 -169 -23 261 -53 337 13 -1 -85 107 109 -130 -117 231 -291 -126 49
5186D9O2n0j65J22R6j20j89K00J50L33j48k55k13L17k91J28K9R7k06O1k3K21j16
$$ 49 111 61 -104 18 114 -6 -195 5 155 488 340 85 -128 189 -102 26 55 152 -54 7 -16 205 89
5209H9o4J25l20K8K17l74K74m6n3q5L42m4n0l6O2r4j64K9K18l57J54K29k23L21
$$ 89 25 150 -170 -142 75 -299 -25 -71 -124 -209 133 89 39 3 65 -29 -193 -164 54 -303 -149 80 -143 178
5233A78j73l1l7N2M0O5kk1j54j75M15l55K81j39J1J06Q5j33Q2kp4L7l38M10n3
$$ 178 5 -26 -63 -11 29 94 92 71 -83 -258 157 -198 83 -56 -45 61 146 13 95 93 19 56 -282 128 75
5258G5k23J6l7K23j44K79j77l5k95K49r9J23J04L4j6J3N4o0l25K67K1k75J19R5
$$ 75 -148 -132 -169 54 -90 189 12 -23 -318 -69 -168 -45 59 93 77 90 144 84 -241 26 47 -228 -109 -14
5282a4J35j67p7P1J1R8K27j54n8j89K16l70L77m6l7k09k57N52j57Qk7K84k96m4
$$ -14 121 -46 -123 -52 -41 57 284 130 72 -117 99 -271 106 60 23 -186 -443 109 -48 -40 -67 217 -79 -123
5306a23k6J78mr2p4K05K2M5r7n4J48K5l5k19nJ50N0J7Jl9k21J33o2K01l50J4J31
$$ -123 -149 29 25 -67 -141 64 86 131 34 -20 128 153 118 -101 -106 44 94 111 112 73 -148 -15 -77 124 -226 -212 -81
5333h1R8k1j37L1K12Q4j1J5m55K54o1j29K96l38M69m73N58j60l62L74q7J2J62
$$ -81 17 -4 -141 -110 102 186 175 190 -265 -11 -72 -201 95 -243 226 -247 311 151 -211 163 76 88 250
5356B50m21J94P6k68K14p7Q0ro7k3N2N29n34L4P6N3l18l4L75J1l8j64j57J14K40
$$ 250 -171 23 99 -169 45 -32 48 39 -28 -51 1 530 -4 30 106 159 -159 -193 182 193 155 -9 -166 -52 188
5381A88k08N4j48O3o2j1p8l3M6K4L1k20J34Q0L28r8j41j20J40L21l56M55l72k48
$$ 188 -20 34 -114 -51 -113 -124 -202 -235 -189 -165 -134 -354 -220 -140 188 90 -51 -171 -31 290 -66 389 17 -231
5405b31M25j68nJ51J2l45K84K2N5j86j22J20J59O0m28L36j57J78M8l40j35L27
$$ -231 194 26 21 172 184 -161 123 145 200 14 -108 12 171 231 -197 139 -18 160 208 -132 -267 60
5427F0p9J51j44Ok37J68P7J58k56K2OK57J19n42J90O2K08k68J25n7J71l24J33
$$ 60 -19 132 -12 -6 -243 -75 2 160 -96 -74 -68 189 308 -234 -44 18 226 -42 83 26 197 -127 6
5450FL29m69N7P6kj80K14m5Rj00m0L08r5K5l71J26j2L91l73J87n4l7J09O6J5K46
$$ 6 335 -134 -77 -1 -3 -183 31 -14 -5 -105 -145 163 68 93 -278 -152 -164 227 -146 41 -13 -50 59 125 140 386
5476C86p4k18k58J15M0k9P7J73k76k1J93l69M45m28L60k89K08j0k2M3k82L78r0
$$ 386 312 94 -164 -49 -9 -38 39 212 -64 -85 108 -261 184 -244 116 -173 35 25 3 46 -236 142 52
5499E2k72J70K28j42J63l30J16p8j36K68mk88J58K3j22L77r2k44M5J44p6k12J66
$$ 52 -220 -50 178 36 199 -131 -15 -93 -229 39 35 -253 -95 -72 -194 183 91 -153 -108 36 -40 -252 -86
5522h6J51jm03M74k48K0K57J10l42J57l17L36rN7k41L9k00K49m8k09J66k31K70
$$ -86 65 64 -339 135 -113 -93 164 274 -68 89 -228 108 99 156 -85 -46 -246 3 -45 -254 -88 -319 -49
5545d9J1L0J25O4k35j6J11J83l33J95j7K79k72k77J32L18Rj21l0k66k12m9N01
$$ -49 -38 -8 117 181 -54 -70 41 224 -109 86 69 348 76 -201 -69 249 258 137 107 -159 -371 -420 81
5568H1Ln2Q4n22N72k36K48j55K64j39k58K56j98J03j1lK86l17j50J64k21K48j22
$$ 81 84 32 116 -406 166 -70 178 23 287 148 -110 146 -52 51 40 37 323 6 -144 20 -201 47 -75
5591g5o5J17k72L66k03J43o2J12j38J71n8QJJ20J9j63j91L91j38r6K98m63K81
$$ -75 -140 -23 -295 71 -132 11 -51 61 -77 94 36 44 45 165 184 21 -170 221 83 -13 285 -178 103
5614A03j41o6J40m6m3j55L61j89J82k01j20j6J02J76k01K12j86j9K93k14K20j49
$$ 103 -38 -104 36 -10 -53 -208 153 -36 146 -55 -175 -191 -89 87 -114 98 -88 -107 186 -28 192 43
5636D3n6K6J34N1J90n84K33R2j04k67L38j43p1K80k17j99J57j1J50j56K90k46
$$ 43 -13 13 147 198 388 -196 37 129 25 -242 96 -47 -118 162 -55 -254 -97 -108 42 -114 176 -70
5658g0k8J24n7J92j39k54J9J37j3J60r0m9L10j00k51O0K98l01K51l27J00k53J03
$$ -70 -98 26 -31 161 22 -232 -213 -76 -89 71 -19 -68 242 142 -109 -49 249 -52 199 -128 -28 -281 -178
5681a78J88n7q3Q9k1L11j94m24M32mk4j03J31p8j4J66j76N1O7j29J51K3j7k00
$$ -178 10 -47 -130 -41 -62 249 55 -369 63 59 35 -68 63 -15 -29 137 -39 12 79 -50 101 124 107 -93
5705i3J40pnj11J09M9j59M3M43m11m8j15J09K57l72K35j22M1J18j72l30J39J48
$$ -93 47 40 35 -76 33 82 -77 -34 409 -2 -50 -165 -56 201 -171 64 -58 -17 101 -71 -401 -262 -114
5728a14QJ42n7J53N7l30J55L8j07O5J15j26J84j84k43M96m68M08m06J35k7P4J00
$$ -114 -106 36 -21 132 189 -141 14 52 -55 10 125 -1 183 -1 -244 252 -216 192 -214 -79 -106 -32 68
5751F8j15J10j64K19k23M3J81j68j8j4P9j54L09j73j87J54M5J94n44L82J05K77
$$ 68 -47 63 -101 118 -105 -62 119 -49 -67 -81 -2 -156 153 -20 -207 -53 -8 186 -358 24 129 406
5773D06n13K0J93j38K58K8j28l6k68L12l06R6K85l30M00m87J42j37K10mJ10k43
$$ 406 -107 -87 106 -32 226 254 126 90 -178 134 -172 -76 209 -121 279 -208 -66 -203 7 3 113 -130
5795a30K47r3k39o4M82j61j27mN3j84K70K3MJ19m68J56J01J48j2Qj35k55J86K2
$$ -130 117 24 -215 -279 203 42 -85 -89 -36 -220 50 73 77 196 -272 -116 -15 133 121 129 -6 -261 -75 -53
5819e3j8J02L02l35j19K86m55M00p8N7j91K16O5k51m7J03j37J12J23P1m23M10
$$ -53 -71 31 333 -2 -121 165 -290 110 32 89 -102 114 179 -72 -119 -16 -153 -41 82 153 -270 140
5841A40k17k08N74m23J21m0K36n31L50J64j15j81l9M90k79k41m5O68m25r5P9J06
$$ 140 -77 -285 289 -134 -13 -53 183 -348 2 166 51 -130 -169 321 42 -199 -244 424 -1 -96 -17 89
5863H9lq0N5j42R8k14o5M20j72O7J9J87m38J12k1K17l15Q4j36K11J52r2j81K16
$$ 89 86 6 61 -81 17 -197 -262 158 -14 53 72 259 -179 -67 -88 129 -186 -102 -238 -27 125 33 -148 68
5887F8K7o4lJ53q7k16m2L3J60Q6jj47L44l86p8R9L6L3L09n40l3K20J22l91M76
$$ 68 95 31 28 181 94 -122 -164 -131 29 115 114 -33 311 -75 -153 -54 -18 15 324 -216 -249 -29 93 -298 178
5912A78j70Q2Kk11M0L41j21M5m65P2L79j64o8L05j56k67L6J35r2R0j96K77j81
$$ 178 8 90 92 -119 -79 262 141 186 -279 -207 172 8 -60 245 89 -178 -142 -7 -99 -9 -205 72 -109
5935a09j3n0J13O1k15K39j31J0J0K05l34N6j20K69n5n5M40k65j22L13l57M26l75
$$ -109 -122 -172 -59 2 -213 26 -105 -95 -85 120 -214 -158 -278 -9 -64 -119 321 56 -66 247 -110 316 -59
5958e9k30J88J33J68k52K04j46j54J31k44J27RQ1j1J3K2J62k50J61j30K34k72
$$ -59 -289 -101 32 200 -52 152 6 -148 -17 -261 -134 -125 -44 -55 -42 -20 142 -108 53 -77 157 -115
5980a15L9n1O2J51j44P1K50l32pM1j75L47j02K35o99L39J25R9l57j62N26k15K27
$$ -115 -76 -127 -65 86 -58 13 263 -69 -76 -35 -210 137 35 270 -429 -90 35 134 -223 -385 141 -74 153
6003A53j89k26K16J17J01j46J43o7r4j57J92j17K22o24N55j76J02m1o8K01K2Q
$$ 153 -36 -262 -46 71 172 26 169 102 8 -149 43 -74 148 -476 79 -97 5 -36 -104 97 119 127
6025A27k26j5P1L40k32j17j96L41j43J02n3J72j93N3k17L8K95j56MLj61N3K01
$$ 127 -99 -114 -43 297 65 -52 -248 93 -50 52 -1 171 -22 31 -186 -148 147 -9 -5 -2 -163 -110 91
6048I1j77J33j36J09J00k40R4j72L32o6J6j55k56K39K35r5Q7P2l08K11p1l08J46
$$ 91 -86 47 -89 20 120 -120 -26 -198 134 68 84 -71 -327 -88 147 52 139 211 -97 114 43 -265 -119
6071a19L4oJ17J3j60J83j69J67K6j17j57M42k39K4K06n34J67N4N8K11M4l15j01
$$ -119 -85 -91 26 39 -121 62 -107 60 86 -31 -188 254 15 39 245 -289 -122 -68 -10 201 245 -70 -171
6094a71L25k78K02n3j07R9j35R9k8K91n51J38K77m05M22q7j97K90j78J3J33r0
$$ -171 154 -124 78 25 -82 17 -118 -19 -47 244 -307 -169 108 -297 125 38 -159 131 -47 -34 99 9
6116Ikk05L89j01r8L00q3o37N94k2j01L5M6k17O9R7n2q4j81R6M17o70K56J02p1
$$ 9 7 -198 191 90 -8 292 209 -428 166 144 43 78 124 -93 -24 73 21 -63 -244 -148 269 -401 -145 -43 -114
6141a14K82L1j13J8j27P9k2N5r6n4j73L16p9l43K37K96j52l91K01N06k55K0j98
$$ -114 168 199 86 104 -23 56 34 89 -7 -61 -234 82 3 -340 -103 193 41 -350 -149 357 102 122 -76
6164g6J61Kj69J79j66K19k27L0J95j71R0J25k15j14M15k82M06l21J85j51j49Q2
$$ -76 85 87 -82 97 -69 150 -77 -47 148 -23 67 192 -23 -137 278 -4 402 81 266 115 -34 48
6186D8J01p8J88l75L1K15K9j42l20L52K30k56o8r3J68j19J96K1k47M7j75M42J4
$$ 48 149 71 259 -116 -85 130 159 17 -303 49 279 23 -45 -138 30 -89 107 128 -119 -72 -247 195 209
6209B09l38L62j3r1j37J0J74m94L91Or6R9L5k06l0j2K49J24m55M01k03l5J41k73
$$ 209 -129 233 220 129 -8 2 176 -318 73 79 -17 82 117 -89 -119 -131 118 242 -213 188 -15 -50 91 -182
6233a82J27L32o25N46j78Q3l01N5J60j62K58n2Q2k07J01r4Q4N8N0j64K6RP8q5
$$ -182 -55 277 -348 198 20 103 -198 -143 17 -145 113 61 143 -64 37 -57 27 85 135 -29 -3 6 84 -1
6257aL4j32J44k04K19L2J4k41jn8L2K65k60R3J16o6J35l81L00j87K61j95LK51
$$ -1 33 -99 45 -159 60 92 106 -135 -136 -194 -162 103 -157 -64 52 -14 121 -260 40 -147 114 -81 -78 173
6281A73k88l5M22m16K45l67K38qj53N73k28j25Pj5Pp1l50N22j40l9J00J32l41
$$ 173 -115 -150 272 -144 101 -266 -28 -36 -189 384 156 31 38 23 30 -41 -391 131 -9 -48 52 184 -157
6304a57K73Kj4m3J38q1k66p6K23K0k34M29j15j45p9J46j62k5Q0J30J20k40K03
$$ -157 116 118 104 61 199 118 -148 -224 -1 19 -215 214 99 -46 -125 21 -141 -166 -86 44 164 -76 127
6327A27j0m4Q4l52K61J85m63K45k02K15j85N7k1J82O4k53J58J2pK8j22N5O3k54
$$ 127 117 73 157 -195 66 251 -212 33 -169 46 -139 -82 -103 79 143 -110 48 60 53 81 -41 14 77 -177
6351a77Qn8K77j10j57J17l20M73p6Q2L9j16q2P3j6r5J83j78K8K8m1J1J22k57K83
$$ -177 -169 -227 50 -60 -217 -100 -420 53 -23 59 98 -18 -100 -27 -43 -138 45 -133 -105 -77 -118 -107 15 -242 41
6376D1k16j7J13K21o0l1j6Q2l4m6M7n8k42K7J42k4M6j82K9p8J80o5K84m14K40
$$ 41 -175 -192 -79 142 82 51 35 117 83 37 84 26 -216 -189 -47 -71 -25 -207 -178 -256 -76 -141 143 -271 -31
6401c1L41n33K10J11m56N56k10l9J39k16l1K87Lk50N2J17j62K77k61J22j53o4
$$ -31 310 -223 -13 98 -358 198 -12 -51 88 -128 -159 128 131 -119 -67 50 -112 165 -96 26 -127 -191
6423a91K95k45l56M11o4J69P7j81K4K52l70K06N3k07K54J0q9J07j63k48K09j11
$$ -191 104 -141 -497 -86 -150 19 96 -85 -61 191 -179 27 80 -127 127 137 48 155 -8 -256 -47 -158
6445a58J65j92K19j71J33o3L6Qk26N5L9J99O6l11J03K07j80N3N6j10J64j21P0
$$ -158 7 -185 34 -137 -4 -67 -31 -23 -249 -194 -155 44 110 -201 -98 109 -71 -18 38 -72 92 -29 41
6468D1q1J65p0k41K09j92J3J54J08j16p0J86k93M89k74J32l34J46j00K23Nj60
$$ 41 -40 125 55 -186 23 -169 -156 -2 106 -10 -80 106 -187 302 28 160 -174 -28 -128 95 100 -60
6490f0J80k96K6L30j89M9Q6j84ml9J36Q4k41%K63k73P3j18J24Q3j94K24j53R4
$$ -60 120 -176 -150 180 -9 40 126 -58 -62 -101 35 119 -122 -122 141 -132 -59 -177 -53 30 -164 60 -93 1
6514AQ5m9J01k87R9l0n7j39M46k51l1m7K5O7j85K80JJ19K5k05j20PJ17k11N5L5
$$ 1 86 37 138 -149 -50 -80 -137 -276 170 -81 -112 -159 -134 -67 -252 28 29 148 173 -32 -152 -145 -28 -239 -184 -149
6540a49L00j86m7J23j20M50m91P6m2Kl13N18J07l3l13J19j7jJ25K45n27L28M1
$$ -149 151 -35 -82 41 -79 371 -120 -44 -86 -84 -397 121 228 195 -118 1 -16 -17 108 353 -174 154 195
6563A95k18J00j88rK14L58n55J69K16k17k0k18O5L15k76J05Q0J31k87J02q7J99
$$ 195 -23 77 -111 -120 94 452 -103 66 282 65 45 -173 -108 207 -69 36 116 247 -40 62 -25 174
6585A74j89n4J27k37K74Rk9J54n15L90j84J99j6j89K23k21j84K65j69J60J1l85
$$ 174 -15 -69 58 -179 95 104 75 229 -286 104 -80 119 103 -86 137 -84 -268 -3 -172 -12 -1 -386
6607c86K23J79j31j00J88J9p8J64k02N9j73M04j1k82N7j52K72K28j26j43j2k2
$$ -386 -163 16 -115 -215 -27 -8 -86 78 -124 -65 -238 166 155 -127 -70 -222 50 278 152 9 -3 -25
6629b5P8k1k51N85m92RK93j29j52R3o4J49J62k61J2O2P4k36K24P4j02l57J83R7
$$ -25 53 32 -219 366 -126 -117 176 47 -105 -12 -76 73 235 -26 -14 48 122 -114 110 184 82 -275 -92 5
6653EJ40j46K2j35J70l8l43J82K07m14M79l77k3L5M55l44J03J91k45J46k33Q9
$$ 5 145 -1 21 -114 56 18 -325 -143 64 -350 129 -248 -271 -236 219 -125 -22 169 -76 70 -163 -74
6675g4j22J18K70N7l65K48q2k27J76j66PL87m06M6M5M6m9K25n2l7J49j05lj64
$$ -74 -196 -78 192 249 -116 132 50 -177 -1 -167 -160 227 -179 -133 -88 -42 -91 134 82 45 194 89 86 -78
6699g8J15j54j49L63j62K36j77L14q3K0l38K51m02M62k43p5K1K84p2k25N8J12
$$ -78 37 -117 -266 97 -65 171 -6 308 225 245 -93 158 -244 218 -25 -100 -79 205 133 -92 -34 78
6721G8J1k40J37N4K8K3K30j73o0j73K36l72L74k16K42K08k57j94P4o8j40J47L9
$$ 78 89 -151 -14 40 68 91 321 148 88 -85 151 -221 153 -63 179 387 130 -64 10 -58 -198 -51 -12
6744a2j09nK7M8j70j13K26K73n32K56J42O0K31k45l5k46K07J76l59P7K45l82M01
$$ -12 -121 -126 -99 -51 -221 -334 -108 165 -367 -111 31 91 322 77 42 -204 3 179 -180 -103 142 -240 161
6767A61j08J72k5j34k34J12K17j03N7p9r7J78qj20l2P9J66k27M4RO7l93L07j51
$$ 161 53 225 200 66 -168 -56 161 58 115 36 -61 117 109 -11 -43 36 202 -25 19 28 95 -298 9 -142
6791a42J15j09L61j50K63j33m02L0K66k06k46L11j33P6Q8k27M14k01j57o9L53
$$ -142 -27 -136 225 75 338 205 -197 -167 99 -107 -353 -42 -175 -99 -11 -238 176 -25 -182 -251 102
6812A02l22K77K50m29J48j78mK92J16k88Q6k32L37l32J29j7k20L31j22K86j42
$$ 102 -220 57 307 -122 26 -152 -156 136 252 -36 50 -182 155 -177 -48 -65 -285 46 -76 210 68
6833F8k23M18n20L73p2k0O9J25jj27j07J16j69J31K8n6m9J0j4K00j6j53j4j3J30
$$ 68 -155 263 -257 116 44 24 93 218 217 90 -17 99 -70 61 89 33 -16 -6 -20 180 164 11 -3 -16 114
6858A14N7L9k18J77q3k10R2P2K21j99k07J81j54K58L4l29J81p1J11K8m9K9k69
$$ 114 171 210 -8 169 86 -124 -32 40 261 62 -145 36 -118 140 174 -155 26 -45 66 94 45 74 -195
6881a95L51k23L49j55l47M52j32j51j91K25M9m6K4O4Q6l02k9p8K11j19O9k49K02
$$ -195 156 -67 282 127 -220 232 100 -51 -242 -17 32 -14 10 74 160 -142 -171 -249 -38 -157 -88 -337 -135
6904a35J48k54L32n1o4Q1j71O0J03J11j51k92J52K08l94L20J59o9k10R0Q9Q6k36
$$ -135 13 -241 91 40 -24 57 -114 -54 49 160 9 -283 -131 77 -317 3 162 93 -117 -27 62 148 -88
6927h8J47Q0mj12q7J29k10L37j64k65K9K75k8k00J10J60l7j23r1P9j03K14j78
$$ -88 59 139 135 23 -64 65 -145 192 28 -237 -208 67 39 -161 -51 109 72 -51 -142 -63 -166 48 -130
6950a30r3M16K00k73o8j16R8r6Q4l81K94o5q6L06j18J40m20L48kM6P9R5l62J67
$$ -130 -223 193 393 120 52 -64 34 -62 22 -359 -65 -130 -216 90 -28 112 -308 40 38 84 163 258 -104 63
6974F3j08j1K07j06k94L08J30m09J77r5K24j03J33j02R7j94J80RO1J7k87J36o2
$$ 63 -45 -56 151 45 -249 59 189 -220 -43 -138 86 -17 116 14 111 -83 97 106 167 184 -103 33 -29
6997b9K61k09r7j19J57r4J73j49M3L50m58l0K22j58K75j90K95k2p7l01O3R4j22
$$ -29 232 23 -74 -193 -36 -130 43 -106 -63 287 -171 -201 21 -137 138 -52 243 221 144 -157 -94 0 -122
7020a22R1j94N17k41q3R1J41m16K06J28m58L50J10k50K71k60M7n4j02J65L25p8
$$ -122 -31 -225 292 51 -32 59 200 -216 -10 118 -340 10 120 -130 141 -119 -72 -126 -228 -63 262 184
7042A84o5j46J6Q2j04r2j72K42J33N2q5K01l1j10K1o4J14L0j51j42J15r0R7J54
$$ 184 119 -27 -11 71 -33 -125 -297 -55 78 130 45 246 215 105 126 62 176 206 55 -87 28 -62 35 189
7066A89l0J01k25k09R4m5J74j32j35J97K79k45j64R1J79j19j10K71m26L19j32
$$ 189 159 260 35 -174 -80 -125 49 -83 -218 -21 258 13 -151 -60 119 0 -110 161 -265 54 -78
7087g8M6j15K02j2j86J0K77Q9k65J93k95N4m6L19k55K34j1j68Q4on4m9j66N3K38
$$ -78 -32 -147 55 43 -143 -133 144 233 -32 161 -134 -80 -126 193 -62 172 161 -7 77 71 17 -32 -198 -145 93
7112I3N4j88M2J93l38K93j33Q2j31j55L8J31j37LK02o4K96k62Q8l16J53L0K01
$$ 93 147 -41 1 194 -144 149 16 98 -33 -188 -150 -19 -156 -153 49 -15 281 19 107 -209 -56 -26 175
7135A75j91m2k24K37k9J8L6J28j0Q6l57J17K8n9J17j34Q4K01l52L40k70K60J3
$$ 175 -16 -58 -282 -45 -74 -56 -20 108 98 184 -173 -56 -28 -87 30 -104 -20 181 -171 169 -101 159 172
7158A72j84J1J8j66K89k03J55j87K40j44j57P4jM78n53l5J80OL5l79M19J44k69
$$ 172 -12 -1 17 -149 140 -63 92 -95 145 1 -156 -82 -83 395 -158 -193 -13 -7 28 -351 68 212 -57
7181e7KO2k2O7J69k75N6l03J97mJJ15o5j32J40J36r8J33J8k31K01J33j45r3L4
$$ -57 -55 7 -15 52 221 -54 2 -301 -104 -108 -107 8 -57 -189 -49 87 -11 122 140 -91 110 243 98 5 39
7206C9p6J10K3j56o6j21M45k31qK9oJ5J21j48j37J49m1o4L47k48j40K25J34j36
$$ 39 -37 73 96 -60 -126 -247 198 -33 -41 -12 -18 -3 118 -30 -167 -18 -59 -123 224 -24 -164 61 195 59
7230E9j88l7J14J15k6J79j53j53K16p4j48k11K59r1L97k66P8k8j23j31P3Q8j9
$$ 59 -129 -166 -52 63 37 216 63 -90 126 52 -96 -307 -48 -139 258 -8 70 42 -81 -212 -139 -51 -70
7253g0K21o4l0j27K33l63J76k5j2P1j47M93o9k71k05J52p3L7K90k77j5K5l1r5
$$ -70 151 87 57 -70 163 -200 -24 -49 -61 10 -137 356 287 16 -189 -37 -110 -73 217 -60 -75 -50 -81 -176
7277a76J91qJ72j71J61j8m06L04n6J61l35K6L07k14L06p5m6k7Q7l85L77k43J08
$$ -176 15 7 179 8 169 151 -255 49 -7 154 -181 -155 152 -62 244 169 123 96 183 -202 175 -68 40
7300D0J15k07P2k1J92j68j24mK55j47J94nk8O3k46n0L59l11J00n5j6rJ5l7K19
$$ 40 155 -52 20 -1 191 23 -101 -105 150 3 197 192 164 227 -19 -69 290 -21 79 24 8 -1 14 -23 196
7325A96q5q7k82J27K82k0k3mk08j8O9J2J17r1P9l00J99r0K78j97Q4p2Q3N6Q4r0
$$ 196 111 24 -258 -131 151 131 108 104 -104 -122 -53 -41 76 -15 64 -236 -37 -127 151 -46 38 -34 49 105 189 99
7351I9o5Rk10K09j02M11l02K8k5P9l01M90j15r5N1j00q0L7J32O9J51m62k18L75
$$ 99 34 43 -167 42 -60 351 49 77 52 131 -170 320 205 110 161 61 -19 18 150 219 370 -92 -310 65
7375F5j63J50K7k36k2K18M4k63L37l82j5K85m0k54rK43j35j97K06N5K08L2p5k18
$$ 65 -98 52 79 -157 -179 39 83 -180 157 -225 -240 45 5 -249 -258 -15 -150 -347 -141 -86 122 154 79 -139
7399a39M4K24j73K9M1k88K63j82L09K5k71K15j88K06j14M2j29j3k5J00N2P8l06
$$ -139 -95 129 -44 -15 26 -262 1 -181 128 153 -118 97 -91 115 1 43 -86 -99 -124 -24 28 106 -200
7422b00J61J16j53l9J60Q4Jk35J17r2J48R1k59K13l4P0%j09l6K75ln34M17j13
$$ -200 -39 77 -76 -115 45 129 130 -105 12 -80 68 159 -100 113 79 149 149 40 4 279 276 -258 159 46
7446D6o9N3j08j10j66P03m08N6qK1J30Qk73Q2n9K71j86O5J02j71OQ0K3j38J01
$$ 46 -23 30 -78 -188 -354 349 -59 -3 -11 10 140 148 -125 -43 -102 169 -17 48 150 -21 -15 65 88 -50 51
7471E1K5j08J36j14k53J20J01O0o1k9j62L20n5P1r5j74M94l20j14J4k5K04k52
$$ 51 76 -32 104 -10 -263 -143 -42 18 -43 -72 -234 86 31 102 7 -167 327 7 -107 -93 -118 86 -166
7494a66L62J01k43M7k15k4J03P1J0l13O7P0j4L63l92R0Q0Q1l4Q1j82j25j6L33
$$ -166 196 297 54 101 -114 -138 -35 36 46 -267 -200 -130 -144 219 -173 -83 -3 78 44 125 -57 -182 -198 135
7518A35l54L38j07J39k62k6J21j29L51m65J05J31j57k32L18K93k55N7o2J9K00
$$ 135 -219 119 12 151 -111 -137 -16 -145 206 -259 -154 -23 -180 -412 -94 199 -56 1 -61 -42 158
7539A58k67Q7l6K74k28L3%NR3k32J06J46j08j09JJ04K8k36L10j52k7n9J25k10
$$ 158 -109 -22 -58 216 -12 21 21 26 119 -113 -7 139 31 -78 -77 27 55 -181 129 -23 -50 -109 16 -194
7563a94J19J20J75l18L50l41L7J81O0O4m54J99k52K56j15Q8K20k14j85J71J36
$$ -194 -75 45 220 -98 252 -89 -52 129 189 253 -201 -2 -254 2 -113 -25 195 -19 -204 -33 103
7584A03kj49O2j28J21j84L46j42j88j9K34Q5l37J83r4K49q7L5n4q6j13L27j7j51
$$ 103 101 -48 14 -114 7 -177 169 27 -161 -180 54 139 -198 -15 -109 140 53 88 34 -52 -165 162 145 -6
7608fj36J31K3k31K40J03k08p5R0K0r6K22j42L1L9o6j32K65J13m09N03l81K35
$$ -6 -142 -11 12 -219 21 124 -84 -159 -69 -49 -145 77 -65 -34 5 -61 -193 72 185 -224 279 -102 133
7631A33j77n8l5J31j16K54n39M81R4n4J48j78L8j54Om9K02Q3k37L29l72L31l88
$$ 133 -44 -102 -137 -6 -122 132 -407 74 168 114 262 84 122 -32 -26 -75 127 210 -27 302 -70 261 -127
7654a27M38l59j88K33P1oj0K25l16K63m7j10m48K56K50l9q1M5j86N11k98Q7k70
$$ -127 311 -48 -236 -3 68 62 52 277 -39 224 177 67 -381 -125 125 86 5 50 -136 375 77 164 -106
7677a06K6L00k04K1l3Q6l6q3K9Q6J1j72J4q3m4K36j58N5P2O1k92K12K7K29m55
$$ -106 -80 220 16 37 4 90 54 -29 0 86 97 -75 -61 -144 -188 48 -110 -55 17 78 -214 -2 25 254 -201
7702b01L68j29OJ0j98K09j32j38K82k40J18L52n9j39j2Q0k58K39j15J72j4j10
$$ -201 167 38 44 54 -144 65 -67 -205 77 -163 -45 307 248 109 97 177 -81 158 43 215 201 91
7724I1k06J07p6K23j03j45L2q6N1N7r2M37j73k77J48J49k43O6M3j7p6R6n7J25
$$ 91 -115 -8 -84 139 36 -109 -77 -163 -112 -55 -147 290 117 -160 -12 137 -106 -40 3 -14 -90 6 -51 74
7748G4O9N1j72J39l86J80O1J5L5q0J36k84K92l08K68j51J12j82J53j22R4K14j11
$$ 74 143 194 22 161 -225 -45 16 31 66 -14 122 -162 130 -178 90 -61 51 -131 22 -100 -6 208 97
7771I7Lq5k58K49j49J29J8j09J85j21k12K78j78K06j96M36m20p0M30r0n2k82J94
$$ 97 100 15 -243 6 -143 -14 4 -105 80 -41 -253 25 -153 53 -143 293 -127 -197 233 143 91 -191 3
7794Cr5K9J92l48J01L3l3K42L5k54l1J49m8L8k87L87j23j27J42J65j27j98J32
$$ 3 -92 -63 129 -219 -118 -85 -118 124 159 -95 -126 23 -25 13 -274 113 -10 -137 5 170 43 -155 -23
7817b3K62k90J90j4j70J6o3R6p9J96j77L6j78K32j16M0j72J58J03p6jl9O0L0j47
$$ -23 239 -51 139 125 -45 -29 -92 4 -75 121 -56 -20 -198 34 -82 -42 -214 -56 47 -29 -30 -69 -9 21 -126
7842a26N2m1L8J31l10L84lOk16j93j07O80m05K99k36M4k3J91Q4m51L86p2p9K01
$$ -126 -74 -115 -77 54 -256 128 125 131 -85 -278 -385 295 -110 189 -47 -3 -26 165 249 -202 184 112 33 234
7866B34m02N05j67J02k66pJ46j70N7k8MJ03p0Q5m27L79n4j40j31nL29J20j53j38
$$ 234 -168 337 170 272 6 -1 145 -25 32 4 8 111 41 126 -301 78 24 -116 -247 -252 77 197 44 -94
7890i4m6L99j03k11J06k52J78j7k4j7J42K7l55K03L80k88n6K24k67k5j3K31K8
$$ -94 -140 259 156 -55 51 -201 -23 -40 -64 -81 61 88 -267 -64 316 28 -28 196 -71 -96 -109 122 150
7913A50k30N48l82j65J17m1K77k97K71j51Mp4k62L77k18n8K53Q5j97J78j87J07
$$ 150 -80 468 86 -79 38 -3 274 -23 248 97 101 27 -235 142 -76 -134 119 204 7 185 -2 105
7935A05j7o5l82Q2K57J44M6k18k16L27O4k11J86K03k16o4j65p5L47n3p7Kj77P
$$ 105 88 23 -359 -277 -20 124 170 -48 -264 63 127 -84 102 305 89 25 -140 -215 132 79 2 4 -173 -166
7959a66J89l60M04j29R2J11m16K25J98l7j17l44K86M38L1o18N9K06J45j60J56
$$ -166 23 -337 67 -62 30 141 -275 -50 148 111 -6 -350 -64 374 405 -213 -154 52 197 37 193
7980A93j82M1K17j63j66q2M2M12j8l14N0j18K1j65L15j20mJ56O7j12k21J82M4
$$ 193 11 52 269 106 -60 -142 -100 312 294 -20 30 -88 -67 -232 83 -37 -41 115 182 70 -151 31 75
8003G5p1k51J54K11j46J01j72R3n6k34L76o6lj71J89l44K61J61k9j50J6K47r3
$$ 75 4 -247 -93 118 -28 73 -99 -6 -62 -296 80 14 11 -160 29 -315 -54 107 78 -72 -56 191 98
8026I8p2O5j75l6R3P4j93O2K35P1m5N7j47q6q7j5K52j03j83J40K35j37Lr8J80
$$ 98 26 91 -84 -120 -27 47 -146 -84 151 222 177 234 87 1 -86 -101 151 48 -135 5 240 103 106 8 188
8051A88l1o6k21L6M43k12j49k81K29%J88J17r2k33L0j36K31J65l79K90k36L48
$$ 188 157 91 -130 -94 349 137 -12 -293 -64 -64 124 241 149 -84 -54 -190 41 206 -173 117 -119 229
8073B29j31J5j95K16j52K5j50J04j2O3P0k47J23p7L40k12r5J11K69p8k72j64L81
$$ 229 98 113 -82 134 -18 7 -143 -39 -51 12 82 -165 -42 -119 221 9 -86 25 294 216 -56 -220 161
8096A61l06K06l8L6j31nK4JK63k39J7kj83K00J28k00j24L75Rn8k04J36l20J35
$$ 161 -145 61 23 59 -72 -77 -53 -52 211 -28 -11 -13 -196 4 132 -68 -192 183 192 134 -70 66 -254 -119
8120a19K2J85l4K12j79k31K10J11k58J07J84l78MJ95j95K67K3j77j44J91J33p1
$$ -119 -97 88 54 266 87 -144 66 177 -81 26 210 -168 -164 31 -164 103 126 -51 -195 -4 129 58
8142E8N3P8j67j83R9j41K05M9K5o6J10J80j69J36l11m9J42j75K85j85j61O5N1
$$ 58 111 189 22 -161 -62 -203 2 51 76 10 120 300 131 267 -44 -93 49 -126 159 -26 -187 -122 -71
8165g1J34m7q1N2J67l60K32L0KJ3J50l12Q4J3m6M1k21K38j60J76k36L03J03j83
$$ -71 63 16 -65 -13 154 -206 26 56 58 71 221 -91 -7 6 -40 1 -220 18 -142 34 -202 101 204 21
8189B1Q2k58
$$ 21 103 -155
8191a55
$$ Imaginary data points
##PAGE= N=2
##DATA TABLE= (X++(I..I)), XYDATA
0@%%%%%%%%%%%qJ6j6J6k4L2l2M0n3O1p2Q8j04J20j42J66j92K24k56K94l37L82
$$ 0 0 0 0 0 0 0 0 0 0 0 0 -8 8 -8 8 -16 16 -16 24 -29 32 -40 48 -56 64 -78 88 -104 120 -136 158 -179 203
33B03m33M91n55O24o98P81q74R73j081J202j334J475j629J800j987K190k413K658
$$ 203 -230 261 -294 330 -368 413 -461 512 -569 633 -701 774 -855 945 -1042 1148 -1265 1393
51A393k927L226l559L930m346M817n356N978o706P569q615R916j1583J3806j6937
$$ 1393 -1534 1692 -1867 2063 -2283 2534 -2822 3156 -3550 4019 -4596 5320 -6263 7543 -9394
66i394K1719k9990M8255j63429J08773K82565k17906j56007P4956J11849r6335
$$ -9394 12325 -17665 30590 -132839 -24066 258499 40593 -115414 -40458 71391 -24944
77b4944l9785Q6794K5803q3528M6297O7098p6298j08117P5809J30555m1956j44167
$$ -24944 -64729 22065 47868 -35660 10637 77735 1437 -106680 -30871 99684 57728 -86439
89h6439L2343J21083j4370r6135j1441M9941K8043q767R201j0578n6899m820P1460
$$ -86439 -54096 66987 52617 -43518 -54959 -5018 23025 14258 23459 12881 -44018 -48838 22622
102B2622K6665l3800k9479M616J4320r673m576J6799p366q35K8263j0898n0939
$$ 22622 49287 15487 -13992 -9376 4944 -4729 -9305 7494 128 -707 27556 16658 -34281
115c4281j5515M8067N2428l0671n8576K1654M3996j5296l1772J654K6448R568
$$ -34281 -49796 -1729 50699 20028 -38548 -16894 27102 11806 -19966 -18312 8136 17704
127A7704p343R122j6399m5743K0863O0563q390n4572n587N0804J0457n9549j3827
$$ 17704 10361 19483 3084 -42659 -21796 38767 30377 -24195 -29782 21022 31479 -28070 -41897
140d1897N1374J4791j9781l196l09j3126q099K4898K7729k6090k3054K5455O476
$$ -41897 9477 24268 4487 1291 982 -12144 -20243 4655 32384 6294 -16760 8695 15171
153A5171k8903p352K4217K0958j7489k2508J3113L150j5933J0444J7920m067j4221
$$ 15171 -13732 -21084 3133 24091 6602 -15906 -2793 357 -15576 -5132 12788 8721 -5500
166e500n147J7226M521k1095J538J7953J815l897p964n345L705k726L410R847
$$ -5500 -10647 6579 11100 -9995 -8457 9496 11311 7414 -550 -5895 -2190 -4916 -1506 8341
180H341o621m660J476n672J262K163K774J1623l209j3466R15J341M740O760m116
$$ 8341 1720 -2940 -1464 -7136 -5874 -3711 -937 10686 7477 -5989 -5074 -3733 1007 7767 3651
195C651o52O86n604K005l779n069J4570N033j2976o955J811R260n26j1597R512
$$ 3651 2999 3685 -1919 86 -3693 -8762 5808 10841 -2135 -9090 -7279 1981 1455 -10142 -630
210f30J3063r732p798M04M185N064m193K435Q553j0960r054P848L081k344n111
$$ -630 12433 2701 -5097 -4693 -508 4556 363 2798 11351 391 -8663 -815 2266 -78 -5189
225e189L086J3568q275j8803N604J1391K706j463m087N551N11j1333K506P753
$$ -5189 -2103 11465 3190 -15613 -10009 1382 4088 2625 -1462 4089 4600 -6733 -4227 3526
239C526n53L445p94m089j994q883K085J2995j39l995l544n535M909K303m269M290
$$ 3526 2973 6418 5624 1535 -459 -9342 -7257 5738 5599 1604 -1940 -7475 -2566 -263 -4532 -242
255b42L074J278J235r364j723R015q21k73J821k490J192l320n060M137j698O29
$$ -242 2832 4110 5345 -4019 -5742 3273 2452 2179 4000 1510 2702 -618 -5678 -1541 -3239 -2610
271b610Q001j675m833l599n795P578Q832j589j450k615q06K141o406J022J2285
$$ -2610 5391 3716 -1117 -4716 -10511 -2933 5899 4310 2860 245 -561 1580 -4826 -3804 8481
286H481j60p149l684j532L809j408k778Q180Oq038J073K545J201j864m630P826
$$ 8481 8321 1172 -2512 -4044 -235 -1643 -4421 3759 3765 -4273 -3200 -655 546 -1318 -5948 1878
302A878P315p983l149J251L4K160l075K120P903n463p341O58o62L188K406p88
$$ 1878 9193 1210 -1939 -688 -654 1506 -1569 551 8454 2991 -4350 -3692 -4354 -1166 1240 452
318D52L578l659q616L776M874K714J441m103K35J791m857J386L664j971K088j013
$$ 452 4030 371 -8245 -4469 405 3119 4560 457 692 2483 -2374 -988 2676 705 2793 1780
334A780l996K100o92j326Q37k789M120L969n529k9K084l523J143K320M021L727
$$ 1780 -2216 -116 -808 -2134 -1297 -4086 34 4003 -1526 -1555 529 -2994 -1851 469 4490 8217
350H217q611m997N692P02j3O61m12K115n335o043O922L920l170k66q20J672J62
$$ 8217 -394 -5391 301 1003 990 1651 1239 3354 -1981 -8024 -1102 2818 -352 -618 -1438 234 396
367C96m813M652M711m826j212K099J469J737n712k198N772k65j574P53j764j16
$$ 396 -4417 235 4946 120 -1092 1007 2476 4213 -1499 -3697 2075 1810 236 989 -775 -891
383h91k013k184N881K027l270P77j939m93K281j250K845L414l621k127q20j8M577
$$ -891 -2904 -5088 793 2820 -450 327 -1612 -2105 176 -1074 1771 5185 1564 -563 -1383 -1401 3176
400C176j300l933K467m3j368L86k494K048K106l004J811J504j881P57j455J016
$$ 3176 1876 -2057 410 367 -1001 -615 -3109 -1061 1045 -1959 -148 1356 -525 232 -1223 -207
416b07L477k682r29L513j693k267j446J47N725o18o047J290Q52o07J127j477K350
$$ -207 3270 588 -341 3172 1479 -788 -2234 -2087 3638 3020 -3027 -1737 -885 -1492 -365 -1842 508
433E08K271m463J8K768m09M0q24J156K887m317k847M650Q07j842k128r30M262
$$ 508 2779 -1684 -1666 1102 693 733 -91 1065 3952 -365 -3212 1438 2245 403 -1725 -2655 1607
450A607K20n550J447K153k25O19j140J692J537m422M73M331q86q70j032L20K386
$$ 1607 1827 -3723 -2276 -123 -348 271 -869 823 2360 -2062 -1589 2742 1856 986 -46 274 2660
467B660l360k783M156J195j360j845k222L205J460l382J718J613j273O32p38P33
$$ 2660 -700 -3483 673 1868 508 -1337 -3559 -354 1106 -2276 -558 1055 -218 414 -324 409
483D09K100l378J98L447r78j507j296j90L117q14l694J937Q16n7m88k779K368
$$ 409 2509 -869 -671 2776 1798 291 -1005 -1195 1922 1108 -2586 -649 167 110 -378 -3157 -789
500g89K451k238N45J135j270N77p31J032K509k788k012K912j85j103j432j287
$$ -789 1662 -576 -31 1104 -166 411 -320 712 3221 433 -1579 1333 1148 45 -1387 -2674
516b674M345j61l985N31J425M52M44j784J030K325k624M48J884j336R4l05K10
$$ -2674 1671 1510 -2475 -1944 -519 -67 377 -1407 -377 1948 -676 -228 1656 320 414 109 319
533C19K045k425k324K289R18m60j159j960K905J091k879J20J419K04J289j679
$$ 319 2364 -61 -2385 -96 822 362 -797 -2757 148 1239 -1640 -1520 -101 103 1392 -287
549b87k14K520j891j60J649j077K97q88j204K664r92k839J836R91j61p03k438
$$ -287 -501 2019 128 -32 1617 540 837 -51 -1255 1409 417 -2422 -586 405 244 -459 -2897
566b897K187K371k080J61L12k67J672j279q25K553j016q86N75q28P23m34k015
$$ -2897 -710 1661 -419 -258 54 -213 1459 180 -645 1908 892 6 581 -247 476 42 -1973
583a973K215O80k521N04L74J237Q1l208J241M160j762k004O99P12J500k138n17
$$ -1973 242 922 -1599 -1095 -721 516 597 -2611 -1370 2790 1028 -976 -277 435 1935 -203 -720
600g20L187j353k687Q03O38N17n02j625K401M05l356P47J545P67K8k249J108K666
$$ -720 2467 1114 -1573 -770 -132 385 -117 -1742 659 1064 -2292 -1545 0 767 795 -1454 -346 2320
618B320j783r64R31k01J165j475n03J829j103j857J331k00K93M01j390J152L99
$$ 2320 537 -427 504 303 1468 -7 -510 1319 216 -1641 -310 -510 -217 184 -1206 -54 345
635C45j830J100J203LQ41j789j079K465j68o36L01j369J324k11k281J454P48j104
$$ 345 -1485 -385 818 821 1662 -127 -1206 1259 1091 455 756 -613 711 500 -1781 -327 421 -683
653f83J97p74J175R40k058N19J904j480KO65M87J156k170j412K727K44j304l36
$$ -683 -486 -1260 -85 855 -1203 -684 1220 -260 -258 407 894 2050 -120 -1532 1195 1439 135 -201
671b01m98J214k83k639J602J907j286m33m51O46J467j986O62K210j200j006L44
$$ -201 -699 515 232 -2407 -805 1102 -184 -617 -1068 -422 1045 -941 -279 1931 731 -275 69
688F9M32J299j589j811K484J47j641J77j86N36M56j884R36J509j036m5k57K16
$$ 69 501 1800 211 -1600 884 1031 -610 -433 -619 -83 373 -1511 -575 934 -102 -147 -404 -188
706a88J613j364l4J606j110o01j57J5J768j125k035J451L85q34J94n86P95J118
$$ -188 1425 61 27 1633 523 -78 -235 -220 1548 423 -1612 -161 224 -610 -416 -1002 -207 911
724I11j971O04J081p28O29k96p60J707k07j572J377k83n90j88o32J623J17k515
$$ 911 -1060 -456 625 -103 526 230 -530 1177 970 -602 775 492 -98 -286 -918 705 822 -1693
742a693P73J273n76L3r42R84J635k021m63K169l32l89n71K31J301r46j411J643
$$ -1693 -920 353 -223 -190 -1132 -148 1487 -534 -997 1172 840 451 -120 111 1412 466 -945 698
760F98n9j204j19k55J193L97k069O58J242n16J37n13M40J565j601q22J606k10
$$ 698 639 -565 -684 -939 254 651 -1418 -760 482 -34 103 -410 30 1595 -6 -828 778 568
778E68M9l13p12J186m02j638J095lj39j3q34J054J027j871J56J156k75M17m22
$$ 568 617 304 -408 778 376 -1262 -167 -170 -309 -322 -1156 -102 925 -946 -790 366 91 508 86
797H6m19J313m93j039R15rJ34j96j331J195N29k083O40Q48k16K07r76N40J315
$$ 86 -333 980 487 -552 363 354 488 292 -1039 156 685 -1398 -758 90 -126 81 -895 -355 960
816I60j314o11J411L0N77j261l51J698o25j337Q41J49J75m37p17P29O17j596L84
$$ 960 -354 -965 446 476 1053 -208 -559 1139 514 -823 18 167 342 -95 -812 -83 534 -1062 -678
835f78J144k66o1j052L59J792p90r75J089K22l3r53m58J458l08j348N26N47k92
$$ -678 466 200 139 -913 -554 1238 448 -527 562 784 751 -202 -660 798 490 -858 -332 215 -77
854g7m53p22J144P46j279J24R85n43N98q58J86J320o57j019P29J02L29m76j332
$$ -77 -530 -1252 -108 638 -641 -517 468 -75 523 -335 -149 1171 514 -505 224 326 655 179 -1153
873a153J398K4r75Q4L51K24J07j014M73J811j478k15Q04l12N52p30j80J114k82
$$ -1153 245 269 -706 -622 -271 -47 60 -954 -481 1330 -148 -363 441 129 681 -49 -229 885 603
892F03j056N52n04N77K3j196O82N80j099L27K14M54J00j035N6J683l92j097P03
$$ 603 -453 99 -405 172 195 -1001 -319 261 -838 -511 -297 157 257 -778 -722 961 569 -528 175
911A75l7P66r53n78J481k51j281M28J46o0J60o49K56P56p94L9L05k6O76q17l16
$$ 175 138 904 -49 -627 854 603 -678 -250 -104 -164 -4 -653 -397 359 -435 -396 -91 -117 559 -258 -574
932e74J386m78n34P10n33K87j54q38Q36N3n38k40J58R9N91m52q1P85m80k6J8j45
$$ -574 812 334 -200 510 -23 264 110 -728 108 161 -377 -617 -459 -360 231 -221 -302 483 3 -23 -5 -150
954a50Q12k70r33R36K68p86Ok73M92L72j353N21O68o56j40NM67P95j016m16J482
$$ -150 662 392 -541 395 663 -123 -117 -390 102 474 -879 -358 310 -346 -486 -481 -14 781 -235 -651 831
975H31m07q00N83J18N34m90j197J110L62o69l03j06L20L00j226Q74M05n31R0O3
$$ 831 424 -376 207 325 859 369 -828 282 644 -25 -328 -434 -114 186 -1040 -166 239 -292 -202 -139
995a39J36N88o25n62J469m09m49K78j25L32j65r67N09L38m21J8k43K74L20o51
$$ -139 -3 585 -40 -602 867 458 9 287 162 494 329 -638 -129 209 -212 -194 -437 -163 157 -494
1015d94J18L95J02j26K22m14Q85n15m06Q14q2n82n5l87P27J19j043l0R28om03
$$ -494 -376 19 121 -5 217 -197 688 173 -233 581 499 -83 -138 -525 202 321 -722 -752 176 170 -233
1036b33l26L6Q19o38J42P31r0k38k7j97N70j82j052R26J37n82J65k84M95Kr53
$$ -233 -559 -523 296 -342 -200 531 441 203 176 -21 549 367 -685 241 378 -204 -39 -323 172 174 -779
1057g79J71O60l28J46k00M10L68o05j95O71j90m3K12p13Q65j36o94J68N25p25
$$ -779 -608 52 -276 -130 -330 80 448 -157 -352 319 129 86 298 -415 450 314 -380 -212 313 -412
1077d12J60k35J72O43o04J22K23j8j4p8n0Q62p63l40L82L30j27l11j77L20P0q18
$$ -412 -252 -487 -315 328 -276 -154 69 51 37 -41 -91 771 8 -332 50 380 253 -58 -235 85 155 -663
1099f63O64K0l37K26l43J34N87m63J6L49m8K2J11n07O61J9q97O35k1J32j52o16
$$ -663 1 21 -316 -90 -433 -299 288 -175 -159 190 142 164 275 -232 429 448 -449 186 165 297 145 -471
1121d71M38L27o07M9K51j2O2k82k07R97m11o04N98l4R7K89r63R51j96p10N07l
$$ -471 -33 294 -313 -264 -13 -25 37 -245 -452 545 134 -470 128 94 191 480 -483 468 272 -438 69 66
1143F6J11k49l84J96O65p21J53K20k62L78l01j86Q04q4p82N60j65j36J28l74O25
$$ 66 177 -72 -456 -260 405 -316 -163 57 -205 173 -128 -314 490 406 -376 184 19 -117 11 -363 262
1164B62N6n51M4J45R7q0l87K75M87o80J61K33j52L50nn48O82k63j87J39j51L71
$$ 262 318 -233 -189 -44 53 -27 -414 -139 348 -332 -171 62 -90 260 255 -293 389 126 -61 78 -73 298
1186B98j89p84P16N69o94j91K82j30K13l21J28M53k13l49L53j53J00k08k18P18
$$ 298 109 -675 41 610 -84 -275 7 -123 90 -231 -103 350 137 -212 141 -12 88 -120 -338 380
1206C80R0n90J63j19n8K26p74O24J92n29R7J69K60K36p93K48N08k12j61N55o79
$$ 380 470 -120 43 -76 -134 92 -682 -58 134 -395 -298 -129 131 367 -426 -178 330 118 -43 512 -167
1227a67K84P0k44K78%m49K12j24K5N2o20L81O02n80M8K68k7M02j54m84P03l69
$$ -167 117 187 -57 221 221 -228 -16 -140 -115 -63 -683 -302 300 -280 -232 36 9 411 257 -227 476 107
1249A07j41K59o4K16k00n73L10L59n60J1M37k23K86m36k07O91j98J56k25j25O01
$$ 107 -34 225 161 377 177 -396 -86 273 -287 -276 161 -62 224 -212 -419 272 74 230 5 -120 481
1270D81l68m50P63N4n11k0p6L81J87r18L24J42n41M74k20K88M44n60j42N55J05
$$ 481 113 -337 426 480 -31 -51 -127 254 441 -477 -153 -11 -552 -78 -298 -10 434 -126 -268 287 392
1291C92l87j77J73O32m40m48L48Q4l68qp1N32j54p71K76L81k32kJ11O4K59k83
$$ 392 5 -172 1 633 193 -255 93 177 -191 -199 -270 262 108 -663 -387 -6 -238 -240 -129 -65 194 -89
1313h9k22P61j2l88Q8r2J68n1m60M37l1r6n7j47J1L48l51L9L39j95j65L75k22
$$ -89 -311 450 438 50 138 46 214 163 -297 140 109 13 -44 -191 -180 168 -183 -144 195 0 -165 210 -12
1336a2Q16m46m67N10k13k11J34l62L92Jm42L95Rn7l83r4K06M20o27R6M01Q0M5
$$ -12 804 358 -109 401 188 -23 111 -251 141 142 -300 95 104 47 -336 -430 -224 196 -431 -335 66 146 191
1359A91k00l1L46n7o30M18L09o11m8j05M80J96p07J87L61j33R4j14k34R01p53
$$ 191 -9 -40 306 249 -381 37 346 -265 -313 -418 62 258 -449 -262 99 -34 60 -54 -288 613 -140
1380a40k07O82j56j81j62J51J93J6o16O11j16l33K66l58J6M04m01J3M11k70K27
$$ -140 -347 335 179 -2 -164 -13 180 196 -420 191 75 -258 8 -350 -334 70 -331 -318 93 -177 50
1401E0Q9l15O07k58l63K05K37j00o5n01K14N41l87K1J49j16j58K43j82M66m61
$$ 50 139 -176 431 173 -190 15 252 152 87 -414 -200 341 -46 -25 124 8 -150 93 -89 377 -84
1422h4l2L46k08L20k53k89Q64m51j87l0M18k41j68m31N81K1j96j46K99l14K00
$$ -84 -116 230 22 342 89 -200 664 213 26 -4 414 173 5 -426 155 176 -20 -166 133 -181 19
1443A9k42oK66J44l80N41k37J95l68J58K81k60k62J98J1j20K4k09j7M25l07r5
$$ 19 -223 -229 37 181 -199 342 105 300 -68 90 371 111 -151 47 58 -62 -38 -247 -264 161 -146 -241
1465b41N22n11L28O4o9K24P2p38M07J06l44M28k96J38L32q24J09K38M9j34j57
$$ -241 281 -230 98 162 93 317 389 -349 58 164 -180 248 -48 90 422 -402 -293 -55 -6 -140 -297
1486b97K1N06l74r1L44r4l7K42j95J32J3j19k80M3N77l12j89j41M69n74M38O0
$$ -297 -276 230 -144 -235 109 15 -22 220 25 157 170 51 -229 -186 391 79 -110 -251 218 -356 82 142
1508A42l05J98r9j38N01J80o40J24J07J38on76N67j97j40n8o4O83m02l61J99L51
$$ 142 -163 35 -64 -202 299 479 -161 -37 70 208 202 -374 193 -4 -144 -202 -266 417 15 -346 -147 204
1530B04j71j45j23L17J58j60l77Q14k99n33N53k67L20j24n00L12O1k98J97J34
$$ 204 33 -112 -235 82 240 80 -297 517 218 -315 238 -29 291 167 -333 -21 40 -258 -61 73
1550G3n20N04l62j86Q93m72k6Q5j16O15l72k19N76k59j47J71l75L85k1o49M42
$$ 73 -447 57 -305 -491 402 -70 -96 -11 -127 488 116 -103 473 214 67 238 -137 248 227 -422 20
1571B0l3k19K60j87K09Q1l85J60J62k91J41p7J65J83N0m08J55K22p5k11Q5J28
$$ 20 -13 -232 28 -159 50 131 -254 -94 68 -223 -82 -159 6 189 239 -169 -14 208 133 -78 7 135
1593A35j18k68r9L24N0l35K58J51K22k08k34J13K34l91M6m6Q2K88p10O02J37k22
$$ 135 17 -251 -350 -26 24 -311 -53 98 320 112 -122 -9 225 -166 -120 -166 -84 204 -506 96 233 11
1615A1j70J01J30j23m51L79L20k16j15R2mM89k77l56M20J43o01L27j28M0rk13
$$ 11 -159 -58 72 -51 -502 -123 197 -19 -134 -42 -46 443 166 -190 230 373 -228 99 -29 11 2 -211
1637b11J47J38j34l4m0r4K30k11q2K20l9K52j47O6J38m5m65K99O0k98K93k61L47
$$ -211 -64 74 -60 -94 -134 -228 2 -209 -291 -71 -110 142 -5 61 199 154 -311 -12 48 -250 43 -218 129
1660A29K1l44r5J45J55l36L05l0K37l43Q3L61k19J14N3q2kJ03k04j7K66m37K13
$$ 129 150 -194 -289 -144 11 -325 -20 -50 187 -156 -73 288 69 183 236 154 152 255 51 34 300 -137 76
1683G6j79j46K30j88J42K22q4j80J06J45j55J04m19N67j6m33K94k12J34O4j01
$$ 76 -103 -249 -19 -207 -65 157 73 -107 -1 144 -11 93 -326 241 225 -208 86 -126 8 72 -29
1704b9R2J46j22k58j16K78p6j68j2J71K73J33m28o0N65k53k27K07Q8p3n08K38
$$ -29 63 209 87 -171 -287 -9 -85 -253 -265 -94 179 312 -116 -176 389 136 -91 116 204 131 -377 -139
1726a39K55K81m89j08k9J65J9J40j47J69k68KM37k70QK46m32L70Q3j11j77j56
$$ -139 116 397 -92 -200 -229 -64 -45 95 -52 117 -151 -149 288 18 26 272 -160 210 293 182 5 -151
1748a51M83l47j69J46K79m01K34k8j31K40m60l9N26k96P2Q2J14k55K51n70Q63
$$ -151 332 -15 -184 -38 241 -160 74 46 -85 155 -305 -344 182 -114 -42 40 154 -101 150 -420 443
1769D43l83j89P9o1L3m7J21j0M6j94k4K51k42M63m19j82K27J13j61j27L50J23
$$ 443 60 -129 -50 -111 -78 -125 -4 -14 32 -162 -186 65 -177 286 -133 -315 -88 25 -136 -263 87 210
1791B10k51k34K80M16o84J02J37J33m07J57J98K36k16m0n4J53j14O5j13J93J03
$$ 210 -41 -275 5 421 -263 -161 -24 109 -298 -141 57 293 77 37 -17 136 22 87 -26 167 270
1812B70o28K45J36K44j98o9M1P4j90k8J55j45J09k18k84P86j71j42M5L7j64Q5
$$ 270 -358 -113 23 267 69 0 41 115 -75 -103 52 -93 16 -202 -486 300 129 -13 32 69 -95 -10
1834a0j90M49p8k02LJ4j03j1N0pK2r3P0j56K68J74l71j58M61M4k2j35K1N1j71
$$ -10 -200 249 171 -31 -28 -14 -117 -128 -78 -85 -63 -156 -86 -242 26 200 -171 -329 132 176 154 19 40 91 -80
1859h0j98J00J38j57J51n5J20O5n09L56j4J37k09L80k03j08K7J11n2n9R0j25r5
$$ -80 -278 -178 -40 -197 -46 -101 19 84 -425 -69 -83 54 -155 225 22 -86 -59 52 0 -59 31 -94 -189
1882a89K83j36q0J88K11k32k88M33j17j60l67J82N34j42j90L9K70j26l1k14J38
$$ -189 94 -42 -122 66 277 45 -243 190 73 -87 -454 -272 262 120 -70 -31 239 113 82 -132 6
1903FO7l40K22K5M9p4k25L83%k78M5Q2kK82m15K40O6j74j99K75J38Q4kk79k4J78
$$ 6 73 -267 -45 -20 29 -45 -270 113 113 -165 -120 -38 -40 242 -173 67 133 -41 -240 35 173 257 255 -24 -48 130
1929A30k43J6p3M5L29o88L81O5J20o1l27K41K99k15j29L59j71j44J69j74j1N24
$$ 130 -113 -97 -170 -125 204 -484 -103 -38 82 21 -306 -65 234 19 -110 249 78 -66 103 -71 -82 442
1951D42o69K16L8J83l93L0mK41q3k33J59K12k21k6K86j46J34j62j74K08L6J8k95
$$ 442 -227 -11 27 210 -183 -153 -157 84 1 -232 -73 139 -82 -108 178 32 166 4 -170 38 74 92 -203
1974b03K84q0m01L17j4K29k99J96l2K66m41J23K87m89M35q9j64L65m14j00J21
$$ -203 81 1 -400 -83 -97 132 -167 29 -3 263 -178 -55 232 -257 178 89 -75 290 -124 -224 -103
1995a03O0k2r8o1M03k23L29l87K34m93O08M3o02N53j57q8q7J53k7Q7k77K43K66
$$ -103 -43 -65 -163 -224 179 -44 285 -102 132 -361 247 290 -312 241 84 -4 -91 62 35 122 -155 88 354
2018C54m93J30J43N0m34j05L40J92l27j48J93j15K54J6j06M41k34p6k17M75j99
$$ 354 -139 -9 134 184 -250 -355 -15 177 -150 -298 -105 -220 34 50 -56 385 151 75 -142 333 134
2039A34J49m64K32J46j56J37q1j00J6j17K71k45o5o4L11j9Q0k1j92J96J51l11
$$ 134 283 -181 51 197 41 178 97 -3 13 -104 167 -78 -143 -207 104 85 165 144 -48 148 299 -12
2061a2J5J75k16O7k99K33K43m05P4M4R8j9l14P2K43p8o7L21j60m2P3k2rK33k48
$$ -12 3 178 -38 29 -270 -37 206 -199 -125 -81 17 -2 -316 -244 -1 -79 -146 175 15 -27 46 24 15 248 0
2086@k3K34j35j5j95R2N0k45M9M35m7j74J0P4L4K5l32j11L82j32N1n8J92q7k51
$$ 0 -23 211 76 61 -134 -42 8 -237 -188 247 200 26 36 110 144 169 -163 -274 108 -24 27 -31 161 74 -177
2111a77o9P1K27Q8k78Q3K10q4q2J36j99O9m1r9L44J39o59K78j98N75k14n96M99
$$ -177 -246 -175 52 140 -138 -55 155 71 -11 125 -74 -5 -46 -145 199 338 -321 -43 -241 334 120 -476 23
2134B3K29o38J34K58K7J78k46j02J12l7l68L90Q7K36k05j30K08J2J83m67k29M76
$$ 23 252 -386 -252 6 33 211 -35 -137 -25 -62 -430 -40 47 283 78 -52 156 168 351 -116 -345 131
2156A31k10J24K3j64j30M20j48m2Q2m7L1R9j78J60o1k27O5K03J9l71K61J12k70
$$ 131 -79 45 68 -96 -226 194 46 4 86 39 70 169 -9 151 90 -137 -72 131 150 -221 40 152 -118
2179a18K06j50l1R1j79K27J60m45Q4M40p8k85o5M94j37l58Q3l4R3K15k83J77J55
$$ -118 88 -62 -93 -2 -181 46 206 -239 -155 285 207 -78 -143 351 214 -144 -61 -95 -2 213 -70 107 262
2202B62j53k25n6L11j76J39m29N37j6n3l8Q6K03k48K5j90L3j41J69k7L7N7m34
$$ 262 109 -116 -172 139 -37 102 -327 210 194 141 103 189 392 144 169 -21 12 -129 40 13 50 107 -327
2225c27K45K17J07k48j45P7J31l68J20M32k29J65k44m2L7L05n20R3K31n9J18l10
$$ -327 -82 135 242 -6 -151 -74 57 -311 -191 241 12 177 -67 -109 -72 233 -287 -194 37 -22 96 -214
2247b14J23j9K75k30J85k82j46K99k48K97j46M6r4K80k07jK86K0l0l27O5L7j41
$$ -214 -91 -110 165 -65 120 -162 -308 -9 -257 40 -106 -60 -154 126 -81 -82 204 224 194 -133 -68 -31 -172
2270a72O6m0J24J21k78L11J43j84k79L3j13N42n36q9L58M77m44p4k19N3K80k84
$$ -172 -106 -146 -22 99 -179 132 275 91 -188 -155 -268 274 -262 -351 7 484 40 -34 -253 -200 80 -204
2292b04L64q8q9j3J64p7NN9l41L68k43N4K48k29J6K35k46O9j22j88K83l6J35P9
$$ -204 160 72 -17 -30 134 57 62 121 -220 148 -95 -41 207 -22 -6 229 -17 52 -70 -258 25 -11 124 203
2316B03l19O1L9k27K05J04o3J77j97L10k09M4P0k23J8J60M8j93R2N8j20j20m6
$$ 203 -116 -55 -16 -243 -38 66 3 180 -17 293 84 128 198 -25 -7 153 201 8 100 158 38 -82 -128
2339a28j3P9RN3Qj40P5N8K25j76J6k20L33j73Q4j84N9J10k06J58QK10k44L9n6
$$ -128 -141 -62 -53 0 8 -132 -57 1 226 50 66 -154 179 6 90 -94 -35 75 -131 27 35 245 1 40 -16
2364a6j58r0j60M15K26m4j24J22l89j38M75j47l0N3j08K3JR8J25k10R9P9j67o4
$$ -16 -174 -264 -424 -9 217 173 49 171 -218 -356 119 -28 -58 -5 -113 -90 -89 9 134 -76 23 102 -65 -129
2388a29o5j61L50p8j61K01K22k4k56jj5K91j54J73j09J24j46j78j2L21j07L2k23
$$ -129 -194 -355 -5 -83 -244 -43 179 155 -101 -102 -117 174 20 193 84 208 62 -116 -128 193 86 118 -105
2411a05J52L0K5k14K38k60J78J21q8%L5k33n8L37k21k99L98k19o9J30j06L65J56
$$ -105 47 77 102 -112 126 -134 44 165 77 77 112 -121 -179 158 -63 -362 36 -183 -252 -122 -228 137 293
2434B93k26j73K08K6l34J89l5K52j39J01m02K47J02k71J42o1jp5K02j40M8N0K21
$$ 293 67 -106 102 128 -206 -17 -52 200 61 162 -240 7 109 -162 -20 -81 -82 -157 45 -95 -47 3 224
2457B24n6j83j60L08r7J58n09J65o3N84m18k20j03O16j92j23P9MJ58l69J34k90
$$ 224 168 -15 -175 133 36 194 -315 -150 -213 371 -47 -267 -370 246 54 -69 10 14 172 -197 -63 -353
2479c53L74j58R8N3j30p3J69j5k13O23m79P9j23p8R3j85J24K98k19L5J23Q7l77
$$ -353 21 -137 -39 14 -116 -189 -20 -35 -248 375 -104 -25 -148 -226 -133 -318 -194 104 -115 -80 43 130 -247
2502b47J28L8JJ95l35M17k07J42k68J38Q0j21j13L16o1j79j10J81P0M0r4j94K15
$$ -247 -119 -81 -80 115 -220 197 -10 132 -136 2 82 -39 -152 164 103 -76 -186 -5 65 105 11 -183 32
2525C2j35p9M05q8r8p6j45K63J50k15j5j42K3L78o31J22K31k24J86k00o0O64o93
$$ 32 -103 -182 223 135 37 -39 -184 79 229 14 -1 -143 -120 258 -373 -251 -20 -244 -58 -258 -318 346 -347
2548c47L59m5lL7k10Q2K13J0r4q9J61j11k92J91j8Q5M5J17n5l4j28L32k45L35
$$ -347 12 -33 -36 1 -209 -127 86 96 2 -87 74 -37 -329 -138 -156 -71 -26 91 36 2 -126 206 -39 296
2572B96r0j83L4m6L7j45p3K24q5j1J29J65l15n4R5k4J65m52J85K85k5J80m83k8
$$ 296 206 23 57 11 48 -97 -170 54 -31 -42 87 252 -63 -117 -22 -46 119 -333 -148 137 112 292 -191 -219
2596b19J6J77J40l23K81j40l1j12O0M03m50l7L52O8j41M5L7k47J03j65K30k2M0
$$ -219 -203 -26 114 -209 72 -68 -99 -211 -151 252 -198 -235 117 185 44 89 126 -121 -18 -183 47 25 65
2619F5q3l61M70K41o53K78o2J52L8Q6j71K53n0j96K66k03L01j30o7o2j43k99K64
$$ 65 -18 -379 91 332 -321 -43 -105 47 85 171 0 253 203 7 273 70 371 241 174 112 -31 -330 -66
2642f6J47Rj05J2J40j15j41O0K5r1M35l80j78K16J81k93k5K05j76N0K55k72L82
$$ -66 81 90 -15 -3 137 22 -119 -59 -34 -125 310 -70 -248 -32 149 -144 -169 36 -140 -90 165 -107 275
2665B75k4k61j42K71j71qJ99m64J36j5J14K2J25k24M0L58r1l34L25KJ17j56O0
$$ 275 251 -10 -152 119 -52 -60 139 -325 -189 -204 -90 -68 57 -167 -127 231 140 -194 131 133 250 94 154
2688A54n5L0l82K46J56j30k51J69K8N1j61M32j71kN1j02q8J4K27l71J52R5o7Q3
$$ 154 99 129 -253 -7 149 19 -232 -63 -35 16 -145 287 116 114 165 63 -25 -11 216 -155 -3 92 25 108
2712A08o4j34L37j10Rl11J69P4k24O3P7J47k15J30j0q6J94j42r4N0J79k23j25
$$ 108 44 -90 247 137 146 -165 4 78 -146 -83 -6 141 -74 56 46 -40 154 12 -82 -32 147 -76 -201
2735b01K3O1J35q4K01j2N2k6o0j01k30L72o4K31l53M6k2l5J99j74P2j17K01j77
$$ -201 -178 -117 18 -66 135 123 175 149 89 -12 -242 130 66 297 -56 -10 -32 -67 132 -42 30 -87 114 -63
2759f3K80j18j14j45l0n1L07l48L24j69M34k76m6J83J08l44j33K84K29o9K3m6
$$ -63 217 99 -15 -160 -190 -241 66 -282 42 -127 307 31 -15 168 276 -68 -201 83 312 243 266 220
2781B20k86j6%N5j38J67j69K00o0J3r1N3L56n04L81j43q5J03J88k28j83K99k51
$$ 220 -66 -82 -82 -27 -165 2 -167 33 -27 -14 -105 -52 304 -200 181 38 -47 56 244 16 -167 132 -119
2804a19J94j48R0k77J01O6L66j86o4n8P3o4P1l0k00J82J41j64J65O4m9j94J56
$$ -119 75 -73 17 -260 -159 -93 273 87 23 -35 38 -26 45 15 -185 -3 138 -26 139 203 154 -40 116
2827A16nj17k24K28M2p7O4l25K91J46m0j78K51j14l81K89k6j28L70k64J81l84
$$ 116 111 -6 -230 -2 40 -37 27 -298 -7 139 99 -79 172 58 -323 -34 -60 -188 182 -82 99 -285
2849b85J70K9K30p5k42L8q4K61J83p4j95k5K30j03k20L98j38j81j32L08j42L69
$$ -285 -115 -86 144 69 -173 -135 -219 42 225 151 -44 -69 161 58 -162 236 98 -83 -215 93 -49 320
2871C20m78L54k59J12j97L02l6nP7l58J6J1K59j46J23j73J68J07j43L9j04R6M8
$$ 320 -158 196 -63 49 -148 154 118 113 190 -168 -152 -141 118 -28 95 -78 90 197 54 93 -11 85 133
2894A33j25J78l04n3J81pM0j89j48K45l9J08J83k80J64q9J25j99J72j00J5J01
$$ 133 8 186 -118 -171 10 3 43 -146 -294 -49 -88 20 203 -77 87 -2 123 -76 96 -4 11 112
2916A12l20K74J90n23K35L2L6j23K19K2ok8N6k94n4J86J0P8J27o0J35l61J46l30
$$ 112 -208 66 256 -267 -32 0 36 -87 132 154 148 120 176 -118 -172 14 24 102 229 169 304 -57 89 -241
2940b41K19r7L98l91m2L36j06j11K04j55l2K41j10k10L73j52j17J3o8J16n8L3
$$ -241 -22 -119 279 -112 -154 182 76 -35 169 14 -18 223 113 -97 276 124 7 20 -48 68 10 43
2962D3k57L21k76J4j54J95L33k85L56p4k91o4L3K24J8l01J78J79r4J34j52j22
$$ 43 -214 107 -169 -155 -309 -114 219 -66 290 216 -75 -139 -106 118 136 -165 13 192 98 232 80 -42
2984d2O1K9m6J54k37k9J37L26l96J30j90K8J18j12J75J55L8k6k12l22L55J3q1
$$ -42 19 48 2 156 -81 -110 27 353 -43 87 -103 -75 43 -69 106 261 299 273 61 -261 94 107 26
3007B6l6R5K63l4m14J54M4j22J21K40k03k12J38j32L66k61n0LJ23L0l37q1j48
$$ 26 -10 85 348 314 -100 54 98 -24 97 337 134 -78 60 -72 294 33 -17 -14 109 139 -198 -279 -427
3030d27M41J47o7q9J90k91K1J69J06m38K40j18J31L57m21M2j36r8K41j8k45K27
$$ -427 14 161 94 5 195 -96 -75 94 200 -238 2 -116 15 372 -49 -7 -143 -241 0 -18 -263 -36
3052c6P9l67L18J49m93L57N4L05l99J36j48K93k52k71K05J43j44N6j7K5K67r1
$$ -36 43 -324 -6 143 -350 7 61 366 -33 103 -45 248 -4 -275 -70 73 -71 -15 -32 -7 260 169
3074A69q2M8k02o4K40k08k4K66j32k14J43o6K25M02m16k73M70o3Jo1k13J43k1
$$ 169 87 135 -67 -131 109 -99 -123 143 11 -203 -60 -126 99 501 85 -188 282 219 220 159 -54 89 68
3097F8j70J99k0k00M20k45l63M72M2k77pO9Q4k64M1J61K5j15J23p0j45M38k71
$$ 68 -102 97 77 -123 297 52 -311 161 203 -74 -81 -12 72 -192 -151 10 35 -80 43 -27 -172 266 -5
3120el19M51k69k8r1J60J33M1Rj48K66O7l78r1k4M44k85J01J60j56lj54K29k1
$$ -5 -324 127 -142 -170 -261 -101 32 73 82 -66 200 267 -111 -202 -226 218 -67 34 194 38 35 -119 110 89
3144H9j86n0J28j0K11m90J30J45J52j72l3J48J05j88n6K63R3j03q9n0l60M33l41
$$ 89 -97 -147 -19 -29 182 -308 -178 -33 119 -53 -86 62 167 -21 -77 186 279 176 87 37 -323 110 -231
3167b31L39Qj81j20N1J25Qp1o1J27J99k48J28Kj87M51l27j16J82k9j76K47k38
$$ -231 108 116 -65 -185 -134 -9 -1 -72 -133 -6 193 -55 73 75 -112 339 12 -104 78 49 -127 120 -118
3190a18k1K96n30O20j88l66L18J97j29j67K6J31Q7P5m10M26l58J69j04l8R1Rk31
$$ -118 -139 157 -373 247 59 -307 11 208 79 -88 -62 69 156 231 -179 247 -111 58 -46 -84 7 16 -215
3213b15J19K56k72O0o8L04p2k68K95j4q3j14qJ32J35rj35O3j56K46k58j16J1J63
$$ -215 -96 160 -112 -52 -120 184 112 -156 139 125 42 -72 -80 52 187 178 43 106 -50 196 -62 -178 -167 -4
3237dj26J68L9J6O4k2j24K38l23K50j92L15j45l47K32P4k26l01L36K93k51J7m4
$$ -4 -130 38 77 93 157 135 11 249 -74 176 -16 299 154 -193 39 113 -113 -414 -78 215 -36 -19 -63
3260f3J08J03l02O1Q8j52J26O3k0K40k35J00J9k20K82k96O6K40J51m38J17j00
$$ -63 45 148 -154 -93 -5 -157 -31 32 12 252 17 117 136 -84 198 -98 -32 208 359 -79 38 -62
3282f2J75n2j66O3QJ4%Jr9J83qR2O0q6m9j57j43N1J78k40L83k66J82K9n9j25N6
$$ -62 113 61 -105 -42 -34 -20 -20 -19 -118 65 57 149 209 123 74 -83 -226 -175 3 -237 146 -120 62 91 32 -93 -37
3309c7m16K83L47j06Pk4P8Q9k33J4J97k39j30q0L17J1j56j45J77L37p30M25J91
$$ -37 -453 -170 177 71 78 54 132 221 -12 2 199 -40 -170 -250 67 78 -78 -223 -46 291 -439 -14 177
3332A77k63M03p49N20j75J70j21J4J47P4k29k44L96O4j48o3j91L42n7k93J07K37
$$ 177 -86 317 -432 88 -87 83 -38 -24 123 197 -32 -276 120 184 36 -27 -218 124 67 -226 -119 118
3354A18l34K45J33k76L68n21O0L43o5j5q4k22N31l02l56M98j24q5O5KJ17k88K56
$$ 118 -216 29 162 -114 254 -267 -207 136 71 56 -28 -250 281 -21 -377 121 -3 -88 -23 -21 96 -192 64
3377F4PJ53k83J8n0K3J24p5j03mK05k96K10K2%Q1l52J65J55j05k36J52K30l2r3
$$ 64 71 224 -59 -41 -91 -68 56 -19 -122 -126 79 -217 -7 15 15 96 -256 -91 64 -41 -277 -125 105 73 -20
3402b0m8L10o7m7k78J46J64k15r9oM17r3l97R1J69J0j95KM32n08J42K01l8J57
$$ -20 -68 242 175 128 -150 -4 160 -55 -154 -160 257 164 -233 -142 27 37 -158 -156 276 -232 -90 111 73 230
3426B30l52n0K03J32j85l38M70j15J63j85j58J57p2j62L32o2M6r6J10K44m18L00
$$ 230 -122 -172 31 163 -22 -360 110 -5 158 -27 -185 -28 -100 -262 70 8 54 -42 68 312 -106 194
3448A94l16P8R9J80k12j10J92L14m07l89N07Kk59K29k41j31O2N3J75Q2Orj18O6
$$ 194 -122 -44 55 235 23 -87 105 419 12 -377 130 132 -127 102 -139 -270 -208 -155 20 102 108 99 -19 47
3472D7pQj85L02l42J35j11J35k48L05lj71J92j32K76J39R4j25k98j03K40j08j24
$$ 47 40 48 -137 165 -177 -42 -153 -18 -266 39 36 -135 57 -75 201 340 434 309 11 -92 148 40 -84
3495h4N1L05J41n71L00n9M8l27N4j75L26j36J93q7K50o82K48L80k58j50l4K86
$$ -84 -33 272 413 -158 142 83 131 -196 -142 -317 9 -127 66 -21 229 -453 -205 175 -83 -233 -267 19
3517A9n2L76n91L17j94j22P4L18j41j08N2M4J31Q5k16N3n5L00j75k04p2L49pk22
$$ 19 -33 343 -248 69 -125 -247 -173 145 4 -104 -52 -8 123 208 -8 45 -10 290 115 -89 -161 188 181 -41
3541d1p8J12k48R2L21k98K47Ok83m5K3J36j85M89k76L09k73J45l0k01j4J88Ro1
$$ -41 -119 -7 -255 -163 158 -140 107 113 -170 -215 -192 -56 -241 248 -28 281 8 153 123 -78 -92 96 105 44
3565D4j07O3J50l51j65K97J81p1k7k40K01M56l91K6N5j32nq7MK20n9l49M24l80
$$ 44 -63 0 150 -201 -366 -69 112 41 14 -226 -25 431 40 66 121 -11 -16 -103 -99 121 62 -287 137 -243
3589b43M03j16J0k3K4k35L48l08O7L24k15r4j6K5j35J56L8Q7l50J45L0L47l85
$$ -243 160 44 54 31 55 -180 168 -140 -73 251 36 -58 -74 -49 -184 -28 10 97 -253 -108 -78 269 -116
3612a16oJ61Qm3R1J13l23Q6lk2J01J29j55K15K4m31J59R5j06P9Mk98P8K40n7j34
$$ -116 -122 39 47 4 95 208 -115 -29 -32 -54 47 176 21 236 260 -171 -12 83 -23 56 60 -238 -160 80 23 -111
3638a11j99K15q0K0QJ73kq6nJ70o2K72l22J50j01K3M7J03k52j79k1N3J75k22J86
$$ -111 -310 -95 -175 -155 -147 26 24 -62 -67 103 41 313 -9 141 40 63 110 213 -39 -218 -239 -186 -11 -233 -47
3663d7j04R5Q1l06L12J3K47k17j32J92j5j91Q6J16p0j4k36J72k57J07j7L6N0n1
$$ -47 -151 -56 25 -281 31 44 291 74 -58 134 119 -72 14 130 60 46 -190 -18 -275 -168 -185 -149 -99 -150
3687a50j16J28L0R5j65J83j73L94m91K46j19L79j30j78J29j35l5K80l95J08J32
$$ -150 -266 -138 -108 -13 -178 5 -168 226 -265 -19 -138 241 111 -67 62 -73 -108 172 -223 -115 17
3708A7k23K06K02l03K11j64L7J00o0l40K77J51k00K81l40L15l14qJ66r8J35j50
$$ 17 -206 0 202 -101 110 -54 -17 83 23 -317 -40 111 -89 192 -148 167 -147 -155 11 -87 48 -102
3730a02Q5J50l50R4J19l8K42J21m57j09J1L9J21L80j55l06L7j04K14J04m19K02
$$ -102 -17 133 -217 -123 -4 -42 200 321 -136 -245 -234 -195 -74 306 151 -155 -118 -222 -8 96 -323 -121
3752a21K32l20K44l9j50M36j52l09J27J20K00k35j77M9J79J15oo09M51kl02J59
$$ -121 111 -209 35 -4 -154 282 130 -179 -52 68 268 33 -144 -95 84 199 193 -416 35 33 -269 -110
3774a10j1J10P4N9l7k3M2o1KK5j14n8k3J59M8l12J01R2K40k62J95j82K2j34K67
$$ -110 -121 -11 63 122 85 62 104 43 45 70 -44 -102 -125 34 82 -230 -129 -37 203 -59 136 -46 -24 -158 109
3799A09o4Q1j64J09o2k59O9K56N6j34j10j20K73j84K01m0J73k3m14M76k45J82
$$ 109 45 126 -38 71 9 -250 -181 75 131 -3 -113 -233 40 -144 57 17 190 167 -247 229 -16 166
3821A66l00J7K40O6l34o4J02K6K35l20Q2L22l18J26j88J65q0J01n9J40k21j06
$$ 166 -134 -117 123 189 -145 -209 -107 -81 154 -166 -84 238 -80 46 -142 23 -57 44 -15 125 -96 -202
3843b02J23kJ23o9L87l48k66K77r7R1j75J42M6k63L8J20J11l89M31J55m44J46
$$ -202 -79 -81 42 -27 360 12 -254 23 -74 17 -158 -16 30 -233 -195 -75 36 -353 78 233 -211 -65
3865f5J57J38j30j65J28N6p2J61Lj24j01m2K36j32J16n04L04J78j91k03L02k36
$$ -65 92 230 100 -65 63 119 47 208 211 87 -14 -56 180 48 164 -340 -36 142 -49 -252 50 -186
3887a86K53j04p1l6M9j5K57n6k20L86l41p0K62k37J45k24J81J68q9O4j03L7l02
$$ -186 67 -37 -108 -144 -95 -110 147 91 -129 257 -84 -154 108 -129 16 -208 -27 141 52 116 13 50 -252
3910b52K35j6L05l69K09k52J99Q0k31O2rj78K76oj09J64l07J6J80L08k17j89k98
$$ -252 -17 -33 272 -97 112 -140 59 139 -92 -30 -39 -217 59 53 -56 108 -199 -183 -3 305 88 -101 -399
3933c99O51l10k9Q3J1j60N53q06N63n1j80P8j31K47j03J14l60J77L3M1j48J09
$$ -399 252 -58 -87 -4 7 -153 400 -406 157 106 -74 4 -127 120 17 131 -229 -52 -19 22 -126 -17
3955a7J45j59M9lJ01l7j11O8K58l10Q1r9L62m54J42n9J07jj33j28K53O9j77L7
$$ -17 128 -31 18 15 116 79 -32 36 294 -16 65 -34 328 -126 16 -43 64 63 -70 -198 55 124 -53 -16
3979a6nK21l38J34J60J30l95j02N1K46R8l45j01L24o5J80j90J6J88r3j83K48j86
$$ -16 -21 200 -138 -4 156 286 -109 -211 -160 86 184 -161 -262 62 -3 177 -13 3 191 98 -85 163 -23
4002b3J65k89J97M7n2l14M93j76k4n7L7n2P8k37L60l01r8K96K22j52l26J77j68
$$ -23 142 -147 50 97 45 -269 224 48 24 -33 4 -48 30 -207 153 -148 -246 50 272 120 -206 -29 -197
$$ [...]
8191b62
##END NTUPLES=NMR FID
##END=
