##TITLE=1H_Pr TUr-4
 200.13MHz, CDCl3,
 8 sc
 
 29.8.2025
##JCAMPDX= 6.0         $$ Bruker NMR JCAMP-DX V2.0
##DATA TYPE= NMR FID
##DATA CLASS= NTUPLES
##ORIGIN= UXNMR, Bruker Analytische Messtechnik GmbH
##OWNER= pz
$$ XWIN-NMR		Version 3.5
$$ Fri Aug 29 14:02:57 2025 Russian Standard Time (UT+4h)  she@DPX200
##.OBSERVE FREQUENCY= 200.1313
##.OBSERVE NUCLEUS= ^1H
##.DELAY= (6, 6)
##.ACQUISITION MODE= SIMULTANEOUS
##.ACQUISITION SCHEME= undefined
##.AVERAGES= 8
##.DIGITISER RES= 18
##SPECTROMETER/DATA SYSTEM= spect
##.PULSE SEQUENCE= zg30
##.SOLVENT NAME= DMSO
##.SHIFT REFERENCE= (INTERNAL, DMSO, 0, 14.3821)
##AUDIT TRAIL= $$ (NUMBER, WHEN, WHO, WHERE, WHAT)
$$ ##TITLE= Audit trail, XWIN-NMR		Version 3.5
$$ ##JCAMPDX= 5.01
$$ ##ORIGIN= Bruker BioSpin GmbH
$$ ##OWNER= she
$$ F:/spectra/data/she/nmr/H-C/1/audita.txt
$$ ##AUDIT TRAIL=  $$ (NUMBER, WHEN, WHO, WHERE, WHAT)
(   1,<2025-08-29 14:01:36.28 +0400>,<she>,<DPX200>,
      <created by zg, POWCHK disabled, PULCHK disabled
       configuration hash MD5:
       00 E9 B6 7A A2 85 ED C7 34 08 36 98 17 FE 4E 26
       data hash MD5: 16K
       A4 15 44 F1 E9 63 7E 40 52 3D C9 AE 2E D0 F4 A1>)
$$ ##END=
$$ 
$$ hash MD5
$$ 8B CB 25 B3 4D 71 56 D5 F6 00 C2 58 9D 23 0C 81
##$RELAX= 
##$RELAX= 
##$RELAX= 
##$RELAX= 
##$RELAX= 
##$RELAX= 
$$ Bruker specific parameters
$$ --------------------------
##$DU= <F:/spectra>
##$EXPNO= 1
##$NAME= <H-C>
##$PROCNO= 1
##$TYPE= <nmr>
##$USER= <she>
##$AMP= (0..31)
100 100 100 100 100 100 100 100 100 100 100 100 100 100 100 100 100 100 
100 100 100 100 100 100 100 100 100 100 100 100 100 100 
##$AQSEQ= 0
##$AQ_mod= 1
##$AUNM= <au_zg>
##$AUTOPOS= <>
##$BF1= 200.13
##$BF2= 200.13
##$BF3= 200.13
##$BF4= 200.13
##$BF5= 200.13
##$BF6= 200.13
##$BF7= 200.13
##$BF8= 200.13
##$BYTORDA= 1
##$CFDGTYP= 0
##$CFRGTYP= 5
##$CHEMSTR= <none>
##$CNST= (0..31)
1 1 145 1 1 1 1 1 1 1 1 1 1 1 1 1 1 1 1 1 1 1 1 1 1 1 1 1 1 1 1 1 
##$CPDPRG= <>
##$CPDPRG1= <>
##$CPDPRG2= <>
##$CPDPRG3= <>
##$CPDPRG4= <mlev>
##$CPDPRG5= <mlev>
##$CPDPRG6= <mlev>
##$CPDPRG7= <mlev>
##$CPDPRG8= <mlev>
##$CPDPRGB= <>
##$CPDPRGT= <>
##$D= (0..31)
0 0.7 0 0 0 0 0 0 0 0 0 0.03 0 0 0 0 0 0 0 0 0 0 0 0 0 0 0 0 0 0 0 0 
##$DATE= 1756461695
##$DBL= (0..7)
120 120 120 120 120 120 120 120 
##$DBP= (0..7)
150 150 150 150 150 150 150 150 
##$DBP07= 0
##$DBPNAM0= <>
##$DBPNAM1= <>
##$DBPNAM2= <>
##$DBPNAM3= <>
##$DBPNAM4= <>
##$DBPNAM5= <>
##$DBPNAM6= <>
##$DBPNAM7= <>
##$DBPOAL= (0..7)
0.5 0.5 0.5 0.5 0.5 0.5 0.5 0.5 
##$DBPOFFS= (0..7)
0 0 0 0 0 0 0 0 
##$DE= 6
##$DECBNUC= <off>
##$DECIM= 32
##$DECNUC= <off>
##$DECSTAT= 4
##$DIGMOD= 1
##$DIGTYP= 9
##$DL= (0..7)
0 120 120 120 120 120 120 120 
##$DP= (0..7)
150 150 150 150 150 150 150 150 
##$DP07= 0
##$DPNAME0= <>
##$DPNAME1= <>
##$DPNAME2= <>
##$DPNAME3= <>
##$DPNAME4= <>
##$DPNAME5= <>
##$DPNAME6= <>
##$DPNAME7= <>
##$DPOAL= (0..7)
0.5 0.5 0.5 0.5 0.5 0.5 0.5 0.5 
##$DPOFFS= (0..7)
0 0 0 0 0 0 0 0 
##$DQDMODE= 0
##$DR= 18
##$DS= 0
##$DSLIST= <SSSSSSSSSSSSSSS>
$$ [...]
##$SUBNAM0= <"">
##$SUBNAM1= <"">
##$SUBNAM2= <"">
##$SUBNAM3= <"">
##$SUBNAM4= <"">
##$SUBNAM5= <"">
##$SUBNAM6= <"">
##$SUBNAM7= <"">
##$SUBNAM8= <"">
##$SUBNAM9= <"">
##$SW= 18.0517328524113
##$SWIBOX= (0..15)
0 0 2 0 0 0 0 0 0 0 0 0 0 0 0 0 
##$SW_h= 3612.71676300578
##$TD= 16384
##$TD0= 1
##$TE= 0
##$TE2= 300
##$TE3= 300
##$TEG= 300
##$TL= (0..7)
0 120 120 120 120 120 120 120 
##$TP= (0..7)
150 150 150 150 150 150 150 150 
##$TP07= 0
##$TPNAME0= <>
##$TPNAME1= <>
##$TPNAME2= <>
##$TPNAME3= <>
##$TPNAME4= <>
##$TPNAME5= <>
##$TPNAME6= <>
##$TPNAME7= <>
##$TPOAL= (0..7)
0.5 0.5 0.5 0.5 0.5 0.5 0.5 0.5 
##$TPOFFS= (0..7)
0 0 0 0 0 0 0 0 
##$TUNHIN= 0
##$TUNHOUT= 0
##$TUNXOUT= 0
##$USERA1= <user>
##$USERA2= <user>
##$USERA3= <user>
##$USERA4= <user>
##$USERA5= <user>
##$V9= 5
##$VALIST= <valist>
##$VCLIST= <CCCCCCCCCCCCCCC>
##$VD= 0
##$VDLIST= <DDDDDDDDDDDDDDD>
##$VPLIST= <PPPPPPPPPPPPPPP>
##$VTLIST= <TTTTTTTTTTTTTTT>
##$WBST= 1024
##$WBSW= 4
##$XGAIN= (0..3)
0 0 0 0 
##$XL= 0
##$YL= 0
##$YMAX_a= 66071
##$YMIN_a= -58002
##$ZGOPTNS= <>
##$ZL1= 120
##$ZL2= 120
##$ZL3= 120
##$ZL4= 120
##$ABSF1= 10
##$ABSF2= 0
##$ABSG= 5
##$ABSL= 3
##$ALPHA= 0
##$AQORDER= 0
##$ASSFAC= 0
##$ASSFACI= 0
##$ASSFACX= 0
##$ASSWID= 0
##$AUNMP= <proc_1d>
##$AZFE= 0.1
##$AZFW= 0.1
##$BCFW= 1
##$BC_mod= 2
##$BYTORDP= 1
##$COROFFS= 0
##$CY= -3
##$DATMOD= 1
##$DC= 2
##$DFILT= <>
##$DTYPP= 0
##$F1P= 0
##$F2P= 0
##$FCOR= 0.5
##$FTSIZE= 0
##$FT_mod= 4
##$GAMMA= 1
##$GB= 0.15
##$INTBC= 1
##$INTSCL= 1
##$ISEN= 128
##$LB= 0.25
##$LEV0= 0
##$LPBIN= 0
##$MAXI= 10000
##$MC2= 0
##$MEAN= 0
##$ME_mod= 0
##$MI= 1.114404
##$NCOEF= 0
##$NC_proc= 0
##$NLEV= 6
##$NOISF1= 3.799351
##$NOISF2= 2.8
##$NSP= 1
##$NTH_PI= 0
##$NZP= 0
##$OFFSET= 14.38212
##$PC= 1
##$PHC0= -1722.583
##$PHC1= 16.39228
##$PH_mod= 1
##$PKNL= yes
##$PPARMOD= 0
##$PSCAL= 0
##$PSIGN= 0
##$REVERSE= no
##$SF= 200.129724274929
##$SI= 16384
##$SIGF1= 3
##$SIGF2= 2
##$SINO= 400
##$SIOLD= 16384
##$SREGLST= <1H.CDCl3>
##$SSB= 0
##$STSI= 0
##$STSR= 0
##$SW_p= 3205.1282051282
##$SYMM= 0
##$S_DEV= 0
##$TDeff= 0
##$TDoff= 0
##$TI= <>
##$TILT= no
##$TM1= 0
##$TM2= 0
##$TOPLEV= 0
##$USERP1= <user>
##$USERP2= <user>
##$USERP3= <user>
##$USERP4= <user>
##$USERP5= <user>
##$WDW= 1
##$XDIM= 8192
##$YMAX_p= 0
##$YMIN_p= 0
$$ End of Bruker specific parameters
$$ ---------------------------------
##NTUPLES= NMR FID
##VAR_NAME=  TIME,          FID/REAL,        FID/IMAG
##SYMBOL=    X,             R,               I
##VAR_TYPE=  INDEPENDENT,   DEPENDENT,       DEPENDENT
##VAR_FORM=  AFFN,          ASDF,            ASDF
##VAR_DIM=   8192,          8192,            8192
##UNITS=     SECONDS,       ARBITRARY UNITS, ARBITRARY UNITS
##FACTOR=    0.0002768,     1,               1
##FIRST=     0,             0,               0
##LAST=      2.2672688,     0,               0
##MIN=       0,             -58002,          0
##MAX=       2.2672688,     66071,           0
$$ Real data points
##PAGE= N=1
##DATA TABLE= (X++(R..R)), XYDATA
0 0 0 0 0 0 0 0 0 0 0 0 0 0 0 0 0 0 0 0 0 0 0 0 0 0 0 0 0 0 0 0 0 0 0 0 0 0 0 0 0 0 0 0 0 0 0 0 0 0 0 0 0 1 -2 3 -3 4 -4 4 -8 12 -16
61 -16 22 -32 49 -78 129 -231 492 -1382 10271 66071 26450 -38022 -24802 12996 16114 1016 -2899
78 -2899 -11227 -18931 5053 28836 8759 -16714 -10737 8590 9513 -10889 -13039 9463 8850 -10123
92 -10123 -3627 16145 11261 -11682 -14220 2100 549 -3249 10582 5706 -13080 -2648 15737
105 15737 6166 -12576 -10133 2782 126 -1473 12001 6775 -13704 -8186 11549 11560 -6328 -16476
119 -16476 -2431 10970 3553 -1559 2778 722 -4668 -2254 6258 3127 -12245 -6943 11494 5738
133 5738 -5267 2632 7059 -4796 -12512 156 12381 56 -10874 199 8126 4630 199
146 199 -4738 -5638 -2645 2253 7277 1473 -7028 -1447 5486 3343 -2075 -5011 -690 2139 -1163 1574
162 1574 3367 -2600 -2485 1772 1610 10 -1329 414 99 -4452 141 6643 943 -4087 -1634 1526
178 1526 2622 -1323 -3024 461 -176 267 3879 1026 -2430 -2305 -1277 2057 1287 -1574 939 458
194 458 -1601 1064 1278 -348 -1455 -2802 1383 3985 248 -1249 -2067 -1946 2452 2256 -1040 -1083 -828
211 -828 1161 1720 -1669 -685 695 -1516 202 1971 1166 130 -2860 -1852 2563 1344 -592 -636 -1430
228 -1430 1015 1690 -875 -260 -438 -861 1324 204 -659 561 -747 -357 516 -568 1750 1504 -2505
245 -2505 -2206 40 2344 2568 -2716 -3056 2729 3125 -183 -2942 -2752 1913 2025 -891 605 359 -857
262 -857 490 -309 -626 35 -749 582 689 -717 1455 783 -2097 -807 109 829 1040 -1543 -894 1567
280 1567 382 201 -139 -1050 588 143 -894 374 -302 262 1464 -1260 -707 2230 224 -1861 -1770
297 -1770 399 2471 -421 -1364 1623 207 -1171 489 -4 -400 -681 -1028 1626 1809 -731 -603 -870
314 -870 -314 1176 -151 -427 -136 -1304 1411 2481 -1371 -2053 -12 1146 1215 -1023 -1204 552 -12
331 -12 917 953 -1750 -405 1370 -342 -517 -151 51 575 -473 287 1351 -1090 -1139 594 313 391 -721
350 -721 -1002 1941 1129 -1626 -643 338 400 114 -690 493 173 -1006 1390 921 -2050 -619 963 810
368 810 178 -1341 -365 1126 -5 96 -164 -957 572 437 -430 604 -435 -853 884 514 65 -156
386 -156 -1179 201 999 -153 -241 -845 40 1864 -348 -1683 371 453 22 -17 -411 578 76 -623 886
405 886 -47 -1172 308 374 227 205 -889 205 862 -656 -197 331 -181 172 -387 64 998 -723 -649
424 -649 905 144 -106 -209 -589 691 223 -756 262 167 131 367 -881 -34 929 -539 -420 258 2
443 2 589 -292 -684 603 -96 -375 484 -266 -78 308 -436 450 171 -783 352 340 -396 94 -236 331 422
464 422 -1015 -165 894 -51 -127 -297 -276 842 -94 -747 382 -32 -159 201 -200 481 69 -1068 411
483 411 872 -248 -290 -517 191 861 -442 -356 488 -322 114 235 -313 213 -274 -339 831 -49 -603 282
503 282 -7 105 -168 -578 700 424 -977 -110 436 305 302 -834 -344 793 18 -139 14 -461 352 155
523 155 -278 505 -186 -654 459 235 31 -109 -702 355 626 -470 8 154 -269 173 -242 21 678
542 678 -521 -391 553 39 54 -134 -330 409 -131 -390 573 1 -494 110 -82 351 305 -683 -36 244 -155
563 -155 316 -82 -362 337 -182 36 554 -393 -197 128 -208 426 161 -560 154 78 -1 373 -356 -46 348
584 348 -549 98 637 -155 -271 -309 4 799 -113 -596 168 -116 140 321 -309 -69 -34 -272 703 252 -675
605 -675 -73 39 263 349 -539 -60 476 -333 -9 157 -133 266 -210 -301 524 18 -189 37 -290 280 356
626 356 -410 123 60 -380 300 124 -10 210 -475 -124 559 -126 -82 -51 -298 340 -5 -211 386 -206 -439
647 -439 342 241 160 -155 -632 340 533 -270 -107 2 -147 264 -152 101 405 -483 -282 400 106 138 -257
668 -257 -451 527 173 -351 172 -98 -137 163 -86 321 151 -630 91 448 -56 -31 -285 7 453 -316 -177
689 -177 462 -169 -174 -39 -26 454 -155 -611 266 220 -141 174 -252 -32 157 -258 194 238 -402 -67 58 99
711 99 446 -308 -331 361 -45 -4 195 -172 70 -51 -247 393 76 -417 -73 14 207 246 -525 -61 314 -227
733 -227 62 79 -129 158 -266 -76 480 -143 -280 127 29 212 17 -376 245 43 -296 299 108 -126 6
754 6 -307 161 400 -295 -112 156 -80 212 -38 -188 274 -123 -216 287 27 -65 -63 -332 293 238 -315 60 33
777 33 -93 197 -176 32 215 -351 -24 308 -121 35 -188 -144 423 -14 -264 271 -101 -72 111 -138 221
798 221 41 -435 198 261 -129 11 -203 19 325 -224 -93 244 -150 29 66 -62 254 -173 -345 331 144
819 144 -97 8 -200 148 197 -331 125 159 -288 8 -24 59 253 -344 -105 393 -83 -104 50 -97 180 -82
841 -82 -232 310 65 -324 53 11 74 40 -374 72 346 -281 -41 101 -58 61 -230 -47 314 -168 -226 169
863 169 -35 120 -91 -207 255 11 -296 239 58 -69 -27 -154 207 248 -291 -38 130 -68 129 -145 -108
884 -108 283 -188 -81 252 -64 -10 13 -160 302 69 -313 169 87 -10 109 -183 65 156 -220 43 224 -188
906 -188 7 -50 -9 304 -187 -141 270 -58 -72 58 -122 186 49 -304 198 168 -131 79 -95 -2 213 -311
928 -311 23 219 -126 -3 20 -96 195 -131 -217 266 -2 -154 32 -114 128 68 -268 187 167 -207 19 -31
950 -31 31 129 -233 47 335 -188 -27 72 -44 143 -123 -195 285 -28 -240 133 3 84 37 -257 184 148 -260
973 -260 32 17 21 130 -194 -27 228 -208 -5 183 -51 58 -60 -163 325 15 -243 127 -19 -45 81 -186
995 -186 118 149 -277 43 192 -86 -8 -124 -11 246 -182 -73 197 -123 7 -44 -165 233 -20 -211 159
1016 159 66 -64 47 -109 136 156 -264 54 164 -133 -40 4 31 145 -248 -74 278 -46 -88 -11 -106 196 -54
1039 -54 -235 224 15 -167 117 -63 103 28 -201 76 163 -242 -16 82 -11 174 -131 -93 226 -102 -131 73
1061 73 -88 139 19 -246 189 42 -208 86 -16 9 28 -128 42 239 -191 -58 79 -12 139 -118 -130 216
1083 216 -76 -173 212 -30 29 30 -112 143 55 -218 80 -26 -65 102 -220 5 168 -162 -31 126 -70 -32
1105 -32 -101 -95 194 -31 -92 176 -28 4 17 -167 117 83 -202 89 60 -45 6 -124 -6 198 -188 -61 198
1128 198 -76 8 0 -44 165 -111 -168 173 2 -102 5 -42 137 38 -266 78 155 -152 38 -62 4 75 -194
1151 -194 34 214 -124 -64 51 -68 156 -97 -151 184 29 -125 113 -83 25 37 -189 99 122 -175 17
1172 17 -45 -22 119 -133 -69 180 -140 -37 23 -13 74 -76 -158 169 1 -205 100 -53 38 11 -100 151 132 -182
1196 -182 -55 125 -6 16 -127 -89 180 -128 -87 85 -10 -8 6 -137 180 -14 -134 133 6 11 53 -96 63
1219 63 106 -199 41 103 -34 18 -64 -14 127 -129 -88 157 -38 13 31 -101 108 78 -122 144 27 -108 106
1242 106 -53 84 56 -189 28 178 -21 -14 37 -28 103 -42 -114 160 -69 -29 67 -86 81 63 -153 101 84
1265 84 -52 -6 9 0 54 -160 32 203 -62 -42 65 6 113 -132 -109 142 -32 -100 66 1 65 -3 -155 96
1289 96 78 -168 37 20 2 86 -133 56 152 -54 -21 53 -33 61 -44 -58 201 -84 -151 55 57 66 8 -136 107 101
1315 101 -144 54 98 -42 24 -69 74 162 -154 -45 154 -59 19 -48 -43 202 -29 -92 49 1 -17 -1 -57 61
1339 61 99 -160 27 48 -27 61 -81 15 106 -99 -48 133 -76 -44 -20 -77 91 -19 -164 102 33 -58 44 -69
1363 -69 -5 53 -84 60 129 -98 -13 -2 18 98 -43 -100 183 -19 -46 59 -46 62 -62 -166 148 -13 -145
1386 -145 69 25 -7 85 -132 54 102 -98 22 -13 -76 37 -103 -68 156 -13 -52 33 -24 5 4 -118 96 29 -146
1411 -146 112 -70 35 72 -122 40 147 -111 4 77 -12 45 -96 -46 65 -42 -81 67 -39 70 -36 -66
1433 -66 93 29 -112 56 95 -48 7 -38 29 73 -76 -27 137 -66 -25 -32 -42 127 -75 -128 64 21 -40 -10 -23 96
1459 96 25 -159 -25 52 -76 -29 -25 -13 52 -109 -12 105 -66 -27 21 -42 50 -7 -95 123 -57 -64 110 -35 64 10
1485 10 -119 58 -7 -62 24 1 -16 63 -23 13 131 -118 -25 26 17 3 -12 -96 79 -18 -36 16 -101 14 20 -165 4
1512 4 1 -102 46 -2 7 18 -94 -36 80 -119 -28 111 -27 59 -12 -41 42 -23 -104 12 -30 -26 -7 -86 51 35 -138
1539 -138 22 35 -16 19 -47 11 72 -78 -38 66 20 -24 -5 -72 86 -12 -96 66 2 -42 24 -16 32 41 -84 2 -9
1566 -9 -3 19 13 -58 25 -56 -66 55 -26 22 28 -74 66 14 -74 60 41 -122 -38 37 4 47 -97 55 63 -9 -10 -90 -3 21
1596 21 -67 -87 59 -39 -105 17 17 42 -59 -44 30 9 -1 58 -15 10 -7 -85 4 84 -57 -33 -37 -10 32 -60 36 64 -84
1625 -84 -49 67 -29 -16 -1 -70 75 5 -51 33 1 -24 37 -83 7 86 -13 -13 30 -49 51 -19 -34 100 -24 -101 14
1652 14 8 35 -4 -33 13 28 -133 -5 33 -13 52 -9 31 51 -64 15 105 -18 -13 -62 30 105 -32 -31 73 10 -27 8 12
1681 12 87 54 -55 21 46 -41 30 -24 26 61 -67 5 73 43 5 -49 3 94 -13 -59 99 -6 11 19 -22 40 45 -66
1709 -66 43 60 -69 -5 29 19 8 -37 12 86 -39 -14 10 70 52 -19 -21 96 -20 -61 4 23 4 3 -33 13 58 -91
1737 -91 -1 29 -11 72 -66 -26 82 21 -3 19 -61 -7 27 -60 68 -31 -37 35 -33 -36 0 -16 26 3 -44 72 50 -44 -37 -81
1767 -81 -1 75 -77 21 99 -28 -58 25 -46 31 -36 -8 31 -2 -13 13 -53 -9 32 -87 0 38 -52 -19 -26 1 44 -1 -30
1796 -30 51 -3 39 44 15 -4 -38 -66 38 -44 -98 16 -9 -14 -4 -88 -1 84 -52 -40 -15 -11 -9 -54 -74 89 -3 -21 -2 -8 32
1827 32 24 -61 71 54 -126 -27 -63 -66 17 2 3 69 -17 10 -26 8 14 56 -50 76 -65 -45 55 -62 -27 30 -21 49 38
1856 38 -59 8 37 8 -8 -76 8 77 -103 -23 54 38 42 -10 -43 11 3 -33 45 -35 -53 35 16 6 25 -101 -8 -28 -29 -4 -8
1887 -8 -17 28 -28 -27 53 -67 14 4 -47 18 8 -11 50 21 0 48 -47 1 40 -92 26 3 0 25 40 22 73 -78 18 18 -55
1918 -55 36 19 4 28 -35 -68 75 -35 -62 -7 -8 29 3 -45 22 77 -21 18 -4 -12 31 -69 47 40 -44 -18 62 -21 -62 4
1948 4 -37 52 -39 -62 13 12 -24 34 -43 -8 35 -60 -21 30 16 30 -31 -27 69 -15 -15 64 -10 24 26 -10 94 -12 14 77 9 -61
1980 -61 9 -41 -6 78 -22 -47 60 -22 -16 65 19 40 -40 -12 121 35 7 8 -54 77 15 -37 26 45 -73 27 -39 8
2008 8 50 -11 5 9 -72 -5 -15 -22 91 -49 -66 45 -6 -9 63 -16 -35 26 -56 53 -21 -47 0 -84 -33 7 -32 10 -25 -12
2038 -12 -19 42 40 -12 -53 -25 37 -1 -47 19 -23 30 -33 -108 18 -54 -41 4 -10 36 -7 -26 -29 22 -26 -26 -4 -48 -18 -14 -28 71
2070 71 -21 -32 58 -20 -39 3 35 54 -26 -89 70 15 -25 40 -16 -4 17 -68 52 28 -55 23 -17 5 57 -24 -36 10 54
2099 54 -24 52 -13 -4 -11 -51 79 68 -52 47 -27 -15 -15 -57 -29 39 -18 -22 18 -24 5 30 -19 47 -49 -14 58 -45 -6 -20 -87
2130 -87 16 38 -54 31 -37 37 75 -13 4 45 -48 -9 -36 5 25 -45 13 87 25 -27 -29 -26 14 73 -59 17 34 8 55 -4
2160 -4 24 53 19 47 -21 -15 10 -13 -16 23 -9 -41 61 25 -57 33 -30 10 30 -71 37 0 -2 -36 47 -71 -28 -16 -29 64
2190 64 -87 1 44 -7 -26 5 -11 50 -28 -64 45 -50 -8 13 -1 48 -18 -42 2 -63 -28 8 11 4 11 10 -5 -16 7 -2 -12 -55
2222 -55 38 -75 -53 52 67 -60 -64 -46 21 0 -45 30 79 39 32 -27 7 -24 -32 34 36 43 54 20 -17 12 22 -99 8 -30
2252 -30 -70 21 -27 -32 37 -21 15 -1 -43 6 1 42 2 -28 -72 131 4 -47 19 -9 -12 9 68 23 -14 -15 29 66 70 7 -58 14
2284 14 45 -38 7 10 -45 -11 18 -17 -4 -49 -53 -25 0 -24 -30 -18 12 -28 -82 6 -19 -25 -28 -47 24 41 -45 -22 23 -39 -25 15 5
2317 5 5 40 -23 35 16 -36 68 15 65 18 -58 -13 63 42 -36 -3 11 42 -25 43 67 -36 1 27 -30 41 5 -81 14 42
2347 42 -38 -13 7 -2 -22 -24 89 13 -60 -8 18 7 8 21 23 28 -31 -42 59 1 9 -12 -24 66 36 -21 9 60 -54 -20 -60 48
2379 48 57 -94 32 50 14 19 -48 13 58 -32 -45 21 19 29 -44 30 -42 -21 -48 19 -13 -8 16 -12 34 10 -45 33 23 1 39
2410 39 -57 -29 45 -24 -12 78 26 -10 36 -28 -62 1 -45 15 -21 -37 -30 3 -2 12 -55 -66 7 -44 7 -43 -10 11 2 -65 19 -35
2442 -35 -46 -6 -35 2 -30 -54 39 -25 -31 12 -19 38 -20 0 -20 20 -12 89 -14 -19 21 -15 19 85 16 -44 11 11 32 8 -4
2473 -4 3 -1 -73 36 8 2 -4 -26 -16 47 -5 -29 42 1 0 -15 -16 9 28 -28 8 42 20 -26 -36 8 75 -3 9 -41 -51 1 -6 19
2507 19 18 -36 20 -6 -25 39 -5 -51 22 49 -36 55 -17 -17 33 -9 24 2 -48 -10 24 -10 9 -29 24 23 -31 60 65 -19 -8 44
2539 44 -48 55 4 -71 44 -38 -64 26 -1 39 9 -74 23 6 -5 2 0 -9 -7 -41 -48 66 -35 33 -25 -41 20 -58 -76 66
2569 66 -16 -4 -32 27 60 15 -48 -37 24 -12 59 -16 49 37 -3 -36 24 -60 5 -2 -6 7 -17 -48 17 39 -104 57 -35 62
2599 62 3 47 -59 3 -62 -28 106 17 20 32 -33 5 -79 31 43 -13 1 -5 -54 62 68 -18 11 -43 7 -35 -6 -18 22 -46
2629 -46 -43 -4 -10 -26 -8 -1 45 -18 -11 18 -21 -38 -17 -8 26 -48 -33 54 40 17 13 -10 16 24 -19 31 17 -23 12 15 15 30 10 -27 35
2664 35 -31 -6 39 -48 21 -65 4 48 8 -10 -54 -33 -3 18 17 20 55 -31 36 46 34 51 -18 -79 47 -39 -9 47 -14 17 19
2695 19 32 0 7 4 -26 16 19 -21 5 64 19 5 -34 0 -79 11 -4 -38 43 15 -4 25 -34 -10 24 -67 59 1 4 24 6 -62
2727 -62 24 -15 -7 36 -48 36 16 -21 21 -27 21 58 16 -59 -24 12 2 7 24 21 -21 -35 -11 8 11 4 -63 26 -21 11 -2 49 -5
2760 -5 8 -28 37 44 -2 -11 -26 51 -9 22 -12 0 -22 -38 -45 46 13 7 -36 -10 38 25 -45 39 -23 14 16 16 52 -35 -19 49 -19 -44
2794 -44 7 9 28 -14 -68 37 34 -69 44 -9 -52 0 -6 -41 50 -66 -60 -22 18 -13 57 -26 42 -17 -49 -7 -10 -15 0 -24 3
2825 3 -1 -47 -9 25 34 53 -3 -11 32 -34 8 3 -42 -8 -48 -16 -9 2 -12 46 13 -16 25 -11 35 2 -26 40 26 2 52 -37 13
2858 13 44 -20 -20 36 -24 -18 32 2 58 31 -54 -6 -8 -106 -38 -40 19 -18 -7 57 19 -23 -33 -26 -70 -10 -49 1 -7 -23 -44 -24 7
2891 7 -21 -18 -59 -45 11 45 -30 7 -26 63 2 15 97 -7 44 11 17 22 -23 -1 15 9 -33 -6 52 2 47 -37 8 -47 -38 -77 -38
2924 -38 11 41 18 13 5 -60 -10 10 31 39 1 -66 67 6 4 -3 22 18 -17 -47 -16 43 -51 40 30 -16 50 -28 23 18 4 -18 36
2957 36 44 -24 5 11 44 0 11 -19 17 -24 -45 -5 -28 -17 -22 11 8 -25 -5 -23 43 13 14 24 33 -2 -32 75 -40 -10 -15 -20 13
2990 13 -30 -40 51 -9 6 18 2 -11 41 52 -8 17 34 18 -57 -14 25 -5 21 -2 -2 47 -15 -6 25 -27 23 4 -53 15 -49
3021 -49 -44 53 -18 -6 13 20 -11 18 -36 -30 50 30 -21 3 -41 11 12 9 37 32 -74 -4 -5 -5 0 36 -8 11 -68 -26 64 -24 11 -7
3055 -7 -60 29 26 -54 17 -9 5 -11 -35 -39 -6 -8 49 -26 -44 20 -54 3 6 27 26 -30 -27 16 -20 -18 68 -30 16 39 55 59 25 -45 -30
3090 -30 -3 -41 3 41 10 22 0 4 32 -22 34 33 8 -1 5 -8 82 33 19 18 -1 -23 32 -28 -7 -15 11 -8 20 -59 3 16 -7
3123 -7 54 -2 3 10 -35 -6 10 -10 8 41 19 -9 18 -48 4 -30 -22 -63 23 5 13 11 22 19 28 20 -23 42 43 -6 -36 8 2 -31 -15 -19
3159 -19 8 -10 18 36 1 -11 -17 -12 53 -22 -92 9 17 -11 -26 -30 -15 20 -68 16 8 28 4 44 -61 -2 15 -41 18 -35 -35 4
3191 4 -87 39 23 15 11 -32 -5 -35 -5 -28 17 -14 6 -34 28 -28 -35 -9 -7 8 2 35 -27 -91 -16 7 20 55 -35 66 -20 -16 -9
3224 -9 28 15 1 -54 -5 48 -43 37 -33 -73 -1 -37 -9 -6 -46 15 -29 -12 13 -8 -3 24 38 18 8 36 -3 -23 12 1 37 -22
3256 -22 -55 41 -66 -1 -26 21 -22 7 31 22 -4 -59 -38 -46 -13 -38 -65 -7 -24 -7 -45 -6 -42 -9 22 -30 -11 -28 16 -65 -78
3287 -78 -40 -7 -55 -46 31 -19 -49 -62 -20 -10 4 -39 -35 -42 -59 6 -9 14 -14 -29 -17 -35 -20 51 30 6 -24 31 -21 18 -8 -44
3319 -44 13 29 -10 6 -22 1 -18 19 5 2 16 -1 -20 -3 -6 -26 15 -13 -12 36 -37 4 -30 7 1 23 -22 12 -43 -10 26 -47
3351 -47 -2 43 20 -2 -23 -8 22 -26 -48 10 -29 -31 16 15 40 59 -22 -3 53 -21 30 -8 11 80 9 32 30 29 -32 41 9 20
3383 20 37 -34 -43 3 -7 -37 -42 -40 33 -66 13 51 -13 3 -9 -13 -7 -25 -13 25 -31 -34 -34 -41 -53 18 34 -15 24 -51 30 -4 2 10 -31
3418 -31 8 -9 -28 29 24 -37 8 -8 -16 -25 28 47 23 35 53 -54 -11 83 -2 -44 46 38 21 58 -5 -8 10 22 -23 15 68 -50
3450 -50 -25 14 33 9 5 31 -8 4 7 -4 -10 20 -3 -13 21 -19 17 20 21 2 -32 -14 -30 -36 25 -11 -53 -16 5 -53 -7 -35 5
3483 5 22 4 41 28 -27 73 -16 30 -12 -18 4 -2 -24 44 48 -19 8 30 32 -1 -24 -50 -5 7 -3 48 -44 -16 -14 4 34 -1 -16
3516 -16 3 -17 7 11 -38 -24 -1 -5 -54 -13 24 32 0 -13 15 19 -10 40 34 68 64 10 2 58 -3 16 -15 45 -5 36 9 31 8 -23
3550 -23 -17 -19 -20 -8 -15 -3 -44 -18 -12 9 13 -28 -104 -4 9 -9 7 -36 7 64 -4 -27 9 -44 -7 -3 12 -43 -11 -23 42 23 0
3583 0 -16 26 22 -28 -42 -8 -20 -46 8 -25 -40 13 10 6 4 -16 31 21 -26 3 27 35 22 -19 2 -5 43 -33 -3 1 51 53 -59 4
3617 4 -19 6 -8 14 -8 8 -19 -29 -24 0 0 -16 -51 31 -14 -25 18 -46 -23 -19 13 -16 43 -52 -27 20 -13 -34 -20 -8 82 -18
3649 -18 -3 -41 34 -17 -12 -3 -12 -6 -47 9 -8 -23 10 4 -15 -36 -20 -6 -36 -60 -45 -10 19 53 -17 -27 11 6 -57 -20 4 -14 -20 -18
3683 -18 13 1 30 -28 24 15 -66 -43 -7 -22 -38 20 -32 30 -27 13 -41 -31 20 -16 -13 -75 -22 -27 7 -29 15 -37 -20 48 -34 8
3715 8 -35 51 2 -46 -33 -34 -7 1 5 -24 17 3 -6 -30 -3 26 -44 -35 -13 -17 27 -63 -9 28 6 -33 10 28 -13 9 -30 -56 -47 -11
3749 -11 -20 -5 -14 -14 -10 -11 -86 -15 19 -52 42 -11 7 -14 -57 -37 40 34 -32 -35 20 -12 -14 1 31 -50 44 -41 -14 -57 -14 31 -21 -46
3783 -46 -41 -9 -27 18 -40 -11 45 -50 -33 39 30 37 -55 -23 -32 12 -23 30 26 -96 0 -11 3 -5 19 47 38 2 18 77 15 -5 -65
3816 -65 11 1 6 59 14 56 -35 -4 10 -30 55 42 -6 36 -32 63 -23 6 20 -42 8 -89 -74 -43 -27 20 -25 -42 0 -15 -20
3847 -20 -6 29 -3 38 -20 -27 6 -30 29 23 11 -56 -17 46 -11 6 -31 -41 -34 -21 -61 -56 -34 19 21 -14 -17 44 -59 0 -43 -34 42
3880 42 9 -11 -44 34 -23 -29 -40 -55 -13 -26 -47 5 -41 0 -20 -61 -14 -55 -14 -28 -18 -6 58 48 19 -5 -51 -13 18 14 -10
3911 -10 17 50 27 -25 -18 -36 9 47 -1 4 31 16 -1 1 -4 -18 12 -12 -5 -40 -1 7 -2 20 -2 -33 -62 -12 -24 34 -18 -5 -5 16
3945 16 36 -15 7 -13 55 -11 18 -23 -10 -15 46 34 -10 -24 -27 19 -7 19 -8 10 -12 -34 -27 6 36 -23 12 10 7 -37 -12 0 -48
3978 -48 -30 -105 50 -14 0 -10 2 -2 6 37 -59 64 -13 36 -19 -2 -33 -26 25 -26 32 0 11 -10 -27 36 -19 17 -18 -21 -100
4009 -100 -22 -43 1 -20 8 1 25 0 -17 15 9 -22 12 -36 14 18 -24 -45 -36 10 -27 -67 -2 13 11 8 8 38 -54 -24 4 41 -72
4042 -72 -17 -49 41 -60 -13 28 -53 -8 -68 4 -30 -5 -16 14 -60 48 -69 18 12 -8 20 11 -7 -40 -14 6 9 -27 32 53
4072 53 -20 17 -20 35 12 9 1 20 -40 12 46 -23 -17 -5 -34 -1 -34 -22 2 7 -21 13 6 14 22 -23 -12 -45 43 27 53 -21 28 -15
4106 -15 -52 19 21 16 -24 33 39 26 -70 -9 6 43 39 22 -1 20 -71 28 31 -13 -13 32 -22 -44 41 4 -54 -43 -90 11 -56 17 -30
4139 -30 -17 26 4 -43 23 -27 9 1 -33 11 42 -13 8 1 -9 18 -20 15 -13 43 41 -69 0 8 -27 1 -34 -55 -14 -45 -12 -56
4171 -56 4 -45 -26 56 2 61 -9 29 -1 -38 6 -11 -2 10 -18 -17 42 24 13 26 28 40 -15 -32 -45 26 -4 -21 12 -8 -35 -12
4203 -12 50 8 -17 35 -13 18 -29 -55 -51 30 -38 -2 -11 13 49 5 -39 -22 16 14 -26 -55 14 3 23 -41 -1 2 -35 60 -51 -9
4235 -9 -29 -26 15 13 10 -28 -56 -29 94 -51 5 -1 10 -22 70 -34 -16 -37 -27 2 -7 -4 36 -32 35 -12 -50 -36 -26 57 -3 75
4267 75 -102 -11 -12 -33 31 52 -17 24 -12 65 -9 -35 9 17 -2 30 -1 -46 -9 -7 -39 60 -32 -10 -17 -12 0 -35 -12 34 100 -8
4299 -8 43 -74 -20 -35 15 2 -16 -2 18 -61 -7 91 16 12 -28 4 -13 11 4 13 -10 -38 -22 3 -28 14 -40 -61 31 -13 -18 35
4331 35 8 14 52 13 -19 -7 -2 -11 -10 44 -23 -10 -38 -14 -3 22 4 -16 -10 26 39 10 -39 -23 11 15 -39 12 6 -45 60 11 6 29
4365 29 -24 31 -91 1 -23 -23 29 1 -2 51 17 -19 21 -3 3 -20 -56 36 39 27 -35 44 -72 -12 20 -5 4 -6 -29 27 -42 -15
4397 -15 -6 -15 -1 -36 69 36 -33 9 36 -24 -3 71 50 -32 -33 -28 8 -7 -36 -9 8 2 16 -11 29 -12 -11 0 -6 3 -70 -20 46 6
4431 6 -16 -10 -39 19 27 -41 -3 34 -66 -59 -7 16 -21 -45 -18 -4 -2 15 4 59 36 -6 -10 -22 -16 -38 17 -28 -73 -49 -38 -2 0 -63
4465 -63 -10 -39 -34 36 -7 -1 -9 -12 18 -3 -28 26 33 -1 44 36 -15 5 16 -27 37 -9 12 -10 13 26 54 29 -33 -27 -7 -2 -21 16
4499 16 -12 -31 20 13 37 -18 31 -27 8 11 -70 36 35 8 38 -50 -24 -29 27 -38 17 12 20 24 -16 4 -7 -68 2 2 33 -22 -59 27
4533 27 -13 10 -21 -19 11 -4 -2 1 -2 37 -66 -18 19 -15 -31 -2 23 27 -37 -12 19 -31 -33 -40 10 -41 19 -11 17 -10 -39 -25 0
4566 0 -16 42 40 20 -43 -45 -50 70 36 72 -22 18 38 11 -73 7 56 -50 8 42 43 -59 -32 -18 -2 1 -27 7 -8 79 7 63
4598 63 -45 0 52 -7 4 38 3 -15 16 -13 -23 14 52 35 -36 7 -22 -25 16 -12 5 -2 7 -20 -38 2 -11 -37 18 -6 -11 -23
4630 -23 -45 7 8 -15 -11 -28 -38 -40 23 -67 -15 29 35 -26 -1 -17 12 42 39 -9 -29 34 -2 46 -19 9 2 25 11 -62 6 33 -31
4663 -31 13 3 -30 13 25 16 -40 3 -1 -15 -5 -53 15 58 47 -20 16 -21 -2 2 -32 8 1 13 -71 -8 36 10 60 11 -5 10
4695 10 -42 -28 -4 12 -59 -1 -14 14 24 -47 -45 0 -29 -6 27 -39 12 1 28 26 19 -27 44 50 18 -38 37 -37 57 7 -4 -37
4727 -37 22 -26 0 -21 -33 1 0 3 -10 3 -23 -22 52 54 31 -13 -6 54 79 -27 72 -46 -26 -3 23 -36 65 34 30 -16 -24 27
4759 27 -19 41 26 1 10 -67 -1 19 15 25 33 32 13 -18 40 -80 14 6 -31 -15 40 9 -25 -1 -13 8 29 8 6 -2 13 -32 46
4792 46 3 24 8 -50 -58 22 -16 3 11 43 2 25 -23 -64 14 0 -27 14 -10 17 22 29 -3 0 -33 20 1 -7 19 -8 42 -26 -6
4825 -6 31 -14 -19 -3 -31 -36 -13 -10 -87 -12 -7 -40 -3 33 15 -44 -56 23 18 40 -1 9 -87 -33 -29 -27 -8 48 -10 21 17 6 -24 -30 18
4860 18 -9 32 -39 50 41 67 -13 96 11 -2 -19 0 -20 31 36 41 64 1 -27 5 1 -20 -1 20 -27 14 27 5 19 18 -60 47
4892 47 -17 -34 -33 44 14 27 -42 -32 13 -5 -8 1 -35 47 -22 -20 42 36 -8 18 12 -47 -31 -49 35 -18 -24 -49 -6 52 48 -8 -18 -37
4926 -37 -9 -54 31 38 47 -45 4 -12 -41 -15 1 30 53 28 24 38 -3 -17 -42 12 34 30 -10 27 -5 21 -26 -16 23 41 -44 -61
4958 -61 -35 -2 3 -6 -16 6 -8 -26 -18 -7 -19 17 -44 -15 -75 24 19 -11 32 3 -24 9 -5 -34 38 15 -40 32 2 -9 58 7
4990 7 2 -45 -7 -6 -16 -11 25 24 -21 -9 2 -23 67 9 18 27 5 -38 -19 4 -66 -25 -51 6 -26 33 16 -19 34 -32 8 20 11 -48
5024 -48 -44 -11 45 -30 20 36 -8 57 16 -2 34 -3 5 -8 8 25 -48 -51 61 -2 -5 -39 -9 -2 -7 32 30 28 26 18 -57 -4 -38 17 14
5059 14 47 11 54 50 51 -20 -43 -51 -18 13 11 -10 -14 -28 30 13 -21 -11 -49 -13 5 23 4 -4 -8 -35 -34 -28 -13 -9 13 -96 -17 -35 -79
5094 -79 -21 -79 -13 35 -13 64 -12 -6 22 -46 6 -15 -71 -4 -13 -53 -25 -23 -46 -12 -24 -6 29 -68 2 0 7 44 -3 -14 49 8 -28
5127 -28 -23 3 7 44 19 -8 39 -20 -21 -30 -40 -24 -10 -53 -4 20 18 35 -9 -19 -3 -10 -18 21 24 51 25 -6 -32 10 7 -4 -19 -5 -1
5162 -1 -22 47 -18 13 60 -44 6 10 15 38 -31 -13 -16 15 4 -9 -7 -32 32 14 -33 3 4 0 -32 20 22 12 11 1 47 -28 -9 -21
5196 -21 -15 -30 -13 15 48 -5 -6 -68 29 -8 12 3 -2 -43 -23 -48 -21 -13 13 -49 -24 19 -22 21 -31 24 17 -24 -38 27 -7 -5 7 -54
5230 -54 3 21 45 22 -33 40 56 28 6 33 -62 -18 22 52 0 -2 10 -12 -11 -28 -11 44 4 -46 -50 -51 -32 -3 23 43 73 10
5262 10 -13 -77 35 -72 37 -13 -33 -1 -7 -28 44 9 -11 4 -33 24 10 -12 -1 4 21 16 31 4 18 57 -1 26 67 66 19
5293 19 -16 -13 -19 14 38 -10 35 -33 53 31 -10 -19 19 6 -49 62 11 19 1 -25 -25 42 -8 -15 4 -10 33 -29 -1 -5 -46 43 54
5326 54 6 -34 -11 -44 -25 -18 -36 -16 5 -12 -23 -11 -37 -2 -43 -12 -29 -58 -9 -4 -5 1 -74 21 -3 57 29 6 8 3 -9 -40 18
5359 18 -13 21 -12 43 -3 -1 -41 28 40 35 -22 32 -3 42 14 -39 21 -32 12 25 25 38 -9 29 -21 70 13 -3 -28 -1 35 -16
5391 -16 -20 55 -15 -28 29 9 -81 -89 -26 6 36 41 -35 36 -56 -1 -17 28 109 -13 53 19 0 -2 47 18 16 17 32 17 -36 -15 -66
5424 -66 -29 63 -8 -39 -21 18 21 35 -36 4 2 1 -10 27 15 -10 12 -40 44 17 44 22 -19 2 17 1 12 -3 -46 -9 4 -18
5456 -18 -21 45 43 28 8 23 -8 -38 33 -26 16 -20 52 54 -21 38 39 -15 17 13 1 -16 -1 -31 -37 27 26 9 17 -6 -13 -8 4 -32 10
5491 10 69 12 32 -17 27 7 40 34 -53 -21 26 -18 5 -23 -24 -18 -7 -30 37 40 -8 -35 -26 -17 10 -15 11 -9 3 33 -2 19 -30
5524 -30 -22 -7 -40 66 -38 -10 -43 -8 0 6 30 -3 -30 37 -7 -37 21 -16 -50 4 8 -31 -25 -37 -38 9 -10 21 -53 46 13 2
5556 2 -14 -20 29 1 11 -10 32 15 49 15 -7 -16 20 30 12 -42 30 -15 -16 -20 35 -38 -24 9 6 -12 -33 23 21 21 48 0 -2 -13 -62
5591 -62 6 -8 -33 -6 -40 -29 -10 6 -12 4 21 56 44 15 32 67 49 8 -28 19 -2 13 -36 -10 58 18 27 54 10 18 3
5622 3 1 -3 -13 -24 -5 43 48 34 12 11 59 -33 16 70 -32 -21 25 -11 -16 27 18 12 44 -2 -7 28 65 -38 -13 -14 8 27 4 7 -16
5657 -16 19 3 26 -13 15 -10 25 26 25 -3 -8 15 47 -1 16 -1 -48 -56 -19 34 14 -9 12 13 -36 6 -35 -13 3 11 6 28 -56 -23
5691 -23 -12 -4 30 22 31 15 -8 27 36 -4 -1 -2 5 20 49 64 23 -23 -27 40 -20 -9 -41 -10 -20 -18 48 38 -13 57 51 -52 -55 -46 -42 -16
5727 -16 0 -18 46 6 46 -23 10 -12 -48 88 23 -9 -24 -58 38 -6 -11 0 11 11 -4 -10 65 34 -12 -21 -12 5 23 15 5 19 -63
5760 -63 -25 17 -26 2 -29 22 2 14 26 -12 -16 46 66 26 -32 -13 -12 -14 57 8 -9 -12 22 -12 -18 -60 44 7 58 -25 -2 -2 -2
5793 -2 61 29 15 22 -11 -19 -36 21 -38 15 -2 50 38 -36 54 25 -7 0 -25 42 -1 -38 12 -15 -17 20 16 -18 14 -44 -45 30 -6 3
5827 3 60 -38 4 38 -45 -5 -15 -13 27 -24 -11 18 -25 4 -34 29 -66 27 5 5 19 -48 16 55 15 -11 25 30 -7 -28 5 10 -23
5860 -23 0 -2 11 -15 7 10 12 19 -34 84 46 56 -14 14 23 -40 19 -16 -1 -41 -17 -4 -11 30 -24 41 3 20 10 -40 3 0 -86
5893 -86 -47 34 -5 6 11 -4 5 -5 6 6 15 20 43 43 67 26 -48 3 15 3 18 20 1 -18 -12 12 -20 -62 37 -55 7 -12 30 -14
5927 -14 -14 29 -3 -4 7 49 26 -8 31 41 -12 37 52 41 54 20 8 34 -29 -30 -24 81 -36 -8 -8 -33 14 0 -19 -1 2 -8
5959 -8 -10 -69 3 39 13 18 12 21 64 2 4 -25 -41 -29 -13 15 -7 -50 -5 -33 35 24 -4 -42 28 -42 -50 -27 4 -16 22 -2 -15 56
5993 56 18 -22 -34 10 -5 -33 35 8 19 -11 21 -25 -49 -37 -1 -4 -5 55 31 31 17 -6 -7 1 -2 -3 -19 0 -8 1 -27 49 -28 36 62
6028 62 27 37 29 38 -8 -26 -27 -13 32 19 67 26 -11 12 -22 -1 33 31 -23 4 -6 -34 -12 -16 -26 13 -37 -16 -6 8 -23 1 77
6061 77 44 22 -26 -22 -10 -27 42 -32 21 -52 30 -19 41 28 18 -19 -37 5 23 19 13 0 6 -26 -37 -20 -34 30 -15 3 -36 -3
6093 -3 -29 -49 20 11 2 35 11 -14 21 -28 23 -63 15 -18 -67 -25 1 9 2 -18 3 39 -19 -13 -1 -39 -20 -22 28 5 -13 15 0 -44
6127 -44 64 20 -23 68 -27 3 47 -14 -16 11 -65 24 83 -7 -13 1 14 -33 41 11 51 19 58 26 20 35 35 7 -36 24 -25 -7
6159 -7 9 -24 -21 -36 30 23 14 2 -29 -25 22 -22 -16 -37 -12 2 17 42 -26 21 -23 9 14 17 -23 12 -29 -12 -30 -52 -44 -11 -12 2 65
6194 65 42 29 22 31 59 15 44 -16 -5 30 11 -30 -32 -14 -14 71 -5 28 -25 -9 -27 17 50 -24 -28 -31 -8 52 -88 13 -16 6
6226 6 16 4 -9 17 -16 -3 6 -40 10 8 10 -15 -33 30 -25 -10 13 -30 -26 -27 31 -12 -25 -5 -1 0 -22 -8 43 61 -45 -10 -10 -46
6260 -46 8 2 -9 0 -26 -30 19 -23 -3 -66 53 20 14 24 11 10 12 -2 -18 -1 54 50 -2 7 24 29 -32 -2 -6 -22 18 40 35 -27 -57
6295 -57 3 -16 -8 28 -26 16 1 -28 104 9 -21 8 -2 0 -11 -26 -2 3 32 31 -38 34 30 10 6 -4 -41 10 2 15 20 49 7 29
6329 29 31 15 -22 28 36 7 -43 -77 15 -29 19 -43 -27 -28 -2 6 36 31 42 26 -6 77 -15 16 -30 31 19 -63 -20 27 6 40 2
6362 2 48 -9 -25 41 -20 31 32 20 -6 6 9 60 25 40 54 39 -17 27 0 6 30 -12 67 4 54 37 10 17 52 11 32 2 -29
6395 -29 -71 21 -4 7 -11 -9 -4 -12 31 -21 -27 34 -4 -2 -19 18 -45 -6 -24 5 2 24 -26 10 28 61 14 -44 -29 14 13 -14 -9 -24
6429 -24 15 -17 -7 7 9 24 22 26 -12 36 -12 22 9 34 63 69 -16 -10 -41 1 1 1 22 9 -16 -11 -3 -74 -2 -8 5 8 25 90 -6 29
6465 29 34 19 22 -11 -30 -24 -3 36 22 -4 -46 31 -16 -44 68 -22 -6 36 -12 62 27 51 -15 28 -1 -8 32 -10 8 -55 32 3
6497 3 -48 -7 28 -51 -24 -46 -26 -19 -33 10 20 -27 19 18 10 -13 -20 38 -5 -88 10 15 11 0 -18 9 53 -40 13 12 30 -23 29 24 -2
6532 -2 2 8 -4 25 13 11 29 -45 37 31 -10 30 57 30 8 39 75 0 -78 -36 -50 8 36 -38 -25 -24 15 17 18 13 -46 12 -1 11 -2
6567 -2 49 23 30 -29 -16 16 27 71 -36 53 45 9 -19 -14 -14 -48 -12 -72 52 -30 -23 25 56 -75 -1 10 4 3 -41 -6 19 -45 -29
6600 -29 37 25 24 -40 -43 47 -45 34 -39 -17 -6 29 -33 -2 28 -16 -50 12 37 -20 -38 -14 39 -7 -12 40 18 -23 -43 -6 25 -2
6632 -2 -22 -20 -32 28 -36 -68 -2 -25 -3 -60 -49 -24 11 -5 5 23 0 7 -57 65 26 -41 -21 16 1 39 80 -19 5 -3 19 15
6664 15 14 -10 15 -34 -43 -53 -53 67 -24 -8 37 -52 34 -31 -17 49 5 7 -22 -34 -2 1 -58 -19 38 -48 -41 4 12 -27 4 13 -21 -34
6698 -34 20 53 16 -14 -58 -21 -54 69 -29 -64 63 26 -21 -36 -24 -23 -50 14 23 -14 2 4 -67 18 -39 -16 1 17 -29 -12 5
6729 5 -45 8 -15 -20 47 10 -21 24 4 20 36 6 -18 -1 -14 30 -7 25 41 -34 -57 11 -4 57 -12 -57 -32 25 -41 -3 8
6760 8 -17 13 25 -35 -47 -1 -23 -10 -29 -11 0 -57 15 12 41 -26 -53 25 33 -1 16 -4 21 -2 -18 -27 31 -7 -9 -57 -7 -24 39
6793 39 19 -15 -21 -67 18 1 -31 -67 -26 13 32 -54 -11 -82 -31 -27 -34 -14 34 -51 11 59 -14 -34 2 -44 17 -18 12 2 -23 -14
6825 -14 35 25 17 23 -18 29 -29 28 16 20 -4 32 28 -54 -41 36 -6 -1 0 -33 44 -76 11 45 27 -20 -9 -8 1 39 27 11 -21 6
6859 6 -5 23 52 -70 38 -18 1 -41 12 -29 17 31 -5 21 -26 11 50 14 -31 38 24 28 -16 33 9 9 38 23 -11 -16 32
6890 32 -61 -29 8 -43 -18 74 -8 40 7 -8 49 -49 2 13 14 -26 -34 70 -10 -17 -34 -34 -30 3 -2 0 12 2 10 -16 -19 -19 3 -86 -54
6925 -54 41 -19 16 42 62 -47 59 0 28 7 -13 18 -31 29 13 -18 -37 18 -8 -38 -62 33 13 21 -29 6 -23 -21 -5 1 -1
6956 -1 33 -23 20 -8 59 -35 18 29 14 -38 -11 11 9 -6 -17 -5 31 48 -5 12 74 14 -24 16 42 20 -7 -2 -22 18 5 16
6988 16 53 34 13 56 18 -25 14 -36 -42 -36 -6 -27 43 39 5 8 34 29 40 7 -32 -14 -21 21 -31 -49 84 -23 -21 2 -75 11 25
7021 25 34 7 2 45 -11 36 31 38 5 -36 52 3 -16 19 14 -16 -30 9 -3 18 -10 30 -4 -47 -26 -6 -31 9 -5 -14 49 31 8
7054 8 17 -3 10 43 15 5 7 -3 7 4 -31 11 5 -24 44 24 -42 13 32 26 -41 71 -11 41 -23 -8 41 -8 15 -28 68 27 -51
7087 -51 -28 -42 -9 4 -17 61 24 -16 -14 18 -17 42 41 50 -15 79 -10 -14 15 52 14 12 46 -71 58 17 41 -34 53 31 22 21 24
7120 24 33 -29 -29 -14 30 2 -3 18 -10 -15 -8 2 -55 -20 52 -29 10 -21 -16 -5 20 -28 18 26 -28 21 -38 -8 31 10 -37 30 31 44
7154 44 23 -21 -18 -48 -11 -9 -18 -19 -2 31 -11 -28 28 28 58 24 -50 -8 -21 -55 -1 -49 29 -18 -42 27 33 28 -11 0 -54 9 -34 3
7188 3 57 10 4 51 35 -38 -35 -15 5 28 -13 20 -12 -17 22 19 -27 18 25 -74 -15 10 11 -36 26 -6 -74 16 -5 4 -1 44 -19 -27 -22 68
7224 68 77 -15 12 -18 25 -20 2 15 46 44 -14 19 -18 -13 -20 -68 -18 16 7 -15 36 -24 -17 59 13 66 -16 -49 -8 -22 -18 4 -30 -39
7258 -39 -10 29 24 36 17 14 -9 -54 -44 17 -9 -89 45 80 12 32 17 -12 -12 3 24 -11 3 27 -2 72 -28 30 -12 28 -29
7289 -29 -21 17 -22 35 14 -36 -2 -22 -16 -23 -9 37 -77 18 -16 -37 10 15 -20 39 5 -35 -21 29 4 -14 13 13 -9 -22 80 15
7321 15 -21 -20 92 53 -41 -12 36 7 50 -13 -2 1 59 35 -23 2 3 3 -16 15 23 35 -48 43 39 9 66 7 41 33 23 33 -21
7354 -21 24 14 18 -7 -39 2 -55 6 54 20 -18 -23 3 -2 24 42 1 14 -17 -23 -9 -1 -14 -10 -11 3 1 72 7 -3 9 -7 -3 7 -11
7389 -11 -38 19 33 15 5 37 0 -57 31 8 6 22 -36 -8 41 109 -21 6 10 -64 -17 27 -21 47 46 -41 -21 16 -20 0 -2 -27
7421 -27 -80 38 4 14 14 -16 24 -44 18 -26 19 64 27 -7 12 26 -13 56 35 10 14 31 -57 12 20 8 -58 6 -36 -46 10
7452 10 44 -19 -27 0 47 -4 -8 44 48 -12 1 -25 -47 13 -64 -3 -5 39 5 -12 29 -7 -40 57 26 -42 5 8 0 25 -17 21 25 34
7486 34 57 -48 38 -18 23 -11 -22 54 -32 5 46 -32 -25 46 -48 -9 -25 -56 32 23 19 21 -31 -23 28 16 -27 -24 9 8 -34 -4 13
7519 13 -13 -38 -34 21 47 27 19 16 12 15 24 14 28 -16 22 -35 -27 1 7 12 18 -11 7 7 21 -27 -36 -48 31 -10 24 36 -36 3 -40 -17
7555 -17 19 31 -28 -52 -39 -12 21 21 7 33 -33 -26 1 -29 17 22 -6 31 1 18 0 -21 -1 60 31 1 -2 3 36 10 -27 -37 -10
7588 -10 39 -6 -39 58 -12 23 13 56 -24 -27 30 -5 40 14 10 -17 27 9 5 -28 52 27 2 12 0 -1 -35 -8 37 -3 18 24 -30
7621 -30 -17 -23 -23 23 -7 -37 -10 29 38 0 0 -38 12 -15 -31 45 -2 34 17 2 -8 -40 -47 -16 29 -19 15 5 5 54 27 17 19 6
7655 6 6 28 -27 19 -3 -8 30 87 11 -52 35 31 52 2 -8 52 -7 14 -1 -35 4 -19 48 -22 53 -38 -10 -23 4 32 1 -7 45
7688 45 8 -23 45 7 39 9 -68 -15 0 19 -2 -33 12 28 4 -7 41 27 12 -45 28 -6 -5 -5 -54 -4 18 -15 15 10 -13 17
7720 17 12 50 39 33 14 -34 19 22 15 31 -77 8 21 12 -31 22 25 28 43 9 -20 -6 58 -70 -19 58 -40 -16 -21 43 -89 14
7752 14 -17 -32 37 47 33 -33 -20 -16 12 -44 67 21 14 -54 52 -43 -34 -4 10 12 44 53 21 -15 30 -7 -11 25 -28 45 -3 -44
7784 -44 -13 -43 16 -11 -5 58 14 -6 -46 -11 32 16 -40 -24 -44 -6 25 -34 5 1 35 -6 -29 -1 -16 -68 -15 -32 6 0 -35 12
7816 12 14 19 -4 24 -1 18 0 2 -16 1 -2 -52 76 14 -33 18 -12 -18 4 25 -26 17 -87 -13 -38 -15 26 1 30 18 1 15
7848 15 24 -24 -19 -10 -22 -17 -24 -26 5 -6 -27 7 31 22 -8 -23 19 7 34 -62 25 35 -16 -69 4 -13 -16 33 41 -5 3 32 -33 -11 41
7883 41 -20 -8 -29 -34 -32 28 -25 -10 -35 13 35 38 -42 -43 -32 0 49 -43 10 49 18 -28 -42 7 -20 25 -17 9 -16 -1 -65 6
7915 6 45 24 -15 3 20 3 33 -1 -27 -10 -24 2 44 -2 45 0 -15 65 17 -36 21 2 1 -57 -3 42 -15 34 -27 -35 12 -9
7947 -9 0 74 17 23 -23 -38 -27 -10 38 33 31 17 28 -7 -17 6 17 8 5 -54 -32 26 13 33 -12 -5 7 -15 -15 80 73 11 -35 -29 37 12
7983 12 -31 29 19 23 -42 27 46 30 -8 55 -19 2 -42 14 25 -15 4 -23 -63 1 22 -82 20 49 -21 -7 7 71 9 -22
8013 -22 -4 -12 8 -24 6 24 -63 2 17 44 14 -29 37 26 18 -16 13 15 -18 -43 18 -23 21 4 -17 2 7 -28 44 42 26 7 4
8046 4 7 23 -23 -67 29 -20 -34 -4 -22 13 -34 -5 16 -20 -41 -2 35 -28 -5 -11 13 -14 -33 9 59 9 44 28 -20 37 -55 15
8078 15 -41 15 14 -22 12 7 7 57 -12 -14 14 -1 27 15 30 -45 24 3 -4 -4 -37 -2 3 -30 -10 12 -32 -66 9 29 -14 -19 -35 -4
8112 -4 18 -3 -30 17 16 -20 -15 -10 43 -28 1 -1 0 15 -43 -11 -8 -32 21 21 34 6 -17 -20 -4 3 17 28 25 19 24 -33 30 -9 -18 18 15 61
8150 61 -19 -4 -6 -36 -1 14 -17 -18 -29 25 -8 -47 -35 -29 10 8 -8 -42 -37 -54 18 33 31 7 -3 30 -40 20 -6 -5 -2 11 -15 -7 -15
8185 -15 56 -10 39 -44 -25 5
8191E
$$ Imaginary data points
##PAGE= N=2
##DATA TABLE= (X++(I..I)), XYDATA
0 0 0 0 0 0 0 0 0 0 0 0 0 0 0 0 0 0 -8 8 -8 8 -8 8 -16 16 -16 17 -24 24 -32 32 -40 48 -51 56 -64 72 -83 96
38 96 -104 120 -130 144 -160 178 -197 218 -241 265 -291 323 -355 390 -430 475 -524 580 -645 719
58 719 -805 905 -1026 1175 -1364 1608 -1945 2435 -3211 4662 -8249 37370 28709 -58002 -27055
73 -27055 16901 18918 -8347 -7541 -4787 -3041 11130 26624 -1535 -27060 -13876 12011 11775 -5590
87 -5590 -9733 10818 9501 -11716 -7476 13618 8221 -12285 -12633 6775 6690 -4268 3771 4648 -10995
102 -10995 -1358 17068 4647 -16501 -11861 4825 5318 -129 9130 6837 -12262 -7991 10888 6668
116 6668 -11411 -14948 3260 17450 6381 -5169 -1625 -2107 -6388 -2393 5709 4451 -7265 -4014
130 -4014 12581 5758 -10133 -2758 5360 -3451 -8114 3752 13046 -655 -13385 -697 9882
143 9882 3113 -2667 -4419 -3712 532 3083 4312 -341 -6871 -89 7865 2732 -4585 -6013 -1278
158 -1278 3311 563 1256 4138 -1482 -3396 1280 435 -1947 -1669 637 2197 -984 601 5488 -910
174 -910 -6994 -1833 2959 3215 -103 -2568 726 862 -1012 1843 349 -2963 -791 1019 2238 1047
190 1047 -2879 -836 1067 -898 1425 2239 -933 -1936 -2100 679 3529 -310 -2077 -346 -84 2299
206 2299 1664 -2849 -2097 206 1616 2375 -984 -1542 804 -1218 -631 2064 654 -389 -1442 -1135 2516
223 2516 1096 -2310 -1048 -199 1508 2466 -879 -1344 -404 -1287 690 915 -585 970 361 -635 453
240 453 -765 9 961 -2153 -1367 2011 2419 1241 -2929 -3415 2733 3298 -1284 -2642 -1365 2397 2424
257 2424 -1801 -788 737 -611 547 521 -870 -57 -596 14 1073 -319 846 1143 -2073 -1108 732
274 732 320 472 -924 -728 2271 839 -846 -569 -1261 111 769 -625 600 699 -201 822 -1113 -1465
292 -1465 1838 512 -1904 -661 1162 2128 -435 -2351 907 888 -1378 449 651 -604 -395 -529 1193
309 1193 1673 -1197 -1022 57 -51 979 -137 -1103 123 -302 1010 2265 -1578 -2535 465 1246 678
326 678 -913 -1140 1138 718 -4 384 -1741 -1011 1747 161 -664 344 219 334 -351 -419 880 -714
344 -714 -1213 1071 748 -146 -425 -903 1330 1245 -1884 -761 1068 311 -98 -657 86 654 -638 726
362 726 1072 -2009 -961 1500 571 -250 -931 -260 1534 230 -729 -159 -849 292 900 -435 333 134
380 134 -872 662 613 -626 -196 -594 302 1282 -303 -737 -353 -8 1421 -173 -1838 485 1035 -316
398 -316 -249 -358 276 366 -548 577 394 -1214 177 712 -182 26 -477 70 1106 -521 -610 559 -136
417 -136 23 4 -120 842 -410 -966 879 294 -561 61 -269 487 511 -912 -40 383 -240 205 -416 -177
437 -177 1095 -346 -871 450 91 152 -65 -695 473 327 -661 275 -8 -358 418 -184 40 312 -694
456 -694 97 609 -432 -31 136 38 465 -756 -382 1088 -75 -564 -22 -179 626 190 -859 306 234
475 234 -381 269 -10 36 247 -814 219 1095 -464 -598 -119 153 833 -315 -817 535 30 -166 404
494 404 -284 70 62 -362 619 181 -812 254 301 -156 65 -425 311 566 -923 -251 770 145 78 -563 -402
515 -402 867 165 -530 72 -276 188 452 -446 213 58 -661 473 485 -289 -136 -394 115 670 -500 -271
535 -271 384 -222 143 19 -212 495 -365 -588 602 234 -236 25 -242 315 195 -519 411 222 -592 182
555 182 215 117 256 -603 -239 618 -114 86 52 -503 272 69 -207 420 -209 -375 326 -138 157 173 -629 41
577 41 410 -77 152 -148 -280 369 -278 -126 654 -191 -467 -25 86 627 -31 -754 241 164 -21 247 -303
598 -303 -242 204 -183 426 338 -703 -106 377 113 153 -428 -265 534 -202 -173 278 -213 42 -12 -368 454 140
620 140 -421 41 -122 40 403 -402 -202 268 -263 184 255 -287 -6 -290 -168 637 -40 -404 65 -159 170
641 170 202 -356 176 48 -509 323 326 -154 -114 -404 229 642 -390 -347 73 -78 199 43 -182 351 -304 -346
663 -346 503 226 -145 -182 -326 437 387 -495 24 138 -197 164 -17 -10 119 -531 7 630 -227 -187 -51 -100
685 -100 395 -139 -340 467 -21 -298 114 45 227 -11 -588 192 378 -261 -50 -104 -101 273 -146 -14 318 -397
707 -397 -133 289 30 218 -204 -415 374 108 -206 197 -143 -88 166 -194 309 177 -497 16 239 52 193
728 193 -394 -182 362 -140 -121 133 -106 21 -45 -177 463 -19 -451 237 134 39 86 -354 71 234 -294 160
750 160 185 -298 -32 -63 54 469 -279 -285 292 11 77 62 -308 177 66 -244 266 91 -211 34 -211 210
772 210 315 -359 -136 203 -80 126 -73 -167 265 -183 -136 334 -66 -190 39 -181 341 105 -415 176 149
793 149 -186 94 -23 38 151 -367 53 400 -214 -72 15 -93 243 -101 -248 285 -75 -134 173 -47 93
814 93 10 -390 266 237 -260 37 -54 43 205 -278 -3 282 -284 -117 186 -67 153 -210 -204 432 34 -257 148
837 148 -44 80 70 -225 210 114 -360 73 120 -48 80 -302 17 391 -286 -103 218 -83 52 -36 -121 340
859 340 -85 -287 216 70 -95 15 -157 135 168 -383 159 189 -174 -51 -109 18 199 -317 -123 300 -80
880 -80 53 -25 -147 228 -58 -181 239 -29 -198 69 -66 155 120 -344 91 198 -172 26 -77 -35 180 -185
902 -185 -90 229 -118 -92 108 -111 129 -21 -298 235 32 -165 92 -60 79 132 -307 104 244 -134 -55 28
924 28 -35 183 -140 -138 289 -138 -121 170 -68 84 4 -242 290 111 -240 22 30 35 77 -253 24 287 -233 -7
948 -7 115 -91 112 -95 -63 211 -75 -174 163 -20 13 26 -179 222 39 -346 87 99 -39 53 -195 17 248
971 248 -213 -20 154 -100 52 -81 -50 216 -143 -221 174 -9 -61 -9 -165 191 76 -281 105 85 -74 90
993 90 -102 9 260 -180 -92 244 -137 -61 -4 -18 252 -115 -204 195 -12 -160 42 -56 181 107 -315 51 112
1016 112 -202 7 -47 36 190 -238 -25 292 -128 -78 84 -5 115 -108 -218 308 -18 -195 138 -60 40
1037 40 49 -171 141 121 -272 26 94 -97 78 -123 13 225 -161 -28 159 -96 104 -15 -173 207 31 -230
1059 -230 140 25 4 106 -191 85 143 -213 33 93 -85 133 -115 -89 215 -177 -84 100 -4 23 -14 -166
1081 -166 240 60 -218 128 54 -41 117 -166 116 126 -125 60 196 -73 49 -119 -85 270 -100 -148 170 -55
1103 -55 -72 27 -62 179 16 -232 119 122 -109 84 -84 49 158 -174 12 155 -157 -11 -25 -19 209 -185 -123
1126 -123 210 -71 -59 6 -104 31 7 -203 178 71 -174 -15 25 32 72 -283 -17 160 -134 -95 83 -36 66
1149 66 -138 -46 242 -97 -144 112 8 73 -29 -221 192 128 -192 52 8 5 21 -141 -26 229 -191 -21 87
1172 87 -66 100 -59 -155 194 1 -139 148 25 -11 20 -150 168 51 -290 96 99 -82 1 -144 -14 135
1194 135 -187 -60 194 -99 -5 -1 -87 186 -62 -224 123 -25 -32 18 -66 68 82 -162 30 162 -135 -29 -6
1217 -6 -20 132 -101 -73 181 -80 -55 60 -75 132 -47 -191 165 21 -100 50 -31 97 78 -183 34 100 -155
1240 -155 23 -27 -27 111 -115 -63 177 -35 -59 63 -58 102 -9 -164 125 10 -72 76 -34 28 70 -187 48
1263 48 127 -131 52 55 -23 116 -135 -50 195 -101 -100 61 -60 48 -15 -110 156 34 -163 77 48 -56 22 -126
1287 -126 107 114 -167 10 52 15 90 -108 -68 199 -88 -78 139 11 -16 -18 -39 67 29 -210 78 65 -73 14 -63
1312 -63 78 102 -169 18 104 -103 -28 26 -54 120 -100 -118 105 21 -12 -6 -45 55 -14 -145 71 114 -109 35 -5
1337 -5 6 117 -170 -23 131 -65 11 52 -52 70 -35 -94 136 64 -100 2 -87 39 55 -179 42 64 -86
1360 -86 -29 -29 -32 74 -142 -11 167 -48 -84 43 -3 12 -44 -95 133 -54 -74 31 -10 41 67 -105 64 53 -151
1385 -151 37 68 -6 6 -83 -43 154 -111 -16 86 -85 94 -46 -64 152 3 -120 51 -36 -27 51 -95 53 36
1409 36 -176 42 90 -38 9 -26 18 110 -108 -92 104 -9 -10 -36 -86 81 -44 -109 129 70 -77 -20 -95 39 86
1434 86 -127 34 81 -86 -12 14 3 38 -111 -57 131 -51 -57 -7 -56 42 32 -132 71 3 -134 9 -3 35 6 -107
1460 -107 34 150 -33 -16 13 11 70 -126 -56 71 -64 -75 8 -26 2 -13 -81 110 -2 -138 61 60 -43 32 -79
1485 -79 -14 81 -123 -59 -7 22 59 -89 -69 119 -32 -111 120 0 -13 -15 -83 86 22 -112 70 7 8 62 -66 3
1511 3 105 -70 -44 67 -31 -26 -52 -59 59 -51 -25 74 -11 -45 -37 -67 50 52 -147 47 20 -57 19 -61 -8 81 -99 -55
1539 -55 87 -75 -2 -16 -15 96 -57 -69 65 12 -21 -22 -73 82 27 -100 12 96 -64 16 -80 12 14 -84 -26 95 -111
1566 -111 -21 -26 -22 79 -21 -42 109 -28 -77 86 -30 60 38 -13 60 51 -74 75 54 29 20 -72 40 81 -56 -71 26
1593 26 -53 97 -18 -104 136 -11 -114 -35 -24 -10 22 -56 19 48 -91 52 44 -7 26 -67 -6 76 -38 -109 18 37
1619 37 -67 32 -46 50 -8 -73 88 35 16 80 -57 22 40 -52 14 37 6 25 -63 -18 52 -69 -32 58 25 1 -23 -9
1647 -9 40 22 -81 90 12 -51 7 17 18 11 -87 -50 53 -45 26 -18 -14 73 -37 -21 103 -60 -3 58 -35 20 45 -33 67
1676 67 0 -54 92 2 -5 -4 -87 -17 86 -31 -31 7 -42 24 -46 -41 76 -42 -38 11 -23 2 17 -62 59 20 -30 29 -38 28
1706 28 -20 -99 -37 85 -43 24 -8 -41 5 -14 -37 49 -16 -39 26 0 18 23 -25 24 10 -100 30 63 -21 37 -54 17 70
1735 70 -120 -32 43 -31 7 -39 -55 32 16 -17 24 -6 -37 34 -28 48 32 -53 24 -13 -23 -11 -25 -26 19 -79 20 65 -42 31
1765 31 3 -9 25 -17 -48 135 -10 -67 7 12 64 -12 -67 6 53 -70 27 -38 -19 29 -48 -3 42 -43 36 45 -23 22 -7 -47
1795 -47 48 -12 10 63 -33 8 43 -34 67 27 -60 15 -9 -6 -24 -55 -20 35 -58 -37 57 -7 12 -21 -41 57 -39 -70 35 -29
1825 -29 0 -16 -105 4 34 -103 -34 13 9 23 -58 -22 81 -17 19 22 -47 33 -32 20 34 -16 -32 59 -31 -27 9 34 91 -44
1855 -44 -73 16 44 -5 8 27 13 1 -77 -25 37 -1 20 8 -43 37 26 -37 13 30 -5 -30 -43 19 72 -63 -6 20 -85
1884 -85 -57 -77 -41 68 -24 24 57 -17 20 29 -27 42 -41 -16 81 11 -50 -2 -1 -14 -1 -61 -14 39 -42 -20 14 -33 -11 -70 -33
1915 -33 76 40 -63 23 15 9 17 -69 42 24 -33 46 -29 4 35 2 15 32 -25 -1 12 -63 -25 47 26 10 -93 -38 64
1944 64 -35 -61 -61 -11 34 51 -79 -8 51 -7 -32 -13 83 20 -43 -32 5 -17 -71 -45 49 46 15 -67 80 12 -37 4 -4 60 26
1975 26 -40 -3 1 -37 9 -34 -40 69 -24 64 39 -39 5 40 -31 11 -22 -56 60 5 -29 11 -29 25 -42 -61 27 35 -73 -19
2005 -19 9 36 82 -67 -34 33 -72 62 -8 -10 52 4 -25 14 0 -71 58 -29 -47 -7 -54 -16 5 -94 17 -13 -42 -1
2033 -1 4 9 15 -26 7 31 -46 6 14 -9 6 17 -22 40 24 2 -20 -50 11 16 -51 -7 8 -50 9 1 2 52 -57 -43 42 -45 -10 39
2067 39 -15 -30 20 -31 63 0 -33 -51 -31 47 -39 -83 40 52 -43 5 21 -6 9 -66 -63 45 -33 0 -53 -50 80 -15 -81 -10
2097 -10 38 -40 56 2 63 15 17 -48 28 -27 -28 -52 -52 84 -26 -13 20 -30 -2 44 -63 -51 -44 18 21 -27 -19 -19 13 -7 -49 -30
2129 -30 15 0 -4 -19 19 -26 -2 -50 -56 53 12 -19 8 -35 43 -2 -31 27 9 -94 3 -5 14 -46 -42 -7 20 -71 19 48 -51
2160 -51 13 -8 -39 41 -10 -12 31 -82 -70 -20 -40 4 -1 -78 19 -7 6 9 25 21 -7 -43 -25 65 3 45 -6 -38 9 -31 -44 14
2192 14 9 -67 29 -73 44 -17 -18 116 -31 -18 3 -38 -14 45 27 42 39 6 21 48 9 43 -26 -14 39 17 -15 3 24 33
2222 33 -41 0 19 74 -16 20 -38 17 -4 -11 8 8 -26 -50 -50 -11 54 -55 -70 90 -12 -46 79 -70 24 29 -70 -16 4 -5
2252 -5 -29 17 -41 12 -17 72 56 -51 -11 43 -15 -18 34 -16 56 -25 -52 19 21 -17 -31 -17 20 10 -13 67 33 -34 -9 -7 3 37
2284 37 -88 -35 43 -2 -7 -55 11 -9 -59 25 6 -29 -24 11 10 -3 29 -69 8 -21 -38 -15 40 -17 69 -37 -42 -15 7 -51 14
2315 14 -36 -20 14 -71 50 -6 -58 -16 39 5 20 -25 -60 54 -11 1 -4 -39 28 -13 17 29 -18 -31 1 -20 31 -42 -26 62
2345 62 87 -14 -16 1 -16 15 -68 -12 8 -5 -3 39 20 -6 17 -72 75 -46 -64 -5 -17 -53 7 -34 -13 14 -12 77 21 51
2375 51 24 -21 -2 50 -48 -36 28 -6 -22 -24 30 56 42 -31 17 -25 -7 30 -45 27 37 -69 14 7 -62 27 -30 -32 17 -53 -6
2406 -6 29 -72 10 -15 -18 28 16 -56 59 -29 32 54 -5 -3 16 -81 49 16 -20 -8 -37 -15 97 -17 50 -9 14 -4 -16
2435 -16 29 16 -53 -21 77 -38 -10 14 6 -37 29 -26 -34 68 -26 35 25 -24 -21 -52 46 -34 -28 -15 20 -37 17 35 -54 32 15
2466 15 -7 -13 29 21 35 -75 40 -54 -67 -6 12 10 39 31 18 29 -17 7 69 -70 -42 -25 -30 0 17 -27 9 -2 -90 -2 -12
2497 -12 -2 -56 -66 9 44 11 13 20 -35 14 -22 -37 92 0 -21 -46 -16 5 -12 -71 -14 7 -17 57 -41 -33 -5 -77 0 -5 -24 17
2529 17 1 42 -28 -66 9 61 -37 -35 -21 -25 -27 67 -16 54 20 -16 -1 38 -28 11 -44 -3 0 -76 -6 15 -51 29 -44 -24 80 -29
2561 -29 -51 7 12 0 5 -20 42 -16 -36 15 50 -17 8 -37 -30 16 -53 -59 61 -14 55 -71 -67 -25 -6 -30 59 0 -21 6 34 60
2593 60 52 -13 10 -14 -51 41 -12 28 41 -11 -14 25 10 59 -43 -49 17 -28 29 14 8 -66 -34 -9 -27 29 -61 70 53 -57 -41
2624 -41 -22 37 -17 -9 8 100 27 -18 -54 -40 1 -2 -21 -18 21 -25 -1 -14 45 -10 5 8 -16 -24 -18 -8 -29 63 -30 7 2 -18 -64 -11
2658 -11 -22 -8 -4 2 4 7 -5 -12 17 -25 53 1 64 30 47 -14 -10 -1 2 -38 8 12 -19 -42 42 14 6 15 -98 41 43 -49 65 5 -41
2693 -41 -32 -41 -7 -54 -14 49 -10 39 -3 2 17 55 -22 -11 62 -15 -32 -11 59 59 18 -27 30 49 0 -38 -51 -60 17 -18 14 54 -8
2726 -8 40 7 -53 52 -69 -43 37 11 2 -49 -8 3 -15 -35 67 3 11 13 1 21 -6 -23 28 46 -43 -9 -27 10 -8 -42 -22
2757 -22 24 17 -50 54 -45 37 -17 4 18 33 -69 50 -12 1 -28 -71 18 28 12 -12 77 -1 15 -56 30 83 5 -28 6
2786 6 -15 59 -5 20 7 50 -8 48 51 10 -11 32 9 12 -23 -13 -17 -17 -22 49 17 38 27 -51 39 -9 20 38 -56 3 -26 -28 -17 20
2820 20 -35 20 -30 1 13 -73 32 36 -36 10 -40 -27 40 -22 -57 9 22 -19 46 -33 15 -18 -25 44 5 -1 1 -44 4 48 -68
2851 -68 -12 31 -21 -38 -26 -58 58 -11 -18 23 3 -25 -3 9 67 2 -39 32 46 -9 8 64 -24 19 -46 45 42 6 -11 13 17
2882 17 9 66 -20 25 12 -57 47 17 -27 -2 21 9 -21 6 -16 -34 -56 -31 24 28 44 -99 -37 25 11 -4 -28 -100 48 -13
2912 -13 -71 -34 -41 19 -1 3 4 70 -55 9 -7 19 40 -32 16 -7 12 -47 41 0 37 39 -19 -36 10 -22 -7 42 -10 -15 -5 -36
2944 -36 55 -34 4 -19 -50 -5 -18 16 43 -75 38 25 4 -34 -24 4 10 -41 -60 -32 -16 -2 15 -2 25 66 -23 7 9 11 -63
2975 -63 21 21 42 -40 -45 5 -2 -65 -9 12 -31 8 -8 -9 30 -69 -32 -22 -28 -33 -21 15 3 -40 -22 -4 -11 40 -11 -3 80 -41 -53 33
3009 33 -20 39 44 26 21 21 -65 -6 23 11 -7 -4 12 31 -40 -37 20 -24 22 -5 -36 -16 -1 -23 11 18 8 -41 -8 33 42 35 55 19
3043 19 17 5 40 24 32 -22 -8 13 -25 -15 10 3 14 35 -58 11 1 -16 15 -16 13 28 -17 12 29 -20 -30 21 -31 16 35 9
3075 9 27 10 -42 62 31 -3 -22 -3 -7 11 -10 11 14 -27 -6 -9 55 78 -27 -32 21 40 42 -12 -27 -2 2 -65 32 15 0 -28 13
3108 13 73 -55 -21 -40 -11 25 54 19 -16 -11 -48 -17 33 -24 44 -43 -44 30 -4 -73 61 69 -54 -44 0 36 44 9 9 15 -21 -80
3140 -80 -30 -29 65 -15 -34 -31 -63 -17 54 -4 89 4 -43 -8 -13 -4 -28 -49 38 -2 -85 44 -8 11 -12 27 -7 27 -61 -26 64 -45
3172 -45 -31 -34 -83 -13 -9 11 -10 9 -1 4 47 -55 10 -20 42 -11 -21 52 0 -1 24 5 -39 -21 -20 32 7 -1 38 27 -37 31 3
3205 3 12 36 -19 18 88 11 20 39 -67 6 50 -12 7 55 0 38 -8 -24 11 -46 12 -21 10 23 -65 -22 21 -34 19 -31 -4
3236 -4 -16 49 -5 66 -28 -20 -48 22 -8 56 -40 -10 18 -41 -2 -10 21 -23 0 9 21 -11 51 -14 -25 18 2 -38 -9 -20 -46 15
3268 15 29 -18 17 11 38 -54 -5 -7 -11 -15 46 30 -17 57 -26 -42 55 24 8 52 -2 -11 -34 47 20 -19 22 34 -33 -60 17 -29 10
3301 10 -22 -25 33 -11 15 7 42 -20 -3 -72 -1 4 6 -49 8 -82 -29 -19 24 -3 14 -28 20 11 10 -20 18 5 26 -28 -11 13 14 -23
3335 -23 15 17 4 15 34 -1 16 88 29 -48 37 -1 22 40 8 -39 20 -30 -50 31 -40 29 55 -25 35 3 -19 3 8 -13 73
3366 73 8 -31 -6 -35 92 1 -31 35 -21 13 -17 -5 -28 0 20 8 36 -14 18 -4 -39 40 0 30 -41 9 34 8 47 -58
3396 -58 41 -45 -9 -17 31 -5 -11 -27 -27 39 46 -24 -27 15 2 3 24 -21 -44 17 31 40 34 66 -50 -7 2 57 -30 15 -14 -35 15 26
3430 26 30 -7 -85 -24 -5 15 -69 17 3 -51 48 -34 3 22 30 22 2 -3 32 -68 -2 22 31 -8 69 35 -33 51 1 17 28 -1
3462 -1 23 55 0 63 -16 -7 8 -48 -11 5 -6 -14 10 0 36 49 -19 8 60 37 -32 12 55 -39 -22 -5 -17 3 -6 4 -16 25
3494 25 -35 -20 21 37 -35 26 23 18 -18 -60 69 72 2 -61 34 49 10 -31 47 -27 0 29 -24 50 5 16 -10 15 11 -53 14 41
3526 41 -6 7 5 21 28 -7 17 27 -75 39 -11 30 24 -20 6 57 -23 58 -8 11 14 -19 29 22 10 50 -32 25 47 49 -19 14
3558 14 20 24 -30 -25 -27 -42 17 0 20 -2 -42 -21 -4 37 53 -11 43 -25 15 11 6 18 16 1 34 64 18 0 -10 -20 27 48 -27 -21
3592 -21 49 59 22 -31 39 -47 -39 36 42 46 -40 16 3 -6 -27 42 -55 -4 -46 11 -2 -27 53 -2 -57 -64 -51 3 17 -21 4 -30 -11
3625 -11 5 40 24 23 -84 -7 34 -5 15 35 27 -4 55 -29 -7 -6 53 25 -27 9 43 -11 -9 -5 -32 22 -20 -22 -8 4 -19 -29 21
3658 21 99 37 -6 66 55 2 -44 -31 -2 16 9 -41 34 -23 39 46 0 -29 -53 -6 -33 7 -32 -3 26 -7 38 -19 -50 -19 -59
3689 -59 -25 10 -5 -30 -4 27 -11 35 -32 20 33 9 7 -17 -12 20 -4 47 -30 6 -3 41 -16 12 34 41 38 28 -16 4 -8 -35 -14
3722 -14 54 24 -16 -18 -13 -23 58 -51 -10 -2 22 -1 -31 17 -42 -28 -21 44 53 -14 26 -21 -14 21 -44 -6 1 6 7 -29 -6 -63 17 16 18
3757 18 -13 11 6 -22 27 17 -19 -12 -24 22 15 -31 33 -23 3 -2 50 -26 -39 -40 -1 -41 -7 -12 43 -39 -23 -33 -4 7 -4 -35 31
3790 31 -20 20 68 4 5 -5 9 23 18 4 7 -12 -48 22 -64 -12 -13 -48 -26 -30 -27 -1 5 -33 -58 18 -41 -8 -9 -19 -6 2 -73 -27 -45
3825 -45 14 -6 59 -32 -10 -30 -8 -39 -18 52 -6 29 -10 6 -2 77 18 -29 -36 20 25 7 3 -19 -23 1 59 31 -14 -27 -14 -39 -37
3858 -37 -3 -8 30 -39 -8 14 16 -8 -6 -15 -41 -15 17 82 -2 10 -30 12 -39 -41 13 39 2 27 28 21 19 -20 4 -29 -22 -28 8 20 29 -19
3894 -19 26 30 -20 18 -29 50 67 4 -64 19 -22 -11 -12 -34 -5 19 -48 -28 -4 -10 -29 2 20 14 -16 -25 16 35 43 47 23 -5 -23 -48
3928 -48 24 -20 -18 5 7 33 22 -10 5 -11 4 40 55 15 -34 -61 29 34 -52 -20 19 -23 -17 -58 40 41 10 -17 -61 18 -18 0 11
3961 11 -20 39 15 -33 27 -5 -51 -47 31 10 12 41 -39 -31 -10 -69 -16 -9 -26 -37 5 -15 6 -60 5 -5 -7 21 -41 0 33 36 -22
3994 -22 -13 19 18 23 -15 -6 47 71 19 -19 43 -67 -11 42 25 28 -64 -24 9 -1 19 -44 -37 6 -31 -3 39 33 28 -16 -55 38 -6 0
4028 0 27 -91 -52 11 -4 15 -68 9 1 -1 40 57 -48 14 14 -14 35 24 -29 -10 21 18 41 10 -8 -25 -3 22 -18 -74 13 -15
4060 -15 -26 47 -11 -15 37 33 -5 17 21 20 -4 -4 -38 15 12 10 0 -33 39 22 -13 23 47 -2 27 13 17 20 2 -46 56 9 5 6 0 -40
4096 -40 6 8 14 17 27 11 -18 32 -28 36 9 0 1 -8 -3 -52 -25 -32 -45 3 19 22 21 -43 -11 -38 47 36 43 21 -39 16 49 19 -2 52
4132 52 0 29 53 18 14 12 10 4 22 9 -4 -70 -9 -34 25 -8 -17 -30 84 74 -7 -40 -52 -26 -10 11 36 -22 44 -21 -49 46
4164 46 25 6 -20 -9 -47 -24 -3 22 -22 -14 48 26 38 -17 23 62 33 28 -26 50 27 -37 -11 -9 -19 21 4 -13 -19 15 58 -60
4196 -60 19 -26 9 6 7 7 -7 8 3 57 -6 -5 -2 19 -15 14 14 3 -17 62 38 -23 19 13 -53 9 -22 -26 0 -10 -38 19 -35 -11 31
4231 31 14 -6 -39 62 -1 25 5 -29 25 12 8 -32 5 6 -9 2 23 18 -56 -10 21 -30 -25 80 8 1 -70 -19 -15 -1 0 35 -48
4264 -48 -28 -7 23 -37 63 12 -18 7 -6 28 46 -16 -2 -56 -14 -4 1 24 17 -39 -10 20 -21 24 3 -18 46 7 -12 -6 -43
4295 -43 -17 18 46 -46 42 -49 57 -33 55 60 26 -39 -18 26 -42 10 -13 5 -18 -11 -35 -54 -9 21 -43 -62 0 -22 -19 -3 18
4326 18 -7 6 -42 4 -11 5 28 -25 -11 29 -20 13 -27 15 -1 3 5 38 -6 -12 -10 3 -33 7 51 32 28 -32 20 -31 -47 11 7
4359 7 -22 30 32 -17 -40 -17 -12 22 -12 -52 3 10 4 27 64 62 -18 72 5 -27 7 2 -9 -11 10 -31 28 7 64 2 54 69 -13 -21 -17
4394 -17 14 19 -29 -49 1 -14 29 -25 -13 49 -18 -3 -43 -38 -48 61 40 25 -38 49 -1 7 9 -31 78 -34 29 91 6 -26 -6
4425 -6 27 1 -30 27 4 24 29 -1 -25 -40 7 -15 -34 4 -43 -30 1 -19 -6 21 1 21 -23 13 23 -3 4 9 -7 63 12 -8
4457 -8 -2 -56 26 -43 35 -34 24 -19 97 68 -37 -30 23 -20 -45 -6 28 57 29 -63 8 30 -18 -26 4 -22 26 -27 -13 -10 39 -4
4489 -4 -15 -6 30 -30 34 -25 31 50 1 -21 -37 -10 15 -1 -27 -4 -7 -9 -35 40 -49 53 -32 -45 -35 4 28 -1 1 -54 3 -42
4521 -42 3 5 20 28 24 29 27 -21 0 -8 -38 -26 55 -55 1 0 5 -43 -3 -40 -44 6 -6 37 -34 46 3 -10 -3 -3 -43 39 46 -4 -36 -14
4557 -14 18 24 -2 35 19 -35 -2 -8 35 31 -6 -20 -29 29 20 3 -55 -15 -9 -29 -5 6 -24 24 -22 -10 3 4 -25 42 -18 65 21 5
4591 5 28 -14 31 112 -10 -30 -20 -54 -29 36 -22 -35 59 -49 -33 33 -35 16 -47 2 -36 -10 25 -7 4 3 -35 -44 -2 -19 38
4622 38 4 -2 5 -1 13 14 86 8 -45 40 2 29 17 6 27 -3 58 -27 22 18 17 5 -12 -36 10 -34 -63 8 -22 34 -26 -9 21
4655 21 -47 -22 38 -2 4 28 10 -28 -35 -41 -16 33 9 -20 12 -40 59 -8 -38 -36 29 -11 -3 48 -7 32 -39 -51 -14 21 -10 41 13
4688 13 20 0 5 -4 13 31 3 44 -38 37 -12 34 15 -13 -26 42 -32 12 22 25 -17 -49 22 23 39 5 -28 59 -11 -25 4 -32 -24
4721 -24 -15 -8 -23 25 8 22 1 -43 12 -51 -44 -14 15 53 -32 -30 -32 -83 26 1 -9 -24 -24 -1 -10 48 23 -5 16 15 -22 -3 48 -35
4755 -35 -8 12 20 1 -18 -15 7 -11 13 12 -18 51 -43 -19 2 -12 18 -7 -31 -7 32 -2 -47 24 24 69 -9 28 21 9 -10 -13 41
4788 41 22 -21 -14 23 4 -14 -5 -3 -3 32 -1 -18 48 -22 -53 -24 27 -44 12 9 31 -17 35 -17 -6 23 62 32 -47 5 -59 -55 -21
4821 -21 7 -15 -43 -12 -19 23 6 9 7 13 -54 -41 -37 -4 -44 51 23 -40 -20 -18 -32 9 16 -10 16 14 43 -56 6 27 20 -23 50 39 10
4856 10 11 19 25 -26 -10 17 -5 -17 20 -76 0 78 18 -18 37 28 -13 1 57 -4 5 3 -44 -5 -2 -7 -18 54 -7 34 45 72 3 -56
4890 -56 -1 -25 -68 19 27 -12 51 -17 25 -5 -35 30 41 42 -31 22 38 9 -65 86 -4 -53 6 -14 8 -20 0 79 -6 -25 36
4921 36 -22 5 77 45 45 -45 24 15 -18 -10 79 16 8 -38 -74 -8 -11 -27 -58 3 -50 2 -14 -35 12 28 -40 44 -35 60 45 42 -18
4954 -18 14 1 -10 7 -34 -10 1 -16 -33 -9 -83 13 14 -35 -13 2 6 9 32 17 -10 -22 -10 -33 46 -11 -23 -24 -29 7 3 8 -8 -39
4988 -39 55 -50 -30 -7 -9 41 20 16 -7 -16 1 30 21 -19 -29 7 -11 24 -21 27 -18 -34 1 -37 -41 6 -6 -9 24 46 4 19 -30
5021 -30 12 23 -46 -52 -8 20 -17 5 -1 30 6 -11 -33 29 1 -2 -38 -41 27 8 -15 0 42 3 -38 -20 -35 32 32 -29 -40 -6 -28
5054 -28 18 -9 25 8 -8 -6 -13 -9 -27 64 -10 39 -42 24 33 -5 8 -20 -12 -6 -15 12 21 -54 -32 -67 5 16 4 -40 11 -34 10 -33
5088 -33 25 -27 -6 19 2 15 12 41 10 -34 -34 -8 -14 1 -1 -19 -13 2 7 55 -24 -26 -21 -54 -34 -39 -29 16 31 41 -30 25 11 24 12
5123 12 -48 -22 6 16 -24 -4 11 -24 4 35 25 0 -36 -16 33 49 -28 9 -11 17 -13 -46 -7 19 -9 36 -36 0 64 -44
5153 -44 -39 -35 -7 -16 19 -75 -18 13 -15 8 20 -24 3 -65 -13 10 23 34 19 20 -16 62 36 -11 -10 -37 -32 18 -21 -71 -44 11 35
5186 35 11 -20 48 -1 -11 0 3 14 17 -57 7 -43 10 10 -10 52 -52 27 -10 10 3 32 -7 -12 -21 -24 19 -41 14 -60 -46 -20 16
5219 16 -29 50 -20 -22 -8 51 -14 -13 37 -34 51 -14 -26 -28 -2 29 41 -24 -28 -8 44 -4 5 -9 -30 34 7 -2 -11 -55 14 45 39 -15
5253 -15 -24 -41 29 -26 -6 15 -23 16 29 31 39 72 11 -30 -4 -3 -73 -35 -8 -35 -6 -51 10 50 9 -27 -74 6 -34 34 9 -62
5285 -62 -5 -28 -7 -34 -30 46 49 -22 44 -1 -11 -40 -49 -22 -37 -50 -46 -27 -35 -21 16 -55 26 -9 -27 -20 -29 -3 37 7 17 -15 -42 -71
5319 -71 -30 -25 -68 39 -31 32 6 -41 -19 56 -20 -38 18 80 33 15 -1 -14 -25 7 9 14 19 -19 2 10 -3 14 -17 5 31 -2
5351 -2 -1 33 2 0 12 -74 -48 45 13 44 2 8 -17 21 -2 -32 46 1 -40 13 6 -13 -34 33 10 5 8 -37 -4 -13 53 -19 -8 9
5385 9 -48 -23 13 -40 59 1 21 29 55 -15 -20 -35 -16 -4 43 80 16 23 45 60 24 41 5 5 -13 18 15 -37 -40 17 14 6 -40 47 -30
5420 -30 17 22 6 -21 27 14 -1 27 60 -4 -1 13 -26 45 -1 9 -22 -27 -54 -53 -12 4 6 51 5 -14 1 37 3 15 0 11 -30
5453 -30 -3 47 10 -36 -39 -59 -20 27 14 -20 -6 18 -12 -42 0 -14 20 -8 -18 -16 8 -18 29 -4 -2 22 0 -3 -28 3 29 -51
5485 -51 -10 -1 -72 45 -54 14 -17 18 33 -8 16 1 -16 47 -46 -37 9 -38 -10 0 -20 3 -6 57 9 31 54 -3 -56 22 32
5516 32 -32 -13 -62 -22 -70 -51 29 1 -40 -30 -17 13 32 -19 -36 19 -43 31 23 11 6 -20 -41 10 -3 17 32 -55 18 -40 -90
5547 -90 19 -19 6 36 22 53 -30 37 -21 -30 -5 22 9 12 -21 14 -6 29 7 -32 21 6 -25 -46 3 -34 38 38 48 -55 -49
5578 -49 -15 36 -13 46 -11 -32 -5 -44 55 -32 -33 53 51 20 -24 -5 -34 0 9 6 47 -36 28 58 5 -6 -27 63 -7 62 -29 -25 13
5611 13 -14 57 23 -23 13 -39 38 -19 4 2 -25 20 -7 -44 31 -7 31 5 35 45 17 10 2 -5 32 12 18 -2 -41 7 9 17 14 -35
5645 -35 13 19 -16 -31 4 31 3 -35 17 13 -3 -10 13 -54 -13 27 -43 -13 -6 41 -2 -21 -17 -11 -19 -27 17 -40 -5 36 -21 41 -33 -6
5679 -6 65 16 -7 -6 -42 -18 -3 -10 -6 17 -21 -31 29 21 4 4 -11 47 -34 -10 57 28 -52 -4 29 -17 -6 23 9 -30 -29 16 -41 6
5713 6 38 -14 30 -14 -5 4 31 -4 30 4 -11 29 -9 42 9 22 17 -31 29 23 -19 -10 -71 7 54 -2 35 24 5 31 18 -50 37
5746 37 -18 29 34 13 22 0 -3 14 -20 -30 20 8 -1 -3 44 -2 17 22 -61 4 28 1 18 31 -2 -10 -52 -59 17 -4 26 2 -33 0
5780 0 1 4 54 9 -36 -30 28 17 8 70 -28 3 38 8 37 9 -29 -56 40 -7 -39 -27 24 -52 -6 53 43 1 5 -17 -34 22 14 -7
5814 -7 10 29 1 -6 73 -68 30 19 -28 -42 8 18 -13 5 -36 35 -4 -22 -15 41 26 -14 -38 32 34 30 -28 12 21 -23 -29 39 47 48
5848 48 -19 -16 -46 31 4 -4 30 -29 -4 -15 -9 -23 22 -28 33 22 -49 -18 7 10 -4 1 26 -50 -11 19 46 -10 37 34 3 -27 9
5881 9 36 -2 5 18 10 35 30 -18 -3 -10 -6 -12 77 43 -56 16 20 19 5 3 -8 -34 -19 -46 33 -35 -33 -41 -9 26 38 50 -44 -56 -43 75
5917 75 1 -6 8 3 32 7 37 -62 7 3 -30 45 0 43 -19 16 -16 44 20 33 -6 -12 0 20 32 -7 21 -16 66 21 5 47
5949 47 12 -59 60 40 -14 9 -5 35 3 -85 -24 16 -13 -20 -11 8 2 41 -19 93 -1 2 -7 29 32 -2 -13 -25 37 2 -14 27
5981 27 25 5 12 26 -21 23 37 -18 35 -9 -16 -8 9 -54 -6 36 33 -18 -26 -32 -39 47 32 -49 39 11 24 -10 -30 40 -7 13 -30 0
6015 0 -37 9 11 21 20 -12 11 12 4 -21 -70 57 32 28 -17 14 6 2 1 -21 24 18 -6 54 -2 -46 -17 31 -22 42 7 -31 48 47 13
6050 13 -13 -7 11 6 55 24 -51 34 -11 -10 18 1 -8 10 -37 42 -12 -44 -32 -4 6 -23 57 36 21 -11 -31 -8 -50 70 13 11
6082 11 -9 16 4 -22 -19 -4 0 -7 0 -19 34 -5 1 -2 -14 -30 35 -33 6 -18 -5 42 68 24 68 2 18 35 -39 44 10 -40 -9
6115 -9 26 -43 11 -6 -20 -28 3 -38 -9 27 24 -50 -11 3 52 59 7 82 57 -20 -28 31 -35 35 -11 44 32 -11 -12 50 12 -6 -34
6148 -34 17 5 -39 24 19 6 -12 12 -12 -9 1 9 -9 -24 -2 -13 29 -34 9 16 51 -25 2 77 -36 3 -19 3 -28 15 24 0
6180 0 28 -42 15 12 12 56 31 11 29 -30 32 15 53 -52 -29 17 -16 6 -48 -26 1 1 -21 -38 -8 29 25 -29 15 -10 25 2
6212 2 26 32 27 9 35 -8 -35 -55 -24 24 12 3 -66 -17 -27 42 60 -25 20 58 9 14 -53 -7 -9 -26 -12 -9 -21 12 64 6 -5 -35
6246 -35 -5 12 -9 -52 -16 -12 28 -4 -32 -9 -8 33 22 7 38 -17 21 -50 25 10 -10 17 -32 3 -31 39 7 58 64 -45 -42 -4
6278 -4 -27 -4 -5 -31 -16 22 -48 -2 -20 -40 36 17 39 12 5 -6 50 22 -46 -11 1 -40 3 -21 44 -2 -93 -38 10 -57 -53 -30
6310 -30 -1 -27 0 36 -3 0 -10 10 -33 29 -17 -61 -26 -41 -3 -26 -34 45 -21 -31 21 -3 -49 -23 -47 47 -30 9 15 -59 14 31
6342 31 39 -62 36 -35 42 11 -1 31 -22 -33 48 1 -13 -9 -16 -8 29 -24 -13 42 -46 23 -46 -20 -7 -42 9 21 26 -8 10 -6
6374 -6 -22 24 -11 7 -46 -43 29 37 5 -2 0 27 1 7 -21 -29 -45 -14 4 -10 -41 -6 13 33 -3 -9 -71 -3 -1 10 -37 7 13 13 -10 -24
6410 -24 41 86 28 6 -41 29 7 -4 16 -4 5 8 66 26 42 -2 36 -17 -3 -7 27 23 -33 -18 1 43 -51 38 -5 -34 -19 -20 -66
6443 -66 -44 -2 -46 -11 2 -30 13 56 -12 -27 15 9 39 10 -21 42 9 22 -8 3 9 -52 7 -11 -62 19 41 -5 26 34 40 1
6475 1 12 5 -39 -1 17 -103 9 2 -28 -6 2 -47 12 -16 -60 11 49 -38 22 1 -35 18 -26 10 35 -34 -16 -8 4 -46 40 52
6507 52 -9 -35 40 27 -20 29 8 -19 -44 -54 -10 9 -31 55 19 -2 18 2 16 0 -39 -22 -14 32 3 -32 -30 18 -27 -7 6
6538 6 -10 -37 8 36 -22 20 43 61 12 25 37 2 -1 58 27 48 32 -27 -1 -29 -46 -19 -14 20 65 -7 -2 51 -35 22 -9 -43
6570 -43 -34 -21 -21 49 31 -13 31 6 -41 22 47 2 -21 -4 7 71 36 3 57 34 54 24 32 -14 -16 22 5 64 -28 -8 -16 -32 -2
6603 -2 -81 13 -26 -30 -52 5 7 -27 -7 29 -3 15 7 44 43 -33 18 -30 -18 -13 -1 34 -9 45 -31 -10 31 13 -62 21 12 -43 57
6636 57 19 22 35 -14 -5 -33 -5 -22 -28 -14 4 -42 35 -41 -12 -3 24 40 -60 -61 10 -39 4 25 -13 -5 -13 -7 -18 -2 31 18 -25 41
6670 41 -30 -33 -20 51 64 -3 8 16 10 9 28 9 -8 1 -7 29 -6 24 -10 14 -4 -29 -3 -34 -31 11 32 -21 14 35 24 3 -20 8
6704 8 -16 -1 24 -13 13 39 -35 22 -47 70 15 -28 -45 14 -22 23 -21 10 3 -13 32 4 -8 42 -46 -29 17 15 -13 -16 2 -49
6736 -49 -12 51 -14 2 -16 -37 52 -28 37 33 1 17 -48 44 49 -13 34 20 16 37 0 -3 37 27 -13 -48 -5 1 -49 35 2 -79 -11
6769 -11 -30 -32 19 -15 16 3 -15 42 -27 22 36 16 7 10 22 4 29 -22 23 7 8 48 -23 -42 -51 6 26 -63 18 -29 16 -13 -51
6802 -51 25 -38 3 2 1 44 -44 -29 16 -30 15 90 -19 -1 64 -17 -33 -27 -17 -3 -24 72 8 4 28 52 65 11 -4 0 -41 -34 36
6835 36 38 56 36 49 8 1 15 16 38 -10 -5 19 2 8 -19 4 -47 -44 15 -9 -25 60 -6 -46 -7 20 -32 -3 -11 31 -25 -30 -6 5
6869 5 41 -15 16 29 -44 0 39 -26 31 -25 -9 4 7 49 -19 -22 -27 20 -14 1 12 7 -42 -49 42 6 5 -1 13 -47 1 14 14 35 -52
6904 -52 15 -17 -18 7 -4 -23 13 -8 -13 13 -5 -52 9 2 54 0 -33 36 10 -10 -22 18 33 49 -8 -34 12 39 14 -4 25 -25
6936 -25 -13 14 21 24 19 21 31 19 -27 18 14 -18 19 -13 -28 -26 5 33 54 55 -51 -6 -17 16 40 -7 -4 16 -26 5 -11 42 6 14
6970 14 -33 19 -1 -41 31 -18 3 55 25 1 21 -31 -53 -25 7 8 -64 -43 -4 36 9 4 29 18 58 10 -28 21 0 10 -41
7001 -41 -4 -20 17 15 -34 -1 10 -6 -9 19 -32 -37 36 -9 -17 19 0 40 -15 2 -36 -38 1 -37 -9 2 -17 -23 10 -6 35 14 13 14
7035 14 37 10 -17 3 15 16 33 28 21 -30 27 -2 68 63 -19 17 15 40 10 14 6 -46 -38 8 -39 7 63 4 42 -79 32 28 6 1
7069 1 -16 -15 -17 20 21 -23 15 -37 -4 18 11 -21 3 -21 -46 52 -32 4 -17 32 44 34 9 31 65 -50 21 10 8 6 -29 24 11
7102 11 8 11 0 -46 -7 -42 -12 18 -30 4 27 11 53 -11 -7 29 -33 -29 68 -38 36 4 1 -5 33 62 3 2 -35 8 -23 15 -10
7135 -10 -39 6 40 24 -33 -42 48 -12 -26 -2 -4 -39 -18 3 0 -47 -13 -17 3 -68 48 -13 27 36 -29 24 24 29 -66 61 -48 -42 21
7168 21 21 -5 -12 -2 -14 -18 -14 8 3 -27 19 -51 -14 -29 -12 -59 70 -37 -6 -11 3 -6 -11 3 -47 7 -50 19 -64 -3 -7 -3 -6 20 -2
7203 -2 -46 -23 -28 5 -15 -9 17 -10 -26 4 -16 1 -37 -38 13 -13 14 13 39 -32 -42 -11 13 -52 -29 5 19 -8 -50 42 25 -21 10
7236 10 -54 -41 -12 34 -22 -7 -5 -12 34 -18 -27 -9 29 -20 -19 -38 3 -7 71 18 10 23 35 3 -4 22 50 -31 -18 57 27 -16 62
7269 62 -7 16 -12 7 -3 -52 10 11 6 -10 16 -53 -49 -3 33 -7 37 -1 17 -41 -33 12 26 10 44 5 -21 41 -47 -43 -29 -57 2
7302 2 -44 22 12 -22 7 13 -1 -32 -17 -106 6 -13 -83 -28 -29 -69 10 25 22 -39 -7 29 -22 -2 32 18 -42 -30 4 -13 -18 -46
7334 -46 -7 -41 -65 -11 -34 -32 25 9 44 -14 -2 12 14 -14 -10 34 -6 -50 31 19 8 -84 -21 1 -22 -50 -35 44 -59 37 -3
7365 -3 33 -4 9 17 12 -50 2 18 -15 40 -15 67 3 -3 22 25 59 51 46 5 5 -48 -20 8 2 29 -18 -8 -25 -78 1 31 -7 7 -49
7400 -49 -50 14 16 -22 -23 -18 -21 1 -4 14 11 -44 -51 -22 -39 54 15 4 -3 -70 -12 -28 11 1 -54 2 53 -45 -87 -23 26 5 8 -8 -40
7435 -40 -11 -31 12 -16 -1 8 -23 -30 22 1 -2 45 -7 -27 30 19 5 22 0 -32 -35 28 -39 -5 63 -25 26 13 19 -20 -5 -11 -12 -7
7469 -7 -31 -8 41 -23 4 0 2 27 -39 -15 14 -4 -40 -16 -16 -31 -3 -2 -11 21 -16 -88 26 -27 -10 62 -19 -1 22 23 38 -5 25
7502 25 76 33 -7 -17 -16 -30 -14 -74 32 27 35 26 -18 -40 48 -44 2 -34 -40 17 -19 -31 2 -2 -51 -30 44 44 -8 1 10 28 -16 -20 28
7537 28 -28 4 28 9 21 -11 12 -2 6 -11 24 -58 10 -3 -33 14 67 36 -21 16 4 -14 7 2 -42 -4 26 -2 -32 28 -15
7568 -15 -33 -27 -18 32 43 -13 -9 2 -31 -53 10 5 58 21 -2 23 38 5 42 -22 36 -13 -72 86 -1 -84 32 10 30 17 -43
7599 -43 -34 36 -5 33 -41 30 -9 -25 2 -8 -24 -32 12 38 25 17 -74 3 0 -60 -28 15 27 27 18 -34 -37 -16 5 32 37 23 25 -21 9
7634 9 -23 33 -16 -19 18 -4 20 17 50 -29 57 -10 -5 2 -38 -35 -28 1 10 -27 -50 -32 9 2 67 -58 -11 10 14 19 59 -1 -44 -27 8
7669 8 18 -7 -16 3 23 9 -31 -18 -25 -31 -27 34 16 -15 -51 -30 -26 4 7 -38 -39 -56 -20 -37 4 -30 21 -64 33 -21 40 26 11 22
7703 22 5 -9 -9 5 -7 -43 27 1 20 25 -6 34 -35 13 -2 -23 -1 19 27 -19 -16 50 -27 5 17 3 -2 -33 30 -4 -4 14 10 -23
7737 -23 25 22 -18 -38 -23 39 32 -19 -18 8 -13 41 1 15 -18 31 -10 -80 -4 -19 -11 12 2 -21 -9 -49 33 26 -40 -49 -20 -22 -48 -30
7771 -30 15 -26 -41 18 6 -47 -74 18 34 -68 -12 41 -31 -24 13 72 9 52 -9 -11 17 51 -12 -31 -25 43 -38 22 37 -35 20
7802 20 -9 12 -68 22 21 -32 11 -10 -16 -45 -43 -32 13 31 43 37 44 -21 21 -50 4 46 -38 -22 61 2 19 -24 -22 38 42 40 -40 31
7836 31 42 1 -20 -9 5 26 10 2 26 2 -20 -69 -44 -8 -4 -12 40 41 3 37 13 -34 -62 -16 20 13 39 -27 -8 43 -9 3 -7
7869 -7 20 20 7 -21 -22 -31 29 26 -2 3 14 7 -13 -8 -16 -38 -9 -14 39 -20 54 -48 21 -2 34 -12 10 -9 -40 14 -48 -17 12 10 -3
7904 -3 -35 -24 -9 -38 13 51 -25 20 28 38 25 21 -17 12 28 11 3 -16 -21 -17 -41 -5 -12 -17 -38 23 -74 -13 -26 -17 -9 -3 56 3 19 49
7940 49 -52 -20 42 2 11 -5 18 26 -25 -37 -4 74 -41 2 -29 0 39 -35 18 19 -26 -20 -9 -36 11 15 17 -17 14 -34 2 24
7972 24 -28 -12 -35 -4 -1 20 -47 -9 -31 -45 -23 -58 42 8 -115 -6 13 19 -29 -56 -48 28 0 36 6 -10 -57 -49 4 -2 34
8003 34 -39 5 9 25 23 -8 2 23 -16 42 9 -20 -27 3 -38 -24 10 -17 -29 -35 -60 9 -27 60 -29 -43 13 1 14 38 -49 17
8035 17 -7 -28 11 30 -44 -2 -16 -29 8 -18 -11 25 -44 34 -14 -16 0 21 -19 -17 -46 15 -1 -40 29 1 12 13 -27 -4 -8 -61 17
8068 17 -19 9 -14 -40 40 -41 2 -18 -40 -12 28 -27 11 -19 -8 14 24 0 1 -46 15 -57 -54 -15 0 6 2 -62 6 -12 -31 14
8100 14 -4 35 -10 -35 -7 -41 -18 14 -19 -29 19 -8 37 -49 -31 -23 -5 -50 -2 -8 -51 -1 15 35 36 30 -1 55 42 58 -24 39
8132 39 72 -6 27 -37 -4 -29 -31 -49 -47 52 -45 -38 2 -38 7 -5 -28 27 7 48 20 -77 15 -54 39 -18 -41 4 18 -43 -39 -14
8164 -14 -2 -20 35 -9 -5 58 7 46 -8 71 -15 -13 25 36 -20 18 39 -12 18 -12 -9 -41 18 35 15 21 -16
8191a6
##END NTUPLES=NMR FID
##END=
