##TITLE=1H_Pr TUr-10
 200.13MHz, CDCl3,
 8 sc
 
 10.9.2025
##JCAMPDX= 6.0         $$ Bruker NMR JCAMP-DX V2.0
##DATA TYPE= NMR FID
##DATA CLASS= NTUPLES
##ORIGIN= UXNMR, Bruker Analytische Messtechnik GmbH
##OWNER= pz
$$ XWIN-NMR		Version 3.5
$$ Wed Sep 10 16:07:56 2025 Russian Standard Time (UT+4h)  she@DPX200
##.OBSERVE FREQUENCY= 200.1313
##.OBSERVE NUCLEUS= ^1H
##.DELAY= (6, 6)
##.ACQUISITION MODE= SIMULTANEOUS
##.ACQUISITION SCHEME= undefined
##.AVERAGES= 8
##.DIGITISER RES= 18
##SPECTROMETER/DATA SYSTEM= spect
##.PULSE SEQUENCE= zg30
##.SOLVENT NAME= CDCl3
##.SHIFT REFERENCE= (INTERNAL, CDCl3, 0, 14.3821)
##AUDIT TRAIL= $$ (NUMBER, WHEN, WHO, WHERE, WHAT)
$$ ##TITLE= Audit trail, XWIN-NMR		Version 3.5
$$ ##JCAMPDX= 5.01
$$ ##ORIGIN= Bruker BioSpin GmbH
$$ ##OWNER= she
$$ F:/spectra/data/she/nmr/H-C/1/audita.txt
$$ ##AUDIT TRAIL=  $$ (NUMBER, WHEN, WHO, WHERE, WHAT)
(   1,<2025-09-10 16:06:21.54 +0400>,<she>,<DPX200>,
      <created by zg, POWCHK disabled, PULCHK disabled
       configuration hash MD5:
       00 E9 B6 7A A2 85 ED C7 34 08 36 98 17 FE 4E 26
       data hash MD5: 16K
       7F 67 54 C7 EC 0D B4 85 FE ED 50 FD 8D BA 42 FC>)
$$ ##END=
$$ 
$$ hash MD5
$$ 2A 3C 4C 52 68 96 03 1A D0 E3 E6 2C C3 EA A7 5E
##$RELAX= 
##$RELAX= 
##$RELAX= 
##$RELAX= 
##$RELAX= 
##$RELAX= 
$$ Bruker specific parameters
$$ --------------------------
##$DU= <F:/spectra>
##$EXPNO= 1
##$NAME= <H-C>
##$PROCNO= 1
##$TYPE= <nmr>
##$USER= <she>
##$AMP= (0..31)
100 100 100 100 100 100 100 100 100 100 100 100 100 100 100 100 100 100 
100 100 100 100 100 100 100 100 100 100 100 100 100 100 
##$AQSEQ= 0
##$AQ_mod= 1
##$AUNM= <au_zg>
##$AUTOPOS= <>
##$BF1= 200.13
##$BF2= 200.13
##$BF3= 200.13
##$BF4= 200.13
##$BF5= 200.13
##$BF6= 200.13
##$BF7= 200.13
##$BF8= 200.13
##$BYTORDA= 1
##$CFDGTYP= 0
##$CFRGTYP= 5
##$CHEMSTR= <none>
##$CNST= (0..31)
1 1 145 1 1 1 1 1 1 1 1 1 1 1 1 1 1 1 1 1 1 1 1 1 1 1 1 1 1 1 1 1 
##$CPDPRG= <>
##$CPDPRG1= <>
##$CPDPRG2= <>
##$CPDPRG3= <>
##$CPDPRG4= <mlev>
##$CPDPRG5= <mlev>
##$CPDPRG6= <mlev>
##$CPDPRG7= <mlev>
##$CPDPRG8= <mlev>
##$CPDPRGB= <>
##$CPDPRGT= <>
##$D= (0..31)
0 0.7 0 0 0 0 0 0 0 0 0 0.03 0 0 0 0 0 0 0 0 0 0 0 0 0 0 0 0 0 0 0 0 
##$DATE= 1757505981
##$DBL= (0..7)
120 120 120 120 120 120 120 120 
##$DBP= (0..7)
150 150 150 150 150 150 150 150 
##$DBP07= 0
##$DBPNAM0= <>
##$DBPNAM1= <>
##$DBPNAM2= <>
##$DBPNAM3= <>
##$DBPNAM4= <>
##$DBPNAM5= <>
##$DBPNAM6= <>
##$DBPNAM7= <>
##$DBPOAL= (0..7)
0.5 0.5 0.5 0.5 0.5 0.5 0.5 0.5 
##$DBPOFFS= (0..7)
0 0 0 0 0 0 0 0 
##$DE= 6
##$DECBNUC= <off>
##$DECIM= 32
##$DECNUC= <off>
##$DECSTAT= 4
##$DIGMOD= 1
##$DIGTYP= 9
##$DL= (0..7)
0 120 120 120 120 120 120 120 
##$DP= (0..7)
150 150 150 150 150 150 150 150 
##$DP07= 0
##$DPNAME0= <>
##$DPNAME1= <>
##$DPNAME2= <>
##$DPNAME3= <>
##$DPNAME4= <>
##$DPNAME5= <>
##$DPNAME6= <>
##$DPNAME7= <>
##$DPOAL= (0..7)
0.5 0.5 0.5 0.5 0.5 0.5 0.5 0.5 
##$DPOFFS= (0..7)
0 0 0 0 0 0 0 0 
##$DQDMODE= 0
##$DR= 18
##$DS= 0
##$DSLIST= <SSSSSSSSSSSSSSS>
$$ [...]
##$SUBNAM0= <"">
##$SUBNAM1= <"">
##$SUBNAM2= <"">
##$SUBNAM3= <"">
##$SUBNAM4= <"">
##$SUBNAM5= <"">
##$SUBNAM6= <"">
##$SUBNAM7= <"">
##$SUBNAM8= <"">
##$SUBNAM9= <"">
##$SW= 18.0517328524113
##$SWIBOX= (0..15)
0 0 2 0 0 0 0 0 0 0 0 0 0 0 0 0 
##$SW_h= 3612.71676300578
##$TD= 16384
##$TD0= 1
##$TE= 0
##$TE2= 300
##$TE3= 300
##$TEG= 300
##$TL= (0..7)
0 120 120 120 120 120 120 120 
##$TP= (0..7)
150 150 150 150 150 150 150 150 
##$TP07= 0
##$TPNAME0= <>
##$TPNAME1= <>
##$TPNAME2= <>
##$TPNAME3= <>
##$TPNAME4= <>
##$TPNAME5= <>
##$TPNAME6= <>
##$TPNAME7= <>
##$TPOAL= (0..7)
0.5 0.5 0.5 0.5 0.5 0.5 0.5 0.5 
##$TPOFFS= (0..7)
0 0 0 0 0 0 0 0 
##$TUNHIN= 0
##$TUNHOUT= 0
##$TUNXOUT= 0
##$USERA1= <user>
##$USERA2= <user>
##$USERA3= <user>
##$USERA4= <user>
##$USERA5= <user>
##$V9= 5
##$VALIST= <valist>
##$VCLIST= <CCCCCCCCCCCCCCC>
##$VD= 0
##$VDLIST= <DDDDDDDDDDDDDDD>
##$VPLIST= <PPPPPPPPPPPPPPP>
##$VTLIST= <TTTTTTTTTTTTTTT>
##$WBST= 1024
##$WBSW= 4
##$XGAIN= (0..3)
0 0 0 0 
##$XL= 0
##$YL= 0
##$YMAX_a= 135286
##$YMIN_a= -159872
##$ZGOPTNS= <>
##$ZL1= 120
##$ZL2= 120
##$ZL3= 120
##$ZL4= 120
##$ABSF1= 10
##$ABSF2= 0
##$ABSG= 5
##$ABSL= 3
##$ALPHA= 0
##$AQORDER= 0
##$ASSFAC= 0
##$ASSFACI= 0
##$ASSFACX= 0
##$ASSWID= 0
##$AUNMP= <proc_1d>
##$AZFE= 0.1
##$AZFW= 0.1
##$BCFW= 1
##$BC_mod= 2
##$BYTORDP= 1
##$COROFFS= 0
##$CY= -3
##$DATMOD= 1
##$DC= 2
##$DFILT= <>
##$DTYPP= 0
##$F1P= 0
##$F2P= 0
##$FCOR= 0.5
##$FTSIZE= 0
##$FT_mod= 4
##$GAMMA= 1
##$GB= 0.15
##$INTBC= 1
##$INTSCL= 1
##$ISEN= 128
##$LB= 0.25
##$LEV0= 0
##$LPBIN= 0
##$MAXI= 10000
##$MC2= 0
##$MEAN= 0
##$ME_mod= 0
##$MI= 1.114404
##$NCOEF= 0
##$NC_proc= 0
##$NLEV= 6
##$NOISF1= 3.799351
##$NOISF2= 2.8
##$NSP= 1
##$NTH_PI= 0
##$NZP= 0
##$OFFSET= 14.38212
##$PC= 1
##$PHC0= -1553.242
##$PHC1= 1.992285
##$PH_mod= 1
##$PKNL= yes
##$PPARMOD= 0
##$PSCAL= 0
##$PSIGN= 0
##$REVERSE= no
##$SF= 200.129724274929
##$SI= 16384
##$SIGF1= 3
##$SIGF2= 2
##$SINO= 400
##$SIOLD= 16384
##$SREGLST= <1H.CDCl3>
##$SSB= 0
##$STSI= 0
##$STSR= 0
##$SW_p= 3205.1282051282
##$SYMM= 0
##$S_DEV= 0
##$TDeff= 0
##$TDoff= 0
##$TI= <>
##$TILT= no
##$TM1= 0
##$TM2= 0
##$TOPLEV= 0
##$USERP1= <user>
##$USERP2= <user>
##$USERP3= <user>
##$USERP4= <user>
##$USERP5= <user>
##$WDW= 1
##$XDIM= 8192
##$YMAX_p= 0
##$YMIN_p= 0
$$ End of Bruker specific parameters
$$ ---------------------------------
##NTUPLES= NMR FID
##VAR_NAME=  TIME,          FID/REAL,        FID/IMAG
##SYMBOL=    X,             R,               I
##VAR_TYPE=  INDEPENDENT,   DEPENDENT,       DEPENDENT
##VAR_FORM=  AFFN,          ASDF,            ASDF
##VAR_DIM=   8192,          8192,            8192
##UNITS=     SECONDS,       ARBITRARY UNITS, ARBITRARY UNITS
##FACTOR=    0.0002768,     1,               1
##FIRST=     0,             0,               0
##LAST=      2.2672688,     0,               0
##MIN=       0,             -159872,         0
##MAX=       2.2672688,     135286,          0
$$ Real data points
##PAGE= N=1
##DATA TABLE= (X++(R..R)), XYDATA
0@%%%%%%%%%%%%%%%%%qJ6j6J6j6J6k4L2l2M0m8N0n8O8p6Q8j00J08j20J36j54J74
39I2j95K17k39K65k96L28l61L96m35M79n29N83o41P07p81Q64r56J062j186J331
59G05j502J707j965K291k717L312m192N624q336J5159o4986j04972J70608R1282
73A02018j03983o8413P5975M0071n3583m50N3822m4278m4124N9406K3589p4709
85c4659k5478P5339M7167o7113m6370N1001K2813l3236M190K0263j0844j6497
97a3424J3781K0658j9877k2581K9876J2890l2052n306K3602M699j7427o327K3021
110A1533K600l0654J657K3266o508j4788N449J7673M330k0507l989J9019o47p601
124H33K540l499n162j622O208J0970q704j0370J0290Q58r899K538O858L706n819
$$ plain form
0 0 0 0 0 0 0 0 0 0 0 0 0 0 0 0 0 0 0 -8 8 -8 8 -8 8 -16 16 -16 24 -24 26 -32 36 -40 48 -52 56 -64 72 -82 92
39 92 -103 114 -125 140 -156 172 -189 207 -228 251 -278 305 -336 371 -410 454 -502 560 -626 705
59 705 -797 910 -1055 1236 -1481 1831 -2361 3263 -5073 10086 -54900 -159872 10736 102018
73 102018 -1965 -70378 5597 45668 -7915 -8365 45457 1179 -42945 16461 40050 -34659
85 -34659 -60137 15202 62369 -4744 -51114 -113 22700 -10536 -6346 13917 3073 -13424
97 -13424 357 21015 1138 -21443 8433 21323 -10729 -16035 7567 12266 -5161 -11488 11533
110 11533 14133 -16521 -14864 8402 1894 -12894 -7445 10228 14558 -5949 -9938 9081 8434 833
124 833 3373 -126 -5288 -6910 -702 10268 1564 -8806 1484 2342 -7557 -5019 1839 5545 -274
139b74o075Q154M31p052J0486N635j2675o463N553Q649k318r292O423M929j2222
154f111j149R646n49m655r30M242K441p640K312J0279n426n546M409J233j724
169H32k496R72N804n397m205O656j313m994L677J364j889j878O12N757k787n929
185e214P674L047n794j111J983J647r54l514L895J762p218J833M499m220m70Q93
201a262J954L84n315J996O808m005k806L856M05r97j667O34M077l449l748M829
217A694n53l953K411O27k36j746j766N294n45n120L931K995l146j78N67J659Q1
234B016l575K722J844n579J192L753k488j258j015J617K345m270k2N012k627j351
250a684K636n29N58n43l19L226l216k530M849r14k975Q70J73J100j616k335L718
$$ plain form
139 -274 -6349 1805 2236 -4816 5670 11305 -1370 -7833 -2280 6369 4051 -5241 1182 6111 -6111
154 -6111 -7260 2386 1837 -2818 -3748 494 2935 -4705 -2393 7886 2460 -3086 1323 2556 832
169 832 -1664 -692 5112 -285 -4490 2166 853 -4141 -464 900 -989 -2867 -2255 3502 715 -5214
185 -5214 2460 5507 -287 -1398 585 2232 1278 -2236 1659 3421 -3797 -1964 2535 -1685 -2155 -1262
201 -1262 692 1076 -4239 -2243 4565 560 -2246 1610 2015 1018 -649 -15 4062 613 -3135 1694
217 1694 1141 -2812 -401 226 -10 -1756 -3522 1772 1227 -3893 38 3033 -113 -291 276 1935 2016
234 2016 -1559 1163 3007 -2572 -1380 2373 -115 -1373 -2388 -771 1574 -2696 -2718 2294 -333 -1684
250 -1684 952 423 981 438 119 3345 129 -2401 2448 1534 -1441 -571 -398 702 -914 -3249 469
267D69N86m172K803J125j566Q90k43J523P11l547K178K248l701O69J384q65K19
284G11k198K91K800l500J85K999k317p07J714p37J808p34n53K798k782j191M379
301B966j468j805P31k41O46j362j753L332l56l638K356K18o66Q18k83J298J77
318I70k936K637J970k748J088M48j527J129q47p32J975k535N6J730k334N25J474
335C43j570M71K09J01K161k093j28K632j837o90K022q22K10j325j202K867p53
352E96k213J886p49q30J003r71J248Q09k149J298O44j175J810m5p08P05j683L32
370a92J953j625J99N40k708Q42J077j139J297j283j75J796j512M44K176j466k21
387CO95r68J467r0j224J368q32j721J833k86l47j6j463J267L80j700J796N57j727
$$ plain form
267 469 1055 -3117 -314 811 -755 135 -108 1415 2126 -1421 757 3005 -696 -27 1357 492 711
284 711 -1487 -1196 1604 -1896 -1711 1288 -1029 -1736 -22 -759 1049 315 -238 2560 -222 -1413 2966
301 2966 1498 -307 424 183 829 -533 -2286 1046 690 -2948 -592 -374 -1040 -222 -505 793 970
318 970 -1966 671 2641 -107 981 1429 -98 1031 184 -548 1427 -1108 -1052 678 -1656 -1131 343
335 343 -1227 -756 -547 -446 1715 -378 -506 2126 289 -401 1621 799 1009 -316 -1518 1349 596
352 596 -1617 269 -480 -1310 -307 -1278 -30 779 -1370 -72 572 -603 1207 1162 454 1159 -524 -192
370 -192 1761 136 335 875 -1833 -991 86 -1053 244 -1039 -1214 582 -930 -486 1690 224 3
387 3 698 -270 1197 1107 -117 1251 419 -1302 531 245 -102 -118 -1581 -314 66 -1634 162 719 -1008
406a008J206K3K8J183j652Q21P94k093R26J137j779L00k32n77J164j337J48J526
424E78j658l14J753n98P88J49j319J475k08j035J928o57j278Q68j113L51N98j086
442g78J027q6k050J648J90o96J046l16m03R19q14O69J049j685R10O14j780J032
460D96K29r55O64j204j38J226j285R0J211j318K89M98KJ171r81l61J212k64o45
479f3J226j047L40R6j480J033P2j422J119n4p75Q64o58M96N65j289Q19R74j053
498b37R60K07j167J084n26m68J284j522K00L87j216K59J012j164P15M3p78J285
516C58l00o86J536p78j48R54r63O54j21o51Q00r8j397J142n97k35N17q30L78P65
536C00j192L77P93q74J071l82l98J157n64l82J099r78M0N48o54k0M9q85Q61k93
$$ plain form
406 -1008 198 221 249 1432 -220 601 1395 -698 228 1365 -414 -114 -346 -923 241 -1096 -948 578
424 578 -1080 -1394 359 -239 549 698 -621 854 646 -389 1539 882 -396 472 -641 -290 308 -778
442 -778 249 163 -1887 -239 -49 -745 301 -15 -418 501 -313 356 1405 -280 630 1244 -536 496
460 496 725 -230 434 -770 -908 318 -967 -877 334 -984 -695 -197 -195 976 -5 -366 846 582 -63
479 -63 1163 116 456 552 -928 105 177 -1245 -126 -180 -955 -91 -749 -253 312 -977 -158 816 -237
498 -237 723 930 -237 847 321 -147 1137 -385 -185 202 -1014 -755 257 -907 -192 -149 -927 358
516 358 58 -628 908 130 -18 936 -27 627 506 -145 655 557 -840 302 -295 -530 -13 -843 -465 300
536 300 -892 -515 278 -596 475 93 -305 852 288 -94 1005 27 67 615 -39 -59 -10 -895 -34 -327
556c27p95J415r41J12J201j038K99O63q05N06K08n71O80j77p77J153q46m62Q15
575C13p69J14M23r31M89N60j189R10J59l58J025r17J3J096j108M05M12q11M50
594B86K0o60O65q94k51J009n80j96P99j028N68O87j071Q89J06p33R91o9m63P54
614H29q40K55L90r66L76j38o75N29J03o37R45m58l85J147o64K9Q95o58P0Q22j087
635a18L16K78j057R36l81l15P38r10O5M10n07L17J14n58Q02K24p85P57q7l79P20
656E80k57l48O61q37O70j71p75P51l41l66M45m24j28N50m61J18P65q76L49M74
676C79n84N37r6k51M68n59n8O65p65J69K87o84L09K11q39R34m31k46P20k36QN64
698E02n53K27N15p06N16L1p69R55p92l60M57k76K1K81p06K16N01j55RK06n30P86
$$ plain form
556 -327 -1122 293 -648 -536 665 -373 -74 589 -216 290 498 -73 607 430 -347 806 -40 -502 313
575 313 -456 -342 81 -850 -361 199 -990 -80 79 -279 746 -171 -158 938 -170 235 647 -164 286
594 286 306 -354 311 -583 -834 175 -405 -601 198 -830 -262 425 -646 243 349 -384 607 538 75 829
614 829 -11 244 634 -332 44 -94 -769 -240 -137 -774 171 -287 -672 475 -189 -160 735 77 147 969 -118
635 -118 198 476 -581 355 -26 -341 397 -513 -448 -38 -545 -228 -114 -672 130 354 -431 326 239 -140 580
656 580 323 -25 636 -201 469 298 -477 274 -67 -433 12 -412 -540 10 -451 -333 432 -444 -95 379
676 379 -205 332 236 -15 453 -106 -164 501 -264 -95 192 -492 -183 28 -811 123 -308 -554 166 -70 -62 502
698 502 -51 176 691 -15 501 532 -237 718 -74 -434 23 -253 -232 49 -657 -441 60 -95 -86 120 -410 376
720C76Po98R62n28k3M56p42L97K17q51L26K06m66M08k30l28N51k70j40P22m06
741e4J89K33o86J065m67k96N14l23l17O46q64J04K44o52O18J42p15N64J10j71
761a16J42k35m5P55o62O86Q1o52N44o3m28K11pp28L96k9m94Q61l91p7M93m61L62
784A43R8j25J58j46j11N19n38j2O97p25K51J23o00Q9L50o78K36J63l45L04l47
805d96K21M13n66M78Q29q81L45m1k82M11m13j59P03p04j70K13k18k06O06o72M35
826a54K6m65J024l02m20P24p19K37K89O5k42J93m70L33R9p13M28J8k92K51l13
847d03j67P36m39K14L76m62L91K04m44M60n39N9N23m57k08O33p12K02J16m73K80
868a10r0k29O54m98K56N76n41p9L30m60K30K41o37P40j28l48J13p7j11L55n91
$$ plain form
720 376 383 -315 647 119 96 552 -190 207 424 -427 -101 105 -361 47 -183 -511 40 -230 -370 352 -54
741 -54 135 368 -318 747 280 -16 498 175 -142 504 -360 -256 -12 -664 -46 96 -619 -55 55 -116
761 -116 26 -209 -254 501 -161 525 606 -46 498 435 7 218 211 -517 -121 -150 -644 217 -174 -251 242 -219 143
784 143 241 116 274 128 17 536 -2 -14 683 -42 209 332 -268 -179 171 -507 -271 -108 -453 -149 -496
805 -496 -275 138 -428 50 879 -2 343 302 20 431 18 -141 562 -142 -312 -99 -317 -523 83 -589 -154
826 -154 -128 -593 431 129 -291 433 -286 -49 240 305 63 256 -214 119 218 -495 -67 -49 -341 -90 -403
847 -403 -570 166 -273 -59 317 -145 246 450 6 466 -73 -14 509 52 -156 477 -235 -33 83 -390 -110
868 -110 -200 -429 225 -273 -17 559 18 -61 269 -191 39 280 -357 383 255 -93 20 -57 -168 187 -404
889d04r6M98o44M90O2n02P47j20j98O41m87J72L88l41R0J31p54O02q0n43O51m82
911a79m9K26m15O0L66m33L16L81n94O37M4n24Q13m71m23R53r08K71L96o93L03
932G7J45p02N87m3m29K11L09o00Q62p66L45J71k35O21l16M3l4j59j27J47O4l79
954b08L02m38K30j15j85K61J62l80L12ok63L31J47r1K89n0k80M64o48J50K89o89
976d16L06K58l66L11j13m15M15k51Q1K47q8K14K0k88M47j66m45P22m18r6L50m05
998i6j06J09Jk67K41j75K49J01m16M68j87j23L12k13J71K60m23J23N4m71M97j56
1020d7k07L42n45M44%l65J71L64n19K15L4LJ86M46n06J35k02o5L72l11j39N6l34
1043d72M06j29k00J96K30m96N74k23k7J72J34j33J87k79K28J6m40O51p0n71L49
$$ plain form
889 -404 -500 -2 -646 -156 -94 -596 151 31 -167 474 -13 159 547 206 296 427 -327 275 195 -348 303 -179
911 -179 -228 -2 -417 -357 9 -424 -108 273 -321 316 360 -164 649 178 -245 708 -200 71 467 -226 77
932 77 222 -480 107 64 -365 -154 155 -445 417 -349 -4 167 -68 553 237 280 246 87 -40 107 171 -208
954 -208 94 -344 -114 -229 -414 -153 9 -371 -59 -65 -328 3 150 59 348 298 18 482 -166 -16 273 -416
976 -416 -110 148 -218 93 -20 -435 -20 -271 -190 57 -31 183 203 -85 362 196 -249 473 55 -41 309 -96
998 -96 -202 -93 -92 -359 -118 -293 -44 57 -359 109 -78 -201 111 -102 69 329 -94 29 83 -388 109 -47
1020 -47 -254 88 -457 -13 -13 -378 -207 157 -362 -147 -113 -110 76 522 16 151 -51 -116 256 -55 -194 -138 -472
1043 -472 -66 -195 -395 -199 31 -465 109 -114 -141 31 165 32 219 -60 168 184 -256 395 325 -246 103
1064A03m2q6R1m48J64N36p07J79K58m01O76k65k12N03l49J50L39n02J41nj25R9
1086I7q9k35Q9j49j62N94m49K06j70K98n6P6j52N12n6l79P9j31j26L57k77J0K45
1109A32j98k56L00p8K01l64j89O13l72N6L14j63l7N33k08Oo9n99N51O3n13L95
1131A18l64k21M82m32K32J54m33K87q6j31P95k21m05K49J84k88N16m66L14j07
1151A77k64K45J07n78L24k20L58O5n17K33J64l09L21k39J23p2L79m20L89k84j14
1172a32K83j06j74M81n53k0L02p01N66J84l06N0K33l33M20l17J12LQ9N7j0k34
1194a06N84n13j69N79k2o44L37k27Q6J52n18L59L65l96O14m85L2J66p8j24K94
1215B86j49r2K56n10L84k46k07K12J94m86M24K7k52J88l37K04J79q3P2K12j80
$$ plain form
1064 103 61 -25 66 -382 -218 318 -389 -210 48 -353 323 58 -154 349 0 150 489 -13 128 123 -2 97
1086 97 8 -227 -138 -287 -449 145 -304 -98 -268 30 -26 50 -102 410 354 -25 54 -77 -203 154 -123 -113 132
1109 132 -66 -322 -22 -100 101 -263 -452 161 -211 -155 159 -4 -41 492 284 290 221 -378 173 236 -277 118
1131 118 -246 -467 15 -417 -185 -31 -464 -177 -263 -394 401 180 -225 24 208 -80 436 -30 284 177
1151 177 -87 158 265 -313 11 -209 149 214 -303 -70 94 -215 106 -133 -10 -82 297 -123 266 -18 -132
1172 -132 151 45 -129 352 -201 -221 81 -620 -54 130 -176 -126 107 -226 194 -123 -11 -8 81 138 128 -106
1194 -106 478 -35 -204 375 353 -291 46 -181 -95 57 -461 -102 263 -133 481 -4 28 194 116 -8 286
1215 286 137 45 301 -209 175 -71 -278 -66 128 -358 66 93 -159 29 -308 -104 75 -8 64 276 96
1236I6K49j42k72L18l14J41Q0j98k9o3k85J88K19m34M80L06m83J09L7j62L30n8
1258A13J41k27j35K11J28k73O6k53J72J57m40J55L32l68O64l29l70J68L09k63
1278d2N41l12O8K62m61k4M8k93q9O34m36n9lN5J00k87L89k86k4L45M5o13N52J93
1302C03j28J74k90K6K67n55J33J28j31Ll3J23r1J4n5Q4p0k07Q05l86l91M18K7
1325A68j70N29o20K98K1m95K81j37j18LJ32N9O8k9J02L5l17p6K42k16P21n58m7
1348a24J18J97K03k77L6k37J24l71L28j36K22k36L38l08K03l34J37J52k09L67
1368A93k5j22j0L6n7Pj68J95j80k3J99k61kj15J24j36M89j21j30J42j21K95q5
1391A24J1j87L27m69mP2r6K96j82j79L71k58N5O2M7o1K97n06K01K09LKK2j48J03
$$ plain form
1236 96 345 203 -69 249 -65 76 156 -42 -71 -134 -419 -231 -12 -446 34 340 -143 -34 3 -159 171 113
1258 113 254 27 -108 103 231 -42 24 -229 -57 100 -340 -185 147 -221 443 114 -256 -88 221 -42
1278 -42 499 187 255 517 56 32 80 -213 -302 332 -104 -163 -166 -111 -11 -298 91 -195 -219 126 171 -442 110 303
1302 303 175 349 59 85 352 -203 -70 58 -73 -70 -103 20 -71 -57 -112 -28 -98 -305 500 114 -277 141 168
1325 168 -2 527 -93 205 226 -269 12 -125 -243 -240 -108 -49 19 -10 92 127 -190 -266 -24 -240 481 -77 -124
1348 -124 -6 191 394 117 153 -84 40 -331 -3 -139 83 -153 185 -123 80 -254 -117 35 -174 193
1368 193 168 46 36 72 15 22 -146 49 -131 -154 45 -216 -218 -333 -209 -345 144 23 -107 35 -86 209 124
1391 124 135 -52 275 -194 -198 -126 -222 74 -108 -287 84 -174 -119 -57 -10 -71 226 -280 -79 130 133 135 157 9 112
1416A12k12J37J20j96J9oJ21j36k50K00j10N1J49J36p8j5p6J95l5o9n35O49k27
1439e6O9N9j07m1O7j06R2P5j89j47M79k92j34K33q7J37L8J5RN7L5m9On9N7j01
1465F0l01M5K26J71k56J72k8j06j08K68j63K0l3j89K84M1j33N6j00K22J41q3m1
1488A65j27p5n4j3m1p4K70k62K67Lj48r2J98Oo4J20l9p7j07M05m51K59Pk04n8
1513a86j68L14k87J89j25K91L19m05K62j98j03K47j32J4N8n2j84K36l95N25pl87
1535a74M06m85J20J76j43k3Q4J58Q7j42j74L4K31j88K70n50K67R0k26K73l3l66
1557c08L69R7n01M20j80k41M71Mj73K90k76O4K19l31O5J93l25K24l24K57J52j31
1579C5k50M73k11r6J38m12l5O02l49N0N7PK27k59P9J15k01J6K41k09pJ42L4o7
$$ plain form
1416 112 -100 37 157 -39 -20 -26 95 -41 -291 -91 -201 -150 -1 135 57 42 -34 161 126 57 -478 171 -56
1439 -56 13 72 -35 -76 -9 -115 -23 52 -137 -284 195 -97 -231 2 -85 52 90 105 114 171 206 157 163 104 161 60
1465 60 -241 -196 30 201 -55 117 89 -17 -125 143 -20 0 -33 -222 62 103 -30 26 -74 148 289 206 165
1488 165 38 -37 -91 -104 -145 -219 51 -211 56 59 -89 -181 17 23 -41 79 40 -37 -144 261 -190 69 76 -128 -186
1513 -186 -354 -40 -327 -138 -263 28 347 -58 204 6 -97 150 18 32 90 38 -146 90 -305 220 213 -174
1535 -174 232 -253 -133 43 -100 -123 -39 119 206 64 -110 -76 155 -33 237 -313 -46 44 -182 91 58 -308
1557 -308 61 158 -343 77 -103 -344 127 131 -42 248 -28 36 255 -76 -11 182 -143 81 -243 14 166 35
1579 35 -215 258 47 -49 89 -323 -358 244 -105 -55 2 9 236 -23 56 171 -30 -14 227 18 11 153 187 120
1603A20k36J67N4k53J21n1k61K30K74k33Q3L82l07k40N63o38L46j10o2K32q4j24
1625b7j05K00j69Qj6L99k05O0m26M18k02J06N3J22k60j3L5J17k47J80p4M6L21
1648C21l74M1R4j74J35J68k65l9K16J97k65J25m52J60o5J44K53r1K0j31k34K21
1670Ek87K3K71Q8j70R7j68N2J14J1K3Q0n4J72j72q8j8p8L3J09j3J39j78m81M33
1695e7J66k30q5K77k04K07j08q4K04K4j92K57j94J26L6k71K74l45Q6N0K8J11P1
1718A47k38p9L06k27J39j88J26J51l1k71J86J72j10j77L9MOJ03K7p2j40Q7l8o7
1742a45L17k30J40j67J0N8l0L24m31K79k33K38J12j37r8J35l29J86j13K20m2j06
1764d2k4j40Q4K10J13l02J22L2q4K43l13J29n6j39K94r7n7M3j54o3N0J61Q6J90
$$ plain form
1603 120 -116 51 105 -148 -27 -78 -339 -109 165 -68 15 397 90 -150 413 -225 121 11 -51 181 97 -27
1625 -27 -132 68 -101 -93 -109 290 85 145 -281 137 -65 41 94 216 -44 -57 -22 95 -152 28 -46 0 321
1648 321 -53 -12 82 -92 43 211 -54 -93 123 320 55 180 -272 -112 -177 -33 220 129 149 18 -216 5
1670 5 -282 -259 12 100 -70 27 -141 -89 25 36 59 139 85 257 85 -3 -21 -99 -66 43 30 169 -9 -490 -57
1695 -57 109 -121 -206 71 -133 74 -34 -118 86 110 -82 175 -19 107 143 -128 146 -199 -113 -63 -35 76 147
1718 147 -91 -170 136 -91 48 -140 -14 137 106 -165 21 193 83 -94 -55 -51 -45 58 85 13 -127 -40 -78 -145
1742 -145 172 -58 82 -85 -75 -17 -47 277 -154 125 -108 130 242 105 7 142 -187 -1 -114 106 64 -42
1764 -42 -66 -206 -122 88 201 -101 21 53 -31 212 -101 28 -28 -167 127 30 -27 16 -138 -201 -151 10 96 286
1788B86l29K1j78J48r5Qj41K14Q8K2l2k55K29K71l37j8q9K04m4j09K72j73R9M1
1812A03q7n4o2O9q6k07K10K61O8j85j31R0j32O6J08k51P8J23j66N3K4k1N2j22
1836a99J59l48K35K96o5Q3P6J00n17K49k66J33J19k55P2L6o3P9J09mq6j55P18
1859E06m91R6o0R3l77M2M4K62J06k44M6j14O6k8J89j02Q6j72L14l07K61j50k25
1882a59M3J73m1J95j93K78j59j93K37l16J47m0N7j8K71k36L2l16N89k98LL60j08
1905C08j30r6r2J59j71R9k76R4K81r0j08k4j65L48k46Q0K99l26j50J94J40q9J53
1928A92l48M36m05m8K68j19K66k85p4J3r6L33r7j14J3k02J01J56n2J59K4l7j12
1951b8K77j82q2Q3M9k05L36k76PJ21q6n1j61J00J19j34O4K58j22j98M6P6K68k62
$$ plain form
1788 286 -43 -22 -200 -52 -147 -139 -280 -66 22 44 12 -243 -14 257 -80 -98 -187 17 -27 -136 136 -37 62 103
1812 103 16 -38 -100 -31 -117 -324 -114 147 215 30 -101 -11 -143 -77 31 -220 -142 -19 -185 -132 -108 -129 -77 -199
1836 -199 -40 -388 -153 143 78 161 237 337 -180 69 -197 -64 55 -200 -128 -92 -155 -76 33 29 -57 -212 506
1859 506 15 111 51 144 -233 -191 -147 115 221 -23 23 -91 -25 -53 136 34 120 -52 262 -45 216 66 -159
1882 -159 -116 57 16 211 18 296 137 -56 181 -135 12 -28 29 11 282 46 78 -238 351 53 56 416 308
1905 308 178 82 -10 149 -22 77 -199 -105 176 86 -22 -46 -211 137 -109 -29 270 -56 -206 -12 128 39 192
1928 192 -156 280 -125 -173 95 -24 242 -43 -117 -104 -200 133 36 -78 -65 -267 -166 -10 -62 97 121 84 -28
1951 -28 249 67 -15 68 117 -88 248 -28 -21 100 14 -37 -198 -98 21 -113 -49 209 87 -111 -65 11 279 17
1975A7r9J75P0n7j40p3k07J87J50m4J3j90K19J52j57J42l76LO6J26L66l02j40
1998i9J64k08R3k1J71n4q5Q0k68J66L0P6j52J98k62R7J58LP4l34J31M35l49k27
2022a83M36l40j43L24m7J2l18R9J33J56j10o5j38J13Q9k2R3j06M3K25m30R7L1
2045e1r0J93k0K52n84J68M6Q2M1l00N04k97O0Q6j50j34K71M8n0p4j52M86m07l1
2069a03m2J55R4j53j07k02L73j71J7K31m1j91K00j84M95l52j1L36l80J53j0l9
2091F8m03K24M2K6N8k00L15l43J90J70k98M5K95l40L35O6k68J5K60k71k68L72
2113I0m14L80K30k87o8Q2k0k6O5l8rQ6J37k07O2j81J51j56j12q8K93M2j74J96
2137C4O2n52M10j09J64p1K37Om89L14j21L64k64N9o6L48l16p4K48k73O2k66M12
$$ plain form
1975 17 -82 93 163 106 -34 -107 -314 -127 23 -21 -8 -198 21 173 16 158 -218 -215 -149 -23 343 41 -99
1998 -99 65 -143 -50 -71 100 46 -39 41 -227 -61 -31 45 -107 91 -171 -74 84 87 161 -173 -42 393 44 -183
2022 -183 253 -87 -230 94 47 59 -259 -160 -27 129 19 -46 -184 -71 18 -4 89 -17 26 251 -179 -82 -51
2045 -51 -141 52 32 284 -300 -132 -86 -4 37 -263 241 -56 4 90 -60 -194 77 125 75 1 -151 335 -72 -103
2069 -103 -145 10 104 -49 -156 -358 15 -156 -139 92 51 -140 60 -124 371 19 8 344 -36 117 107 68
2091 68 -335 -111 -69 -43 15 -185 130 -213 -23 147 -151 -106 189 -151 184 250 -18 -3 257 -14 -282 90
2113 90 -324 56 286 -1 -69 13 -7 -33 32 -6 -15 71 208 1 63 -118 33 -123 -235 -323 -30 12 -162 34
2137 34 96 -456 -46 -155 9 -62 175 181 -308 6 -115 249 -15 44 -22 326 10 -64 184 -89 -27 -293 119
2160A19j26P0l2Rj13j2J52j49l1RL68m14J50K22l24J35j94o0K78k9Q1n8M8R0k09
2185b0j21P7K00k35R9P2l60M56k46N7%mJ05o7r6J26kj74K65j29k19J06Q1k49M88
2210B10N3k09m7J8J85k60J15%k92K88j14R2J0J10m63K55J24k59L76l28M3J30k58
2233b21q6L73q7J06j65k8o8K43k30N2Q5j17K24k4k16M72j95j82K54l13J66J24
2255A67L6k50J90j98k31K29J19J8j21m1L1m8j36J29J32j20l3K09lp2m4l7J11M2
2279G9N8M6k81k4J62j48O1o3r6R4L56k59j0M03l99j26j3K59J18m45jJ99j79L99
2303A90k20M7K23k34k7l0L35k78j92L74j77L5J42qj19l84M79k19O5K31k36Q6k01
2326a18J88L4j22J61k14J54Q8k85J92j12r9rQ0J20n51L52Q3O8m2J6j42J0n4K62
$$ plain form
2160 119 -7 63 31 40 -73 -85 67 -82 -113 -104 264 -150 0 222 -102 33 -161 -221 57 28 109 51 99 189 -20
2185 -20 -141 -64 136 -99 0 72 -288 168 -78 -21 -21 -25 80 13 -83 43 41 -133 132 3 -216 -110 -29 -278 210
2210 210 263 54 7 25 210 -50 65 65 -227 61 -53 39 49 159 -304 -49 75 -184 192 -136 -93 37 -221
2233 -221 -307 66 -21 85 -80 -108 -176 67 -163 -111 -26 -143 81 57 -159 313 118 -64 190 -123 43 167
2255 167 203 -47 143 -55 -286 -57 62 80 -41 -82 -51 -99 -235 -106 26 -94 -127 82 79 7 -37 -74 37 79
2279 79 137 183 -98 -122 40 -108 -47 -110 -206 -112 244 -15 -25 378 -21 -147 -160 99 217 -228 -229 -30 -209 190
2303 190 -30 17 240 6 -21 -51 284 6 -186 188 11 46 188 180 61 -323 156 -63 2 233 -3 83 -118
2326 -118 70 104 -18 143 -71 83 171 -114 78 -34 -133 -142 -62 58 -493 -141 -58 10 -32 -16 -158 -148 -202 60
2350F0j50j59K85J81pk66l7J8J25m03K30LN7m8J20N8N1r1j10Q7k11K91J21m26
2374b21K82J33j78r6O5O8j84J11l3k32J01K24p1n2j31L69j82k11K56O8j13LK02
2397A78j47j21K60j0J32l11j06L01m5k05J35l71L19K21k67J02k8r1J38j9j35M8
2419b2J99j69j29J91O9j64J0n2J18r2K3q2m7L36k13L8o2K0q0ML33l38K83k02J19
2444I1j53K18j36J44J91o00J31k03Q6J02R4K2P6m2r2K21l18K64m0K56m39r3J44
2467g6J64j02J42N7j64l71K40L04l65P3J94m73M79k32L70k79P8k0K1mk25L06j49
2490c2l12K87J57M2m3K3p2J77j46l50L32l63N83J1n23K98P6j73l8m7L15l64L85
2513B23l20R4PL1j73K42nk03j79M77m40L10m1j06J70J12N2j15m2p2o4Q3K6j53
$$ plain form
2350 60 -90 -249 36 217 210 -56 -93 -75 50 -353 -123 -120 -63 -111 9 67 118 27 -83 4 -207 84 205 -221
2374 -221 61 194 16 -80 -15 53 -131 -20 -53 -285 -184 40 -31 -83 -214 155 -27 -238 18 86 -27 -24 178
2397 178 31 -90 170 160 292 -19 -125 176 131 -74 61 -310 9 230 -37 65 37 -54 84 65 -70 -22
2419 -22 177 8 -121 70 139 -25 -15 -67 51 -41 -18 -100 -147 189 -24 14 -48 -28 -108 -104 229 -109 174 -28 91
2444 91 -62 156 20 164 355 -245 -114 -317 -231 -129 -35 -13 63 21 -71 150 -168 96 56 312 -127 -220 -76
2467 -76 88 -14 128 185 21 -350 -110 194 -171 -98 96 -377 102 -130 240 -39 39 19 40 36 -189 117 -32
2490 -32 -344 -57 100 142 99 122 50 227 81 -269 63 -300 283 294 -229 69 145 -28 -66 -113 202 -162 223
2513 223 -97 -3 4 35 -138 104 99 -104 -283 194 -246 64 23 -83 87 199 251 136 94 22 -42 41 67 -86
2537h6p5K30j69J64r6L7lk26M11m53M59K5j68J26j97l5J39K12J4l42J02o5k30
2560b26K05m1k6R4J82j36j45J53j53j8L59l88K34j3j88l2J25Q6j82P5m5L3l4J04
2584B3O1Rj44j05K4m7J80l7p5J46J32l10L39l69K98j31j69J19o5J12p9L23l30
2607i5N0K52k95K67k13J70k28K99n3k79K40m09N94k39r8q1p0J27K28l4j9j65j96
2630b47L19j74m0J45o5n0K51p6k67RJQ2M3J64l85K16L74m97K44j95L41j83L5k81
2654b36K92k03J46N1k5K93j92J58l32R0P5l4R8N9k8j12K0j26K0J69m12K54M9j20
2678d6j07J87L3j26L60m20K66j65j20J39r4l1J45j96M76k16j96K55n5j49q3o4
2700b07N7O6Q3L0l1L19l90L3NJ73m6l0l20K23k47L6R2J41J79l39J15N1%K29k90
$$ plain form
2537 -86 -161 69 -100 64 -32 5 2 -224 187 -266 193 218 50 176 -21 -56 83 295 309 -33 69 4 -226
2560 -226 -21 -62 -88 6 188 52 -93 60 -93 -111 248 -140 94 81 -107 -139 -14 72 -110 -35 -80 -47 -81 23
2584 23 84 93 -51 -156 -132 -179 1 -36 -111 35 167 -143 196 -173 125 -6 -175 -56 -121 -9 -88 235 -95
2607 -95 -45 207 -88 179 -34 136 -92 207 154 -125 115 -294 300 61 -37 -118 -188 -61 167 133 114 -51 -247
2630 -247 72 -102 -142 3 -62 -112 139 63 -204 -195 -194 -112 -69 95 -290 -74 300 -197 47 -148 193 10 45 -236
2654 -236 56 -147 -1 50 25 318 126 284 -48 42 117 83 181 240 212 100 120 -6 14 183 -229 25 74 -46
2678 -46 -153 34 67 -59 301 -119 147 -18 -138 1 -93 -124 21 -175 301 85 -111 144 89 -60 -143 -207
2700 -207 -150 -84 -1 29 -2 317 -73 -40 -35 138 92 62 -258 -35 -282 -246 -154 -13 166 -173 -58 -7 -7 222 -68
2725f8p0K98j53q0L13k59L0J6N0j11P2m5o6k1J7K05j45J19l29R8N3M1m00O23p2
2750A16m9n0j12j41L14k40K7L86l84K8J0J07J5k27K25K9k26L25k4j26j08J18Q7
2773A00j6p1L7l9j8J3L2n8j01K21l16m8M66k13K39k14p7J4J87k00J46j43J62j04
2797aj23J41k29P9jR1jOK29o13Q00m11j9K93l69R2J15Q3m56L82j10l9J4M7L89
2822C89l50p9J06J29l73J59Kj8J87m12J73l1L4qJ90L0j12j66L11j51J62m63K82
2845ij72L40k11R4j60K47j70J08j74J07k92L65p3pj8J30r7j32K86OJ28l16K36
2868B16j77%n2L38l01k64J89O1j09J17j49K88k50r5P5R4q6J16o4n1k2Q7K69o6
2892A64p6k12J46k43N16k90m18K32K04K3R3l49K9K64J37k57j19K11R5k41l6L44
$$ plain form
2725 -68 -138 160 7 -73 240 -19 11 27 77 -34 38 -7 -73 -94 -77 128 -17 102 -227 -129 -76 -35 -435 188 116
2750 116 67 17 -95 -236 78 -162 -135 251 -133 -105 -95 12 27 -200 25 54 -172 153 129 3 -105 13 100
2773 100 84 13 50 11 -7 6 38 -20 -121 100 -216 -264 202 -11 228 14 -63 -49 138 -62 84 -59 103 -1
2797 -1 -124 17 -212 -133 -134 -43 -44 -38 191 -422 378 -33 -52 241 -128 -36 79 162 -294 88 -22 -61 -47 0 389
2822 389 39 -40 66 195 -178 -19 -17 -35 152 -260 -87 -118 -84 -92 98 128 16 -150 161 10 172 -291 -9
2845 -9 -181 159 -52 42 -118 129 -41 67 -107 0 -292 73 0 -7 -25 105 8 -124 162 168 296 -20 216
2868 216 39 39 -13 325 24 -240 -51 10 -99 18 -131 157 -93 -188 -113 -19 -105 11 -53 -104 -126 -39 230 164
2892 164 88 -124 22 -221 295 5 -413 -181 23 46 139 -210 -181 83 220 -37 -156 55 150 -91 -127 217
2914B17j53j6j85L71j83k84K18r5K83JOl61N1n7M52k95J99J8l51o4L03k61O9N3
2938f4J47Ol96j09L83J57k11j2m2J66p7K06j13j3J22r5j81K95j83j30J57Mn2J65
2962A30j21K78k50m3r8n4J69K5J6R6n9k74M31k31J32k36O6R8o9J90j98K33R5l76
2986e0m2Nk02R3J85J4K8j49K44j15k15L36k0J00j14j22j10J44M0j63J5J24K69
3009B95m47L55nj18o4j90j80M36mk66J22j36l1j57K65l3J4K65j92j36r1K57n4
3032i5J23j95J13K3K31l01J1K85j89K14l01J85o2j11K00l60K95k29j82L41o1L1
3054c4Q4p2J22k20O8K00j43N2l0p5oj57J13K89j4j24J99j81J05j53J68M9k92K74
3078B22Oj92o4l4L3J91p5l2o9J93j46r8j57R4j33J05K69K31k23j97O1k00K52o1
$$ plain form
2914 217 64 48 -137 234 51 -233 -15 -110 173 174 180 -181 -130 -187 265 -30 169 187 -164 -228 75 -186 -117 -64
2938 -64 83 89 -307 -416 -33 124 -87 -99 -141 25 -52 154 41 28 150 55 -126 169 -14 -144 13 17 -35 130
2962 130 9 287 37 -6 -104 -158 11 36 52 148 89 -185 246 15 147 -89 -23 75 6 196 -2 231 326 -50
2986 -50 -92 -87 -289 -196 -11 3 31 -118 126 11 -204 132 112 212 98 -24 -134 10 50 -113 -98 26 295
3009 295 -152 203 198 80 16 -174 -354 82 78 -188 -66 -202 -233 -390 -125 -158 -144 121 -71 -207 -298 -41 -95
3032 -95 28 -167 -54 -31 200 -101 -90 195 6 220 -81 104 42 -69 131 -229 66 -163 -345 -4 -65 -34
3054 -34 50 -22 100 -120 -52 148 5 57 27 -48 -54 -211 -98 191 177 53 252 71 176 23 191 240 -52 222
3078 222 228 36 -28 -62 -29 162 87 55 -14 179 33 -65 -222 -128 -261 -156 113 344 121 -76 -15 -215 37 -24
3102b4j40K33o8M2o3n8K48l04K60j00K6k99L26j63k20O59o62L91k25K77O3j48
3124E1m8j79K51o0J94j01k76j28L19m0P1k49K35j43r5J25K44k04L00K5l15l3j01
3147a57l7J97L1j63M95k85k65O3q7L58k14R6j91K17l13K63L8j88M92m71j26K28
3169a9M7n2j04L17M1k79j93L25J8j17k67J19L18j82m2K27j48k40L27o5J84n1k92
3192a28K09k8j80J29l3j41K47j88J24O5p2K33k50L4j28J56j18K32k02k11K08k0
3214f2P8j64J02J10k07J86j89K81p4J48j00k54K54J46k15J57m36M27j65k74K65
3235A4k14J09L05j61Q8j56j58J36j45K38Q7k10M15k43l40K91k55J90J80l16K53
3256A08j46p0J44m5M0j49K19J16k91P7j79J15K96k11p8J35l34K93o6k43L37n1
$$ plain form
3102 -24 -164 69 1 43 -20 -78 170 -134 126 26 52 -247 79 -84 -304 355 -307 84 -141 136 199 51
3124 51 3 -176 75 15 209 108 -168 -296 23 -17 54 -195 40 -103 -198 -73 171 -33 267 292 -23 -56 -157
3147 -157 -194 3 34 -129 366 81 -184 -121 -208 150 -64 32 -159 58 -255 8 46 -142 350 -121 -247 -19
3169 -19 28 -24 -128 189 230 -49 -242 83 101 -16 -283 -164 154 -28 -70 157 9 -231 96 31 215 164 -128
3192 -128 81 53 -127 2 -31 -172 75 -113 11 76 4 237 -13 21 -107 49 -69 163 -39 -250 -42 -62
3214 -62 16 -148 -46 64 -143 43 -146 135 61 209 109 -145 109 255 40 197 -239 188 23 -251 14
3235 14 -200 -91 214 53 141 -15 -173 -37 -182 56 143 -67 348 105 -235 56 -199 -9 171 -145 108
3256 108 -38 -108 36 -9 31 -118 101 217 -74 3 -176 -61 235 24 -54 81 -253 40 -26 -269 68 17
3278A7M9j86Q6k87L73Nj47L67q6k98L28l35K45q1J80k38L1p4N3P5m29L95l18J69
3302a06J24K7j33K14j75L6Mr3J93m2k50Q7o3K03j46J15J66k62K21q7J37j34M4
3325H0j13J87k5m2p8L9Qm4m0j4Q6j61j6J81k35K04J77l02J35k62K2K71j16R5Q
3350D5K0j28K09K13j86p5j31k7r8J78K7J29m11K54j4j17K05p3J50k44J9K82m71
3373b44J1K72J80m48O7J90R1j81J68o7j75p3K34k23J40J95O2j21j70r4J12P3J05
3396A04m8M7k49J19jj82L28J23l17K39j3j91m5M6J31J20k26n2o2L4K04k15J23
3419A7n9q0%L47k43j3L3m8L13k69n6n6M2J21k7k56J38j71J81j47L47qQ8K11k87
3444A18j27Nl6J32j11O9K45j5k21J43l1k85K13k65K61n4j39MoJ01J84j22J29k66
$$ plain form
3278 17 66 -120 -34 -321 52 57 -90 277 191 -107 221 -114 131 50 230 -8 23 -51 2 77 -352 43 -275 -106
3302 -106 18 45 -88 126 -49 -13 -9 -102 91 49 -201 -114 -177 26 -120 -5 161 -101 120 33 170 36 80
3325 80 -33 154 129 87 9 48 56 12 -28 -42 44 -117 -133 48 -187 17 194 -108 27 -235 -213 58 -58 37 45
3350 45 65 -63 146 359 173 98 -33 -60 -158 20 47 176 -235 19 5 -112 93 20 170 -74 -55 227 -244
3373 -244 -233 39 219 -229 -162 28 119 -62 106 39 -136 -209 25 -198 -58 137 199 78 -92 -186 -74 -1 104
3396 104 56 103 -146 -27 -28 -210 118 241 -76 163 150 -41 -86 -40 91 211 -15 -67 -129 -95 109 -106 17
3419 17 -42 -122 -122 225 -18 -31 2 -46 267 -2 -58 -114 -72 49 22 -234 -96 -267 -86 -233 114 106 194 405 118
3444 118 -9 -4 -40 92 -19 50 295 280 59 202 171 -114 99 -166 95 41 -98 -94 -100 1 185 63 192 -74
3468g4O3j67K95J6k58j5J25J74l07j5rK97k72J35J01j83J59l11L01j86K85M2k81
3491h5K00J20j39j02k6J7n2J4j06L42k76m2o9J30M8J75n2k52J41J15n8k87K98
3514E4m5j0n8L98j87J06j50Q2j70k1J85j14Q8j68J48k64j1kP8N7J03k93K67j59
3538h6N5L39l09j00J25J96k66k28P8K33n17M68p5M4K00j51N2j38p2K43K9n3p3
3561fl0K2K70m56J97J55P1m91L06J03k28Q6L6j2l3J81l31J80k2j08K22k40K79
3584A51k65J90nk52J96J88j16m44L08K89o8n8j02l97J92N0K17j5O1l7k70J09K36
3607A58k68N9K25m41M25j72L60n23p6K46p4j47L64l19K48r5lM9J23o4j83J0K5
3630g3J67k10L92j35k12j17L41q9k2p9nK16m07K02p6K01n6J07m3n6J34k47j7L06
$$ plain form
3468 -74 -11 -178 117 133 -125 -140 -15 159 -148 -163 -172 125 -147 -12 89 -94 65 -246 55 -131 154 196 -85
3491 -85 115 235 96 -6 -32 -15 -67 -53 -159 183 -93 -135 -204 -74 -26 149 97 -155 -14 101 43 -244 54
3514 54 9 -1 -59 339 152 258 108 190 20 -1 184 70 158 -10 138 -126 -137 -139 -61 -4 99 -194 73 -86
3538 -86 -31 308 -1 -101 24 220 -46 -274 -196 37 -480 -12 -87 -43 157 6 58 -80 -152 91 120 67 -6
3561 -6 -36 -14 256 -200 -3 152 223 -268 38 141 -87 -1 35 23 -10 171 -160 20 -2 -110 112 -128 151
3584 151 -114 76 71 -181 15 203 87 -357 -49 240 172 114 12 -385 -193 -143 74 59 120 83 -187 -78 158
3607 158 -110 -51 174 -267 158 -14 346 -177 -253 -7 -81 -228 136 -183 65 -30 -33 16 139 75 -108 -98 -73
3630 -73 94 -116 276 141 -71 -188 153 64 42 -37 -42 174 -233 -31 -107 94 38 145 102 46 180 -67 -84 222
3654B22k26l9l7K84m2l1k07J40j88l8J31J42j17k5J07J56l8j19r5K11m40L04K35
3677B90l60j71K14K25k62j8J43j21M2L7o8J46j01M1Rj82J04J2k75L18J12j32j88
3700a85Q8L39k63L82l80n7J01r2L52o2j18q7R8K13m50J35J75k78k6M2j64K15j92
3723b14K2L20j00K07J1l22J43O3Q5j71K11m96N86j98l4j30l01M51J21n35L98j55
3745c8k26L16L5K03k06j24O5K18j91M5k08L20j14n8o3j61j6L73K18l89q4J86k56
3768a55R7R8o1q1J69j21Q5j13K51q9p1P0m69L64J51ok66K66j77p1K03J89m19M7
3792a09J33L47j96j70j72J84k36K81K40l62O9l4m0L96k53J3j40L0k6N9J01Ln8
3815F0O8N8j82K84k23j06J16j76J89m9j47J05K80o6l31K26k43J1L62n0K9l55M4
$$ plain form
3654 222 -4 -43 -80 204 162 131 -76 64 -124 -162 -31 111 -6 -31 76 232 194 75 -20 191 -249 55 290
3677 290 -70 -241 -27 198 -64 -82 61 -60 -18 19 -49 97 -4 37 46 -136 -32 -20 -295 23 135 3 -185
3700 -185 -97 242 -21 361 -19 -76 25 -67 285 223 105 18 116 329 -121 14 189 -89 -115 -73 -237 -22 -214
3723 -214 -192 128 28 235 246 -76 67 130 215 44 255 -241 345 147 113 -17 -318 133 254 -281 117 -38
3745 -38 -264 52 87 290 84 -40 25 243 52 97 -111 209 95 37 -26 -187 -203 170 388 -1 -85 101 -155
3768 -155 -58 40 -21 -102 67 -54 31 -82 169 80 9 79 -390 -26 125 119 -147 119 -58 -129 74 263 -156 -109
3792 -109 24 371 175 5 -167 17 -219 62 302 -60 9 -25 -65 331 78 91 -49 -19 -45 14 115 118 60
3815 60 128 186 4 288 65 -41 75 -101 88 39 -108 -3 277 211 -120 106 -137 -126 236 186 215 -140 -96
3838i6K12M3l64J54j04K32J12p8k43M32k64q7mJ99J0l9l78L34j41J55J55k22K69
3861B87k97l5J75j5J5j44lj01J8J98J8q8J46k2k2O2m20K06L9qN1k37l3K92l88
3886c06L48l3P1k95M07m10J4K11o8J75P1j59n0O8p6K63j94o5j37J5j5J20n8K43
3910A40k46N3j24R8L4K0O0j51m0K3j97K17J74j64J90n5K63l79K20k66K78l3j73
3933e8P2j36O1k4L3J2k77K53J08n8p9k7K14q2k70L88j71L2R5q1J9k9j35L69j34
3958I5k86J50J22K4k01J76j75J81Q2j07o1M1j6j39J66Jp6k52M67l73K67M2k12
3981h4R4j65j8J16N1j23L46j66n0QRj34J88j05L62j45m78K37J2j00K43J44j12
4004A30j79J71k03K02j18J1J7m1K7j13M0J32N4Ok35j86J90rK13Q9l8j25J49k49
$$ plain form
3838 -96 116 159 -205 -51 -155 77 189 111 -132 300 36 -51 -55 144 154 115 -263 71 -70 85 240 18 287
3861 287 -10 -45 130 115 130 -14 -17 -118 -100 98 116 28 174 152 130 192 -228 -22 17 9 60 -177 -210 82 -306
3886 -306 42 9 80 -215 192 -218 -204 7 -61 114 185 26 -24 44 -32 231 37 -28 -165 -150 -165 -45 -103 140
3910 140 -106 -53 -177 -79 -45 -25 35 -116 -156 -133 -330 -113 61 -103 87 32 295 -84 136 -130 148 115 -58
3933 -58 14 -122 -61 -85 -52 -40 -317 -64 44 -14 -93 -120 94 12 -258 130 -41 -9 86 5 24 -5 -140 229 95
3958 95 -191 -41 81 105 -96 80 -95 86 168 61 0 41 25 -114 52 53 -23 -275 192 -181 86 128 -84
3981 -84 10 -155 -173 -57 -6 -129 217 51 1 9 18 -116 72 -33 329 184 -294 -57 -45 -145 98 242 130
4004 130 -49 122 -81 121 3 14 31 -10 17 -96 -56 76 130 136 -99 -285 -95 -104 109 198 160 35 184 -65
4028f5j20K05J86m9j37P8R9l01p4N11k27j88J77L4q4j46J38R4l51K48L81m95q
4051i4K07j98O5K83k59N9j56qK21k1Oq7n0k33L06l34L73J12j13K38l63j1M1J49
4075A33l7l2p0n7L26j37k24K42k43L6qj26J71K95k19j94J34k25K94k05J32J9j28
4098a23N54m35O7P9k77J89j23J18j1l0j58K84q6K0n5m7L32m50K20j83J28l33M20
4121A00k66J31J63p0k47K09N8Mj46K61j30k55J28k3mL29m47M0M3L97N6m42J12
4144Ap6K88m2j14Nj96J46K7J65l29j54L03J74j76p5J24J1k35j18K43PJ09j81J60
4168F7n9R5k68K18j44K40j58P2j23j01M25l54K05j73n4J86k12L79j41j4r3J5j66
4191a58J15N1m4J03Q9k36M5j13K87k14J51o6J25J8m40J08O5M6J83r5j67L57q5
$$ plain form
4028 -65 -185 20 206 157 20 98 197 -104 -178 333 106 -82 95 129 45 -101 37 131 -220 28 409 -86 -94
4051 -94 113 -85 -20 263 4 63 -93 -101 120 99 105 18 -32 -265 41 -293 80 192 79 317 -46 -57 -16 133
4075 133 96 64 -6 -63 263 126 -98 144 -99 -63 -71 -197 -26 269 50 -144 -10 -235 59 -146 -14 5 -123
4098 -123 431 -4 63 142 -135 54 -69 49 38 8 -150 134 48 68 13 -34 298 -152 68 -115 13 -320 100
4121 100 -166 -35 128 58 -189 20 78 82 -64 197 67 -188 -60 -83 -87 242 -205 -165 -122 275 331 -111 1
4144 1 -75 213 171 57 62 -134 12 39 204 -125 -279 24 198 22 -53 71 82 -153 -271 -28 -21 88 -93 67
4168 67 8 103 -165 53 -91 149 -9 63 -60 -161 264 -90 115 -58 -112 74 -138 241 100 86 -7 8 -158
4191 -158 -43 8 -36 67 156 -80 -35 -148 139 -75 76 10 135 153 -287 -179 -114 -68 115 20 -147 210 125
4214A25j93R2O7j24k18K16J7j49K19j86L58k08p7J31m0R7n2k66K09q6J4N0J57
4237A53m54M02o9J91l26J87r2J29O6l64j06K60L11l54J87l90K02n2M09n73L90
4258A07p6J7j6j15n8J97J13l00L25j11k53J47J87k85L44m95K98k11N0j94K78j76
4280b27J41M14k33R0l62L24k35q2K08J48j94l4nP1n4k1J21j46P0q2j49M52l2k86
4304a03J28j24j58K03j34J30K03k05J13j97J39N8O0k05m7K44j65J4K43k78j01
4325a82Q1J97LM8k11NK8j15J20q1K27k71K19j18K62l20k23J74R8n9o7J23j8M09
4349C29k51M2j83p8M9k0Q2P9j27N9o5K72j22j43J13m2J46k88K47q2L9k69K66J28
4373A81k26J99r8j33J95j17M7j24j57m2MJ86J00k0j18M10k94K17k22nQ4r6O9n1
$$ plain form
4214 125 -68 24 91 -33 -251 -35 -18 -167 52 -134 224 16 -61 70 30 127 75 -191 18 -68 -54 -4 153
4237 153 -301 101 32 223 -103 84 -8 121 187 -177 -283 -23 288 -66 121 -269 -67 -119 290 -283 107
4258 107 31 48 32 -83 -141 56 169 -131 194 83 -170 -23 164 -121 223 -272 26 -185 -135 -329 -51 -227
4280 -227 -86 328 95 185 -177 147 -88 -170 38 186 -8 -42 -47 24 -30 -51 70 -76 -6 -88 -237 215 183 -103
4304 -103 25 -99 -257 -54 -188 -58 145 -60 53 -144 -5 53 113 -92 -139 105 -60 -46 197 -81 -182
4325 -182 -101 96 99 147 -64 -59 -31 -146 -26 -107 120 -151 68 -50 212 -108 -331 -157 -59 -118 -185 -62 -80 329
4349 329 78 120 -63 -141 -92 -112 -30 49 -78 -19 -84 188 66 -77 36 -6 140 -148 99 17 56 -213 53 181
4373 181 -45 154 56 -77 118 1 48 -76 -233 -275 -271 -85 15 -5 -123 287 -7 210 -12 -17 67 -29 40 -11
4397a1J17j33m9J49m40L80J39r3j05Qj20J43Nj85L92R7m47K50Q7k41K40k60K17
4420A40j59j9lj25M27j23l79J89j66L80P2j68J6R3k4j53J33q7P2k05j37O0N10
4443C44l36N9J49k15J63r1K24l54K13k18J59J84m80J89J48j73j37J04L95k52Q
4464H3r4o4P0O5k14R8K02l29J20K08J2j1j22j68L02l47M54n43J57O3J09j37K37
4487A51j23j93K59k03J35q3L00k13j79J03J52l0J15l45J64j05J72n6J60l34K33
4508H0l0j11Km5N2J44k00J79k25J91o7K08o2M6k30J23K90k87m2J57J24l56K0r6
4532a35J70j15L5K0m7J65J68j45j91p7J5o9K66m14K74J72L3K63m60K12k88L18
4554A70jl25J32k09l9L22j53L52m31R0M7J73l8j77Q0J54k53J50K21l84K09k04
$$ plain form
4397 -11 106 -27 -76 73 -367 13 152 59 -46 -38 -158 -15 -10 -195 197 294 -153 97 184 -57 183 -77 140
4420 140 -19 -38 -41 -166 261 138 -241 -52 -218 162 234 66 82 175 151 -2 131 44 116 -89 -226 -166 344
4443 344 8 67 216 1 164 73 297 -57 156 -62 97 281 -199 -10 138 -35 -172 -68 327 75 83
4464 83 -11 -75 -5 60 -154 -56 146 -183 -63 145 157 146 24 -144 158 -189 265 -278 -121 -58 51 -86 151
4487 151 28 -165 94 -109 26 -57 243 30 -149 -46 106 76 191 -154 10 -95 77 21 181 -153 80
4508 80 50 -61 -59 -104 -52 92 -108 71 -154 37 -30 178 116 162 -68 55 345 58 16 173 297 -59 -39 -135
4532 -135 35 -80 -45 -25 -72 93 261 116 -75 -152 -137 -206 60 -354 -80 92 125 388 -72 140 -148 170
4554 170 169 -156 -24 -233 -272 50 -103 249 -182 -92 -45 128 90 -87 -7 147 -106 44 265 -119 90 -114
4576a14p4oJ91R3m49L68n1p1K49j47L6r9L9L25k60P1J46l77L09k90J1o5J83j85
4600a67K23j55Q9k5k8j5J95o1k02J61L2m98K92K55j7Q7k14M0K64j14k53J53n8
4623a6J17j8J15m27K75k08l7L73l64R7J68k05J02J20j89j96L87J0n5k54P0R5j02
4646a42K01o5J68p9k01j15L40j00R8ML6j27j45N9Q6r5J06Q1J13j45l44J35J65
4669C4k23L39k75L08q9J58l87J82j96K23k69K02J02j39K53j44j76K31j02k1K6
4690C7M0M5J89j69j10j83J76L6j48Q7R7M9j92N0k13J64l7J28m9K0j64J40J77k48
4714g8Q9J57l5K1j86K26j29j69K2J05j31K32k72J76j8kk78L68j5J65m8j14J81
4737B67K7pk68K22l06J95R3m27K11L07l54q5N6L10k51j67L13K21k74j36j6J55
$$ plain form
4576 -114 -188 -194 -3 90 -359 9 -42 -113 136 -11 25 -74 -35 290 30 101 247 -130 179 -111 -100 -165 18 -167
4600 -167 56 -99 -10 -35 -63 -78 117 56 -146 15 47 -451 -159 96 79 166 -48 -8 256 142 -111 42 -16
4623 -16 101 83 198 -229 46 -162 -199 174 -190 -93 75 -130 -28 92 -97 -293 94 104 49 -205 -135 -40 -142
4646 -142 59 -6 162 83 -118 -233 107 7 105 109 145 18 -127 -68 18 -77 29 110 223 78 -266 -131 34
4669 34 -189 150 -125 183 94 252 -135 47 -149 74 -195 7 109 -30 223 79 -97 134 32 11 37
4690 37 77 122 311 142 32 -151 25 61 -87 0 97 146 -46 4 -209 -45 -82 46 -3 17 -147 -7 170 -78
4714 -78 11 168 133 154 -32 194 65 -104 -82 23 -108 124 -148 28 10 8 -270 98 83 248 200 86 267
4737 267 294 287 19 241 -65 130 223 -204 7 314 -40 -125 -69 241 -10 -177 136 357 83 -53 -69 86
4759H6j17j7J47K27l90j09R4M2J73k7l55J55K9K6p%P3J22k93J68Q8J15k74j70
4783b14K5M5K26o9J25k47J02J64m3k54J30r5K54k05k18K05P4j08p6J27k8K04j39
4806a5J13m06K94R4Oj76m8J27K29j05k93J57%j68o5L51n6k32K52k47J82M0J57
4829A91J6q9M6k1O7k68l0K9K9K7N1MO7r4k24J29P2R0j34K1J05j61l5l4K45k82
4855a83M31l23OM8j62K76k60K22N2n0j48R0L77j47l01J55j72J33k22L55m86K44
4877f5O3J21j35j80J56k17K98k29K40q5j85K04J12j14K78j16k12J26j91P7O4Q1
4899I1l6n2Nj56M66l55j05J69k47J28J44j29K09J6j20l6J39n1J37q0l64L39j66
4922e4K58l9j15O7n0q3j85K01k02K85R1J37k28k64J04Q2k71L54l3P5J1k14J72
$$ plain form
4759 86 -31 -48 99 326 -64 -173 -79 -37 136 109 -246 -91 -62 -36 -43 -43 30 152 -141 27 115 230 -44 -214
4783 -214 -189 -144 82 13 138 -109 -7 157 114 -140 -10 -105 149 -56 -274 -69 5 -103 -179 -52 -80 124 -15
4806 -15 98 -308 -14 80 86 -90 -138 -11 218 113 -180 -23 -23 -191 -256 95 39 -193 59 -188 -6 34 191
4829 191 207 118 164 143 210 -58 -88 -59 -30 -3 48 52 119 25 -199 -70 2 92 -42 -21 84 -77 -112 -146 99 -183
4855 -183 248 -75 -69 -21 -183 93 -167 55 107 57 -91 -1 376 229 -72 83 -89 44 -178 177 -309 -65
4877 -65 -2 119 -16 -196 -40 -257 41 -188 52 -33 -218 -14 98 -16 262 146 -66 60 -131 -54 10 91
4899 91 55 3 8 -148 318 -37 -142 27 -220 -92 52 -77 132 148 28 -8 131 80 217 137 -227 112 -54
4922 -54 204 165 50 117 67 -16 -201 0 -202 83 174 311 83 -181 -77 5 -266 88 55 130 141 -73 99
4945I9j56J15j80j64N89j19k74RP3J67k66J01r0J27P4p9Q4K18k57m7j09K07J45
4968B67p9l21j59K18O3q6K23L9m95L14j49J55L0oJ04j11Qk74K61Q1l0o5j66j16
4992b94N25nk06O8j03Q2K80k67p7j86J87n2J8K52o7l6n8n7K30j94J7O5Pr9L6K5
5018I1k36J72J17r0K01l25K45m1j69j00J92j76o0J16L09m75J80J8M1R5k0j8j75
5041a08K58k04J17j43M66m46K38j20j25J5K18o4j4k6k6j30K37j32N8k06J43l4
5063b8j09J14j64O9L15n9k87J23J7M5j3p4K82j01j67k40J18J69r6L3J94J19l04
5086d4K50j8j09Q9k73L9L61j52p5p4Q3n7n8p7J13K50k27Q5j42J61j60j06J09m4
5110g6J19J58j50Q7k51J19j06M0R7K05k91N6J42j94K3K19l22p6J75M9k33J35J46
$$ plain form
4945 99 -57 58 -122 -286 303 184 -90 -81 -8 159 -107 -6 -96 31 105 26 110 328 71 24 -85 122 267
4968 267 188 -133 -292 -74 -11 -97 126 165 -330 -16 -165 -10 20 14 118 7 15 -259 2 83 53 -12 -178 -294
4992 -294 231 226 20 88 -15 67 347 80 3 -183 4 -48 -30 222 155 119 61 4 234 40 57 122 129 30 66 91
5018 91 -145 27 144 54 255 -70 175 134 -35 -135 57 -119 -179 -63 246 -229 -49 -31 10 105 85 67 -108
5041 -108 150 -54 63 -80 386 -60 178 58 -67 -52 166 102 88 62 36 -94 143 11 69 -137 6 -28
5063 -28 -137 -23 -187 -118 197 138 -149 -26 -9 36 23 -51 231 130 -37 -277 -159 10 -86 -53 141 260 -44
5086 -44 206 188 79 168 -105 -66 295 143 68 -6 77 20 -38 -115 -2 248 21 106 -36 125 -35 -141 -32 -76
5110 -76 43 201 51 138 -113 6 -100 -60 37 242 -49 7 149 -45 -22 197 -125 -201 -26 23 -210 -75 71
5133G1k1Q7p2m7L2j16J9J95m3j46J89pk75L33j91k08N10l24J09j65P8jOn1r8K33
5159I7O0l61L54k33N5J65o4j89p3J84J08Q7l66K18k59K01n3J25k61j66K08Q4J35
5182E6j71O1O6k90L80R7k70K88l70m5Q0O4j70K72j6k57J90J57j44J78k32L46m0
5205B30k96o0j22J18J23J3q0J2K42j7p7M2j45j97M29j6k28K74m3k42L3J77Pj10
5229F7j05j40L63k91l23L51n4qk8J39k1M4J78o2n8n8L6M1l03J43J37n6r9L0O1
5254a6K5N9j98J40q0O9R5Kk04L3J04%K11k90L37n0O4n30o2M22j29J05p2k44L35
5279A26M9j36J22k01N4m7o2K36l53M49n61M06j08l3R2j24J13J72k13J5K6j16j26
5302b20K9Q1L19l93J01p8J75r1q7J8J29L27l1l01rn4J67k97L9J19k7j29K00P5
$$ plain form
5133 71 50 137 65 18 50 -66 -47 148 105 -41 148 141 -134 199 8 -200 310 -14 95 -70 8 7 13 -38 -136 97
5159 97 157 -204 150 -83 -28 137 73 -116 -189 -5 103 190 -176 42 -217 -16 -69 56 -205 -371 -163 -79 56
5182 56 -115 -54 12 -278 102 199 -71 217 -153 -198 -118 -54 -224 48 32 -225 -35 122 -22 156 -76 270 230
5205 230 -66 -126 -248 -130 -7 6 -74 -62 180 163 86 128 -17 -214 215 199 -29 245 202 -40 -7 170 177 67
5229 67 -38 -178 185 -106 -429 -78 -132 -140 -168 -29 -50 -6 172 110 52 -6 30 71 -232 -89 48 -8 -107 -77 -16
5254 -16 9 68 -130 10 -70 -1 94 96 -108 -75 29 29 240 -50 287 237 301 -229 -291 131 2 107 35 -209 126
5279 126 175 39 161 -40 14 -33 -95 141 -212 237 -324 82 -26 -59 33 -91 22 194 -19 -4 22 -94 -220
5302 -220 -191 -110 209 -184 -83 -161 14 -77 -164 -146 -17 310 279 -22 -31 -85 82 -215 -176 -57 -84 -213 -13 62
5326F2m7k08L58j80r2J69j62L4KL20l87K02k19J93P4r1m6j01j19J91K11j09l2
5349B3m7l6J10l43L65K15l27J64l16nL40j13j35J5l8O4j60K84o6J61N8l36J82
5372E9q4n8M0J8R2j6q5J56L0m34N42Kk41r7J86j80j7O7O4j39J01k4j9M2m9K44
5398B00p6P6r7L7k62J48K92l06J8J35j11p9J25J5k15J72m4Q2p1K64j87j26N8p2
5422b4J00j74K64j14k03R1r2K1K09k63L28l46L84k09Q2Rk50J6M06l37K39n8J77
5445B56k67j59L55j25J86k09j0Q8m38L80O4J79m37K32j86J28n8L25j14n4j25j28
5467a17OJ74K01j88o0j74J57l2k69J74K27p3J21k2k00j14J42P6k6l6MJ7J11j36
5491c7J92j28J66k27k45L80R6k58O1J76o1L5j91j9L9j21M8K09J84l80K38m4l49
$$ plain form
5326 62 15 -193 165 -15 -107 62 -100 -66 -64 256 -131 71 -148 45 119 28 -18 -119 -238 -47 164 55 23
5349 23 -24 -60 50 -293 72 287 -40 124 -192 -197 143 30 -105 -90 -128 -64 -224 60 -6 155 213 -123 59
5372 59 -25 -83 -43 -25 67 51 -34 122 152 -282 260 262 21 -76 110 -70 -87 -20 44 -95 6 -18 -37 5 -44 200
5398 200 124 200 103 140 -122 26 318 12 30 165 54 -25 100 115 -100 72 28 110 39 303 116 -10 48 -24
5422 -24 76 -98 166 52 -151 -60 -152 -131 78 -185 143 -203 181 -28 54 63 -187 -171 235 -102 137 79 256
5445 256 -11 -170 185 60 246 37 27 115 -323 57 121 300 -137 95 -91 37 -21 304 190 136 11 -117
5467 -117 -111 63 264 76 16 -158 -1 -33 -302 -128 99 26 147 125 -75 -189 -47 29 3 -33 -29 -12 99 -37
5491 -37 155 27 193 -34 -279 101 197 -61 0 176 115 150 -41 -60 -21 -142 -94 115 299 -81 157 113 -236
5514b36J83j86J73L21j72Km23J59L46k19J21Nk53J21k9m7J56p7k1L90k12j09Q5
5537G8k4J51k84k6K53l18K67k45J01k20J38L50j27k25kq8K33J21k74o7J58j8J22
5560E4n0K5j19J13nJ94m13K51p8j71m4J59L27j78k4j32J71j89J33K6J4j09K38
5583A93k71J73p2P6K8j14J75j65J18j63j82K66J4k35K91k84M15l45O1l9J61q5
5605A6J9J9l93K49J34k02K12j81K43q2m9Q1l41J14K60q2P0p3o1J82l08M93j47
5628A73l92L10k27j30M40j55J17L7k8l21J75j51R3K87j61L9n8m0j56K39m8o3J81
5651A61Q6l01m4J40r9K3p8J1M5K69l17J69n4M8P4k0n9j4o0K4j00J33J91k9J6k35
5677b0j6K21k10M0M9j38J60r2k26L37j14M6J98k16q9o2L86m39J56K95o34K13L64
$$ plain form
5514 -236 -53 -239 -66 255 83 85 -338 -179 167 -52 69 74 -179 -58 -87 -134 22 -55 -76 314 102 -7 78
5537 78 54 205 -79 -105 148 -170 97 -148 -47 -267 -129 221 94 -131 -133 -221 12 133 -141 -208 -50 -68 54
5560 54 4 29 -90 23 18 212 -201 50 -28 -199 -243 -84 243 65 41 -91 80 -109 24 50 64 -45 193
5583 193 -78 95 23 99 127 13 188 23 141 -22 -204 62 76 -159 132 -152 263 -82 -21 -60 101 16
5605 16 35 54 -339 -90 44 -158 54 -127 116 34 -15 66 -275 -161 99 17 87 14 -47 135 -173 320 173
5628 173 -219 91 -136 -266 174 19 136 173 145 -176 -1 -152 -59 228 67 106 48 8 -148 91 43 -20 161
5651 161 247 -54 -98 42 -57 -34 -112 -101 -56 213 -104 65 11 59 133 113 54 40 -20 4 -96 37 228 199 215 -20
5677 -20 -36 185 -25 15 64 -74 86 -6 -232 105 -9 37 235 19 -70 -132 254 -185 -29 266 -368 -155 209
5700B09K2l34O0J19N4k68J75jj91Q9k53L22p8L06J60j45k92l13K75J92P4k84K
5723a00J78r1J46L6Lj61j91J71K3p7k6J85l49L97l68J34K50k81j06N8R7P5J2j18
5747a03Q4J79JoJ7l21ML91l81j04K36l4J13Mk91K8L03Q3j83K31j80j7k85J06M29
5772C04j87k24j14J30J81j54mJ40r0J93r4r1j48J85O8n6k60K04K78j72o8J11j83
5795e1Pn3J92K23m57Q6m5Q2J89j05l3N8r9l0J08j00o0j1M3l7K09k19J34r0J98
5820A39j86K5J5k70J39J56l0K9J6q1P4k65K23Q4L5j39n4m6J3L21pk28J13rj00
5845c3P7J87O0j74J76n37R2R1n0k0Q2K43j21j02L9J06O1l05M4K7L3k42N08k65
5869b3kP7n6k81L49P0k14L07r3k65J38J54l55O4K99O2k11j53J01J08J3J44l26
$$ plain form
5700 209 231 -103 -43 76 130 -138 37 36 -155 -66 -319 3 -75 231 391 246 -46 -359 -84 108 182 -102 -100
5723 -100 78 -13 133 169 172 11 -180 -9 14 -63 -89 96 -253 144 -224 -90 160 -121 -227 -169 -72 3 15 -103
5747 -103 -19 160 161 155 172 -149 -145 246 -135 -239 -3 -37 76 80 -211 -183 120 203 20 251 71 54 -231 -125 304
5772 304 117 -107 -221 -91 90 -64 -68 72 -18 175 81 -10 -158 27 95 39 -221 -17 261 89 21 132 -51
5795 -51 -44 -97 95 318 -139 -53 -98 -16 173 68 35 93 -6 -36 72 -28 -88 -99 -56 -93 116 -103 31 -59 139
5820 139 -47 -22 -7 -277 -138 18 -12 17 33 -48 26 -239 -16 68 103 -36 -90 -136 -123 198 191 -37 76 67 -33
5845 -33 44 231 291 117 293 -244 -152 -61 -111 -131 -49 194 73 -29 10 116 177 -128 -84 -57 -24 -266 242 -23
5869 -23 -25 52 -4 -285 64 134 -80 227 134 -131 7 161 -194 -130 169 231 20 -133 -32 76 89 233 -93
5892i3K12j08L0j37J11j37J05K20k14K8K62m43L65l04k00K64mj43o2K99m0M1r8
5915d6J60j36P9j26M4P5J04j94k7q1J47j22J62j17M6lJ8q8P6j31J92L6j72J09
5939EJ58k04M07m69J93K72k98K12k88k3r5l3R6J89j83J79J37j79J18l02J58k24
5961a74M38j50j31J73j79j92Q5J37p0O9l7j5R5j46L4K23r0j5J50j58J58m6k46
5984h7Q7K93l13O9K9k06K46j36L12l50J51k00J84k25L08j69k18K46l8j31K91j07
6006C6o7J43j35j32K04n9j40l2J05K77j53P4j24Nk36K31P7nR2k32Q5J94k11P9
6030G6K1k38j0oJ05K0k63L93j75K69m5j26r9j5R7nL8P7k16P0L16k48q0l4n0j02
6056b30P3M63j64j07k1L21l63J43l34O03n24K31m78L43J57oK0k9j15j57M05j17
$$ plain form
5892 -93 119 11 41 -96 15 -122 -17 203 -11 17 279 -164 201 -103 -303 -39 -43 -186 -248 51 11 52 -46
5915 -46 114 -22 57 -69 -25 50 154 -40 -67 -148 -1 -123 39 -78 -32 -35 -17 -105 -29 -160 32 68 -104 5
5939 5 163 -41 366 -103 90 362 64 276 -12 -35 -130 -163 -67 122 -61 118 255 76 194 -108 50 -174
5961 -174 264 114 -17 156 -23 -215 -130 7 -63 6 -31 -46 49 -97 -63 160 70 55 205 47 205 159 -87
5984 -87 0 293 -20 49 78 -128 118 -18 294 -56 95 -105 79 -146 162 -7 -225 21 -17 -148 143 36
6006 36 -31 112 -23 -155 49 -10 -150 -182 -77 200 47 121 -3 2 -234 -3 74 69 161 -71 14 208 -3 76
6030 76 97 -141 -151 -157 -52 -32 -295 98 -77 192 147 21 -78 -93 4 -1 37 114 -102 -32 284 36 -44 -78 -128 -230
6056 -230 -157 306 142 35 14 335 -28 115 -219 384 -140 91 -387 -44 113 107 127 98 -17 -174 231 114
6078A14l00J32J54m18L17K2L2J11l88J66M3N6K75k69O7j41o3Q6J32k21j2K34m0
6101H9k36J81k82J02K15K34m15J47K00k44j20m8J50L9J50k36R7l13L28%k12oL84
6124B04l93K26r4j17K57J14Jk67K61l55J84O2j81J06J63k87L87m32L01q2l33L94
6146A19k74L48m2j72J15oj97O5r7K71k53K54N9k73k15K28j0N0j74J07J78j84Q1
6169b2K72l71L53k02l54M34l2j03p7K65k13R4j24J28o0R7k20J96O4j31l29K50
6191h5N8j27J19mj44J33p7j05J62j4p7J28J53k74j60M05k7R3k15J24N0n27O69
6214B58k15r3nR2p3K3k15L76j08pl0l30L72q7j86K14jM3Q9k67J99r7j14p7K93
6239E4n9j88K27k22L62k41j99L83j37j96J54J59j36K05N6k74J05j8Q3p0j46J41
$$ plain form
6078 114 -186 -54 100 -318 -1 21 53 164 -224 -58 -15 41 316 47 114 -27 -90 -4 128 -93 -105 129 89
6101 89 -147 34 -248 -146 69 303 -112 35 235 -9 -129 -177 -27 12 162 -74 23 -290 38 38 -174 -180 204
6124 204 -189 37 -57 -174 83 197 198 -69 192 -163 21 83 -98 8 171 -116 271 -161 140 58 -275 119
6146 119 -155 193 151 -21 94 88 -109 -44 -141 130 -123 131 190 -83 -298 -70 -80 -30 -204 -97 81 -103 -22
6169 -22 250 -121 232 30 -324 110 78 -25 -102 163 -50 44 -80 48 -12 85 -135 61 125 -6 -335 -85
6191 -85 -27 -154 -35 -39 -183 -50 -127 -232 -70 -84 -161 -33 120 -154 -314 91 64 157 -58 66 116 -411 258
6214 258 43 -50 -55 37 -36 -13 -228 148 40 33 3 -327 45 -42 -228 -14 -15 28 117 -150 49 -48 -162 -239 54
6239 54 -5 -193 34 -188 174 -67 -266 117 -20 -216 -62 97 -39 166 222 -52 53 35 118 48 -98 43
6261D3j09j59L09p4m1k55K55k6P6k61J94J58R5j73j63K42Pj48J22k02K10q5L8
6284E3r9k05J99M8j11p5K69l5M8Jj59K49j73Mj15mJ6k08J50J02p1k3N8m4M8N7
6310b0J48o5j10K38l53J10N7k52K06K43k31q4J30l3j23K19j84K17pj43j83L48
6332A28J20j06N0l06j7O2k20L85j82L46n67K63o7R2j69L13q2k88J92J45j64j51
6354b23J99j28J28K5NJ12p2j29J92j72L6k18L41k53K19l97p5K41o5K35r0Q7l0
6377c2n5p4O5J62K57m50J5J42j08j81J05J12Q9k88L84l82K11J9k58K89J1K10l65
6400a22J73K81m47K72k29R6r1O3J7J04J0l9q3O6l32K63L7l7L97m84J48j72L08
6423A99m6o2j84J0J37n6P2M2l81N2J88j85J62p5K82k0k20n6J03Q6k96J09J73j35
$$ plain form
6261 43 -66 -225 84 10 -31 -286 -31 -57 19 -242 -48 110 205 32 -131 111 118 -30 92 -110 100 15 53
6284 53 -46 -251 -52 -4 -115 -190 79 44 92 93 -66 183 10 14 -101 -105 -89 -297 -147 -45 -116 -139 -81 -125 -77 -20
6310 -20 128 63 -47 191 -162 -52 5 -247 -41 202 -29 -113 17 -16 -139 80 -104 113 106 -37 -220 128
6332 128 248 142 192 -114 -131 -69 -289 96 -86 260 -307 -44 -111 -19 -188 125 43 -245 -53 92 -72 -223
6354 -223 -24 -152 -24 1 6 118 46 -83 109 -63 -27 -245 96 -157 62 -335 -410 -169 -234 1 -89 -2 -32
6377 -32 -87 -161 -96 66 323 -127 -112 30 -78 -259 -154 -42 47 -241 143 -239 -28 -9 -267 22 33 243 -122
6400 -122 51 332 -115 157 -72 24 -67 -4 13 117 127 88 5 71 -261 2 39 2 399 -85 63 -109 199
6423 199 153 91 -93 -83 54 -2 70 112 -269 -217 -29 -214 -52 -127 155 135 -85 -141 -38 48 -248 -139 34 -101
6447a01L08r9k27K47n3L2k08q4J22j66P2L70k45k9P4Q2m3k36K57J33N5j98j07
6470d4J5J15J29k86j66J24J30K5k16J72k5L1k07M2K85k74J8l2l2J77K39l49K49
6493A20j57K59l42K77q3M8j10K2M2j33K65k71n5J13K22k21J09J23k92j62L8M05
6515B17j22n3j42N2J21j34K8p4N7j28J80J31k11J72n9n1K30j88J61r4k65K26J85
6538B39l89N0K14l08L85J54k68j61q0K32J82n63L44K1k95L57OR8j21K8J68m57
6560a64R3Q9M0j08L3r4K78n7m67M60o4q9K23k14j5p0O9j44L29k04n8L6n0l2O4
6585a16L78l82L05m62M24k01J10Jn6j65J76P9l0j93j4P9N6K1j9j02O5P2j61K12
6609G7Mo3k52K74J0j92J81k12r4K25K11J50j98j87R0j9J6J5k45L92k43pn4R0j09
$$ plain form
6447 -101 207 108 -119 128 75 107 -101 -185 -63 -229 -157 213 -32 -61 13 95 52 -184 73 206 261 63 -44
6470 -44 -29 86 215 -71 -237 -113 17 42 -174 -2 -27 4 -203 -161 124 -150 -132 -164 -196 -19 220 -129 120
6493 120 -37 222 -120 157 74 122 12 34 76 -57 208 -63 -118 -5 217 -4 105 228 -64 -226 -188 217
6515 217 95 42 -100 -48 73 -61 -33 -107 -50 -178 2 133 -78 94 35 -16 214 26 187 93 -172 54 239
6538 239 -150 -100 114 -194 191 345 77 -84 -164 68 250 -313 31 52 -243 114 120 218 97 125 293 -164
6560 -164 -71 18 58 -50 -17 -111 167 110 -357 103 39 -50 173 -41 -56 -126 -57 -201 128 -76 -134 -98 -148 -180 -116
6585 -116 262 -120 185 -277 147 -54 56 57 1 -164 12 91 61 -132 -146 -67 -11 10 -9 -111 -46 26 -135 77
6609 77 81 18 -234 40 50 -142 39 -173 -267 -42 169 319 121 -66 24 5 21 36 -209 183 -60 -67 -121 -31 -140
6634a40K10Q4l79O38k73M4l77J43j16K36K51k60M3J1k01J26J13n8J20q5J95j43
6656A82l25p0K37J7o5l8L93n21M65n0k13k7K14j78K42l78K21l42L32J22j27k8
6678F3Oj60o3L21j28o5N9j92L0K25l66L06n7K2lR3o1k61L32k90M22n49O2L41k
6703H5jk8l44K55K0j7Lj53K25k93J21J3L7J51M2k13K72k46k8l5L29Jk91J2J7j40
6729b06K03p8L22k10j01Q2J99l98N6L01k56J8K13lj73k5N6J00o4J16j74j30L30
6752A78m08R6j08J91L37k02l46J60J04J91L6m07K88j22K34j91k65K21J9j78J2
6773a60K11r6J41j93J57jj90J47J7N6j00L0J69j34K6k8j59k0Q1J01k61K22k9l3
6797d6K59m28K19K9J46l5j32J24M5k32K9J00j97P6K01l50Q4Q7j95l6K35j10J10
$$ plain form
6634 -140 70 154 -225 413 140 184 -193 -50 -166 70 321 61 104 115 -86 40 153 95 215 130 325 182
6656 182 -143 -213 24 41 -24 -62 331 -190 275 225 12 -15 199 21 263 -115 106 -236 96 218 91 63
6678 63 69 -91 -154 167 39 -26 33 -159 -129 96 -270 36 -21 1 -2 91 30 -231 101 -189 233 -316 -254 87 85
6703 85 84 56 -288 -33 -13 -30 -27 -180 45 -248 -127 -114 -77 74 116 -97 175 -71 -99 -134 195 196 -95 -83 -66 -206
6729 -206 -3 -81 241 31 -70 12 211 -187 -131 170 -86 -68 145 142 -31 -56 0 100 36 152 -22 -152 178
6752 178 -230 -134 -242 -51 286 84 -262 -102 2 193 229 -178 110 -12 222 31 -234 -13 6 -172 -160
6773 -160 51 -45 96 -97 60 59 -131 16 33 89 -11 19 188 54 80 52 -107 -127 -46 55 -206 16 -13 -46
6797 -46 213 -215 4 33 179 144 12 136 181 -51 -22 78 -119 -43 158 -192 -108 -21 -216 -252 -17 -127 -17
6820a7R1J70l59k9l2L20l03L82j97j33j5J82l7l7KRk80J15J48P3N7k97M28j00
6844A41l02K1K85K09l53K7L9k82N8K44j36J09o4O1j71O9J7P0q6k96K76j01K00
6867C5L7j41Oq2K26j38N8j14O2J38p5J57l82J86J5Q7k66J76N2l44L63K3k34M69
6891C14n87P1J53K6J70j61j84J58J98l43L28l51J38J6J71L0r6j07k59M57M4j96
6913a0j22L3M6j1RJ05J9J94q2j20L14k05k15P7K97n16K39J71r3r0kK20k03j48
6937i3J48n5J19J4J07l35K4K48j48q4l0n9J62p9O0j06K2M8R3k60K52L2J40m54
6961b34K3J65L34n93K98jj57K24k0j02R4j37K27q6r0M4M7K46j39J74k93j43J10
6984ip6R8j3j59R8J95j68P5K89m05j68K74q4K9j01R4m4O8r9J29k02L60l53K65
$$ plain form
6820 -17 74 244 -115 -144 -176 144 -159 223 26 -107 -122 60 23 -14 -12 -3 -283 -168 -20 53 110 -187 241 141
6844 141 -161 -140 145 354 1 28 67 -215 -157 87 -49 60 -4 57 -114 -45 -28 42 -44 -340 -64 -165 35
6867 35 72 -69 -63 -145 81 -57 1 -113 -51 87 12 169 -213 -27 -12 75 -191 -15 37 -307 56 79 -155 314
6891 314 -273 -202 -49 -23 147 -14 -198 -40 158 -185 143 -208 -70 -54 117 147 51 -56 -315 142 186 -10
6913 -10 -132 -99 -53 -64 -55 50 69 263 181 61 375 170 -45 32 329 -187 52 223 130 40 38 258 55 -93
6937 -93 55 0 119 133 240 -95 -71 177 29 -55 -85 -144 18 -61 -1 -107 -85 -37 56 -204 48 80 220 -234
6961 -234 -211 -46 288 -305 -7 -8 -165 59 39 -63 31 -106 121 35 -55 -11 36 282 143 317 24 -119 -9
6984 -9 -85 13 0 -159 -61 134 -34 41 330 -75 -243 31 -53 -24 -125 -31 -75 -7 -106 23 -179 181 -172 93
7008I3m5k86K01R0r2J69j22K6j48j04L31j88L58k02r3j48J61j82J81K63l63p9
7030a79K40j78K71l53K71l6j21r6J81lJ51J04l67K95m1k24o2K68k14L16j71L78
7052D30n34M9M5L64j29l69K91j61M7j10J45K31j07j32m5m1K06k29p2K26k92J70
7074a7K64j90L3lq6K24k58R0j58OK42R3l07K26j01r8R2k53J8N5J67P0m0l1PQ6
7100A31k16J56j34k73L52J50q5k25Q6R0Jl83K60J18J90p1k96j37L93j04k6l12
7122c35J69m3K1kL25k08N7J24j65j15K54k47K54mk32K10P2J32m50J59p8J80J32
7145B10n41K68J13n3P8L0j48J02Q1o2K91m22K07j43J67k75J52L1j12R6m0k7Q7
7168I0r7k99K31o1o0j8L53j93k8m0J42k9O5k5J3P1O5l97M35r1J56p0j88P7j37
$$ plain form
7008 93 48 -238 -37 53 -39 130 8 34 -114 -218 113 -75 283 81 -12 -160 1 -181 0 263 -100 -179
7030 -179 61 -117 154 -199 72 36 -85 -181 0 -3 148 252 -115 180 139 -85 -147 121 -93 223 52 430
7052 430 -104 -55 -10 354 225 -144 147 -14 33 -77 68 299 192 60 15 -26 180 -49 -121 105 -187 -17
7074 -17 247 57 90 87 1 225 -33 57 -101 -95 147 240 -67 159 58 -40 52 -201 -183 -128 39 109 69 38 45 131
7100 131 -85 71 -63 -336 16 166 81 -144 -58 32 33 -350 -90 28 218 147 -149 -286 107 3 -23 -335
7122 -335 -166 -209 -188 -190 135 -73 -16 108 -57 -172 82 -165 89 85 -147 63 135 267 -183 -24 -102 78 210
7145 210 -331 -63 50 -3 75 105 -43 59 140 78 369 -53 154 11 178 -97 55 86 -26 70 30 3 90
7168 90 -7 -306 -75 -136 -196 -214 139 -54 -82 -122 20 -9 56 31 44 115 180 -217 218 127 283 213 25 102 -35
7193c5K23j48q9O6J85m20l2M18k78K35J0n9J18j93j51J65p3K30j55m04K97J05
7215A5j85L37k37K50n5p7j36K34k19l10M05j21M6o0K27j45J94j91J71j69k3O5
7237A6j52P7j64K36o7K3J35j38P9k28N3K24k3q0k61M39j74k06K26j09m1J49R3
7260A07Q4k13P0o4j51Q4K91j34K4J11k54N4M5k74j0L58j63k32J95J42j01M4K28
7283B41k69j03l6N71l72l84O12l74j20M17k67J85j83P4mQP8k42K86j73O0J21o3
7306F3o38M98J86j73J93j00N7rN0M9p0l81L63K8r3k23J43L28k53J14j86K26j58
7329A4R9l01K53n4L0o3p5K11oMR6r0k09j9J43j20J75n9O8nJ43j71j60L35m96N39
7355B82l36K33k65K84j35q8j16j9L13r8j63j59L52q5J6k10M04j82J25P7j16q3
$$ plain form
7193 -35 188 40 -49 17 202 -218 -250 168 -110 125 135 76 194 1 -150 15 -58 172 17 -387 -90 15
7215 15 -170 167 -70 180 125 48 -88 146 -73 -383 22 -99 -53 -113 114 -31 163 -28 143 -26 -49 16
7237 16 -136 -59 -223 13 -54 -31 104 -34 45 -183 -130 94 71 -9 -270 169 -5 -211 15 -94 -135 14 107
7260 107 191 -22 48 -16 -167 -83 208 74 98 209 -45 9 54 -220 -230 128 -35 -267 -72 70 -31 13 241
7283 241 -28 -131 -167 404 32 -352 260 -114 -234 183 -84 101 -82 -8 -12 -4 74 -168 118 -55 5 126 63
7306 63 -575 -77 109 -64 129 29 86 77 127 176 106 -275 88 116 23 -200 -57 271 18 132 -54 172 14
7329 14 113 -188 65 11 41 -22 -97 114 108 112 208 118 -91 -110 33 -87 88 29 97 92 235 64 -96 239 -257 282
7355 282 -54 179 -86 198 63 -25 -141 -160 153 55 -108 -267 85 0 16 -194 210 28 153 230 114 31
7377C1j20J91rK4M6l21J37j27Q7r7J23K5j61K53r1o5J06O3Rr0K2j9j66K16n4Q0
7403I3o4K30j30Nk15K7J68l08J25k65L51J70m34K2K80j20k9l2J34M8K03k60r2
7426i3p5J1K53k3R2N6j86K30j72l42L16j53K45k76K2jk18O12n04KL59l77L33k02
7450i1Q3J26q7m5K49P1l33p5L09j47j43P8j06m0kL19Rk13j54J33j37J46j60J77
7474c3j24K03J6n2M6k37K34k08L80j91j91N1j14K35K18k07P9j14J3K54k73k55
7496b70L52j49m3L01n02L53j19J48J00k08r2l3m6P6Q6J55l22K22o7M9L14l33J12
7519H4k71J90j02K60k83j05M48j19L2q7j1l87L32K40j55Pk61L58k62Q2L8j9J86
7542A95j25PL5j47j40Q8K5k22K80J62l13j52K78L22j02k25nJ8K9r0K07j72J57
$$ plain form
7377 31 -89 102 93 117 163 -158 -21 -148 -61 -158 -35 -10 -171 82 -9 -74 32 95 104 14 36 17 -149 67 13 93
7403 93 29 259 129 134 -81 -54 114 -194 -69 -334 17 187 -247 -225 55 -65 -94 -126 8 56 259 -1 -93
7426 -93 -168 -157 96 73 165 221 35 265 93 -249 67 -86 159 -117 -95 -96 -314 298 -206 -204 155 -222 111 -91
7450 -91 -8 118 31 -14 235 306 -27 -102 207 60 -83 -5 -111 -151 -153 166 175 -38 -192 -59 -196 -50 -210 -33
7474 -33 -157 46 62 10 56 -181 53 -155 225 34 -157 -106 -220 15 233 26 105 -9 4 258 -15 -270
7496 -270 82 -67 -110 191 -311 42 -77 71 171 -37 -129 -162 -208 -132 -46 109 -213 9 -58 -9 305 -28 84
7519 84 -187 3 -99 161 -122 -227 221 102 134 47 36 -351 -19 221 66 73 -188 170 -92 -10 28 9 195
7542 195 70 77 112 -35 -175 -87 -62 -284 -4 158 -155 -307 -29 293 191 -34 -39 -21 8 -82 125 -47 110
7565A10j3k85K31o7N1r5K51j42k6Q4n4J21j19j9K5M5q8l12J09K24k97M59j76M9
7589F6J12m5K49n12J95k0J00o59N06J98j56q1R4J13M6m4q0k09K64k84L56l23J39
7612B5K52l05L92m89K91q5q9K52m04K10q7r1R3m8J24k22J57J85l22K95j23k14
7634b03J41k37J86k81L00J2J97Nq6j59k12L92kl29J10J58N5j27J78K9k16J03M1
7657E5n5J3p2m5n0Q0k07J18J86Pj34L1j68oJ60K12k39M05l32J59j41j86L23k57
7681a43j11L38P2k36Q8Q1l68M30j28J69r7j49k11N48j28k45J68j53L9L8l8P6N3
7704I3l48L70l1n6q8j25j10Q9K27J62j65r7Q0Q0J1k62K61j37K28k73J94k35l8
7727a70m3L85M0o6r8k60M14K9j54j29l00M26o8J00J01L4k03j34K94k33n2Q0Qj68
$$ plain form
7565 110 97 -188 43 -24 27 -68 183 41 15 99 45 166 47 28 53 98 10 -302 -193 31 -266 193 17 66
7589 66 178 133 382 -130 65 45 145 -514 -8 190 34 -47 47 160 206 162 82 -127 137 -147 209 -114 25
7612 25 277 -28 364 -125 166 81 -8 244 -160 50 -37 -128 -35 -83 41 -181 -24 161 -161 134 11 -203
7634 -203 -62 -299 -113 -394 -94 -82 115 120 34 -125 -337 55 53 -276 -166 -8 47 -80 98 127 -89 14 55
7657 55 0 13 -59 -104 -154 -74 -281 -163 23 30 -104 -73 -241 -247 -87 125 -114 291 -41 118 -23 -209 114 -143
7681 -143 -254 84 156 -80 8 89 -279 151 23 192 95 -54 -265 283 155 -90 78 -75 -36 2 -36 40 93
7704 93 -255 115 84 28 -60 -185 -295 -206 21 183 18 -79 1 81 92 -170 91 -46 182 -91 103 -132 -170
7727 -170 -213 172 212 146 48 -212 202 231 77 -52 -352 74 6 106 207 241 38 -96 198 -35 -87 -7 1 -167
7751a67L32j38k85K55K42j95J57k93j24K74rj74J84J94j82k42N6J69l30M25j16
7772C3l24L25j32L04k28l5K7K57l04R6K0o3n3J86l9p3j42K12k70J97K77j22j57
7795h%MJ88l29m8M7L38r8j04r0k37L37L54n11P4J48j39J15R3j29J66k55K37j65
7819a2k3P5m4n7P9J37j40k21O9J91q8M3r2O1J02k61J46j56J36P9pJ67k71L62m29
7844a54N7L13l63K21l21J00M04l93K39j25L20l16J30l71M22j13l7k77J38j94P9
7865b41K36J33l20K19J24J0k54P3J06R0l13q4K72K33n98J94M3K50j41k14j92L76
7887BJ77k88R9l7J82n5J12k59k1K07J38l53M2K57k46P8L5j25KK22k69j04L20j83
7911f7J26q4N6k12K49j71J2mK35K4m62J33J83o2J22j9l7j20QK81N2k93R5K1J47
$$ plain form
7751 -167 165 27 -258 -3 239 44 201 -92 -216 58 49 -125 59 253 71 -171 -115 54 -276 149 33
7772 33 -291 34 -98 206 -22 -57 -30 227 -77 19 39 -24 -77 109 70 -3 -145 67 -203 -6 271 149 -8
7795 -8 -8 -4 184 -145 -193 -146 192 94 -10 -100 -337 0 354 -157 -83 65 -74 41 134 5 171 -84 153 -12
7819 -12 -35 40 -4 -61 18 155 15 -206 -137 54 -34 9 -83 -22 80 -181 -35 -191 -55 24 17 184 -87 275 -154
7844 -154 -97 216 -147 74 -247 -147 257 -136 103 -22 298 -18 112 -259 163 50 13 -264 -126 -320 -241
7865 -241 -5 128 -192 27 151 161 -93 -20 86 176 -137 -221 51 284 -314 -120 -77 173 32 -182 -374 2
7887 2 179 -109 -10 -47 135 80 192 -67 -88 119 257 -96 -54 203 -43 35 70 -55 -53 169 -100 -204 116 -67
7911 -67 59 -25 31 -181 68 -103 -91 -95 140 164 -298 -165 18 -44 78 59 22 -98 -90 191 243 -50 45 66 213
7936B13j37k07K40j94l4J61K23j48q1q8j2R7m0k8l9J39k51K59J31j87K79l68k23
7959b95J85N8K28j11J37k91J68j40j4N8j06J10k89M62l28K02J70p4j19m2j20M4
7981a07J12k28p0K74r9J39o4J71j94j03L64j15L57n22K0K09l91M80n27K64J08
8002G8j70J46j58K44l72L75m7j28N1j08J73q6j01J98o1J85o9L5k55K8J80m34M02
8025A06k20R8J16r2J08l19K22j99j24M98J5P2l85L86j31l87L50j11P5R3j46j78
8047a53J88M8k48L11j38n6J43N0r5J83j78l32J82J16n7K75j86j82K67k14J58N7
8069A39p1J40p5j22k29K38J38j39l6m2L7rJ59p2k0K55l74L2l0K71m27J58oL30
8093B45o0l78Q3k39M60o6J26k33N5j00K03P2r9M9k46K74L9%j79j26J05J78o3k95
$$ plain form
7936 213 76 -131 109 -85 -119 42 265 117 36 -52 -64 33 -7 -35 -74 65 -186 73 204 17 296 -72 -295
7959 -295 -110 -52 176 65 202 -89 79 -61 -75 -17 -123 -13 -302 160 -168 34 204 130 11 -31 -151 -107
7981 -107 5 -223 -293 -19 -118 21 -43 128 -66 -169 195 80 437 -85 -65 144 -247 233 -294 -30 78
8002 78 -92 54 -104 140 -232 143 96 -32 19 -89 84 -2 -103 95 34 219 150 185 -70 -42 138 -296 106
8025 106 -114 -16 100 8 116 -203 19 -180 -304 194 209 281 -104 282 151 -236 114 3 78 171 25 -153
8047 -153 35 83 -165 146 8 -48 95 145 50 233 55 -277 -95 21 -36 239 53 -129 138 -76 82 139
8069 139 68 208 133 11 -218 20 158 19 -17 -59 -22 -31 128 56 36 291 -83 -51 -81 190 -237 -79 -85 245
8093 245 185 -193 -110 -349 111 45 171 -62 -7 -107 96 168 69 118 -128 146 185 185 6 -120 -15 163 100 -195
8117a95J75k10L22k99K93j62K01j27j44N2m1K66k00P4L2P8q4l27K78J68j09M7
8139H8k57k2K67j59n2J24K4l7J92J01k48j83L23M2m13K84J45l62J14J14kk27L8
8162a06PP7J3K6k43M25k58j63qlK72J20q6l1J3m4ll6j67J82J89j5Jr9J07k32j9
8189h1mk7
$$ plain form
8117 -195 -20 -230 92 -207 86 -76 125 -2 -146 -94 -135 131 -69 5 37 115 31 -296 -18 150 41 88
8139 88 -169 -191 76 -83 -135 -11 13 -24 168 269 21 -162 161 203 -210 74 219 -143 -29 85 83 -144 -106
8162 -106 -99 -22 -9 17 -226 199 -59 -222 -230 -233 39 159 73 42 55 11 8 -28 -195 -13 176 161 162 63 170 -62 -81
8189 -81 -85 -112
8191a12
$$ Imaginary data points
##PAGE= N=2
##DATA TABLE= (X++(I..I)), XYDATA
0@%%%%%%%%%%%%%qJ6j6J6j6K4l2L4m2N0n8P2q7R9j12J32j52J71j95K24k55K87
35A52l23L63m06M56n10N67o31P01p78Q60r49J048j156J275j407J550j708J882
53I86k075K291k533K808l121L482l908M413n022N779o748Q039r856J2621j7393
68a0237K7890r5051P0014J42670j45378o1499P7442N8351p4597j8305N0507j4185
80G622n0221N8468K8028o9139k6054P8797L6181o7956n1580N9214L1628m3905
92h917j0284K8024q427j4640J1786J7920j7703k2010K5840K1457l0467o886K8343
105A4036L278k0482o131J8556M606k8584j171K7077n432j8880P476J5557O20j9366
119h840n461K0806J617j3043K704J564k830K830N443O767p487j2666R669N074
$$ plain form
0 0 0 0 0 0 0 0 0 0 0 0 0 0 0 -8 8 -8 8 -8 16 -16 18 -24 26 -32 40 -47 52 -60 72 -80 91 -104 120 -135 152
35 152 -171 192 -214 242 -268 299 -332 369 -409 451 -498 550 -606 669 -738 812 -896 986
53 986 -1089 1202 -1331 1477 -1644 1838 -2070 2343 -2679 3100 -3648 4391 -5465 7156 -10237
68 -10237 17653 -77398 -7384 135286 -10092 -71591 5851 64202 -10395 -28700 21807 7622
80 7622 -42599 15869 43897 -25242 -51296 27501 63682 -4274 -55854 3360 34988 -8917
92 -8917 -19201 8823 396 -14244 -2458 15462 -2241 -24251 1589 23046 -7421 -14307 14036
105 14036 17314 -3168 -9299 9257 13863 -14721 -15892 11185 5753 -13127 -5651 9906 10526 -8840
119 -8840 -14301 6505 8122 -4921 -2217 -653 -3483 -653 4790 11557 4070 -8596 1073 6147
133F147j1098J369P726n16o383n850P375M493p836N523O882j2831m895J0466P806
148H378k688r099L471P300j0478l097J1641q59p406r45L818K297n778q70R761
163E446m166q439O025L303k880m76J679M128k453n471N894J469o607L048K155
178B655l423j332M65L408j349o310N444N042p240j477M477J311m05k397K137L456
194D462o230J59O060l306l343K842O03p94l756J60O409k972n216M555J381k207
210a193M3R00L018j303m353M699J612m790J821J967k167r80j365L421L96n850
226d124K557M276m290j151K504Q39L97k653J269L745m187j80M808k195k567Q12
242a40Q15J759l653j899N106j820l481K705M00p16N09r97K760j098k864M501J193
$$ plain form
133 6147 -4951 -3582 4144 3628 -2755 -8605 -1230 3263 -4573 950 7832 -4999 -9894 572 8378
148 8378 5690 -3409 62 7362 -3116 -6213 5428 4569 -2837 -3782 36 2333 -3445 -4315 5446
163 5446 1280 -7159 -1134 2169 -711 -1187 492 4620 2167 -3304 2590 4059 -2548 500 2655
178 2655 -768 -2100 -1635 1773 424 -5886 -442 4600 -2640 -4117 360 1671 1266 -1131 1006 4462
194 4462 -1768 -1609 4451 1145 -2198 644 1247 453 -3303 -3143 3266 294 -4922 -367 1014 -1193
210 -1193 -1150 -250 2768 1465 -2888 1811 3423 -1367 454 2421 254 -726 -2091 1330 1726 -4124
226 -4124 -1567 2709 -1581 -2732 -228 611 1008 -1645 -376 3369 -818 -998 3810 1615 -952 -140
242 -140 675 2434 -1219 -3118 1988 168 -3313 -608 -208 -924 -415 -1412 1348 250 -2614 1887 3080
259C080m208J404J457m79k34k709K549J529m549J052J989k206K7N91k9J307k734
276b163Q47L542k499m94L087j165l83m71n44K666j888j997L339j943k025K132
292D1o11j33L70j503K420j075k146M234M22l557J547R08n3J18j364K132P22m472
310b000J248J996k197Q80n79n07J151k419J171K716k223l16K005j238Q47L38p30
327A43J688j525p73K420j827n11J630j947j04L59n18J280j148j443L342j004j704
344a642K513l08l99M18j380K713J96l001J726K79j709R17m48m25J449k556J59
361a498J765j442N61J569k001P71J71m23K619j304m92J398k386Q19J537j367K93
378E90p79r93J340r43m87K147j115j588J665o38J085O71j439J815j18k266J919
$$ plain form
259 3080 -1128 276 1733 1254 1020 -1689 860 2389 -2160 -1108 881 -1325 -1298 -707 -736 571 -2163
276 -2163 -1316 2226 -273 -767 2320 1155 772 301 -243 2423 535 -1462 1877 -66 -2091 41
292 41 -570 -703 -333 -1836 584 -491 -2637 1597 2019 -1538 9 917 864 982 -382 1750 2472 -2000
310 -2000 -752 1244 -953 -73 -652 -1159 -8 -2427 -1256 1460 -763 -1079 926 -312 535 873 143
327 143 1831 306 -467 1953 126 -385 1245 -702 -806 -447 -965 315 -833 -2276 1066 62 -1642
344 -1642 871 563 164 582 -798 1915 2111 -890 836 1115 -594 323 -125 -550 899 -1657 -1498
361 -1498 267 -1175 -614 955 -1046 -275 -104 -527 2092 788 296 1694 -692 127 1664 297 590
378 590 -189 -1182 158 -785 -1272 875 -240 -1828 -163 -801 284 955 -484 1331 1213 -1053 866
395H66P34j193L16j181M0J436j925L00J406k631N98J143n79O60n83J03J513j447
413d24l3K249j157q19P80o00J143m02j285J501j275j399K021l00p01Q31j615J071
431d14P01j488J625M92j459J219k51l14J204q31J01N56k190R50J052j969Q84k8
449a60j060J158k37m16J140j257K62J548j213L92J010r88N51m76l13J372r71p17
467c75J113j070o55J015o93R16m60j220J504Jj278J725k12n10J088j227P59R12
485A333j627P62N32j497P46q5r55R93j023r3J281j206n9J396j154O34M18o89R93
504G00k91n26J112q38PJ050j274r6M01j076Q51j1j281J221j13r86J401n81l7Q52
524D85q09P94N95j557R30P55j130M30l88j47M21q98KJ154j391K41P27j084P70
$$ plain form
395 866 1600 407 723 -458 -418 1018 -907 -607 799 -1832 -1234 -91 -670 -10 -593 -490 1023 -424
413 -424 -457 1792 635 -184 596 -4 1139 737 -548 953 -322 -1721 300 0 -701 130 -1485 -414
431 -414 287 -1201 424 916 -543 676 425 111 1315 484 585 1141 -1049 -99 953 -1016 -132 -160
449 -160 -1220 -62 -299 -715 425 -832 -570 978 -235 157 1167 179 730 254 -59 1313 342 -375
467 -375 738 -332 -987 28 -665 251 -209 -1429 75 76 -1202 523 311 -199 889 -338 421 1333
485 1333 -294 468 1000 -497 249 164 -791 202 -821 -914 367 -839 -898 498 -656 -22 396 -293 700
504 700 409 -117 995 157 164 1214 -60 -156 245 -831 20 9 -1272 -51 -164 -1150 251 -330 -367 485
524 485 -324 470 1065 -492 438 1193 63 493 105 -42 379 -519 -517 637 -754 -513 214 -870 -100
543a00L28j093J565n20n88J321l94m61R01j014M66K24j011N07Oq54R56n89m11
562g61Q64n49K59K09l56O35L95j112J159k72p84J157n60l16N99o02K8L78r27J9
582e37L71o99P34j20o10J198o67j8R92o84j9J018j003O15j13o30P93l65q07Q89
602C38m82k19O37r51K09O73j112Q85L44p68N45O6m35J140p36j41R14q10PN52j004
623c48L85K97q70L52j65o29J138o21P6J021p59k61Q60o57O89J47p66O91n11l13
643b44J086o35n27M76o60J74N08j095P00J17o11O40j20O4P54o98m7R29r94N25
663C42m1o21N61o9n33O76n47n58O15m00q5R64q82L62L53m80P40j5p31J117m13
684C55k74O75o38l2L17n99K43J95r13O97k63l32N67m77j70Q59o87L42Q44p51M94
$$ plain form
543 -100 228 -865 700 180 -408 913 519 58 959 -55 411 635 -376 131 137 -717 239 -350 -761
562 -761 103 -446 -187 22 -334 301 696 -416 743 471 -313 844 284 -32 567 -35 -7 371 -556 -537
582 -537 -166 -865 -131 -251 -861 337 -330 -348 644 -40 -59 959 -44 571 458 -172 621 256 -551 338
602 338 -144 -363 274 -677 -468 205 -907 -22 322 -446 99 165 -270 870 134 -7 907 97 104 656 -348
623 -348 37 334 -536 -184 -349 -978 160 -461 -385 636 -123 -384 476 -181 508 655 -111 580 69 -244
643 -244 842 207 -320 156 -504 -330 178 -917 -217 -100 -711 -71 -191 -127 627 -71 -118 811 -183 342
663 342 301 -320 241 172 -361 315 -232 -790 -175 -575 -660 304 -578 -216 137 -343 397 382 -349 768 355
684 355 81 756 118 86 403 -196 47 242 -671 26 -237 -569 -2 -479 -649 210 -477 -135 709 -42 452
705D52R5o67P17j78m43K50n36k86R03j083N54O46j167M43Q6l53Q13j03n23J000
725F20q32K58N71o39R1P77j141M28K25q00P74n58l8M59p90O2P44p46J73O43n63
746b82M48J73n96N79m8m97Q05n11kK48o05L40P4k49R9Qn41O18m92j95R75n58M2
769a67O24o31L23M40n58L24K40q51M89k94k71M39n23j56O71p64Q01j61m74O28
789A29n1o36N39J72k29O40p43K52L53m97K81R4p50N27k83k26J97J19k89O27l07
810h1k40P31o61K55N53o84M89k0o49P81p9l10K06n58J69K57k65m7K32q00O17J84
832H0n30P74l99j17N83n97K64M82p45K87M09r54P59k81l87L74k85m0M68l96P1
853a80L72p62O45J31p42P21K81o21P36n08P4M68p74M21J10q67O44j83m53L99k9
$$ plain form
705 452 547 -120 597 419 -24 226 -310 -596 307 -776 -222 424 -743 -300 -214 -567 246 143 -380 620
725 620 -212 46 617 -22 69 846 -295 133 358 -442 332 -226 -264 195 -595 -533 211 -535 -362 281 -282
746 -282 166 339 -257 322 274 -223 582 71 69 317 -288 52 126 -123 -24 -16 -557 61 -431 -626 349 -209 -167
769 -167 457 -174 149 589 31 355 595 -256 233 -61 -332 107 -416 -572 99 -665 136 -25 -499 129
789 129 78 -558 -19 153 -76 564 -179 73 426 -71 210 304 -446 81 -202 -428 -231 -112 -401 226 -81
810 -81 -321 410 -251 4 557 -127 362 342 -307 474 395 85 291 -267 -98 159 -106 -153 79 -721 -104 80
832 80 -450 324 -75 -192 391 -206 58 540 -205 82 491 -463 296 15 -372 2 -283 -323 145 -251 -180
853 -180 192 -570 75 206 -536 185 466 -155 581 73 147 615 -159 262 372 -495 149 -34 -487 -88 -117
874a17l15N88k35n9K36n63L52N99p07M26K45l25K35k11n84R88m08l23N70q44J13
895c39N57o34L20K60m50M74l64J10L05k30R9O29j020N68J21o55L04J88o85O49
915B07l36j74M01k05j05J38l27L16K79m05J69K94m49O69m18K38J48q46J91N46
935C31m91L45j15k47K95l33k39O29m61J05K82l23M31l2n29O07j76l52M48J55o69
956c39O70n11k4N06o47O8K85k15J01R9m12R15m40k52M06k45k02N37l31L58K56
977E83n90K79l01j63L77m46k1K82k95o0J22P5J31L52l43L15Lk89K94L5k93N81
999F28p16n7L12l21P8K53n34J63J85n84P29l39r1O39l93M5J36r4kK96l37K84q4
1022A96m99L68L7k52L34n18j1L48l44J74K58PJ2j21j06K60j01o6L78l89j86M48
$$ plain form
874 -117 -432 156 -79 -138 98 -465 -113 486 -221 205 450 125 360 149 -435 553 145 -178 392 -452 -339
895 -339 218 -416 -96 164 -286 188 -176 -66 239 9 108 737 -283 285 406 -249 55 243 -442 207
915 207 -129 -303 98 -107 -212 -74 -401 -85 194 -211 -42 252 -197 472 54 292 440 -406 -215 331
935 331 -160 185 70 -177 118 -215 -454 175 -286 -181 101 -222 209 177 -352 255 79 -273 175 330 -339
956 -339 331 -180 -204 302 -345 -277 8 -207 -106 -7 -419 496 56 -196 210 -35 -237 300 -31 327 583
977 583 -7 272 -29 -192 185 -261 -282 0 -295 -355 -233 -158 -27 325 -18 297 300 11 305 340 47 628
999 628 -88 -145 167 -154 -76 177 -357 -194 -9 -593 136 -203 -294 345 -48 -3 133 39 37 333 -4 280 196
1022 196 -303 65 102 -150 184 -334 -345 3 -341 -167 91 98 110 -11 -117 143 42 -24 354 -35 -221 227
1044B27k04J47K7l92K65R7m75J34J12l35O81l07M1J70j50m8L9p8Q9K80l80K12
1066A52K2l02M46l70Q9J83m98L8K01j44J09np4J75j58r0N76j07k32L67m75K27
1088A30K1j90K33j05l12L23m28J37J98k38J20Mk24O37l61J4M01qn85N87l80o4
1110i0N00o64M08pl96L52j87l10M29o4l12M51j70k56O66n44K74L70n47J43l42
1131b96J70K89k12J16K52m40j07K11N6j86K42m90M72k28j26O27l88l2L65l94Q3
1152a6K92n14M44M9n80M61k8l12M47n17m3K71j09K24ok10M3J50j39J04oQK47k84
1176b4k07L95k45K00m5j07j3O8j02N6k2k01N12l30j48M39o7p2K44m98K95l7k36
1199a45N51k58k54L03m55J99J67l89Q4L19l70L98R5l25M55m50RK83k89K71K41
$$ plain form
1044 227 23 170 197 -195 70 167 -308 -174 -62 -397 284 -23 18 188 38 -10 29 -49 40 320 -60 152
1066 152 174 -128 318 -52 37 220 -278 -240 -39 -183 -74 -79 -153 22 -136 -226 350 243 11 378 -97 130
1088 130 151 -39 194 89 -223 100 -328 -191 7 -231 -111 -107 -331 306 -55 -41 360 352 -233 354 -26 -90
1110 -90 410 -254 154 147 -249 103 -84 -394 35 -29 -341 110 -60 -316 350 -194 80 450 -97 46 -296
1131 -296 -126 163 -49 67 319 -121 -228 -17 39 -147 95 -395 77 -151 -277 350 -38 -70 295 -99 -16
1152 -16 276 -238 206 255 -325 136 108 -204 243 -274 -317 -46 -155 69 63 -147 -104 46 -93 11 5 13 260 -24
1176 -24 -231 164 -81 119 74 -33 -46 22 -80 -24 -46 -247 265 -65 -213 226 159 87 331 -167 128 91 -145
1199 -145 406 148 -106 197 -258 -59 108 -281 -197 122 -248 150 245 -80 375 -75 -66 217 -72 199 440
1220D40n52K96k7l25M36j10j93L36j01j79J72n15L00o8N2K49j72j48K44k49K87
1241A73j33M1m5M05n15k8L88k71j40RN3K34k90j82K08k8J38q8j08P2M49k53J29
1264B18j77l5K01p0j33L46n33L26P3o97L47J40m19N05m64J50J57K38m98O66m13
1285g2j49L24r7K06k53j9J70l65J34J14j70k9O4P7J8l7p9L05M2j89K05pl03J95
1309H5j1O6r5j02N5J63k04J6K12k15j08J18m1J09J5n5N9j49l2Q0K45k23R0k33
1333a55L31o2l84L86k05k7J90j7k30K55l28o1M52p22P76j34j71M73j69k36K89
1354B51l00N5J25m6p8j7l38N35k37j63L7J50J38J33l42j4k9M8K60p0k12L09k49
1377e4j82K96J00j72o5k06K54M40o41L9J49O3n6K73m24L76n04J87J59l41L06K20
$$ plain form
1220 440 -112 184 157 -168 268 158 -35 301 200 21 193 -322 -22 -90 -38 211 39 -109 135 -114 173
1241 173 40 81 36 441 -74 -102 286 15 -125 -116 -63 171 -119 -301 -93 -121 17 -71 -179 -107 342 89 218
1264 218 41 6 207 137 4 350 -183 143 216 -481 -134 6 -413 92 -372 -222 -65 173 -325 341 -72
1285 -72 -221 103 6 212 -41 -60 110 -255 -121 -7 -177 -206 -142 -65 -47 -84 -163 142 184 -5 200 193 -110 85
1309 85 74 140 45 -57 -2 161 -43 -27 185 -30 -138 -20 -61 48 63 8 67 -82 -114 -34 211 -12 78 -155
1333 -155 176 114 -270 116 -89 -116 74 57 -173 82 -246 -307 145 -577 199 65 -106 367 198 -38 251
1354 251 -49 6 131 85 7 -10 -348 187 -50 -213 -176 -26 112 245 -97 -111 -140 -92 168 98 -114 195 -54
1377 -54 -236 60 160 -12 -77 -283 -29 411 -230 -191 -42 21 -35 238 -186 190 -314 -127 32 -309 -3 217
1399B17k58J09r6nJ17N8m68L63j72j40L26n2j3J4k09K34l33J38M90k57k4On3o3
1423g1Q2j15K90j19j28N2P1k57L02m84J49O9J23o0J97j92J3P8Q5J51k15K52j64
1446A09k96K21p8K2jJ41k74K72o9j43j57J55j5J89j13L8L03k36k82N47l45j87
1468a99K69k50K03R6l14K47l39M3L0N04l26R3j34R9R6j27N2k35J86K32k61J02
1490F7M98m82p9N0J3k15M56m80L24j94j98J83L3o9j77J03K18j25R7n9K82j20L
1513A29k6J11m5k92O3J29j8j45q8J42P7J51k21K94k21j94M33l80K2R8J16m38L55
1536E2J59j75O9j23q8j27J3K73k02pL88j94J87M2l01L63m6k31J49k42J18j38J58
1559I7l49L64n6J91k82K61j88k26k6q1K32n3O2q9K46n3k31J02K13k99L48j38j12
$$ plain form
1399 217 -41 68 -28 -33 84 142 -326 37 -135 -275 51 -1 -14 0 -209 25 -308 -170 320 63 39 45 -8 -71
1423 -71 11 -104 186 67 -61 -9 62 -195 107 -377 -228 -159 -36 -96 101 -91 -78 0 85 236 21 273 109
1446 109 -187 34 -44 -22 -23 118 -156 116 47 -96 -253 -98 -113 76 -37 1 304 68 -214 333 -12 -199
1468 -199 70 -180 23 119 -195 52 -287 -244 -214 290 -36 57 -77 22 118 -9 43 -192 -6 226 -35 67
1490 67 565 83 4 54 67 -148 308 -172 152 -42 -240 -57 -24 -93 -270 -167 51 -74 23 -36 246 126 129
1513 129 103 214 169 -123 -60 69 51 -94 -182 -40 37 188 -33 261 40 -154 279 -101 -79 19 135 -303 52
1536 52 211 36 105 -18 -106 -233 -220 53 -149 -156 232 38 225 267 -34 329 283 52 201 -41 77 -61 97
1559 97 -252 112 56 247 -35 226 38 -188 -214 -295 -63 -116 -54 -143 103 50 -181 -79 134 -165 183 45 -67
1582f7K2j79J61L5lO2O0j11J07Q5q7k40J84M1R1j11p8k25K34J42k72J06k31M03
1606A29l69J61j25k07M99pq3J34l05J52pJ41J8K78l30K36n42N15l47n1M9M13m00
1629d8J51n0M2P5r8K4J5q6l3k1k0k98L53K98k67R6r5J74J7j18k33J47k70L35k62
1654a72L4l8R4J77L3k61K05k8J3j9Q8k13K07j41L33k14l27J69J2OK92m41J30n0
1678a11K09m03L23L8l7J35l18K79k77J65m7L53l36J72k6j41K07j78J76j13k29
1699a59K94l1n09J35J41J93p0r0J34k15L37j89K12Ok94J78o4L54l71M8p3L8k73
1722b68K08j33L09j19k67K66P0k27M9K42J43j55k15L47k08j21m5J35l43J74J97
1743C9k09L34j33j42m2M31l21J94m66L47m3k2P8k35L08k23J85j06l8K31j91K49
$$ plain form
1582 -67 -45 -224 -63 -28 -31 31 91 -20 87 172 85 -155 29 70 161 50 -28 -253 -19 123 -149 -43 -274 129
1606 129 -240 -79 -204 -411 88 81 -2 132 -173 -21 -28 113 131 409 79 315 -227 288 -59 -110 -61 352 -48
1629 -48 103 53 95 170 72 96 111 25 -8 -29 -49 -347 6 304 37 133 38 212 229 111 -122 25 -245 90 -172
1654 -172 -138 -176 -82 95 128 -133 72 44 57 38 126 -87 120 -21 312 98 -229 -60 -48 -42 250 -191 -61 -111
1678 -111 98 -305 18 56 19 154 -164 115 -162 3 -44 309 -27 145 119 -22 185 7 183 70 -159
1699 -159 135 104 -405 -270 -129 64 -6 -96 38 -177 160 -29 183 189 -105 73 9 363 -8 40 -33 5 -268
1722 -268 -60 -193 116 -3 -270 -4 66 -161 -112 130 273 118 -97 250 42 -79 -124 11 -332 -158 39
1743 39 -170 164 31 -111 -153 278 -43 151 -315 32 -11 -33 45 -190 118 -105 80 -26 -64 167 -24 225
1765B25j59k09J76k30J16kO9M14n73j02L60j86k06J04M43k92j43J66j00M9K7J44
1787I1j78J92j99K2J03L7m9l2J1L39l37j08J20k80K95J50j12j44k45L62o9K06
1809A75jm40K24L0R1r9j2j21K06P2j4j37RK74l30n7K61l07J85r3K05L9q1n5k87
1834b63L98k62j4L49r5j63j14J29J27j9k44O8J15J70m8j84K12k40m3J76j65J63
1856E3m5j54K63j64J42K7mq6K4kj38j61J66M0J48j18J5J51m7l69K44m1Q2k37J51
1881f0N1k60M52j2j31RJ04m3Q8J2l03N65l15k63L42k20J93r3k35J33J48n10M18
1904G0N5m58L28o3K48k35J4J83R2q4j97L69n9k25k53L1M73k26m6J69j98J02k38
1927a48K55J83n43L86k21Nj8LM0O9j49K74j3q5O7P8j71q0j13P5j12K46O7l02M82
$$ plain form
1765 225 66 -143 33 -197 -81 -83 -14 400 -173 -275 85 -101 -307 -203 240 -52 -195 -29 -129 -80 -53 91
1787 91 -87 105 -94 -72 31 68 19 -13 -2 337 0 -108 12 -268 27 177 65 -79 -324 38 -31 175
1809 175 174 -266 -42 -12 79 -20 -32 -153 53 125 111 -26 -17 257 -73 -130 131 -176 9 -84 121 160 79 24 -263
1834 -263 135 -127 -141 208 113 -50 -164 -35 92 73 -171 -103 12 182 134 -50 162 -78 -121 55 -110 53
1856 53 8 -146 117 -47 95 122 118 32 56 54 -84 -245 -79 -39 109 -9 6 157 110 -259 -15 -56 26 -211 -60
1881 -60 -9 -269 183 171 40 49 153 110 198 210 -93 472 157 -106 236 16 209 116 -119 14 162 -348 70
1904 70 125 -333 -5 -68 180 -55 -41 142 234 150 -47 322 263 38 -215 -184 289 63 17 186 -12 90 -148
1927 -148 107 290 -253 133 -88 -83 -101 -98 -58 11 -138 136 123 38 105 183 12 -68 -181 -106 -218 28 95 -207 275
1952B75m17p4K08J10r0Nq2J43k45R7J25k23j67L31n2J65J42k31k70M37k61L61
1974B87n18K93k6j2N3k0k00J51r5L19j11l4oJ06k84j04J54k01L64l9j9k21L52
1997A89n44M14k61K23r6J79o1J84k22J19k27o6J35m7r1n9K24j57J83k00J14L69
2019C02l81M36l67J14qo4J64j90j04j34J23K92l2k63J29n8j06j3p0L05j25Nj23
2042a68K34j17J96r6P3l3l7k76J97j36K4O6J41M3k64J88k77L26k78J75K42m17
2064a94J23n8j25K26Q0M9j1n2j00k38L82k64L02l57n0M5K49J1J45L7k85J97l33
2087b21K13N5j42R8K52p6k2j18q6j62J2K23k12K24l14P4J50J18N5j70M9J66k58
2110i2J01L4J09j73K21l21L21l28L8k2P1J74k74J8K68l09J57O7J40k6j97p6L6
$$ plain form
1952 275 -142 -216 -8 102 12 17 -65 78 -167 -70 55 -168 -335 -4 -56 109 251 20 -250 187 -74 287
1974 287 -231 62 36 24 77 57 -143 8 -87 232 121 87 81 187 -97 -201 -47 -248 116 77 58 -163 189
1997 189 -355 59 -202 21 -75 104 43 227 5 124 -103 -169 -34 -81 -172 -231 -7 -164 19 -181 -67 302
2019 302 -79 357 -10 104 96 32 196 6 -98 -232 -109 183 151 -112 17 -41 -147 -160 -230 75 -50 -45 -168
2042 -168 66 -51 145 49 122 89 52 -224 -27 -163 -139 -73 68 111 -153 35 -242 84 -194 -19 223 -194
2064 -194 -71 -129 -254 -28 52 101 90 38 -62 -300 82 -182 120 -237 -287 -242 7 18 163 200 -85 112 -221
2087 -221 -8 47 -95 3 255 179 157 39 -47 -209 -197 26 -186 38 -276 -202 -52 66 121 -49 0 166 -92
2110 -92 9 43 152 -21 200 -121 200 -128 -90 -112 -41 133 -141 -123 145 -164 -7 60 200 174 -23 -99 -63
2133f3J31LL5LJ9k07K34k15O6Q8q2K66k64Kk43J63K82j6k23k60J98J9J23LP2j79
2159d5j12R5K4k39R8PJ58N6j14k8J09j26J06Q9K0O6M9l90K88j2j36J33l08N07
2183B95n40L54o2J7j57M4p3K36j11J89Ol91K04r9M53l66J15j00P1K09n34K32j18
2206a26J26L45l85J77k75L44r9j28m6P0J74j17j53M47m08%J69k97L44k28k7J07
2228A4j82K32mj28q5L7j1OK6m7R9J4l0K27l56K02L1K9J5J01j58R7K61m22Q5j72
2254a19K9Q8M8n8J25k76J37K24k12O2K24j39p4l64K99J90k10J90M7k65k13L73
2276A06k01J64l8J19L1n8j89J32j31J07j41J40j22l6J74j38J74J03k22R3J44k75
2298f4K8j45O7nK73m3k12k58N76l09K16P9k77O7j40N6K89n9k15J68k10K69j38
$$ plain form
2133 -63 68 71 106 109 128 -79 155 -60 6 94 12 278 14 16 -227 -64 218 202 -21 -281 -83 -64 59 62 134 -45
2159 -45 -157 -62 -38 -277 -179 -172 -14 42 -72 -100 9 -117 -11 78 98 164 213 -177 111 99 -37 96 -212 295
2183 295 -245 109 47 64 -93 -49 -122 114 3 192 198 -193 11 -88 365 -1 114 14 85 294 -240 -8 -126
2206 -126 0 345 -40 137 -138 206 107 -21 -67 3 177 60 -93 354 -54 -54 115 -182 162 -66 -93 14
2228 14 -168 64 60 -68 -153 -116 -127 -121 -95 -142 -43 -29 -59 168 -188 14 45 74 89 190 32 129 390 -32 53 -119
2254 -119 -90 -2 46 -12 113 -163 -26 198 -14 48 272 133 59 -305 -6 184 -26 164 211 -54 -267 106
2276 106 -95 69 31 150 181 123 -66 66 -65 42 -99 41 -81 -117 57 -81 93 196 -26 67 211 -64
2298 -64 -36 -181 -114 -119 154 111 -101 -359 217 -92 124 203 -74 -7 -147 -91 198 139 -76 92 -118 151 13
2321A3O9k36J08J48j69J52k42m6K49k64J9J89j76k27K1L70P0K56n59J77J03J79
2343B04j4l50J04l7M4o9L30k74M79k03k27ql5j4K60l19J87o6l5J44j54M0o5P8
2367@n6J38m69M26m2r1Q2K57l36J0q2L49m0j41J77p7k75O1J39qM4L6j05O5j09
2392d7M6k39K42j20j29J59J60l2k96M08k38K81k65j06K11J4J37k12q0J98j43l49
2414d00K81L24m60N68O0k69n6mn7J20l17J88j36K83M8k12M36l77Q8j7J53o7p8
2437I9j21ok35K49j13J7j47K05j75K39O3o8K8O7J40k3m16M47j79j06j18J30q7
2460a10N2K10l16K00n4J43P4k94K49J72k73L77j61j40j1j6N9k93j47K93j24L48
2482B38l83J40j3J94J06l12K28m16L18J9q5J28j94M1m9j4Q3M7o0ko7p9J19N3k89
$$ plain form
2321 13 82 -154 -46 102 -67 85 -157 -203 46 -218 -199 -10 -186 -413 -392 -22 48 304 -255 -78 25 204
2343 204 190 -160 -56 -93 -49 -118 212 -62 417 214 -13 -21 -56 -70 190 -129 58 -8 -43 101 -53 -13 -78 0
2367 0 -56 82 -387 39 -3 -94 -12 245 -91 -81 -163 186 146 5 182 105 -170 -109 30 22 66 102 -3 62 -47
2392 -47 -1 -240 2 -118 -247 -88 72 40 -256 152 -86 195 -70 -176 35 49 186 -26 -106 92 -51 -400
2414 -400 -119 205 -255 313 373 104 48 44 -13 107 -210 -22 -158 125 173 -39 397 20 108 91 244 177 99
2437 99 -22 -28 -263 -14 -127 -110 -257 -52 -227 12 75 7 35 102 242 219 -197 250 71 -35 -153 -23 -110
2460 -110 -58 152 -164 36 -18 125 199 -95 154 326 53 430 269 129 118 102 161 -132 -279 14 -110 238
2482 238 -145 -5 -18 176 282 -30 198 -218 100 119 34 162 -32 9 -40 -54 29 76 16 14 -53 -132 -13 40 -249
2507b49M78l18J01J21P3J25m79M02m22N3O3j28m9L09O7l45K39p8k3J3o8K1On0
2531a38Q3J43pj01P9k04J77K65m85J38Q1m12L10J25k18L20l87P9J17j56L41R9
2553B49j74j55J63j47O9n1K61j11r4j06K43k9j72P4m4K24j44j60J57m1J2O4j77
2576h9K16j13j32Q7J41Q1j29j0J11o8o3k5l6j2r5q1n1J26L09m19L49k15k18O06
2600B70pr6l94J33L0K9n0O2K51q6r2j30O9J49j94r5P6K29k4K9k38p3K05O0k10
2625i7k03N37J58l28r4j00Q2k0k9pJ57j34J89j8k82M38l11J10j01j7K52Q3k10
2648E5l0j62r6L53k98M35j81j13J07K50m64j11K07N0N4N6j75J44l33N07k59M1
2670C7j27L7j0M1o7k29J95K12J77l93J94J51l37j20L13j44j60K10m0j42K25r9
$$ plain form
2507 -249 229 -89 12 133 206 331 -148 254 -168 -115 -52 -180 -229 80 147 -198 41 -37 -60 -47 -115 -94 -88 -138
2531 -138 -55 88 81 -20 59 -145 32 297 -188 -50 31 -381 -71 54 -164 156 -231 -152 -35 -191 150 249
2553 249 75 -80 83 -64 5 -46 215 104 10 -96 147 118 -54 20 -24 200 56 -104 53 12 24 88 -89
2576 -89 127 14 -118 -31 110 191 62 52 163 95 32 7 -29 -41 -136 -217 -268 -142 167 -252 97 -118 -336 270
2600 270 263 167 -227 -94 -64 -35 -85 -23 228 142 50 -80 -11 138 -56 -151 -75 154 130 159 -79 -152 53 113 -97
2625 -97 -300 237 395 67 -27 -127 -45 -65 -94 -101 56 -78 111 93 -189 249 -62 48 -53 -70 182 265 55
2648 55 25 -137 -233 120 -178 257 76 -37 70 320 -144 -255 -48 2 56 112 -63 81 -252 255 -4 37
2670 37 -90 -53 -63 -22 -89 -318 -123 89 266 -127 67 218 -119 -239 74 -70 -230 -20 -60 -202 23 -76
2692g6P3k48L46M1k45K28M9j17J44j82q5K54j75K49k76j39J75m5L7J27j42K0q4
2715g1Q1J42L06n63K43k01L00p0j19Q3p1n5K31k44K25j26M6k54m0M65m23J65j21
2738g1j23J35JJ75o5l10j3M96k50J01R7k23K06l51K72k06J44K73j45L9p5r3l13
2761b99J83M8J05P0j66o7P3n8M15k35N1Ol94K30j65K09O6q0l7K54J3k02K19l01
2785f2J44j7L9k19J58J22o07K10J44K28j4k59K4J01j21J69j30K23M4r4l64K79
2807bR9r9k3K17j09J70n3j84Q1j79K02l18J42K55m70J05J70P1J62l74L9M1L22
2830B65km16K16j43J98J65l07J45m0j05J81m02L63N2j51J76J48l39N2j29K53j29
2852E1N3j31J7J43Pj29Mj26J83j26QP7N9%k00p6J35M3J80L3m59K55l12M50j38
$$ plain form
2692 -76 -3 -251 95 136 -109 119 168 51 195 13 -72 182 7 256 -20 -159 16 -29 8 135 -7 13 -71
2715 -71 10 152 458 -105 138 -63 237 167 48 131 60 5 236 -8 217 91 137 -117 -157 308 -115 50 -71
2738 -71 -194 -59 -58 117 52 -258 -271 225 -25 76 173 -50 156 -195 77 -129 15 288 143 182 107 14 -299
2761 -299 -116 -68 37 107 -59 -126 -53 -111 304 69 120 126 -268 -38 -203 6 72 -8 -45 209 222 20 239 -62
2785 -62 82 65 104 -115 43 165 -442 -232 -88 140 126 -133 -109 -8 -129 40 -90 133 177 83 -281 -2
2807 -2 97 -2 -25 192 83 253 200 16 97 -82 120 -198 -56 199 -271 -166 4 75 237 -137 -98 -57 265
2830 265 263 -153 63 -80 118 283 -24 121 81 -24 157 -245 118 170 19 195 343 4 56 -73 180 51
2852 51 104 -27 -10 133 140 11 15 -111 72 -54 -46 31 90 90 -110 -186 -51 -8 172 205 -254 1 -311 139 1
2877AR4k12N8r6M6K37l56J81J31J13j7l54L63k73l6j0L16k45k0R3j47r6K1K77
2901F9o4J72k41K57j64r0J7J0nK21l1k75j31K92q8K4J01J81l06k82L89o3Q0j8
2925E5P5j56j55M1Q9K7j58Q9OL39l5j50r0J60j67K60j90j89J16O4j28J88j77J20
2949C4j69Q2j03j3J8kK05J07k18pJ31m3j57J7K10j64J78k93K04j2%J16k7m2o4
2974a2PO4j9J47j81j85K21l0n3P9j64J69k69L09l01L32n8j04R2k84K01K9k55K17
2998d8o7K11J90m51N32m61K03l8m3M4p6j27m7L35m26O92l01m6o5o4n1M65m04N7
3022A4K14l12k4j8KJ37j2J80j21J5R8k01J28j06kJ07k89J97M7Q6l11J22J97m35
3046b87L28J47j14R9k58P4J36m59M62j02J19l65K00MK45k51k39J32K45K3k28j87
$$ plain form
2877 1 95 -117 -59 -155 -109 128 -228 -47 84 197 180 -174 189 -84 -120 -130 186 -59 -79 14 -133 -229 -208 69
2901 69 5 177 -64 193 29 -61 -44 -34 -39 182 151 -124 -255 37 -51 -27 74 255 -51 -333 56 -7 73 55
2925 55 130 -26 -181 -140 -51 -24 -182 -93 -87 252 217 67 -23 137 -30 230 40 -149 -33 31 -97 91 -86 34
2949 34 -135 -53 -156 -169 -151 -153 52 159 -59 -66 65 22 -135 -118 92 -72 106 -187 17 5 5 121 94 52 -12
2974 -12 -5 59 40 187 6 -179 42 12 -41 38 -126 43 -226 83 -218 114 56 -48 44 -240 -39 -10 -265 -48
2998 -48 -115 96 286 -165 367 -94 109 71 28 72 -4 -131 -178 157 -269 423 122 76 11 -53 -104 361 -43 14
3022 14 228 -84 -108 -126 -124 13 1 181 60 75 173 -28 100 -6 -8 99 -190 7 54 140 -171 -49 148 -287
3046 -287 41 188 74 173 -85 -11 125 -334 128 26 145 -220 -20 -16 229 -22 -261 -129 116 139 -89 -276
3068b76R9L5P0Nl5J60j1j00P6K23R5o94M51P0J0k79L31l05p9J49K21n7j02J52
3092B09k46j3J7O8j90K04k18j24L63J11k31r1N1K60k58l9L12l48J42J45k94J80
3114A0J66L7m4k18J04j60P4j87Q8N9K29q6L6q2P5k3j24oL2k40JL53M8k84M7N7
3140c8P0j03J51J29J3k93N5jp1L3J8J46j9K3j6k35J04o8K24l88J31L1N0r1J87
3165D2m4K12N6j12m04J3L32k49L77r2o5N0l18L3J46r2k0Q4K08j53J62O5k16J81
3189A96j94J67k23j72K19J23j60j20R4n5J30R2m8J28j98o9J28K92l09K82l04k22
3211b23J35R0j51K9J18r1Q4q7R6K97j19J50p7j15l9P1l20L11k04j20J43J18P5
3234A71k38K76r7r5k23L3R7J20K05j28j63k6J13QJ53l04J43J51m18J46K16l34
$$ plain form
3068 -276 -177 -142 -72 -67 -102 58 47 -53 23 246 341 -353 98 168 178 -101 230 -75 -154 -5 216 159 57 209
3092 209 -37 -50 -33 35 -155 49 -169 -293 70 181 -50 -141 -90 170 -88 -127 185 -163 -21 124 -170 10
3114 10 176 213 169 -49 55 -105 -31 -218 -130 -71 158 72 108 26 101 78 -46 -52 -20 -260 -259 94 142 -142 -95 -38
3140 -38 32 -71 80 209 222 -71 -16 -17 -88 -55 -37 109 90 113 97 -138 -34 -102 122 -266 -135 -104 -54 -145 42
3165 42 -2 210 266 154 -250 -237 95 -154 223 131 66 116 -202 -169 -23 -115 -135 -51 157 4 166 231 15 196
3189 196 2 169 -54 -226 -7 116 -44 -164 -70 -125 5 97 49 177 -21 -90 38 330 21 303 -1 -223
3211 -223 -88 2 -149 -120 -2 -93 -9 -96 0 297 178 328 251 136 97 168 -152 159 -45 -165 -22 96 171
3234 171 -67 209 112 17 -206 -173 -76 44 249 121 -42 -68 45 53 206 -98 45 196 -222 -76 140 -194
3256a94K72m3j58r2R3NN7Q3j29K63J1j13J22l08L71m63J79m1J85p6K2J24O3j23
3280A10k81J22O4j55J07R7J00n2J24o4j89j21K28j2j06J86p3q7Q1J94l91J39J94
3303B15q3J10k06O7q9k5K24k84j53M57j35N2O6j57r2J25N4n8l07J13J56l64J37
3326a77L20j81l90M19n3J02j65N5K45l18o8L40j14j86P6M41j96q8m26M26m2j4
3348FN7m0J25j60j09Qn7N07m06LO3l0rP5o1J13J21m57L24j35K03k10L22m02K81
3373A32r7m4l14L16J30j22K0K34m13M37l72Jm2J30j14J90Q1p3p0j67M25m96K5
3396b03K27R0j40M3j3J66r8j60j6J92k59P9L41j04m05L94j22Rj17L3O5J2M5k63
3420b04J40N3j04J59m1k8n3M9K44j85J71k42K08k10m0l0J87m18M52j55R8j25j81
$$ plain form
3256 -194 78 35 -123 -215 -122 -117 -60 23 -106 157 168 55 177 -131 240 -223 -44 -85 100 24 46 170 233 110
3280 110 -171 -49 15 -140 -33 64 164 112 236 172 -17 -138 90 78 -28 158 85 -2 79 273 -118 21 215
3303 215 132 242 36 103 14 -11 213 -71 -224 233 98 150 216 59 -33 92 146 88 -219 -106 50 -314 -177
3326 -177 143 -38 -428 -9 -62 40 -125 -70 175 -143 -211 129 15 -171 -95 346 150 62 -364 62 20 6
3348 6 63 23 148 -12 -121 -113 -170 337 -69 -66 -3 -33 -42 33 -28 85 206 -251 73 -62 141 -69 253 -149 132
3373 132 35 -9 -323 -7 123 1 21 255 -158 279 -93 -92 -134 -4 -118 72 153 80 10 -157 268 -228 -203
3396 -203 24 114 -26 17 4 170 72 -88 -104 88 -171 -92 249 145 -260 134 12 21 -96 -63 2 14 59 -204
3420 -204 -64 -11 -115 44 3 -25 -78 -29 215 30 201 -41 167 -43 -83 -113 74 -344 108 -47 51 -74 -255
3443b55L79l42L36j46J00o4M3j09J04j28Q8j06j9J57k09K82N3k86m5L42j63Q6
3465I8o7Nk49N07k22l55R1J30K10o2k77p9M85j91j96J77q5J73j2q3p6J31r9j40
3489a86R4K88j00p2k7j0j8J8k5J3L48m44J19M1k44Q9O3K79n6l19R5R9j99J76k0
3514BK6q8L7K03K0j23j5j75Lp9M30l43q3L10l63N5n2L16l45K20J97j28kK5n6J94
3540A86j98R5n1k5MK66j85r8J02o7J7j36P4m53K72P9R2J05k01L70m17J95j47L71
3564B50k36l1J02k63M9J59m8j74J66J79P2P6l12j16J28K9m7K01j85R6J46l30q7
3587a76K24j94K26j17O3K08j73q2K31j70o1o3J8R1j33J06o5L5N7Q5r4q1Q0j62
3611a47K71l10L24l4P1k46J2J16j34J53K00k50j45M43n08J12m5J7j07K60j94L41
$$ plain form
3443 -255 124 -218 118 -28 72 8 51 -58 46 -82 6 -100 -119 38 -171 111 164 -122 -167 175 12 98
3465 98 31 36 -213 294 72 -283 -192 -62 148 86 -191 -270 215 24 -172 5 -80 93 81 -2 -78 53 -46 -186
3489 -186 -92 196 96 24 -3 -13 -31 -13 -38 -25 323 -121 -2 39 -205 -116 -53 226 170 -149 -54 45 -154 22 2
3514 2 28 -60 -23 180 200 77 62 -113 -110 -189 241 -102 -185 125 -238 -183 -235 81 -264 -44 153 25 23 48 -8 186
3540 186 -12 83 32 7 11 277 92 -6 96 29 46 -90 -16 -469 -197 -118 -26 79 -122 248 -169 26 -121 250
3564 250 14 -17 85 -178 -129 30 -18 -192 -26 153 225 301 -11 -127 1 30 -17 184 -1 95 241 -89 -176
3587 -176 48 -146 80 -37 26 234 61 -21 210 40 -21 -84 -66 25 -108 -2 -67 -32 25 110 16 -65 15 -147
3611 -147 124 -186 138 104 175 -71 -59 57 -77 76 276 26 -119 324 -184 -72 -117 -100 -207 53 -141 200
3633B00k06l27R5K11K35n07M65j13n7Ok00J00K36j89Q6J30n35N91n22J58J30J69
3655A56k8j24K3k43J26J8j9LJ77j90K0J1R8k83M02k37R0j05nK07k09J22J03J79
3679B92n84N6K45p6J23j43j23K12j57J00m9O7l3N9r6L55J02l09N0j25o2q5J88
3702Gj05K00l24K08j74J41j9p3j4J53J06k67K4L53Q7k00k34N7J45j53qJ97o5j27
3726h5P4j51K1K58l32L63n7J02j57k19K74J5m39M99r4k4j2k82J29K52N7m26J26
3749a08J68j80Q8J08j61J43l8j67J79J8r0R6p1L0j29J74q8J83n73N31q2k20L80
3772A91k80K3L6r9K41l7l47K89N0ok0P5o2L8j29P4J46l73j22L67j75K68p4k10
3796a36J82k66K28k55J59Q2p5J34o1J54J7j91J03K6J24j33j09L4J67l2j95j7O9
$$ plain form
3633 200 -6 -333 -238 -27 208 -299 166 53 -4 2 -198 -98 138 -51 35 165 -370 221 -301 -143 -13 156
3655 156 128 4 27 -216 -90 -72 -91 -88 89 -101 -81 -70 28 -255 147 -90 0 -105 -110 97 -112 10 113 292
3679 292 -292 -236 9 -67 56 -87 -210 2 -155 -55 -104 -37 -70 -11 -107 248 350 41 91 -34 -96 -181 7
3702 7 -98 102 -222 -14 -188 -47 -66 -139 -153 0 106 -161 -137 216 303 103 -131 -74 71 -82 -90 107 42 -85
3726 -85 -11 -162 -141 117 -215 148 91 193 36 -183 91 106 -333 166 72 48 36 -246 -117 135 192 -234 -108
3749 -108 60 -120 -32 76 -85 58 20 -147 32 50 -40 56 -15 15 -114 60 -28 155 -418 113 31 -189 191
3772 191 -89 -66 -30 -129 112 75 -272 17 67 61 41 116 54 92 -37 37 183 -190 -312 55 -120 148 74 -136
3796 -136 46 -220 8 -247 -88 -6 -81 53 -8 146 163 -28 75 101 225 92 -17 17 184 152 -43 -60 9
3819Ij93J99k03K07O0j93K22k42J81P9j02j03P2J99l71L84k84J17M4j7Kl9N3P5
3843A56O4j56j40J80K00k66j18K50k76J11j9k68K10L23l33J38j17l49M13o8K27
3864A62k90L35l01R4J7J11P1o0m0k45n3K26mP8j12J04l83K78M2nR8k89mL83j96
3889A7r1L28l68K70j81k0K5j2q7L38K6k97Q6j64k11O12l58J47J5j33K70p2r8M1
3913H3o0k03M4K64j28j69q1K16K78j33k14P9J6j36L74m47N64m19J72l56N09l55
3935a02m7l1J94ok01L25L4o5K39l83Q6J96l59J25K0l6P2l5mj62L40k98K88p3m3
3960G4k28J94j61J86k47o3L90l94M19O2l44R2q6j46K25M36m57J07l80K28q7L28
3982A48j31k4R4j53j37K33p7J34Pp5K3j53r0Q7OL39l30oK9R5m7j43J40Q7mj23
$$ plain form
3819 9 -184 15 -188 19 79 -114 108 -134 47 126 24 -79 -7 192 -179 205 -79 38 82 65 67 28 81 156
3843 156 220 64 -76 104 304 38 -80 170 -106 5 -14 -282 -72 251 -82 56 -61 -410 3 -65 162
3864 162 -128 207 -94 0 17 128 199 139 99 -146 -199 27 23 101 -11 93 -290 -12 30 25 123 -166 -170 213 17
3889 17 -74 254 -114 156 -25 -45 -20 -32 -119 219 245 -52 34 -130 -341 271 -87 60 75 -58 212 140 42 83
3913 83 23 -180 -136 128 0 -169 -250 -34 244 111 -103 -24 -8 -144 230 -217 347 -72 100 -256 253 -102
3935 -102 -149 -180 14 8 -193 132 166 101 340 -43 43 239 -120 5 25 -11 61 26 22 -140 200 -98 190 117 74
3960 74 -154 40 -121 65 -182 -245 145 -249 170 232 -112 -20 -106 -252 -27 409 -48 59 -321 -93 -180 148
3982 148 17 -7 87 -66 -203 30 -47 87 94 19 42 -111 -201 -114 -108 231 -99 -105 -76 19 -28 -171 -31 56 52 -71
4008g1o9O7J06K13m92M13j20m0L7j09L15J7j91k59P0K32k01J80P3k36J17r9J52
4031A05J15k56J38j09l07J05J48J61j47j99J71J39j41j55K00o3P3q2j7L00j55
4052B4j23mK70j52n0K29j19R7k13L0LJ59R7m14L39j42j8L14n09K03J44p0k9j25
4076e9j61J80N1pN2k3j49n9L28m0R8j89p6J89k6l33j6L47J0j61j90K92l0j16Q1
4101gjr1j7K24j81o1k18M30J5l35K42O4k51K1N80m20O1k82L05J88q5j27L0q4J16
4126A16l06N7K2p1K36l10K80q9J28Rj63K99l09P5j20J55K9p8K34m17J20j38J58
4149h3N9L4O7j83J36J0J87k96k8J62qk62L04j4l16J80Kn2K30l04K24l61M12k22
4173a22oQ4l8J64k21J67J88k90j67J95j53J12j16L22q3o8j80L55o3k25J95q2Q9
$$ plain form
4008 -71 -140 -73 33 246 -246 167 47 7 44 -65 250 267 76 -183 -113 119 -82 98 171 -65 52 -47 105
4031 105 220 -36 102 -7 -314 -209 -61 100 -47 -246 -75 64 -77 -232 -32 -95 -22 -104 -121 179 24
4052 24 -99 -103 167 15 -35 194 75 172 -41 -11 -8 151 248 -166 173 31 13 327 -182 21 165 95 66 -59
4076 -59 -220 -40 11 4 56 33 -116 -175 153 113 211 22 -54 135 109 -224 -240 107 117 -44 -234 58 28 -88 -7
4101 -7 -8 -99 -116 108 -73 -134 -352 78 93 -242 0 64 -187 -166 414 -6 55 -227 78 266 181 54 84 0 116
4126 116 -190 -133 -111 -182 54 -256 24 -65 63 72 -91 208 -101 -26 -146 9 38 -40 194 -223 -103 -241 -83
4149 -83 -24 10 77 -106 30 40 227 -69 -97 65 57 -205 99 85 -231 -51 -49 -101 129 -175 49 -312 100 -122
4173 -122 -128 -44 -82 82 -139 28 216 -74 -241 -46 -199 -87 -203 119 36 -32 -212 143 80 -145 50 -32 57
4196E7Q0K9n3q8M2r8j11L65l40J49M1J6M1L0k54o2r3L36j23J98n3J36l37R4M8
4221E0l0k2n1m%k5K97k29k2K87l56J15j01J07o9R6J44j33K0L9l11N2J08J68k53
4246a23K64k28kJ85J4p9J09j44j05N8KJ12j0r7K31j80j3K3k36J76j17L59j15k19
4270a35QP9Q5q7K4R5k03J34l8j17o8%K68l76P5J51K37q3j51L7n5K21q6l2l2Q8
4296C9m5j58J04K9r0J60K1o4J10m22L91M4l61MK44J04o6j51K60k43M64k10k79
4319a15N9O0R6r0J24j55q5R6j95L93j09k19j23M51k7r3J06o4q3lj91L66k19J64
4343A44k36L06l80J82J07K2q9J4M5j26N5P9k74RK61q8n5K26J4j84R9k10J47J1
$$ plain form
4196 57 137 166 113 25 67 -31 -142 223 -117 32 73 89 130 160 -94 -156 -249 87 -36 162 109 245 -92 2 50
4221 50 20 -2 -53 -57 -57 -82 215 -14 -36 251 -105 10 -91 16 -53 43 187 54 74 113 -198 -146 -38 130 -123
4246 -123 141 -87 -89 96 110 31 140 -4 -109 -51 -49 63 53 -44 187 7 -6 17 -219 -43 -160 199 84 -135
4270 -135 -127 -48 37 -50 -26 69 -134 0 -38 -155 -223 -223 45 -331 -256 -105 132 49 -102 -65 -120 101 15 -17 -49 39
4296 39 -6 -164 -60 -31 -121 39 60 -4 106 -316 75 119 -242 -238 6 110 44 -107 153 -90 374 164 -115
4319 -115 -56 4 100 10 134 -21 -106 -10 -205 188 79 -140 -263 188 161 68 174 110 27 24 -167 199 -20 144
4343 144 -92 214 -166 16 123 145 56 70 115 -11 44 123 -151 -142 119 31 -24 202 216 32 131 -79 68 79
$$ [...]
8191a13
##END NTUPLES=NMR FID
##END=
