##TITLE=1H_Pr TI-3
 200.13MHz, CDCl3,
 8 sc
 
 28.8.2025
##JCAMPDX= 6.0         $$ Bruker NMR JCAMP-DX V2.0
##DATA TYPE= NMR FID
##DATA CLASS= NTUPLES
##ORIGIN= UXNMR, Bruker Analytische Messtechnik GmbH
##OWNER= pz
$$ XWIN-NMR		Version 3.5
$$ Thu Aug 28 15:37:02 2025 Russian Standard Time (UT+4h)  she@DPX200
##.OBSERVE FREQUENCY= 200.1313
##.OBSERVE NUCLEUS= ^1H
##.DELAY= (6, 6)
##.ACQUISITION MODE= SIMULTANEOUS
##.ACQUISITION SCHEME= undefined
##.AVERAGES= 8
##.DIGITISER RES= 18
##SPECTROMETER/DATA SYSTEM= spect
##.PULSE SEQUENCE= zg30
##.SOLVENT NAME= D2O
##.SHIFT REFERENCE= (INTERNAL, D2O, 0, 14.3821)
##AUDIT TRAIL= $$ (NUMBER, WHEN, WHO, WHERE, WHAT)
$$ ##TITLE= Audit trail, XWIN-NMR		Version 3.5
$$ ##JCAMPDX= 5.01
$$ ##ORIGIN= Bruker BioSpin GmbH
$$ ##OWNER= she
$$ F:/spectra/data/she/nmr/H-C/1/audita.txt
$$ ##AUDIT TRAIL=  $$ (NUMBER, WHEN, WHO, WHERE, WHAT)
(   1,<2025-08-28 15:35:26.14 +0400>,<she>,<DPX200>,
      <created by zg, POWCHK disabled, PULCHK disabled
       configuration hash MD5:
       00 E9 B6 7A A2 85 ED C7 34 08 36 98 17 FE 4E 26
       data hash MD5: 16K
       39 74 09 FC 02 C5 10 7E 92 FA DD F3 FF B9 F0 F9>)
$$ ##END=
$$ 
$$ hash MD5
$$ 8F A8 E6 14 DF 3D 51 6D F7 B5 55 33 BA 17 C6 67
##$RELAX= 
##$RELAX= 
##$RELAX= 
##$RELAX= 
##$RELAX= 
##$RELAX= 
$$ Bruker specific parameters
$$ --------------------------
##$DU= <F:/spectra>
##$EXPNO= 1
##$NAME= <H-C>
##$PROCNO= 1
##$TYPE= <nmr>
##$USER= <she>
##$AMP= (0..31)
100 100 100 100 100 100 100 100 100 100 100 100 100 100 100 100 100 100 
100 100 100 100 100 100 100 100 100 100 100 100 100 100 
##$AQSEQ= 0
##$AQ_mod= 1
##$AUNM= <au_zg>
##$AUTOPOS= <>
##$BF1= 200.13
##$BF2= 200.13
##$BF3= 200.13
##$BF4= 200.13
##$BF5= 200.13
##$BF6= 200.13
##$BF7= 200.13
##$BF8= 200.13
##$BYTORDA= 1
##$CFDGTYP= 0
##$CFRGTYP= 5
##$CHEMSTR= <none>
##$CNST= (0..31)
1 1 145 1 1 1 1 1 1 1 1 1 1 1 1 1 1 1 1 1 1 1 1 1 1 1 1 1 1 1 1 1 
##$CPDPRG= <>
##$CPDPRG1= <>
##$CPDPRG2= <>
##$CPDPRG3= <>
##$CPDPRG4= <mlev>
##$CPDPRG5= <mlev>
##$CPDPRG6= <mlev>
##$CPDPRG7= <mlev>
##$CPDPRG8= <mlev>
##$CPDPRGB= <>
##$CPDPRGT= <>
##$D= (0..31)
0 0.7 0 0 0 0 0 0 0 0 0 0.03 0 0 0 0 0 0 0 0 0 0 0 0 0 0 0 0 0 0 0 0 
##$DATE= 1756380925
##$DBL= (0..7)
120 120 120 120 120 120 120 120 
##$DBP= (0..7)
150 150 150 150 150 150 150 150 
##$DBP07= 0
##$DBPNAM0= <>
##$DBPNAM1= <>
##$DBPNAM2= <>
##$DBPNAM3= <>
##$DBPNAM4= <>
##$DBPNAM5= <>
##$DBPNAM6= <>
##$DBPNAM7= <>
##$DBPOAL= (0..7)
0.5 0.5 0.5 0.5 0.5 0.5 0.5 0.5 
##$DBPOFFS= (0..7)
0 0 0 0 0 0 0 0 
##$DE= 6
##$DECBNUC= <off>
##$DECIM= 32
##$DECNUC= <off>
##$DECSTAT= 4
##$DIGMOD= 1
##$DIGTYP= 9
##$DL= (0..7)
0 120 120 120 120 120 120 120 
##$DP= (0..7)
150 150 150 150 150 150 150 150 
##$DP07= 0
##$DPNAME0= <>
##$DPNAME1= <>
##$DPNAME2= <>
##$DPNAME3= <>
##$DPNAME4= <>
##$DPNAME5= <>
##$DPNAME6= <>
##$DPNAME7= <>
##$DPOAL= (0..7)
0.5 0.5 0.5 0.5 0.5 0.5 0.5 0.5 
##$DPOFFS= (0..7)
0 0 0 0 0 0 0 0 
##$DQDMODE= 0
##$DR= 18
##$DS= 0
##$DSLIST= <SSSSSSSSSSSSSSS>
##$DSPFIRM= 0
$$ [...]
##$SUBNAM0= <"">
##$SUBNAM1= <"">
##$SUBNAM2= <"">
##$SUBNAM3= <"">
##$SUBNAM4= <"">
##$SUBNAM5= <"">
##$SUBNAM6= <"">
##$SUBNAM7= <"">
##$SUBNAM8= <"">
##$SUBNAM9= <"">
##$SW= 18.0517328524113
##$SWIBOX= (0..15)
0 0 2 0 0 0 0 0 0 0 0 0 0 0 0 0 
##$SW_h= 3612.71676300578
##$TD= 16384
##$TD0= 1
##$TE= 0
##$TE2= 300
##$TE3= 300
##$TEG= 300
##$TL= (0..7)
0 120 120 120 120 120 120 120 
##$TP= (0..7)
150 150 150 150 150 150 150 150 
##$TP07= 0
##$TPNAME0= <>
##$TPNAME1= <>
##$TPNAME2= <>
##$TPNAME3= <>
##$TPNAME4= <>
##$TPNAME5= <>
##$TPNAME6= <>
##$TPNAME7= <>
##$TPOAL= (0..7)
0.5 0.5 0.5 0.5 0.5 0.5 0.5 0.5 
##$TPOFFS= (0..7)
0 0 0 0 0 0 0 0 
##$TUNHIN= 0
##$TUNHOUT= 0
##$TUNXOUT= 0
##$USERA1= <user>
##$USERA2= <user>
##$USERA3= <user>
##$USERA4= <user>
##$USERA5= <user>
##$V9= 5
##$VALIST= <valist>
##$VCLIST= <CCCCCCCCCCCCCCC>
##$VD= 0
##$VDLIST= <DDDDDDDDDDDDDDD>
##$VPLIST= <PPPPPPPPPPPPPPP>
##$VTLIST= <TTTTTTTTTTTTTTT>
##$WBST= 1024
##$WBSW= 4
##$XGAIN= (0..3)
0 0 0 0 
##$XL= 0
##$YL= 0
##$YMAX_a= 44383
##$YMIN_a= -60235
##$ZGOPTNS= <>
##$ZL1= 120
##$ZL2= 120
##$ZL3= 120
##$ZL4= 120
##$ABSF1= 10
##$ABSF2= 0
##$ABSG= 5
##$ABSL= 3
##$ALPHA= 0
##$AQORDER= 0
##$ASSFAC= 0
##$ASSFACI= 0
##$ASSFACX= 0
##$ASSWID= 0
##$AUNMP= <proc_1d>
##$AZFE= 0.1
##$AZFW= 0.1
##$BCFW= 1
##$BC_mod= 2
##$BYTORDP= 1
##$COROFFS= 0
##$CY= -3
##$DATMOD= 1
##$DC= 2
##$DFILT= <>
##$DTYPP= 0
##$F1P= 0
##$F2P= 0
##$FCOR= 0.5
##$FTSIZE= 0
##$FT_mod= 4
##$GAMMA= 1
##$GB= 0.15
##$INTBC= 1
##$INTSCL= 1
##$ISEN= 128
##$LB= 0.25
##$LEV0= 0
##$LPBIN= 0
##$MAXI= 10000
##$MC2= 0
##$MEAN= 0
##$ME_mod= 0
##$MI= 1.114404
##$NCOEF= 0
##$NC_proc= 0
##$NLEV= 6
##$NOISF1= 3.799351
##$NOISF2= 2.8
##$NSP= 1
##$NTH_PI= 0
##$NZP= 0
##$OFFSET= 14.38212
##$PC= 1
##$PHC0= -1473.183
##$PHC1= 13.19228
##$PH_mod= 1
##$PKNL= yes
##$PPARMOD= 0
##$PSCAL= 0
##$PSIGN= 0
##$REVERSE= no
##$SF= 200.129724274929
##$SI= 16384
##$SIGF1= 3
##$SIGF2= 2
##$SINO= 400
##$SIOLD= 16384
##$SREGLST= <1H.CDCl3>
##$SSB= 0
##$STSI= 0
##$STSR= 0
##$SW_p= 3205.1282051282
##$SYMM= 0
##$S_DEV= 0
##$TDeff= 0
##$TDoff= 0
##$TI= <>
##$TILT= no
##$TM1= 0
##$TM2= 0
##$TOPLEV= 0
##$USERP1= <user>
##$USERP2= <user>
##$USERP3= <user>
##$USERP4= <user>
##$USERP5= <user>
##$WDW= 1
##$XDIM= 8192
##$YMAX_p= 0
##$YMIN_p= 0
$$ End of Bruker specific parameters
$$ ---------------------------------
##NTUPLES= NMR FID
##VAR_NAME=  TIME,          FID/REAL,        FID/IMAG
##SYMBOL=    X,             R,               I
##VAR_TYPE=  INDEPENDENT,   DEPENDENT,       DEPENDENT
##VAR_FORM=  AFFN,          ASDF,            ASDF
##VAR_DIM=   8192,          8192,            8192
##UNITS=     SECONDS,       ARBITRARY UNITS, ARBITRARY UNITS
##FACTOR=    0.0002768,     1,               1
##FIRST=     0,             0,               0
##LAST=      2.2672688,     0,               0
##MIN=       0,             -60235,          0
##MAX=       2.2672688,     44383,           0
$$ Real data points
##PAGE= N=1
##DATA TABLE= (X++(R..R)), XYDATA
0@%%%%%%%%%%%%%%%%%%qJ6j6J6j6J6k4L2l2M0m8M8n6O4p2Q8r6J04j20J36j52J68
$$ 0 0 0 0 0 0 0 0 0 0 0 0 0 0 0 0 0 0 0 -8 8 -8 8 -8 8 -16 16 -16 24 -24 24 -32 32 -40 48 -48 56 -64 72 -80 88
40H8j90K14k34K58k88L20l52L86m26M72n20N71o29O96p68Q48r41J045j166J309
$$ 88 -102 112 -122 136 -152 168 -184 202 -224 248 -272 299 -330 366 -402 446 -495 550 -616 693
60F93j478J682j937K264k697L309m242N858r423L1629k2133n5992M9161L4731
$$ 693 -785 897 -1040 1224 -1473 1836 -2406 3452 -5971 25658 3525 -52467 -3306 31425
74C1425j8989k3453J4359k650j1357J2138J8472j7782j2691K0006J0129l0933
$$ 31425 12436 -11017 3342 692 -10665 1473 19945 2163 -10528 9478 19607 -11326
86a1326j3503L1772K3673k4535k6835Q413K2717O556n331j1632j2410K057J8783
$$ -11326 -24829 6943 30616 6081 -20754 -12341 10376 16932 11601 -31 -12441 -10384 8399
99H399N924j5807p836J3068M921j2681l051J4090M333j1319o754K106O33M609
$$ 8399 14323 -1484 -9320 3748 8669 -4012 -7063 7027 11360 41 -6713 -4607 -3974 635
113F35J1305j93j7837r593J4136J6361m414j6128n610Q337P498j570k998J564
$$ 635 11940 11747 -6090 -15683 -1547 14814 10400 -5728 -11338 -3001 4497 2927 -71 1493
127A493o94n157P53O840o76o358K943N613q348q729J2971J6682r976k1848R11
$$ 1493 799 -4358 -3605 3235 2559 -3799 -856 4757 -3591 -12320 651 17333 7357 -14491 -13580
142a3580J8132N474r478n889J276J213K304L994j573n963P01O206j714q267J680
$$ -13580 4552 10026 548 -5341 -4065 -2852 -548 3446 1873 -4090 -3389 2817 1103 -7164 -5484
157e484J1392J692j1843o145Q679R279k103q082m772K151P004L873n275o580K825
$$ -5484 5908 7600 -4243 -10388 -1709 7570 5467 -2615 -7387 -5236 1768 5641 366 -6214 -3389
172c389O610j653n761J528N703m63n584k128L512M589J041l576m393L09M656K752
$$ -3389 3221 1568 -4193 -2665 3038 2575 -3009 -5137 -1625 2964 4005 429 -3964 -3655 1001 3753
188C753k654m353l05L871K304k893k704K838L039l154l772L040M487j953m108
$$ 3753 1099 -3254 -3559 312 2616 -277 -2981 -143 2896 -258 -4030 -990 3497 1544 -2564
203b564P56K626R3r0Q47j638k552J496L403j082l315Q23K887j082k653J634K995
$$ -2564 -1808 818 911 821 1668 30 -2522 -1026 2377 1295 -2020 -1197 1690 608 -2045 -411 2584
220B584j568l172J106K843q19j801J236J044j810m91K384L56k630n62J990O3j389
$$ 2584 1016 -2156 -1050 1793 974 -827 409 1453 -357 -848 1536 1892 -738 -1300 690 753 -636
237f36P26J185j480j272J728J504j361j368R06R61n84m54N45L93k41l52l03o4
$$ -636 90 1275 -205 -1477 251 1755 394 -974 -68 893 309 -145 400 793 552 200 -103 -167
255a67N63P11p36j614J16J992Q23j758j422J083J468m28r41K11M60j84n8K29k22
$$ -167 396 1107 371 -1243 -1127 865 1688 -70 -1492 -409 1059 631 -310 -99 361 177 119 348 126
274A26j48P42J91j496q63J707J554j442k240O09K293J47j723m24J160L37p86m
$$ 126 -22 720 911 -585 -1448 259 1813 371 -1869 -1260 1033 1180 -543 -967 193 530 -256 -260
292b60O98j28m95K57K73n51j38R53J75j434p36J374J099r73j232N40J014k06o53
$$ -260 438 310 -185 72 345 -206 -344 609 784 -650 -1386 -12 1087 114 -1118 -578 436 230 -423
311d23L25M66k97m00K67L91q0j92L1q0k00O3K87k3l82j88J54K09J29n6k08q8K18
$$ -423 -98 368 71 -329 -62 329 249 57 88 8 -192 -129 158 135 -247 -435 -281 -72 57 1 -207 -295 -77
334g7J96m5l6J51j29k27J74M34k02o16J43O17k40p53J97P92o1q78p9Q68K45o23
$$ -77 119 74 38 189 60 -167 7 441 239 -377 -234 383 143 -610 -413 379 318 -560 -639 229 474 -149
356a49k15M70J28k67J39L09l30m86M66O58n63q79M21Q88l43r40J49Q49K4o09j45
$$ -149 -364 106 234 -33 106 415 85 -401 65 723 160 -719 -298 590 247 -693 -544 305 329 -280 -425
377d25M21J81p4Mk7j62l0M44J80m43n57K73O91o8p97j71O29K91m08l69J41L41
$$ -425 -4 177 103 107 80 -82 -112 332 512 69 -488 -215 476 408 -389 -560 69 360 -48 -417 -276 65
399F5J89j01k65j13K59L43j9l17l23J28O06J88q33o67P09Q73m04r82N3P10K24
$$ 65 254 153 -112 -225 34 377 358 41 -282 -154 452 640 -193 -860 -151 722 318 -664 -611 99 323
420C23l14k90JK81M01l7m89l38L65P49O4r24p06P85J100m09j463P4J251K89q86
$$ 323 9 -281 -280 1 402 365 -124 -462 -97 652 716 -208 -914 -129 971 562 -901 -827 424 713 -173
441a73m42L27L25K64Q1m51m71M18Q11j46q97l31Q29R18n12j464j23J475O27j134
$$ -173 -615 -288 37 301 382 -69 -540 -122 689 543 -354 -685 144 1062 550 -914 -1037 438 1065 -69
461f9r15O38P57k11l35j07PL05M06j48n92k20N16O66j01j014n02J136R95j213
$$ -69 -984 -346 411 200 -135 -242 -235 70 476 328 -264 -484 32 698 597 -417 -919 217 1212 -1
481aj402R06J565n04j266K08O46k64j3O56j56q73J26R34k0q92j83Q57N48p76j009
$$ -1 -1403 -497 1068 564 -702 -494 152 -112 -125 531 375 -498 -372 562 542 -350 -533 324 872 96 -913
502i13L06J157J14r47l91N15L85n7j46k24k09L68N03km38m26MO79N48p37r74Q80
$$ -913 -607 550 664 -283 -674 -159 226 169 23 -201 -410 -42 461 459 21 -405 -401 278 826 89 -885 -5
524eJ160j160j514J150J697o97j500K37P55j65J08N07l83q33K44J021M5r17m27
$$ -5 1155 -5 -1519 -369 1328 631 -869 -632 123 -42 66 573 190 -643 -399 622 667 -250 -677
543f77P64P33o18j026M03J197l21j379R9J374K36q86l96K11O3L73M93j35o89l55
$$ -677 87 820 202 -824 -421 776 455 -924 -825 549 785 -101 -497 -286 -223 150 643 508 -181 -536
563e36K86N78K16m34l79L45K12p29j65R63M13r56n92O16N04j79j46K6j93pK35
$$ -536 -250 328 544 110 -269 76 288 -441 -606 357 770 -186 -778 -162 342 163 17 43 -150 -157 78
584G8K69Q7l43o38P1R26K70q25l12N32j66n25N01Q00m11p32N8K63nL35L54l52
$$ 78 347 434 91 -547 -476 450 720 -105 -417 115 -51 -576 -75 725 314 -418 -360 -97 -102 233 587 235
606B35n51o7L16M47K09n49o50L81P21l37n57L37M04n89l79P41N17m97n64J50L13
$$ 235 -316 -383 -67 380 589 40 -610 -229 492 155 -402 -65 339 -250 -629 112 629 132 -432 -282 31
627C1N8J61K24l04o90k0Q07M02o51l85M07K1o23K47R35j41r37j0N93n5q1M14j96
$$ 31 89 250 474 170 -520 -540 267 669 18 -367 40 61 -562 -315 620 479 -458 -468 125 70 -11 403 207
650B07p44L14P84k47o51L22L05n16j74P08J17o37j67K89r7K8N59N7p86l57P08
$$ 207 -537 -223 561 314 -337 -15 290 -226 -400 308 425 -212 -379 -90 -187 -159 400 457 -329 -686 22
671B2N15m00l47L01J14m33o4N37J30m59k06L10pk44K94L50n09m86N26N44l40l93
$$ 22 537 137 -210 91 205 -228 -292 245 375 -84 -290 20 13 -231 63 413 -96 -582 -56 488 148 -245
693b45J81J56j76J24K54j76k40L1L3j7J75P8k80j39J95j2r1K47J11k85k59L28
$$ -245 -64 92 -84 40 294 118 -122 -91 -58 -75 100 178 -102 -241 -46 -58 -149 98 209 -76 -335 -7
715gK59j31j23O3j9j28J18K00j52k97P9K23L5j62m7J56j7j82K1J88P4o1j28n5
$$ -7 252 121 -2 61 42 -86 32 232 80 -217 -138 85 120 -42 -89 67 50 -132 -111 77 151 90 -38 -93
739i3Q1J45R2k24j59J38J24q8j7L7j26q5K08P1k55m9L21M5l68J3M16K2l39j24
$$ -93 -12 133 225 1 -158 -20 104 16 -1 36 -90 -175 33 104 -151 -200 121 166 -202 -189 227 249 -90 -214
763b14L17Q9j65o9O8l6r8J14J30j50j09O6J36l8j35K8J55l7j50L7J45Q3j32j40
$$ -214 103 192 27 -42 26 -10 -108 6 136 -14 -123 -57 79 41 -94 -66 89 52 -98 -61 84 167 35 -105
787a05Q1J45n0j08RO2j08l0J14P2j41j02R0J40o5o7J09M1r5o8J11J02q2r1J1L8
$$ -105 -24 121 71 -37 -28 34 -74 -104 10 82 -59 -161 -71 69 4 -63 46 87 -8 -76 35 137 55 -36 -25 13
813A3OJ1pom9n8J1J34J3j23n9J18J01r0n5P5Q5j19j19J68J22j95o9O0K6p3J6J72
$$ 13 19 30 23 17 -32 -90 -79 55 68 -55 -114 4 105 15 -40 35 120 1 -118 50 172 -23 -92 -32 -6 -79 -63 109
841A09r8j65J8K23L0j56k8J21L5r0k1Q1J6n5m7PM3Rj6l7j2Ok1M9O9q4j26J05J29
$$ 109 11 -154 -136 87 117 -39 -67 54 89 -1 -22 59 75 20 -27 -20 23 32 16 -21 -33 -27 -48 1 70 -14 -140 -35 94
870I4k4j31L9R1l0j01L7J31m7j39M8O9m7o1M6M6o8o0P6J14k2j05l9J33L3r2L0
$$ 94 70 -61 -22 69 39 -62 -25 106 59 -80 -32 37 -10 -71 -25 21 -47 -107 -31 83 61 -44 -83 50 83 -9 21
897B1%K3n7J4N7Lq2k9P0Mp1k5N0N6o7q9J26Q8r9p1O4J08p3o1Q3J4j24J7R2j6o7
$$ 21 21 44 -13 1 58 61 -21 -50 20 24 -47 -72 -22 34 -33 -122 4 92 -7 -78 -14 94 21 -40 43 57 -67 -50 42 26 -41
928d1k0P1J5o1l6N4Q2p0o0L4J27k9r7J7P6j0m1LN1j08n5J27K6m9q4L2RO0n8l7
$$ -41 -61 10 25 -36 -72 -18 64 -6 -66 -32 95 66 -31 -14 62 52 11 14 65 -43 -98 29 55 6 -78 -46 -37 23 -35 -72
958g2R4N7j27o5J28O2j16qJ25m2j17K9J10l8p8L6O7m2k8l5M6M8J2j12Q6Q1n9j06
$$ -72 22 79 -48 -113 15 77 -39 -47 78 36 -81 -52 58 20 -58 -22 45 3 -25 -60 -14 34 46 -66 20 101 42 -64
986f4P9P1p6p8J21N6j54jL2O2q1m7N2K6m0RrR4J2r2k6J33k8j56Q2J51p3j43N1
$$ -64 15 86 10 -68 53 109 -45 -46 -14 48 -33 -80 -28 -2 -42 -33 -42 52 64 -28 -54 79 51 -105 -23 128 55 -88 -37
1015c7R4o2o2L8M8J6o5k2J1Q7k6o3R4M7j29o2J55O7j43m0J59Nj95k3J25L5p5k8
$$ -37 57 -5 -67 -29 19 35 -30 -52 -41 46 20 -43 51 98 -31 -93 62 129 -14 -54 105 110 -85 -108 17 52 -23 -51
1043e1M3j2mk1KN1K9p4L9O5m8j04J03J14j00j03P8O9j08l4O2M9m9L4m6k5P8j5
$$ -51 -8 -20 -24 -45 -43 8 37 -37 2 67 19 -85 18 132 32 -71 7 76 -32 -66 -4 45 -4 30 -16 -41 37 22
1071B2m4N3M2p0l9P4J9q7k1J29l7j23J5O3N5j11O5qlj3m2L3N4L0r1L2M6n4o0J33
$$ 22 -22 31 73 3 -36 38 57 -30 -51 78 41 -82 -67 -4 51 -60 5 -3 -6 -19 -61 -28 26 56 -35 -3 43 -11 -71 62
1101F2L1j14k1J04Oj30L5N8l8j7J6nm4L0K5j1J4O5m8j9K9k8m9N7P6m2j31N1M6
$$ 62 93 -21 -42 62 68 -62 -27 31 -7 -24 -8 -13 -57 -27 -2 -13 1 66 18 -1 28 0 -49 8 84 42 -89 -38 8
1130Hk4j6L3j5k7K7jkML7k1K7Ql8k1J15p2n5K3O5m2o3L4J8m8K3L6j8J2qm0J5L8
$$ 8 -16 -32 1 -14 -41 -14 -15 -17 -13 24 3 30 38 0 -21 94 22 -33 -10 55 13 -50 -16 2 -46 -23 13 -5 7 -1 -41 -26 12
1163A2j1l2K9L7p3J7M0J2o7k4P5J4p8J5K9J8m3QK5J6j8j9L8L3qk3nM0p1qM7K8
$$ 12 1 -31 -2 35 -38 -21 19 31 -36 -60 15 29 -49 -34 -5 13 -30 -22 3 19 1 -18 20 53 45 22 17 57 -14 -22 25 53
1195E3m4n5L7K0k2k0M8j2k8oK2K9Mm8kN8ro5lN4j4l5K0N8m5k8MK3k0K1K6oj0j1
$$ 53 9 -46 -9 11 -11 -31 17 5 -23 -29 -7 22 26 -22 -24 34 25 -40 -43 11 -3 -38 -18 40 -5 -33 -29 -6 -26 -5 21 15 5 -6
1229fJ3J5K7m7Jj5M9k9m7O5jk2l4J9M2p6j3O0J9p0MP4pm9mN4Jm3qL2kqLl3L5k0
$$ -6 7 22 49 2 3 -12 37 8 -39 26 25 3 -31 -12 30 -46 -59 1 20 -50 -46 28 21 -28 -32 22 23 -20 -28 4 2 -6 -3 -36 -1 -21
1265b1J7jJ2l5L3mJ4lj4mJ0J6j6k7N8K5n1pRL4p9j2P1j3q2O2J9j8l2J6M8l5l8
$$ -21 -4 -5 7 -28 5 1 15 12 -2 -6 4 20 4 -23 35 60 9 2 11 45 -34 -46 25 12 -70 -8 11 -7 -39 -23 25 -10 -48
1298d8L4L9j8k9K3OJj7k0L0QJ5k5nJ7j9J6j1K7Ql4pN2rl6L3J3k7m7M2L9o1lj1
$$ -48 -14 25 7 -22 1 7 8 -9 -29 1 9 24 -1 -6 11 -8 8 -3 24 32 -2 -9 43 34 -2 31 44 17 -30 12 51 -10 -13 -24
1332b4L4l0k2N1qJ9m3K3lnPLK7j7j7OK5l2lj8L7J3n6L0K1On2J0K8lj1KN4m3l8
$$ -24 10 -20 -42 9 1 20 -23 0 -3 -8 -1 2 29 12 -5 1 26 -6 -9 -27 10 23 -33 -3 18 24 -28 -18 10 7 -4 -2 52 9 -29
1367b9M9pRl0k1M2Qn2K1K0m0rPN8n6K1k9L2rMj9M7RpJjJ8l3j1K1K6j3l0K7J1o2
$$ -29 20 13 22 -8 -29 13 21 -31 -10 10 -30 -39 -32 26 -30 -9 -38 -6 -15 -11 -30 17 26 19 20 19 37 4 -7 14 40 27 -3 24 35 -27
1403b7J6L9Qo3k5N9lMLkoJ1k5L5JMm3jK5Km8L7Mj1k8RK9k6JM0LNjm0K2K4l2j0
$$ -27 -11 28 36 -27 -52 7 4 8 11 9 3 14 -11 24 25 29 -14 -15 10 12 -36 1 5 -6 -34 -25 4 -22 -21 19 22 27 26 -14 8 32 0 -10
1441a0N7k9m1oK8nl5L7Rk1k1J8K8k5Oj4K8J9j0j6J0Mk5j7M8j0j6j9L5K5k7l4L0
$$ -10 47 18 -23 -29 -1 -6 -41 -4 5 -16 -37 -19 9 -16 -10 -24 4 23 13 -3 7 11 -14 -31 17 7 -9 -28 7 32 5 -29 1
1474AK5m4K3L1k0mPrK3l3K3j4L4m2j3K4k0J9o1M5L4n0%L2L3p1J4K6Nm0L5k5mM0
$$ 1 26 -18 5 36 16 12 19 10 33 0 23 9 43 1 -12 12 -8 11 -50 -5 29 -21 -21 11 44 -27 -13 13 18 -22 13 -12 -16 24
1508B4j3Kk4K1n9NM8K0k7j0L1k2l4N8J9rl4j1N1k5jQqkNq5N1N6l9oJ8K5o2j6M4
$$ 24 11 13 -11 10 -49 -44 4 24 -3 -13 18 -4 -38 20 39 30 -4 -15 36 11 10 18 10 8 13 -72 -21 35 -4 -10 8 33 -29 -45 -1
1543aK2n5kQ3l8rj4mJN2l1QJ7m0l9N4N1m3m2K2M3m0j6K5M4ppkk1j3k2OL5Rj9k7
$$ -1 21 -34 -36 47 9 0 -14 -18 -17 35 4 12 29 -11 -50 4 55 12 -30 -8 35 -5 -21 4 48 41 34 32 11 -2 -24 -18 17 26 7 -20
1579b0JL3l3RM3ko7jM8l3k9L3L9ol3K8j5j1J3j1J9J0j3k6K9J4j3j0K3Ol9l4R8
$$ -20 -19 14 -19 -10 33 31 -36 -37 11 -22 -51 -18 21 15 -18 10 -5 -16 -3 -14 5 15 2 -24 5 19 6 -4 19 25 -14 -48 50
1612E0j0l7OK7o1OJ5oK4Km5J4K4Kn1J4M5l3l2M4L5n0k5M5J6k2PK0k9mLPK3L3n7
$$ 50 40 3 9 36 -25 -19 -4 -10 14 16 -29 -15 9 11 -40 -26 19 -14 -46 -2 33 -17 -42 3 19 -3 4 24 -5 -9 -6 1 24 57 0
1647@l5Q0k7ml2L7Pn0OK3j2j0N7Mp7L2NmPKPk3K5p0lN5Mj7KM6J4o8J6K7Pl6JL7
$$ 0 -35 45 18 14 -18 19 26 -24 -18 5 -7 -17 40 44 -33 -1 4 0 7 9 16 -7 18 -52 -55 0 4 -13 -11 35 49 -19 -3 24 31 -5 -4 33
1685C3l5NJ7m0L9j8J5l2M5J0n7K2K2j8j8J1L3n0J1J0Jl5J2J8J1j8J2rpL3l8LR
$$ 33 -2 3 20 -20 19 1 16 -16 29 39 -18 4 26 8 -10 1 34 -16 -5 5 6 -29 -17 1 12 -6 6 -3 -10 23 -15 -12 -3
1718ck9J6j2K3K8m7NO2l9J2OkKnl4K8nj3K1j0J6l2nJ7J1k8nj6N3l3pJ9Qk6J7N
$$ -3 -32 -16 -28 -5 23 -24 -19 43 4 16 22 20 22 17 -17 11 6 -7 14 4 20 -12 -17 0 11 -17 -22 -38 15 -18 -25 -6 2 -24 -7 -2
1754b%j4%OJ7ok9M8j8mj0%J4pj5K4L7J3q8M4kj6L1j8mnl4L1RJk4QJ0Mj8LL7j7
$$ -2 -2 -16 -16 -10 7 1 -28 20 2 -2 -12 -12 2 -5 -20 4 41 54 -34 10 8 -8 23 5 1 -4 -38 -7 2 3 -21 -13 -3 1 -17 -14 23 6
1792Fj7JJ8Qk7PJ9j6j8k9J8K7k4K0JK7k2k1L8j0Lj0K2j5RnkOk0NK4Jl8OK0j6Q
$$ 6 -11 -10 8 16 -11 -4 15 -1 -19 -48 -30 -3 -27 -7 -6 21 -1 -22 16 6 9 -1 21 6 15 10 8 14 -6 -1 23 24 -14 -8 12 -4 4
1829Dm0N8j3l1k9N6j2j8k6L2M0k0k4%J5J6j7JJ9l5JkL8k5j2J9L5j4l3M8nLk4l2
$$ 4 -36 22 9 -22 -51 5 -7 -25 -51 -19 21 1 -23 -23 -8 8 -9 -8 11 -24 -23 -25 13 -12 -24 -5 30 16 -17 31 26 29 5 -27
1863b7K7J0j3lL6Pk5n5L3mj2RJ8j9NJ6j3K6n1J4K8Nj1k2K7Qj8QJ1j9mMJ2J3om6
$$ -27 0 10 -3 -6 30 37 12 -43 -10 -14 -26 -17 1 -18 -13 3 -10 16 -35 -21 7 12 1 -21 6 14 -4 4 15 -4 -8 -4 8 21 15 -31
1899c1L2J0j8OMK5j9j5j0K7rj7J0K0m9K1kLpj6L8J3J2l2j1J5Km8K0L8ok8M3l4
$$ -31 1 11 -7 -1 3 28 9 -6 -16 11 2 -15 -5 15 -34 -13 -15 -12 -19 -35 3 16 28 -4 -15 0 2 -46 -26 12 6 -22 21 -13
1933a3L9j7NPnk0Jk0M9o3K8K8k2J8k7J5Ppk6K2koOJ3qJ0m2O0n0PJ6j4JOj3JK6
$$ -13 26 9 14 21 16 -4 -3 -23 26 -37 -9 19 -3 15 -12 3 10 3 -23 -1 -3 -9 -3 10 2 12 -30 30 -20 -13 3 -11 -10 -4 -17 -16 10
1970A0j3j6PK0L3n9K6J7pj3K1Rk5LqJ1m3M9j3j6MKrJ8K4o9J7L5J9o5j7O5%m2j
$$ 10 -3 -19 -12 8 41 -18 8 25 18 5 26 35 10 13 5 16 -27 22 9 -7 -3 -1 -10 8 32 -37 -20 15 34 -31 -48 17 17 -25 -26
2005b6M7o0M3j4JpQj6L8Lll2M2Pk9POJ5l6J0%K0mm2K8ll9PQM5j2l9J1NK6k7JJ9
$$ -26 21 -39 4 -10 -9 -16 -8 -24 14 17 14 -18 24 31 2 9 15 30 -6 4 4 24 20 -22 6 3 -36 -29 -21 24 12 -27 -16 -11 15 -12 -11 8
2043HKll0J5j1nj4M3Nj1nj7J3L1j8pK3k5LJ1M3m7rM0l8NpK0j2Orj6J0K5l9k6K3
$$ 8 10 7 -23 -8 -19 -24 -38 5 10 -1 -6 -23 -10 21 3 -4 19 -6 -3 8 51 4 -5 35 -3 2 -5 15 3 9 0 -16 -6 19 -20 -46 -23
2080b3J0qK0J2j6j8%N0k0m6J7J3k1J7ML3m5L4j8JJ5j0j1M0j3k0K9J3k0l9L5K1
$$ -23 -13 -21 -1 11 -5 -23 -23 27 7 -39 -22 -9 -30 -13 -9 24 -21 13 -5 -4 11 1 -10 30 17 -3 26 39 19 -20 15 36
2112C6k5njJ8k0nK1Pl1Ml0JJ2mQmJ3oK0j0nJ4l2K2KoNJ4j1k5O7n5JJ6lJ8kj5j1
$$ 36 11 6 5 23 3 -2 19 26 -5 -1 -31 -30 -18 -22 -14 -18 -5 -11 9 -1 -6 8 -24 -2 0 -6 -1 13 2 -23 44 -11 -10 6 3 21 19 4 -7
2151gPK0k3JK4l4L8k3j5K4l6J0j6RJ6l4K1mk4J9jJ8K7%l8K8mRj4K0k9Oj5L3j8
$$ -7 0 20 -3 -2 22 -12 26 3 -12 12 -24 -14 -30 -21 -5 -39 -18 -22 -46 -27 -28 -10 17 17 -21 7 3 12 -2 18 -11 -5 -20 13 -5
2186enJ2J8m8O7k3J7k5k2%L1ql1qL6j1Ql3L2Nm7L0rQk5L4j7J9k3J6J2k9nJ2J4
$$ -5 -10 2 20 -28 39 16 33 8 -14 -14 17 9 -22 -30 6 -5 3 -30 2 7 -40 -10 -19 -11 -36 -2 -19 0 -23 -7 5 -24 -29 -17 -3
2221cKqJ2mj1QK1Jj0%ok3N7l4Ql0K1oJMjJ%j4K1Nm8J2L1k8JKJ3k1L1%Kj1rK0k2
$$ -3 -1 -9 3 -1 -12 -4 17 18 8 8 2 -21 36 2 10 -20 1 -5 -4 0 -1 0 0 -14 7 12 -36 -24 7 -21 -20 -18 -5 -26 5 5 7 -4 -13 7 -15
2262a5Qj0kK8l0NJ2j4K5qL1j8mjk4M8m5l2L0pl6Q0k5LPj0k5J8j0L7l1J6J4l3j2
$$ -15 -7 -17 -19 9 -21 -16 -4 -18 7 -1 30 12 8 7 -17 31 -14 -46 -16 -23 -59 21 -4 -1 6 -4 -29 -11 -21 16 -15 1 15 -18 -30
2297c0J4nj0KJ2J6Lpj6K9J0k2j9M8k7j7L5j2J3qOnpj5K2K5n4K2k%j5K9ok1K4j2
$$ -30 -16 -21 -31 -29 -17 -1 2 -5 -21 8 18 -4 -23 25 -2 -19 16 4 17 9 15 10 3 -12 10 35 -19 3 1 1 -14 15 9 -12 12 0
2333@Ooj6jJ2l4M4l8K9rL0m7J0J6j5J2J4j8K0j5J8%%j6K6k2j9J4KL0k8J4pj7K7
$$ 0 6 0 -16 -17 -5 -39 5 -33 -4 -13 17 -30 -20 -4 -19 -7 7 -11 9 -6 12 12 12 -4 22 0 -19 -5 -3 27 -1 13 6 -11 16
2368A6j5m2P5l7k3K5jk1K7m2L3j1KKK3j5%K3nk4K3Jl1pJ6J2rJ1pk2QJ9qoL8k3
$$ 16 1 -41 34 -3 -26 -1 -2 -23 4 -38 -5 -16 -14 -12 11 -4 -4 19 14 -10 13 14 -17 -24 -8 4 -5 6 -1 -23 -15 4 -4 -10 28 5
2404El2J0nK8k8J4j3J6j9K4orQJ6l2K1K6rj4Lk3j3J7K8K2l2J0j1lK2j4K2j7Km
$$ 5 -27 -17 -22 6 -22 -8 -21 -5 -24 0 -6 -15 -7 9 -23 -2 24 15 1 4 -19 -32 -15 13 35 3 13 2 -1 21 7 29 12 14 10
2439A0j1L1k8J4K7m5J0j2J5%oj5RK3l4pLJ1j7LQjlrJJ5lnPJ3j0J2lj2J2PKK3k7
$$ 10 -1 30 2 16 43 -2 8 -4 11 11 5 -10 -1 22 -12 -19 -16 -5 -22 -19 -11 -12 -15 -24 -23 -8 -11 -16 -9 4 -6 6 3 -9 3 10 12 35 8
2478Hk4J9LK0Pj4lk4K9j9mJ8l2J1JOk0K0pj7OJ6mnJ7j7qK3k9J2JJ2pJ7l3K3k9
$$ 8 -16 3 6 26 33 19 16 -8 21 2 -2 16 -16 -5 -4 2 -18 2 -5 -22 -16 0 -4 -9 8 -9 -17 6 -23 -11 -10 2 -5 12 -21 2 -27
2515b7K2J2Qj1k2K2J2k0KJ0J9l2O%rJ6j1J1Mpk0K1k8Ok1L4pj3oL0lN%J2j4l8J3
$$ -27 -5 7 15 4 -18 4 16 -4 -2 8 27 -5 1 1 -8 8 -3 8 12 5 -15 6 -22 -16 -37 -3 -10 -23 -29 1 -2 3 3 15 1 -37 -24
2552b4K2j3j5K0j4K8j1k9M8k6M3m3L9Mj8j6J0K1J3m7J2j0K0rl3K3J6Jmj7qK6m7
$$ -24 -2 -15 -30 -10 -24 4 -7 -36 12 -14 29 -14 25 29 11 -5 5 26 39 -8 4 -6 14 5 -28 -5 11 12 8 -9 -17 9 -38
2585c8M1j0J6m9KK8k9J5j1L3J6n5M8j0jRJj7J8oJ3k3mL8k7KL4l3rJ4k5J5Kpk2
$$ -38 3 -7 9 -40 -38 -10 -39 -24 -35 -2 14 -41 7 -3 -4 5 6 -11 7 1 14 -9 -13 25 -2 0 34 1 -8 6 -19 -4 -2 -9 -31
2620c1J3K2Kl2K0jrpL2l5K9j1NqJ9k2K8j6J2k7K5pK1J0j6mrK9l4QJ5k7M0m3MJ2
$$ -31 -18 4 6 -26 -6 -7 -16 -23 9 -26 3 -8 -3 -11 8 -14 14 -2 10 -17 8 1 22 32 16 12 3 32 -2 6 21 -6 34 -9 -5 7
2656Gk9L2k4J8Kj4K8m0Nk6L4%nJ3oJRk7J7lJ3nj9LK1jK0j8Lk5K2k4J6M0k7k2K7
$$ 7 -22 10 -14 4 6 -8 20 -20 -15 -41 -7 -7 -12 1 -5 -4 5 -22 -5 -8 5 0 -19 -16 5 4 24 6 9 -16 6 -18 -2 38 11 -11 16
2693A6k2K0k2J9rpL3m1k0K1LJ2k2jL4l0pL9l2j0J4KK5j7qK0k2pM3l6J4L4m1OK
$$ 16 -6 14 -8 11 2 -5 28 -13 -33 -12 -9 3 -19 -20 14 -16 -23 16 -16 -26 -12 -10 15 -2 -10 10 -12 -19 24 -12 2 36 -5 1 3
2728CL3k9l2L6Plj4Nk6M3j0l3L5m8L2jJ8jl8M5m5k0K0M5l0lj0L1prj1M6rk5J3
$$ 3 36 7 -25 11 18 15 1 6 -20 23 13 -20 15 -33 -1 -2 16 15 -23 22 -23 -43 -23 22 -8 -11 -21 10 3 -6 -17 29 20 -5 8
2763HQkJ6ro%ll0rL8j0PPk3K2Qk9K6kl2L3rJ2k2oj8M3m0K4J6nOk6MJ2Kpk4K7j7
$$ 8 16 14 30 21 15 15 12 -18 -27 11 1 8 15 -8 14 22 -7 19 17 -15 18 9 21 -1 -7 -25 18 -22 2 18 13 19 -7 -3 9 11 4 -20 7 -10
2803a0MjJ4Nk0M1j5l3J0J0J7k1k3M8onk4OJ0qoK8m0K7j7k1M4l3oJ4J7k1j5%L9
$$ -10 -6 -7 7 12 -8 33 18 -15 -5 5 22 1 -22 26 20 15 -9 -3 7 -1 -7 21 -19 8 -9 -30 14 -19 -25 -11 6 -15 -30 -30 9
2838Ioj1K0Pm2M5rj2qK9l4J8mOlNL5m2J4k5J5j6J0QKk5jK7Kk1j3L1l5L2k2J3k9
$$ 9 3 -8 12 19 -23 22 13 1 -7 22 -12 6 2 8 5 10 45 3 17 -8 7 -9 1 9 11 -14 -15 12 14 -7 -20 11 -24 8 -14 -1 -30
2875c0K7j2J0K1qj2K8l5J3k0JRK6j6K1k3M3k8j4J8l5L3k1J6MK8k7J5k1oj6K4k5
$$ -30 -3 -15 -5 16 8 -4 24 -11 2 -18 -17 -8 18 2 23 0 43 15 1 19 -16 17 -4 12 16 44 17 32 11 5 -11 13 -12
2908a2oK5lj5k1K9J3rj0J0j1K1k8j9NJ7KrL9j9lnjL4j6jrL1j5k2L9k3j3L4J6k8
$$ -12 -18 7 4 -11 -32 -3 10 1 -9 1 -10 11 -17 -36 -31 -14 -12 -21 18 -1 -4 -9 -10 24 8 7 -2 29 14 -8 31 8 -5 29 45 17
2944A7j1kPMpJ3lJ8n1J8qj8NJ0m2M7Pm4M6j3j0LK0J1k8J1PJ1mj4J1%j7%J1PMM
$$ 17 6 4 11 15 8 21 18 36 -15 3 -5 -23 -18 -8 -50 -3 4 -40 6 -7 -17 -14 6 17 -11 0 7 18 14 0 11 11 -6 -6 5 12 16 20
2982B0Kmklk0RJ3Jj5Kpj0K0j0%okj6K7Ql3J8J5k3J1K2ok9K8Rrj1J9mlj6L9j7o
$$ 20 22 18 16 13 -7 2 15 16 1 3 -4 -14 6 -4 -4 -10 -12 -28 -1 7 -26 -8 7 -16 -5 17 11 -18 10 19 10 -1 18 14 11 -5 34 17 11
3021A1lj2nK5MPj7NJ5k8J0Kj4oK7k3LrK3nol0M5jl3J1jlJ7j8jJ9Jj2mM0j7%oJ7
$$ 11 8 -4 -9 16 20 27 10 15 30 2 12 14 0 -6 21 -2 1 -8 15 10 4 -26 19 18 -15 -4 -5 -8 9 -9 -10 9 10 -2 -6 34 17 17 11 28
3061B8j6rNj4%J5qK9l3j7K5LLPk5Qj0K6l2NKj4J5K0j7oqQ%K4ll7K2K1n5N4J1k9
$$ 28 12 3 8 -6 -6 9 1 30 -3 -20 5 8 11 18 -7 1 -9 17 -15 -10 -8 -22 -7 13 -4 -10 -18 -10 -10 14 11 -26 -4 17 -38 16 27 -2
3099bj3L7k2nK5k3J4k1K5l0K5k6k4MP2m6Qj0J8j3RJoK2l4jLL1k7OmKL3m0mJ1j
$$ -2 -15 22 0 -5 20 -3 11 -10 15 -15 10 -16 -40 -36 36 -10 -2 -12 6 -7 2 3 -3 19 -15 -16 -13 18 -9 -3 -7 -5 28 -12 -16 -5 -6
3136fJ8l4Nj3J6K1Rj3jL3j0k6oK3J3l0K7k5j3PJ0J7j3onKj0joJ6oK5l3MJ4k2K4
$$ -6 12 -22 -17 -30 -14 7 16 3 2 35 25 -1 -7 16 29 -1 26 1 -12 -5 5 22 9 3 -2 0 -10 -11 -17 -1 -7 18 -15 -11 3 -19 5
3173Ej0Nn4K2J3nL1j0j4L3Ol1QK9j8QmK6l2K5l3%J4Omk5J0j0%OoJ7j9kK2j6J1
$$ 5 -5 0 -54 -32 -19 -24 7 -3 -17 16 22 -9 -1 28 10 18 14 40 8 33 0 0 14 20 16 -9 1 -9 -9 -3 -9 8 -11 -13 9 -7 4
3210DpJ7j7Rj3LLJ5mk7J5k0J8J8k5lJ8J4K1l1k4L2jJ0n0L8j9k3N1k7j2K3j8Pj8
$$ 4 -3 14 -3 6 -7 -4 -1 14 10 -17 -2 -22 -4 14 -11 -14 4 18 39 8 -16 16 15 25 -25 13 -6 -29 22 -5 -17 6 -12 -5 -23
3245b3jj5L9jLk2L6n0M8m8%K0j0oN4l8RkK0pj9QJ3j1qL1j6J5j1Lj3K1j3l2J7M2
$$ -23 -24 -39 0 -1 2 -20 16 -34 14 -34 -34 -14 -24 -30 24 -14 -5 -7 13 6 -13 -5 8 -3 -11 20 4 19 8 11 -2 19 6 -26 -9 33
3281C3l7j6J2L3l8JMNolj5%LOK4L6n8J0K6k6kJ0K1l2K6olK0j3J9j7Jjj5j4J1K5
$$ 33 -4 -20 -8 25 -13 -12 -8 -3 -9 -12 -27 -27 -24 -18 6 42 -16 -6 20 -6 -8 2 23 -9 17 11 8 28 15 34 17 18 17 2 -12 -1 24
3318B4o4K8K2j5j3K0j0Mnl1K9j5K2kPj0j5J1K2k2k3L6kJ0l3J2J6mNkQk7L0k7L8
$$ 24 -40 -12 10 -5 -18 2 -8 -4 -9 -40 -11 -26 -4 -6 1 -9 -24 -13 9 -13 -36 0 -2 8 -25 -13 3 -1 4 2 10 -17 13 -14 24
3353B4M3n3Kj3J4J2m7LJ3k7M1%%k2k6M4Kk3kKORK9m7kK1j8j9J9J4ljJj3K9j8j3
$$ 24 67 14 16 3 17 29 -18 -15 -2 -29 12 12 12 -10 -36 8 10 -13 -15 -13 -7 2 31 -16 -18 3 -15 -34 -15 -1 -4 -5 -4 -17 12 -6 -19
3390a9K0JMjkQMJKl6K0J2l2J9Rj1Lj2L3K6q3K9oRL4l4ok1M3k0mmRK4j0m9M1mK
$$ -19 1 2 6 5 3 11 15 16 18 -18 2 14 -18 1 10 -1 2 -10 23 49 -34 -5 -11 -2 32 -2 -8 -29 14 -6 -10 -14 -5 19 9 -40 1 -3 -1
3429apK4J0m4O2n6L8Nk2J3k2K2kj9Qj0j1K0j7kL1j2l0J8j3J9j0%j1OJ4j5oK8J2
$$ -1 -8 16 26 -18 44 -12 26 31 9 22 0 22 20 1 9 -1 -12 8 -9 -11 20 8 -22 -4 -17 2 -8 -8 -19 -13 1 -14 -20 8 20
3464B0%l8j%L5k9K2Nk9J9NJ9l0K4l0L9J0Km3oJ9m9L3kJkmJok6J0L1J0mopKJ5j1
$$ 20 20 -18 -19 -19 16 -13 9 14 -15 4 9 28 -2 22 -8 31 41 43 0 -6 13 -36 -3 -5 -4 -6 -10 -9 -15 -41 -31 0 10 6 0 -7 -5 10 -1
3503aoK6j0j4k3K9lolJ0J9Rj3k4kPK5J1j9qK0k4J7Kk1K4l3J1k1L3J2k0qqk6N2
$$ -1 -7 19 9 -5 -28 1 -2 -8 -11 -1 18 27 14 -10 -12 -5 20 31 12 4 24 0 17 19 -2 22 -11 0 -21 12 24 4 -4 -12 -38 14
3539A4j0j1j8K4Mk7K2L3m7RJ2m1K5NjJ3rK1k0j1M7Jm1J2J6l8L8k4J3J4Nl7JK2
$$ 14 4 -7 -25 -1 3 -24 -2 31 -16 -7 5 -36 -11 -6 -7 6 -3 18 -2 -13 34 35 -6 6 22 -16 22 -2 11 25 30 -7 -6 16
3573A6mrk0L5j5l4J4K1j1j5qK5Lk5M3l7jK6nojJ3n5P8l5L5nj6mlj1K1j8kLK5j7
$$ 16 12 3 -17 18 3 -31 -17 4 -7 -22 -30 -5 -2 -27 16 -21 -22 4 -1 -7 -8 5 -50 28 -7 28 23 7 3 0 -11 10 -8 -10 -7 18 1
3610AqK2jj9Pk6N1l4J4lk8j0M1m0RLK0Jj4kJ9k8J7M1k5K3n4K8j8K5k0J2opJ2l
$$ 1 -7 15 14 -5 2 -24 27 -7 7 4 -24 -34 7 -33 -24 -21 -1 0 -14 -16 3 -25 -8 33 8 31 -23 5 -13 12 -8 4 -2 -9 3 0
3646@nK2j0J7l3jL2l6QKK3nj6ojkJ0j7jK4j1l2L7j5j3qJL7nj5MM6m4J8J4j6PL
$$ 0 -5 17 7 24 -9 -10 22 -14 -6 -4 19 14 -2 -8 -9 -11 -1 -18 -19 5 -6 -38 -1 -16 -29 -37 -36 1 -4 -19 -15 31 -13 5 19 3 10 13
3684A3pJ7j6J8k2J9j7j4J0k2J5KNl9O1n1K9k3mkQmJ8j1%LmJ4j3Kk%Jj3L9k5rQ
$$ 13 6 23 7 25 3 22 5 -9 1 -21 -6 -4 1 -38 23 -28 1 -22 -26 -28 -20 -24 -6 -17 -17 -14 -18 -4 -17 -15 -17 -17 -16 -29 10 -15 -24 -16
3722a6K4J6k4K1n6L6K3j7K7l4K1j0J5k8nOL2l6kK4m4M0j6qj8QK6k9j9K7J3mQP
$$ -16 8 24 0 21 -35 1 24 7 34 0 21 11 26 -2 -7 -1 31 -5 -7 17 -27 13 -3 -11 -29 -21 5 -24 -43 -16 -3 -7 1 8
3756Hrj7j1J0K7j4J7J0j2nj3L5q4L8K3JK2k0Nj7pOJ3mk6K4PoJ0k0Nk4j6J1J5O
$$ 8 -1 -18 -29 -19 8 -6 11 21 9 4 -9 26 -58 -20 3 4 26 6 11 -6 -13 -7 6 2 -24 0 7 1 11 -9 -4 -28 -44 -33 -18 -12
3792a2l%Pj3JN9l6j7RJ7o2M2J6rkJ6mJMjqJMoJ0kK0k0J0On3J5Qj1K2j5Kj2jlp
$$ -12 -15 -15 -8 -21 -20 39 3 -14 -5 12 -50 -8 8 -1 -3 13 9 10 14 13 5 6 10 4 14 12 32 12 22 28 -25 -10 -2 -13 9 -6 -4 -16 -17 -20 -27
3833b7K9J1k8J4Ok9PK8j7j4JL3j4lJ3JmK9j8mk1J0RKNrjj0j5M1l1L0k1j4K0Rl5
$$ -27 2 13 -15 -1 5 -24 -17 11 -6 -20 -19 14 0 -3 10 11 7 36 18 14 -7 3 12 14 19 10 9 -1 -16 25 -6 24 3 -11 9 18 -17
3870a7k4K0J6j3JK2Jmk9L9j7K0j7K3k2qjJ6mj0J2j0M3k1MkqK8k9qJ0k3K5rj4j7
$$ -17 -41 -21 -5 -18 -17 5 6 2 -27 12 -5 15 -2 21 -1 -9 -10 6 2 -8 4 -6 37 16 20 18 10 38 9 1 11 -12 13 4 -10 -27
3906b7L2j1kj1krL1j3pJ3n1L2M3l3J2J2j3j6k3O3l2Qk0L7j9J6k5J5L0j1k2K0j7
$$ -27 5 -6 -8 -19 -21 -30 1 -12 -19 -6 -57 -25 18 -15 -3 9 -4 -20 -43 20 -12 -4 -24 13 -6 10 -15 0 30 19 -3 17 0
3939@q%PK1j3k9L5j6j5OL5j3Kk3OOl2JL8k4K4j2rJ1rj1K7oJ4pmJ9k8j0J2J3Nk
$$ 0 -8 -8 -1 20 7 -22 13 -3 -18 -12 23 10 12 -11 -5 1 -31 -30 8 -16 8 -4 -13 -2 -11 -22 5 -1 13 6 2 21 -7 -17 -5 8 13 11
3977A1nJ5J6k9J2k7J0Lj1Mj7LJ2Jnj3Qj7J9j4K5j0Qk7J7%J9Ll1OmJ6lj2J2NKQ
$$ 11 6 21 37 8 20 -7 3 6 -5 -1 -18 -15 -3 -2 -7 -20 -12 -29 -10 -24 1 -9 -1 -28 -11 -11 8 11 -20 -14 -18 -2 -5 -17 -5 0 2 10
4015A0Rk7LJ4j3LJ1qLJ3m5L4J9l6j0K9k3J7LmpNpk5J8j4J1kLK8k6L7j6l1J9j8
$$ 10 19 -8 -5 9 -4 -1 10 2 5 18 -27 7 26 -10 -20 9 -14 3 6 2 -5 0 -7 -32 -14 -28 -17 -19 -16 12 -14 23 7 -24 -5 -23
4051b3K7Oj5j1RjK5pj1oL3k3l0L6k4L3j6J3qj2Nk2L9m4ONolL3k6K4m4L2jj2PL
$$ -23 4 10 -5 -16 -7 -8 17 10 -1 -7 26 3 -27 9 -15 18 2 15 7 -5 0 -22 17 -27 -21 -16 -22 -25 8 -18 6 -38 -6 -7 -19 -12 -9
4088imoPNk4J4J2k6K5J0k6M6m0K2oJL0l0K6n0J9Pk5L5%k0oj0J2j3M4n3M4j9pP
$$ -9 -13 -19 -12 -7 -31 -17 -5 -31 -6 4 -22 24 -16 6 0 1 31 1 27 -23 -4 3 -22 13 13 -7 -13 -23 -11 -24 20 -33 11 -8 -15 -8
4124hk7RK4mJ5rl3K0%QJ5k7J8Nj4K4Lk2K2rl2J7J2%K0k0Qj1nJ4j6j2K1%jj8j8
$$ -8 -35 -26 -2 -6 9 0 -33 -13 -13 -5 10 -17 1 6 -8 16 19 -3 19 10 -22 -5 7 7 27 7 15 4 -1 13 -3 -15 6 6 5 -13 -31
4161c1j1K1J8k1L3m4lM5j0j8ROjj4K6o4M7J9qJ3J9j5k7%K3j0K0j3oJ4j0Nl0lK1
$$ -31 -42 -21 -3 -24 9 -35 -38 7 -3 -21 -12 -6 -7 -21 5 -59 -12 7 -1 12 31 16 -11 -11 12 2 22 9 3 17 7 12 -18 -21 0
4196@J5nnl8L2j9K7l5J5J1lj1kLj8L8j5QroJ5j1K2ok5J1L6rOj6K7j1Lj1l6K1K
$$ 0 15 10 5 -33 -1 -20 7 -28 -13 -2 -5 -16 -18 -15 -33 5 -10 -2 -11 -17 -2 -13 9 3 -22 -11 25 16 22 6 33 22 25 14 -22 -1 1
4233AK3m4J9J6J0m2L1nnqJ0m1J7k5N1j2oJ0k9R%NKL0Nl7Qk%jKJ8j1OrJ8l7M2O
$$ 1 24 -20 -1 15 25 -17 14 9 4 -4 6 -35 -18 -43 8 -4 -10 0 -29 -20 -20 -15 -13 17 22 -15 -7 -9 -9 -10 -8 10 -1 5 -4 14 -23 19 25
4272B5m0J8j2K5l3PL3k6oj3%lK1jj4Pj0K1k7M4k9k6P0k9k1nQOK4j1jJ0Nrj5J1
$$ 25 -15 3 -9 16 -17 -10 23 -3 -9 -22 -22 -25 -4 -5 -19 -12 -22 -1 -28 16 -13 -39 31 2 -19 -24 -16 -10 14 3 2 12 17 8 -7 4
4308DK3j5K4m1J9k2KJ8rpJ7k5J3k9M6oMn4N3m9O0k7k0MqL1j2k1J3J2k4K4j6%J7
$$ 4 27 12 36 -5 14 -8 -6 12 3 -4 13 -12 1 -28 18 12 16 -38 15 -34 26 -1 -21 -17 -25 6 -6 -27 -14 -2 -26 -2 -18 -18 -1
4343a%J7%l2M1m7K0J8kk2K9k8JJ0Qk5J3J8J2j0J3j9j4qJQk2K5j0noM5l7J0k8L2
$$ -1 -1 16 16 -16 25 -22 -2 16 14 -8 21 -7 -6 4 12 -13 0 18 30 20 33 14 0 -8 -7 1 -21 4 -6 -11 -17 28 -9 1 -27 5
4379ENk1PPnj0L0m0L9J3l3j0J0J0j1OK2rlKl8K7rrK2OMj1K7n1L5j8K4k0pJ8%K
$$ 5 10 -11 -4 3 -2 -12 18 -22 17 30 -3 -13 -3 7 -4 2 24 15 12 14 -24 3 -6 -15 7 13 17 6 33 -18 17 -1 23 3 -4 14 14 16
4417A6k3kJ1l3L7l7J5j6L2lL6mk2k9K7mJ5k1LLj6M4ql4kJ8lJ5k1LrqK6kkj9J8
$$ 16 -7 -9 2 -31 6 -31 -16 -32 0 -3 33 29 7 -22 5 1 16 -5 -2 1 -15 29 21 -13 -15 3 0 15 -6 -3 -12 -20 6 4 2 -17 1
4454Ak3M1n9K4K6l3k9L6L6m7L0j8J4NJ4k9L2j5K6n1K7j7J2OJ7j9Lmmj3L8j0rJ3
$$ 1 -22 19 -40 -16 10 -23 -52 -16 20 -27 3 -15 -1 4 18 -11 21 6 32 -19 8 -9 3 9 26 7 10 6 2 -11 27 17 8 21
4488B1j5J5n3M3k9nJ8j6J5j3J6Rj3Pok0K3j2J8j4K0kOnj7NK4J5l8k2K9J2k6K8
$$ 21 6 21 -32 11 -18 -23 -5 -21 -6 -19 -3 6 -7 0 -6 -26 -3 -15 3 -11 9 7 13 8 -9 -4 20 35 -3 -25 4 16 -10 18
4522A8kJ2n9K3J7l0L0j1J3Jk5L8k9k3K8K9l8RRl3Lj1K9j1K0%mj3Rk1K6k2J8K0
$$ 18 16 28 -31 -8 9 -21 9 -2 11 12 -13 25 -4 -27 1 30 -8 1 10 -23 -20 -31 -2 -13 7 7 3 -10 -1 -22 4 -18 0 20
4556B0j6K8m1J3j0MJ0%j3j4nJ9OJ0j9nJ%k4M5j1k8K4j6K6j6j2ORjJ5l2K3Jlom
$$ 20 4 32 -9 4 -6 -2 8 8 -5 -19 -24 -5 1 11 -8 -13 -12 -12 -36 9 -2 -30 -6 -22 4 -12 -24 -18 -9 -10 5 -27 -4 -3 -6 -12 -16
4593a6J8LK0l3MKJ3mj2OJ7k4J0Mk3OMK9m8J3j8K7K2k2m1O3l1k1K4J7qj0ql9K8
$$ -16 2 5 25 -8 -4 -2 11 7 -5 1 18 -6 4 8 -15 -9 -5 24 -24 -11 -29 -2 20 -2 -43 20 -11 -32 -8 9 1 -9 -17 -56 -28
4628b8K3J3J1rjl3K9R%j5j1L6j2k0J8j1lOJ5k9oK4Lj7QJ9j8rOJ5olpnj1OK2k8
$$ -28 -5 8 19 10 9 -24 5 14 14 -1 -12 24 12 -8 10 -1 -4 2 17 -12 -18 6 9 -8 0 19 1 -8 -2 13 7 4 -3 -8 -19 -13 9 -19
4666a9J2J6j3pj9L9k7L1j9j0K5m0M6k3L2mOn5K6J6J%J1jj9k3K6j6N%J3ql7N1l2
$$ -19 -7 9 -4 -11 -30 9 -18 13 -6 -16 9 -31 15 -8 24 20 26 -29 -3 13 14 14 25 24 5 -18 8 -8 -3 -3 10 2 -35 16 -16
4701a6K7kl7J2M5m0Jk4K3j1J2Kjj9J7j2J8K2J0l2OK9m6j1N8k3k3J0J2pJ0J8Mj3
$$ -16 11 9 -28 -16 29 -11 -10 -34 -11 -22 -10 -8 -9 -28 -11 -23 -5 17 27 -5 1 30 -16 -27 31 8 -15 -5 7 0 10 28 32 19
4735A9oKok0J5oJ0j4LLk8K6k9J2J2mj8M1j2j2j0LJ3j1K9qjJ1K0j8KJ3k5L7l7N
$$ 19 13 15 9 -11 4 -2 8 -6 -3 0 -28 -2 -31 -19 -7 -11 -29 12 0 -12 -22 -19 -6 -17 12 4 3 14 34 16 18 31 6 43 6 11
4771A1J2j6j2K8nj0j9J7nj5K8j8Nj6j2J8lk6L2j0L7l7LJ7k2Mp%M%L5ml4lK5rM
$$ 11 23 7 -5 23 18 8 -11 6 1 -14 14 -4 1 -15 -27 -9 -12 -38 -6 -16 21 -16 -13 4 -18 -14 -21 -21 -17 -17 18 14 -20 -23 2 -7 -3
4808cJ3K1l3K0j7j6K0J2qj1Kk1L0pk2J5J5rqk1LK7j4J7k2K7l1L3n3K1j5J1K9k9
$$ -3 10 31 -2 18 1 -15 5 17 9 -2 0 -21 9 2 -20 -5 10 1 -7 -28 -25 2 -12 5 -17 10 -21 12 -41 -20 -35 -24 5 -24
4842b4kJ8qK2j0l9O3j4j1k0J4K6k4JL0J8l4rJ3Qj6j5J4j3Rj7K0qj2kK1k3%J0q
$$ -24 -26 -8 -16 6 -4 -43 20 6 -5 -25 -11 15 -9 -8 22 40 6 -3 10 18 2 -13 1 -12 -3 -20 0 -8 -20 -22 -1 -24 -24 -14 -22
4877b2J3QRk2k8M4l0K3Qm7M8KOJ3k0QJ3k6K2mj4j4lJ4J5pKK1n3K6Pl8J3knJ5o
$$ -22 -9 -1 8 -14 -42 2 -28 -5 3 -44 4 6 12 25 5 13 26 0 22 18 4 -10 -13 1 16 9 11 32 -21 5 12 -26 -13 -15 -20 -5 -11
4914a1%k0J9K2m2L0Lk1NLlJ4J6k1lnK3j0pJ2k3J5mOj3K5J0kj0Nm1K5NK7n6K1j2
$$ -11 -11 -31 -12 10 -32 -2 1 -20 -15 -12 -15 -1 15 -6 -9 -14 9 -1 -8 4 -19 -4 -8 -2 -15 10 20 18 8 13 -28 -3 2 29 -27 -6 -18
4951a8j2K1J4k3j8QlK8kj2MK6lj6j1jJ3%K8ql7lL4K0l7K8Kj3J9j3nk6jJ8lMJ7
$$ -18 -30 -9 5 -18 -36 -28 -31 -3 -5 -17 -13 13 10 -6 -17 -18 -5 -5 23 15 -22 -25 9 29 -8 20 22 9 28 15 10 -16 -17 1 -2 2 19
4988A9Ll1J5lj2J2j1J3pk5J7k3J7j6K4Qj3nM4o2K4J3mKK7Mo1L8J4l2J1J3Ok8K6
$$ 19 22 -9 6 3 -9 3 -8 5 -2 -27 -10 -33 -16 -32 -8 0 -13 -18 26 -36 -12 1 -3 -1 26 30 -31 7 21 -11 0 13 19 -9 17
5023A7nJ6kj4jn%pj%pmkKJ3lk7M5k3j9K7k2J2Mk5J7Rk6J2J9RmjMJ1j7Ok0K8Rk
$$ 17 12 28 26 12 11 6 6 -1 -2 -2 -9 -13 -15 -13 0 -3 -30 15 -8 -27 0 -22 -10 -6 -31 -14 -5 -31 -19 0 9 5 4 8 19 2 8 -12 16 25 23
5064B3K4m8J3j7nOj6PnrPJ3lnjolJ0J1mJ0k3MJ1j3J2qjNj1L1J1k0Qj7lNPNNj1
$$ 23 47 -1 12 -5 -10 -4 -20 -13 -18 -27 -20 -7 -10 -15 -16 -22 -25 -15 -4 -8 2 -21 -17 -6 -19 -7 -15 -16 -11 -22 9 20 0 8 -9 -12 -7 0 5 10 -1
5105aJ6k7K7Krk2L3k5moJ8J1j3j3J2J3l7JJ2rL4l0%PJ1J0l2PPJ1J5oPkk4JNj%
$$ -1 15 -12 15 17 8 -14 19 -6 -10 -16 2 13 0 -13 -1 12 -25 -24 -12 -21 13 -17 -17 -10 1 11 -21 -14 -7 4 19 13 20 18 -6 -5 0 -1 -1
5144aKqk%K9l1M5k2%j7kPKj2j6J0J1kJ8k7K2j9ljK1j4RnJ0q%mQJ4ONqJ4l7K8n
$$ -1 1 -7 -9 -9 20 -11 34 12 12 -5 -7 0 2 -10 -26 -16 -5 -7 11 -16 6 -13 -16 -17 4 -10 -1 -6 4 -4 -4 -8 0 14 20 25 17 31 -6 22 17
5185A7mJ8j7K6Jm5OM1j8k0j5K0kMl6J7%qJmJ6jj7jM1k6loOnJ7k6K0k2KJ7K1J7
$$ 17 13 31 14 40 41 -4 2 43 25 5 -10 10 8 12 -24 -7 -7 -15 -14 -18 -2 -3 -20 -21 20 -6 -9 -15 -9 -14 3 -23 -3 -25 -23 -6 15 32
5223C2m1MQJ2j6K3j4j1QK3k0J8rj0k8L3%Jm9M5j9qj1K5l4M0Mj5oqK9k0K0k4L5
$$ 32 -9 -5 3 15 -1 22 8 -3 5 28 8 26 17 7 -21 12 12 13 -36 9 -10 -18 -29 -4 -38 2 6 -9 -15 -23 6 -14 6 -18 17
5258A7m3N9o0M3k9J2j1RJ4J1m3N7k6k4lK2J2j3kJ3j9J4Qm5J9k2K2ljJ3l1J6J4
$$ 17 -26 33 -27 16 -13 -1 -12 -3 11 22 -21 36 10 -14 -17 5 17 4 2 15 -4 10 18 -27 -8 -30 -8 -11 -12 1 -30 -14 0
5291@k9J3J0PJ7j5oqJ6k%NNl3J3K6l3jL4J3m4K2k3K2oJ7ok8J2j8K6j9K2K6l7P
$$ 0 -29 -16 -6 1 18 3 -3 -11 5 3 3 8 13 -20 -7 19 -14 -15 19 32 -12 10 -13 9 3 20 14 -14 -2 -20 6 -13 9 35 -2 5
5327El2M1l8Kk1M6j4Kk0K6L0n8K4MnJJ2J5k7RJ5l2J9P%%J7l2J7lL1m3K6l3K3J2
$$ 5 -27 14 -24 -22 -43 3 -11 -9 -29 -3 27 -31 -7 -3 -8 -7 5 20 -7 2 17 -15 4 11 11 11 28 -4 13 10 41 -2 24 -9 14 26
5363B6l5K1j9J5m0K8jJ9k7OrkK1k9J9K0j9J3k4K1moj0L0k1j8N2k0l8M4Rk3PKJ6
$$ 26 -9 12 -7 8 -32 -4 -5 14 -13 -7 -16 -18 3 -26 -7 13 -6 7 -17 4 0 -6 -16 14 -7 -25 27 7 -31 13 22 -1 6 8 24
5398B4j1oLj1J8rMj7j0L1l3K4n2M2Jj9pK1J5Kl1OpN5l7j0J1j5K1j3RkK0j5M6l1
$$ 24 13 7 10 -1 17 8 12 -5 -15 16 -17 7 -45 -3 -2 -21 -28 -7 8 10 -21 -15 -22 33 -4 -14 -3 -18 3 -10 -1 -3 17 2 48 17
5434A7mjJ0rljJ9l9MNJ8k5k1L1Nj9Ok2K6J6pj0J0k3Pj5K0NlJ1Kj2qL7l1K5j4l2
$$ 17 13 12 22 13 10 9 28 -11 -7 -2 16 -9 -30 1 6 -13 -7 -29 -3 13 6 -4 6 -17 -10 -25 -5 0 -3 8 10 -2 -10 27 -4 21 7 -25
5472b5L6J2J2n1L9l2J2MlJ1j3OJJ5k1k2J3L2n8J8K6%k5J1j7Qj4M1l1%oPj7M3l3
$$ -25 11 23 35 -16 23 -9 3 7 4 15 2 8 9 24 3 -19 -6 26 -32 -14 12 12 -13 -2 -19 -11 -25 16 -15 -15 -21 -14 -31 12 -21
5507b1K0KJ3j8qNj1L3j9KRJpj6J5L1k5l3M8k8J9k1k3M3k8OnpL6k5Rlk0K5Kj7K4
$$ -21 -1 1 14 -4 -12 -7 -18 15 -4 -2 7 8 1 -15 0 31 6 -27 21 -7 12 -9 -32 11 -17 -11 -16 -23 13 -12 -3 -6 -26 -1 1 -16 8
5544Hj3j8rM0Jj2j0oL4lj5J3%k9K8rj3K0J6j3K1n1N8pl6J9j7k0jJ7j2QJ9j0k2
$$ 8 -5 -23 -32 8 9 -3 -13 -19 15 12 -3 10 10 -19 9 0 -13 7 23 10 31 -20 38 31 -5 14 -3 -23 -24 -7 -19 -11 8 -2 -24
5579b4J0J4Ll1J7K0j3Kj6K3j1j9J8K4j2j1J0jlJ3nJ5nK6k1l4J1J5mj5PK%j9PR
$$ -24 -14 0 3 -28 -11 9 -4 -2 -18 5 -6 -25 -7 17 5 -6 4 3 0 13 8 23 18 44 23 -11 0 15 11 -4 3 5 5 -14 -7 2
5615BPk1okJ7J7Kl6K1k0j4J4QQk9K4j1K1nK0J0k5k0K9Rj1rK6j1rJ1m3J6J8Jj7
$$ 2 9 -12 -18 -20 -3 14 16 -20 1 -19 -33 -19 -11 -3 -32 -8 -19 2 -3 17 27 2 -18 11 20 9 0 26 15 6 17 -26 -10 8 9 -8
5651hoJQJ5k1K3nj0k6OK0J5l7MJ5k1lK1lLK0j9j1M1m3Kqj1J4L5Ql8PL0m2K7J5
$$ -8 -14 -13 -5 10 -11 12 7 -3 -29 -23 -3 12 -25 -21 -6 -27 -30 -9 -12 -9 11 -8 -19 22 -21 -19 -27 -38 -24 11 19 -19 -12 18 -24 3 18
5688A8k5J5kk6RPK1k0J4pMj3Kj1j9J6J6kj3J0j2J0lpK2j9qMJ3NJ4j7J2lNpk9M3
$$ 18 -7 8 6 -20 -11 -4 17 -3 11 4 8 -5 -3 -14 -33 -17 -1 -3 -16 -6 -18 -8 -11 -18 4 -15 -23 -19 -6 -1 13 -4 8 5 10 3 -26 17
5726A7QOpk7K8k8J2j9K%K2k0kK3j5k4J9J5k0L0lJ7m2%K0l6JQK3k2K3qoJ5l2L3
$$ 17 25 31 24 -3 25 -3 9 -10 -8 -8 14 -6 -8 15 0 -24 -5 10 -10 20 17 34 -8 -8 12 -24 -23 -15 8 -14 9 1 -5 10 -22 11
5762A1kLMj7M2j3k4J8ojk5J0K1Lj4Qk3rNjk2K2Nj1mNOK6n7O0j4J1l0LJ8l8L7P
$$ 11 9 12 16 -1 41 28 4 22 16 15 -10 0 21 24 10 18 -5 -14 -9 -10 -32 -10 -5 -16 -20 -15 -9 17 -40 20 6 17 -13 -10 8 -30 7 14
5800A4l4K0J3k7RjL0l5J8POj1%j9QJ5Qk5rK6Rl4NL1o6M8Jj0Pk8J3PrK2k9lJ5n
$$ 14 -20 0 13 -14 -5 -6 24 -11 7 14 20 9 9 -10 -2 13 21 -4 -13 13 22 -12 -7 24 -42 6 7 -3 4 -24 -11 -4 -13 9 -20 -23 -8 -13
5838a3Nk3QL1pl9N0j5JJ2QjopL9m2K6l7J0K0k2J6k8kL7m0K7j6j8J0MjJ2j5K2m4
$$ -13 -8 -31 -23 8 1 -38 12 -3 -2 10 18 17 11 4 43 1 27 -10 0 20 -2 14 -14 -16 21 -19 8 -8 -26 -16 -12 -13 -1 -16 6 -38
5874c8J3N6j6m5KLNL8m9L4j8K0Lj1K5%j0J4j6JNok6OJ2koM4k4Kj7kKJ1j1oj2K
$$ -38 -25 31 15 -30 -28 -25 -20 18 -31 3 -15 5 8 -3 22 22 12 26 10 11 16 10 -16 -10 2 0 -6 38 14 16 -1 -3 -1 10 -1 -7 -19 -17
5912a7Pqnk5M1MJ0k0KlL0m5L4qKk7J5j5L9Pk6J2J1rqJ8j2Lj9JL3k3L0m7J5Mkm
$$ -17 -10 -18 -23 -48 -7 -3 7 -13 -11 -14 16 -29 5 -3 -1 -28 -13 -28 11 18 -8 4 15 6 -2 16 4 7 -12 -11 22 -1 29 -18 -3 1 -1 -5
5950eJ6oj0qL1l7K4Rjl6J6J4k9M1oj6K0n7N5Km0J7N3n2J1J0k4K8j9l8K9kJ6J3
$$ -5 11 5 -5 -13 18 -19 5 14 13 -23 -7 7 -22 19 13 -3 17 -40 15 17 -23 -6 47 -5 6 16 -8 20 1 -37 -8 -10 6 19
5984A9k3RJ5j0j0Pk6K7j6j2j1K7oMjlKjj3J6j2J0K1k2J6L1n0RRpK6k5KMJ7k4J7
$$ 19 -4 5 20 10 0 7 -19 8 -8 -20 -31 -4 -10 -6 -7 -10 -8 -9 -22 -6 -18 -8 13 -9 7 38 -12 -3 6 -1 25 0 2 6 23 -1 16
6021A6NqOj3jPj7J4Km1M7k5kjMj9lK1k0K3nK6k4J9j1pj3l4N3j5J5mPlk3OL0mm
$$ 16 21 13 19 6 5 12 -5 9 11 -30 17 -8 -10 -11 -7 -26 -29 -8 -28 -5 -10 16 -8 11 0 -7 -20 -54 -1 -16 -1 -5 2 -1 -24 -18 12 8 4
6060DJ8K0m2J5k5K1J5m3OL8l3j5J0J6K2l1J2J2j8l2N0j7j1j2jlK1pj1k2L2OLM
$$ 4 22 42 0 15 -10 11 26 -17 -11 27 -6 -21 -11 5 27 -4 8 20 2 -30 20 3 -8 -20 -21 -24 -3 -10 -21 -43 -11 -5 -2 2
6094BK1j4l3J7J3K6j9l2L5kOk2J7J6rl8J1J0k%k1MQqK4k1opK5l6J2opL3jJ1oj1
$$ 2 23 9 -24 -7 6 32 13 -19 16 14 20 -2 15 31 22 -16 -5 5 3 3 -18 -14 -6 -14 10 -11 -17 -24 1 -35 -23 -29 -36 -3 -4 7 1 -10
6132a0K5k9K9Npj4j8J9kK5k5K2J0k2Pj4LK5kj8Jj4pNK3k4mK8k9j1K5J8o0L5nj5
$$ -10 15 -14 15 20 13 -1 -19 0 -2 23 -2 20 30 8 15 1 4 29 27 9 10 -4 -11 -6 17 -7 -11 17 -12 -23 2 20 -40 -5 -10 -25
6168b5K5k5M2j2j6K1j2K5Qj9k6K0rk3J9K1nJmKQK4m5K5rk0K2j7k3J1PJ4pj3j4
$$ -25 0 -25 17 5 -11 10 -2 23 31 12 -14 6 -3 -26 -7 14 9 10 6 8 16 40 -5 20 11 -9 13 -4 -27 -16 -9 5 -2 -15 -29
6203b9K4j3kK1k4J1k4K2%J9Jj7LNJ4JJ3m2L7rK1k9J5j5j6L1j5JjkJ3j0nk0LJ7
$$ -29 -5 -18 -20 1 -23 -12 -36 -14 -14 5 6 -11 -8 -3 11 12 25 -17 20 11 32 3 18 3 -13 18 3 4 3 1 14 4 -1 -21 -18 -1
6239aJ1k6RJ4nl1K7Nj8mJ1l4L5k2%RmK4Lk6RL1k2K2qJ7rj9K0l0KL7jl1nMJ9j2
$$ -1 10 -16 -7 7 2 -29 -2 3 -15 -19 -8 -42 -7 -29 -29 -20 -24 0 3 -23 -14 17 -5 17 9 26 17 -2 18 -12 -10 27 26 -5 -10 -6 13 1
6277Aj6J9J7l8j3J1J2RM%j6j1Mj4K7j0QlnRj4L7n0M3JmJ7l2NK0l4K5j3L9m4K3
$$ 1 -15 4 21 -17 -30 -19 -7 2 6 6 -10 -21 -17 -31 -4 -14 -6 -9 -14 -5 -19 18 -32 11 12 8 25 -7 -2 18 -16 9 -4 35 -9 14
6313A4NkjJK0jj4j0qj9RK9k9j1K9j4K7l3J3J0k9J3l0K6nK7j8Lmj3J0Qj4J6pK3
$$ 14 19 17 16 17 37 36 22 12 4 -15 -6 23 -6 -17 12 -2 25 -8 5 15 -14 -1 -31 -5 -10 17 -1 2 -2 -15 -5 3 -11 5 -2 21
6349B1k0j7L0pjk1L8j9j7K2qK5j1k7RKPJNl2Oj3oN9l4nj9J6Qmj2K3J0nj5jK0j0
$$ 21 1 -16 14 7 6 -15 23 4 -13 9 1 26 15 -12 -3 -1 6 7 12 -20 -14 -27 -33 26 -8 -13 -32 -16 -8 -12 -24 -1 9 4 -11 -12 8 -2
6387bJ6l3L7J1l5NJ8Mrj6K5Qk2k5j5M2kJ0nrJ5j6j8PoL4j9j6NrK7jl5J8lJ7k8
$$ -2 14 -19 18 29 -6 -1 17 21 12 -4 21 29 7 -18 -33 9 7 17 12 3 18 2 -16 -9 -15 19 0 -16 -11 -20 7 6 -29 -11 -14 3 -25
6424b5J7Qj4L8k2J1j2J1J6Pl2K4j6nKqK0j4MJ5j8j7K6n2L2J7%l8J5l5J3K7J2p
$$ -25 -8 0 -14 24 2 13 1 12 28 35 3 27 11 6 8 0 20 6 10 25 7 -10 16 -36 -4 13 13 -25 -10 -45 -32 -5 7 0
6458@O%qlJ2k7J1K0k9KL1rj2pRLJ2pj0J6Rj6%j6KJ4J1On8L7klM1k5k3K6m5M0k7
$$ 0 6 6 -2 -5 7 -20 -9 11 -18 -16 15 6 -6 -13 -4 -1 11 4 -6 10 19 3 3 -13 -11 3 14 20 -38 -1 -3 -6 35 10 -13 13 -32 8 -19
6497a9J4Jj8L0m3M3l3J3KRJ2qKK8l8J4Ll2K5K2j2Qj6J4j2j0K2j3pQMMj7J1pMn
$$ -19 -5 -4 -22 8 -35 8 -25 -12 -10 -1 11 3 5 33 -5 9 12 -20 5 27 15 23 7 21 9 -1 21 8 1 9 13 17 0 11 4 8 3
6534CnrJ5Nk3mj2K2JRk8Pj1J9J5k5K5JPj0j2lL1rk4QlL5j1K0j2m3M7%k1lj2qK4
$$ 3 -2 -11 4 9 -14 -18 -30 -8 -7 2 -26 -19 -30 -11 4 -21 4 5 12 2 -10 -13 18 9 -15 -7 -10 25 14 34 22 -21 26 26 5 2 -10 -18 6
6573Fj3J6J1l4Qj9rK0Pm1K5K9lk1J3J4k3LmL4m2L3j9J8kJrJ2Qj5kKL4l9J0j9N
$$ 6 -7 9 20 -14 -6 -25 -34 -14 -7 -48 -23 6 3 -18 -5 9 -14 -11 -15 19 -23 10 -9 9 7 8 -1 11 19 4 2 4 38 -1 9 -10 -5
6610eKJ4n3L0MJ3l6qL0jj0j6J7rnL0k9JK7rnJ7K7l8L2pj3JJ1rRjl7L6J3MrJ2l5
$$ -5 -3 11 -42 -12 -8 5 -31 -39 -9 -10 -20 -36 -19 -28 -33 -3 -32 -31 -4 -13 -18 -1 26 -12 20 13 0 1 12 3 12 11 -26 10 23 27 18 30 -5
6649ekJ6k5RJ9Ojn8N2j6Kj3JMK3n1oPj5O2rj4Lj6NQJ3k3K2RQj6J6j3J8pj5M3n4
$$ -5 -7 9 -16 -7 12 18 17 -41 11 -5 -3 -16 -15 -11 12 -39 -45 -38 -53 9 0 -14 -11 -27 -22 -14 -1 -24 -2 7 15 -1 15 2 20 13 -2 41 -13
6688a3K3j9M9j8k7j4K3L9rl8Lk0J3j2K6J1m3J2o%QMM2n9MKJJnL2kj8Rj7J5OK0
$$ -13 10 -9 40 22 -5 -19 4 43 34 -4 -1 -21 -8 -20 6 17 -26 -14 -20 -20 -12 -8 34 -25 -21 -19 -18 -17 -22 10 8 -10 -1 -18 -3 3 23
6725B3kl2L0%jj2oJ2mJ1j1lK1k8L8k8k8%J1nLnj1L6ok5L4j6J5j9J0k4K9j0J5J8
$$ 23 21 -11 19 19 18 6 0 12 8 19 8 5 26 -2 36 8 -20 -20 -9 -14 -11 -16 -27 9 3 -22 12 -4 11 -8 2 -22 7 -3 12 30
6761C0n4M1qj5RK0mk6kOK3lk6J3Pk0mJ4ljj0%K2j7%j7JK6l0LmJ4J4ppjK3jmLl
$$ 30 -24 17 9 -6 3 23 19 -7 -9 -3 20 17 -9 4 11 -9 -13 1 -2 -3 -13 -13 9 -8 -8 -25 -24 2 -28 -25 -29 -15 -1 -8 -15 -16 7 6 2 5 2
6802Bj0NK3m8M1j1J6lrJnRj5K4k5J6qk0K4%Jk5jNJ0J3k7J4Oj1k3j4K8J6L0l6K2
$$ 2 -8 -3 20 -28 13 2 18 15 6 7 2 11 -4 20 -5 11 3 -17 7 7 8 -17 -18 -13 -3 10 -17 -3 3 -8 -31 -45 -17 -1 29 -7 15
6839A5k2kRLloJ2j9qK5pPpK6qj9J1Ok6L3Pl3j0ML9l4MK7l4Oj2ML0k3j6RNj4K0
$$ 15 -7 -9 0 3 0 -6 6 -13 -21 4 -3 4 -3 23 15 -4 7 13 -13 20 27 -6 -16 -12 27 -7 -3 24 -10 -4 -16 -12 18 -5 -21 -12 -7 -21 -1
6878aj2jJ4J8m7K3QPk3PRNj2J4j3J5pL9l6MNpqj7K6K2l5RqL5k5j0j7K2oj7K9l3
$$ -1 -13 -14 0 18 -29 -6 2 9 -14 -7 2 7 -5 9 -4 11 4 43 7 11 16 9 1 -16 10 32 -3 6 -2 33 8 -2 -19 3 -3 -20 9 -24
6916b4M7l5jJ2J8J2m3j2M0j4J2j7NJ5J9j5Mk0K4j8njqJ9j6J1RolrJ9lk0J1kj2
$$ -24 23 -12 -13 -1 17 29 -14 -26 14 0 12 -5 0 15 34 19 23 3 27 9 4 3 -5 14 -2 9 18 12 9 0 19 16 -4 7 5 -7
6952gJ2j5K6j9rJ9k6L2l8ML7j6j5K4K6j2m4K4kK8k7k3L8JQk2J8Ll5J8KroK1l6
$$ -7 5 -10 16 -3 -12 7 -19 13 -25 -21 16 0 -15 9 35 23 -21 3 1 29 2 -21 17 18 26 4 22 25 -10 8 10 1 -5 16 -20
6987b0K8rqJ7k1nK0nJ1k5J0K5k2j6L4n4M0pRJ7j4K5k0k3K3jk0M2m7K6k6L8Qm8
$$ -20 8 -1 -9 8 -13 -18 2 -3 8 -17 -7 18 -4 -20 14 -40 0 -7 2 19 5 30 10 -13 10 9 -11 31 -16 10 -16 22 30 -18
7021a8RJ5rk6L8j0nkNK8m3J2j2nK2j9K2lPl5J0j3M3m0J4JJ9j3LmlL5j2Nl5K0J6
$$ -18 -9 6 -3 -29 9 -1 -6 -8 -3 25 -18 -6 -18 -23 -1 -20 2 -1 6 -29 -19 -32 11 -29 -15 -14 5 -8 -5 -9 -12 23 11 16 -19 1 17
7058A7Mk0J0L7l7j9L4m5L3rmnOj2Rqj1J7%k0L3j4k3j0KK1j6kM0j0Nj1KL2mk6K8
$$ 17 21 1 11 48 11 -8 26 -19 14 5 1 -4 2 -10 -1 -9 -20 -3 -3 -23 10 -4 -27 -37 -35 -14 -30 -32 8 -2 3 -8 -6 26 22 -4 24
7095B4l0NL6jk2j5LRQNK3l6J0%j5Rklk4NlL6k0j2J9k4LqNJ8oJ0j3jkqM3Nk0j5
$$ 24 -6 -1 35 34 12 -3 0 9 17 22 45 9 19 19 4 13 11 8 -16 -11 -14 22 2 -10 9 -15 -12 -20 -15 3 -3 7 -6 -7 -9 -17 26 31 11 -4
7135dPPK4m1ML3j8lk1L2m2K2J7Lk2MKJ1r%Rj5l3M0j8rL5n3K9J2k7J4PKj0oj4J9
$$ -4 3 10 34 -7 -3 30 12 9 -12 20 -22 0 17 20 -2 2 4 15 6 6 15 0 -33 7 -11 -20 15 -38 -9 3 -24 -10 -3 -1 -11 -17 -31 -12
7173a2Rj6J2oK8k0K8k7J3pj3J1lRJ0R%K5n1j3J2oJ2J3pj3Rrk2K7mrJ7J0m5J7P
$$ -12 -3 -19 -7 -13 15 -5 23 -4 9 2 -11 0 -3 6 16 25 25 50 -1 -14 -2 -8 4 17 10 -3 6 -3 -25 2 -2 -11 6 16 -29 -12 -5
7210ej1K1jLOok6L3J4l7kJ7JJ7j3olJ9K1m1Rj5NJ9pj4K5k8Mk1M5k5Ok0J9rJl5
$$ -5 -16 5 4 7 13 7 -19 14 28 -9 -11 6 7 24 11 5 2 21 42 1 10 -5 0 19 12 -2 23 -5 -1 -22 23 -2 4 -16 3 -6 -5 -40
7248d0K0oLK4%K7m7J8Jj7NKnK2POMj7K3jk7J2nQJ%j2J3k9J4Mj7jJ8rj%Lk4J8p
$$ -40 -20 -26 -23 1 1 28 -19 -1 0 -17 -12 -10 -15 7 14 20 24 7 30 29 2 14 9 17 18 18 6 19 -10 4 8 -9 -10 8 -1 -2 -2 1 -23 -5 -12
7289a2K0k2qM6ml4j7L7k0L6k2kNj0QNJ2rkoPNNnJK2jm3kJJ1K3l9kRK7kl2OJ4j8
$$ -12 8 -14 -22 24 20 -14 -31 6 -14 22 0 -2 3 -7 1 6 18 9 7 1 8 13 18 13 14 36 35 -8 -10 -9 2 25 -14 -16 -7 20 18 -14 -8 6 -12
7330a2j1K7pl2L2%j2j1lM6l1K4K7o7L9lLj5K0j5J2j0J9k0K7m3oM0j9%J4pqj0Q
$$ -12 -23 4 -3 -35 -3 -3 -15 -26 -29 17 -14 10 37 -30 9 6 9 -6 14 -1 11 1 20 0 27 -16 -22 18 -1 -1 13 6 -2 -12 -4
7365dkk3L9j5lL4l6K2k8JQoQll1J6O%K4J4k8J4jK8k0lQk6K6m6K2lkJ6j1JRnOl0
$$ -4 -6 -29 10 -5 -8 26 -10 12 -16 -15 -7 -13 -5 -8 -39 -23 -17 -17 7 21 -7 7 6 34 14 11 19 -7 19 -27 -5 -8 -10 6 -5 -4 5 0 6 -24
7405b4J8K5m7M6jj1l7K8Pj2K0Lk1J%j9l7O4k0NK1j8OROOj3k0K7KJ4k7J7j3K2j9
$$ -24 -6 19 -28 18 17 6 -31 -3 4 -8 12 15 -6 -5 -5 -24 -61 3 -17 -12 9 -9 -3 6 12 18 5 -15 12 14 28 1 18 5 27 8
7441HpK4pm4M8mm3K8j3J6K5m0Rpll2M2Nj0j1KmK3K2l3J3k1J2nJ3j2L6j6mJ9k2
$$ 8 1 25 18 -26 22 18 -25 3 -10 6 31 -9 0 -7 -10 -42 0 5 -5 -16 -14 -18 5 27 -6 7 -14 -2 -7 6 -6 30 14 10 29 7
7477GJ5J3m2K2j8J7j0j8J9k1L4j7j7qK1Rk3K9j7QJ0k8J9Qj1ljPrJ6j0Mj9L1l7
$$ 7 22 35 -7 15 -3 14 4 -14 5 -16 18 1 -16 -24 -3 6 -17 12 -5 3 13 -15 4 12 1 -2 -3 4 -5 11 1 5 -14 17 -20
7512b0pL7nK4l2nJ5J5j8Ok0OJ7j6j6L4j9j9NPK8Qm8K2Lj3QlJ2k%j9J4jpMRJ7l7
$$ -20 -27 10 5 29 -3 -8 7 22 4 10 -10 -4 13 -3 -19 15 -4 -23 -18 -11 17 25 -23 -1 2 -11 -3 -6 6 4 4 -15 -1 -2 -9 -5 4 21 -16
7551a6K3J7rl0J5%K7J2m1PJ0KQNj9knMj2KQNK0k5l0M0j4J4k4j2J7k6L1nrNj0j8
$$ -16 7 24 15 -15 0 0 27 39 -2 5 15 17 25 30 11 9 4 8 -4 -2 6 11 31 6 -24 16 2 16 -8 -20 -3 -29 2 -3 -12 -7 -17 -35
7589c5K0mlM4j8KMk2L8k1%K7qk4PlK2K8o1K0lk5L0j3j3QRmj9J8j7K5j0l6K7j2
$$ -35 -15 -19 -22 22 4 6 10 -12 26 5 5 32 24 0 7 4 26 54 -7 13 10 -15 15 2 -11 -3 6 2 -17 1 -16 9 -1 -37 -10 -22
7625b2K7k4J5K7m2L9k6jJ0K0k1jKj6K0k2OMK7kj8j7K8j1Kj6J1K2l1J4ool6M8J
$$ -22 5 -19 -4 23 -19 20 -6 -7 3 23 2 1 3 -13 7 -15 -9 -5 22 20 2 -15 13 2 4 -12 -1 21 -10 4 -2 -8 -44 4 5
7660Ej4k1LQK3k8L5k4J9j5k3K5lkK7kqrj1RKOj4L1pk1j8N6m3M9ok8J0j6j0K4%
$$ 5 -9 -30 -27 -19 4 -24 11 -13 6 -9 -32 -7 -10 -12 15 13 5 -4 -15 -6 -4 2 -12 19 12 -9 -27 29 -14 35 29 1 11 -5 -15 9 9
7697IJ1Qpmk0l%k1K2Rk2Qk4J6NqMLpL8l7RM4j6j4K0j5j3JK8k4K2j4j8K7k7K0M
$$ 9 20 28 21 17 -3 -6 -6 -27 -5 4 -18 -10 -34 -18 -13 -21 -17 -14 -21 17 -20 -11 33 17 3 23 8 -5 -4 24 0 22 8 -10 17 -10 10 14
7735A4j2J5mrj6jL6k1j7Qj2K5%kkk9J2J3Qk2j1J8J2QmMk0K2Nk1OJ5Kk7JJ4LkJ7
$$ 14 2 17 13 4 -12 -13 23 2 -15 -7 -19 6 6 4 2 -27 -15 -2 6 -16 -27 -9 3 11 7 11 -9 13 18 -3 3 18 20 -7 -6 8 11 9 26
7774B6j3m2L6J0Kqlj1nk0J6KJ1l6K5K2l2J5nMJ9j8qMJ3%k5M4k3Kk3M4j0nK1j7
$$ 26 13 -29 7 17 19 11 8 -3 -8 -28 -12 -10 1 -35 -10 12 -20 -5 -10 -6 13 -5 -13 -9 4 4 -21 23 0 2 -21 23 13 8 29 12
7810A2j7JL3mj1j7KOj5K3%oj4jK8l0L0k0m2K6oQmk0L2Ok5J9mRPNK3Qn7K4lj0L9
$$ 12 -5 -4 29 25 14 -3 -1 5 -10 13 13 7 -7 -8 20 -10 20 0 -42 -16 -22 -14 -18 -38 -6 0 -25 -6 -10 -1 6 11 34 42 -15 9 6 -4 35
7849C5j3J2l3NoMJ1Pj3m2K7nK5ok4J0JNJjk4j8J9K6k3j3L1lJ2Ln9L7J0J1kpK2
$$ 35 22 34 1 6 0 4 15 22 9 -33 -6 -11 14 8 -16 -6 -5 0 1 0 -24 -42 -23 3 -20 -33 -2 -5 7 10 -49 -12 -2 9 7 0 22
7886B2j5qJ5k0M5k4j3Rj5J0J0j0J3j4%Nk0Qk2M0m3L6pj9J2Pk2KOK5jl9K5l2NN7
$$ 22 7 -1 14 -6 39 15 2 11 -4 6 16 6 19 5 5 10 -10 -2 -24 16 -27 9 2 -17 -5 2 -20 -18 -12 13 12 -27 -2 -34 -29 28
7922B8Jj9j8K7j9K6k5j6M2k7%K6j2J3%l5J2J2pJ8k0j2KLJ4mj0kQl6M1l6RjRk1
$$ 28 29 10 -8 19 0 26 1 -15 27 0 0 26 14 27 27 -8 4 16 9 27 7 -5 -3 0 14 10 0 -2 6 -30 11 -25 -16 -17 -8 -29
7958b9NL0kj8K3j3J3MQj4n0O8n9O0l9L8Jl9L0pmJ3j5nL3k6oj4L4k7j2K3j2mL0
$$ -29 -24 6 4 -14 9 -4 9 13 21 7 -43 25 -34 26 -13 25 26 -13 17 10 6 19 4 -1 32 6 0 -14 20 -7 -19 4 -8 -12 18
7993A8j2Lk7J7JmNl4lL1J4j0l5L2NQk4j0QOK2l4L0JJ0J1Kl4NJ5j2%PLj2k6M0J0
$$ 18 6 9 -18 -1 0 -4 1 -33 -36 -5 9 -1 -36 -4 1 9 -15 -25 -17 -11 11 -23 7 8 18 29 31 -3 2 17 5 5 12 15 3 -23 17 27
8031B7k5k0KPJ1nnlK2pj8K8k3l%J1%j5L4j4rK5oqqJ4pj6K4J9j5L0m4K2j1m7M2
$$ 27 2 -18 -16 -9 2 -3 -8 -11 11 4 -14 14 -9 -12 -12 -1 -1 -16 18 4 -5 20 14 6 -2 12 5 -11 13 32 17 47 3 25 14 -33 9
8068IK2l4%J4j0n%J3j7%qmJ1KlqJ4Rl1NK1MpjJ3Ml6M6k2K2J3j4K0m0L0rl9L2j2
$$ 9 31 -3 -3 11 1 -4 -4 9 -8 -8 -16 -20 -9 -7 -10 -18 -4 5 -26 -21 0 4 -3 -4 9 13 -23 23 1 23 36 22 42 2 32 23 -16 16 4
8107Dj2J9mK5j3k8lL1ml0NJ2k0J1RJl2K4j4K4pJ3k2mJ5J3k9K1k0MNJ7K0k1Roo
$$ 4 -8 11 7 32 19 -9 -12 19 15 -15 -10 2 -18 -7 2 3 -29 -5 -19 5 -2 11 -11 -15 0 13 -16 5 -15 -11 -6 11 31 10 19 13 7
8144GRj%%J3J8l5oQRm3L0k3J3j6Mk4K1MJ7j0K%k0K6j1J8J4m0kM3k0J0j3J1J0j0
$$ 7 16 15 15 15 28 46 11 5 13 22 -21 9 -14 -1 -17 -13 -37 -16 -12 5 -5 -3 -3 -23 3 -8 10 24 -16 -18 25 5 15 2 13 23 13
8181A3pNj8J6JLJ1j4J8k8
$$ 13 6 11 -7 9 10 13 24 10 28 0
8191@
$$ Imaginary data points
##PAGE= N=2
##DATA TABLE= (X++(I..I)), XYDATA
0@%%%%%%%%%%%%%%%%%%%%%%JrJ6j6J6j6J6j6K4l2L2l2L8m6M8n5O3o9P7q5R3j04
$$ 0 0 0 0 0 0 0 0 0 0 0 0 0 0 0 0 0 0 0 0 0 0 0 1 -8 8 -8 8 -8 8 -8 16 -16 16 -16 22 -24 24 -31 32 -37 40 -45 48 -56
44e6J17j25J36j52J68j85K05k26K50k76L03l35L73m17M67n27O00o89Q03r54J160
$$ -56 61 -64 72 -80 88 -97 108 -118 132 -144 159 -176 197 -220 247 -280 320 -369 434 -520 640
65F40j467J965k910N304k2462m1305N9781M4837l0086l2916J4674O717j2582P361
$$ 640 -827 1138 -1772 3532 -18930 -60235 -454 44383 14297 -18619 -3945 2772 -9810 -2449
79b449J6383j4757j4013J9481J2397k5505j0934L0982J7219l1135k6832J6913
$$ -2449 13934 -823 -14836 4645 17042 -8463 -19397 11585 28804 -2331 -29163 -12250
91a2250K7443J197j3246r753l602P629J6545J316j9077q765J3839O880j1455k500
$$ -12250 15193 16390 3144 -6609 -10211 -2582 13963 15279 -3798 -12563 1276 8156 -3299 -5799
105e799J4566L821j3570o751O142L860J471M830l437j5079l526J8197J4477r435
$$ -5799 8767 12588 -982 -7733 -1591 2269 3740 8570 5133 -9946 -13472 4725 19202 9767
119I767j7577j863J1887O865m885n762J053J319k676J588O549p39p309O53N040
$$ 9767 -7810 -9673 2214 9079 4194 -1568 -515 804 -1872 -284 6265 5526 -1783 -1130 3910
134C910n851o563J1475J3039j1894j9533O072K1136K707j4619p078M392L620J189
$$ 3910 -1941 -8504 2971 16010 4116 -15417 -9345 11791 14498 -121 -7199 -2807 813 2002
148B002J801j848n059J141O089j328p312J565R433n40j2017l719J1183Q545n336
$$ 2002 3803 1955 -3104 -1963 4126 2798 -4514 -2949 6484 5944 -6073 -9792 1391 9936 4600
163D600r176j679N260O189P12o749n878L950P002j849n939J642N571j402o063
$$ 4600 -4576 -6255 -995 5194 5906 -843 -6721 -2771 4231 2382 -3557 -1915 3656 2254 -3809
178c809r29M718L555j229m306k776K372N156J459l932l950Q90M072J363l432k605
$$ -3809 -4738 -20 3535 2306 -2000 -4776 -2404 2752 4211 279 -3671 -2781 1291 2654 -778 -3383
194c383K841K942k915l358L205M091k774m570J254L561l3j168L77p74j561J813
$$ -3383 -542 2400 -515 -3873 -668 3423 649 -3921 -2667 894 861 -307 70 -704 -2265 -452
210d52L053j431l556P07K998r39k693J445K890j607l195J360L022r93k377R22
$$ -452 2601 1170 -2386 -1679 1319 380 -2313 -868 2022 415 -2780 -1420 1602 609 -1768 -846
226h46J439j330n58K261N32k486m73K325L08j767K05J165j182j179J700J409j560
$$ -846 593 -737 -1295 966 1498 -988 -1461 864 1172 -595 -390 775 -407 -1586 114 1523 -37
243c7j493J127J138p49o88N86M86l56k83J41K82M82L32p58j190L93J786L04j993
$$ -37 -1530 -403 735 -14 -702 -116 370 14 -269 -128 154 636 968 210 -980 -587 1199 1503 -490
262d90j183J432J517o95j279K80O37j86k04K92m9r5N36J81j087m10J623J173j708
$$ -490 -1673 -241 1276 581 -698 -418 219 33 -171 121 72 -23 513 694 -393 -803 820 1993 285
281B85k068J012K325k51k063l73J424M01r49j42P05n9n88K19M81l00j55P87J46
$$ 285 -1783 -771 1554 1303 -760 -1133 291 692 -257 -399 306 247 -341 -122 359 59 -96 691 837
300H37j241m21J384Q86j262j286P47J079l85q08K39N33l13m28K91M63j49k51Q4
$$ 837 -404 -825 559 1445 183 -1103 -356 723 338 -470 -231 302 -11 -439 -148 315 166 -85 -1
319aJ10q8J42K31q6l71j32K32J70n4j76k18n8K17J42j27j21J35l6j65K12M12j92
$$ -1 109 21 163 394 308 -63 -195 37 207 153 -23 -241 -299 -82 60 -67 -188 -53 -89 -254 -42 370 178
342A78m80K13O01j61o82J77P34k19q82j6Q75Q5p68k51N34K37l27K2K63j90l38
$$ 178 -302 -89 512 351 -331 -154 580 361 -521 -537 338 423 -345 -596 -62 175 -152 -130 133 -57 -395
363c95M76N49m67p38N03Q61m21r34J85Q77j15p59j27N18J90k73j11L1o7P9L09
$$ -395 81 630 163 -575 -72 789 368 -566 -381 496 381 -378 -505 13 203 -70 -181 -150 -217 -138 171
384A71J76m33l32L74O77j97p46q0P23J88n45l93K52L14K9k50k72JL45K40j19l45
$$ 171 347 -86 -418 -44 633 436 -310 -390 333 521 -24 -417 -165 149 178 -72 -344 -343 2 242 123 -222
406b22j18K96N07N9p53m05P82Q33o24j028J85Q80N6n93k81J76K96J83j72m20j36
$$ -222 -340 -44 463 522 -231 -636 146 979 355 -673 -488 392 448 -145 -426 -250 46 229 57 -363 -499
427d99N02N97j76q30l88R28R69o42j283K48J326P4j135l75N51L93m6j24m25k44
$$ -499 3 600 424 -406 -794 134 1103 461 -822 -574 752 826 -309 -684 -133 260 214 90 -335 -579
447e79N21O14k69q36n3Q98O86o99j231K29J558L97j390q53Q25Q21m06n38m1J84
$$ -579 -58 556 287 -549 -602 296 982 283 -948 -719 839 1236 -154 -1007 -182 639 233 -305 -346 -162
467a62K17K28k38n14k0O57M62l11q51j43J109P62j187j245J055J525p45j517L35
$$ -162 55 283 45 -469 -489 168 630 319 -532 -675 434 1196 9 -1236 -181 1344 599 -918 -583
486e83R30k14l12M63j36p75J76R36p6q56l2R01L70q55p76N66J110n1j157l24P51
$$ -583 347 133 -179 284 148 -627 -451 485 409 -447 -479 422 792 -63 -839 -273 837 786 -371 -695 56
507E6L75l15l14j02l3L43M05k20n14j73K59O02L39p29p70Q14J054j058j321J210
$$ 56 431 116 -198 -300 -333 10 415 195 -319 -492 -233 369 708 -21 -791 23 1077 19 -1302 -92
527i2J617r76j713M32J120j71k42K85l16o79L64R66j09r22j83Q41N99o75q88M90
$$ -92 1525 549 -1164 -732 388 217 -25 260 -56 -735 -371 595 486 -436 -619 222 821 146 -742 -252
547b52J148m20j319K23J384K9j195l59N13K90J56K35k75o41j50N94N24on04k73
$$ -252 896 476 -843 -620 764 793 -402 -761 -248 42 198 433 158 -483 -633 -39 485 479 -25 -298
567b98L26K55n06j05Q03K91j073n37Q02N39l87l51Q2j8LK79J70j40k87l48K44
$$ -298 28 283 -223 -328 475 766 -307 -844 -42 497 110 -241 -159 -177 -174 105 275 135 -152 -500 -256
588b56Q60J39r27l87O35J51n17L76O08n22q22K14N24J7J21J12m10m58J74N07L41
$$ -256 604 743 -184 -571 64 215 -302 74 682 160 -662 -448 76 93 214 326 -84 -542 -368 139 480
609D80q3n17m30M54P21l13o66K87M68n22l59O63M34p00n69L53M65J3pM6k98m85
$$ 480 397 -120 -550 -96 625 312 -354 -67 401 -121 -480 183 617 -83 -652 -299 166 179 172 218 -80 -565
631e65K12Q56K42p57m61M95K25n13J25Q11k44j047M1P94M8l67K30o3n93K80Q20
$$ -565 -353 503 745 -12 -473 22 247 -266 -141 670 426 -621 -580 214 262 -105 125 62 -531 -251 569
652E69k48p54L22M38l96k16O48J08p21j45M53L4j43L51k6p78j96Q42M62n50m72
$$ 569 321 -433 -111 327 -69 -285 363 471 -250 -395 58 92 -51 300 274 -504 -700 142 604 54 -418
673d18L57K34l19k5M63J32n50k05M02J18k61J23K73m70m01N53N07m13n35K27L11
$$ -418 -61 173 -146 -171 292 424 -126 -331 71 189 -72 51 324 -146 -547 6 513 100 -435 -208 103
694A03j45L7K33j44k79Q2K05rN9J5k47j33K46P0j35P3J14k88j93L19K54k15j94
$$ 103 -42 -5 228 84 -195 -113 92 83 142 157 -90 -223 23 93 -42 31 145 -143 -336 -17 237 22 -172
717a72J43M1p9P3J86j09k91Q8L29k9k68k5J60J4j66K0J30P5j60j07K2Q7J76j2
$$ -172 -29 12 -67 6 192 83 -208 -120 209 180 -88 -113 47 61 -105 -85 45 120 -40 -147 -125 -38 138 126
741A26k17j25K02J83r9q4L7l4n3J41P6k62o3K62M3l29k1L76O6m32n5L31J56k08
$$ 126 -91 -216 -14 169 70 -14 23 -11 -64 77 153 -109 -172 90 133 -196 -217 159 225 -207 -262 69 225 17
765A7j00J31j9n1P0R9j25j34R8J16l6j48J0R4l1r8j0J76L2j69o4J30J38m1j29
$$ 17 -83 48 29 -22 48 147 22 -112 -14 102 66 -82 -72 22 -9 -107 -117 59 91 -78 -142 -12 126 85 -44
790d4NJ13k8r0R0Q3j59j33J62Q0r6n9P3N3q2m9J07R6j15o4O6M6j5JPk7l3j6L5
$$ -44 -39 74 46 -44 46 129 -30 -163 -1 79 -17 -76 -3 50 -32 -81 26 122 7 -57 9 55 40 41 48 21 -12 -28 7
819GM9K0j41q8J44P4r8q2J16Q2j46m2J37J46j69j03J30N1q2j6Q8m0j93N1J90Q
$$ 7 56 76 -65 -153 -9 65 -33 -115 1 83 -63 -105 32 178 9 -94 36 87 5 -11 77 37 -156 -105 85 93
845I3k03j8J29L0q6k0J11ln0m0L1J05j9j7l5j0J0k1L2J9p7q4Q5J17o3j20L1J09
$$ 93 -110 -128 1 31 -55 -75 36 33 -17 -57 -26 79 60 43 8 -2 8 -13 19 38 -39 -123 -38 79 16 -104 -73 36
873C6k4n6J6J32p6j18O7J00j7n7J2L5p7k1L2P7n8j02JQ8P4r8k6P2Mm1oR6m5k2
$$ 36 12 -44 -28 104 28 -90 -23 77 60 3 15 50 -27 -48 -16 61 3 -99 -98 -10 64 -34 -60 12 16 -25 -31 65 20 -2
903bk7R4pp5k4N6N6j21o2J39N2j28r4R8R9l9q2R6J2r1LJ32J6j06k1P4J0o5m7N9
$$ -2 -29 65 58 -17 -41 15 71 -50 -112 27 79 -49 -143 -45 54 15 -67 29 41 -50 -47 85 101 -5 -26 48 58 -7 -54 5
933EK9l7j17N5J17j1j01qJ13kr9N9O3l8n6K7J10p6q6J5M1J4m1m7J00oj02n5J21
$$ 5 34 -3 -120 -65 52 41 -60 -68 45 43 -56 3 66 28 -28 -1 109 33 -53 -38 3 17 -24 -71 29 23 -79 -134 -13
962a3P5r1n1J30J0j32OJ33Jj30PJ09l1n5m0O0O0n7p3O2N0n6p8R2J46r7j04P8N7
$$ -13 62 -29 -80 50 60 -72 -66 67 68 -62 -55 54 23 -32 -72 -12 48 -9 -82 -20 30 -26 -104 -12 134 37 -67 11 68
991F8j08k8J40J6q2n0M7Nk2m3J5P8nr8k7J30Nj06L4J46m5j47N1J20n7o7N1N4o0
$$ 68 -40 -68 72 88 6 -44 3 8 -14 -57 -42 36 31 -67 -94 36 41 -65 -31 115 70 -77 -26 94 37 -30 21 75 15
1020A5l6k8K5M9kl3J3J1m1q1J18Q8j30m0J38L8j83k2J56J3r3rL9j3k8k3N2K3J
$$ 15 -21 -49 -24 25 23 -10 3 14 -27 -108 10 98 -32 -72 66 104 -79 -101 55 68 -25 -34 5 -8 -36 -59 -7 16 17
1049A7l5m6Q8l2n8O9J12r4j02R5P7r2n8P7K3k7j9l9OJ4N2m1k1N7m2m3P5K7m8j0
$$ 17 -18 -64 24 -8 -66 3 115 21 -81 14 91 -1 -59 18 41 14 -5 -44 -38 -24 28 -13 -34 23 -19 -62 13 40 -8 -18
1079a8J19k7j74N3J06Lo2j3L3k5l7k8O7J5rk7KN6p2m0J30K8o7n6J04J1j52K8J11
$$ -18 101 74 -100 -47 59 62 0 -13 20 -5 -42 -70 -3 12 3 -24 -22 34 -38 -78 52 80 13 -43 61 72 -80 -52 59
1108E9l4l2Mj5k1J1M7l5J4K1k8n8Q9j2r3R5P8m4j36P2P8m3m9M9K5o5j8M1j4J2
$$ 59 25 -7 -3 -18 -39 -28 19 -16 -2 19 -9 -67 22 10 -83 12 90 46 -90 -18 60 17 -32 17 42 -23 -41 0 -14 -2
1138bL0k6pJ2l9nP1nn9K8P6k9q1L7K2jo3P9n2l8L2K7nJ4L1j02J0P5l9o3J12M4
$$ -2 28 2 -5 7 -32 -37 34 29 -30 -2 74 45 -36 1 23 22 -41 38 -14 -52 -20 7 2 16 47 -55 -45 30 -9 -72 40 84
1170H4j11l4Q5O9r3m2Q0j9n7J6K9k6j7J2K7MJ3n4LO6j3l9J5O5p7k4P9J6p1k5M0
$$ 84 -27 -61 24 93 0 -42 38 19 -38 -22 7 -19 -36 -24 3 7 20 -34 -31 35 22 -17 -2 63 -14 -38 41 57 -14 -39 1
1201Anj8j6L7j2J2m4J5M6j5m3OP5j1m0RN9k5p3M7nnj2L%k2L7nNJj2j9J3L0k4O
$$ 1 -4 -22 -38 -1 -13 -1 -45 -30 16 1 -42 -36 39 28 -12 -3 56 31 -42 5 0 -5 -17 -14 -14 -36 1 -4 1 2 -10 -29 -16 14 -10 -4
1237dJ6K4l8m0O8M5r0l1P0J0l7k6L8nl5jL8J2k3k8N0lk3J5L7j0l3kL6k4RmJ9p
$$ -4 12 36 -2 -42 26 71 -19 -50 20 30 -7 -33 5 0 -35 -36 2 14 -9 -37 13 10 -13 2 39 29 -4 -6 30 6 15 11 30 23
1271B3m9k0J6O1m2q%K7J5nm7M4Qm4L6L3n4lmN5k5m1J0L8j1m0L2K6l6j8J7M3j5
$$ 23 -26 -46 -30 31 -11 -19 -19 8 23 18 -29 15 23 -21 15 48 -6 -9 -13 42 17 -24 -14 24 13 -27 5 31 -5 -23 -6 37 22
1304B2j9k3L9Pj7pL7j5j5m4J7N8l8j1PL2n4j8M8J3j2j7J6M5n3j7K3J1jm2M1M2
$$ 22 3 -20 19 26 9 2 39 24 9 -35 -18 40 2 -9 -2 30 -24 -42 6 19 7 -10 6 51 -2 -19 4 15 14 -28 13 55
1336E5p9MJ4%pQMLj0l4N1L0m3oJ2K8m4J5ROL3o1RL1k2l3oM1kl8J2K9j4oJ1M2%
$$ 55 -24 -20 -6 -6 -13 -5 -1 2 -8 -42 9 39 -4 -10 2 30 -14 1 10 16 49 -12 -3 28 6 -27 -33 8 6 -32 -20 9 -5 -11 0 42 42
1373D2o8K7J6J6n6J7L3l6l7K7L4Jk7lON1l4j1oL4m4K9J0J2n2j5K3L6l1l1M3J3
$$ 42 -26 1 17 33 -23 -6 27 -9 -46 -19 15 16 -11 -14 -8 43 9 -2 -8 26 -18 11 21 33 -19 -34 -11 25 -6 -37 6 19
1405A9n1K0ML8m5J1MJ9qKk2J7K5m3J8Qnj8qK6Qo5M6K1j5k5kK3Pk5K5j0K1l1J8
$$ 19 -32 -12 -8 30 -15 -4 0 19 11 13 -9 8 33 -10 8 16 11 -7 -15 11 19 -46 0 21 6 -19 -21 2 9 -16 9 -1 20 -11 7
1440GK2ro0J0O2l0j0rN1k6n3K8M7qp2N0J5j7j1J7K3Ol3k8K3K9k9oJ8L2n0l3K3
$$ 7 29 20 -40 -30 32 2 -8 -17 34 8 -45 -17 30 22 -50 0 15 -2 -13 4 27 33 0 -28 -5 24 -5 -11 7 39 -11 -44 -21
1473b1O0l2j3mJ9qm5RL3K0k1j4P7l7l1NM9k7m9J1M5k1n6P1Ll2k9O5l6j4J9k3M1
$$ -21 39 7 -6 -10 9 1 -44 -35 -2 18 -3 -17 60 23 -8 -3 46 19 -30 -19 26 5 -51 20 23 -9 -38 27 -9 -23 -4 -27 14
1506A4L2m5k8N1J2o0mO9J8p4pN5l9j1J3M5Kq5J8N1j5J1lJ2pNm3pO0k9l5P9Ln8
$$ 14 46 1 -27 24 36 -24 -28 41 59 -15 -22 33 -6 -17 -4 41 43 -42 -24 27 12 23 20 32 25 30 -13 -20 40 11 -24 55 58 0
1540@l9J5Oj0K9j8K9l2NK6j1J3K2j8J2L2p7K6J6j0m0J7K4m1j5O5ll8J3J4j0J6
$$ 0 -39 -24 -18 -28 1 -17 12 -20 -15 11 0 13 35 17 29 61 -16 10 26 16 -24 -7 17 -24 -39 26 23 -15 -2 12 2 18
1572A8pJ5kJ1Ko1L9OKl1M8ro1J1K5Pq1O1M9p9K1J1J1nkK0K3pm1j4J7L9k0n4O2
$$ 18 11 26 24 35 37 -24 15 21 23 -8 40 31 -30 -19 6 13 -68 -7 42 -37 -16 -5 6 1 -1 19 42 35 -6 -20 -3 36 16 -38 24
1607B4nk1rJ1Ok2RK9j5l7J5K8KK3k6k2L5om2K0M0j0m2j5O2j4n2N5Ll8LQNmj5K1
$$ 24 19 -2 -11 0 6 -16 -7 22 7 -30 -15 13 15 38 12 -10 25 19 -23 -3 37 27 -15 -30 32 18 -34 21 24 -14 -11 -3 2 -2 -17 4
1643DJ2j7jj9M4Nm8J2K9ll5NN8l9l3K6Ml1%PK4J4j7qj8M6j3k6J6M1k0j8k1N8q0
$$ 4 16 -1 -2 -21 23 28 -20 -8 21 18 -17 -12 46 7 -26 0 4 -27 -27 -20 4 18 1 -7 -25 21 8 -18 -2 39 19 1 -20 38 -42
1678d2K0M6Nj6rJ6j4j8K8j0J9ql3QM7ol5JL2l0k8J9L1m6%L8Jm0KJ8LJ1jQj6K5
$$ -42 -22 24 29 13 4 20 6 -12 16 6 25 17 -16 -8 39 33 -2 -1 31 1 -27 -8 23 -23 -23 15 16 -24 -22 -4 -1 10 9 17 1 26
1714B6k9rJ7J1j7j6L0J7p0L4K1Rn1L4j8K4k6J0L1J2k9Jk2K4k4mL0K5m1k3J1J0
$$ 26 -3 -12 5 16 -1 -17 13 30 -40 -6 15 24 -27 7 -11 13 -13 -3 28 40 11 12 -10 14 -10 -14 16 41 0 -23 -12 -2
1746bMrL5j9k7k2P2rk6J2j5L0Ml0nROk2K5kk3J6kNj3j4L6n%k1K9K3j3k3J2Nl0
$$ -2 2 -7 28 9 -18 -40 32 23 -3 9 -6 24 28 -2 -7 2 8 -14 11 9 -14 2 0 5 -8 -22 14 9 9 -12 17 40 27 4 16 21 -9
1783ij3J0M8l3m1K0MK5l3j8N3j3nPK6j9nPjkk3j4M3J5k7k9N3j7j6J5jj3J8l4J7
$$ -9 -22 -12 36 3 -38 -18 -14 11 -22 -40 13 0 -5 2 28 9 4 11 10 8 -15 -29 14 29 2 -27 26 9 -7 8 7 -6 12 -22 -5
1818eL6j2l9K6J4j5KmJ1n1L0J7rJlk%Kj7KK6j1lnNLqJ5L0j8k1JJ7J2l6JJlpRL5
$$ -5 31 19 -20 6 20 5 7 3 14 -37 -7 10 1 2 -1 -3 -3 -1 -18 -16 10 -1 -4 -9 -4 -1 -9 6 36 18 -3 -2 15 27 -9 -8 -7 -10 -17 -8 27
1859B7j0m9J4J6L5l6nML1l9L7j1l2K7J8jk6Lm1M0QqJ3%Qj8m3N2J7k0oJ2Rk4J2
$$ 27 17 -32 -18 -2 33 -3 -8 -4 27 -12 25 14 -18 9 27 26 0 3 -38 2 10 2 15 15 23 5 -38 14 31 11 5 17 26 2 14
1894A4JNkl8J3K9k6lj9M5m1J8J4k8QjM6k1LlMj2j7K0Onk0k6K6PK4l2Nk6P2p3j
$$ 14 15 20 18 -20 -7 22 -4 -7 -26 19 -22 -4 10 -18 -10 -11 35 14 17 14 18 6 -11 9 15 10 -10 -36 -10 -3 21 -11 -6 -32 40 -33 -34
1931c4L8j0NL0Mj7JNOm3N5j9l9N2m3k3jL4k1K8n4Q5m8j5K0L1l8PJ2K6k7k2K0R
$$ -34 4 -6 -1 29 33 16 17 22 28 -15 40 21 -18 34 -9 -32 -33 1 -20 8 -46 39 -9 -24 -4 27 -11 -4 8 34 7 -15 5 14
1965A4j1j3LPJ2k6ML5j3rj1L6k9k6J3J0J3j0K6Jkk6k0N1k1j0k6K6LPm7K9%J5Q
$$ 14 3 -10 -7 0 12 -14 -10 25 12 3 -8 28 -1 -27 -14 -4 9 -1 25 26 24 -2 -22 29 8 -2 -28 -2 1 8 -39 -10 -10 5 13
2000A3j7KMJ0J6k7jK7j8J5rrk5L3j6j8K4L1m1j4J3J3ll0P1k6j9oK2l5qj2N0j0
$$ 13 -4 -2 2 12 28 1 0 27 9 24 15 6 -19 14 -2 -20 4 35 -6 -20 -7 6 3 -27 44 18 -1 -7 15 -20 -28 -40 10 0
2034@Ok5j4L7j7L3k0J0j3k2K1J9qj6K9j9J2j8m2P4l8K2j6J2J6j1j6J5J8l6k4M7
$$ 0 6 -19 -33 4 -13 20 0 10 -3 -25 -4 15 7 -9 20 1 13 -5 -47 27 -11 11 -5 7 23 12 -4 11 29 -7 -31 16
2066A6Lk9K2LK0m7J7RNl3J8JjpJ2k7K3Kj1rK5J1k5JL7m4j2L5l1L0l5J7Jl9N3m
$$ 16 19 -10 12 15 35 -12 5 14 19 -14 4 5 4 -3 9 -18 5 7 -4 -13 12 23 -2 -1 36 -8 -20 15 -16 14 -21 -4 -3 -42 11 7
2102GJ9k3m0K1J6%%pL0j7l0J4K3k1kL7Pl5qM1jm5K5j5nK4k8J0kL4m8K0K0j5J1
$$ 7 26 3 -37 -16 0 0 0 -7 23 6 -24 -10 13 -8 -10 27 34 -1 -9 32 31 -14 11 -4 -9 15 -13 -3 -5 29 -19 1 21 6 17
2137A7j8K9j0jOKj7k4JL3nJ8l3nj1k0N9j1Lj8qK2J0k8J2K2qm4K1lrlJ9j5J8mJ
$$ 17 -1 28 18 17 23 25 8 -16 -15 18 13 31 -2 -7 -18 -38 21 10 13 -5 -13 9 19 -9 3 25 17 -27 -6 -9 -18 -21 -2 -17 1 -3 -2
2174bm4N4Ql7L7K5k2l8N8n0K3qML0m5K2k4J8j4j0LjOJ7l2K2K2m4J6L4k5j3K8p
$$ -2 -46 8 16 -21 16 41 19 -19 39 -11 12 4 8 38 -7 15 -9 9 -5 -15 -12 -13 -7 10 -22 0 22 -22 -6 28 3 -10 18 11
2208A1qoJ4k8K1j0lj2K8j2KJ2k6L2%j5K1J5n3L8j4jK4o2N9j5j3L0k8L5k8l4J9
$$ 11 3 -3 11 -17 4 -6 -9 -21 7 -5 -3 9 -17 15 15 0 21 36 -17 21 7 6 30 -32 27 12 -1 29 1 36 8 -26 -7
2241gRJ2JJ0m3j2L5olMK1K2m3j2J6JJk0nJJ8mkK3k5%PJ1j9LkL9n5J9OL2l7J3N
$$ -7 2 14 15 25 -18 -30 5 -1 -4 0 21 43 0 -12 4 5 6 -14 -19 -18 0 -4 -6 17 -8 -8 -1 10 -9 -6 -8 31 -24 -5 1 33 -4 9 14
2280A4j9k9J4L1qL4l2k1%M8k8j4LJ3Pj6Qk1K4k9J4J5NJJ7k1k0Rj5M2k8J7lk4K4
$$ 14 -5 -34 -20 11 3 37 5 -16 -16 32 4 -10 -7 6 13 -3 5 -16 8 -21 -7 8 13 14 31 10 -10 -1 -16 26 -2 15 12 -12 12
2315A2lj1kJMK8Jk6j4K3J2k2MJ7qNj7l0L1nk8M4mmk3OpJ2J2k0M5j1j2Mk2L0k8
$$ 12 9 -2 -4 -3 1 29 30 4 -10 13 25 3 7 24 16 21 4 -26 5 0 -28 16 12 8 -15 -9 -16 -4 8 -12 33 22 10 14 -8 22 -6
2352fpJ0J0k4L5KOl3J6kJNk4PRnlL9rm4k1L1KJ4j3k%j1K4j1j6J6qLJ8kk9J9L6
$$ -6 -13 -3 7 -17 18 20 26 -7 9 7 8 13 -11 -4 5 0 -3 36 27 -17 -38 -7 -5 9 -4 -6 -6 -17 7 -4 -20 -4 -12 -9 9 7 -22 -3 33
2391C3k6K2j4kplj1JKJ9l3J2J1j9M2nk9LJ4ppmLmrMK8j6MRNl1QJ1JjJ2K%k8K7
$$ 33 7 29 15 13 6 3 -8 -7 -5 14 -19 -7 4 -15 27 22 -7 -4 10 3 -4 -8 -5 -9 -18 -14 14 -2 2 11 16 -15 -7 4 5 4 16 18 18 -10 17
2432A7J9j5m2J7RJ0j9%j5L9qk0L9m0K5Jm1N8l6NNjk1L3j6oj0K1l6J1M0j3pnOn
$$ 17 36 21 -21 -4 5 15 -4 -4 -19 20 12 -8 31 -9 16 17 -24 34 -2 3 8 7 -14 19 3 -3 -13 8 -28 -17 23 10 3 -2 4 -1
2468aoj4L8mnk9j0N6ll7K3J5l5K6l2J4K9k5L3o7N8j0j0L5m4K3jj7jj3QJ5j2Oo
$$ -1 -7 -21 17 13 8 -21 -31 25 22 -15 8 23 -12 14 -18 -4 25 0 33 -34 24 14 4 39 -5 18 17 0 -1 -14 -6 9 -3 3 -3
2503cK3Ml5LJKlM1j7j8j1lM7nk4lLK7l6j4L2j7j0qJ2K1nj7O%J2k6J8PL9k8k6J8
$$ -3 20 24 -11 -8 -7 -5 -8 33 16 -2 -13 -16 31 26 2 -1 2 29 -7 -21 11 -6 -16 -24 -12 9 4 -13 -7 -7 5 -21 -3 4 43 15 -11 7
2541GKrKpj2J2J1j3lk0L7j8pMJ6QKlnk1kK7Mj5L1k2k3K5mk0J4J0Ok4L0Lj8pQ%
$$ 7 9 0 2 -5 -17 -5 6 -7 -10 -30 7 -11 -18 -14 2 10 12 9 4 -17 -19 8 12 -3 28 6 -17 8 4 -16 -2 8 14 -10 20 23 5 -2 6 6
2581Fj0k6M9l1K6j7k3L5J4pj5j0J1k1M3j8j9L1j9K8l8J5j8J6rLll3M5L2n4MM8
$$ 6 -4 -30 19 -12 14 -3 -26 9 23 16 1 -9 2 -19 24 6 -13 18 -1 27 -11 4 -14 2 -7 -4 -7 -40 5 37 -17 -13 35
2614C5k6k3J2MK2k5Qlj9pK9k7K5nPoj6K2Kk3K7J4j2lNj7J4rJ9okJ3j4k6j1J2K7
$$ 35 9 -14 -2 2 24 -1 7 4 -15 -22 7 -20 5 0 7 1 -15 7 9 -14 13 27 15 12 17 0 14 5 24 18 16 29 15 -11 -22 -10 17
2651A7Ok7j3J2L1mk9J2PkqJ0rk1J4L3l9J5kJmk2P4n8J0oK1j1j9K4k0J1j0LM9m0
$$ 17 23 -4 -17 -5 26 22 -7 5 12 10 2 12 3 -18 -4 29 -10 5 3 4 0 -22 52 -6 4 -2 19 8 -11 13 -7 4 -6 -3 46 6
2687FQk2J8lk1K4j1JLj7J8k6L7j6qLl3L2j7K4%k2nK1j3L4jlk2POlJj5L2k%j5j
$$ 6 14 -8 10 7 -14 10 -1 0 3 -14 4 -22 15 -1 -9 -6 -39 -7 -24 0 0 -22 -27 -6 -19 15 14 11 -11 -4 2 -1 0 -15 17 15 15 0 -1
2726aj8L2Qj2lj3NJ1k1K7nj1K7l1QKjj0%k2M0k3Rm9O4k%j6KK7pl3qM5prj3K1N
$$ -1 -19 13 21 9 6 -7 -2 9 -12 15 10 -1 26 -5 3 5 4 -6 -6 -28 12 -11 -2 -51 13 11 11 -5 -3 24 17 -16 -24 21 14 5 -8 13 18
2765A8l1K0nojJ5J1j4l9J2J7nj7L4lJ2k5oJ6Oj0olK2J2l6J5J6m4J9L8k2oj2OO
$$ 18 -13 7 2 -4 -5 10 21 7 -32 -20 -3 -8 -25 9 6 18 -7 -13 3 9 -1 -7 -10 12 24 -12 3 19 -25 -6 32 10 4 -8 -2 4
2801Dk7K5j0L2k8Lj2K2j9kK4j0J4j9%jqK1rNj0rJ5k0QK8nJ3k6Kl3L3ljL7o9L3
$$ 4 -23 2 -8 24 -4 -1 -13 9 -10 -12 12 2 16 -3 -3 -4 -12 9 0 5 -5 -14 1 -19 -11 17 12 25 -1 1 -32 1 -2 -3 34 -35 -2
2838bKk4%RRJ1J2lnpPj6RJ4j5klM2pl2jj8N4k2k3PqK0j8lL0j9J1m9M4j0J5k4p
$$ -2 0 -24 -24 -15 -6 5 17 14 9 2 9 -7 2 16 1 -1 -4 38 31 -1 -2 -20 34 12 -11 -4 -12 8 -10 -13 17 -2 9 -40 4 -6 9 -15 -22
2877b2K9Kj3j4J9qj1oK7LK6k3Rk5koJ1J5j4J1J4kj5kmJ8lj2%J1jpK0j6l9L6J6
$$ -22 7 9 -4 -18 1 -7 -18 -24 3 6 32 9 18 -7 -9 -15 -4 11 -3 8 22 20 5 3 -1 17 14 2 2 13 12 5 25 9 -30 6 22
2914B2j7j4j4J9J2k7K3pK1Pl4J3rK4lO%Jk2J6J0k8QK0%k1k3J1K3pnRj3Jk5M9o9
$$ 22 5 -9 -23 -4 8 -19 4 -3 18 25 -9 4 -5 19 16 22 22 23 1 17 27 -1 7 27 27 6 -17 -6 17 10 5 14 1 2 -23 26 -43
2951d3L9kPK6k7LpJK2j9j2NJ8l9M4kl6K7qL1Nk3J5LjNk2KJ2j4k1J4K2m0Qj0j6
$$ -43 -4 -6 1 27 0 3 -4 -3 19 0 -12 -7 11 -28 16 14 -22 5 -3 28 33 10 25 28 27 32 10 12 24 10 -11 3 25 -15 -7 -17 -33
2988c3K9j0J4k4M0k6qL1J9n3O2l1k7K1k3L9Mk1j0pJ1kPJ3l3J6K0k2K9k0MqKpO
$$ -33 -4 -14 0 -24 16 -10 -18 13 32 -21 41 10 -17 4 -19 20 24 3 -7 -14 -3 -5 2 15 -18 -2 18 -4 25 5 9 1 3 -4 2
3023BK6j3j6JqM3o5QN0k4j3J1k1LK4rj1K7ll4M8m3L1l1K2K0n1K3K0kk4RjMjJ2
$$ 2 28 15 -1 0 -8 35 -30 -22 28 4 -9 2 -19 -16 8 -1 -12 15 12 -22 26 -17 14 -17 5 25 -26 -3 17 15 -9 0 -1 3 2 14
3059A4jk1J5J7jNqnj8Oj1K0oQPk2MQj4J7ll4J7J0l0K9mpJ5j7JrM4l3J2lPj0Pk5
$$ 14 13 -8 7 24 23 28 20 15 -3 3 -8 12 6 14 21 -1 3 11 -3 14 11 -23 -6 4 -26 3 -1 -8 7 -10 -9 -18 26 -7 5 2 9 -1 6 -19
3099a9J1J4pRK4j3k3RnJ6qqKk%rLMJ4Kj7j7J4j1j4L5Kl3L8mNj9kK4nj6J6Lkl9
$$ -19 -8 6 -1 8 32 19 -4 5 0 16 8 0 2 0 0 -9 -6 -2 12 14 -3 -20 -6 -17 -31 4 6 -27 11 7 12 -7 -9 15 10 -6 10 13 11 -28
3139b8QL7LJ3%j5pj6j9N5k4J0k0K1k1j5K7j0nKQj8rJ9j9RJ7J1lk4K0j5NK6l9J1
$$ -28 -20 17 20 33 33 18 11 -5 -24 31 7 17 -3 18 -3 -18 9 -1 -6 -4 4 -14 -23 -4 -23 -14 3 14 11 -13 7 -8 -3 23 -16 -5
3175eloJ0JJ2j4J9k2K0k8J6Mj4QkJ5k2J1J0l3L5j3J3Qj9k1K8l5J9kLJ6l2L5Kq
$$ -5 -8 -14 -4 -3 9 -5 14 -8 12 -16 0 4 -10 -2 -4 11 -11 0 10 -23 12 -1 12 20 1 -20 8 -27 -8 -10 -7 9 -23 12 14 6
3211FnJ9J4Ql8Nj2Pk8Mj0O8l4k8J3L0m1J8qK1kk9L4pj3KLJ0oj5j3L3NpmJ9j2P
$$ 6 1 20 34 42 4 9 -3 4 -24 -20 -30 38 4 -24 -11 19 -22 -4 -12 9 7 -22 12 5 -8 -6 -3 7 1 -14 -27 6 11 4 0 19 7 14
3249A4l4qM9jj8k4K4j3J8J8j9LpJ0j1K7l1NL0jMl6K1Jk6mJ0Ok7OJ3j4lj7K7Pp
$$ 14 -20 -28 21 20 2 -22 2 -11 7 25 6 9 2 12 1 28 -3 2 32 31 35 -1 20 21 -5 -9 1 7 -20 -14 -1 -15 -18 -35 -8 -1 -8
3286hJ3K0l3lL6j0j3L2rk8J8k4JJ1J1Kp1O2j9K9JOJ5l9K6j7rj8M1j9J9l3MjJ4
$$ -8 5 25 -8 -11 25 15 2 34 25 -3 15 -9 -8 3 14 16 -55 7 -12 17 18 24 39 0 26 9 0 -18 23 4 23 -10 -6 -7 7
3321Gm0J3M4l7j1J7j%J0J2j2j5J4k5j9P5k6j7J3%j6K2RrJ2j3J9l4OK0l4KJ0J1
$$ 7 -33 -20 24 -13 -24 -7 -8 -8 2 14 2 -13 1 -24 -43 32 6 -11 2 2 -14 8 17 8 20 7 26 -8 -2 18 -16 -14 -4 7
3355GPl3L7l2K4k1L7k9MJJ0KJ1l0J7j9l2M1nj1QJK0k4J9l%k3K7Ok4Lj1K6j2M0
$$ 7 14 -19 18 -14 10 -11 26 -3 1 2 12 14 25 -5 12 -7 -39 2 -3 -14 -6 -5 15 -9 10 7 7 -16 11 17 -7 -4 -15 11 -1 39
3391C9k1rj8J7Ok6MoK1pmL7o2M7j2k3J9k1M2j4j7J6j0Rk7J6K7k0j8j7M1k1OPr
$$ 39 18 9 -9 8 14 -12 -8 -14 7 0 -4 33 -29 18 6 -17 2 -19 23 9 -8 8 -2 7 -20 -4 23 3 -15 -32 9 -12 -6 1 -8
3426hPk0M0j9LLj2J8kJk6M2nk3pJ9k3J7Rj3j2j5M3k7J6j9OkKNoj7M4k0J6j2%J
$$ -8 -1 -21 19 0 3 6 -6 12 10 11 -15 27 22 -1 -8 11 -12 5 14 1 -11 -26 17 -10 6 -13 -7 -9 -7 -2 -8 -25 19 -1 15 3 3 4
3464DLRol1L0j6K5mk6lK0l8K4JK2k3J3jjJ6k7K6l0J6l2N5k3j4OJ5Mj9J4l0J3n
$$ 4 7 16 10 -21 9 -7 18 14 -12 -15 5 -33 -9 -8 14 -9 4 3 2 18 -9 17 -13 3 -29 26 3 -11 -5 10 14 -5 9 -21 -8 -13
3500a3pK8j4j1J8j1k1M6l2M2mJn3J9PqRRoK3jj2m0M3j6%J3%L1k9Rmk8nOL4m3j
$$ -13 -20 8 -6 -17 1 -10 -31 15 -17 25 21 22 -31 -12 -5 -13 -4 5 -1 22 21 9 -31 12 -4 -4 9 9 40 11 20 16 -12 -17 -11 23 -20 -21
3538b1ML5k6kj4L8k6k7J2KL9j2QJ8l0RNj2LkJ7Pl5NM8n5PrJ9k3J1J8l0J9mnJ5
$$ -21 -17 18 -8 -10 -24 14 -12 -39 -27 -25 14 2 10 28 -2 7 12 0 3 1 18 25 -10 -5 43 -12 -5 -14 5 -18 -7 11 -19 0 -4 -9 6
3575Fmjlj5K9l3K7Ok3%k0M7j1j1RJk2J6J0j2nJ2J1l2M9J2j8l7j2J6j3J0K6j4j2
$$ 6 2 1 -2 -17 12 -21 6 12 -11 -11 -31 16 5 -6 3 4 -18 -2 8 -4 -9 3 14 -18 31 43 25 -12 -24 -8 -21 -11 15 1 -11
3610a1J1j0MMj9O8n6nqL2j3Lj8J9J6om3J6qJ8lPL2o2K8mKK7lJ5k7nK4pk1L6n8
$$ -11 0 -10 -6 -2 -21 47 -9 -14 -22 10 -3 0 -18 1 17 11 -32 -16 -24 -6 -9 -2 30 -32 -4 -8 -6 21 18 33 6 1 25 18 -3 33 -25
3647b5L4kJ5rpL7m1J5j4k5MKkJ3mL9l6PJj5J5Kk6K1qJ5J2m9M1j0j0J4LK7ml0L5
$$ -25 9 7 22 13 6 43 2 17 3 -22 -18 -16 -18 -5 -9 30 -6 1 2 -13 2 4 -22 -1 -9 6 18 -31 10 0 -10 4 7 34 30 0 35
3684C5pk3J1l4K7Mk7Rj0M6k4nj2RL2l4mj8J9K3k7K8l8K2lK0Lj8j4RqK7l0J0J5
$$ 35 28 5 16 -18 9 13 -14 -5 -15 31 7 2 -10 -1 31 -3 -7 -25 -6 17 -10 18 -20 2 -1 19 22 4 -10 -1 -9 18 -12 -2 13
3719A3l7P2k0k6J2rL0l9L7k3k8%j0K3rJ8Lqk8K8jj2L2k1Ql1N1Jl5jN4l0j1J0r
$$ 13 -24 48 28 2 14 5 35 -4 33 10 -18 -18 -28 -5 -14 4 7 -1 -29 -1 -2 -14 18 -3 5 -26 25 26 -9 -10 44 14 3 13 4
3754DpjoL6j8k1oK9l7M5J1k6RmJ7Nj0k0Nj1j9J7K7rl2K4Nk9L9k8qJ6Mkj3K1mn
$$ 4 -3 -4 -10 26 8 -13 -19 10 -27 18 29 3 12 8 25 30 20 0 5 -6 -25 -8 19 10 -22 2 7 -22 17 -11 -19 -3 1 -1 -14 7 3 -2
3792bpJ0JmL5k4L0k4j6J2k0K6j2nOJ6k6J8%J4k1mqLO%j5RoqJ2J5Ml4J3K8j8rJ1
$$ -2 -9 1 2 -2 33 9 39 15 -1 11 -9 17 5 0 6 22 -4 14 14 28 7 3 -5 -2 4 4 -11 -2 -8 -16 -4 11 15 -19 -6 22 4 -5 6
3831Fj0j2J6lk4M0Jk7PL4rrROk3J7mnJ0k4lkRJ8k8oj8K9%k6J8JoJ3PlqJ7ml3K5
$$ 6 -4 -16 0 -3 -27 13 14 -13 -6 28 19 10 19 25 2 19 15 10 20 -4 -7 -9 0 18 -10 -16 -34 -5 -5 -31 -13 -12 -18 -5 2 -1 -9 8 4 -29 -4
3872dKj0J9k1j9lK5nK0k3J2J1j0%K1j3j3RmPj6K2qQK3j8J2l5kJ3J0j1lonOK6j6
$$ -4 -2 -12 7 -14 -33 -36 -11 -16 4 -19 -7 4 -6 -6 15 2 -11 -2 -6 1 -15 7 -1 7 30 12 24 -11 -13 0 10 -1 -4 -10 -15 -9 17 1
3910Ak4K8k1J6j3K7Kl0pPLJJK2rJ5l4J1oJ9o%%kK4mJ2m8K7Lmk1O%j1J6jjj6pJ0
$$ 1 -23 5 -16 0 -13 14 16 -14 -21 -14 -11 -10 -9 13 4 19 -15 -4 -10 9 3 3 3 1 25 21 33 -15 12 15 11 -10 -4 -4 -15 1 0 -1 -17 -24 -14
3951a4J9rK0K0m4nJ5j8%K0Rnl4N2j6kJ3j2l6K2nrM6j8qQn4L4j1K3JJ7j4j8K2k0
$$ -14 5 -4 16 36 -8 -13 2 -16 -16 4 13 8 -26 26 10 8 21 9 -27 -5 -10 -19 27 9 1 9 -45 -11 -22 1 2 19 5 -13 9 -11
3987a1L9k7Nj0j4K8j8J8j2ljJ1rRPk2nJ1jRm1K0nJ9oK5j0J0Pk2Ok0OJ7J2k5lj4
$$ -11 28 1 6 -4 -18 10 -8 10 -2 -5 -6 5 -4 5 12 -10 -15 -4 -5 4 -37 -17 -22 -3 -9 16 6 16 23 1 7 -13 -7 10 22 -3 -6 -20
4025b0K9j1MNk1J8k9J3JJQj9L2j3%nJ9Rol6L1k0K6qOm4K2j3L5J3k6LJ4l5K0kM
$$ -20 9 -2 2 7 -14 4 -25 -12 -11 -10 -2 -21 11 -2 -2 -7 12 21 15 -21 10 -10 16 8 14 -30 -8 -21 14 27 1 4 18 -17 3 1 5
4062EK7j9jOk8J6j6k1K8kRj6K0l2J3pK6l6L5j3m%L7j3k7Nj1K0%oRrL2m7K9j8J5
$$ 5 32 13 12 18 -10 6 -10 -31 -3 -5 4 -12 8 -24 -11 -18 8 -28 7 -6 -10 -10 27 14 -13 -8 -19 1 1 -5 4 -5 27 -20 9 -9 6
4099FoKlpJ6J5k1J0k7K4j8NkOjj0PJ9l8jMlK3nPRj1%J9l8K9j1JK2k2LKj0J6kJ0
$$ 6 0 2 -1 -8 8 23 2 12 -15 9 -9 -4 -6 0 -1 -11 -4 15 -23 -24 -20 -23 0 -5 2 11 0 0 19 -19 10 -1 0 22 0 3 5 -5 11 9 19
4140A9pK9l7J5j9j1K3jkkJqk0NpK8L5m3Nqj8K6%ok5K6oJJ1%J0k9K7jKQj1k9J3
$$ 19 12 41 4 19 0 -11 12 11 9 7 8 0 -20 -15 -22 6 41 -2 3 -5 -23 3 3 -3 -28 -2 -8 -7 4 4 14 -15 12 11 13 21 10 -19 -6
4179fLkKk3L0Lj8J3%j0J7l3L4Kjl0K1Qj7oK8pj7rK9J0m5J0J7J4Kj9K2Pk7k0J0
$$ -6 -3 -5 -3 -26 4 7 -11 2 2 -8 9 -24 10 12 11 -19 2 10 -7 -13 15 8 -9 -18 11 21 -24 -14 3 17 19 0 22 29 2 -18 -8
4216hK2jj9j2J8Mk0K9J3Om7J0J0qMoonQmJ3oK2rk2L5l4K9k6K3j1LlMrj2K0Mk9
$$ -8 14 13 -6 -18 0 4 -16 13 26 32 -15 -5 5 -3 1 -5 -11 -16 -8 -12 1 -5 17 8 -14 21 -13 16 -10 13 2 5 2 6 -3 -15 5 9 -20
4255b0J9K3k8OJ3%l3K3ok6L0KqK3j1K0k6J1Rj4lk4K3Loj1K3j2j4J8JQl3N1k5N
$$ -20 -1 22 -6 0 13 13 -20 3 -3 -29 1 3 -5 18 7 27 1 12 21 7 4 -20 3 6 0 -11 12 0 -14 4 5 13 -20 31 6 11
4291A1Jj9qK5Ol8J3QK1l1L5jj5k1mJ7J5nLl1L3qk2K3j4qM0m5J3J4k4K3K4l7K2
$$ 11 12 -7 -15 10 16 -22 -9 -1 20 -11 24 23 8 -13 -17 0 15 10 13 -18 15 7 -15 8 -6 -14 26 -19 -6 8 -16 7 31 -6 16
4326A6j5l6J6L8l1MLpK1k4LJ1nj0K6J4nj3MOLJj1j1Mj2K1j0j5K7j4J4Klol0%%
$$ 16 1 -35 -19 19 -12 -8 -5 -12 9 -15 -12 -1 -6 -16 10 24 19 6 10 16 19 20 9 -2 2 -10 11 1 -14 13 -1 13 15 12 6 -24 -24 -24
4364b4K6k8N9n1kJ6k5L6j4jJ1j0l0J5K7Pn3K8k5L0L6l8lL9k7J1nKLjj2K4j7k5
$$ -24 2 -26 33 -18 -20 -4 -29 7 -7 -8 3 -7 -37 -22 5 12 -41 -13 -38 -8 28 -10 -13 26 -1 10 5 7 10 9 -3 21 4 -21
4398b1L2k6J4k7K0%oKQkmJ8Kl7QJ3kK9j7pMJ6Lj6j0J5j1Qj7QknJ3K1j5k0NnK9
$$ -21 11 -15 -1 -28 -8 -8 -14 -12 -4 -6 -10 8 10 -27 -19 -6 -8 21 4 -3 1 17 20 4 -6 9 -2 6 -11 -3 -5 -10 3 24 9 -11 -6 -11 18
4437A8rloJ1L9m1j7QJ9Mk0pmJ8k3J0mrj7M5n%k0qK2mMj7K5JJJ6j4j1rJ8%l4M2
$$ 18 9 6 0 11 50 9 -8 0 19 23 3 -4 -8 10 -13 -3 -7 -16 -33 12 7 7 -13 -21 1 -3 1 -16 9 10 11 27 13 2 -7 11 11 -23 19
4476A9m3K2J8jNl3k6LM0K4pRn6L1k8J8pj2nL5j9J6%j5J7j8L2k3K2l7J5J0Pm3L3
$$ 19 -24 -2 16 15 20 -13 -39 -36 4 28 21 30 -26 5 -23 -5 -12 -24 -29 6 -13 3 3 -12 5 -13 19 -4 18 -19 -4 6 13 -30 3
4511CRl5M4j0l6M5jk1J4Qk7J3Mnnj2J8MRmJ4j8m0K6KJ1Nk3J0j5J5j4K9M%j8kn
$$ 3 12 -23 21 11 -25 20 19 -2 12 20 -7 6 10 5 0 -12 6 10 19 15 29 11 -29 -3 -1 10 15 -8 2 -13 2 -12 17 21 21 3 1 -4
4549djJ9j5QJ1j8J4nJ2j8J6J0Mj2Rj9Qj1j2kK0l0J6kj7K1pQMk7qK8qpK3qPl0L4
$$ -4 -5 14 -1 7 18 0 14 9 21 3 19 29 33 21 30 11 19 8 -4 -6 14 -16 0 -2 -19 2 -5 3 7 -20 -28 0 -8 -15 8 0 7 -23 11
4588A1j6J3N2p1J6J6koLKk1jJ3k0j9M7l4K1Jj0J1j3PoJ0rNJK1k9K5j7j0%J1k1
$$ 11 -5 8 60 -11 5 21 19 13 16 18 -3 -4 9 -11 -30 17 -17 4 5 -5 6 -7 0 -6 4 -5 0 1 22 -7 18 1 -9 -9 2 -19
4624a9N1k6JK1k8j5J3J5pjj1M5k7qMJ8j6lJ2k4J6l2L1qjl1L6MqJ2m8L1LLK%lJ7
$$ -19 32 6 7 28 0 -15 -2 13 6 5 -6 39 12 4 8 26 10 7 19 -5 11 -21 10 2 1 -30 6 10 2 14 -34 -3 0 3 5 5 2 19
4662A9Jk8qkJ4mj8lM4k9K5J5k2Mojj3O1k2p2N7jj9L9j0j7k4N2m9J5ml9L2k%pJ6
$$ 19 20 -8 -16 -18 -4 -8 -26 -29 15 -14 11 26 4 8 2 1 -12 49 27 -45 12 11 -8 31 21 4 -20 32 -17 -2 -6 -45 -13 -15 -15 -22 -6
4699fnjnJ6J1oj0J9l7L6j5J2m4N9%l0mqOlL1k4QL8m5j2%J6jjK0k1MNJ4j9K1mk2
$$ -6 -11 -12 -17 -1 10 4 -6 13 -24 12 -3 9 -35 24 24 -6 -10 -18 -12 -15 16 -8 0 38 -7 -19 -19 -3 -4 -5 15 -6 -2 3 17 -2 19 15 -7
4738gJ0mj9K2j4J4j5kLJ0J0NnKl0K4K7l7K4j5K1j4L1k0J9l0KRm7L0J1m0M0j4L
$$ -7 3 -1 -20 2 -12 2 -13 -15 -12 -2 8 13 8 10 -20 4 31 -6 18 3 24 10 41 21 40 10 12 21 -26 4 15 -25 15 1 4
4773DJJ7j9L2m3K1knj1J5j1j4K6qLJ4k3K0l4J3J6k2K0k3K0j3pJ6JKoJj1J8K1l4
$$ 4 5 22 3 35 -8 13 11 6 -5 10 -1 -15 11 3 6 20 -3 17 -17 -4 12 -10 10 -13 7 -6 -13 3 4 6 0 1 -10 8 29 -5
4809eJ7k3j1L2j1OkJk0J2j7J3%rnJ3K5k3J2j6nM8o1L2j5POJ4l4N1m1Pj7KJ8j5
$$ -5 12 -11 -22 10 -1 5 3 4 -16 -4 -21 -8 -8 -17 -22 -9 16 -7 5 -11 -16 32 -29 3 -12 -5 1 15 -19 32 -9 -2 -19 -17 1 -14
4845a4L0j2J2k5RnJ9J0j0j1mJ9j0Kq%J5oj2j3nK6j1J6j6OOk1J6k7L2pk6J0M0m6
$$ -14 16 4 16 -9 0 -5 14 24 14 3 -1 18 8 10 2 2 17 11 -1 -14 -19 7 -4 12 -4 2 8 -13 3 -24 8 1 -25 -15 25 -21
4881b1jLK0jJ6pkj6K2j2J3l0J0J0lMJ6mk7lK4nJ4l3J1NpM1o4M6j7OJ0m9L8l1L2
$$ -21 -22 -19 1 0 16 9 7 -9 13 1 14 -16 -6 4 1 5 21 17 -10 -13 11 6 20 -13 -2 3 -4 37 -27 19 2 8 18 -31 7 -24 8
4918HpNpLL1k6j9M6m3J3nJ8ok4PQj0rJ9Mpk2J8RPmk9K6K4lm7J7lkjJ7%k7J5k2
$$ 8 1 6 -1 2 33 7 -12 34 -9 4 -1 17 11 -13 -6 2 -8 -17 2 6 -1 -23 -5 4 11 7 -22 4 28 25 -22 -5 -8 -10 -11 6 6 -21 -6 -28
4958b8J0j2LJ1k3M1Rl2J5qKM4k8j5lpJ9MJ4lj3J7l6K8pJ3nk7K3mj4jKK3j1kKk8
$$ -28 -18 -30 -27 -16 -39 2 11 -21 -6 -14 -12 32 4 -11 -14 -21 -2 2 16 13 0 17 -19 9 2 15 10 -17 6 2 -12 -13 -11 12 1 -1 1 -27
4996b7K3nJ7k2K1k8mOM0k3qJLK5k9Qj4K1j5pL7Pj1j5rL3l4J4J3j1Oj4J2j8j8M
$$ -27 -4 -9 8 -14 7 -21 -25 -19 21 -2 -10 -9 -6 19 -10 -2 -16 5 -10 -17 20 27 16 1 -8 25 -9 5 18 7 13 -1 11 -7 -25 -21
5032b1J3J0k8J6K2j8jl0K8mnL5l1oJ4LrL5l2K4nj0j3K2k1rK5k3Ok3OL7j5lK0k0
$$ -21 -8 2 -26 -10 12 -6 -7 -37 -9 -13 -18 17 -14 -20 -6 -3 -12 23 -9 15 10 0 -13 9 -12 -21 4 -19 -13 -36 -30 7 -8 -11 9 -11
5068a1J9qj3LJK1Mpj5J6Lk5%M2m8j4J1K1J5k5M0p4O9om9K7%PRj3J9j5mJ9jj6k6
$$ -11 8 0 -13 -10 -9 12 16 9 -6 10 13 -12 -12 30 -18 -32 -21 0 15 -10 30 -44 25 19 -30 -3 -3 4 13 0 19 4 0 19 18 2 -24
5105b4K7m9M1k4K5KkJ7j3J6m1j5M6mrJ7l6L5l5K0J4j4Oj7J8mmmK3k9mK1J5j7k
$$ -24 3 -46 -5 -29 -4 -2 -4 13 0 16 -25 -40 6 2 -7 10 -26 9 -26 -6 8 -6 0 -17 1 -3 -7 -11 12 -17 -21 0 15 -2 -4
5140dPJ2j8jJ6j4j5K5mJ0k7Kk0J8M2l4k0K9k8L1pj6oJ8oj1LL7j4j5LRJ3Qm1K1
$$ -4 3 15 -3 -4 12 -2 -17 8 4 14 -13 -11 -31 -13 29 -5 -25 4 -24 7 0 -16 -22 -4 -10 -21 -18 19 5 -10 -7 2 15 23 -18 3
5176Ck4M1m5J3j6M2j0l6M8j0kj8J7n%K6j7k4K5jj6jnk0J7K9j7Rlj8K0j3K6n3N6
$$ 3 -21 20 -25 -12 -28 14 4 -32 16 6 4 -14 3 -2 -2 24 7 -17 8 7 -9 -10 -15 -35 -18 11 -6 3 0 -18 2 -11 15 -38 18
5211A8j3pJ4j2mnQNj7L1k6j8K9j3kQK9m2J0OJ0k2LL5k4K1j6qk3M6j2j8K2j3nl5
$$ 18 5 -2 12 0 -4 -9 -1 4 -13 18 -8 -26 3 -10 -12 -4 25 -17 -7 -1 9 -13 -10 25 1 22 6 -2 -25 21 9 -9 13 0 -5 -40
5247d0M0%RJ3j8K2l5NQMRj8j0K7j6J6J1j3J2j3j9L9l2J5k8%j9J9PLJ6l3L7qj2
$$ -40 0 0 9 22 4 26 -9 -4 4 8 17 -1 -11 16 0 16 27 14 26 13 -6 33 1 16 -12 -12 -31 -12 -5 -2 14 -19 18 10 -2
5282bRk9J0k4L1K8l3PJ4lrjJ1j0J7k7J6j6pJ4J3norM6m2J7j1NnK6j5j0M%pJ0J0
$$ -2 7 -22 -12 -36 -5 23 -10 -3 11 8 -1 -2 9 -1 16 -11 5 -11 -18 -4 9 4 -2 -11 35 -7 10 -1 4 -1 25 10 0 4 4 -3 7 17
5320A7k4LKqnJ0j8J2pJ6mL6kKj7j7pJ7K2ll5RJ2Nl0L9j7j0L%%Jj7J2N0m6K1j6
$$ 17 -7 -4 -2 -10 -15 -5 -23 -11 -18 -2 -6 30 28 30 13 -4 -11 6 28 25 -10 -1 11 16 -14 25 8 -2 1 1 1 2 -15 -3 47 1 22 6
5358F%Rnqmj7L8n0K2J9j4j8K6j4LL5j9k7mL0k5PoK4Kkj1L5l0j0L6l3NPml0L5j0
$$ 6 6 15 10 2 -2 -19 19 -31 -9 10 -4 -22 4 -10 -7 28 9 -18 -22 8 -17 -10 -16 8 10 8 -3 32 2 -8 28 -5 0 7 3 -27 8 -2
5396bj2K7%k6L4k1qkJ7J2l5pK1qOK9l1k5LL0K1j3j1LrJ3Nm1K7J0k3L9k9RJ5k4
$$ -2 -14 13 13 -13 21 0 -8 -10 7 19 -16 -23 -2 -10 -4 25 -6 -31 -28 2 23 10 -1 2 -7 6 11 -30 -3 7 -16 23 -6 3 18 -6
5432fmJ8j2lK0Rk6j7K9J1l5LnL3l9L2k1J2LJ7oj7nlJ2j2M2l9J4j7J1olK4k9LK2
$$ -6 -10 8 -4 -7 13 22 -4 -21 8 19 -16 -13 -18 15 -24 8 -13 -1 2 19 13 -4 -9 -12 0 -12 30 -9 5 -12 -1 -7 -10 14 -15 -12 10
5469A0J4n0K5J1l3K8RJl9K4pK5j6j9Pj0Pj2J7pmJ4jnLjj6L1llJ1k0K1olk2K3j9
$$ 10 24 -26 -1 10 -23 5 14 15 -24 0 -7 18 2 -17 -10 -20 -13 -25 -8 -15 -19 -5 -6 -11 -8 -9 -25 6 3 0 11 -9 12 6 3 -19 4 -15
5507a5k5M4j9NJ7k4J1N3n2rK2j3PpJJ5PKl3K5j9QJqJ8j7j2Oj8N4l1Nj8L0j4Qr
$$ -15 -40 4 -15 -10 7 -17 -6 47 -5 -14 8 -5 2 -5 -4 11 18 20 -13 12 -7 1 2 -6 12 -5 -17 -11 -29 25 -6 -1 -19 11 -3 5 -4
5544dj4QMJ8j7N0m8K1ooQj2j6J4j6j3K4Jj0OL0m1L3j0j3J2pk5K4lk0M2k3mNjO
$$ -4 -18 -10 -6 12 -5 45 -3 18 12 6 14 2 -14 0 -16 -29 -5 -4 -14 -8 22 -19 14 4 -9 3 -4 -29 -5 -8 -28 14 -9 -13 -8 -9 -3
5581clRJNj3Nkj3NjRMqK2J6nj5K2j4k6K4k8L8k3KJk4M1ml1nRK4k3J2j2K1j3J2
$$ -3 -6 3 4 9 -4 1 -1 -14 -9 -10 -1 3 -5 17 33 28 13 35 21 -5 19 -9 29 6 8 9 -15 26 22 -9 -14 -5 19 -4 8 -4 17 4 16
5620A6k1K0m0K3oQJj5J0oK5j4M7n0K0Opj5JjL2j5kMNj1MLk9L1rj8KNk2J3J7rk9
$$ 16 -5 15 -25 -2 -8 0 1 -14 -4 -10 15 1 48 -2 18 24 17 2 3 2 34 19 17 21 26 15 19 22 -7 24 15 -3 -1 4 -18 -5 12 3 -26
5659b6J9J5j1j4J8pJj4M3j7RLk4%RRL2k8j1j0Nl0L3%Rj6KK0l2K6j1J0k0j0L2l1
$$ -26 -7 8 -3 -17 1 -6 -5 -19 24 7 16 19 -5 -5 4 13 45 17 6 -4 1 -29 4 4 13 -3 -1 19 -13 13 2 12 -8 -18 14 -17
5695a7L1ljNj3jJ2l5j5J6K1oqK4Jk2j4L5j1J5J4k3qpN2j1j4KlJ7j3l2%J2j1J8
$$ -17 14 11 10 15 2 1 13 -22 -37 -21 0 -6 -14 10 11 -11 -25 10 -1 14 28 5 -3 -10 42 31 17 19 16 33 20 -12 -12 0 -11 7
5731Gj4LJ0k9L7j0RLj9QJ1j5K8k2Mk0NJ5j8Pk2J8j0MJ8J4k0nJ1KJ7jk7NJ8k6K7
$$ 7 -7 -4 6 -23 14 4 13 16 -3 5 16 1 29 7 11 -9 -4 11 -7 0 -22 -4 -14 -10 8 22 2 -3 8 10 27 26 -1 4 22 -4 23
5768B3l6K1nMk5J1K8k8J1j2kK5j0j5%J6j0pjJJ0Mj0QqK4mk1OnJ4k1J1J6m6K4L3
$$ 23 -13 8 3 7 -18 -7 21 -7 4 -8 -10 15 5 -10 -10 6 -4 -11 -12 -11 -1 3 -7 1 -7 17 13 -8 -2 -7 7 -14 -3 13 -33 -9 24
5805B4k6nRm6L1nL4Jj8Okj3J2Jk0J4J7j8Oj3J4jj8J7l0J7Qk6M3j5LKj9K0j2Ml
$$ 24 -2 -7 2 -44 -13 -18 16 17 -1 5 3 -10 2 3 -17 -3 14 -4 2 -11 3 2 -16 1 -29 -12 -4 -30 13 -2 1 3 -16 4 -8 -4 -7
5842gM2k4j4L9m4J3Nj1oJ7j2rJ9mj4RK7l4L8j1n1J4OJ1JjJ6m5L7k5k0L8j2k0l
$$ -7 35 11 -3 36 -8 5 10 -1 -7 10 -2 -11 8 4 -10 -1 26 -8 30 19 -32 -18 -12 -1 0 -1 15 -30 7 -18 -38 0 -12 -32 -35
5877c5K1L4pk0j1MJ3KL8k8Jmk1L1J0k0lpkK6j9qlPNj2KJ1lj3j9J5L1j0K3j3j7
$$ -35 -14 20 13 -7 -18 -14 -1 1 39 11 12 8 -13 18 28 8 5 -2 -4 22 3 -5 -8 -1 4 -8 -6 5 2 -11 -30 -15 16 6 29 16 -1
5914aj1K9l5K4%j2J2NJ0k8kLJ6J2k6L1k5J6rQoLJ8m5OrJ2L4l4oNj0J3Pj1J9m4
$$ -1 -12 17 -18 6 6 -6 6 11 21 -7 -9 -6 10 22 -4 27 2 18 9 17 11 14 32 -13 -7 -16 -4 30 -4 -10 -5 -15 -2 5 -6 13 -31
5951c1K6Oj1mJ7rMRj1K0j8J4K4k7j3K7m2J5J3k1K1l4K4j7j5L9j8K7oj5PlRj9K2
$$ -31 -5 1 -10 -14 3 -6 -2 7 -4 16 -2 12 36 9 -4 23 -19 -4 9 -12 9 -25 -1 -18 -33 6 -12 15 9 -6 1 -2 7 -12 10
5986A0j4J8k4J2JJj4J7j1k6OJ8lJ1k2L8k9QJ3lJ2m2J2J4PK3j2k2J9k4j3K6J4k4
$$ 10 -4 14 -10 2 3 4 -10 7 -4 -30 -24 -6 -9 2 -20 18 -11 -3 10 7 19 -23 -11 3 10 33 21 -1 18 -6 -19 7 21 -3
6020cMMj3oJ5j6L6k9J6%k4p%L8j0j5J2k6M9m7L0Kl6K8l1O4n0J6Jj1RKlK3l1qK9
$$ -3 1 5 -8 -14 1 -15 21 -8 8 8 -16 -23 -23 15 5 -10 2 -24 25 -22 8 10 -26 2 -29 35 -15 1 2 -9 0 2 -1 22 -9 -17 12
6057A2Qj9j2OK3k8rrJ5J0K1o%k2NNj6J3j4L3k1pK5lpkqj8RjJ4J7k0MRjMPj0Lo
$$ 12 20 1 -11 -5 18 -10 -19 -28 -13 -3 18 12 12 -10 -5 0 -16 -3 -17 16 -5 -12 13 10 3 1 -7 -25 -16 -17 -3 14 -6 -2 7 6 10 17 7 10 4
6098DJ1l3O%L9j1Nrj1koJ6j5Rk0pJ4Jj7L0j6j0K3%lK0k9K8m3L3%Qj7OJ3Qk0qJ1
$$ 4 15 -18 -12 -12 27 16 21 12 1 -1 -7 9 -6 3 -17 -24 -10 -9 -26 4 -12 -22 1 1 -2 18 -11 17 -26 7 7 15 -2 4 17 25 5 -3 8
6137Hrj4QNN1o2J0qpM5m8N5k0j8Qk2LK9nk6J2jOMmmj2K0K1n8RMPPJpK1j9M2j4
$$ 8 -1 -15 -7 -2 49 -13 -3 -11 -18 27 -21 34 14 -4 4 -18 -15 14 9 -17 -5 -6 0 4 0 -4 -16 4 25 -33 -24 -20 -13 -6 -5 -12 9 -10 32 18
6177A8l2QJ7nj4J8nJ6jJK5m2kJ6l8L2j7l3K7Nj1M9n4NqM1k3M0k6LNNl1RJ7k4L4
$$ 18 -14 -6 11 6 -8 10 5 21 20 21 46 4 2 18 -20 12 -5 -38 -11 -6 -17 32 -22 -17 -25 16 -7 33 7 10 15 20 -11 -2 15 -9 25
6214B5k7OJ0rJ1k3Mj9J8K2j5K7l5jrL0l7K6orQJ2njrj3kmMRlJ0MpK7j1k2J7j0
$$ 25 -2 4 14 5 16 -7 -3 -22 -4 18 3 30 -5 -6 -15 15 -22 4 -2 -11 -3 9 4 3 -6 -19 -21 -25 -21 -12 -15 -5 -1 -8 19 8 -14 3 -7
6253gkMK1j1k2J5j4Oj6M2%l4L5k5J0NJlj1L7l6PMkJ3rKl0L2j4mrK4l0L6KJ0j9
$$ -7 -9 -5 16 5 -17 -2 -16 -10 -26 16 16 -18 17 -8 2 7 8 5 -6 31 -5 2 6 4 17 8 10 -20 12 -2 -6 -15 9 -21 15 17 27 8
6291Hj1LPK0k7JJ5%oj4MJ1opj2OqJ6K9l1N0k4j7j2lmK5j1j2J3j8LJ7Qj2J6j2k3
$$ 8 -3 0 7 27 0 1 16 16 10 -4 0 11 5 -2 -14 -8 -16 0 29 -2 48 24 7 -5 -8 -12 13 2 -10 3 -15 -12 5 13 1 17 5 -18
6329a8lJ5kKJ1J5j0l5K4qjMRK0m4K3j6J2Pmj1J3oRmoK6m9nL1j2plJ7nPj4MLL3
$$ -18 -21 -6 -8 -6 5 20 10 -25 -1 -9 -10 -6 3 23 -21 2 -14 -2 5 1 -10 3 -3 6 2 -4 22 -27 -32 -1 -13 -20 -23 -6 -11 -4 -18 -14 -11 22
6369B2l1J3koQooj6L8m3L3k1J8k6M0k6PJLRj8L8l8J4mK1j3K0ll2j6L8m0J5RrR
$$ 22 -9 4 2 -4 4 -2 -8 -24 14 -29 4 -17 1 -25 15 -11 -4 -3 0 9 -9 29 -9 5 1 22 9 29 26 -6 -22 16 -24 -9 0 -9 0
6406@J2Ol3K0j8K6l6J8KrL4k5rL2lm0K8l2M7j5j3j5L6j1nKj7K3NKj1J5rmj5L0
$$ 0 12 18 -15 5 -13 13 -23 -5 -3 -12 22 -3 -12 20 17 -23 5 -27 20 5 -8 -23 13 2 -3 -1 -18 5 10 12 1 16 7 3 -12 18
6442A8Oj0%j5pK3l6K7k3PmJ5kRMj5j1L0pl2J6K8oJ0Pn0L8j7K3l4oJ0J6mkj4K3
$$ 18 24 14 14 -1 -8 15 -21 6 -17 -10 -14 1 -1 8 12 -3 -14 16 9 -23 -7 21 15 25 32 -18 20 3 26 -8 -14 -4 12 8 6 -8 15
6479A5k9K9m3M1j1j1pK6oj3J6LKj9j5K7j9L2l3nL6m0K5k6L0K3j2k3M1n6L6k4J8
$$ 15 -14 15 -28 13 2 -9 -16 10 4 -9 7 10 12 -7 -22 5 -14 18 -15 -20 16 -24 1 -25 5 28 16 -7 34 -22 14 -10 8
6512Hj0L4l6M%j0J6mj0L0J2l8QkK2l6nJ7K3l0RJ9k4Pjpk7N9l3J2LJ5k9K4nK5m4
$$ 8 -2 32 -4 0 0 -10 6 2 -8 22 34 -4 4 2 24 -12 -17 0 23 -7 2 21 -3 4 3 -4 -31 28 -5 7 10 25 -4 20 15 40 -4
6549djNppK6Nl1J2OL2k6j2j0J4K4l3Oj3NK6k1qJ8pK1k3j1K7qj0j0jPj3M4l7QL4
$$ -4 -5 0 -7 -14 12 17 -14 -2 4 36 10 -2 -12 2 26 -7 -1 -14 -9 17 -4 -12 6 -1 20 -3 -14 13 5 -5 -15 -16 -9 -22 22 -15 -7 27
6587B7j7jj8K3K4n0NnJ1k3L4rNj5qL3j7onK0l2K9K4k7k9L5j2mJ1j4ORj0jqKrR
$$ 27 10 9 -9 14 38 -12 -7 -12 -1 -24 10 1 6 -9 -17 16 -1 -7 -12 8 -24 5 29 2 -27 8 -4 -8 3 -11 -5 4 -6 -7 -15 -13 -22 -13
6625a3j4M2k0K1k4L4qmpJ0J2j0lRk1J0Nl3K2J0j2pMj3J0j4LJ7Qk0kRK2k3j2J6
$$ -13 -27 15 -5 16 -8 26 18 14 7 17 29 19 16 25 4 14 19 -14 8 18 6 -1 3 -10 0 -14 -11 6 14 -6 -8 1 23 0 -12 4
6661Dj0K3l9J4%j9M3j0qj5QK4J2k3k3K0j1J6RokqM1k9kK0rJk0J7j5j1nK5k8O%
$$ 4 -6 17 -22 -8 -8 -27 16 6 -2 -17 -9 15 27 4 -19 1 -10 6 15 9 7 -1 40 11 9 29 20 21 1 18 3 -8 -13 12 -16 -10 -10
6698a0K5k2J2J0rJ8k2Jqj%K6j6lj0J9j0j1J4j3lM2k3j4K1%pNJk6K6J1m2L4j6K7
$$ -10 15 -7 5 15 6 24 2 3 -5 -6 -6 20 4 1 -9 10 0 -11 3 -10 -13 29 6 -8 13 13 6 11 12 -14 12 23 -19 15 -1 26
6734B6m7J0J3Rk8j2J8k8K2J8k0J8l8PJ4QJ3k3rK8Lk6J9%J6k0K6nj2Mj5MJ7j7j7
$$ 26 -21 -11 2 11 -17 -29 -11 -39 -17 1 -19 -1 -39 -32 -18 -10 3 -20 -29 -1 2 -24 -5 -5 11 -9 17 12 0 4 -11 -7 10 -7 -24
6769b4L0k4J7Qj4J1j6K1m%l3L1J5qJ5n9M1oJ3l2nK4J1rk2J8k6M1l8RL2Noj0J2
$$ -24 6 -18 -1 7 -7 4 -12 9 5 5 -28 3 18 10 25 -34 7 1 14 -18 -23 1 12 3 -19 -1 -27 14 -24 -15 17 22 16 6 18
6804A8k0j6K0pK8k0OpJ1Pk0MOk2j6Qj1N5j8m9O1Ok8L3j3k0J7j4k1J2j8J7J4rJ7
$$ 18 -2 -18 2 -5 23 3 9 2 13 20 0 4 10 -12 -28 -20 -31 24 6 -43 18 24 -4 29 16 -4 13 -1 -22 -10 -28 -11 3 -6 11
6839A1J1m2L1rpkJ0J0j9L3m0K3J2qK5j5l4K1j4J8l1JNNj1K4j2LQmK6l0J9j2K0
$$ 11 22 -20 11 2 -5 -7 3 13 -6 27 -13 10 22 14 39 24 -10 11 -3 15 -16 -15 -10 -5 -16 8 -4 -1 7 3 29 -1 18 6 26
6874B6l0J6k8K8qjj3JJ3PKJk5K7j5j7J1K0m3j7O6k2j9K1K5l1PJ7l6PnPmL0l0N
$$ 26 -4 12 -16 12 4 3 -10 -9 4 11 13 14 -11 16 1 -16 -5 15 -28 -45 21 -1 -20 1 26 -5 2 19 -17 -10 -15 -8 -12 18 -12 -7
6910gK6j9j2qJ3mLj5LK4j1Lj9L8j7Oj4MK6omk2K5m1J8qMK8k6J5K2l2Ok3K2pQj2
$$ -7 19 0 -12 -20 -7 -11 -8 -23 -20 4 -7 -4 -23 15 -2 4 -10 -6 20 14 10 -12 13 -28 -10 -18 -14 14 -12 3 25 -7 -1 -24 -2 -9 -1 -13
6948a3J5j8K4j5j2K2k9K0pL1%j4mJ0mqj0J1J1Mk2mK2RMJ4l0k1K8mJ8l6NK1k3L2
$$ -13 2 -16 8 -7 -19 3 -26 -6 -13 18 18 4 0 10 6 -2 -12 -1 10 14 -8 -12 10 19 23 37 7 -14 14 10 28 -8 -3 18 -5 27
6984B7l0kqPJOj0J0Mk1M8l7%J9l5K8Njm0L5J1Jm4K4K0k7pj1M4j4KKK0l9L4j8j9
$$ 27 -3 -5 -13 -6 -5 1 -9 1 5 -16 32 -5 -5 14 -21 7 12 11 -29 6 17 18 -26 -2 18 -9 -16 -27 17 3 5 7 27 -12 22 4 -15
7021a5J6Nj8K4Jk4Q%Jj4N2l7k0K4j3j1j5L3j5kK6Rl3J9qN9m2K4j8j2L3k5LkJ1
$$ -15 1 6 -12 12 13 -11 -3 -3 -2 -16 36 -1 -21 3 -10 -21 -36 -3 -18 -20 6 15 -18 1 -7 52 10 34 16 4 37 12 15 13 24
7056B4j0j7J7j4%J0m7M1j0JnK8l3J7OK6j3Nj9j5k1J7NPrJ4Kk3J3%%k6L0K7j1p
$$ 24 14 -3 14 0 0 10 -37 4 -6 -5 -10 18 -15 2 8 34 21 26 7 -8 -29 -12 -7 0 -9 5 7 -16 -3 -3 -3 -29 1 28 17 10
7092A0k8jM5l3orL6k0jJ3Rj2moj3K8j6L2k3p%j1N1m0J9j5Jj1J4qJ9JrOl2J7j2
$$ 10 -18 -19 26 -7 -13 -22 14 -6 -7 6 15 3 -1 -7 -20 8 -8 24 1 -6 -6 -17 34 -6 13 -2 -1 -12 2 -6 13 14 5 11 -21 -4 -16
7129a6K6oJ6k5K6k4k5L2l0M1JJ5J0o1K3QJ5k7KmOj6J0j2J7lj4K9jj9OJ4k1K6l0
$$ -16 10 4 20 -5 21 -3 -28 4 -26 15 16 31 41 -20 3 11 26 -1 1 -3 3 -13 -3 -15 2 -1 -15 14 13 -6 0 14 -7 19 -11
7164a1M2l1J3m5M7j0j6L4j1l0L5lj4j7J9K0l8JJ0L1k3L9o1J8J8j0rjj1mM7l9%
$$ -11 31 0 13 -32 15 5 -11 23 12 -18 17 14 0 -17 2 22 -16 -15 -5 26 3 42 -19 -1 17 7 -2 -3 -14 -18 29 -10 -10
7197a0qNJ9J7k3KmK6k7K3Mk4k9M1Jk9L0j6J0%J2Oj3j7JJ3oKj4J8j0J2k2RlJ5k0
$$ -10 -18 -13 6 23 0 2 -2 24 -3 20 24 0 -29 12 13 -16 14 -2 8 8 20 26 13 -4 -3 10 4 6 -8 10 0 12 -10 -1 -4 11 -9
7234ij9N8l3KmJ0OlqJ1k1Jk0K6k8L7j8J7rpJ4J5poJ8j3%nJ5k1J1j9K1j5K7k8N
$$ -9 -28 30 -3 -1 -5 5 11 8 0 11 -10 -9 -29 -3 -31 6 -12 5 -4 -11 3 18 11 5 23 10 10 5 20 -1 10 -9 12 -3 24 -4 1
7271ARKk3J9J8qj1j2%qJ4K1qm6M3k7K8RoJ0k4RmL3n1MR%j0K2rj4L0l8L4K2l0l8
$$ 1 10 12 -11 8 26 18 7 -5 -5 -13 1 22 14 -32 11 -16 12 21 15 25 1 10 6 39 -12 -8 1 1 -9 13 4 -10 20 -18 16 38 8 -30
7309c0L1J0l6QNLN0l5j8Lj3K2Kj4jJ3j1k0K3JjNK1l3J7L0j6k2J4qj0rJ2qK2KJ0
$$ -30 1 11 -25 -17 -12 -9 41 6 -12 -9 -22 0 2 -12 -13 0 -11 -31 -8 -7 -8 -3 18 -15 2 32 16 -6 8 0 -10 -19 -7 -15 7 9 19
7346A9jrmNJ0k5K5Rj8j6k9M3k3L1k8K1k0LJ6l9lL5K2l1JpOJ6k9%MJ6J6k2qL0j1
$$ 19 18 9 5 10 20 -5 20 29 11 -5 -34 9 -14 17 -11 10 -10 -7 9 -30 -33 2 24 -7 -6 -13 -7 9 -20 -20 -16 0 16 -6 -14 16 5
7383EjJLL8k1Jnk8K4Jo4M8l4J9J0opJ7J5k9J8%opj2J1K0J0l2krK0j9J3L2n1K6
$$ 5 4 5 8 46 25 26 21 -7 17 18 -46 2 -32 -13 -3 -9 -16 1 16 -13 5 5 -1 -8 -20 -9 11 21 -11 -13 -22 -2 -21 -8 24 -27 -1
7420aJj7OJ6j5j4rJ9oJ2mJJL0l5K2j6K6k5k3M2J1k1j4J3nOoJ0k2J7k5L1k8M7k6
$$ -1 0 -17 -11 5 -10 -24 -33 -14 -20 -8 -12 -11 -10 20 -15 7 -9 17 -8 -31 11 22 1 -13 0 -5 1 -5 5 -17 0 -25 6 -22 25 -1
7456aK2Nk4J7lj3J1j4L2l8J5k3K5j1J4l7K7kpJ2kJ2j0k5J6J2lk5j0M3J3k5k4J0
$$ -1 21 26 2 19 16 3 14 0 32 -6 9 -14 11 0 14 -23 4 2 -5 7 5 17 7 -18 -2 10 7 -18 -28 15 28 3 -21 -11
7490a1j3K5j0J1mk1M4j3mJ3Kj3J3jJ8k9J4Ok5%k8K3K4j7j0J1l2J0NJ2J2j4j2m
$$ -11 -24 1 -9 2 -2 -23 21 8 4 17 19 6 19 18 36 7 21 27 2 2 -26 -3 21 4 -6 5 -27 -17 -12 0 12 -2 -14 -18
7524a8N5k8k3K9nj3k4J8K6Rn8J7K7k0Rrj2L2pJ7j5K8J0Ml2k6K1mMpJ3jj9j1M7
$$ -18 37 9 -14 15 10 -3 -27 -9 17 26 -32 -15 12 -8 1 -8 -20 12 5 22 7 35 45 49 17 -9 12 8 12 5 18 17 -2 -13 34
7559C4l3rJ3l0J9Lj2PqK6j1mOJ1j8jK1j3k0M1k4J3k6K1Kj5rPJ2Qj7pJ0K1oOpn
$$ 34 1 -8 5 -25 -6 -3 -15 -8 -16 10 -1 -5 1 12 -6 -7 14 1 -19 22 -2 11 -15 6 8 -7 -16 -9 3 11 -6 -13 -3 18 12 18 11 6
7597FK8j4lj2l1M4qj1oL7m8qM1k7Qj1Mj0JL2j5k5K5K0j4J5j9Pj4j2L0l5J7nK8
$$ 6 34 20 17 5 -26 18 10 -1 -7 30 -18 -26 15 -12 -4 -15 -11 -21 -20 12 -3 -28 -3 17 3 18 -1 6 -8 -20 10 -25 -8 -13 15
7632A5PorMPj7J9j8K3j9KRk8L9m5L2j5pJ5k4J3prK3qk5RL1j3k8L2mj1N3l1MOl3
$$ 15 22 16 7 11 18 1 20 2 25 6 8 17 -11 28 -17 15 0 -7 8 -16 -3 -10 -19 4 -4 -29 -20 11 -2 -30 2 -2 -13 40 9 13 19 -14
7670a4J5K2lj9J3Nj2j0K1l0L0kj4Rk1KL9j8k4K4J3Kl9K1j0J0pMj8KJ0nKK9k6l
$$ -14 1 23 20 1 14 19 7 -3 18 -12 18 16 2 11 -10 -8 31 13 -11 13 26 28 -11 10 0 10 3 7 -11 -9 1 -4 -2 27 1 -2
7706bK2j6L4l1k2K6l4K8jJ4l3K1k1J2lL3K8p1%%M2k0k3L8rl1lJ4MK3k7J7K1rm1
$$ -2 20 4 38 7 -15 11 -23 5 4 18 -15 6 -15 -3 -6 27 55 -16 -16 -16 26 6 -17 21 12 -19 -22 -8 -4 19 -8 9 30 21 -20
7741b0NL9k8nJ5j3K4m8M9l5L8k0J3l7J7%QJ1k6J8Mj9K4K3l4Lj7J0OqL5m2MJ3j3
$$ -20 -15 24 -4 -9 6 -7 17 -31 18 -17 21 1 14 -23 -6 -6 2 13 -13 5 9 -10 14 37 3 6 -11 -1 5 -3 32 -10 -6 7 -6
7776fj1%L0l8RM1k8j7K0rM0m5K0j3J7j5JmKK6n7J9PJ5Jl5K3L0k9Nj6L0j9J4Rl7
$$ -6 -17 -17 13 -25 -16 25 -3 -20 0 -9 31 -14 6 -7 10 -5 -4 -8 -6 20 -37 -18 -11 4 5 -30 -7 23 -6 -1 -17 13 -6 8 17 -20
7812b0M1mJk5kK1j5JmK0k6J8rjjJ9j7omOj8K1Lk0J0lK8j2jk1L0k1L6Jj8mJ8ok4
$$ -20 21 17 18 -7 -9 12 -3 -2 -6 14 -12 6 -3 -4 -5 14 -3 -9 -13 -7 -25 -4 -1 -21 -11 -14 14 2 1 -20 10 -11 25 26 8 4 22 16 -8
7851hK5k1J5j6RlJ1mj0%MKj0J3j1qJ4%%j7MpL7j9j5RJ0kj1K9oj1J8j1J5j4J8%
$$ -8 17 -4 11 -5 4 1 12 8 -2 -2 2 4 -6 7 -4 -12 2 2 2 -15 -11 -18 19 0 -15 -6 4 2 -9 20 14 3 21 10 25 11 29 29
7889B9j2klQ%j4lJ6k5Nj3j0N2l3J7Rk8%J0j1%J0j9ML3k5j7J7mj8K3J8k1jjJ0K0
$$ 29 17 15 12 20 20 6 3 19 -6 -1 -14 -24 28 -5 12 21 -7 -7 3 -8 -8 2 -17 -13 20 -5 -22 -5 -9 -27 -4 14 -7 -8 -9 1 21
7926B1J1j6nk7K2qKRNj1%%j9QnJ1j4N5l7k1J7L2j5qoj6K3Rk6K6nMj3j1K9j7Nr
$$ 21 32 16 11 -16 6 -2 0 9 14 3 3 3 -16 -8 -13 -2 -16 39 2 -19 -2 30 15 7 1 -15 8 17 -9 17 12 16 3 -8 21 4 9 0
7964@K6k8K9l3k4K8Nj5K8j5RJk5K1J4pjj4J2k9J9jrkK7m8L0K3k9OLNjk2J7j1j0
$$ 0 26 -2 27 -6 -30 -2 3 -12 16 1 10 11 -14 7 21 14 13 -1 11 -18 1 0 -9 -11 16 -32 -2 21 -8 -2 1 6 5 -17 0 -11 -21
8001b1K8J2qk9L8pj4J1kMrLMnJJ8ol0jm%J0K8l1J5J7nl1J6l5L1K5k5%j2J6lpK1
$$ -21 7 19 11 -18 20 13 -1 10 8 12 3 6 10 5 6 24 18 -12 -13 -17 -17 -7 21 -10 5 22 17 -14 2 -33 -2 23 -2 -2 -14 2 -1 -8 13
8040A3l7J6K9k5J4k9K8j9K3j5M7l5j7K6k8M0k5Nj6J2Mj8J6nkj3mj6K8pK8Qm0J
$$ 13 -24 -8 21 -4 10 -19 9 -10 13 -2 45 10 -7 19 -9 31 6 11 -5 7 11 -7 9 4 2 -11 -15 -31 -3 -10 18 26 -14 -13
8074a3k5J8jMJ3KpK8kl7K6rK7j8K4j6K3k3Jj5l5M1J4k0PRj6J7Nk2Qj1QK2ppk2
$$ -13 -38 -20 -21 -17 -4 -2 -9 19 17 -20 6 -3 24 6 30 14 37 14 15 0 -35 6 20 0 7 16 0 17 22 0 8 -3 5 27 20 13 -9
8111iMlj6J5K9m2J8LNKj3QmpMJ7j6J9l3L9Km3L8J2k2OQl8MJ2K5j2Kok8K2j2Pj5
$$ -9 -5 -8 -24 -9 20 -22 -4 -1 4 6 -7 1 -3 -10 -6 11 -5 14 -19 20 22 -21 17 29 7 13 21 -17 -13 -1 24 12 14 8 -20 2 -10 -3 -18
8150a8J2oqK5j4L4k4nqK3l0j5L0jkJJ5j2%jK2j3K9m1K9j5k1J7lNJ8m2K0J6j2k0
$$ -18 -6 -12 -20 5 -9 25 1 -4 -12 11 -19 -34 -4 -5 -7 -6 9 -3 -3 -4 18 5 34 -7 22 7 -14 3 0 5 23 -19 1 17 5 -15
8186a5J0j0J2K6l8
$$ -15 -5 -15 -3 23 -15
8191a5
##END NTUPLES=NMR FID
##END=
