##TITLE=1H_Pr TP-2
 DMSO, 8 sc, 
 10.06.2021
##JCAMPDX= 6.0         $$ Bruker NMR JCAMP-DX V2.0
##DATA TYPE= NMR FID
##DATA CLASS= NTUPLES
##ORIGIN= UXNMR, Bruker Analytische Messtechnik GmbH
##OWNER= root
$$ XWIN-NMR		Version 3.5
$$ Thu Jun 10 13:52:51 2021 Russian Standard Time (UT+4h)  she@DPX200
##.OBSERVE FREQUENCY= 200.131506
##.OBSERVE NUCLEUS= ^1H
##.DELAY= (6, 6)
##.ACQUISITION MODE= SIMULTANEOUS
##.ACQUISITION SCHEME= undefined
##.AVERAGES= 8
##.DIGITISER RES= 18
##SPECTROMETER/DATA SYSTEM= spect
##.PULSE SEQUENCE= zg30
##.SOLVENT NAME= DMSO
##.SHIFT REFERENCE= (INTERNAL, DMSO, 0, 15.7039)
##AUDIT TRAIL= $$ (NUMBER, WHEN, WHO, WHERE, WHAT)
$$ ##TITLE= Audit trail, XWIN-NMR		Version 3.5
$$ ##JCAMPDX= 5.01
$$ ##ORIGIN= Bruker BioSpin GmbH
$$ ##OWNER= she
$$ F:/spectra/data/she/nmr/H-F/1/audita.txt
$$ ##AUDIT TRAIL=  $$ (NUMBER, WHEN, WHO, WHERE, WHAT)
(   1,<2021-06-10 13:51:16.79 +0400>,<she>,<DPX200>,
      <created by zg, POWCHK disabled, PULCHK disabled
       configuration hash MD5:
       00 E9 B6 7A A2 85 ED C7 34 08 36 98 17 FE 4E 26
       data hash MD5: 16K
       16 C5 A0 2A A0 4A 9D 74 A2 0F BD F6 41 E4 0F 76>)
$$ ##END=
$$ 
$$ hash MD5
$$ F3 0F 86 AE 9A 0C 40 E8 08 39 E9 3E B7 DC 3F F4
##$RELAX= 
##$RELAX= 
##$RELAX= 
##$RELAX= 
##$RELAX= 
##$RELAX= 
$$ Bruker specific parameters
$$ --------------------------
##$DU= <F:/spectra>
##$EXPNO= 1
##$NAME= <H-F>
##$PROCNO= 1
##$TYPE= <nmr>
##$USER= <she>
##$AMP= (0..31)
100 100 100 100 100 100 100 100 100 100 100 100 100 100 100 100 100 100 
100 100 100 100 100 100 100 100 100 100 100 100 100 100 
##$AQSEQ= 0
##$AQ_mod= 1
##$AUNM= <au_zg>
##$AUTOPOS= <>
##$BF1= 200.13
##$BF2= 200.13
##$BF3= 200.13
##$BF4= 200.13
##$BF5= 200.13
##$BF6= 200.13
##$BF7= 200.13
##$BF8= 200.13
##$BYTORDA= 1
##$CFDGTYP= 0
##$CFRGTYP= 5
##$CHEMSTR= <none>
##$CNST= (0..31)
1 1 145 1 1 1 1 1 1 1 1 1 1 1 1 1 1 1 1 1 1 1 1 1 1 1 1 1 1 1 1 1 
##$CPDPRG= <>
##$CPDPRG1= <>
##$CPDPRG2= <>
##$CPDPRG3= <>
##$CPDPRG4= <mlev>
##$CPDPRG5= <mlev>
##$CPDPRG6= <mlev>
##$CPDPRG7= <mlev>
##$CPDPRG8= <mlev>
##$CPDPRGB= <>
##$CPDPRGT= <>
##$D= (0..31)
0 1.2 0 0 0 0 0 0 0 0.06 0 0.03 0 0 0 0 0.0002 0 0 0 0 0 0 0 0 0 0 0 0 
0 0 0 
##$DATE= 1623318676
##$DBL= (0..7)
120 120 120 120 120 120 120 120 
##$DBP= (0..7)
150 150 150 150 150 150 150 150 
##$DBP07= 0
##$DBPNAM0= <>
##$DBPNAM1= <>
##$DBPNAM2= <>
##$DBPNAM3= <>
##$DBPNAM4= <>
##$DBPNAM5= <>
##$DBPNAM6= <>
##$DBPNAM7= <>
##$DBPOAL= (0..7)
0.5 0.5 0.5 0.5 0.5 0.5 0.5 0.5 
##$DBPOFFS= (0..7)
0 0 0 0 0 0 0 0 
##$DE= 6
##$DECBNUC= <off>
##$DECIM= 32
##$DECNUC= <off>
##$DECSTAT= 4
##$DIGMOD= 1
##$DIGTYP= 9
##$DL= (0..7)
0 120 120 120 120 120 120 120 
##$DP= (0..7)
150 150 150 150 150 150 150 150 
##$DP07= 0
##$DPNAME0= <>
##$DPNAME1= <>
##$DPNAME2= <>
##$DPNAME3= <>
##$DPNAME4= <>
##$DPNAME5= <>
##$DPNAME6= <>
##$DPNAME7= <>
##$DPOAL= (0..7)
0.5 0.5 0.5 0.5 0.5 0.5 0.5 0.5 
##$DPOFFS= (0..7)
0 0 0 0 0 0 0 0 
##$DQDMODE= 0
##$DR= 18
##$DS= 0
##$DSLIST= <SSSSSSSSSSSSSSS>
$$ [...]
##$SUBNAM2= <"">
##$SUBNAM3= <"">
##$SUBNAM4= <"">
##$SUBNAM5= <"">
##$SUBNAM6= <"">
##$SUBNAM7= <"">
##$SUBNAM8= <"">
##$SUBNAM9= <"">
##$SW= 20.0188882624521
##$SWIBOX= (0..15)
0 0 2 0 0 0 0 0 0 0 0 0 0 0 0 0 
##$SW_h= 4006.41025641026
##$TD= 16384
##$TD0= 1
##$TE= 0
##$TE2= 300
##$TE3= 300
##$TEG= 300
##$TL= (0..7)
0 120 120 120 120 120 120 120 
##$TP= (0..7)
150 150 150 150 150 150 150 150 
##$TP07= 0
##$TPNAME0= <>
##$TPNAME1= <>
##$TPNAME2= <>
##$TPNAME3= <>
##$TPNAME4= <>
##$TPNAME5= <>
##$TPNAME6= <>
##$TPNAME7= <>
##$TPOAL= (0..7)
0.5 0.5 0.5 0.5 0.5 0.5 0.5 0.5 
##$TPOFFS= (0..7)
0 0 0 0 0 0 0 0 
##$TUNHIN= 0
##$TUNHOUT= 0
##$TUNXOUT= 0
##$USERA1= <user>
##$USERA2= <user>
##$USERA3= <user>
##$USERA4= <user>
##$USERA5= <user>
##$V9= 5
##$VALIST= <valist>
##$VCLIST= <CCCCCCCCCCCCCCC>
##$VD= 0
##$VDLIST= <DDDDDDDDDDDDDDD>
##$VPLIST= <PPPPPPPPPPPPPPP>
##$VTLIST= <TTTTTTTTTTTTTTT>
##$WBST= 1024
##$WBSW= 4
##$XGAIN= (0..3)
0 0 0 0 
##$XL= 0
##$YL= 0
##$YMAX_a= 58250
##$YMIN_a= -46097
##$ZGOPTNS= <>
##$ZL1= 120
##$ZL2= 120
##$ZL3= 120
##$ZL4= 120
##$ABSF1= 10
##$ABSF2= 0
##$ABSG= 5
##$ABSL= 3
##$ALPHA= 0
##$AQORDER= 0
##$ASSFAC= 0
##$ASSFACI= 0
##$ASSFACX= 0
##$ASSWID= 0
##$AUNMP= <proc_1d>
##$AZFE= 0.1
##$AZFW= 0.1
##$BCFW= 1
##$BC_mod= 2
##$BYTORDP= 1
##$COROFFS= 0
##$CY= 11.3945322036743
##$DATMOD= 1
##$DC= 2
##$DFILT= <>
##$DTYPP= 0
##$F1P= 15.9154993809931
##$F2P= -4.1035820241983
##$FCOR= 0.5
##$FTSIZE= 0
##$FT_mod= 4
##$GAMMA= 1
##$GB= 0.15
##$INTBC= 1
##$INTSCL= 1
##$ISEN= 128
##$LB= 0.24
##$LEV0= 0
##$LPBIN= 0
##$MAXI= 10000
##$MC2= 0
##$MEAN= 0
##$ME_mod= 0
##$MI= 1.114404
##$NCOEF= 0
##$NC_proc= 0
##$NLEV= 6
##$NOISF1= 3.799351
##$NOISF2= 2.8
##$NSP= 1
##$NTH_PI= 0
##$NZP= 0
##$OFFSET= 15.70392
##$PC= 1
##$PHC0= -11485.68
##$PHC1= 15.60101
##$PH_mod= 1
##$PKNL= yes
##$PPARMOD= 0
##$PSCAL= 0
##$PSIGN= 0
##$REVERSE= no
##$SF= 200.130013532006
##$SI= 16384
##$SIGF1= 3
##$SIGF2= 2
##$SINO= 400
##$SIOLD= 16384
##$SREGLST= <1H.CDCl3>
##$SSB= 0
##$STSI= 0
##$STSR= 0
##$SW_p= 3612.71676300578
##$SYMM= 0
##$S_DEV= 0
##$TDeff= 0
##$TDoff= 0
##$TI= <>
##$TILT= no
##$TM1= 0
##$TM2= 0
##$TOPLEV= 0
##$USERP1= <user>
##$USERP2= <user>
##$USERP3= <user>
##$USERP4= <user>
##$USERP5= <user>
##$WDW= 1
##$XDIM= 8192
##$YMAX_p= 0
##$YMIN_p= 0
$$ End of Bruker specific parameters
$$ ---------------------------------
##NTUPLES= NMR FID
##VAR_NAME=  TIME,          FID/REAL,        FID/IMAG
##SYMBOL=    X,             R,               I
##VAR_TYPE=  INDEPENDENT,   DEPENDENT,       DEPENDENT
##VAR_FORM=  AFFN,          ASDF,            ASDF
##VAR_DIM=   8192,          8192,            8192
##UNITS=     SECONDS,       ARBITRARY UNITS, ARBITRARY UNITS
##FACTOR=    0.0002496,     1,               1
##FIRST=     0,             0,               0
##LAST=      2.0444736,     0,               0
##MIN=       0,             -46097,          0
##MAX=       2.0444736,     58250,           0
$$ Real data points
##PAGE= N=1
##DATA TABLE= (X++(R..R)), XYDATA
$$ [...]
1580e20O22k48L62L13j027L89Q8m09R88o58LJ39n69P78N6n02K79m27J15N48m27
1601a07M31n51j57M88o3J94L7n22K39J67k02M66p74L7M60l38P84m37l92K19l95
1622d16M58L97o74K36k47R6P93o79J04Om84O10K28m63K80p27O7P09m12M84m39
1643g3k80O38m96L69J29o52L19K2Q5M68p13k5L90m71N39k8n19M66m65K39M59p03
1665c02N09m85k7P31m27R9j91n40R33j86k61M79n91J73K87k30M41n49l71P34l89
1686a63L90J20o20K16Lj47O66p17Q6j6j26O82r5n09L18n59O50K28p14M15l86j04
1708c82N93k48Q6l9o73Q97j54j76L76q24M05L82m13O53o56k19M80j02L49k2n64
1729b51L10j00k6N47o44J39j01l81Q53j75l80L15n56M68K87l17J47n64J70N93
$$ y = [-520, 102, -146, 216, 529, -498, -109, -21, -430, 558, -100, -97, 42, -527, 251, 307, -195, 84, -343, -228, 320, -107, 324, -227, -384, 104, 41, 235, 272, -250, -11, 156, -46, 420, -354, -317, 143, -195, 589, 152, -240, -21, -416, 42, 439, -235, 1, -246, -150, 643, -36, 68, 74, -410, 200, 428, -35, 245, -482, -415, 294, -118, 366, -73, -353, 285, -211, 158, 287, -365, -46, -24, 61, 529, -184, -209, 181, -290, 249, 221, -298, 168, -297, -58, 401, -302, 207, -278, -305, 426, -1, 98, -93, -633, 300, 114, -147, 332, -259, -86, 201, -29, 412, -137, -508, 226, -163, 227, 347, -273, -57, -54, -201, 465, -252, -166, -182, -308, 374, 279, -230, 88, -471, 179, 407, -307, 108, -278, -382, 211, -37, 49, 10, -663, 234, 80, -96, 280, -544, -139, 243, -170, 483, -173, -392, 88, -14, 335, 313, -251, 59, -41, -67, 480, -164, -25, -126, -507, 346, 171, -209, 106, -450, 18, 305, -12, 135, -429, -259, 334]
1749C34m12L13j23n62M33N1j3K39o41L75K66l88N15n50k23L96l16O23j14m17K86
1770G2k94K26L94n67O6o7l46P85q9l61M08p72N62M61m87L24o49q4N23j20K97j36
1792A46p28O02j68J27L88n61l8K51p2M59m02k86L17k70L98rk83K56m99K38N00
1813C66l80P1j70j81M89j57J08J10o83M30K16l62M64n90j64N64j62J36m7k82L16
1834I2k89L35M01p96L08j11K1M29k99q8q5j98N85j19m80L82n13K33M98m03K25
1855A28l24l19P27J9q2j16k84J42K97k27M79o34l8K08j65N84k33l17J96j34K29
1876A36K69o31J43k07N6P66l27j34O0n03O03j10j31J47n59L32L99l63J75l84P5
1897a88L96k00J80o3m60J99Q1%K60n41K5L56r9L02m4k84%k04M65K50n62J81k27
$$ y = [334, -78, 235, 112, -450, -17, 34, 21, 260, -381, -6, 260, -128, 387, -163, -386, 10, -306, 317, 203, -214, 72, -222, 4, 398, -169, -103, -170, -516, 269, 180, -181, 227, -545, 17, 478, -9, 315, -334, -418, 105, -15, 282, 146, -582, 20, -148, -21, 367, -194, -232, 19, -53, 406, 4, -282, 35, -235, 163, 154, -129, 127, -372, -134, 366, -14, 57, -113, -294, 195, 38, 146, 256, -427, 3, 219, -143, 321, -269, -433, 131, -31, 105, 58, -224, 92, -197, 138, 539, -257, 51, -60, -39, 390, 91, 3, -82, -280, 305, 186, -294, 88, -425, -192, 306, -97, 128, -196, -515, 212, 231, 149, 33, -251, -109, 188, -39, 440, -194, -232, -24, -189, 395, 162, -155, 41, -93, 136, 405, -226, -83, -290, -234, 532, 205, 71, 131, -372, 231, 121, -10, 137, -422, -90, 309, -54, 121, -263, -188, 208, 8, 188, 125, -335, -136, -55, -55, 205, -336, -311, 45, -54, 248, 204, -80, -80, -284, 181, 431, -131, 50, -177]
1920a77o5O60m67O8l9k30L65k4J3J49o61L83K86l46L84l43m25O06l01K58K39p04
1942c71M80j95J17K96m46%K27l80O80k77j57P0l79N51J06m20J05k31J37M40l17
1963C6n4J06m94N26J8k92M41p84L08J52K8K82j99m57L50j88O05o6o35L47J2n1
1985iN52p10Q9K29m57M34k0k93K24l43N10J37l43N9k99J05M30l01NO0k59J26K34
2008A60J13J24q89M97Pj38L34j80k97L25k73L54J24m96K64j83J25M22m94r7K33
2029C5m08P50k72j44J12l23L88J27l48J16j82n5N54m00K30k80l39N23j79P6K04
2050A85m19K26Oj1K23l58P2J26k32L06K82n28K78l27J29M80n40Q5J83m36M18j02
2072D6J9ll74N10J3k48L09m80l5M93m67M00M1n06L54k51J46L35n36J23O1q1L40
$$ y = [-177, -242, 418, -49, 19, -20, -250, 115, 91, 104, 253, -408, -25, 261, -85, 299, -44, -469, 137, -164, 94, 333, -371, 109, -86, 31, 327, -119, -119, 108, -272, 408, 131, -26, 44, -335, 216, 322, -98, 7, -224, -87, 353, 36, -18, 88, -406, 120, 138, -154, 287, -497, -189, -37, -9, 273, 74, -383, -33, -221, 384, 318, -317, 30, 42, -9, 543, -167, -78, 151, -306, 128, 108, -185, 39, -304, 206, 343, 0, 59, -240, -135, 295, -6, -1, 59, -200, -74, 160, 273, 397, -492, 5, 12, -126, 208, 28, -269, 56, -217, 137, 261, -235, 29, -154, -29, 393, -101, -198, 35, -373, 377, 105, -39, 73, -250, 138, 265, -83, 33, -149, -204, 350, -50, 180, -100, -439, 84, -95, -19, 185, -234, -8, -2, -13, 210, -148, -76, 50, -182, 124, 406, -122, 156, -171, -42, 438, -102, -17, 166, -270, 148, 46, 65, 62, -312, 198, 211, -37, 272, -208, -243, 250, -217, 183, 224, -282, 72, -179, -33, 302, -234, -111, -50, -131, 209]
2095B09k75m4O4j98M07j8j99K09l88J14M08m79K80q3k98L47L0k7K09o98M07J55
2117A32j47L86m96j03M57l33L97q2m53K91l98L66M79p40M54m04R4L95l13l0J00
2138E2m25O44j22m13M58l41J67L60n09L53j93k06L32l1nq1m91M94L0j17L85n47
2160b06k7K00j37M50k48k81K83j73K77K12n58K11j15j6M73l67j55J07l03M02J94
2181B23k42L8l46L14K00l46M32k88j36L46k76K63J23p22N14p0J00J62n84K95N5
2202E5k49M00j1k32l1k00L37J70l76K67j42l07O45m14K49j97m08M81L0j13K84
2223B38l93L8L40k60K77l23r5J90k46N36k56m29M01J8K6K63n90J86J34l61N62
2244B56k24j54K30n24M62L82m13K04m81J23M76l11R2j2m04K38J90j13K30n82M13
$$ y = [209, -66, -110, -46, -244, 163, 145, -54, 155, -233, -119, 289, -190, 90, 7, -291, 56, 86, 59, 268, -430, -23, 132, -15, 371, -125, -228, 229, -104, 293, 211, -242, 49, -349, 17, 496, -244, 210, -194, -100, 295, -18, -48, 52, -373, 271, 149, -264, 194, -147, 20, 380, -129, 224, 31, -175, 157, 126, 121, 40, -451, 43, 73, -44, 341, -206, -233, -33, -170, 280, 32, -249, 34, -139, 138, 350, -208, 3, -112, -128, 345, -22, -177, -70, -373, 29, 223, -19, 19, -327, -13, 187, -159, 273, -15, -151, 195, -81, 182, 305, -417, 97, 27, 127, 289, -295, 0, 55, -194, 206, 195, -37, -68, -268, 69, 239, -137, 130, -12, -319, 326, -88, 161, -36, -444, 37, 67, -46, 238, -155, -117, 223, -37, 240, -83, -178, 12, -234, 302, 46, -383, 18, 36, 62, 325, -265, -79, 55, -306, 256, 32, -122, 108, -416, 46, 428, 15, 219, -262, -139, 337, 26, 118, 106, -298, -60, 130, 17, 247, -335, 78]
2265G8R9k72M78l34k23K87l58N69j07l88K95k08n7N74n98J53J49l46M60k99N5
2286GK04n15N00nj96J00p8r1L19k79J40m8l22L63k21J81K04n26J87J25j64J93
2308G8o5j30K42m16N33N9n76L25k99J69M03m51M7J38l90O42k61n3J38m95L96J74
2330B08l91L23l23J40J81q3O1j09l82K41KJ98L15n64Q9J34j33M05k19l44J64j32
2352b19M28J1l97L13l92J12K44k37K14j71k66P36k54L2m7m46M41J17l48L59m66
2373b36J14K40k12L53j28m52M57j54J02J97n28K94j77j5M51j57j63J68m95O05
2393B64j9n18L43l64J50M95m27L27k82k00L96j59pK99p20M20J48k33L26m94P0
2414a85J22j06M22o0m22K81k55J69K49m03J66o3O6L23k81M6K4m00M93n2q6N4k90
$$ y = [78, 177, -95, 383, 49, -174, 113, -245, 324, 217, -171, 124, -84, -141, 433, -165, -12, 137, -209, 251, -48, 7, 211, -304, 196, 191, -5, 95, 17, -74, 245, -34, 106, 58, -264, 99, -122, 59, 263, -263, -76, 49, -115, 78, 13, -117, 125, -291, 242, 301, -275, 50, -249, -80, 323, -128, -81, 57, -333, 309, 48, -5, 133, -362, 34, 208, -183, 140, -183, -43, 138, 55, 116, 7, -375, -134, -132, 66, 381, -183, -94, 40, -93, 312, 93, -251, -87, -219, 209, 220, -177, 136, -256, -144, 100, -137, 77, -94, -360, 376, 122, 154, 107, -339, 102, 219, -129, 230, -236, -122, 118, -94, 259, 131, -321, 136, -18, 84, 281, -247, 47, -130, -145, 306, 149, -14, 154, -341, 264, 245, -273, 70, -294, -144, 351, -76, 251, -31, -231, 165, 6, -1, 298, -422, -2, 146, -87, 239, -255, -185, -63, -169, 253, 193, -229, 52, -203, -34, 215, -188, -22, -85, -19, 304, 23, 69, 93, -307, 186, 134, 48, 102, -188]
2437a88J52K24k11J09k19k16M02j21K22q6l64L76j02J09L14m32j10L39m01L59
2457A56J22m60J08k9J82J49k75PK4k66N82m25K10J27n99L73O5j24J78m08K45J55
2479I7L5N3k94k50N11k93K08K51n77K64j1j37M29l31n5J33k38M44o4l51J49k15
2501b42N06Q3n06K06j84j56M18l6n5L0k36L54j9k05L93n63K10Q2q1M02m20j81
2523b00K74k98K92K07n12K77M1j51L07l57P0j6k44N02Kq8p6l84L01L59o01M06
2545A11k65j24M99j88P3P3m15K70l3J6K05n64J06L92k46K0m7p5J36R8J54m2k69
2568a15K15k14J53K04m38jL6j48M42m3j96K36m22K72K82k87J36l39P8L20k85J95
2590H1rk80J12M8j2L68n51Q3K81k99L59k02j23R6n5K48R6m32J62p5l6O05m37K7
$$ y = [-188, -36, 188, -23, 86, -133, -349, 53, -68, 154, 68, -296, 80, -22, 87, 401, -31, -141, 198, -203, 156, 278, -182, -74, -103, 79, 228, -47, -40, -16, -282, 300, -125, 85, 212, -387, -14, 51, -73, 105, -303, -58, 97, 132, 185, -109, -359, 152, -141, 67, 318, -259, 5, -6, -143, 286, -45, -100, 33, -205, 239, 175, -176, -27, -242, 264, 347, -159, 47, -137, -293, 125, 89, 34, 64, -172, 182, 163, -42, 351, -212, -2, 80, -1, 401, -19, -200, 74, -224, 68, 275, -237, 40, 81, -70, 237, -120, -50, -66, -310, 192, 194, 106, 30, -354, -53, 306, -295, 111, -154, -278, 221, 33, 106, 179, -236, 34, 1, 17, 222, -342, -236, 156, -90, -70, -117, -192, -56, 42, 196, 154, -115, 100, -114, 39, 243, -195, -196, -160, -308, 134, 91, -105, 131, -291, -19, 263, -24, 112, -227, -149, 171, -114, 81, 72, -208, -96, -48, -60, 308, -243, -160, 121, -178, 181, -21, -144, -48, -103, 145, 241, -191, -29, -104, -140, 465, 28, 55]
2614E5p2k95M48m2Q7k09k07J37L54j89P3j90k39K98k82M03n0m71L50J53k26L34
2636B20l35Q7Ok86N36j70j43J41k38K34K65m10K75j78n6L63k06K7o6l01L00j32
2658f7J25J61n19J09L51k23K70j07k60K68k44L85k53j66K01r9J15J98m01K63j07
2679@k57O17l79j10K60m71M03J32l07M63n07k9M34m73L48k30k52M89r1p2K21l45
2701a56J69k64J66L69m48J16J52k55K61J7m38L47j51J51K89m13J50l7k63L76l5
2722A03k76J39l51L04K43k12J10k23m7L79k61J62q7k01M87l58J08J54l93K52j01
2743f9l6K93j38j19K11l62M42o9m27K70k25K04L47l97R5Q3j36J75j21K7P3l17
2765a96K45Q2j36K02k41q2K74k66J27p7l25M54j39J55Q6m70K22j18J04M73m71
$$ y = [55, -17, -312, 136, 94, 181, -28, -235, -98, 256, 67, 140, -50, -289, 9, -273, 130, 80, -391, -41, 112, -114, 220, -115, -28, -22, -308, 228, 58, -85, 56, -182, 52, 317, -93, 182, 4, -52, 311, 105, 132, 66, -235, 65, -67, 58, 219, -300, -191, 160, -63, 207, 100, -160, 108, -136, 249, -4, -170, 31, -68, 47, 245, -156, 107, 0, -257, 360, -19, -129, 131, -340, 63, 195, -112, 351, -156, -185, 249, -224, 124, -106, -358, 131, 40, -32, 189, -156, 13, -251, -85, 284, -164, -48, 104, -151, 110, 127, -311, 36, -115, 36, 325, -88, 62, 25, -238, 138, 103, -173, -34, -385, -81, 162, -50, 60, -163, -210, 169, -92, 70, -17, -218, 269, -89, 19, 173, -220, 32, -69, -105, 188, 50, -69, 142, -220, 222, 153, -274, -4, -229, -25, 322, -75, 20, 103, -33, 142, 21, 48, 121, -196, 49, 131, -5, 197, -44, -126, 148, -118, 9, -68, -393, 61, -78, 77, 163, -307, -85, -203, -99, 374, -97]
2786i7J7O3k03N41k47k59J90j95J79K71m37J32N1k31M84j71k7R6m44L57Q6k21
2808f5K78m12k5K22j00K66j97k62M16l04L31K17n70J67L4k25M50k75K1P7k08L72
2830B08O3k71K15m02P0J67j5M5j77k86N81j99N9Q4m98N14j32L6M15n80n1J89j80
2853a45N18l74j03K06k64L81k2k82R0k74J60O10l43j33j5k56N34k0j45km82K16
2875a45M25m43L57k59l83M71k4%J59l04K09l7n1J78m21J81J03r8J74j41j85L68
2897A34m35L08L93k82Ol93J82M22m15J28k1n09O15N4k18K88n21M32O8k95K40l08
2919a27p6K17k69M48N1m26J65R2j24L11l92J24q3j06M52j53q0l6l00K60L85l94
2941f1J24j44k09N51l55J12J1l25M73q7j26K29n78K76L01j27J34k67k52K37p6
$$ y = [-97, -80, -17, -220, 321, 74, -185, 5, -190, -11, 260, -177, -45, 6, -225, 259, 88, 61, 157, -287, 70, 156, -65, 213, -199, -224, -2, -102, 164, -33, -295, 121, -183, 148, 365, -205, -38, -4, -229, 221, -54, -33, 44, -164, 208, 271, 0, 215, -187, -117, 50, 35, 80, -97, -383, 198, -1, 58, 142, -356, 158, 26, 62, 477, -103, -154, 35, -145, 373, -1, -104, 102, -162, 219, 197, -85, 5, -269, -109, 501, 158, 25, 10, -246, 288, 268, 123, 121, -361, -145, 280, -163, 194, -65, -448, 23, -1, -1, 158, -146, 63, 26, -25, 153, -268, -87, 16, -82, 92, -49, -234, 134, -301, 7, 400, 118, 124, -269, -87, 335, -80, 48, 27, -482, 133, 187, -31, 257, -264, 168, 236, -59, 181, -127, -203, 14, -255, 193, 244, -182, -17, 75, -49, 262, -130, -6, -89, -195, 257, 104, 24, -12, -312, -52, 333, -61, 63, -81, -290, 261, -94, 18, 29, -296, 177, 90, -36, 193, -385, -109, 192, 65, 199, -68, -320, -83, -159]
2962a59K25J44o23N16j74K2M19n92K30j40J22K56j72o7L7m43L77P5k12K84j41
2983a6j00L36k85J92j74l41M25P8q3K21m45K39k5j98L25o6j71J34k79K92M4j65
3005f2K16l99J43L16j76l6K7j92L57M6k45L2l84L38K41k71J97l72O4K95k27K50
3027A58j70k23K68k08K52K48m22j47M11k96L93k40j75L4j31M03K4k22M6j19P8
3048c8J92j75J8N4l18J85J08J93j17n71K83L31k46K31r1k75J52p8L30K7m45L31
3070H1p4qL06l15R0j42r3L09n4k89J81j65N12j25j61M2l64J96K62l44L22j49l76
3093c58N74j35n0k0k88J14K54q9J35j36j94K13j39L17pn61N81m37J31N19n95J97
3115B6j7k14N03l14O8Rk60L31j04j09J22j49n4M00j94J14k58P2Km6J2K26k74N2
$$ y = [-159, 66, 210, -413, 103, -71, -49, 370, -222, 8, -132, -10, 246, 74, 7, 44, -399, -22, 53, -159, 125, -16, -116, 220, -65, 127, -47, -388, 37, 115, 32, 253, -192, 47, 22, -176, 149, 83, -88, 46, -233, 59, 103, -62, 154, -245, -102, 214, 38, 2, 29, -163, 194, 240, -5, 27, -357, -19, 222, -49, 148, -224, -160, 135, -92, 158, -12, -235, 33, -175, 77, 325, -97, -244, 167, -129, 264, 24, -151, -117, -248, 155, 179, -43, 3, -116, -38, 154, -21, -3, 51, -267, -82, 26, 219, 102, -469, -186, 145, -101, 130, 39, -236, -84, -162, 168, 195, -250, 81, 7, -1, 305, -10, 80, -62, -155, 154, 100, -189, -8, -173, 339, 214, 53, 95, -269, -73, 189, -155, 167, 18, -358, 216, 81, 31, 11, -277, -163, 91, 2, 137, 1, -193, 20, -119, 198, 191, -370, 211, -226, -95, 424, -171, 26, 9, -205, 298, -16, 52, 61, -199, 132, 28, -81, 41, -108, -162, 238, 44, 158, -100, -28, -26, -72, -60, 166, -108, -56]
3139e6K8j1L60l90j90K69k23N01k07k59L01j33J6K44m93J09l5Q6J36K9j55K1k92
3162c44L96J52j96K65m29Q2J86j17J20l35o7L94k15L11j84j98J53k6r9L18k05
3183c8p7J04k90N19J17m24J07k12J1L86j39m3j06j04L63q8j41K07l11J13K48r9
3205A03Jk56J8K69k14K58p0m17L16k07L38N8l58Q5M5j61M77k82j79N1q9L25m7
3228F4j48J09j14o2K83k85L67k98k71O41k20m8N3l29J52J6N6J69k77k5L55k55
3250f7L40p9l12R7n7K57j46j60K76k96K9K61j82J20j97L9J84j18j16L29m52K55
3272EK68k82J39k16o2M94l18J96j24m67L58l6M2P1k98J09P8l5K02l7j17K13k80
3295i7J66J44l23J7k1rM69l50P8j14m8K14K1l53J77l42K99K35l01L73l46PK83
$$ y = [-56, -28, -39, 321, -69, -259, 10, -213, 288, 81, -178, 123, -10, 6, 250, -243, -134, -169, -83, 53, 82, -73, -52, -344, 52, 204, 8, 273, -156, -74, 112, -5, 115, -220, -287, 107, -108, 203, 19, -179, -26, -52, -151, 167, -38, -115, -11, -301, 218, 335, -89, 18, -194, -183, 203, 64, 21, -85, -189, 174, 86, -55, 152, -159, -46, 202, 103, 104, -152, -134, 135, -79, 179, 109, -308, 8, -199, 139, 197, -161, -76, -31, -192, 285, 3, -176, -125, -214, 111, 64, -84, 25, -89, -151, 132, -153, 214, -84, -355, 286, 66, 18, 71, -258, -106, -90, -34, 135, -142, -167, 188, -67, 273, 194, -118, -21, -78, 179, 33, -127, 149, -147, -118, 143, -39, 81, -116, -77, 107, -11, -127, 202, -250, 5, 273, -9, 130, -86, -148, 346, 28, 224, 100, -367, -9, -45, -3, 68, -230, -121, -43, -78, 124, 87, -30, 183, -97, 69, 213, -110, -93, -114, -123, 346, -4, 74, -40, -88, 126, 147, -206, -29, -371, -72, 163, -138, 235, -111, -104, 179]
3318A79j25J74l06k15K93p4J61J05m37K25J65l71L82k00k9J69l52K08L03m17K75
3339A13k24P4L05j86p4L4j81L62j96p8J83j19o8J76j58J99n9l90M29k61L38r0
3361A29k60K42j59K03J22l94P8k4k08M21j41K6K4l31M42Ok39K29k26j74L32L1
3383A29o6q8k56M39k07R7K39m35P1O0J22J37m07Q6J95j75N4K00l51K29j58R6J91
3406B02k80J10M7l24M23j34j66K22k86K86p7j1K06l54M3J94o6k5k0k28M23k17
3428c2J25J44l44JJ63k24M98l97j5J37j59K69n4l52L71k36p0M77m57L86l81n7
3450b07M83j88p0Q6k87J71R9n4K42n15J8K59r7Q1O4j11J83k35J29K08k55M9%j60
3474a07L45k69j87L32m13L65J25k86K92l60J74K58k38J63l14q7K94q0O6Pm43M37
$$ y = [179, 54, 228, -78, -293, 0, -74, 87, 192, -245, -20, 145, -226, 156, -44, -73, 96, -256, -48, 255, -162, 113, -111, -37, 268, 82, 8, 42, -139, 223, 27, -51, 132, 13, -55, 121, -37, 162, 103, -287, 142, -119, 219, 129, -131, 111, -48, 155, 277, -117, -39, -63, -271, 150, 9, 35, 59, -272, 170, 176, -63, 166, -60, -234, 98, 129, 63, -25, -281, 158, -49, 48, 287, -148, -77, -17, 105, 242, -165, -79, 116, -59, -5, 195, -156, 73, -85, 11, 202, -78, 32, 79, -245, 178, 44, -122, 100, -186, 100, 23, 12, 218, -136, -93, 101, 35, 10, -10, -238, 185, -32, 93, 237, -107, -106, 57, -167, 331, -66, -81, 56, -103, 166, 112, -240, 131, -105, -175, 302, -155, 231, -150, -207, 276, 88, 18, 104, -183, -12, 87, 33, 275, -240, -222, 37, -60, 21, 85, -26, 157, -78, 51, 259, 4, 53, 53, -107, 238, -31, -218, 114, -299, 66, 191, -95, 197, -163, 11, 269, 31, 194, -120, -207, 87, 7, 73, 80, -363, 74]
3496G4j28p6M24l87r7K79k02L48n5k34R5j94P4L26m54R6P2L0K30k63QJ36k82K78
3520I8L3k16K56l64J86K47l26J46k42K5K03lj46Q4l11L74J3k28M54m38l2K86j46
3543d7K21p3k33J90j90J05K18k45K5n5j7J56nj55J63j32J61J59j94K62m91O8K60
3566A51l22L29k23k3J73k55K82M8k42pm2l1N86o49J15K98l59L20m7k70K89k82
3588a61J18K74l47J13Mj15K57k33Q7L4k32L16o5n1J83l86J65K33m73N49k46j36
3610a12L83k69Q6J52j94Q9N9l70L11k19j64L60k18K34L9j98L8j92J81J64k97J84
3632D7q1j31L44l57J26K5k82M40rL0n6j61M0K79n26N16k48k63K79n8N5L40l76
3655b7m5q9L8K58k15m7J03LJ15O5j85M0j87J83J90j94J3o4l15M94k65J45J53m17
$$ y = [74, -54, -130, 294, -93, -190, 89, -113, 235, 180, -54, 41, -153, -79, 247, -207, -111, -39, -9, 221, -42, -34, 102, -180, 98, 131, -85, 171, -193, -7, 240, -86, 60, -182, -157, 46, 43, -103, -19, -330, 44, 57, -171, 283, -155, -187, 99, -47, 174, 101, -132, 58, -132, -27, 191, -54, -29, -84, -101, 55, 50, -105, 58, -74, 87, 246, 52, 314, -177, -109, 151, -171, 158, -65, -88, 85, -170, 112, 160, -82, -89, -131, -162, 424, -225, -110, 188, -171, 149, 102, -168, 121, -161, -43, 231, -116, -3, 1, -114, 143, -90, -3, 31, -201, 115, 50, -1, 182, -204, -39, 194, -279, 270, 24, -112, 271, 2, 88, 240, 46, 135, 194, -176, 135, -84, -248, 112, -106, 128, 167, -31, 7, -185, -4, 160, -137, 47, -34, -165, 179, -178, -52, -27, -309, 131, 122, 152, 96, -65, -25, 254, -272, 244, -4, -267, 12, -46, 9, 349, -27, -72, -161, -123, 135, -80, -127, -24, -21, 94, 159, -26, 14, -173, 10, 200, 6, 19, -45, -360, 134, -131, 14, 167, -250]
3679b50J76j9j3L29n00K32Q4o7R2j3j3m3p9J42J48k29J2n1r2K21J39j77ol41M90
3704A72n3j58J69k71Q0J60j41L60l61n4L48j73o1K1k24J64M2j71L50l94R3J01
3726aq0L42j78k49J54j85K59M2j30n2m0MK46j72K74j72l12L80q0j38N8m5J06n
3750B6j23L22k29%J9j20J47J94k25J07k81J91J71k22J23m4k02K98o9j40J19j80
3772a18K37k8j68J76jl54N50l24L7p1KK63l59J61K45m23J78m9L9K29l24k15Q6
3795b31R6L07o9k92K06j25O4L10m66K75j30m3L05l6j91J00m20L03J89j91K7k6
3817c8r8J41l8K74l4k82K06j52P1K21n12K95q0j05K68j07k46K70k07L60j1l78
3839a82K85k99n0M04k72K42q0k28L63j76Lnk56L43j6K5j7r0o4K62k96K42j86q0
$$ y = [-250, -74, -93, -106, 223, -277, -45, 39, -28, 64, 51, 38, -5, -84, 58, 206, -23, -11, -62, -154, 67, 206, 29, 23, -318, 172, 119, -39, 130, -141, -61, 99, -42, 318, -43, -97, 251, 78, 17, 38, -186, -22, 20, -151, 199, -195, -102, -1, -81, 261, 83, -166, -12, -197, 62, 104, -26, -78, -118, -114, 132, -40, 234, 62, -250, 130, 50, -88, -30, -75, 31, 26, -97, 225, -4, -4, 15, -105, 42, 236, 11, 118, -163, 28, 199, -23, 100, 56, -146, 152, 83, -57, 62, -118, 119, 91, -77, 99, 98, -256, 294, -30, 7, -64, -62, 201, -158, 3, 248, -175, 3, -46, -7, 222, -102, -317, -231, -135, 172, 103, -189, 17, -108, -44, 266, -200, 75, -55, -98, 207, 171, -20, 80, -340, -37, 152, -39, -12, -38, -136, 5, -33, 241, 207, -75, 131, -21, 50, 271, -241, 54, -26, -131, 137, 30, -216, 54, -153, 207, 196, -182, 103, -196, -246, 158, -114, 128, 48, -180, 183, 7, 10, 5, -251, 92, 76, 101, 84, -6, -70, 192, -104, 138, -48, -128]
3863a28K3J5J93L5l03J39L7p1K28k33J62j2k32K12P6k54J88l75K63J72j66K29
3885A98k88k01L46j46J12K22l66P6J17j42K26l64N2R7k0L00j34k39K13j38P9K57
3907B57n00L70k29n2L36k62l0J72l23K28O0r1J33j32m3J77q2J37j40p6P9P6Qj70
3931i7k40M84q2L6L7k74O2J57J6M3K3k77J99k10J87J78m69J94N1k61M52k61Q3
3954C1kk17L68j68q8J30k39J2M05k07k4o4k7R3j32K82L5k68Q5MM0J64m03J42j2
3979f0l8K28j31j39K22r0K21n1k34Q5j94J39K12p7j46J12k93K68%j83K09j93J45
4002A2Q6k62L23k04O8L4j87L59k24k56L09L7j06J74k46Q0m6NJ36Pl44L02k90M12
4026A79n5p5J22k20J7L2OJ08j97j2J06P6O3r4j58P3K39k52R0K5k46M3RJ68Qj43
$$ y = [-128, -105, -90, 103, 138, -165, -26, 11, -60, 168, -65, 97, 85, -147, 65, 141, -113, 75, -300, -37, 135, -31, 198, -90, -291, 55, -91, 21, 243, -123, -47, 70, -72, 154, -210, -158, -61, -81, 219, 85, -154, 59, -79, 0, 257, -243, 127, -102, -154, 182, -80, -110, 62, -261, -33, 27, -64, 69, -63, -106, 71, -11, 126, -14, -90, -11, 65, 73, -97, -337, 147, 65, 101, 138, -136, -74, 83, 99, 142, 165, -112, 87, -123, 64, 242, -227, -33, 18, -243, 209, -52, 31, 29, -188, 180, 12, -76, 54, -185, -173, 232, 25, 1, -63, -90, 3, -129, 153, 188, -80, 5, 9, 49, 213, -190, -48, -60, -98, 130, -1, -140, 82, -8, 213, 162, -72, 13, -181, -42, 170, 93, -53, 59, -234, 34, 34, -149, 60, -133, 12, 98, -164, 159, -45, 23, 57, -130, 229, 5, -251, 58, 95, -11, 163, -83, -3, -49, -44, 92, 99, -245, 57, -233, 179, 124, 49, 171, -49, -32, 0, 6, 114, -83, -95, 11, 87, 150, 56, -102, -29, 210, -42, 48, 73, -173, -130, -121, 47, 55, -88]
4052h8P5J22k17L27j23j71P8r7J78N8k32J78l65K46L48m14J81j48o0K63j40P4
4074G3o2j18K55r6j07R1j47O4P5j45J78m0j01Q8j0P7l4j61J20J46j47J70M4j65
4098D8m2q5J29p2J14J08k21N9J88q7mj16l5l3J2J31O3k03Q4k60J42K43k24j0K86
4123B15l34K62j44j24O9n3P4J80k98K79l91Q5K42k13K06j26j95L52J7j45K57m02
4145a87J2L52l09K75k19j19K76j48J91q9j98J98J6J0j3j2LP8l90L24L3j61J6j04
4169a65J98J67l16J38j0k46K87j09J39j42k27K78J8p0Q4k11K08J1j2M1j01K3J3
4192dJ24k3M7j87K0l7j12K46jm3K9j35J55j7j39K20k81K21oj25J28k32K41m4N8
4217A03l9J15l00K12j81q3K17j98J14k3j26K76J32k33RmK4J27k44l0J46l2K05
$$ y = [-88, -13, 109, -108, 219, 96, -75, 3, -94, 84, 142, -90, 88, -277, -31, 317, -97, 84, -64, -124, 139, -1, 73, 11, -107, 148, 52, -55, 36, -111, -47, 28, -117, 61, 21, -80, 8, -2, 75, 41, -120, 0, 146, -1, 169, 213, 48, 6, -79, 50, -22, 92, 200, -21, 38, 226, 139, 135, 19, -16, -49, -37, 94, 157, -46, 38, -222, -80, 163, -61, -71, 215, -119, 143, -1, -125, -56, -109, -35, 145, -153, 126, -265, -180, 62, -151, 55, -71, -266, 86, 103, -42, 215, -187, -175, 177, -132, 143, -76, -195, 81, -67, 124, 35, -163, 35, 51, 61, 48, 36, 39, 117, -273, 51, 84, -77, -61, -165, 33, 200, -116, 22, 12, -234, 53, -56, 83, -59, -286, -8, 10, -60, 24, -187, 21, 32, 20, 61, -40, -17, -4, 120, 97, 144, -43, -23, -60, -172, 74, 73, 30, 59, -76, 79, 62, -77, 143, -138, 83, 77, -48, 80, -152, 89, 45, 103, 64, 179, -121, 91, -90, -173, 44, -154, -40, -63, -189, 87, 219, -14, -5, -9, 15, 142, -102, -132, 14, -18, 187]
4240A87l34Q1P6r1K61j04Q7j52k24K91k6j7J35k51o0K62j24J71o2j34L9k69L99
4263A41o6k20K35j96KK30q4o7q9n1K94jl7k63r2J97K21j53Q1Nl48N29k74O9O3
4288A26l38J55o6O4J19r6QK15l28K15k55P3K22j02J3Q8j50J45j14m1R4o3O1q4
4312c9j28L12j82j3J36j7n1m1l1J15o5j32J92j93m0M28l38K80j12m0K10m52L6
4335a65K35r3J99m8k51J12R3L9k2k20K4P6k4J51j64L16k82p1K22r8J78j8l81L3
4359a59K17k14R9N4j92L47q7lM5n9n8l3J70p5j42J48o7L5q4N4j10Q6j74J61K56
4384B15j42k13J02j04K62j40K07j52r8K20j34q0K68n10J92K43o2N6%l36L62j77
4406b1J13M4l08J27p2K81r2L6k37K29j87J85j83J4P6r4L3O6Nj2Oj16K23k11J17
$$ y = [187, -147, -66, 10, -81, 180, 76, 163, 11, -213, 78, 52, 35, 170, -81, -141, 121, -3, 168, 106, -28, 11, -258, 141, 75, -145, 90, -106, -104, 126, 42, -25, -114, -165, 129, 128, 91, -172, -264, -67, 154, 1, 82, 87, -261, 268, -6, 63, 126, -212, -57, -123, -59, 60, -36, -28, 187, -141, 74, -181, -108, 114, 12, 25, 113, -37, 108, -6, -47, 47, -16, 45, -39, -167, 145, -37, -50, 86, 69, 18, -23, -54, 61, -4, -136, 56, -137, -177, 251, -87, 193, 81, 41, 251, -201, -165, 70, -23, 176, 128, -123, -11, 82, 121, 99, -121, -97, -21, -45, 106, -58, 258, -24, -95, 127, 29, 207, 189, -192, -159, 58, -156, -57, -3, -195, 152, 65, 62, 107, 48, -10, -43, 127, 52, -90, 58, -9, 26, -58, -4, -114, -28, -202, -41, 215, 73, -140, -38, -142, 120, -20, 187, 35, -63, 157, 23, -57, 211, -299, -107, 136, 74, 130, 130, -206, 156, -21, 92, 136, -172, -45, -117, 164, 72, 108, -129, 100, -87, 98, -85, -71, 5, -89, -56, 10, 15, 3, 9, -107, 116, -95, 22]
4431B2P2l54K39m8J02K03l37J29k8k6J40J7Pp4o5P3n4j15J72k47j05L01j66Q6
4455e6J48k68L33mj27pj13J34m8M8k3j14l9O6P3J15k78N4J64l1r5N8j35J44L1
4480C0O5o2J9M9M8j83J60J4j38N6j93Q3J20p9O5j8k09K60j13L9M2j59J39J3q5
4505c7Q0J41j63J05k23K79j92r9J52R3k9k8k09J51k5j71K89m1j05P1j7n5J52l44
4529b25K58Kj06Q8o9N7L4k61J91N6n5K41l28J27K8j63L28l09N0K2m4Lk8p4K33
4554E6k8r0M1n3k1K1N8J51l5j21O1q3J81j2r1J48k25L8j7L5O3j56j05L12j69O7
4580B6Q3l18L42j77m3P4m2J63j46j29K97n7k37J19j02K99J03k19j54K10o9Q5m
4603A04j36J92l13K32J6j81J69k66NL32j90L44l12j2pj05K16L4j43m9J33j57K46
$$ y = [22, 94, -260, -21, -69, 33, 236, -101, 28, 0, -26, 114, 131, 138, 64, -1, 72, 18, -97, 75, -172, -277, 24, -142, -56, 92, -176, 157, 153, 26, 19, -94, 40, -8, 40, 17, -97, -136, -70, 3, 118, -160, -106, 58, 27, -68, -10, -145, -1, 30, 95, 33, 52, 101, 149, -34, 126, 140, 2, 58, -135, -52, 68, -11, 54, 36, -173, 87, -26, 13, 55, -104, 35, 48, -37, 43, 184, 21, 126, -97, 182, -10, -109, 43, 136, 107, 79, -130, 21, -4, -175, 114, 73, -32, 39, 22, -33, 119, -225, 33, 35, -71, 17, -52, 5, 39, -222, -31, 25, -30, 211, -117, 10, 38, -125, 203, -106, -56, -34, -78, -75, -103, -177, 56, 28, -62, -21, -74, -95, -74, -16, 135, 100, -21, 40, -43, 138, 126, 35, 183, -42, -4, -21, 14, 77, -79, -184, 128, -41, 26, 109, -209, 133, -44, -87, -13, -55, 108, -38, -167, 130, 73, -164, -45, -147, 152, 255, 36, -118, 92, 23, 108, 104, -32, 160, -153, 79, 95, -86, 83, -183, -178, 154, -36, 308, -4, -16, -23, -128, 88, 122, -21, -70, 63, -94, 152]
4626A52k51N8Q5j01J16J9k60K75r0J51k8k20R4n3Q4J64p4r0Qj35P0J23j34R9K1
4651H3r3J40l23L73j21j16J42j24j35K52j71R3KK1J8j68J47j23O3L5N1m3J42m8
4675I7nK1m03K66j6J09k2N4p9N8k53K71K1q6n2m8J8m5K5Q2K46l31K07k8j97J60
4701G0l8q0JR0J09j25r9J28n6q2J51j46K37j19p%k02J63J18j62ql6O3M5n9M16
4727C72l11j61J26j30l3K86j66po9K8lL0k3K93j68j70J5j8K86q9r3K6j85K58n9
4752C5l51L29r5J7O5j54J33P9j36p2J06O6p5j66K59J38j4j17j06N8O9j82L66k26
4776B6j87J61L6Qq1l7J09n6m7J67r8r6M9j2J52j17KQ2k29R6mJ97Kk25R4Mj25J95
4804F6n0j44K54Q1j21k9r3J40j84j8Q4k9rl4Q4K5r2n3K7Q0N6J18j20r3J04l73
$$ y = [152, -99, -41, 44, -57, 59, 78, -182, 93, 3, 154, 126, -94, 0, -53, 31, 195, 121, 31, 39, -96, -26, 97, -37, 62, 83, -10, 130, -193, 180, 59, -57, 85, -39, -174, 78, -93, 0, 2, 23, 41, -127, 20, -103, -40, -5, 46, 3, 145, 97, 92, 113, -290, -24, -40, 69, 47, 101, 22, 80, -173, 98, 119, 33, -19, -67, -49, -94, -69, 13, 259, -72, 135, 107, -90, 70, 32, -48, -47, 43, 152, 27, -72, 56, 0, -82, 69, -77, 160, 41, 34, 34, -168, -5, 113, -49, -57, -93, -30, 15, -44, 372, 61, -100, 26, -104, -137, 149, -17, -24, -93, -65, -68, -38, -61, 232, 64, -106, -91, -109, 177, 88, -5, 21, -164, 94, 35, -316, 13, -82, -65, 0, -154, -21, 58, -78, -150, -44, 22, -53, -219, 40, 178, 164, 47, -59, -1, 68, -114, 252, 26, -161, 0, 36, 44, -37, -74, 35, -21, -68, 99, 1, -95, -46, -58, 94, -23, -21, 61, -168, -72, -76, 121, 123, -102, -8, -4, -129, 66, 16, -128, 126, 207, 86, 57, -36, 104, -80, -98, -14, -43, -52, -86, -2, 23, -69, -122, -95, -15, 41, 159, 39, -54, 50, -323]
4830c23L70N4j88N9j79J72Q0k89N13m53j8K69j33J79q6m5j11J4O2K47l77K37J5
4853F9L1M5j75J03N3k09J80p8r5J03j55k1J17J30j1K7l58M08j98K18k73J54q1
4876a6K7j79K91q4j9J43q3j04L4r0J00J8k3K26j54n7j1K3L1J2j90K59k66K4J95
4901A07p3O6j21j93L88r9L1k1k3l6L7Q1o7k29J74j19O3J8j35J04L4N7j44J13j11
4926i8L28l16mK02K4j2k12J37J09j02j3R1j95O9J9Kko9m2J12L1O4r3L0j68j2K43
4953A23L7l15R0N0J44l0j32Q6p2j50K45ll7J6q9j31M88j61j82l5j59L28k36N0
4977g5L9n1P8Q5k10J19j29Q2K56k20K29j84J16o0k2L6p6m6N6k9j52L02k26J65
5001H3k13N2J00J43j50O9j50k1L51k51j6j11M9J53n7r4R9o3N5r3J01J5j67RJ94
$$ y = [-323, 47, 101, -87, -28, -207, -35, 45, -244, 269, -184, -202, 67, -66, 113, 27, -18, -129, -115, -53, 194, -183, 54, 69, 100, 145, -30, 73, 126, -83, 97, 19, -76, 27, -128, -149, -32, 98, 87, 114, -244, 164, -34, 184, -89, 65, -16, 11, -168, 123, 39, 20, 163, 80, -24, 10, -80, 20, 38, 15, 241, 87, 30, 19, 42, 73, 85, -105, 154, -112, -88, 107, 34, 100, -21, -214, 174, 75, 106, 85, 62, 26, 63, 144, 77, -152, 22, -97, -34, -16, -151, -47, -13, 44, -100, 13, -98, 230, -86, -90, 112, 136, 124, -88, 49, 158, 56, 43, 134, -61, 8, 27, 29, 27, -42, -84, 28, 59, 123, 30, 60, -108, -120, 123, 160, -155, -65, -15, 129, 99, -33, 53, -19, -169, 76, 73, 36, 52, -37, -168, 320, 159, -23, -58, -217, 111, -125, -75, -36, -87, -9, 76, -134, -15, -144, -62, 194, -26, 203, 19, 135, 75, 53, 89, 13, -33, 23, -6, -158, 144, -82, 83, -130, -78, 22, 165, 15, 84, -66, -87, 264, 13, -3, -114, -65, 88, 31, -63, 36, -27, 28, -65, 36, 51, -116, -107, 87]
5026H7k20J32pM7k1J10j49m0K6J45k6j13J14r2j14J21k9J79j12j67K08p3r5J30
5050D1j51K30j27q8L8j6L2n4J7L17k26O4m0n6n4j85O6K94p8j71K07j45N2J57o4
5075F0M7r9l7K50k09K0J14j60J58k56J00Lr8J88K2p2O2P8m02M00l06K58jk57J62
5100B5j27J12K4o4K8k5O9m1M3n7k0l6j7J48Pj34j10N9K38k6M4R5l97K81mnk66
5127a56J08J54m6j3J49j60j57L21j85k6K5oJ53K2j72J20j46l0N0o8j0J59MO0k43
5152i3N1P0j66J60Q5L0j3p3k4m5j23J07L8K0oM1L0j1K5J20l01J40p1n2J92j3k03
5179h5J35j16N7R2j40R1J11k01M8J18j21J29k04R8P0j59P6J00k9m5N4j00j6p5
5203a12J16L5K9m9j73K44j8j56K81j88J8m6Q5j77K45k70J00nJ18l7j32J88k17
$$ y = [87, -133, -1, -8, 39, 18, 128, -21, -61, -35, 110, 84, -29, 85, -7, -121, 0, -29, 150, 38, -129, 79, 6, -89, 41, -110, 120, -7, -95, -57, -73, -41, -95, -78, 239, 13, 77, 37, -19, -73, -258, -192, 102, 24, -147, 60, -85, -33, 124, 60, 107, 8, -29, 221, 12, 32, 146, -14, 144, -112, -12, -9, -107, 81, 103, 31, 93, 171, -231, 169, -137, 121, 120, -137, 25, -102, 10, 34, -30, -2, -27, 42, 1, 44, -13, -33, -69, -86, 62, 69, -65, -175, -116, 122, 96, 140, 235, -162, 119, 115, 110, -156, -48, 106, 60, 47, 196, 36, -121, 200, 15, -11, 14, 8, 161, 183, 11, 131, -15, -45, 5, -63, -73, 86, 90, 150, -93, -42, 28, -138, 22, 107, 137, 124, 51, 27, -18, -141, -34, 4, 24, 18, 59, 89, 78, 103, 223, -78, 62, -9, -61, 131, 118, -85, 50, -66, -9, 83, -57, 34, 145, -56, -8, 110, -11, 118, -86, 12, 82, -77, -1, 99, 70, 25, 79, -21, -37, -112, 4, 39, 68, 19, -154, 90, 72, -84, 197, 9, 27, -19, 66, -111, 134, -136, -36, -41, 77, 40, -92, 96, -121]
5226a21J92r4j00j16K99k07K13Q1j60m6m8J16r6KO2p7K22r4j15J15j69J41M1l7
5250Dn8N7J35k09R2N0j11L5q2L0J4N1RR4j97J59L1o8o1R6P3l15J54q0K9N9n8J23
5278E6k44Q1J24j0O6J8j20J17j32m6N8l6o1K46l2j71N6q4k6K11j64K26j82P%r9
5304a41R8j3O3Jp1K15K2j68j2L0Q8O0k55L1K23j99J09j60j9J95r1L0OJq0K8Qk9
5332c0J49k52J70m1J57j15Pk4r7O9j9Qj06R6J69Lk77K76k39K7L1L4kK01q9j51
5358d5P1M3P3j39J08j71j52K74J06j30j3q0o1K19j75K53l1j79J30o8j69J91Qj14
5382e1J42k32J88N2j07J12k14J83j96M7OJ25j70rO3N0JjJ0Kk4j4p2J43j18N9K09
5409A84l01K44o4j76J83J9j39J18q6J41m7P0j9q5k5M8m5N4jl13K77nN5o3J3k39
$$ y = [-121, 71, -23, -123, -239, 60, -147, 66, 147, -13, -59, -107, 9, -87, -85, -23, -100, 122, 28, -87, 28, -141, 0, 41, 4, -54, 3, 138, -71, 21, 71, -40, -5, -87, -57, -43, 8, 17, 111, -86, 73, 104, 36, -25, 71, 144, -171, -17, -97, -68, -9, -67, 56, -188, -107, 17, 7, 73, 91, -29, 88, -44, -90, -32, -68, -129, 117, 85, -86, -30, -114, -140, 71, -93, 133, -49, -42, -42, -141, -43, -56, 7, 8, -63, 152, 174, 6, -6, 24, 112, 172, -83, -52, 171, -28, 81, -79, -98, 97, 6, 36, 42, 43, -37, -9, -1, -30, 119, -133, 37, -4, 153, 38, 45, 21, -76, -7, -26, -18, -124, -28, 141, 144, -133, 143, -96, -69, -38, -4, -6, 195, 106, -45, 26, 69, 142, 3, 111, -60, -212, 62, 168, 38, 25, -55, -116, 103, -72, 181, 150, -29, 101, 33, -136, 55, 63, -51, 91, -141, 47, 99, -8, 104, -110, 73, -123, -76, -70, 55, -115, -124, -61, -11, -10, -11, -1, 1, -23, -37, -109, 34, -84, -25, 184, -117, 127, 63, -113, 70, 89, -50, 68, -18, 123, 76, 146, 127, 42, 17, 65, 20, 74, 73, -240, 37, 32, 87, 24, 37, -202]
5435b02L82j62K7j36N6N0J33j64J7k84L38J4K9j81M4j99K73j75J04K19l56K31
5457E8m3L6p6N8O6j2n0Q4pl38L16j94N9J35j11P7j26M1P6J11k03J43j89J67j48
5482g0k7P6o3P0j29K51j11p1M7l6Q3j8j8j02K15j00j27j22L13j7O8k20R0l9J10
5507E3J48l01J98k10L4M6j01J38J5k1Q5J7k44K19m8k01K41r7m0K58j74m2J82j79
5531b4L1J77l38L56k71J92j7j30J82l0Rr4k32K83J19k06J44k25J76q7k9K17k09
5554fO0j10j27L13Kp5j9m1L8l9mJ6J45j26Kj39r4J49P9r1J77j17N5r1MJ3K09j42
5582D1l7oJ17K2k98R9J13o7J4j24J42ol5J32j46J47j31j66J92k64L77k05R3J3
5606A7j9k9R3k2k28L39j35J42j65j45K37j82K6J38j3l5k9M5P8kj97J36j22J14
$$ y = [-202, 180, 18, 45, -91, -35, 15, 148, -16, 1, -283, 55, 69, 98, -83, -39, -238, 35, -140, -36, 183, -173, 58, 15, 51, -25, 33, 99, 87, 37, 121, 114, -224, 92, -102, -43, 92, -19, 58, -68, -27, 49, 160, -43, 100, -89, 78, -70, -97, -21, -84, -14, -143, 108, -3, -74, -27, -63, 20, 2, -16, -118, 97, -3, -130, -252, 61, 44, 112, -108, -18, -57, 53, 201, -100, 98, -112, -78, -32, -133, 5, 20, -1, 84, 101, -143, 76, 28, -173, 68, -29, -69, 189, 15, -27, 155, -24, 7, 184, -154, 202, -69, 123, 106, -24, 158, 128, 137, 43, -189, 94, 213, 7, 151, -74, 102, 15, -14, 203, -6, 54, -56, -183, 130, 132, 57, 38, -3, 35, -4, -8, 8, 153, 27, 29, -110, -204, -55, 24, -67, 110, -7, 48, -43, -39, -26, 183, 41, 4, -2, 115, 137, -161, -62, 51, -16, -2, -126, 16, 10, -25, 107, -39, 108, -23, -189, 3, -261, 116, -89, 4, 17, -2, -31, 62, 40, -188, 151, 16, 158, -7, -152, 85, -97, -71, 67, 54, 19, -10, 35, 113, 111, -86, 50, -72, 42]
5630D2j3j08N5o5J28m1l2J29o4j16O8p3P8j2l1j43J09J28J7o9J7jJ0P2q2K20j77
5657D6k15K76j00j39J80j66J88r6J58k48J26Pk39K63k03K45k54K37J85l40M4P3
5679B8L3j20J93j68J51k49K01j38l8K91l38L9K68k33J97j3K8q2o2J07j35p5K75
5702A60j03k16L9J29m1J0P8k7pj90R3Q7o5Q2j00K86k38j1K48k88L8J78l05J45
5726a8k3Q3J36j96lJ95k21N5r5R4J23k03J84P5k92K00jj63K24j5j69O6j99J03
5750f0j0kP8k2R5k31L0J25L7l1r6J75J8n9j18o8J01Q0l1K5Rn0j30K32l3P4p0j56
5778h8Q0K9N0Mr2oP0O2J1j79o2L17l90L59p8k02J18l0n4J46j8j89K89j34J4L7
5804F4m7Q2L8k43K22r2J4pJ06j44j11K45j72L1J0K2K6r2j4R9K5j23J3P6j43K31
$$ y = [42, 29, -79, -24, -89, 39, -2, -34, 95, 31, -85, -17, -90, -12, -24, -55, -198, -89, 39, 56, -13, 4, 3, 13, 85, 3, 223, 46, -169, 107, 7, -132, 48, -118, 70, -26, 132, -116, 10, 17, -222, 41, -162, 83, -171, 66, 251, -89, -45, 28, 61, -59, 134, -34, 117, -132, 69, -69, -107, 184, -154, -115, 153, -80, 117, 104, 132, 50, -12, 95, -40, -115, 160, 57, -159, -120, 9, -32, -22, 56, 29, 22, -168, -75, 12, -53, 29, -71, 215, -23, -34, 214, -74, -36, 142, -163, -18, -41, 42, 178, -18, -21, 174, -47, 8, -87, 7, 130, -73, 111, 186, -106, 94, 93, -70, 154, 139, -30, 36, -163, -60, -70, -72, 6, -16, 79, -152, -122, 3, 40, 9, -87, 88, 106, 47, -71, -139, -38, 42, 11, 36, 45, -5, -135, 97, 64, 138, 68, -88, -8, 21, 71, 75, -17, -23, 47, 109, 120, -59, -121, 196, -194, 165, 87, -115, 3, -27, -81, 65, 47, -142, 147, 13, 27, 64, 17, 99, 137, -106, 116, 24, 38, 31, 137, -7, -118, 127, -45, -14, -4, 18, 44, -48, -62, 37, 62, -61, -48, 28, -115, 116]
5830A16k00J6K04k03QJ76j32R2j08P9k9j30J47m0r6K12j99P7L7l7J02k3j13J86
5854A42j08Q5n0k44K74m4n3l1l7R9N8k1rMK7r8N7L7K9j8J3k07Q9k9M1j9R2j15
5882c6qk4O5O4j76J17J17k61J78J31l29J64j18L7K98j18o7q8P3j2L3J44p1M7k15
5907e5j14K92j35l5J45n5m2p6J80k79L17J8j15k3j47l0L71l41O9P5O3j2j46K24
5931A49j91K7J38k32N7Q8j40K50j90PJ43j00QJ0q4jJ29k35J24J95j81P4p4Q0j92
5956a41J06J30K1p9j7qmrOO1j01j76K34q1J36j46J21j72P7o8J85j63O3r6J2J55
5982D6J6l2j5j5%J03m1k9k27K18q3k2J55j71M1J63n4k14K78l57K16O2O7L4j80
6007d1P3r6rJ98k18J49Q4k06J52J95j05j88R7J2j53R0k13K40j50K48j45L7m4n2
$$ y = [116, -84, -68, 136, -67, -59, 117, -15, 77, -31, 48, 19, -111, 36, -4, -100, 112, -87, -10, 27, -10, 92, 69, -44, 142, 34, 119, 69, -175, 99, 55, 2, -29, -66, 33, 91, 70, 61, 65, 92, -6, 51, 88, 117, 99, 112, -95, -6, -35, 6, -13, 79, -36, -44, -68, -3, 61, -115, 2, 119, -142, 36, 167, -162, 2, -116, -79, 219, 101, 34, -54, 19, 7, 40, 184, 113, 160, -55, -169, 123, -12, -47, 98, 43, 1, -75, 105, -174, 143, 161, 46, 23, -124, -154, 217, -124, -55, 20, 83, 71, -75, 149, -42, -15, 123, -109, -52, 36, -104, 146, -44, -37, 106, 6, 14, 24, -60, -61, 68, -167, -43, 152, -29, 45, -29, 51, -141, -35, 95, 116, 37, 20, 12, 8, -1, 5, 66, -35, -211, 23, -58, 78, -68, 53, -119, -42, -110, 75, -88, -25, -121, -109, 46, 62, 30, 15, 0, 0, 103, 62, 33, -194, 24, -59, -81, 74, -97, -56, 107, 53, -161, 117, -240, -24, 38, 105, 139, -41, 32, -64, -73, 125, -93, 56, 140, -66, 86, 281, 176, -12, 85, 97, -56, 34, -179, 61, -89, 159, 14, 51, 7, -45]
6031d5j6J88o0l8j77O0J01K3l3n1O6j63J59n0K22j93LO4o1J74j45k4j9l5K2mo6
6058i8P8j65K44K02l03M8MQ9j89J75j78R9R4o1N1o3k08RO3J69K1j97J72L6P2k91
6084a27J48r2n0O2L3J6L2M0j7k0k69J70N7K3k9J3r0K38pj63O6o3K2N7rj42K35
6111A34j33J39j14ok46K19J17j57J51q6j76K38k35K8K50j79L2r1J40RJK6J2l12
6135b39K80M7j82Q8N8l7J60k22J05O1k09J14k6J44j39q6O3P8J8N5j53n1O5N5%
6160D7l5j41J71j79Q4JR3j34j3k1K45p2p9J72j30o2m1P9jm7o1L1L1L36m68K41
6186D7O9j48M7J03q5j9J20n5N7j51J6J35m1j14K03k30K6N6J15j21m0J6j06k3J46
6211B3N1j02O0r7N6l5o0J62j59K05j60mJJ19M7R6j46n4J63q2M5j04p1J14P5r9
$$ y = [-45, -61, 127, 67, 29, -148, -88, 13, 36, 3, -48, 18, -145, 14, -36, 186, -7, -4, 60, -1, 173, 28, 4, -15, -50, -28, -32, -98, -20, -185, 59, 261, -42, 6, 10, 99, -90, 85, -93, 6, 100, 39, 90, 27, -181, -172, -109, 60, 81, -116, 56, 92, 164, -127, 21, -71, -121, -59, -26, -10, 22, 62, 45, 25, -244, -74, -17, 6, -23, -10, -100, 138, 131, -32, 34, -29, -7, 50, 41, -101, 134, 1, 140, 26, 20, -226, -7, 110, -47, 104, 18, -158, 80, -155, -127, 123, -56, -24, -115, 25, 34, 35, 61, 73, -239, 41, 88, -94, -6, 52, 15, 175, -47, 58, 119, -90, 24, -2, 142, 3, -83, -20, 58, 76, 131, -22, -73, -8, 47, 47, 12, -129, 42, -137, -53, -52, 41, -93, -106, -127, 118, 46, -33, 139, 9, -53, -94, -15, -16, -63, -124, -93, -62, 274, -194, 47, 116, -32, 15, 118, 33, 14, 134, 79, 136, -15, 1, 136, 95, -19, 184, -46, -20, 36, 151, 30, -10, 6, -100, -123, 23, 74, -28, 32, -65, -9, -44, -104, 58, -101, 104, -56, -60, -59, 60, 107, 203, 57, 3, 166, 84, 129, 25, -46, 68, 143, 44]
6237D4K9j11J49j10n8O5j55k8K13j36O2P6j09J45j27m8J08k9Q2n8o3K18j39Rp9
6262e0J04k17J67j77K18j15j26J35l4P3p8J7L6J34K6j99M4J22J0j58J22j28m7
6285a21M8J66q3k6rJ24j32j50K99Oj20O7ok10K02j56OK2J53q4J52j46L7O5p3j36
6311a05J8rJ21Q0j72L55k54n0R2j75M6R5m1q9J39j63K70l6n5j7r7J46j22o9R9
6336GJ4N2o5J01l5j24Q9Q8l11J06J83j82P2n0n3J74j69P1J41j15j46K32l4o4r1
6361a09J36Mr7J9J00r8J56K7l02K48j46Q6l9J01j70N4n0J63l56K42m4J19l5q7
6385g8K47r4j92J85N9j62J39k05Q2qL6p4N2p1K03j62J16M8k28Q1J5NN9j0k26K08
6411B5R7j49mJ1m9N0k6mj11O4K34j20O1q2j5J63r0l6ll9q0l5O3L7J04m1Q8l6j44
$$ y = [44, 73, -38, 111, 1, -57, 8, -147, -175, 38, -98, -36, 40, -69, 76, -51, -99, 9, -20, 62, 4, -59, 159, 20, 29, -50, 54, -163, 4, -173, 45, -70, -196, -61, -95, -22, -100, -83, -47, 87, 113, -86, -42, 80, 90, -68, 54, -74, -121, -73, 93, 10, -16, -25, 99, -33, -183, 116, 122, 2, 69, 63, -147, 55, -101, -95, -73, 80, -4, 148, 2, 39, 104, 31, -105, -87, -96, 25, 105, -67, 288, 34, -16, 76, -99, -53, 42, 1, -88, 51, -112, 158, 122, 67, 50, -47, 99, -23, -92, 7, 21, 73, 8, 109, 74, -50, 39, 127, -184, -78, 105, -77, -5, -55, -108, 66, -103, -32, 109, -6, -152, 80, 46, -18, -109, 27, 31, -66, -47, 53, -45, 111, 138, -164, 84, -62, 24, -15, 86, -84, -30, -80, 83, -273, -31, -75, 44, 9, -78, 169, 75, -117, 68, 127, -35, 104, -101, -19, -27, 9, -65, -13, -84, 119, -43, 73, 121, -107, -26, -11, -6, 53, 43, -183, 25, 122, -27, -31, -20, -69, -19, -45, -49, -160, -96, 138, 18, 79, -3, -18, 145, 55, 19, 16, -23, -103, -138, -75, -38, 66, 25, 113, 77, -67]
6440f7K48p5j43j9K8m6j0K49k17m0l9J27k45L97j99N3N0j56R8K7l3q2j12K29L7
6465F0j35K41j12j4m3K6J5O4k0K2q1R8l9j35N7k1J01l9m8o2J03k1J55p2j17J76
6491A59k49J49L2j10P9j42l8K55k31m7K44j48p6J00J27j18rPk0P7m4j84J41k08
6515b54K29L8J35l22K42j75PJ45j70J31p8Q8p9Q3O3j6l3J70k32K1mlL7P8q9o6
6541e4L2j07J51j29L9Q4q1K13k60J09J31k4j70Q4Oj8k9J12k90J84kl2k0J09J2
6566E0k29J99m0j5J00j04j8N2j7J32K7j63Q6l9lj34o4J37m9N2P8l4J92j37N3n7
6592E5J05k63K39k88K12n7q7Kq1J72l3q3J51K01k17J56k38p2K84j71J0NJ21J3
6616A36j24pJ95l19J54o5j67K53j37K05j83m3K55k42Q7L4o8P7J9R9r0%j13J56
$$ y = [-67, 181, 106, -37, -56, -28, -74, -84, 165, -52, -92, -131, -4, -249, 148, -51, 2, 52, -104, -6, 21, -12, -94, -206, 23, 60, -75, 166, 54, 40, -3, 23, 38, 102, 82, 104, 23, 121, 82, -53, 4, -17, 84, 45, -3, -65, 38, 17, 172, 100, -17, 159, -90, 59, 91, -19, 60, -82, -120, 135, -96, -143, 101, -47, -123, -23, 104, -14, -23, -16, -36, 41, -3, -187, -46, -254, -25, 13, 148, -174, 68, -107, -100, 45, -125, 6, -72, 16, -63, 20, 83, 67, 34, 204, -28, -7, -11, -14, 23, 101, 12, -54, -22, -129, 22, -107, -68, 16, -65, 148, -112, -3, 128, 104, -66, 18, 24, 6, -23, 89, -201, -17, -19, -51, -71, 38, 50, -179, 20, -20, -35, 65, -39, -57, -5, -22, 110, 137, -26, 60, 21, 18, -116, -180, -43, -92, -40, 38, 4, 196, 59, 112, 55, 160, -103, 136, -152, 60, 3, -84, -82, -163, 9, -24, -107, 44, 245, 28, 184, -54, -126, 158, -13, -3, 2, 123, 136, 12, 5, 200, -119, 35, -30, -197, 56, -81, 124, -59, -102, 153, -89, -2, 32, -36, 41, 60, 159, 69, 69, -44, 112]
6640A12j59J10j16r3J55j54L1M3n7J26p2L0l4L8j12J36j03J56q3n7R5L3K9j01
6664d7R7j46K37j94M8j06N1J06l13L67M6j46N5j62J67M7o3J72k36M8q0J82k41
6687a11L09j11j76O4j07R3K9J12mk99N5J97j15O7J26j86K48k69o4J67J46k5j91
6710d5ll3n5L1J71l6L1k3j49K25p4j67J76r7O8R3l00K88o6N8j11k2N2j05K56q2
6736H1j27Rn9J03J13j24r3mJ3J55o0QJ02k0j04K4l5J85j68n8K27j51Q5p5j80J77
6762B4q8o7K27n5o3J05n3L6j65J46j34J63kj43O5j32O1JO4k5R1K03k78L6J47m0
6788A24Q1p6k77K78k32K05j04n7O7L6J26o1m6k07O8n6Q8K3l1K6j39L24j48Q8q1
6813A9k9K9Q3k35J48j54K61J8m1p9l9o6L0l5N3P2M2j11K9p4J73r8q8L7L9N4k6
$$ y = [112, -47, 63, -53, -146, 9, -145, -114, -71, -128, -2, -74, -44, -78, -40, -152, -16, -119, 37, -46, -103, -8, 25, 54, -47, 50, -96, 141, -53, -5, -111, -60, 46, -267, 100, 146, 0, 55, -107, 60, 107, 44, 216, -20, 28, -52, 130, -111, 198, 87, -89, -25, -132, -39, -10, 102, 98, -201, -146, 51, -64, 3, 129, -57, 191, -78, -142, 25, 171, 146, -45, -48, -81, -136, -105, 66, 30, 61, 38, -111, 114, 40, -127, 49, -48, 20, 113, -187, 101, 35, 93, -18, -40, 12, -93, 163, 81, -46, -37, -96, 7, 120, -4, -97, -101, -88, 67, 7, 15, 117, 97, -7, 17, -18, 167, -1, -59, 168, 17, 102, 27, -153, 24, -64, -131, 96, 41, -22, 83, 30, 66, -99, 47, -87, 76, 74, -69, -4, -136, -75, -74, -10, -35, 56, 259, -19, 17, 164, 124, 205, 129, -148, 130, -102, 103, -1, -58, 9, 45, 171, 110, 64, -143, -75, -131, -43, -20, -51, -25, -164, 160, 12, 100, 19, -10, 19, 102, -133, 15, -139, 122, 140, 99, 20, -19, -85, -55, -90, -37, 35, 77, -34, -5, -79, 94, -4, -92, -55, -16, 38, 12]
6840A2lj29J04KJ36j73O3o7J31j02J70k28O8J52k00J26O2k38J26L8P0o3q9l6N7
6865a1oN1j6n5o6P9J1r0j6J03q1K01J6j77J4K20j18j19K16q1n5lj43K9m5J12J33
6892A03Q3j50J5n9J24j94K14k26J22K5j60N7l2R0j31Q9M6R1MM4j62N7N9k31J56
6917C4o7q8J56P5k08k5K49j24K3J05j64j79M17j30k06J34K7K8J58k05N8j04j8
6940e4J99j02P9j5p4j83J66r3L4N0n0Q5o5J26Q1j35j05O6P7j56Q4J10k9r3N0p4
6966b1J5mj17N7J73j68J35q2K35m5k77J26o3K2j26k5J35J22r0Q5o5O7l7j77J94
6991F9m2k7J47j08j12m5J21l2J60j64n6R1n1J59j04N8J5j03m4K27k94J99p5K9
7015A8n9N6J68j80KJ63j33O5r6M9j35M6M2j56L71k43j16K55J6q7j89J61q7K4R6
$$ y = [12, 9, -120, -16, -14, 122, -51, 12, -55, 76, -26, 144, -84, -16, 136, -64, 62, 124, -114, 12, 50, 120, 57, -32, -68, -11, -17, 34, 18, -37, -103, -24, -13, -103, -119, -16, -97, 104, 120, -57, -43, 177, 59, -60, 156, 75, 20, 17, -126, -97, -142, -30, 103, 186, 36, 51, -8, 116, -78, 136, -90, 32, 57, -103, -46, -78, 12, -119, -30, 16, 107, 111, 155, -7, 50, 109, -122, 34, -33, -121, 35, 110, -98, -123, 126, 2, 25, 130, -34, -213, 204, 74, -132, 2, 29, 57, 215, 10, 68, -36, -54, 145, 43, 122, 107, 33, -150, 16, -77, -43, 7, -43, 42, -23, 103, 184, 49, -56, 10, 87, -69, 15, 125, 96, 3, 53, -21, -6, -10, -127, -70, 103, -65, 70, -12, 223, 178, -99, 27, -36, -14, -140, -165, -30, 92, 2, 87, 22, 89, 52, -125, 69, 27, 0, 147, 39, -73, -118, 3, -29, 131, -33, -89, 2, -49, 110, 6, 64, 79, -24, -68, 159, -135, 64, -11, 18, -41, 15, 183, 3, 5, 168, 35, 100, 4, 53, -82, -36, 6, -150, 221, -22, -138, 117, 133, 46, -143, 18, -69, -45, 51]
7040E1j37J82J09k21LJ44j33O7l9o3RK06r3p7j8M9q5m8J66k6l7m4j92K98q2p5
7066h6M4Mk8N8K27l12K46j51J3m5R9r8j03K20J48j85k02Lp3M15q3k52J83j15J05
7091C2Q1j64J14j%K9j98p1J16PN2L8n6m4J31j13j17J79J44j15k43J90j61J9PQ1
7117f3PJ67j35J30k9l2j1P1j36J11j83p3K72j96K68j27k8R9k44K8J31O5l2m0j43
7142a23K03K8j24J61j05M4j14j49K41m4J42o9k19J17L6m2P6o9m5Q6l0k8J49J3
7166A35q1J20l31J52j51P7J69r8J58j29p0q8J27j29J05Q9nJ02j98K46l10k4J08
7189b6o4J33k6j06RK11j23k2l1J80j07j20J2R6q8n5K0J2J53J16j36Ql0j44J83
7214E5R9q8r3lP8p7l1J39o4j03O9o8J52j31K9m0J40mk63L45j20rq4R6p5K38j93
$$ y = [51, -86, 96, 205, -16, -13, 131, -2, 65, 26, -37, -28, 178, 85, 8, -10, 39, -46, -94, 72, 46, 9, -35, -227, 71, -11, -86, -42, -38, -66, -8, 219, -93, 153, 2, 15, -30, 69, -29, -132, 88, 236, 51, -151, -148, -221, 194, 111, -141, 42, -73, 32, 113, -51, 63, 62, 62, 91, -107, -178, -62, -55, -3, 35, -21, -65, 66, -47, -164, 15, 159, 44, -199, -9, -170, -151, -144, -63, -56, 111, -24, 106, 77, 45, 34, 105, -31, 80, -103, -176, 96, -100, 168, 41, 13, 112, -132, -104, 27, 92, 60, 20, -123, 80, 108, -16, 145, 40, 84, -30, -179, 62, 18, 160, 91, -128, -11, 25, -17, 59, -10, -55, 31, 1, -27, 122, 135, 54, 174, -157, -5, -156, -79, 90, -8, 150, 21, -49, -137, -10, -139, -34, 55, 50, 152, -46, 200, -110, -134, -26, -90, 43, 17, -89, -80, 131, 8, -14, -45, 135, 28, -92, -80, 16, -72, -127, -107, -95, 58, 174, 38, 46, 16, -128, 55, 154, 66, -27, -30, 48, -29, -60, 79, 15, -88, -19, -87, 65, -66, -37, -77, 63, 59, -204, 141, 21, 12, -72, 24, -51, 187, -6]
7241fn2M8J1k2P8K0j42MjP8j85K44m4n5n2m6J95p5p4K72k10Rm7J36rm5r5K03l42
7270b04J82l2Pj1K04m4J9j4j63L2N1N9n1J30j98N7R7j29J15j23l4J39j19J08j40
7295f2K38j68j24J20O5N2j86O8M4p0JJ7j46J45L2p7L7n2J13j23j6l0J88oj47J80
7321I3L3j35n6j47R2N5J81m6K6j99j7J84Q2j52r1J13k9R2r7pP2r6Q3P2o9P3k28
7348a18K52k72J20K2n1K42n2j30J55k57j8K41k05J40j05K4J0N1j36o4J55K6p2
7371d2K36l85K50O0j97N7q5j9J29l14K27R6q6M6J61k79K39p7j51J31m3%O9j60
7395a37J67J20j39J2j9r1nK29j00p4j5J97j00j04l7N8lJ95j53R6j79J3J76p7M8
7420G8j42J68j30lk2L1M2o2O3L6o3o1P5J47j36k1n1K6Kk3Q6N8k13J82j05M9N9
$$ y = [-6, -58, -10, 1, -21, 57, 77, -65, -61, -62, 16, -169, 75, 31, -24, -76, -122, 73, -2, -76, 196, -14, -5, -52, 84, 75, 30, -65, 138, -204, -22, -54, -47, -58, 146, 102, 121, 107, -56, -24, 27, 86, 35, 165, -33, 24, 121, -8, 107, -16, -50, 89, -30, 78, -62, 176, 8, -116, 4, 69, 121, -65, 3, 47, -23, -22, -5, -151, -6, 26, -51, -14, -66, 47, -76, -92, -122, 66, 60, -87, 93, 126, -9, -65, -212, -120, -65, 116, 70, 96, -103, -120, 64, 146, -6, -97, 16, -13, 79, -18, -25, 47, -49, 34, 106, 37, 110, -118, 134, -138, -18, 4, -47, 195, 143, 13, 168, -89, -107, 134, -71, 69, -36, -12, -2, 49, -87, -151, 4, 30, -42, 194, -191, 59, 119, -78, -21, -106, -125, 4, -310, -83, 13, -73, -27, 134, -145, 94, 17, -134, -3, -46, -46, 23, -137, 30, 150, 11, 23, 4, -87, -92, 137, 37, -37, -52, 145, 45, -59, -96, -38, -41, 154, 1, 97, -82, -69, 107, 30, 78, -64, 104, -26, -29, -51, -20, 22, -40, 23, 59, -4, -65, 10, 157, 21, 0, -51, -25, -23, -46, 40, 98, -115, 67, -38, 11, 70]
7447G0n1K5o1o6J44j73J12Oj44J50r9QK5O8n3l1k4R3k1K7j57J86j78R4N7j09R4
7474hJ00q5jk5J97k22R4J19j12j34J36j78J30m4m1J5K0J0QR1j37J31j68j4J24
7499Fp8N8Pj17J07o0J08k4RJ17j39k93L31J14j09Q5r0n0KK27k00r1J47n4r7K12
7525A28k10J8J6J46j57K7k43L13r2L9l5n3N2N9j32K22m2M8%k14K73j98J51j07
7549Ij54K08q0J65K2k76N4O6l3R8n3j23J36r3K56j91J27j56P0nk6M8m4k6K7NK5
7576E6P8j97J12r7r5J86Mj29n5PQ9J32p5M9K1j17N7n4J72l1q0R0j22J0o0N4k23
7603b18M26k79m4J88O4j80J02k19J46J40k50J90j23K04Kk53J36mm5J01j43K2k6
7626f3n6J41O5j55M0q5K38Rk92J04k4J43m6m3l9J46k3j11N6k88K31K8nj9R5J51
$$ y = [70, 19, 44, -17, -83, 61, -112, 0, 6, -138, 12, -87, -79, -54, 14, -39, -70, -94, -1, -22, 5, -152, 34, -144, -50, 7, -102, -8, 92, 7, 6, -19, 178, -44, 50, 169, 57, -77, 59, -119, 11, -33, -74, -59, -39, -29, -21, 70, -67, 64, -104, -118, 6, -72, -14, -7, -124, -17, -77, 31, 7, 16, 133, -6, -299, 32, 146, 37, 122, 32, -18, -16, 211, 11, -80, 67, 13, -84, 128, -82, -64, -48, 98, -59, -32, -275, 38, -54, -15, -50, -103, -51, 8, -124, 98, 56, 104, 104, -110, 163, -35, 116, 9, -145, 63, -17, 148, 170, -106, -52, 14, -19, 79, 26, -97, 39, -54, 202, 11, 138, -18, 52, 47, 21, 69, 25, -1, 26, 31, 56, 134, -63, 49, -48, -143, 43, 47, -82, -137, -130, -41, 91, 16, 65, 86, -31, 26, -28, 144, 113, 33, 123, 1, 11, -49, 5, -218, 208, -71, -115, 73, 137, -43, 59, -160, -14, 126, -124, 66, -57, 147, 149, -104, 32, 28, -17, 84, -59, -37, -63, -119, 22, 87, -68, -28, -113, 125, 134, -158, -54, -78, 65, 19, -24, -63, 83, 60, -51, 5, -283, -52, -24, -29, -48, 47, 198]
7652A98k80J7P3J08p2j86K52n7m3M9j06R5r6L4Q4j75R1L9J40k52N3K01j59KK6
7677C6M3j4j67K8KJ11N4j30j12J24o1N7j12N6J15j53qK56n6J5j45l8R1o6j7P6
7703a5l0k1J4M0R9L9j66Pk0lQ1p7J52k4j8n2m4J23k87L32j66L4n0q2K02L0j52
7730e4Jj01J75l1k0l6K09%k10L9K1QR8j09o1J13r6J78q4K5r6J01L0j3m8j40Q1
7757b0M2n9Q9l9m5k4M9l7J27K6k38J21R2m7R0r1o9nk4J05j16P7K3j13J52r1P2
7784D7Q8p3k00J59M1n9r9Q3j9J86n3j00n8P1nr0J44j52J51l3j95J79M6j06RK12
7810A74k63P8j2M7j9l0q9K47j64J42l5N4J5p4j15j21J58n7N5l6Q8r4J36K7o4O4
7836A12k41J04L5M4oM1r5M2j03pM8M2j79O4J86m2o5m6J00o7R7K1q7K75k02K2J29
$$ y = [198, -82, -65, 8, 116, 44, -142, 110, 53, 10, 59, -47, 48, -48, -14, 70, -105, -14, 25, 165, -87, -34, 167, 8, 10, 36, 79, 65, -102, -74, -72, 39, 93, -37, -149, -25, -86, -29, -141, -85, 30, -123, -131, 125, 69, 84, -61, -99, -8, -74, -91, -15, -45, -66, -52, -12, 87, 126, -40, -33, -53, -56, 25, -52, 100, 76, 58, 6, -38, 85, -202, 130, -36, -2, -52, -134, 68, 98, -54, -53, -154, 21, -10, -30, -66, 143, 143, -67, -28, -7, 1, 99, -10, -71, 42, -54, 124, 40, 65, -31, 70, 100, 87, 39, -101, -20, 22, -37, 52, 13, -32, -56, -7, -44, 83, 109, -129, -8, 84, 37, 127, 36, -33, -38, -62, 43, -73, 4, 27, -86, 66, -25, 47, 135, 62, -138, 21, 62, 3, -96, -13, -32, 154, 101, 1, -57, 14, 9, -81, 63, -89, 62, 29, -166, 13, 59, -47, -38, 174, -89, -11, -23, 24, 5, -25, -114, 133, -31, 111, 76, 130, 145, 71, -44, -165, -7, -64, -9, -45, 43, -51, 85, 112, 48, 112, -129, -25, 10, 54, 48, 89, -6, 36, -67, -74, -26, 16, -163, -99, 87, 45, -20, -66, 34, -33, 64, 85, -2, 273, 71, 93, 222]
7863B22n8j11p1QJ6j9K1J53r2r2jk1K0J49p2K3j29J26j77j3L05j14l7L4J29j81
7889A8R6r9R7j40m6K75k22l4K8J36k24j4Q6K8Q6r4rK08k2k28n4J77k4R3p4N0j9
7916G5k5J3R8M9m9k00J8J02j76K37j8k07J71o4j41L08j82L4Mq5M7J35j80Q5p3
7941b4j4J66o6q1j7K9p6J59k3k36K30j48J45n4j12J77j93K66j00nJ01p3k99K90
7965D2n3k7l3L3J06k80J31QJ06J7j14N7r2J57r4J60M7j27P7l6k69N0K04j35J87
7990A22j63k4Q6O3Rj84N4lJ59j05K0lr2N8J3j56J11k68K29P8j39J72j58q5J85
8015b1L3N6r2l1j17J66Q1j61J60j16K26j11N6p9j61K38k20q9K44j4n9j29J34L1
8039B5j68j35J22J55R1P6j44J4j89J16q5J84J4r9n6J62j65J38N0Lj18k1r6O1L3
$$ y = [222, 164, 53, -18, -10, 6, -13, 8, 161, 69, -23, -24, -45, -25, 124, 52, 75, -54, 72, -105, -118, 187, 73, 36, 70, 199, 18, 114, 15, 112, -28, -74, 201, -21, -55, -27, 109, -115, -129, -43, -15, 71, -23, -32, 176, 154, -74, -128, 49, 25, 118, 44, 94, 75, 50, 63, 161, 210, 161, -39, -21, 81, -95, 142, 124, -83, 88, 24, -117, 191, 9, 43, 47, -38, 9, 144, -36, 49, -24, -38, 128, 62, -19, -36, -7, -83, 76, 53, -183, 47, -101, 44, -10, -122, 55, -138, 128, 28, 23, 124, 51, -248, 42, -11, -38, -71, -38, 68, -212, -81, -73, 33, 50, -64, -7, -99, 58, -36, 124, 171, 44, 121, 85, -184, -134, 70, -65, 122, -41, -65, 21, 84, 93, -91, -37, -40, 119, 14, 34, 31, -61, -3, 10, -146, -35, -303, -74, 4, -135, 37, -121, -206, -21, 12, 68, -24, -55, -172, -6, 75, -86, 74, -42, 184, 73, 129, 50, -111, 127, -93, -182, 62, 48, -11, -140, -6, 25, -143, -278, -156, -1, 90, 166, 22, 36, -153, -37, -122, 62, 76, -23, -79, 83, -82, 56, 106, 109, -9, -30, -126, -65, -32]
8064c2KP9j79O5K5M6PJ64j51j16J73J0k89J40J79j8j25R6nn5p3N5K1J63j64j9
8090aJ12q1l6r1M9n2J34n5Lj3m0k4l4O2J97k15pJ48o6J59k23M9J22lq2M5j48J12
8118B1r4M7K23k82J11k61L30j72J94r7RN0p2o1q1K11m7j44J02L8j23K25r4r5J52
8143I0k17K38r5JN9k37J97k8j62K26m8p2J30j02P5L5l6j35nJ4J86k36N2J7J41
8168H8K3J5j76N2qm1m4l9L4J26J08j54o5k7J00k7M5m2N3j70L6J87J22
$$ y = [-32, -30, 49, -130, -65, -40, 6, 13, 177, 26, -90, 83, 93, -196, -56, 123, 105, -20, 76, 71, 16, -57, -2, 19, 182, 18, -1, 111, 30, -6, -97, -48, -100, 34, -21, -18, -31, -71, -95, -129, -67, 130, -85, -92, 56, -10, 149, -74, -25, 97, 94, 12, 57, -91, 21, -73, -26, 197, -85, 26, -235, 95, -77, 117, 20, 29, 79, 7, -54, -135, 76, 29, -115, -13, 25, -98, 127, 33, -62, 90, -127, 111, 16, 17, 76, -161, 36, 8, -154, 72, 24, -48, 82, -20, 55, 90, 54, -81, -86, -72, 114, -122, -70, -53, 88, 111, 126, -50, 2, -6, -47, -91, -130, -96, 30, 138, -16, -81, -108, -8, -35, 10, -32, 21, -149, -113, 74, 196]
8191A96
$$ Imaginary data points
##PAGE= N=2
##DATA TABLE= (X++(I..I)), XYDATA
0@%%%%%%%%%%%%%%%%%%qJ6j6J6j6J6k4L2l2M0m8N4o2P1p9Q8j03J17j31J47j64
39h6J81k02K25k50K78l07L39l74M13m56N02n52O09o71P39q16R03r99J109j239
59f54J386j562J773k034K369k807L414m321N847r061L0670m7346k3771O6479J591
74B1973k5952k741K7936j5210k2976J4169R473r14Q511j9659o757J2080J0029
87I962k77k2377K464K8119j7362j2164J3476k006r22K380k346j853j797R186q447
102c964q719K3237l013k3517O077J3406M830j4108n855J8809j1423j0336K2191
115G615l716j1788L535q28K165L209M004o241j4768J7446R606k0644L778J3333
129F706o183j3939L111K7798j1845l1559K3295J6539j8369l349O467M061o007
$$ y = [0, 0, 0, 0, 0, 0, 0, 0, 0, 0, 0, 0, 0, 0, 0, 0, 0, 0, 0, -8, 8, -8, 8, -8, 8, -16, 16, -16, 24, -24, 30, -32, 39, -40, 48, -55, 62, -69, 78, -86, 95, -107, 118, -132, 146, -161, 178, -196, 217, -239, 263, -289, 320, -351, 388, -428, 475, -524, 585, -654, 732, -830, 943, -1091, 1278, -1529, 1885, -2436, 3411, -5650, 25020, -22326, -46097, 20382, 21973, -3979, -6720, 21216, 6006, -16970, -2801, 6672, 5758, 14269, -5390, -12147, -67, 9962, 9685, -12692, -10228, 17891, 529, -11635, 1841, -165, -1087, 1293, -1053, -2906, -4703, 4483, -3964, -12683, 10554, 7541, -15976, -9899, 3507, 8337, -5771, -11626, 7183, -4240, -14576, 7615, 3899, -7889, -4354, -5182, -3017, 192, 4196, -2045, -16813, 633, 10239, -10405, -6627, 6706, 523, -13416, -10305, 17493, 5648, -25911, -2616, 13923, -4446, -7795, -1328, 2733, -3274]
142c274l692J1841n233n184Q016p032L54Q293j388l905r118Q693J2180j2721m10
157b580K527p025J1680Q93j0249M154J968J52n881P68J6438j0028j5700J1577
171a306Q604k029p689q90P550p619L102J0282j3558k94R194o534J153K259J164
186C389j461r104R077O595j0167J529N15k086M535J94R02p053j660J3668p603
201A270o014J1245m872n500K370L991O172j0199m849R303k338K430J858q098J783
216a448J970J664R67n261N091k416o779J0300Q9n172J725m439L704L317k964K684
232C032o688n18J0210n587k944L806j367q24k325O005L231j2608L075P008m037
247e31K822l309j275L009m192N551J871o941K602k367Q0Q194m295l893p85J587
$$ y = [-3274, -6966, 4875, -358, -5542, 2474, -4558, -4204, 4089, 2701, -1204, -10322, -1629, 10551, -2170, -2580, -53, -7078, 4602, 5495, -4754, -600, 1368, 1520, -4361, -3593, 12845, 2817, -12883, -1306, 7298, 5269, -2420, -3310, 4240, -3379, -277, 10005, -3553, -3847, 5347, -1187, -34, 2225, 3389, 1928, -7176, 1901, 8496, -1671, -142, 373, -1713, 2822, 3016, 3918, -3135, -4795, 8873, 1270, -4744, 6501, 1629, -3871, -1501, 2490, 8662, -1537, -6386, 2917, 579, 3009, 4867, -3231, -1448, 522, 2186, 3153, -2108, 2983, 567, -6212, 4088, 4177, -995, 730, -3709, -5, 3312, 348, 3032, -3656, -4174, 6036, 449, -2495, 1311, -56, -880, -3205, 2800, 6031, -6577, -3502, 3506, -531, 2291, -1018, -2293, 716, -3476, 2075, 3946, -2995, -393, -2760, -2680, 5514, 1219, -2674, -3459, -1872]
263a872O228n593k91M847p767J458N216j694J320n170L31N237m602M523M41q582
279e970M820K645q71M57m280L067J15k746O095k984k541K328l878N090K545n474
295a582O58l353M415N850q479P32L298m411K785J020J738j146p612N415L811l296
311a57K528l944j143L945k133L686j162m942M141k340J491M941o323l57J970j248
327a047M136k798o56J199m760N533K342n352J405j774J776K710l940L680k156
342B98n297O990K11j154N50n554L343K634j492K644m647o60L574l011L909K87
358B625m694J455j437L608K766o783K148P04l022N179j205j241K89l886M794J031
374B331l291K626l684L2M244k156J309k070k355M667j780J219J430o371L146J917
$$ y = [-1872, 4356, -1237, -1528, 3319, -4448, -2990, 2226, 532, 1852, -3318, -2987, 2250, -2352, 2171, 2612, -5970, -1150, 1495, 624, 1081, -3199, -132, -17, -2763, 3332, 348, -2193, 135, -3743, 1347, 3892, -1582, -924, -4277, 138, 5988, -2491, -1759, 1539, -2872, -87, 933, 2671, 1525, -6087, -672, 3139, -157, 2371, -1573, -2716, 1229, -904, 2782, 1620, -3322, 819, -1521, -30, 4911, -1412, -1769, 201, -1047, 3089, 291, -365, 834, -3926, 1607, 3949, -1403, 2, -1772, 4, 2714, -1226, 2454, 298, -4999, 1991, 2202, 1048, 1598, -3956, -613, 2021, 529, 3173, -1474, -2134, 1440, -1571, 2338, 2625, -2069, -614, -2051, 1557, 4323, -2460, -312, 392, -2630, 2549, 1344, 103, 392, -3494, 1300, 2331, -960, 1666, -2018, -1986, 2258, 102, 1411, -659, -3014, 1653, -127, 1092, 2522, -3849, -703, 1214]
390A214j760L485l770j495K283j893N102p86n602K407p05K447J995m089J502j443
406a108j804N556j888o17O05m577L851J974k017J706m036N48L577k701K703j293
422D79l533L379o86J633O67m870K938L06j478M133l279j106J379k096M581l02
438B145l993J752k176K301L484m429O82o96j052L971j762N39L79m778L215J820
454A402r28K107m767l71L920j721K721k019l099L631j610R79K034l775J434p69
470h31p09M511k933q50P62k574M478K46l103J057k392K301K986l993J521j077
486f00j856M260r75j07L25l955K927P03p08K658l829j006K145o52M077k386l957
503b936L227j125J888J479m194J488o3j312L673j911J64M9l413L651J333j714
$$ y = [1214, -546, 2939, -831, -2326, -43, -1936, 3166, 2380, -3222, -815, -1520, 927, 2922, -1167, 335, -1108, -2912, 2644, 756, 139, 744, -3833, 18, 1992, -25, 1681, -2355, -1807, 1770, -931, 1772, 479, -3054, 325, -361, 1272, 1939, -2931, 7, 313, -1165, 2968, -311, -1417, -38, -2134, 2447, 2145, -1848, -96, -2272, 29, 3513, -916, -234, -930, -1982, 1989, 227, 766, 1145, -3633, -418, 1402, 474, 2581, -2186, -2557, 1363, -358, 2363, 344, -2755, 876, -734, 245, 2279, -1496, -62, -831, -1540, 2971, 38, -812, -50, -2624, 1854, 2100, -1003, 54, -2338, -37, 2949, -1044, 477, -600, -2456, 1804, 829, 722, 1047, -2908, 19, 722, 14, 2672, -1157, -2163, -18, -670, 3407, 1021, -2936, 291, -834, 1054, 2533, -1661, -173, -236, -1548, 2125, 214, 378, 427, -2986, 665, 1998, 284]
519B84O71m043K552L508l275O80j395l80L285k885J360J847m414J282P10J004
535G91K287m840l09K504j201L389j669k987K059j515K339J253l378J942j604j186
551b125M179j346k38n77l019L952O95j766J326l061R97K230j466K071k425j977
567b550L793j313Q67L62l195K441m97n36L057k927l38M80j241L989j173k620Q59
584e42j706L367J819m248R62n17K27K117k335J867L78m442K435J806R9K90m472
601b895J657K750j767J798j645j664K400j371J506O81k746J470j312J96L639k553
617A44q90l8p32L936j521k369J631j470J725J191k318J662k092p04L210j247P28
634H46n03k910K872K12j9J668l972M39J843p25K385k131j781K171j546K267N90
$$ y = [284, 955, -3088, -536, 2972, -303, 377, -1018, -1398, 1887, -998, 362, 2209, -2205, -923, -213, 791, 3078, -1762, -2071, 433, -768, 2621, 952, -2035, 24, -1491, 848, 2101, -1277, 665, -939, -2125, 2054, 708, 470, -107, -3126, 826, 1521, -245, 1081, -1980, -983, 1247, -219, 1852, -573, -2550, 1243, -70, 797, 1159, -2036, 405, -92, -628, 2429, -498, -836, -356, -1597, 2392, 1219, -1401, -542, -2248, 1119, 2938, -1310, -348, -865, -638, 1479, -856, 1011, 1389, -3053, -618, 1188, 1287, 1577, -2895, -1238, 1512, -255, 1543, -102, -1766, 634, -737, 769, 1450, -1296, 174, -1138, -942, 2697, 144, -746, -784, -1516, 2420, 899, -1470, 161, -1309, 416, 1607, -711, 951, -1141, -1845, 1365, 118, 846, 343, -2567, 305, 517, 498, 2166, -1806, -1367, 476, -249, 2136, 5, -1776, 395, -1151, 1116, 1706]
651A706l311J618p29J54K204k066R16q25k201L943qj737K67j926K436J432k599
668g26J574j496p47K739j534R37q5k714K020k06O43J875l754J32J537p32K876
685B339k354j487J755j225J698P26k341J163j470o1L280j670j75p95j279L209
701A313n83j020J349k833J192J624r82J364k105o23K366j447J346j09k735K002
717A19k75M08J597k706L22J12n79L238j543k032J314j284K252O01k229J074j589
734a200J63K610j549O77o92k069K584Q8K03M02l373J545J509j117J681k102o41
751a281K092j474J495J36k100J262j064P89K395k795p8L64p12K695j533r14J302
768E79k043J879J039j611R37k159J82K629j242O00p72k017K489k10P7Q99k718
$$ y = [1706, -1605, 13, -716, -562, 1642, -424, 492, -333, -2534, 1409, 1401, -336, -69, -1995, 441, 1873, -726, 848, -648, -1395, 1344, -190, 747, 662, -2052, -32, -238, 405, 2280, -1474, -1342, 195, -537, 2339, -15, -1502, 253, -972, 726, 1452, -889, 274, -1196, -1257, 2023, 353, 178, -617, -1896, 1313, 730, -290, 1059, -1774, -582, 1042, 60, 1424, -681, -1304, 1062, -385, 961, 852, -1883, 119, -156, 252, 1849, -857, -535, -423, -1002, 2236, 693, -1339, -25, -1309, 943, 1544, -685, 389, -1200, -1037, 1573, 24, 701, 9, -2060, 524, 612, 815, 1217, -2156, -611, 898, -219, 1462, -640, -1281, 811, -663, 832, 968, -1132, 130, -934, -145, 2250, -545, -623, -259, -971, 1724, 191, -723, 579, -1464, 415, 1454, -157, 780, -1379, -1197, 1432, 190, 790, 18, -1999, 490, 280, 357, 1256, -1462]
785a462P81Q71n55K200k068j038J542j311K014J99k347J320r73N01K098k356N29
802e5j89j104K586p78n62M95k103K004P40j212R95j997P7K156j316J060p63j992
820a958K234k79M05J030k770P73O67l96K129j839j099J113j199K211J89k028R66
837A49j188P51J857j927O04m23j288K273l33n12P13k203J554O18q14J168k070
854a071K68J442r08J142m54k031J861k97O09O69k244O87J09k07J995j543o49O79
872E7j182J929J44j493Q24j488M58K146j603O47o12j234K379p57j3M73k045J229
890a41O92q06J645k220r4J432j020J617n29j736J294n36P03R55k066O12k19l81
908g98K274j401n19L95j269K017L57j573P53j532P97J727j260P36r80j234K119
$$ y = [-1462, -681, 190, -365, 1835, -233, -1271, 271, -1040, 974, 1173, -1174, 146, -827, -326, 1772, -584, -55, -244, -1348, 1238, 460, -102, 393, -1710, 294, 1034, -178, 817, -1180, -1103, 1053, -263, 797, 34, -1958, 276, -3, 402, 1432, -1338, -565, 102, -294, 1835, -4, -1103, 10, -1189, 1022, 1211, -817, 149, -1039, -288, 1569, -358, 246, -177, -1465, 808, 475, -37, 676, -1527, 27, 645, -169, 999, -1071, -803, 639, -269, 873, 419, -1612, 249, -48, 561, 1230, -1014, -327, -218, -425, 1570, 27, -622, 57, -1125, 804, 948, -545, 279, -1209, -751, 1395, -208, 439, -173, -1407, 972, 215, 202, 675, -1370, -141, 551, -255, 1390, -830, -924, 508, -512, 1105, 576, -1160, 134, -402, 301, 1256, -810, -198, -417, -798, 1476, 75, -444, -49, -1318, 699, 1056, -517, 236, -1296, -499, 1228, -32, 704, -276, -1510, 609]
925F09n28M75M10k445J096N46r2J260j710l84Q82p53J695p45j263J196q94O95
943E0J417k003N06m08k88K062j247m07M62j441J801K42j066J041j809O01J345
960H58j062J081j021j065J563m57N30M55k099J008L27j37J510j873l69Q75p55
977f31J541k96j138N83q97O86J361j455M14n93m96J979r69J55Nj445J614J00o64
996a46Q95j653K84J211q71J167q74j172J378m49Q30M47k078R35j62J3J514j569
1014c00j05K83o94J825k76j416R42j169O85J331j330O37r48m92J859p04J84o6
1032B46j452J399jj96J008j874L82R67q17J310q68j070R76o51J041M55j648P67
1050b6m18J02J649j470j13L09r81J492q5n97N49j603R74J159j063P77j104n91
$$ y = [609, 81, 556, 966, -1479, -383, 163, 71, 1331, -379, -763, 119, -634, 1061, 316, -947, 249, -645, 50, 1467, -536, -30, -438, -726, 1336, 89, -318, 144, -1297, 504, 746, -320, 721, -1088, -487, 858, -204, 877, -144, -1209, 354, -103, 427, 882, -1217, -209, 118, -19, 1491, -382, -751, 124, -631, 910, 614, -524, 59, -838, -152, 1209, -246, 168, -425, -921, 1058, 89, 244, 249, -1196, 418, 518, -146, 749, -904, -620, 591, -280, 887, 13, -1159, 219, -230, 600, 1047, -1031, -96, -258, -245, 1269, -300, -405, -122, -816, 1009, 733, -683, 259, -910, -225, 1106, -224, 413, -535, -1027, 832, 128, 312, 246, -1206, 193, 192, -4, 1004, -870, -488, 479, -338, 972, 104, -966, 10, -641, 400, 855, -793, -26, -444, -342, 1307, -163, -276, 33, -948, 544, 459, -138, 411, -1192, -218, 941, -122, 655, -449, -1040]
1068a040J640m39K51l5j575J286J63m36J319j567L5N60o59J656j102p96J017r54
1086f76J076O84j795R37p13j4J594j276J40r8q60J636k7q48N15j459J107P38r08
1105b47R65j118m82J379n28Q01r1j953J108J37J18R18j604L31K04o53J603n91
1123B97q23M72q46J136P77j303M69p06l2J437r29J86k62q83J595k41l71Q28j794
1142i93P80P02m55P63j197m17J014m17Q74k8j513J022n16M43J008j537J29J64
1160a74l17J504o44n94M63j106R68N12o88N47j171j64J583r50O05k40j101J275
1178C08k16J45M22j451N33N92o43J414j275o11J031n51R93k43j288J001m05J84
1196f0R15j294M25Q0q52J687p39m46N97j260J012N15n27L68j045J7J158p72Q17
$$ y = [-1040, 600, 161, 412, 377, -1198, 88, 251, -185, 1134, -433, -398, 162, -497, 1159, 57, -739, 278, -676, 400, 1084, -711, 226, -487, -501, 1093, -183, -43, -141, -1001, 635, 608, -240, 275, -1184, -77, 661, -247, 718, -400, -882, 497, -31, 770, 679, -1274, -166, -29, 89, 1007, -597, -266, -62, -715, 888, 297, -526, -54, -900, 236, 1013, -290, 179, -527, -559, 878, -51, 135, -127, -1010, 585, 344, -27, 801, -993, -213, 489, 34, 797, -400, -817, 197, -220, 654, 626, -887, 135, -381, 62, 1070, -467, -338, -174, -491, 1013, 369, -225, 238, -868, 100, 612, -76, 471, -700, -864, 719, -231, 374, 134, -967, 308, 92, 237, 659, -792, -259, 333, -310, 1104, -171, -782, 249, -302, 691, 448, -840, 161, -244, -60, 855, -439, -14, 66, -786, 901, 162, -284, 313, -947, 65, 580, 53, 421, -624, -607, 551, -221, 596]
1215E96m31j281J367j87R5M75j287N75K33n16J335j131l82N62n60J030Oj183O85
1234An67N07Q22r59L52l61n26J511m26l81L23j228J162J07n24Q75j269oJ235q11
1254a63P55m14j123J030k14M81N41j479M99Pk93J229o81n64M23q07J243j2r83
1273e25P01q12M55J006j133P27p62l31J425p41O1J47j173Q76M31l59N44j095J23
1292d35O70n85R72n78q23R37l88N60L10j156M19j72j01J291p52k96k9o06J158
1311C96K4p14N85p46j5J114p40L93m66o06J128k23Q5K10j233P47K90k11P60j214
1331d36J50M83n90R34k26r87Q13n34O48M78j099N18n01o8J377j032j81L08p74
1350g19Q32L93m82L70j061N63P60q29O32p57n08J055k22K19J28j174P91J5j37
$$ y = [596, 165, -1116, 251, 64, 159, 634, -653, -78, 155, -361, 974, -157, -539, 23, -537, 493, 499, -684, 1, -566, -59, 763, -196, 156, -205, -731, 780, 354, -27, 296, -932, 230, 337, -187, 688, -581, -587, 648, -163, 592, 178, -945, 85, -129, 352, 893, -586, -87, -80, -373, 856, 175, -389, 34, -773, 470, 458, -525, 176, -636, -181, 825, -308, 419, -343, -674, 751, 10, 71, 218, -955, -79, 352, -7, 537, -558, -435, 235, -350, 622, 44, -779, 158, -230, 330, 640, -516, -97, -269, -370, 921, 169, -127, -156, -762, 396, 420, -294, 291, -455, -470, 644, -96, 297, -169, -775, 353, 130, 215, 425, -808, -61, 229, 18, 778, -436, -286, 197, -393, 541, 315, -672, 141, -393, 255, 733, -366, 152, -349, -417, 960, -72, -253, 55, -719, 113, 506, 24, 394, -667, -104, 656, -173, 459, -298, -806, 249, 27, 246, 374, -800, -9, 6, -131]
1369a31J061j320J26L86o35J173m42q20P25n26M24P24r36K38l20k54J196o32R4
1388A31j16o99J130j93j47K12j027L94P99n39M96p05l92Q49j28J21K83q54M73
1407H8j73P7J012j208R8K07n08R34j63n61M28o38N39K78o22L48m43j11R45m06
1427A21J31j67r02R83Mj75N45j161M24L37l48P22o29n44Q15l15N44J01r70N16
1447C2k85J88Q38r62J45P7n31Q37j30k49L01p79N70N77n79J41n17j54Q69m42L53
1468C00l19p39J009k36J52K43p68K30L35m65Q71o24m02N03l01N18J71q82L95j76
1488a85P7Q36q62L0mm75J050l31k39J97p33O95K28l45L21n29j51P39l86N25%r52
1510d94O48l80K27M74r32M45J8j14O91n82m69N75q03J045J46o09K69l96P4P14
$$ y = [-131, 930, -390, -264, 122, -513, 660, 218, -602, 123, -403, 21, 745, -191, 47, -273, -527, 669, 37, 131, 15, -684, 446, 253, 106, 318, -709, -315, 484, -55, 441, -264, -656, 193, 65, 186, 469, -385, 88, -85, -8, 1004, -204, -106, 101, -407, 527, 364, -197, 231, -407, 132, 410, -212, 136, -307, -418, 527, 121, 252, 85, -817, 166, 170, -5, 540, -621, -197, 140, -208, 514, -115, -659, 156, -159, 385, 486, -484, 32, -253, -65, 773, -189, -44, 33, -498, 339, 209, -40, 261, -518, 52, 629, 50, 191, -326, -480, 389, -53, 300, -19, -758, 251, 15, 167, 410, -358, -128, 207, -258, 613, -11, -413, 90, -211, 307, 478, -404, -9, -185, -108, 728, -134, -104, -108, -583, 467, 136, -103, 94, -639, 56, 284, -61, 260, -269, -420, 319, -67, 458, 458, -494, 154, -226, 1, 475, -457, -12, 6, -108, 583, 1, -468, 107, -696, 349, 495, -114, 155, -241, -167, 547]
1530E47o67K04q6o52J158l36j89K08o75L29N16l69M22p20j68Q21m81O03l26p63
1550f24O74l05J30O29q87L40o2k53P92n48O3K0l92O61L5o15M81n77L58O01n68
1571d7K65m00m23R88k22q1K67q97N83K24k70N35q51q2N49m20N82p3p18N89m24
1592c26L71N73q40L54k12j62O26n25RL14n57O84j45k74L72q34L91O80n30J86l71
1613b16j86N75j03J46J60q92L76J13R7M37r26j8L46j0L64j58n63M56j82L10J83
1634C09m71J54p9r7O46l55j35J02p68J073l04o8K49o22K22M52m89M66l90k99N43
1655A39k80M33Mq28O15r3j0N49o19j4L94o17O86k73m13N14m25J75L96m36N9j82
1677b26j01P15l48L0O4o47N61J16J1O4p08K91L62k95M98m28l03N12m10L95Q0o31
$$ y = [547, -120, 84, -2, -654, 504, 168, -21, 187, -488, -159, 357, -12, 410, -310, -478, 343, -138, 465, 139, -624, 50, -255, -125, 504, -383, -43, -105, -358, 434, -114, -51, -31, -423, 238, 273, -342, 139, -438, -80, 521, -47, 218, -182, -605, 383, 161, 80, 347, -550, 33, 257, -13, 522, -329, -411, 138, -282, 300, 227, -491, 98, -326, 45, 618, -222, 132, -80, -242, 384, -141, -132, 182, -375, 309, 164, -110, 262, -572, -181, 499, -31, 155, -216, -402, 173, 70, 216, 376, -516, -140, -27, 70, 507, -419, -437, -91, -101, 263, 105, -458, -2, -184, 126, 309, -162, -8, -87, -184, 462, 107, -28, 74, -694, 379, 75, 7, 256, -366, -144, 308, -181, 285, -105, -404, 139, -141, 292, 296, -532, 83, -10, -20, 529, -90, -104, 290, -327, 359, 86, -327, 187, -238, -63, 333, -103, -44, -226, -327, 388, 40, 70, 134, -513, 48, 164, 175, 239, -469, -178, 184, -111, 387, -41, -344, 168, -242, 153, 233, -398]
1699c98K69O7j07P68o68n5O2l04R27m63l25L23m89N52K71o19M48n04j47O76m30
1720a46L40r9n49N87m2o2M48p53K38Q2j75N95n86k53L76j55L44J52n78L08k56
1741a84J53N27o05J20j02k48M87l5k84K15m09M08J41k55L39p10R8O31l94K87r2
1762H8m87M92j84M3M58p52N7J72o3M06j92k21K62m38P35q2m91K22k28P7M15l18
1784b9L7j21j33M98o1j4N7o87M85K19l00N82q61J13M25j52L8N2n71O68k40J82
1806A87J95n96P0J28OM77m08l99L76k41K30J07l22J13l63K42N94l84J38k68j18
1827b36M21p1k0M5n10M72R1k00K23n87J56M36k37K96k80l31L56k13L54K15o70
1848b90K97p6j36P50n48k01J98l16O37j30m37L93n14K08O32p15L52k69k77M82
$$ y = [-398, -129, -62, -169, 599, -69, -124, -62, -366, 561, 98, -227, 96, -393, 159, 430, -189, 259, -245, -392, 284, -146, 194, 95, -454, 133, 91, 29, 477, -276, -38, 44, -131, 464, -122, -375, 1, -154, 190, 342, -236, 72, -184, -31, 496, -109, 11, -91, -339, 148, 113, -171, 44, -365, 43, 184, -71, 268, -442, -344, 287, -107, 180, 88, -399, 93, -91, -48, 410, -342, -285, -113, -176, 230, 38, -183, 79, -359, 376, 294, -197, 25, -203, -126, 289, -29, 8, -113, -246, 252, 191, 177, 234, -453, 32, 251, -49, 533, -328, -215, 210, 58, 96, 148, -423, 245, 5, 187, 382, -214, -144, -16, -10, 467, 59, -340, 36, -205, 25, 132, -190, -77, -440, -198, 396, 12, 150, -118, -236, 185, 114, 94, 139, -371, 101, 192, -8, 215, -372, -216, 220, -17, 279, -1, -332, 24, -189, 165, 380, -290, 7, -69, -205, 545, -3, -204, -6, -322, 315, 185, -252, 141, -373, -165, 467, -248, 104, -165, -442, 40]
1868D0K07M4k02l79J98J01M0K61m46q5L87j96L50j0p42M13N9J06J77o20K80k5
1890d2j12N47k59k94J14k97N16R3k53K6m61L45L04l20L72l42k34O01l10J84k2
1911A56o16M93J05l32O61o16k8K29j63M18j74j88Oj01K14K28m27Q1k3j62O56k41
1933A76q2n7m30M79O7m64N28o82M62P6j23L10l34j27N06l92L77m1n61K66J46p5
1955B5L82n95q8Q1pO16m67l0J73l02J64K43l77M34m13k33O25k57P1N4m68N21p9
1978G3J9L00p95M12M1j67N59m96k24M07k25L15J7n94L36k01K51K32l74J26O7k61
2000a82N97j95l66P2k95L43K39k49L04m70M1L82k96K97l11k49L80p9J14L27p90
2021c86K84K04k19N13o12J11L19l62M00j92m39N68m41K89L89n03J71j01k81M84
$$ y = [40, 247, 291, 89, -290, -92, 9, 49, 310, -136, -221, 166, -30, 320, 310, -432, -19, 40, 146, 323, -297, -17, -42, -154, 393, 134, -160, -46, -343, 173, 266, 13, 39, -422, -77, 227, -93, 279, -63, -297, 304, -6, 178, 156, -460, 33, 138, -194, 467, -149, -177, 52, -111, 307, 133, -55, -49, -150, 64, 292, -135, -54, -77, -239, 417, 176, 94, 37, -393, 86, 153, -311, 217, -465, -3, 73, -50, 260, -74, -201, 305, -87, 290, 249, -312, -46, 100, 25, 407, -188, -276, -195, -202, 414, -53, -83, 90, -212, -48, 195, -182, 252, -161, -394, 231, -26, 45, 99, -369, 152, 73, 92, 392, -403, 9, 50, -117, 442, -54, -278, 129, -96, 219, 236, -358, -22, -223, 28, 260, -114, 12, 79, -182, 415, 220, -146, -74, -369, -26, 213, -36, 268, -202, -161, 221, -75, 222, -89, -338, 42, -37, 77, 404, -386, -102, 102, -117, 396, -216, -105, 214, -148, 252, 60, -379, 189, -252, 37, 426, -77, 94, -7, -288, 196]
2041A96o1l04J26l41N21J13m03M32n28J65L57n06K91q2l18M02j79L0M26n55J37
2062h1J11j82L73k86j06J87k54L42P8l40P8j44P0M24k80J41k89RL72j52n6N4m64
2085c95L26R9j67K26l27pL99l30L71j90l94M46k06J4N49n41J0LR1L59n03k7J79
2108a5l00M92J26l15J79l81J48M74m92K02k33k11O00k24k41K86m56K40K23r4J72
2129A80l37k9L88k92K31%k24K62k30J50K51n12J80ll01N50k43L7j2l81M50J33
2151B48k69J45m30J99N31m32J5q9k43N15k69J89J22o09K58J29j41L00m06K7K97
2172H7j76L25j78k56K77k02O5L56m59K40j15j91M96j55j05Ok32L18K5j60K15n46
2194c65K09N53n06J21j89k76O72k75L41k03m21M51j01n4M62n68l0L41m28N38j65
$$ y = [196, 135, -169, -43, -384, 137, 250, -153, 279, -249, -84, 273, -233, 58, -24, -342, 60, -119, -89, 337, -218, -81, 30, -152, 221, -65, -171, 16, -238, 104, 182, -158, -80, -224, -154, 270, -10, 131, -158, -149, 223, 71, 15, 69, -395, -69, 30, -137, 89, -238, -245, 154, -176, 195, 5, -389, 57, -149, -135, 414, -127, -117, -114, -23, 336, -167, -194, -15, -315, 177, 303, -12, 167, -214, -66, 408, -84, 118, -115, -326, 274, 50, -191, 95, -361, -121, 102, 8, 180, -157, -186, 202, -90, 141, 141, -83, 179, -51, 99, 350, -162, 18, 15, -286, 264, 21, 58, 46, -335, 115, 248, -21, 124, -306, -107, 424, -8, 7, -82, -325, 190, -79, 110, 232, -377, -119, 10, -131, 169, -237, -210, 87, -89, 236, 58, -198, 79, -123, -58, 298, -161, 79, -36, -227, 269, 114, 9, 15, -217, 101, 126, -34, 181, -365, -156, 397, -109, 12, -177, -453, 219, -56, 285, 82, -339, 112, 11, -43, 419, -149, -179, 162, -266, 272, 107]
2215A07k31K22l45L40J28j58j2j98j11M57k69KJ2k10K47J44j35J90m09J29K60
2236A60k38K19j74j23M00l76L93qn41K33j7J92L32n23k07K19l28O64l9m64L94
2257A68m61L31L69n87J65k81J38L88k24q1J76k78K34q4j02L09n42J8M85j49L03
2278B95l43l31M81k18K39o3l32K62l01J44M98n41K40j38q4N05k68j40N7l19M09
2299E2J59m14M04m33L2L51k43J73P7m42J68J4k0M31n31R3J34r4L40j58l66K78
2321Er7K11J14m50L34m59J55N88n80J40n4l01M56M2k53M06o60L70K89l27K54n23
2343c40J40K10j21K37M6o28O40k38Q4M46p90J06J12J8M58l40j15R0k83M33r4l24
2365b53L39l48J78L60k13k05K36l14L84n3j29J37m40L15J96l86M56m31o9M36l96
$$ y = [107, -124, 98, -247, 93, 221, 63, 51, -147, -258, 199, -70, -68, -56, -266, -19, 125, -10, 180, -229, -100, 160, -78, 141, -33, -156, 244, -132, 261, 253, -288, -55, -72, 120, 452, -71, -278, -59, -387, 277, 238, -226, 168, -293, 38, 407, -180, -15, -296, -158, 230, 6, -75, 101, -177, 57, -27, -129, 180, -362, -344, 141, -8, 295, -48, -379, 102, -116, 123, 60, -272, -10, -311, -167, 331, -210, 30, -108, -192, 313, 45, -95, -38, -357, 52, 211, -203, 201, -232, -200, 151, -92, 81, 158, -284, -116, -102, -122, 309, -222, -129, 5, -89, 251, 93, -273, 5, -92, 119, 233, -217, 117, -342, -187, 401, -179, -39, -93, -394, 62, 104, -149, 257, -403, -33, 256, -71, 183, -340, -200, 10, -111, 126, 172, -456, 184, -54, 30, 476, -314, -208, -96, -78, 380, 40, -75, 15, -268, 165, 71, -253, 86, -262, -84, 276, 63, -142, 94, -220, 164, 111, -18, 119, -321, -6, 190, -196, 260, -171, -240, 196, -200]
2386b00L58o4l38J70j37L01L00n95J14jr4N62k96k56K43j79K53L05m01J43l49
2407a61K9M85m61K26j54j39K80N6m6Q3l88J08J44j98M19m11L4K66m07N24k42l94
2429c47M17k94J67K68m82K40j66j21O54j84j64m9j47L08Q3k09J79k96o1L53k14
2450f5J28j52j63L90k02P6K25o10L52L6n8L49l74lJ25k45M77j65l64K25j72J99
2472IJ31j84P1j17j39M38l42J19nl16L99K39l89L73m84l4M89l76J70j20k12L16
2494C6j28J15K02m56J07J2J95K06l84Q3O7k89N11k05l12L81l35K53K14m71K12
2515A4m2j57M87l43M8K01p12N42j36J48n6m14K39M04k56J65m8k36J82j41J25J61
2537A75m31K33o9L4L76l50N9P9m08M56j30p5J19k37J87Q9j70J23k48p3K82j73
$$ y = [-200, 158, 94, -244, -74, -211, 90, 390, -205, -91, -92, -186, 376, 80, -176, 67, -112, 141, 446, 45, 188, -161, -132, 353, -108, 118, -36, -175, 105, 161, 115, 198, -190, -82, 62, -136, 283, -128, -94, 172, -235, 289, 47, -347, 70, -224, -57, 211, -271, -31, -197, -318, 336, 152, -12, -61, -208, 100, 183, -26, 153, -143, -204, 149, -65, 63, -89, -252, 138, -64, 12, 237, -373, -21, 15, -43, 306, -68, -71, 54, -191, 286, 121, -243, -18, -190, 9, 140, -44, 27, -90, -229, 209, -133, -14, -19, -335, 64, 303, -86, 287, -197, -231, 258, -118, 52, -68, -280, 36, -92, 23, 225, -231, -124, -112, 83, 289, -95, -12, 55, -234, 277, 72, -240, 141, -194, 59, 273, -198, 14, -28, -185, 302, -41, 7, 208, -504, 38, -98, 50, -6, -420, -181, 223, -33, 132, 84, -152, 30, -111, 14, 175, -256, -23, -92, -58, 318, -32, 27, 106, -302, 154, 24, -51, 68, -169, 18, 107, -63, 60, -188, -261, 21, -152]
2559a52K22J98m99K66mm5J12l74L29M4j30J25j72j23K88k96L85R5n31J81j38j8
2581b37N94l98kJ26l89O51k78k1L2m26L80K98l12O0j44k16M75k20J9K32m87L80
2603A17l22L13K20n81Q0K76m07O07m19j17L70m31L33K14n23K39j99Q3L76k89N7
2624ck20j35O09j76k51M31o22L30L8l3L37m84J04K97k25K61k4n27K87k42L76J48
2646B76o19K89P0j34L56k5m57K86k69L66r0j25J69k23J6L71l09O0l7l99N48l3
2668H7j13J81o50N03J18k26M13n86O1L86k65K81m4m00J54J76P4K77o02O2j40L3
2690b20N93k03k70L3o7K11K54k29O1l44L9L88k73K31q7m71O27m15J83Q0m36J80
2712a35K28q5L56m30j59J09r1M23j58l48L98k33J2L44l65J49j72jM00k74m8J52
$$ y = [-152, 70, 268, -231, 35, 31, -14, 98, -276, 53, 97, -33, 92, -80, -203, 85, -211, 174, 269, -262, -81, -219, -237, 357, -41, -43, 83, -306, 345, 67, 46, 78, -348, 32, 330, 18, 78, -66, -282, 193, -27, -8, 224, -263, 117, -205, 108, 328, -253, -173, 103, -304, 303, -116, -233, 137, -294, 39, 253, -270, -31, -230, -147, 229, -60, -3, -223, -358, 251, 75, -176, 255, -367, -37, 1, -32, 305, -179, -75, 222, -3, 258, 234, -293, -6, -248, 128, 276, -343, -54, 16, -118, 238, 213, -244, 42, -227, 139, 49, -76, 93, -130, -114, 257, -52, 8, -29, -428, 120, 87, -26, 155, -495, 8, 126, -100, 313, -273, -212, 174, -91, 190, 146, -254, -100, 76, 150, 427, -175, -113, -253, -220, 373, 170, -100, -67, -134, 77, 331, 102, 163, -181, -142, 246, -27, 204, 117, -354, 273, -142, 41, 121, -315, -135, 93, 8, 364, -66, -225, -116, -207, 216, 58, -290, 108, -125, -113, 231, -134, 15, -157, -158, 242, -32, -80, 72]
2734G2k40K46L7j42M03n52Q4M31n07M61n03J4K18q8R6Q5k57J62r9j5K84k81l9
2757a30J17k01M71j57j30m1k41N7L63j98J04j42j24O57m55J98p2l84K09K66j63
2778DK25m23J15J78j77L63k59k27L66k65K39L01m88J15k22J17L13m53J09J08j87
2799a48K84m3l81J30K7K39J39k67K6jj41K44j41PJ22k04J28j07M3J02k76M4K76
2822A02k38L82k89l89N18j71J96N4k93K45k03j17M90l85J45l2o12P68J17m12J66
2843D2k19J67J40j68K29j63j97K52j56K50M7m68K87m7j21L79m09mK29j81K17j97
2865i1pon0pL49m77K74j50j18O04n66L20j96r1O33k13l03L8l08L97K73l66K42
2888A81k43p9K59Pk6Q8m48L83p8O6K11n46K48k3j53M70m78M5K30m27N32l4l04
$$ y = [72, -168, 78, 115, -27, 376, -176, -92, 339, -168, 293, -210, -196, 22, -66, 30, 115, -142, 20, -79, -94, 190, -91, -130, -13, -214, 257, 100, -30, -71, -312, -255, 108, -90, 14, -128, -252, 405, -50, 148, 76, -308, -99, 167, 4, 229, -194, -79, 99, -78, 285, 26, -201, 165, -100, 139, 440, -48, 67, -155, -38, 275, -178, -69, 39, -148, 136, 93, -288, -158, -131, 108, 247, -20, 6, 5, -136, 108, -33, -26, 96, -108, 20, -87, -44, 58, -218, -174, 102, -136, 246, -43, -432, 86, -85, 111, 165, -128, 117, -86, -203, 287, -98, 47, 15, -597, 171, 288, -124, 42, -177, -10, 130, -38, 191, 28, -169, 83, -73, 177, 224, -244, 43, -4, -125, 254, -155, -159, 70, -111, 106, -91, -98, -104, -154, -161, 188, -289, -15, -165, -283, 321, -245, 75, -121, -212, 421, 208, -95, -57, -365, 32, 305, -61, 181, -62, -141, 118, 125, 99, 187, -261, 122, 44, 110, 321, -225, 23, 0, -153, 317, -161, -116, 114, -313, 219, 185, -119]
2911a19J90j84j58M80j85K3p9j73L89j83N4n9k22J36L04j35J94m59j0K79jj0M6
2934A18j50J08j87J26J72n42J22J87j27M38j88j97J80l35L71K91n92M26m19M5
2954a53M67l50J75j30l26M21k21K80O8m17J48J96j46L80m55q2K39l14M44k08k44
2975b28M39l25PL35k47J47n9k58M46p8jRk80K61K43n23R5j67q4L88k04J71J47
2998B34o17L97PN7J16l00J16L8k5K39l74J53l5p5K01m4k68K87l35O5K86r4k7o3
3022f1j16M37j03p8J03m37J58K28k50M22n03N7K29q9J34j26j83J46m4J90J60m09
3044a35M8R5j82M97m60q6M16l52K08K5k57K31l06J57M32m30K30j89l55N73n8j18
3066a6J48m40L63M1j04J74j59j65K38j65J68J22m46N05n10L31L3k56O8K3j75M30
$$ y = [-119, 71, -113, -271, 209, 24, 47, -32, -205, 184, 1, 55, -4, -226, -90, 214, 79, 273, -186, -196, 83, 82, 72, 118, -32, 76, -111, 15, 187, -355, -233, -46, -173, 265, 77, -120, 60, -275, 96, 387, -205, 221, -198, -153, 314, -36, 139, 9, -317, 104, -117, 163, 231, -186, -38, 158, 12, 392, -63, -145, 94, -220, 224, 16, -228, 211, -114, -107, 228, -19, 128, 69, -189, 257, 179, 178, 187, -93, 168, 411, -112, -17, -184, -268, 120, -84, 87, 234, -383, 14, 21, 78, 194, -106, 10, 48, 23, 262, -112, 41, 6, -69, 132, 88, -180, 107, -228, -163, 123, 29, 2, -61, -177, 260, 157, 79, 182, -255, -97, 131, -119, 303, -200, -143, 86, -3, 131, 5, -178, -32, -76, 114, 274, -135, -87, 8, -174, 323, -137, -223, 193, -159, 49, 74, -183, 48, -258, -101, 331, -99, 131, -58, -413, 160, 102, -16, 132, -308, 55, 96, -8, 166, 7, -158, 80, -85, 83, 205, -241, 264, -246, 85, 118, -138, -70, -47, -222, 208]
3088B08j81j79K42k71K56J18l14K04j54j1K36k23K72k51j89L99r2J4J54n32J17
3109a77K59j53J90k53P8J34k43L10q2k29L17j93K0K32l10O9o7k5K87k45J1P0l64
3132c64N86j23k76K93m05K35M11l78K29k74k32L80j44J71J02n41K65Q2M1J28k05
3153a9j08J36k79N28J7m72K48k43Q7K94m9j8l07k0L36k14K58p1m05K70J03j22
3175e0K05l05J24J74k37K88j92n0Q3k52L48M7l73K00n7ML90n70J67J12l14N62
3197C04k06q1O7j71R7J31j56J44k30K4L98k72J76k01k37K09K9P4Q0l29N6K41l23
3220a76K78o7l95L81j03Q9J44k98L04j36L5J52j38j3n8l5J50J33l25J29k68L34
3242A17K3j88K71k42j11K41m8K8r8k91L88j82L2L90m39J3K40j92J91mj99Q3j84
$$ y = [208, 27, -152, 90, -181, 75, 193, -121, 83, -71, -82, 154, -69, 203, -48, -237, 162, 70, 84, 238, -294, -177, 82, -71, 119, -134, -56, 78, -165, 145, 63, -166, 151, -42, -22, 210, -100, -31, -98, -123, 164, -81, -70, 0, -364, 222, 99, -177, 116, -289, -54, 357, -21, 208, -66, -298, 82, -62, 109, 211, -330, -65, 17, 58, 186, -19, -127, 9, -270, 258, 275, -197, 51, -192, -105, 189, 140, 122, -185, -205, 131, -83, 175, 104, -301, -31, 72, -50, 155, -150, -26, 148, -89, 199, 7, -43, 40, -212, 136, 183, -190, 10, -47, -43, 347, -223, -56, 56, -258, 304, 98, 17, 84, -87, 10, 141, -15, 129, -101, -77, 321, 49, 225, 24, -213, -4, 25, 99, 179, -150, -94, 147, -176, 102, 35, -360, 21, -82, 7, 151, -147, 157, 21, 56, 208, 70, 57, -1, -36, 114, 247, -78, 51, -217, 117, 140, -48, 223, -19, -130, 111, 63, 91, -7, -298, 90, -92, -60, 330, -109, -96, 144, -48, 143, 139, -60, 23, -161]
3265a61J37L11m54K43j34Q7J91l36J04J25k07J80K5j25M1k04K23Q3q2N9l02J04
3287i2J53j79J79R3m29K25J24j70M12n14J20j3j21L54j67j67J62j28Q4J56k94
3308b12K85k26L28j05j08P0l3m6K52n3k14K25k14PJ20p8J07q8k90L83k07K75r8
3331H0l34J86J4k4L64n35J88K2k03L42m2j37J74k34K57J53l19K96l73mL65j51
3353H5N6j83k33L43j47K19J75n61K88n5k30M35l04k08N16k21K73j05l71L67j48
3374iJ18J65m19M6K2j59K84j36J62j73r9K34J66k19K6j09J84rj65K06L2k92J50
3397FM6O1L3l77J09J0r5L94k12j40J76r4J97k2k07K73l68K50J77l17J90j71PL91
3421C17l71k0M1m23N03Ok76L75l70j2K84q4J21j09k07M74k46J74j01l80L37o1
$$ y = [-161, -24, 287, -167, 76, -58, 29, 220, -116, -12, 113, -94, 86, 111, -14, 27, -177, 46, 129, 47, 106, -196, -92, 61, -118, 61, 154, -275, -50, 74, -96, 316, -198, -78, -91, -212, 142, -25, -192, -30, -158, -74, 82, -212, 73, -153, 175, 70, -38, 32, -1, -47, 205, 152, -62, 163, -51, -44, 76, -2, 105, 17, -273, 110, -97, 178, 80, -254, -68, -54, -78, 286, -249, -61, -39, -242, 100, 58, -79, 95, -139, 118, 271, -48, 248, -125, -129, 236, 85, 141, -42, -275, 68, -79, 140, 315, -246, 42, -13, -243, 192, -112, -320, 196, -25, 248, 143, -228, 139, -9, 109, 274, -145, -99, -77, -236, 48, -88, 74, -99, -198, 36, 202, -17, 9, -100, 84, 75, -90, 116, 148, -144, 6, 52, 113, 146, -231, -122, -112, -207, 187, -25, -165, 11, -83, 114, 92, -115, 158, -210, 40, 217, -100, 90, -81, -74, 317, -54, -74, -33, -456, 47, 53, -223, 152, -218, -230, 54, -30, 91, -18, -225, 249, 3, 177, 76, -304, 33, -28]
3443b8Q6K89l40j24K31m09N72k06k38N6M5J14J67l03K6m5j36L02r5J30l8k84K80
3466E2J70k07M5k96Q1K97k50L02j29j99J79j71m8M50m08J11j16J24K31l56j3J31
3488b0j37M12l0j34J19l65k9K74k33K87j44l04O34l07MJ38k45j39K83n0Q1j78
3510h3n4J08l3L17k24l26K66L8L1L6k55K84j24j55M71m21J61Ll10L54L7j81J87
3533A27j87k30M64j06Lq6k41L77j28j8L12o46L52P5J7P2l06L2K35j34N2k4p6K0
3557d4n9K29J26l03J9p1OL77k66r8Q0j73L41j91j59N09l61J3K01j51J12l04M4
3580a23K10k81K82R2k56K84k39J11J94l83N1K24k50K79q5k06K03j30L5J26k86
3601a48K56k85K70J66k97J95p9k20K21k6j8J18q6k71K89j43K94j43k95K84k34
$$ y = [-28, 58, 347, 7, -117, 114, -295, 277, 71, -167, -111, -66, 48, 215, -88, -62, -107, -243, 59, -36, 94, 56, -228, 52, 222, 15, 60, -236, -155, 142, -108, 194, 65, -134, 45, -126, -174, 276, -132, -21, -137, -13, 218, -138, -151, -20, -157, 255, 225, 91, 210, -155, -184, 90, -143, 144, 0, -304, 330, 23, 27, 165, -80, -219, 64, 14, 95, -83, -137, -29, -62, 255, 31, -295, -29, 9, 40, 76, -179, 105, -19, -174, 297, -124, 37, 40, -270, 84, 121, -60, 127, -60, -290, 174, 68, 71, -15, -256, 121, -7, -25, 287, -359, -7, 68, 85, 157, -149, -117, 118, -16, 36, 12, -64, -44, -103, 126, 252, -51, -32, -103, -97, 280, 14, -84, -4, -177, 164, -27, -186, 323, -38, -25, 176, 25, 137, -167, -123, 87, -194, 88, 180, -76, 208, -31, 80, 274, -109, -58, 166, -84, 195, 110, -96, 107, -23, 12, 138, -148, 108, -177, 93, 259, -38, 157, 78, -142, 79, 53, 35, 153, 67, -204, 85, -58, 236, 93, -202, 82, -152]
3622a52L16J65m53Q8R1PL45m84%l9J72J80j1l63K14n05L54J42r9O7K4p6J06k48
3646a59J78O9m67L68j4Q0K34m59K20J46k07J87k19j31J57j84K92m3l63M87k62
3667i0O1J50k17J89j30q6K42j95J34l3k89M18J49m34M18l50j48L50j22P5J63k87
3689c2l8J30K6J16k84n1PN1K98j12l36J95j22J73K35k73Nj85J44K89l40n3N2k6
3713a31N1M6P8J45l79J23L00k75J89l25LL67k31P1J70l86R5m2J28K77l45RJ23
3736F1j01l3M4M4L1j96J20O8n9J10l29J03M61m21J25j28q3K69m4k0J79l21P3L9
3760hr8M12l87r5K38j32R7K13l37Q3j09J31J94k71J30j45q5L69k82L0R5k21K33
3783E5R0q8Ol08K12K34k72K52j21j41J61o9j21K61l38R0K84m14L40j00j30Nq6
$$ y = [-152, 164, 329, -124, -36, 55, 62, 407, -77, -77, -116, 56, 236, 225, -138, 76, -429, -75, 67, -32, 35, 59, -17, 89, -159, 19, 88, -379, -11, -25, 55, 289, -170, 50, 196, -11, 176, -43, -174, -17, -201, 91, 48, -315, 172, -90, -29, 121, -96, 93, -37, -123, 119, -76, 58, 25, -264, 154, 303, -131, 287, -63, -211, 139, 17, 92, 255, -32, -70, 60, 86, 202, -82, -133, -126, -75, 223, 111, -225, -30, -152, 21, 256, -17, -12, -197, -53, 236, -104, -157, -105, -131, -80, -34, 44, 189, -190, -67, 233, -42, 147, -178, -175, 192, -39, 32, 202, -184, -89, -131, -3, 274, -71, -62, 61, -40, -73, -29, 15, 46, -150, -30, 38, -21, 89, -240, -137, 324, -97, 28, -100, -183, 86, 42, 22, 201, -120, -47, -8, -106, 306, -81, -176, 62, -70, 27, 240, -97, -14, -123, 8, 202, -69, 61, -84, -169, 200, -82, -52, 43, -178, 55, 145, 57, 63, -245, -33, 201, -71, 181, 60, -81, 80, 11, -110, 151, -187, -97, 187, -227, 113, 13, -117, -112, -198]
3806a98K58P9l21K48J13j70K71m62R3j06l6M02q8j59J56k70K22P9j57K07l04N2
3828i1L64l39L12l08k5J56l56K53R2k49R6rK4j6j0p9J65j43J86J98k77j2r8M3
3852a23L53m03L40j59l93M77j32R5n2l07L65L30l78K04k48m1K15j68J97q4m28
3873c40M04o9N5J21l31J23J16j79L66k78q8K11m26M58%j30l1j06r1M11k58L03
3895B41l11J3K49l04K70j62k24L81j69q5M76n43q1L28j33K69j19k58K04j62J27
3916GJ90l39L45k82k00L89p7j0l7j33J92L3n2Jk97K82J79k02J81k66m3J47J50
3939A58j92K18m23K70j13n8L61l09j1K93l54L36K0k75K54k18k1K37j67R4k60j73
3961c33N32j68j34P8k57L29O0j50L36l90L1J14m8J5P9j90R4j00J75P8l02JK7J72
$$ y = [-198, 60, 139, -182, 66, 179, 9, 280, -182, -89, -195, -231, 171, 83, -76, 80, -190, 32, 111, -46, 161, -143, -91, 273, -66, 246, -62, -87, 69, -287, -34, 58, -191, -95, -104, -80, -96, -106, -185, -20, -163, 23, 221, -56, -68, -166, -123, 230, -173, 167, 8, -385, 92, -40, 55, 3, -304, 61, 391, 13, 217, -31, -72, 143, -25, 172, 88, -340, 64, -5, 50, 171, -160, -37, 79, -100, 266, -12, -100, 111, -315, 143, 143, 13, -18, -124, -215, 196, -62, 241, -70, -57, 192, -112, 158, -4, -228, 153, -16, -101, 375, -168, -249, 79, -54, 215, 96, -162, 42, -120, 7, 197, -142, 203, -79, -279, 110, 33, 23, -14, -147, 45, 78, 26, 27, -270, 12, 191, -11, 170, -96, -139, 8, 158, -34, 184, -239, 31, -82, -140, 221, -88, -99, 194, -160, 176, 196, -79, 175, -43, -64, 173, 6, 100, -160, -333, 199, 31, -103, -25, -282, 47, 107, -43, 293, -97, -66, 48, 0, 15, 94, -96, -2, -102, 73, 151, -151, -150, -123, 49]
3985D9K33k63k65J73q7L43k05j68Q4j74L48K05l39J73P9l60J81r1R9M7k52K16
4007B6J30p4rPj15Q2n4K52k79OQ3j69L31o6k17K9J00k24L74j14l4K2l32K54L7
4032D6j57K44l75K22J93j69Q7j72m7L56l17J20M3m33L74o9r7L15j77o7K15k79
4054a44L36k49O2J31k32J45L8k54J65j97M1M38k65J19k40j06K08r5k8P7k85L02
4076c3J84p8k2n6l9k8m9Q4J17r2K1k7k3J44j88J10n6R6jj33l8J04n7P3K7k67K93
4103F6l00O8K25K9Qj29k39L55j59L4J78k27Q1K18m13L44l02j37L25M0j79P1P7
4126C4q7j1P2K5k05J37L6k21K58j02M7J01l06L16j3l6R5k82l3K08j03L4p2o8J87
4151A1p7J8P3l0J2j68J11O7Ql32L46j93K94k28ML49l67J03L8j54J59k9j94L79
$$ y = [49, 282, 19, -246, -73, -160, 183, -22, -190, -106, -280, 68, 273, -66, 107, 186, -174, 7, -84, 15, 62, -190, 26, 156, 82, 73, 80, -35, 47, -7, 245, -34, -28, 55, -114, 217, 151, -66, -37, 63, -161, 213, 99, 65, 87, -245, 9, 46, -111, 133, -242, -20, 173, 4, 91, -81, -128, 228, -89, 31, 74, -359, 15, -54, -151, 164, -13, -80, 135, -144, 192, -57, 5, 136, -96, 49, 87, -167, -2, -199, -158, 280, 15, 134, -106, -212, -4, -99, -127, -50, -335, -33, 151, 73, 51, -5, -44, -72, -121, -37, 80, -12, 9, -18, -41, 103, -85, 25, -31, 65, 64, -69, -107, -3, -60, 13, 40, -227, 66, -234, -166, 59, 88, 96, -33, -272, 83, -76, -42, 136, -91, -10, 208, -205, 139, -163, -300, 25, 65, -114, -43, 34, -53, -64, 8, 33, -172, -35, 1, -220, 38, -64, -17, 84, -222, 94, 81, 45, 140, -142, -175, 33, -70, -36, -108, -176, 11, -66, -48, 25, -5, 7, -161, -50, 17, 25, -307, 39, -154, 140, -88, -84, 265, -102, 1, 39, -115, 44, 15, -179, 200]
4175B00k33P2o5j51q0L57j37J67l06J70J93k33J7no2J56L7k19K46l24K50n9j0
4198a9L0j51L9M4r4K42q1r6K13k57J12J81j09Jn7k00J93K9p5M6k00K75J6k88K19
4223A3j60J7J59k74K84K6k02L58j33J52Lj42j05J17j28J55j29j19K48j32M2J25
4245A75l02J01M8m8K43k16l3o3r7M05l77K16L1k06J4J33JN7j93J37K06j45L5j02
4269B0j17J95j00o7J66j44J7r9J24J67j09o2J4k01J65R6l5O7q4j14K14j33j28
4292a48J27o3L6r0K09j21l80L78L2j7R8j63j64K93l30M21k7l37J81k24L73k5l3
4315B6j19K3o0L16k84J17J24j55P4j21MJ94j54J01O9k57K63k26j29L51j43R6J48
4338B58n85M78r5L2j37J05j15K02j81J6Qk8J90j25J5J75l40K5L5KJ49k59L51r2
$$ y = [200, -33, 39, -26, -177, -257, 100, -37, 130, -176, -6, 187, -46, -29, -34, -96, 60, 97, -122, 124, -200, 50, -9, -19, 11, -140, -101, -57, -151, 91, 10, -86, 127, -130, -18, 163, 54, 55, -2, -202, -9, 20, -55, -9, -209, 66, 82, -206, 13, -147, -130, 29, -245, 39, 65, -137, 221, 88, 240, 243, 101, -4, 113, -15, 140, 11, -108, 140, 8, 50, 175, -127, -26, 22, -26, 217, 1, -32, -95, -192, 213, -164, 52, 83, -123, -109, 24, 25, 82, -111, 26, 232, 87, 122, 20, -97, 98, -2, -69, 97, -47, -30, -129, -5, 162, 53, -9, 5, -196, -31, 65, 30, 97, 13, -101, 113, -20, -148, -21, -84, -48, -138, 71, -50, -430, -52, -20, -37, 61, -102, -266, 27, -303, 118, 91, -246, -65, -289, 84, 59, 26, -93, -70, -130, 186, -98, 19, 143, -12, 62, -59, -55, 139, -15, 86, 155, -102, 161, -65, -194, 157, 14, 110, 258, -327, 151, 56, 88, -49, 56, -59, 143, -38, -22, -14, -42, 148, 23, 38, 213, -127, -102, -67, -65, 84, -175, 176, 84]
4362H4j11J37k0k49Q4k7M9J69j83K19l7l37L32k57J81J08l31j3K23J09J8p4j02
4385b8Ml3K96j42j40K0k47L02K29l67O4J6j96N14j92j2n9j99K62j70J57p0j20
4408a11q4K74j65J57m3r9J43p8Q1P1k60O5L4o7M33k54j99k9O6J77j04l6J57j66
4432c7J32Q4r0j8j4j25K00j68J62j46j68L19L0j77l5N2j05J88j72K71j82o0%P7
4456A8J69q4k88K60j48L5O3q7r2K72k83K09n4Lj4p0q5L55j17J26k42l4J63pj31
4481f3o2j17M45j33k27L51k18q5J65j47j6J28O8m6k54L55k8k20L2j05J05n6p4
4504b02K21Q3k64K36nk3P2j52J98k7j89J39K4j64J6m5J64n4j23J81r3o2J78j70
4528f1J06mj44L46k52J6O9J12q0q3J4J65k53L3R5j21l5K47m81M27j2j15K35l05
$$ y = [84, -27, 110, 90, -159, -75, -102, -53, 116, -67, 152, 115, -222, 110, -147, 34, 142, -189, -202, 21, 130, 148, 74, -28, -24, -57, 239, 97, -43, -23, -270, 32, 261, -106, -42, -26, -222, 292, 100, 88, 29, -170, 92, -78, 79, 9, -111, -195, 79, -86, 71, 28, -71, 72, -6, 75, 146, -114, -49, -15, -82, 351, 97, -102, -131, -65, 112, 8, -28, 129, -37, 95, 179, 89, 71, 57, -68, 132, -36, 126, -20, -188, 131, 161, -16, -51, 1, -104, 84, -88, 183, 1, -59, -59, 18, 187, 103, -185, 75, -73, -38, 25, -62, -154, 118, -165, 44, -10, -7, -21, -91, -176, 179, 62, 188, -54, -88, 75, 68, -63, -125, -242, 203, 70, -157, 194, -24, -109, 56, -91, -107, 21, 89, 43, -211, 144, 116, -104, -72, -177, -72, -128, -202, 19, 102, -162, 74, 69, 46, 118, -34, 164, 137, -52, 87, 111, -53, -37, -82, 82, 28, -95, 86, -7, -69, 109, -61, 45, 41, -103, 243, -9, 7, 76, 188, 108, 25, 39, 204, -49, -16, 79, -42, -77, 170, -311, 116, 104, -11, 224, -81]
4552h1K39k8j56Q7k16R2J08k0j72L91j04p0j24J13J46k67j8l2J10J01k91J63o9
4575i8r8K87n3j22P4j46J76j7oL9ol3O9o0J57k8r5k9l4m4J70j47N8O4k10P6m0
4602i6m3K08kN1L5k49k6M0J23L7L9j75N0k09J34J72j24J89r5k06K88p9M0k21r0
4627b09K34j8j04K14l00O6J11N3R0k20L5K7Q7j2r1k6r0J36j9J06k14M6K86k02
4651a4M4oj4M9j00j34J61q9K83k14j6R8o6R8Oj83J50j3n9Oo3P4PL0n1K7n5J05
4679F1j52K29j17j03K03k60J47l9%o9J49k13J94j37J64Q4n20O56k11j18K09j24
4701C3j43K39k34J35l1j03j8J0K10Pj44J81k79m8K70j92O2M9q8Q8k3j44L18l24
4725a69J52ko1K36k70j88L74Nl4q5l1J41o9j38K66j30n5o8J19O0Jj45j6L7O7K01
$$ y = [-81, 158, 130, -26, 61, -155, -63, 45, 25, -147, 244, 140, 70, -54, 59, 205, -62, -80, -112, -2, 99, -192, -29, -98, -196, 91, 38, -84, -10, -156, 20, 3, -3, 36, 30, -3, 66, 6, 163, 135, 40, 11, -23, -67, 103, -44, 14, 78, -132, -56, -96, -139, 69, 67, 118, 153, -96, -122, -82, 41, 78, 117, -58, -8, -217, -83, 89, -35, 154, 59, -147, 141, 62, 102, -119, -209, 25, 7, -97, 117, -183, -117, -6, 47, 137, -83, -48, -21, 66, 54, -37, -63, -153, -17, -36, 70, -144, -98, 188, -14, 30, 24, 10, 59, -41, -175, -14, -103, 180, -34, -50, 48, -18, 80, 86, -97, 53, 40, -19, -13, -76, -2, 5, 35, -16, 11, -44, 61, -91, 138, 21, -82, 121, -139, 8, -31, -31, -100, 49, -164, 30, -107, 57, 141, -379, 277, 66, -52, 157, 33, -110, 129, -105, 30, -1, -104, -122, -112, 98, 105, -39, 142, -137, -185, 85, -107, -45, 4, -84, 4, -19, -163, 155, -169, -17, -19, -80, 156, -114, -302, 72, 77, 43, -42, -73, 68, -1, -139, 127, -3, -58, -126, -7, 53, 54, -91, -107, -70, -3, 198]
4751A98k67K00j69J65J85m37Q1M9k73L15n6nK91k16j55J88%L5k12O1R2j3J0j46
4775g9j9J01q5J75J75l29O9K9j60P4m1K0O3K5p6Q3j18K8J52j97K23k43K55j12
4799A3k06K52j05N7J3p8J8N1P5J69k43j60K35j70J87j4l97K34l7K23J74m56J19
4822d6N0jJ56j59M8L0p7J03m3N4k03J67p6P5q6j17J19o4J31k7j26K7k7J7M9QJ6
4849bk8N5P6k25K64q4l07K92M3q7J38N1j44r9J02K8k8n3K2k21K86J10k57Q9j48
4874a27J29J06j2q3o7K8K5k4j22J27j41K02n3LJ16j53j4R4j3l1J7nJ40k62J42
4899B2J71l11K99k06L2J88k88J42Q5k22O1P9j0m7R4K5j21n3j2n6L3K42j73J5N
4924fj66P2k2K11O6K7j17j37O7J44m8Or1j06l9J12Q6P4l14L5K71j04k8J95k28
$$ y = [198, -69, 131, -38, 127, 312, -125, -44, 5, -268, 47, -9, -14, 277, 61, -94, 94, 94, 129, -83, -22, 70, 57, 67, -79, -98, 3, -82, 93, 268, -61, 8, 37, -123, -49, -90, -70, -7, 18, -58, 25, -93, -65, 87, -110, 113, -130, 125, 13, -193, 59, -46, 11, 24, -54, -36, 15, 90, 259, 16, -144, 91, -79, 108, 94, -303, -69, -106, 117, 291, -165, -46, 4, 3, 159, 0, 48, 78, 1, 104, 61, 115, -88, 79, 3, 78, -8, -125, -6, -70, 61, 34, -92, -65, -92, -75, -26, -18, -2, -30, 25, 101, -124, 140, 56, -251, 41, 84, -3, 135, 186, 42, -57, 45, 73, 45, -8, 14, -207, 79, 189, -68, 21, -127, 2, 108, 96, 13, -54, -26, -1, -25, -147, -20, -161, 41, -12, -9, 107, -46, -60, 34, 21, -10, 7, 2, 142, -120, 22, 193, -118, 181, -25, 7, 195, -93, 49, 134, -88, -27, 52, 42, -5, 89, 114, -7, -60, -72, -128, -95, 147, -26, -11, -6, -172, -100, -122, 89, 155, 182, 65, -72, -5, 139, 91, 97, 6, -100, -139, -27, 59, 133, -181, -146, 125, 21, -7, 188, -40]
4949d0r3K25j69K75m6k34J07m4K0R4M9n2lj63J81j33K05j64l0n1J71j55Q3j34
4973a01J72L9k42J04j39K97K24j84k16J72l50K23k6n7K89l04R2J16j41K13k09
4994b8J08P4j77O9m3j79K90p7j67K50j51R6j09PJ77j56o6J41r3M2K8j08K33l84
5018b23K04J87k26L4J29k19L58k32O1j94J1J2K75k68J22j1j77J01K9kK3q3K11
5041A22m33J67L11j92M8K9m1Q4j6q0N6k22K11J31j96k6L5M7M7M1k0Q1j81J24j00
5066B7r1J04j11P6q8p1K20j55p1Q5P4M0n7Q0j12k9J09J7n1R8k22L63k69p9J11
5091bM7j27J65O6k29J60j16O8j6P6j00J15k06J77j33K2o7p8N4J16m9J16J33j80
5115A2N5j96J06o3MJ16l1p6K06m2p9K1j4K7k78K05J12k68K75k8k8P6j48n6K13
$$ y = [-40, -133, 92, -77, 198, 152, -82, 25, -19, 1, 95, 144, 92, 89, -74, 107, -26, 179, 15, -15, -66, 105, -50, 33, -101, 71, 110, -132, -28, -167, 130, 354, 170, -46, 126, -224, -1, -27, -84, 205, -99, -7, 109, -32, 181, -28, 80, 154, -23, 46, 3, -176, 114, 37, -130, 120, -31, 65, -44, -37, 140, -16, -82, 59, -34, 8, 36, -72, 161, -223, -19, 168, -58, -24, 105, -114, 244, 12, 73, -121, -110, -98, 177, -91, 31, 20, -157, -56, -27, -29, -6, -89, 122, -311, -144, 167, -25, 23, 52, 11, 95, 79, -1, 55, -167, 44, 175, -21, -47, -12, 35, 82, 123, 103, 184, 3, 127, 27, -64, 40, -71, 5, -83, -154, 66, -89, -160, -75, -1, 39, -18, 62, -50, -79, 30, 47, -4, 94, -128, 235, -34, -113, -2, 45, -82, 83, 149, -80, 80, -36, 32, 16, 92, -8, 107, -99, 78, -55, -33, -100, -178, -124, -8, -57, 59, 192, 12, 67, -129, -23, -86, -82, 34, 3, -73, 133, 91, 12, 33, 19, 46, -232, -27, 85, -183, 92, 64, 36, 112, -36, -92, 121]
5140A21k36J42Lj39J99j82J90o1N8m9K6j86J28k2j43J94o8pM7j09R3J59J2k29
5164e9J09J6j26L6J28P1j17l1j43J40J4p4j3J28j13R9j4j3q0nJ82j46R5Qj35M0
5190cr3J18J13k61K34j6k6j97J39j14J21k24J80J84k41L7MO9K0j9K9j04j25K67
5214I2j34M4l1J02k0j76J28o8J29k10J93n1m2K32j32k16J9K69k22OK00k07J1N5
5238b9r5J95j06N8j32J14J2P3j90O2P5MN5j70J77p6m2p8J07JK6l7K4n0j83J02
5264a03J9j16J32K6l5K25l60K9M09k99J03l7J5J6p1l7N9j20P3Q6Qj0j35l5J66
5289Hj7K1nj12J76K7k06J34j58J70k5JR9l6q7jj11K86j13q4m0QqK28k22L9J12
5316H4j19P8k09K52Q3k45J29L7k33K77k40J52P5j02R7m7l02L35m6l3kj19k0J72
$$ y = [121, -115, 27, 30, -109, 90, -92, 98, 37, 95, 46, 72, -114, 14, -8, -151, 43, -25, -32, 15, -94, -1, 158, 170, -59, 50, 66, -60, -24, 104, 175, 58, 27, -116, 24, 38, -36, -49, 79, -34, 65, 51, 38, -42, -47, 135, -11, 84, 92, -43, -3, -96, 22, 135, -126, 108, 92, 66, -131, 8, -106, 15, -209, -29, 155, -86, -49, -45, 24, 44, 25, 54, -50, -175, 92, -42, 2, -29, 73, 53, -123, 5, -63, 66, -144, 49, -2, -44, 188, 56, -160, -141, 128, -94, -88, 112, -95, -84, -29, -124, 71, -35, 23, -109, 5, 17, 90, -100, -38, 37, 41, 96, -74, 103, 27, -15, -93, 14, 15, 41, 4, 28, -22, -205, -103, -84, -200, -68, -42, -77, 148, -212, -183, 226, -73, 30, -7, 8, 24, -47, -84, -25, -145, -72, 14, 22, 12, -123, -158, 8, -9, 12, 7, -105, 71, 98, -108, 26, -132, 38, 13, 14, 113, 77, -10, -11, -122, 164, 51, -33, -73, -65, -73, 155, -67, -28, 84, -35, 43, -166, 86, 169, -76, 53, 90, -143, 134, -106, 46, 121, 19, 116, 69, -233, 102, 56, 23, 21, -98, -118, 54]
5340E4q7J87j39Mj01j08J25J58o1M7o8r7J00j57J38p8q4R1J07J16k2l69K32P7
5364F5l5K39k79K7K1j22J12M5j75K60k40J72r5J04o6l3k5Q9j12J42j22M9J86j86
5388B1J14r5jn8K1j40K33n3J69j69k06K57n7p4R1j62j4J15n6K7J24j26k6K62k05
5413hP5l6l1Q6j12M6Q7l29L81l83L00j15J27J3j02j3J17p9j48J25j77J31l0m2
5437a17O5p2J97J3k17J91j39k03N33l31R4N4j45P1n0j2p5M4j42K35l6oq4RJ66
5462D3j81K06o8r0j7N6J74j41n5n9L7J44q1K0o9J14J8J64j80K3p4Qj5N1Q7p3J09
5489A51j83J06r2J01L8j11r7K3J94J0j74J64j27%O9j00o6j2J82j31K21k30O9n9
5513e4P5J83p7q0l4R7Pj09o6K00k29n2K92j62J3J19j36j0J46o1j6n3kN4j03J16
$$ y = [54, -33, 154, 15, 19, -82, -190, -65, 93, 32, 79, 11, -86, 14, -143, -5, -83, -167, -76, 31, 147, 125, -244, -12, 65, 30, 269, -10, 17, 38, -84, 28, 73, -102, 158, -82, 90, -5, 99, 33, 0, -25, 64, -48, 94, -28, 21, 207, 21, 135, 40, 39, -19, 2, -138, 95, 42, 211, 42, -164, 93, 36, -38, 53, -109, -123, -8, -64, -37, 87, -39, -65, 197, -8, 67, 31, 0, 86, -26, 20, 107, -222, 159, -224, 76, -39, 88, 101, -1, -14, 103, 24, -124, 1, -176, -45, -75, -117, -52, -124, 73, 86, -131, 60, -79, -282, 251, -80, 14, 68, -77, -6, -56, -68, -143, -99, -241, -6, -42, -48, -132, -123, 43, -138, 68, 0, -90, -107, -51, 123, -18, -73, -132, -95, 49, -32, -12, -81, 33, 51, 215, 35, 58, -16, -8, -23, 28, 115, 42, 151, -32, 74, -18, 83, 121, 10, -87, -64, 130, 140, -34, 130, 3, 3, 72, -28, -94, -106, 76, -55, 166, -64, 5, -54, 21, 204, 127, 47, 13, 110, 117, 8, -58, 142, -87, -139, 153, -9, 4, 123, -13, -23, 123, 62, 46, -7, -9, 45, -58, 58]
5539E8j91j28L05j24J57J5k55J72j32K13J04k54J01m7j07J35j06K12n0j68K79
5560A89l67K91j00n1j01P0P3m5q8J47l9K6M2Kj86Q8Q7M4Q0j85j15J43j44J91O0
5585A12j55P8p2J15j59J26j23m9J29L3j40K02n2o6L1R1j51K8m9K9J71p9j2n9o0
5610h1J18j05J08Jj86J37j25K06L2j78O7O9o2K4L7n3L5q3l5P2mk4J54K2O9k74
5636e9N6o5N8J12j15N0n6j38L02r5M6n0Q5k97J42Q3J44j07j48P4L2j12j23J21
5660f0J06k3j97J56K9K6k7J4j24J59%qj15O8l9o7L24l75m8N0K75m3j07oj05J52
5686A5j52L4J89j28J07j11RJ38k9p5j34J54l1j51J94Jj60R6O3j8P9Pk62L33l67
5711a99K03j33J52J23j63Q9k6p4Q4j01O8Q1l29J90j5L2P3j79J03N7n2J16k89K69
$$ y = [58, -133, -261, 44, -80, 77, 92, -163, 9, -123, 90, 194, -60, 41, -6, -113, 22, -84, 128, 78, -90, 189, -178, 113, 13, -38, -139, -69, 4, -41, -129, 18, -21, 5, 47, 49, -137, -49, 38, 82, 162, -23, -138, 5, -139, 52, 112, -43, 35, -37, 78, -81, 45, -78, -127, 2, 35, -105, 97, 45, -21, 10, 101, -50, -22, -71, -42, 129, 50, 38, -21, -81, 37, -68, 40, 41, -145, -8, -133, 73, 105, -73, -6, 63, 1, 25, 62, 9, 44, -39, -74, -2, -6, -30, 124, 146, 215, -59, -3, -68, -10, 102, -13, 37, -19, -157, 145, 50, 96, 46, 131, -166, -24, 59, 203, 96, -52, 22, 54, -58, -181, -60, 46, 23, -174, -18, 11, 37, 10, 24, -100, 59, 59, 51, -64, 4, -35, -102, 222, -153, -201, -151, 124, 81, -26, -32, -137, 15, -137, -103, 86, -42, 65, -46, -37, 101, 72, -3, -137, 17, -14, -165, 29, 30, -130, -34, 29, 11, 90, 97, -165, 168, -199, 4, -129, 23, 146, -17, 72, 46, -28, 56, -45, 23, 104, -225, -35, -50, -18, 55, -124, -21, 36, -16, 100, -189, 80]
5735H0j78Q5o6J86j79N3j1K0M0rj24J79j09J89k35J6K66k83J00j25J84o2R8n6
5759E9k19J63N3l7L2j17O5k5j3k6K9j1k6J5K1n9L40k17n7K28j56m4kj9O1j25R8
5786A1j99J78j05R8L8N8n6n0J11j42Q2l0O0j15K16l02L91l16o4K29r5J43j99l8
5810i6J64j23j1J42k74K14l16J93J10jj3K02k85R2L7M0j5o2j0R9j06J4j21J20
5834fJ40J57j42j39j22rK29j0J11j32j20R5o3K7j04R2j41J40M8P9k29J89o1j86
5858a57K28j35P2R3k46K85k33M2J42k48K00L6j60m6K21p4J1j17M3J90j47m2L1
5881a1JO4rJ4j00L8j11J26L3j6O1J4j36P6J7j8j44J01m7k5Q4M1j03P8j32J93q0
5908Ij04r6K15J8r0K6J52k00J61k16M0R6j87P4K22k15J48K5j2K6q6j2J40k27J06
$$ y = [80, -98, -13, -79, 107, -72, -19, -30, -10, 30, 21, -103, 76, -33, 156, -79, -63, 203, -80, 20, -105, 79, 17, 115, 59, -160, 3, 56, 19, 51, -66, -1, -26, -39, -65, -36, -47, -73, -58, -37, -96, 244, 27, -30, 198, 42, -2, -4, -23, 38, -87, 11, -188, -10, -115, -17, 21, 79, 23, -27, 84, -58, 24, -6, 54, -61, 155, -147, 244, -72, -136, 93, -2, 141, -58, -96, 68, -55, -66, 76, -198, 16, -300, -107, 3, 2, -11, 191, -94, -2, 35, 75, 60, -2, -12, 87, -19, -5, -126, -6, 134, 291, 149, 10, -112, -121, 108, 98, 209, 77, -43, 52, -11, 16, -88, 4, -137, 3, 51, 130, -99, 90, 29, -157, 71, -64, 8, 101, -145, 140, -93, -51, 91, -157, 43, 79, -81, -127, 94, 20, 31, -86, -43, 147, 0, -42, -11, -10, 54, 45, 59, -41, -3, -114, 12, 45, 29, 90, 104, -32, 44, 61, 43, -101, 0, -47, -72, 12, 53, -50, 28, -104, 89, 9, -95, -191, 24, 42, -48, -22, 130, -70, 91, -125, -85, 11, -176, -102, 120, -95, 53, 78, 66, 92, 6, -6, 134, -93, 13]
5933A3k7j41KK41r1J6o5M2j48M1J10L4n4K20k47q2J15o1K41r4l5mj28J10N4N2
5959A14q0K4O4l04K41J8Q4k15J32j35K3J51j77j2j04K42j6q1Q4j5n6N6j12J3J73
5984A12n6r2J05j74O1LN8R7k30J62Mj3j55Q3j20J30j61K28k2j44L47k23m7J76
6008A29p4j39N4J7pJ28j07r0Q7P1q1Q0K5L6k30j8N2j35K01K5K05j91j19K13k45
6033a13QJ80k35J23J2J17q1j7KJ80j86l1q9J21m8J34j1j32pJ80j06mQ1L1q4J24
6059A49rj50l3j2mL8Q2j8k01L32j03k1l7J56k07R2j58J24O1k88K34M8j34rk8Q4
6085a2j29K31l9j40K11n1k07J17J13j1o9J39j07K8j84J75o3l5K45k18j5J57k52
6108a16J28k7j85M45l59K2K42j99qm1K3J05J43j98L1J8J22k45o7K98j64MoN4J45
$$ y = [13, -14, -155, -153, 88, -3, 13, -52, -10, -158, -117, -7, 27, -27, 193, -54, -136, -21, -82, 159, 65, 30, 26, -102, 8, 62, 114, 34, 58, 122, -182, 59, 77, 161, -54, 78, -57, -34, 117, -60, -72, -176, 66, 50, -31, 53, 38, -18, 38, -74, -61, 112, 56, -36, 69, -105, -44, -41, 17, 114, -116, 46, 50, 37, -118, -35, -155, -25, -186, 42, 20, -124, 223, 0, -47, 129, 55, -84, -30, -13, -20, 108, 1, -89, -2, 69, -12, 68, 93, 129, -101, -119, -67, -202, -1, 24, 229, 38, -81, 132, -113, -105, 75, -160, -37, -25, 92, 11, -6, -4, 176, -10, -41, -130, -9, -57, 77, 66, -66, -73, 107, 1, -3, 78, 109, 25, 149, 140, -10, -43, -55, -59, -21, 61, 43, -158, 174, 71, 50, 13, 169, -38, 54, -104, 20, 81, -207, 27, 75, -59, -68, -96, -12, -141, 90, 51, -89, 122, 71, -136, -19, 94, 83, 14, 153, 46, 74, -110, 65, 2, -33, 212, -6, -21, 136, -116, 12, -15, -200, 245, -114, -92, 150, -49, -57, -98, -75, 30, 173, -25, 6, 24, 146, -99, -166, 132, -32, -28, -34, 20, 165]
$$ [...]
8191B2
##END NTUPLES=NMR FID
##END=
