##TITLE=1H_Pr TP-1
 DMSO, 8 sc, 
 10.06.2021
##JCAMPDX= 6.0         $$ Bruker NMR JCAMP-DX V2.0
##DATA TYPE= NMR FID
##DATA CLASS= NTUPLES
##ORIGIN= UXNMR, Bruker Analytische Messtechnik GmbH
##OWNER= root
$$ XWIN-NMR		Version 3.5
$$ Thu Jun 10 11:20:40 2021 Russian Standard Time (UT+4h)  she@DPX200
##.OBSERVE FREQUENCY= 200.131506
##.OBSERVE NUCLEUS= ^1H
##.DELAY= (6, 6)
##.ACQUISITION MODE= SIMULTANEOUS
##.ACQUISITION SCHEME= undefined
##.AVERAGES= 8
##.DIGITISER RES= 18
##SPECTROMETER/DATA SYSTEM= spect
##.PULSE SEQUENCE= zg30
##.SOLVENT NAME= DMSO
##.SHIFT REFERENCE= (INTERNAL, DMSO, 0, 15.7039)
##AUDIT TRAIL= $$ (NUMBER, WHEN, WHO, WHERE, WHAT)
$$ ##TITLE= Audit trail, XWIN-NMR		Version 3.5
$$ ##JCAMPDX= 5.01
$$ ##ORIGIN= Bruker BioSpin GmbH
$$ ##OWNER= she
$$ F:/spectra/data/she/nmr/H-F/1/audita.txt
$$ ##AUDIT TRAIL=  $$ (NUMBER, WHEN, WHO, WHERE, WHAT)
(   1,<2021-06-10 11:19:26.14 +0400>,<she>,<DPX200>,
      <created by zg, POWCHK disabled, PULCHK disabled
       configuration hash MD5:
       00 E9 B6 7A A2 85 ED C7 34 08 36 98 17 FE 4E 26
       data hash MD5: 16K
       A5 4B 3E 2D 61 61 3A BD AB 30 8E 1B 66 ED 0E 50>)
$$ ##END=
$$ 
$$ hash MD5
$$ 0A 43 CD 85 18 E2 8A 1E 87 6C EE 9B 31 FE F6 99
##$RELAX= 
##$RELAX= 
##$RELAX= 
##$RELAX= 
##$RELAX= 
##$RELAX= 
$$ Bruker specific parameters
$$ --------------------------
##$DU= <F:/spectra>
##$EXPNO= 1
##$NAME= <H-F>
##$PROCNO= 1
##$TYPE= <nmr>
##$USER= <she>
##$AMP= (0..31)
100 100 100 100 100 100 100 100 100 100 100 100 100 100 100 100 100 100 
100 100 100 100 100 100 100 100 100 100 100 100 100 100 
##$AQSEQ= 0
##$AQ_mod= 1
##$AUNM= <au_zg>
##$AUTOPOS= <>
##$BF1= 200.13
##$BF2= 200.13
##$BF3= 200.13
##$BF4= 200.13
##$BF5= 200.13
##$BF6= 200.13
##$BF7= 200.13
##$BF8= 200.13
##$BYTORDA= 1
##$CFDGTYP= 0
##$CFRGTYP= 5
##$CHEMSTR= <none>
##$CNST= (0..31)
1 1 145 1 1 1 1 1 1 1 1 1 1 1 1 1 1 1 1 1 1 1 1 1 1 1 1 1 1 1 1 1 
##$CPDPRG= <>
##$CPDPRG1= <>
##$CPDPRG2= <>
##$CPDPRG3= <>
##$CPDPRG4= <mlev>
##$CPDPRG5= <mlev>
##$CPDPRG6= <mlev>
##$CPDPRG7= <mlev>
##$CPDPRG8= <mlev>
##$CPDPRGB= <>
##$CPDPRGT= <>
##$D= (0..31)
0 1.2 0 0 0 0 0 0 0 0.06 0 0.03 0 0 0 0 0.0002 0 0 0 0 0 0 0 0 0 0 0 0 
0 0 0 
##$DATE= 1623309565
##$DBL= (0..7)
120 120 120 120 120 120 120 120 
##$DBP= (0..7)
150 150 150 150 150 150 150 150 
##$DBP07= 0
##$DBPNAM0= <>
##$DBPNAM1= <>
##$DBPNAM2= <>
##$DBPNAM3= <>
##$DBPNAM4= <>
##$DBPNAM5= <>
##$DBPNAM6= <>
##$DBPNAM7= <>
##$DBPOAL= (0..7)
0.5 0.5 0.5 0.5 0.5 0.5 0.5 0.5 
##$DBPOFFS= (0..7)
0 0 0 0 0 0 0 0 
##$DE= 6
##$DECBNUC= <off>
##$DECIM= 32
##$DECNUC= <off>
##$DECSTAT= 4
##$DIGMOD= 1
##$DIGTYP= 9
##$DL= (0..7)
0 120 120 120 120 120 120 120 
##$DP= (0..7)
150 150 150 150 150 150 150 150 
##$DP07= 0
##$DPNAME0= <>
##$DPNAME1= <>
##$DPNAME2= <>
##$DPNAME3= <>
##$DPNAME4= <>
##$DPNAME5= <>
##$DPNAME6= <>
##$DPNAME7= <>
##$DPOAL= (0..7)
0.5 0.5 0.5 0.5 0.5 0.5 0.5 0.5 
##$DPOFFS= (0..7)
0 0 0 0 0 0 0 0 
##$DQDMODE= 0
##$DR= 18
##$DS= 0
##$DSLIST= <SSSSSSSSSSSSSSS>
$$ [...]
##$SUBNAM2= <"">
##$SUBNAM3= <"">
##$SUBNAM4= <"">
##$SUBNAM5= <"">
##$SUBNAM6= <"">
##$SUBNAM7= <"">
##$SUBNAM8= <"">
##$SUBNAM9= <"">
##$SW= 20.0188882624521
##$SWIBOX= (0..15)
0 0 2 0 0 0 0 0 0 0 0 0 0 0 0 0 
##$SW_h= 4006.41025641026
##$TD= 16384
##$TD0= 1
##$TE= 0
##$TE2= 300
##$TE3= 300
##$TEG= 300
##$TL= (0..7)
0 120 120 120 120 120 120 120 
##$TP= (0..7)
150 150 150 150 150 150 150 150 
##$TP07= 0
##$TPNAME0= <>
##$TPNAME1= <>
##$TPNAME2= <>
##$TPNAME3= <>
##$TPNAME4= <>
##$TPNAME5= <>
##$TPNAME6= <>
##$TPNAME7= <>
##$TPOAL= (0..7)
0.5 0.5 0.5 0.5 0.5 0.5 0.5 0.5 
##$TPOFFS= (0..7)
0 0 0 0 0 0 0 0 
##$TUNHIN= 0
##$TUNHOUT= 0
##$TUNXOUT= 0
##$USERA1= <user>
##$USERA2= <user>
##$USERA3= <user>
##$USERA4= <user>
##$USERA5= <user>
##$V9= 5
##$VALIST= <valist>
##$VCLIST= <CCCCCCCCCCCCCCC>
##$VD= 0
##$VDLIST= <DDDDDDDDDDDDDDD>
##$VPLIST= <PPPPPPPPPPPPPPP>
##$VTLIST= <TTTTTTTTTTTTTTT>
##$WBST= 1024
##$WBSW= 4
##$XGAIN= (0..3)
0 0 0 0 
##$XL= 0
##$YL= 0
##$YMAX_a= 107944
##$YMIN_a= -90466
##$ZGOPTNS= <>
##$ZL1= 120
##$ZL2= 120
##$ZL3= 120
##$ZL4= 120
##$ABSF1= 10
##$ABSF2= 0
##$ABSG= 5
##$ABSL= 3
##$ALPHA= 0
##$AQORDER= 0
##$ASSFAC= 0
##$ASSFACI= 0
##$ASSFACX= 0
##$ASSWID= 0
##$AUNMP= <proc_1d>
##$AZFE= 0.1
##$AZFW= 0.1
##$BCFW= 1
##$BC_mod= 2
##$BYTORDP= 1
##$COROFFS= 0
##$CY= 11.3945322036743
##$DATMOD= 1
##$DC= 2
##$DFILT= <>
##$DTYPP= 0
##$F1P= 15.9154993809931
##$F2P= -4.1035820241983
##$FCOR= 0.5
##$FTSIZE= 0
##$FT_mod= 4
##$GAMMA= 1
##$GB= 0.15
##$INTBC= 1
##$INTSCL= 1
##$ISEN= 128
##$LB= 0.24
##$LEV0= 0
##$LPBIN= 0
##$MAXI= 10000
##$MC2= 0
##$MEAN= 0
##$ME_mod= 0
##$MI= 1.114404
##$NCOEF= 0
##$NC_proc= 0
##$NLEV= 6
##$NOISF1= 3.799351
##$NOISF2= 2.8
##$NSP= 1
##$NTH_PI= 0
##$NZP= 0
##$OFFSET= 15.70392
##$PC= 1
##$PHC0= -11483.33
##$PHC1= 12.80101
##$PH_mod= 1
##$PKNL= yes
##$PPARMOD= 0
##$PSCAL= 0
##$PSIGN= 0
##$REVERSE= no
##$SF= 200.130013532006
##$SI= 16384
##$SIGF1= 3
##$SIGF2= 2
##$SINO= 400
##$SIOLD= 16384
##$SREGLST= <1H.CDCl3>
##$SSB= 0
##$STSI= 0
##$STSR= 0
##$SW_p= 3612.71676300578
##$SYMM= 0
##$S_DEV= 0
##$TDeff= 0
##$TDoff= 0
##$TI= <>
##$TILT= no
##$TM1= 0
##$TM2= 0
##$TOPLEV= 0
##$USERP1= <user>
##$USERP2= <user>
##$USERP3= <user>
##$USERP4= <user>
##$USERP5= <user>
##$WDW= 1
##$XDIM= 8192
##$YMAX_p= 0
##$YMIN_p= 0
$$ End of Bruker specific parameters
$$ ---------------------------------
##NTUPLES= NMR FID
##VAR_NAME=  TIME,          FID/REAL,        FID/IMAG
##SYMBOL=    X,             R,               I
##VAR_TYPE=  INDEPENDENT,   DEPENDENT,       DEPENDENT
##VAR_FORM=  AFFN,          ASDF,            ASDF
##VAR_DIM=   8192,          8192,            8192
##UNITS=     SECONDS,       ARBITRARY UNITS, ARBITRARY UNITS
##FACTOR=    0.0002496,     1,               1
##FIRST=     0,             0,               0
##LAST=      2.0444736,     0,               0
##MIN=       0,             -90466,          0
##MAX=       2.0444736,     107944,          0
$$ Real data points
##PAGE= N=1
##DATA TABLE= (X++(R..R)), XYDATA
$$ plain form
0 0 0 0 0 0 0 0 0 0 0 0 0 0 0 0 -8 8 -8 8 -8 8 -16 16 -16 24 -24 32 -33 40 -48 56 -64 72 -80 89 -104 114
36 114 -128 144 -161 181 -201 222 -246 273 -302 334 -368 407 -448 493 -543 598 -661 729 -806
55 -806 891 -993 1105 -1240 1397 -1589 1822 -2120 2514 -3057 3860 -5170 7658 -14075 66921
70 66921 107944 -65083 -56047 46592 71170 -17080 -33528 33740 30307 -8083 17894 4002
82 4002 -1453 33019 19991 -17968 3410 39453 17457 -22891 10778 34557 5221 -2769 8044
95 8044 15136 14648 2939 9850 1681 5143 33914 -4429 -25936 36076 31083 -22733 -8749 28733
109 28733 18363 -15125 417 25655 -2031 -8730 12783 9159 83 1603 7542 -2182 -4508
122 -4508 23804 -10 -27715 23334 22298 -31666 -8587 33679 9975 -34828 -11005 42301
$$ packed form
0@%%%%%%%%%%%%%%qJ6j6J6j6J6k4L2l2M0m8N6o5P3q8J04j20J36j52J69j93K18
36A14k42K72l05L42l82M23m68N19n75O36p02P75q55R41j036J141j259J390j535
55h06J697j884K098k345K637k986L411l942M634n571O917r030J2828k1733Q0996
70F6921M1023j73027R036J02639K4578q8250j6448O7268l433l8390K5977j3892
82D002n455L4472j3028l7959K1378L6043k1996m0348L3669K3779k9336p990J0813
95H044P092m88j1709O911q169L462K8771l8343k1507O2012m993n3816J3984L7482
109B8733j0370l3488J5542K5238k7686o699K1513l624r076J520N939r724k326
122d508K8312k3814k7705N1049j036n3964K3079M2266k3704m4803K3823N3306
$$ plain form
134 42301 3718 -41364 5406 30455 -8675 -24414 6958 15910 -13756 -6246 8715 -12110
146 -12110 -123 10539 -12928 -10016 3543 6386 -2884 -18883 -737 9894 -8751 -4097 -3318
159 -3318 -9470 4776 1682 -15145 -9526 12492 5878 -28438 -9806 24199 -3725 -22135 -3095
172 -3095 7101 -93 -14497 -1742 7162 -13993 -2542 7684 -14456 -4861 10084 -5225 -13838
185 -13838 -2215 10219 -4724 -14943 3590 1532 -6439 1441 -2669 -5866 -3836 4184 4510 -17137
199 -17137 -3297 18685 -10500 -16426 10668 7971 -7134 -11343 2504 9532 -5254 -3956 1797
212 1797 -3878 2262 2164 -3976 -1192 1898 4664 -6889 -5474 12794 -795 -9231 4853 162 -288
227 -288 3812 -2099 -409 -1605 3869 6428 -9485 -1200 11578 -2846 -7187 4567 9471 -3765
$$ packed form
134D2301l8583m5082M6770K5049l9130j5739L1372Q952k9666P510J4961k0825
146a2110J1987J0662k3467K912J3559K843r270j5999J8146J0631j8645M654P79
159c318o152J4246l094j6827N619K2018o614l4316J8632L4005k7924j8410J9040
172c095J0196p194j4404J2755Q904k1155J1451J0226k2140R595J4945j5309q613
185a3838J1623J2434j4943j0219J8533k058p971P880m110l197K030Q020L26k1647
199a7137J3840K1982k9185n926K7094k697j5105m209J3847P028j4786J298N753
212A797n675O140r8o140K784L090K766j1553J415J8268j3589q436J4084m691m50
227b88M100n911J690j196N474K559j5913Q285J2778j4424m341J1754M904j3236
$$ plain form
241 -3765 -9321 10222 7525 -8973 1952 4562 -504 861 -1619 5159 2865 -5373 3478 837
255 837 855 8186 -4287 -4612 7253 4532 -2143 -2878 6726 5498 -8916 1752 8908 -1855 -751
270 -751 186 2746 2518 -3104 5421 1263 -6940 7593 3930 -6180 2393 3219 913 -1392 -1196 5952
286 5952 -283 -2983 2890 -440 3117 2144 -4456 94 1646 4038 219 -7760 5687 5373 -9235
301 -9235 1193 6534 -522 -3568 -3835 5450 2976 -5908 2347 973 -3086 1006 -407 1046 -272
316 -272 -2276 1332 -3022 1170 4194 -5939 -121 3686 -3292 846 -549 -942 977 -4071 2805
331 2805 1971 -6627 1530 2429 -2688 -970 370 2685 -3383 -4600 5704 77 -3992 392 -2442
346 -2442 1374 735 -2809 2618 -1954 -2436 2020 -3135 2454 2706 -5868 -658 1865 734 65 -3483
$$ packed form
241c765n556J9543k697j6498J0925K610n066J365k480O778k294q238Q851k641
255H37J8P331j2473l25J1865k721o675p35R604j228j4414J0668P156j0763J104
270g51R37K560k28n622Q525m158q203J4533l663j0110Q573Q26k306k305J96P148
286E952o235k700N873l330L557r73o600M550J552K392l819p979J3447l14j4608
301i235J0428N341p056l046k67R285k474q884Q255j374m059M092j413J453j318
316b72k004L608m354M192L024j0133N818L807o978M138j395l93J919n048O876
331B805q34q598Q157Q99n117J718J340K315o068j217J0304n627m069M384k834
346b442L816o39l544N427m572m82M456n155N589K52q574N210K523j131o69l548
$$ plain form
362 -3483 2670 394 -4590 2584 856 -1744 -227 -2057 2589 179 -2914 3433 -2266 -2061 4003
377 4003 -2200 -898 1046 -2356 1644 -658 -129 1940 -3254 634 1604 -1809 2417 -968 -1898 487
393 487 -928 3765 -995 -4537 3795 139 -2083 2600 -406 1277 -810 -3225 3843 484 -1633
408 -1633 1518 -2676 1577 2149 -1567 1111 -980 245 1421 -2751 2434 632 -3458 2842 -193
423 -193 -484 2207 -2376 1324 449 -2282 4030 -581 -2845 1251 -370 1849 53 -2239 2341 -1112
439 -1112 -68 1804 -1870 2329 393 -3157 2028 805 1253 824 -4499 1672 2627 -1629 1255 -1393
455 -1393 -345 2542 -2401 511 1429 -879 1533 -2150 -200 3259 -1638 -334 -657 -565 3688 -1586
471 -1586 -998 1552 -1922 2144 676 -2992 1974 -425 -740 1053 -1384 2051 -70 -3350 1713 475
$$ packed form
362c483O153k276m984P174j728k600J517j830M646k410l093O347n699K05O064
377D003o203J302J944l402M000k302N29K069n194L888R70l413M226l385r30K385
393D87j415M693m760l542Q332l656k222M683l006J683k087k415P068l359k117
408a633L151m194M253N72l716K678k091J225J176m172N185j802m090O300l035
423a93k91K691m583L700q75k731O312m611k264M096j621K219j796k292M580l453
439a112J044J872l674M199j936l550N185j223M48m29n323O171R55m256K884k648
455a393J048K887m943K912R18k308K412l683J950L459m897J304l23R2M253n274
471a586N88K550l474M066j468l668M966k399l15J793k437L435k121l280N063j238
$$ plain form
487 475 368 1036 -2875 306 -14 -59 3057 -2718 -2006 2389 -517 915 -831 -1456 3462 -2291 -2061
504 -2061 2079 -273 1126 -1338 -2728 2983 876 -862 -754 -2374 3410 1075 -3266 492 -532
519 -532 1667 645 -4364 2593 3084 -2745 -1442 -864 4038 2322 -6285 -874 3441 411 -30 -2752
535 -2752 1188 2362 -3179 777 944 -373 2066 -2689 -1529 2277 712 1522 -2810 -2467 4394 -81
551 -81 -1990 759 -755 1857 -878 -1818 3051 -840 -722 1273 -1173 1392 -297 -897 1495 -2123
567 -2123 414 2653 -1792 -70 -749 -507 3167 -1615 -1415 1002 -1263 2007 245 -2003 1507 -799
583 -799 -53 17 -1893 3241 982 -4510 -816 1807 3164 -1394 -5105 3559 3453 -2954 -867 370
599 370 2475 -457 -4699 2168 2356 -1448 56 -2222 625 2745 -1178 -593 -1481 934 3777 -2890
$$ packed form
487D75j07O68l911L181l20m5L116n775P12M395k906J432j746o25M918n753K30
504b061M140k352J399k464j390N711k107j738J08j620N784k335m341L758j024
519e32K199j022n009O957M91n829J303N78M902j716q607N411M315l030m41k722
535b752L940J174n541L956J67j317K439m755J160L806j565Q10m332L43O861m475
551h1j909K749j514K612k735r40M869l891J18J995k446K565j689o00K392l618
567b123K537K239m445J722o79K42L674m782K00K417k265L270j762k248L510k306
583g99P46P0j910N134k259n492L694K623J357m558l711Q664j06o407K087J237
599C70K105k932m242O867J88l804J504k278K847K120l923N85q88K415K843o667
$$ plain form
615 -2890 -2111 2523 31 409 -1866 -144 3711 -2075 -2088 1451 260 2254 -1337 -2578 2386 -111
631 -111 530 1059 -1996 1152 -257 -660 1782 -1557 81 1302 -2459 897 1024 -122 884 -2146
647 -2146 441 1547 -1499 1923 -309 -2289 2123 513 -180 -1206 -1570 3437 -26 -3100 1834 742
663 742 -194 -1207 -1389 3690 84 -2835 858 -495 1210 1145 -2323 478 35 -146 1635 -2000 543
680 543 1613 -2207 105 357 406 1323 -3062 -813 2239 -221 650 -1319 -326 2461 -1742 -136 1687
697 1687 -899 537 -1017 -347 2414 -1630 -561 933 -1411 1575 541 -878 498 -1456 1068
712 1068 1197 -1355 1257 -627 -1475 2075 -448 52 136 -1518 1591 -878 -1072 2417 -1492 -1125 496
729 496 -156 2332 -769 -1468 1075 -940 539 933 -1771 1206 -65 -961 1012 -1181 572 289 -2550
$$ packed form
615b890P79M634k492L78k275J722L855n786j3L539j191J994l591j241M964k497
631a11O41N29l055L148j409m03K442l339J638J221l761L356J27j146J006l030
647b146K587J106l046L422k232j980M412j610o93j026l64N007l463l074M934j092
663G42r36j013j82N079l606k919L693j353J705o5l468K801m43j81J781l635K543
680E43J070l820K312K52M9R17m385K249L052k460Q71j969R93K787m203J606J823
697A687k586J436j554O70K761m044J069J494k344K986j034j419J376j954K524
712A068J29k552K612j884q48L550k523N00Q4j654L109k469j94L489l909L67J621
729D96o52K488l101o99K543k015J479L94k704K977j271q96J973k193J753k83k839
$$ plain form
746 -2550 1729 829 -765 713 -1837 834 1747 -1457 383 -455 -123 1394 -1915 688 1664 -1913
762 -1913 69 -403 643 1688 -2038 -552 1068 -975 1562 -380 -1032 1222 -1358 609 890 -1108
778 -1108 1270 -1050 -787 1882 -863 244 202 -1348 1345 -214 -494 1378 -1703 188 826 -1324
794 -1324 1301 -724 -839 1133 -1024 1304 886 -2076 1116 -184 -13 1334 -1342 -143 110 -1457
810 -1457 1930 -80 -651 823 -1667 1102 1320 -1011 707 -966 -408 1489 -1301 1116 546 -1896
826 -1896 827 -90 -2 1650 -1588 324 307 -975 1770 -362 -968 923 -888 988 666 -773 1107
843 1107 -659 -407 1706 -1325 208 237 -1401 1505 -109 -562 739 -1630 982 708 -1065 1196
859 1196 -662 -864 1091 -512 1165 321 -1787 916 -505 -45 1461 -1339 144 -12 -927 1794
$$ packed form
746b550M279r00j594J478k550K671R13l204J840q38L32J517l309K603R76l577
762a913J982m72J046J045l726J486J620k043K537j942o52K254k580J967K81j998
778a108K378k320K63K669k745J107m2j550K693j559k80J872l081J891O38k150
794a324K625k025j15J972k157K328m18k962L192j300J71J347k676J199K53j567
810a457L387k010n71J474k490K769K18k331J718j673N58J897k790K417n70k442
826a896K723r17Q8J652l238J912j7j282K745k132o06J891j811J876l22j439J880
843A107j766K52K113l031J533K9j638K906j614m53J301k369K612k74j773K261
859A196j858k02J955j603J677q44k108K703j421M60J506k800J483j56r15K721
$$ plain form
875 1794 -564 -615 914 -1780 346 659 -1069 1308 -1049 -442 1252 -1223 628 67 -1246 1523
891 1523 -168 -319 1189 -1453 263 299 -901 1751 -871 -834 1167 -955 789 351 -1553 938 -966
908 -966 153 1729 -1148 504 -20 -1050 1529 -153 -389 685 -1588 1023 545 -1048 1612 -1098
924 -1098 -519 1044 -536 873 321 -1390 1467 -332 18 1493 -1462 468 559 -723 1168 -727
940 -727 -322 990 -1340 988 928 -1134 1013 -1078 -98 1381 -1028 375 -210 -1150 1757 -440 -183
957 -183 668 -1465 403 64 -673 1380 -964 -678 684 -1227 1084 565 -1590 786 -520 239 1084
974 1084 -1405 810 225 -916 1227 -669 -217 736 -1455 366 671 -621 996 -1468 -352 1558
990 1558 -864 499 -440 -1185 1281 -609 43 880 -1121 148 -17 -770 1546 -574 -376 444 -952
$$ packed form
875A794k358n1J529k694K126L13j728K377k357O07J694k475J851n61j313K769
891A523j691j51J508k642J716L6j200K652k622L7K001k122J744m38j904K491j904
908i66J119J576k877J652n24j030K579j682k36J074k273K611m78j593K660k710
924a098N79J563j580J409n52j711K857j799L50J475k955J930R1j282J891j895
940g27M05J312k330K328o0k062K147k091R80J479k409J403n85r40K907k197K57
957a83Q51k133J868l39p37K053k344K86J362j911K311n19k155K376j306P59Q45
974A084k489K215n85j141K143j896M52R53k191J821L05j292J617k464J116J910
990A558k422J363r39p45K466j890O52Q37k001J269j65p53K316k120J98Q20j396
$$ plain form
1007 -952 1226 315 -1351 907 -609 -100 1039 -1084 751 -66 -943 1589 -497 -256 1124 -1337
1023 -1337 516 306 -265 1140 -945 -521 1095 -785 867 -221 -1373 983 -151 381 863 -1393
1039 -1393 739 174 -944 1202 -790 -267 191 -1310 1348 581 -475 637 -1094 335 1438 -1062
1055 -1062 428 134 -960 1073 -677 557 750 -1622 324 178 -541 1561 -957 -486 477 -584
1071 -584 1062 -258 -980 1301 -760 -35 663 -960 639 -539 -650 1490 -618 -116 604 -1421 952
1088 952 311 -542 710 -1170 -61 772 -743 676 -258 -884 1309 -497 529 760 -1300 477 -237
1105 -237 -524 1491 -721 -338 242 -1008 991 130 -941 881 -772 388 809 -1383 996 119 -982
1122 -982 1122 -408 423 63 -1558 993 204 -599 680 -962 -524 873 -686 887 -541 -356 882
$$ packed form
1007i52K178r11j666K258j516N09J139k123J835q17q77K532k086K41J380k461
1023a337J853k10n71J405k085M24J616j880J652j088j152K356j134N32M82k256
1039a393K132n65j118K146j992N23M58j501K658p67j056J112j731J429J103k500
1055a062J490k94j094K033j750J234J93k372J946j46p19K102k518M71R63j061
1071e84J646j320p22K281k061P25O98j623J599j178j11K140k108N02P20k025K373
1088I52o41q53J252j880J109Q33j515J419r34o26K193j806J026K31k060J777p14
1105b37k87K015k212L83N80j250J999q61j071J822j653J160M21k192K379q77j101
1122i82K104j530Q31l60j621K551p89q03J279j642M38J397j559J573j428J85J238
$$ plain form
1139 882 -859 210 931 -1001 109 -473 -47 1605 -809 -464 260 -1022 1183 80 -515 941 -1014
1156 -1014 215 941 -1016 1002 -361 -770 944 -681 315 567 -1497 814 45 -425 1098 -1129
1172 -1129 -98 504 -924 1087 -370 -813 583 -652 646 520 -1218 859 -609 -882 1289 -307
1188 -307 -9 175 -1034 1280 228 -381 1035 -1079 53 786 -774 1108 -149 -598 874 -991
1204 -991 765 965 -1144 220 -119 154 1288 -873 290 476 -833 1003 -276 -474 779 -1120
1220 -1120 211 865 -814 732 -725 -438 1285 -459 295 415 -1301 1042 -120 -198 988 -998
1236 -998 186 337 -569 1100 -50 -780 564 -559 737 301 -1125 805 -509 -624 1363 -721
1252 -721 451 406 -838 1035 -176 -274 829 -1153 288 675 -983 755 -262 -337 851 -570 588
$$ packed form
1139H82j741J069P21j932J110n82M26J652k414L45P24j282K205j103n95J456j955
1156a014J229P26j957K018j363m09J714j625R96K52k064K311p69m70J523k227
1172a129J031O02j428K011j457m43J396j235J298j26j738K077j468k73K171j596
1188c07K98J84j209K314j052o09J416k114J132P33j560J882j257m49J472j865
1204i91J756K00k109J364l39K73J134k161J163J86j309J836j279j98J253j899
1220a120J331O54j679J546j457K87J723j744P54J20j716K343j162p8J186j986
1236i98J184J51r06J669j150p30J344j123J296m36j426J930j314j15J987k084
1252g21J172m5j244J873j211r8J103j982J441L87j658J738j017p5J188j421J158
$$ plain form
1269 588 377 -1396 956 -112 151 1110 -1100 66 -17 -843 1062 -363 -954 822 -1028 479 743
1286 743 -792 421 -968 -278 1053 -853 519 193 -1164 872 6 -149 924 -1196 154 499
1302 499 -866 1154 -229 -549 851 -773 464 130 -865 672 -553 34 1128 -664 72 354 -713
1319 -713 752 102 -310 580 -1058 526 372 -940 600 -596 -560 887 -436 572 -115 -1176 932
1336 932 -290 206 942 -881 -24 70 -202 1063 -704 -175 616 -1168 493 437 -756 797 -470 69
1354 69 770 -590 314 1 -1155 991 -236 -461 565 -857 355 102 -706 815 -743 -448 972
1371 972 -651 559 348 -960 407 -640 360 864 -1035 589 232 -604 886 -577 -127 314 -945
1388 -945 770 649 -535 895 -837 -245 859 -494 603 52 -1002 768 -627 127 668 -966
$$ packed form
1269E88k11j773K352j068K63R59k210J166q3q26J905j425n91J776j850J507K64
1286G43j535J213j389O90J331j906J372l26j357K036q66j55J073k120J350L45
1302D99j365K020j383l20J400j624J237l34r95J537j225N87J094j792P36K82j067
1319g13J465o50m12Q90j638J584j54j312J540j196L6J447j323J008o87j061K108
1336I32j222M96P36j823Q57R4k72J265j767N29P91j784J661n6j193J553j267N39
1354F9P01j360R04l13j156K146j227k25J026j422J212k53q08J521j558K95J420
1371I72j623J210k11j308J367j047J000N04j899J624l57q36J490j463M50M41j259
1388i45J715j21j184J430j732N92J104j353J097n51j054J770j395P54N41j634
$$ plain form
1404 -966 375 238 -319 1097 -529 -301 510 -977 521 -114 -748 496 -446 62 852 -676 307 -125
1422 -125 -643 1342 -134 -111 608 -1026 520 368 -537 736 -587 -49 637 -561 797 98 -926
1439 -926 627 -385 228 410 -812 386 -246 -505 886 -42 -72 249 -638 830 124 -825 404 -801
1457 -801 182 1011 -684 176 -432 -801 752 -370 -16 354 -987 342 236 -376 914 -556 -237 395
1475 395 -482 720 188 -763 396 -410 148 786 -704 261 -135 -453 918 -314 30 566 -751 669
1493 669 320 -453 486 -602 75 461 -712 712 -49 -664 964 -235 -98 496 -1044 152 109 -553
1511 -553 1101 -530 -496 379 -577 739 21 -487 455 -719 -37 505 -633 180 -412 -467 796 -312
1529 -312 6 304 -805 389 74 -333 817 -792 -204 467 -504 502 -48 -459 707 -290 192 428
$$ packed form
1404i66J341j37n57J416j626K28Q11j487J498o35o34J244r42N08P90j528R83m32
1422a25n18J985j476K3P19j634J546j52r05J273j323N38O86j198J358o99j024
1439i26J553j012O13J82j222J198o32k59J391r28l0L21q87J468p06r49J229j205
1457h01R83Q29j695Q60o08l69J553j122L54L70j341J329j06o12J290j470L19O32
1475C95q77J202n32r51J159q06N58O38j490R65l96l18J371j232L44N36j317J420
1493F69l49p73R39j088O77L86j173J424p61o15J628j199J37N94j540J196m3o62
1511e53J654j631L4Q75r56J316p18n08R42j174O82N42j138Q13n92n5J263j108
1529c12L18K98j109J194l15m07J150j609N88O71r71J006n50m11J166r97M82K36
$$ plain form
1547 428 -673 539 -4 -304 812 -663 -177 349 -608 667 116 -458 410 -607 213 515 -524 580
1565 580 -440 -497 880 12 146 378 -837 167 -313 -206 859 -471 92 584 -632 842 187 -372
1583 -372 458 -647 99 350 -662 590 144 -283 556 -492 -189 123 -540 701 150 -194 604 -633
1601 -633 -81 608 -352 466 -90 -276 634 -395 -139 375 -697 333 -13 -160 815 -538 -77 214 -439
1620 -439 749 -96 -446 359 -332 330 369 -440 545 -437 -571 999 -315 339 352 -704 375 179 -62
1639 -62 461 -541 267 440 -417 620 -47 -505 520 -523 303 198 -814 264 -343 -299 750 -423
1657 -423 106 -51 -740 518 -343 -244 276 -625 173 393 -255 148 -195 -419 458 -492 354 290 -557 433
1677 433 -300 -216 530 -457 126 211 -448 903 12 -141 405 -347 395 459 -652 386 -481 -245 687 -339
$$ packed form
1547D28j101J212n43l00J116j475M86N26r57J275n51n74Q68j017Q20L02j039J104
1565E80j020n7J377q68J34K32j215J004m80J07J065j330N63M92j216J474o55n59
1583c72Q30j105P46K51j012J252m46m27Q39j048L03L12o63J241n51l44P98j237
1601f33N52O89r60Q18n56j86R10j029K56N14j072J030l46j47R75j353M61K91o53
1620d39J188q45l50Q05o91O62L9q09R85r82j34J570j314O54J3j056J079j96k41
1639f2N23j002Q08J73q57J037o67m58J025j043Q26j05j012J078o07M4J049j173
1657d23N29j57o89J258q61R9N20r01P98K20o48M03l43k24Q77r50Q46o4q47R90
1677D33p33Q4P46r87N83Q5o59J351q91j53N46p52P42O4j111J038q67K36R32j026
$$ plain form
1697 -339 315 12 -845 369 -189 -470 627 -607 51 365 -354 669 -341 -474 592 -511 379 182
1715 182 -817 299 -63 -109 595 -636 -57 189 -479 544 205 -105 438 -563 412 557 -554 462
1733 462 -230 -382 219 -488 249 -106 -718 493 -212 72 422 -386 -4 193 -573 957 -26 -112 500 -572
1753 -572 376 -132 -569 283 -281 -120 621 -327 272 -233 -457 447 115 202 307 -615 139 301 -547 556
1773 556 -354 -302 352 -421 385 145 -518 581 -223 -308 456 -631 -183 -164 -395 647 -207 -215 369 -544 253
1794 253 236 -370 512 -399 -287 802 -152 10 -189 -547 568 -178 423 116 -575 402 38 -207 540 -150
1814 -150 -157 328 -231 683 42 -730 363 -457 -102 411 -376 444 -173 -452 522 -297 -202 120 -442 337 194
1835 194 -50 545 -588 -55 648 -356 382 -127 -691 455 -96 60 338 -387 122 -75 -533 594 -124
$$ packed form
1697c39O54l03q57J214n58k81J097j234O58L14p19J023j010j33J066j103Q90j97
1715A82r99J116l62m6P04j231N79K46o68J023l39l10N43j001R75J45j111J016
1733D62o92j52O01p07P37l55o12J211p05K84L50q08L82J97p66J530r83q6O12j072
1753e72R48n08m37Q52n64J61P41r48N99n05k24R04l32Q7J05r22P54J62q48J103
1773E56r10N2O54p73Q06k40o63J099q04q5P64j087M48J9k31J042q54qN84r13P97
1794B53j7o06Q82r11J12J089r54J62j99l58J115p46O01l07o91R77l64k45P47o90
1814a50pM85n59R14o41p72J093q20L55N13p87Q20o17k79R74q19R5L22n62P79j43
1835A94k44N95j133N33P03j004P38n09n64J146n51J56K78p25N09j97m58J127p18
$$ plain form
1854 -124 -196 145 -414 650 -53 -451 549 -491 -116 300 -450 203 -60 -629 554 64 115 462 -547
1873 -547 385 157 -36 390 -338 20 342 -264 477 -41 -448 271 -313 17 356 -640 390 -148 -236 677
1893 677 -204 -24 116 -611 374 263 -229 535 -296 -99 210 -265 399 -183 -363 193 -74 144 230 -493
1913 -493 193 -166 -243 503 -344 128 89 -372 423 50 -460 396 -353 154 169 -302 324 -141 -544 806 -200
1934 -200 -77 187 -1006 563 -80 -225 627 -664 -381 18 -165 378 -130 -85 304 -201 85 219 -541
1953 -541 171 -96 -261 721 -360 44 159 -611 612 81 -178 441 -435 108 195 -118 691 -249 -330 449
1973 449 -496 301 237 -727 207 -143 -148 310 -365 -41 295 -382 553 -87 -435 244 -167 19 94 -296 307
1994 307 -232 -289 459 -26 189 -2 -440 295 -142 -244 288 -545 -121 191 -86 686 -181 -301 612 -16
$$ packed form
1854a24p2L41n59J064p03l98J000j040L75M16p50O53k63n69J183m90N1L47j009
1873e47R32k28j93M26p28L58L22o06P41n18m07P19n84L30L39r96J030n38q8R13
1893F77q81J80J40p27R85j11m92P64q31J97L09m75O64n82j80N56k67K18Q6p23
1913d93O86l59p7P46q47M72l9m61P95l73n10Q56p49N07J5m71O26m65m03J350j006
1934b00J23K64j193J569o43j45Q52j291K83L99j83N43n08M5L89n05K86J34p60
1953e41P12k67j65R82j081M04J15p70J223n31k59O19q76N43Q7l13Q09r40q1P79
1973D49r45P97o4r64R34l50nM58o75L24L36o77R35o40l48O79m11J86P5l90O03
1994C07n39n7P48m85K15j91m38P35m37j02N32q33M24L12k77P72q67j20R13o28
$$ plain form
2014 -16 111 11 -303 436 -188 -289 429 -427 37 -28 -193 406 -172 -56 365 -220 258 404 -525 367 -401
2035 -401 -464 335 -248 278 150 -709 151 24 -122 410 -444 16 -52 -552 266 -69 -273 295 -350 182 387
2056 387 -485 354 29 -94 449 -389 -96 102 -314 620 39 -362 363 -478 136 82 -467 476 -226 -250 495
2077 495 15 384 239 -587 312 -229 -130 628 -213 -80 -88 -467 663 -133 -330 469 -346 105 -48 -127 428
2098 428 -195 -307 421 -276 81 -31 -270 521 -222 -281 343 -278 -19 90 84 347 -233 0 566 -291 306
2119 306 -348 -380 324 -494 -143 572 -420 -158 -5 -335 726 -109 -283 326 -459 296 267 -61 540 -374
2139 -374 -323 198 -211 171 37 -135 257 -33 -345 433 -214 -56 35 -296 541 -243 -412 149 -263 472 -123
2160 -123 -299 377 -237 -170 358 -65 87 -174 -314 593 -143 -112 149 -403 271 315 -278 303 -213 -200 61
$$ packed form
2014a6J27j00l14P39o24j01P18q56M64o5j65N99n78J16M21n85M78J46r29Q92p68
2035d01o3P99n83N26j28q59Q60j27j46N32q54M60o8n00Q18l35k04N68o45N32K05
2056C87q72Q39l25j23N43q38K93J98m16R34n81m01P25q41O14n4n49R43p02k4P45
2077D95m80L69j45q26Q99n41R9P58q41J33ql79J130p96j97P99q15M51j53p9N55
2098D28o23j12P28o97L57j12k39P91p43n9O24o21K59J09oK63n80K33N66q57N97
2119C06o54l2P04q18L51P15r92K62J53l30J061q35j74O09p85P55k9l28O01r14
2139c74N1N21m09L82j34j72L92k90l12P78o47J58R1l31Q37p84j69N61m12P35n95
2160a23j76O76o14O7N28m23J52k61j40R07p36L1K61n52O74M4n93N81n16J3K61
$$ plain form
2181 61 -155 431 -130 -657 422 -146 -187 177 -384 162 2 -211 764 -234 5 323 -157 170 322 -403
2201 -403 332 -28 -117 548 -68 331 -79 -308 200 -14 -52 423 -391 394 221 -226 546 -219 -172 301 -564
2222 -564 225 -198 -189 178 -189 -42 518 -247 244 72 -437 575 105 -367 471 -248 148 128 -106 208 -387
2243 -387 -398 550 -292 430 15 -286 499 -114 -62 302 -266 36 12 -367 516 -216 10 61 -250 431 -51
2264 -51 -460 160 -93 49 373 -106 38 -317 -348 657 -386 -36 210 -434 390 -38 -42 455 -201 43 258
2285 258 2 277 -194 -233 481 -75 -33 229 -199 206 -229 -337 556 -287 -354 352 -285 218 -220 -194 298
2306 298 -309 -323 500 -346 -30 -366 -347 228 -59 181 269 -361 -101 -118 -256 525 -31 -78 122 -212 27 315
2328 315 -481 213 -53 163 393 -359 187 -44 -224 459 -263 90 99 -441 370 7 31 290 -249 82 158
$$ packed form
2181F1k16N86n61n27J079n68m1L64n61N46j60k13R75r98K39L18m80L27J52p25
2201d03P35l60q9O65o16L99m10k29N08k14l8M75q14P85j73m47P72p65M7M73q65
2222e64P89m23RL67l67J47N60p65M91j72n09J012m70m72Q38p19L96k0k34L14n95
2243c87j1R48q42P22m15l01P85o13N2L64n68L02k4l79Q83p32K26N1l11O81m82
2264e1m09O20k53J42L24m79J44l55l1J005j043L50K46o44Q24m28mM97o56K44K15
2285B58k56K75m71l9P14n56M2K62m28M05m35j08Q93q43o7P06o37N03m38K6M92
2306B98o07j4Q23q46L16l36J9N75k87K40Q8o30K60j7j38P81n56m7K00l34K39K88
2328C15p96O94k66K16K30p52N46k31j80O83p22L53Rn40Q11l63K4K59n39L31P6
$$ plain form
2349 158 -133 421 -71 -202 215 -357 -111 253 -326 82 -392 -211 308 -337 -132 143 -155 354 -23 -366
2369 -366 338 -559 135 78 -412 165 -233 -393 218 -182 -88 378 -221 -53 -206 -231 506 -441 16 287 -257
2390 -257 310 -181 -198 129 -396 102 398 -103 141 -67 -275 231 -370 64 192 -425 255 11 -54 221 -265
2411 -265 139 4 -207 420 -179 -520 441 -200 171 214 -352 285 -269 -289 580 -149 -138 377 -251 446 -14
2432 -14 -170 262 -450 136 264 -173 0 -46 83 398 -344 194 54 -232 392 77 -187 240 -284 -43 144
2453 144 -443 500 -59 -375 83 -413 22 469 -640 120 -226 -323 111 -372 -37 185 -284 305 149 -46
2473 -46 420 -348 -16 177 -295 318 -287 -125 420 -418 201 114 -427 3 -114 -184 287 -347 47 -44 -353
2494 -353 384 -185 -12 354 -302 -102 254 -310 185 -142 -90 486 -172 -172 -1 -245 284 -65 -9 415 -311
$$ packed form
2349A58k91N54m92j31M17n72K46L64n79M08m74J81N19o45K05K75k98N09l77l43
2369c66P04q97O94n7m90N77l98j60O11m00R4M66n99J68j53k5P37r47M57K71n44
2390b57N67m91j7L27n25M98K96n01K44k08k08N06o01M34J28o17O80k44o5K75m86
2411b65M04j35k11O27n99l41R61o41L71M3n66O37n54k0Q69p29J1N15o28O97m60
2432a4j56M32p12N86J28m37J73m6J29L15p42N38j40k86O24l15k64M27n24K41J87
2453A44n87R43n59l16M58m96M35M47j109P60l46r7M34m83L35K22m69N89j56j95
2473d6M66p68L32J93m72O13o05J62N45q38O19q7n41M30j17p0M71o34L94r1l09
2494c53P37n69J73L66o56K00L56n64M95l27N2N76o58%J71k44N29l49N6M24p26
$$ plain form
2515 -311 71 125 -30 591 -504 -193 157 -257 229 368 -535 152 -284 -186 345 -210 42 36 -149 199 -155
2536 -155 -166 477 -474 271 181 -128 238 -282 -176 299 -127 -162 236 -198 405 52 28 344 -189 33 59 -357
2558 -357 40 -61 -186 346 -148 259 172 -208 315 -324 -160 421 -436 135 -170 -283 230 111 38 44 -417
2579 -417 27 399 -147 286 -340 -85 201 -100 347 34 -66 186 -177 -168 320 -277 242 -21 -75 524 -115
2600 -115 -249 322 -154 236 -97 -131 76 -238 -177 116 -145 21 -35 -118 420 -253 -115 163 -259 165 63
2621 63 -111 194 -117 -50 171 -290 -23 -34 -230 305 31 61 328 -228 -17 -10 -80 359 -140 -18 -21 -134 128
2644 128 67 -253 280 -163 -318 4 -331 25 53 -122 375 -111 88 355 -273 -141 64 -76 278 -197 -101
2665 -101 323 -259 624 -52 -176 166 -35 26 179 -110 148 54 -371 181 -10 -200 107 -242 197 87 -79
$$ packed form
2515c11L82N4j55O21j095L11L50m14M86J39r03O87m36R8N31n55K52oj85L48l54
2536a55j1O43r51P45r0l09L66n20J06M75m26l5L98m34O03l53k4L16n33K22K6m16
2558c57L97j01j25N32m94M07q7l80N23o39J64N81q57N71l05j13N13j19p3Om61
2579d17M44L72n46M33o26K55K86l01M47l13j00K52l63RM88n97N19k63n4N99o39
2600a15j34N71m76L90l33l4K07l14O1K93k61J66n6q3N38o73J38K78m22M24j02
2621F3j74L05l11O7K21m61K67j1j96N35k74L0K67n56K11Pp0M39m99J22lj13K62
2644A28o1l20N33m43j55L22l35L56K8j75M97m86J99K67o28J32K05j40L54m75R6
2665a01M24n82Q83o76j24L42k01O1J53k89K58r4m25N52j91j90L07l49M39j10j66
$$ plain form
2686 -79 282 -242 81 324 -130 397 -246 -288 -39 -99 -43 105 -180 397 158 -169 60 139 -98 285 -420 -12
2708 -12 7 -116 82 -21 -95 28 -360 280 -120 -13 296 -211 145 -90 -57 265 124 -305 82 -383 -78
2729 -78 145 -328 194 -169 -324 200 6 73 190 -152 3 -121 -280 214 29 -264 291 -506 171 -79 52
2750 52 525 -65 -226 204 -71 246 84 -333 66 -224 184 75 -174 24 -82 -284 334 -61 -53 174 -146
2771 -146 229 161 21 44 89 198 259 -166 270 206 -43 302 -275 -216 162 -311 306 121 27 181 -108 58
2793 58 -56 -209 179 67 -178 -36 -54 44 -189 190 23 -94 -194 -73 -102 168 153 -460 370 -71 -143 212
2815 212 -203 -149 461 -272 306 14 -58 -62 -18 64 -88 -213 67 -333 75 490 -175 107 -17 -266 276 148
2837 148 -57 288 -142 300 243 -38 207 -105 164 308 -134 -27 -246 -333 396 -16 -117 -73 -362 -12 204
$$ packed form
2686g9L61n24L23K43m54N27o43m2K49o0N6J48k85N77k39l27K29P9k37L83p05M08
2708a2J9j23J98j03p4J23l88O40m00J07L09n07L56k35L3L22j41m29L87m65L05
2729g8K23m73N22l63j55N24j94O7J17l42J55j24j59M94j85k93N55p97O77k50J31
2750E2M73n90j61M30k75L17j62m17L99k90M08j09k49J98j06k02O18l95QK27l20
2771a46L75o8j40K3M5J09O1m25M36o4k49L45n77N9L78m73O17j85r4J54k89J66
2793E8j14j53L88j12k45J42j8R8k33L79j67j17j00J21k9K70j5o13Q30m41p2L55
2815B12m15N4O10p33N78k92p2mM4Q2j52j25K80m00M08M15o65K82j24k49N42j28
2837A48k05L45m30M42n7k81K45l12K69J44m42J07k19q7P29m12j01M4k89L50K16
$$ plain form
2858 204 -211 -93 -84 40 150 -447 380 216 -175 194 -67 71 153 127 -35 140 -435 276 172 -76 407
2879 407 -142 -254 -18 128 207 -177 -220 -28 -22 18 252 -222 345 -141 -26 164 -280 172 191 -210 132 28
2901 28 164 17 -93 305 164 -228 157 31 -222 139 -133 41 214 -31 210 198 -211 -13 -57 -52 100 -251
2923 -251 275 -250 -101 102 11 203 -41 -223 -94 -26 51 73 -275 -306 -125 -85 141 -57 -157 -5 -179 25
2945 25 284 61 36 25 -124 196 -278 17 188 -284 11 -26 -54 -57 -209 202 68 -100 73 -183 48 -5 -357
2968 -357 287 52 -298 57 -75 -142 113 -136 -43 171 -219 437 -57 -217 158 -238 17 -116 -89 249 25
2989 25 -76 316 -104 134 181 45 219 -76 -95 195 -234 65 6 -274 -68 -49 -82 57 190 126 280 51
3011 51 249 -4 -151 90 -193 1 153 -362 193 -9 81 147 -98 -57 -48 -101 216 87 -21 -7 -164 60 -59
$$ packed form
2858B04m15J18RJ24J10n97Q27j64l91L69k61J38Q2k6j62J75n75P11j04k48M83
2879D07n49j12K36J46P9l84m3J92OM0K34m74N67m86J15J90m44M52J9m01L42j04
2901B8J36j47j10L98j41l92L85j26k53L61k72J74J73k45K41j2m09J98m4NJ52l51
2923b51N26n25J49K03r1J92k44j82J29O8P7K2l48l1J81M0K26j98j00J52j74K04
2945B5K59k23k5j1j49L20m74K95J71m72K95l7k8lj52M11j34j68J73k56K31n3l52
2968c57O44k35l50L55j32o7K55k49R3K14l90O56m94j60L75l96K55j33K7L38k24
2989B5j01L92m20K38M7j36J74k95j9K90m29K99n9k80K06J9l3J39J33o4J54k29
3011E1J98k53j47K41k83J94J52n15N55k02R0O6k45M1Rn3L17j29j08J4j57K24j19
$$ plain form
3034 -59 -155 164 79 -88 30 -294 118 -94 -205 210 52 -183 83 -82 263 89 -248 207 -322 -90 235
3055 235 -202 211 195 -44 37 -74 -245 123 -259 114 22 -181 40 -93 59 218 -200 -2 36 -315 135
3076 135 -106 -92 472 -111 46 -88 -98 225 37 298 330 -191 305 -67 267 59 -136 167 90 -103 -35 -172
3098 -172 2 269 -27 215 69 -34 126 112 -44 203 -230 -117 -65 -338 19 321 255 86 -441 3 107
3119 107 -204 20 -16 38 228 -212 245 405 -366 -39 187 32 170 -42 -72 2 -44 129 -99 -218 21 -197
3141 -197 12 294 59 209 -103 157 -15 -74 133 268 -231 278 -48 -323 -174 -93 147 -37 -17 92 -158
3162 -158 -228 284 -263 50 75 -173 68 59 -179 148 -142 104 98 -157 72 -31 -140 34 -170 7 40 2 -26
3185 -26 87 -215 108 -160 139 -71 -137 -48 99 3 67 -272 155 45 -348 -1 -71 -132 -35 -309 28 -109 73
$$ packed form
3034e9r6L19q5j67J18l24M12k12j11M15j58k35K66j65L45j74l37M55n29K32L25
3055B35m37M13j6k39Q1j11j71L68l82L73r2k03K21j33J52J59m18J98L8l51M50
3076A35k41J4N64n83J57j34j0L23j88K61L2n21M96l72L34k08j95L03p7j93O8j37
3098a72J74K67k96K42j46j03J60j4j56K47m33J13N2k73L57L02o6j69n27M44J04
3119A07l11K24l6N4J90m40M57J60p71L27K26j55J38k12l0P4m6J73k28j19K39k18
3141a97K09K82k35J50l12K60j72n9K07J35m99N09l26k75J49Q1K40j84K0J09k50
3162a58p0N12n47L13K5k48K41rk38L27k90K46ok55K29j03j09J74k04J77L3l8k8
3185b6J13l02L23k68K99k10o6Q9J47r6O4l39M27j10l93L47p0o1R7k74L37j37J82
$$ plain form
3208 73 327 16 -62 286 75 44 -14 -57 344 -105 -125 80 -149 -55 192 -274 215 109 -51 189 -112 178
3230 178 183 -295 0 -272 -277 185 -48 -39 -94 -157 22 -180 23 22 -194 -54 -62 -214 76 46 213 447 18 83 -22
3255 -22 55 155 184 -216 9 -56 -190 -29 -86 174 -46 -148 43 -161 -61 -134 -118 128 110 -158 210 -236 204
3278 204 176 -318 220 36 -128 -3 182 -15 244 159 -38 55 -186 42 28 169 -151 -131 243 -137 -118 134
3300 134 -156 -60 86 86 293 -33 -210 -86 -52 21 101 198 -185 207 -89 122 -189 -21 190 -345 306 -350
3322 -350 -8 260 18 103 13 -96 72 5 47 109 19 537 196 -136 -112 183 81 171 122 62 89 -60 46 -90
3346 -90 -265 203 -106 31 -49 34 -22 7 62 40 -222 75 145 -274 41 -24 46 -43 -361 -206 208 -207 354 -202
3370 -202 -35 244 -47 190 -23 56 188 90 32 -21 218 233 178 -29 120 52 -17 43 -32 75 -121 -111 93 -33
$$ packed form
3208G3K54l11p8L48k11l1n8m3M01m49k0K05k29R4K47m66M89j06j60K40l01K90
3230A78Nm78K95k72nM62k33Rn5o3J79k02K03jk16J40qj52K90l0J67K34m29O5j05
3255b2P7J00K9m00K25o5j34J61n7K60k20j02J91k04J00p3J6K46j8k68L68m46M40
3278B04k8m94N38j84j64J25J85j97K59q5j97R3k41K28j4J41l20K0L74l80J9K52
3300A34k90R6J46%K07l26j77J24L4P3Q0R7l83L92k96K11l11J68K11n35O51o56
3322c50L42K68k42Q5r0j09J68o7M2O2r0N18l41l32K4K95j02R0m9o0K7j49J06j36
3346i0j75M68l09J37q0Q3n6K9N5k2k62K97P0m19L15o5P0q9l18J55M14m15N61n56
3370b02J67K79k91K37k13P9J32r8n8n3K39J5n5k07J49o8o9O0p5J07j96J0K04j26
$$ plain form
3394 -33 -77 -228 -81 67 -91 -247 24 -16 -236 126 -102 149 273 92 204 19 141 5 -176 -52 126
3415 126 -63 284 123 -108 149 11 -191 46 -75 287 15 -35 43 -258 -203 -47 -188 86 -167 -221 105
3436 105 -136 94 223 -196 -62 42 30 193 -247 14 -43 89 26 -193 35 129 32 31 104 162 113 -131 -55 94
3460 94 -127 263 -90 -38 50 -62 27 100 25 61 115 -248 -120 -71 -61 -74 -279 153 -47 51 -201 11 -63 264
3484 264 143 -95 -82 -2 116 -19 76 -95 -121 30 -166 -49 -21 -136 30 -2 49 9 -22 -140 129 218 5
3507 5 -239 -337 -9 47 -37 201 -283 -30 -14 -40 243 -161 2 213 -167 -94 25 39 177 -84 -184 200 -47
3530 -47 225 302 -38 45 203 121 -2 121 70 233 -36 -22 -103 176 -89 -226 104 143 103 27 -58 -98 230 27
3554 27 72 159 -253 52 125 -149 177 -69 179 309 -71 8 -178 -304 6 43 186 128 -20 115 -57 -62 107
$$ packed form
3394c3m4j51J47J48j58j56K71m0k20L62k28K51J24j81J12j85J22j36j81J24J78
3415A26j89L47j61k31K57j38k02K37j21L62k72n0P8l01N5J56j41K74k53n4L26
3436A05k41K30J29m19J34J04j2J63m40K61n7J32o3k19K28R4r7jP3N8m9k44P6J49
3460I4k21L90l53N2Q8j12Q9P3p5L6N4l63J28M9J0j3k05M32k00R8k52K12p4L27
3484B64j21k38J3Q0J18j35R5j71k6J51j96J17K8j15J66l2N1m0l1j18K69Q9k13
3507Ek44r8L28N6q4K38m84K53J6k6K83m04J63K11l80P3J19J4J38k61j00L84k47
3530d7K72P7l40Q3J58q2j23J23n1J63k69J4q1K79k65j37L30L9m0p6q5m0L28k03
3554B7M5Q7m12L05P3k74L26k46K48J30l80P9j86j26L10L7J43n8j48J35j72nJ69
$$ plain form
3577 107 -84 -231 -102 -216 129 11 -18 408 23 -20 -49 -4 -136 9 90 182 -114 250 -146 44 174 116
3599 116 28 221 -135 -25 138 37 -12 -22 -34 13 9 48 -61 27 -33 9 -219 -27 -277 -111 83 -27 197 -138
3623 -138 -159 -102 -109 127 6 -106 -260 53 -159 170 -56 -129 -14 91 -187 17 -139 162 -161 -175 58 160
3645 160 295 -163 -60 -74 -46 307 25 -136 41 -149 45 23 178 33 163 131 230 -112 -15 126 138 0
3667 0 42 -66 129 -165 -6 200 246 105 338 -224 -89 96 112 130 -81 115 -102 -24 -18 -279 215 187 -196
3690 -196 -153 79 -113 106 102 -57 0 -88 -22 264 -155 -105 33 22 138 -108 25 80 -46 449 243 -23 159
3713 159 -35 -209 29 -199 -160 -123 315 -5 -90 -172 99 -191 317 -170 86 237 -84 249 82 -20 -160
3734 -160 -120 -186 246 93 -120 316 -37 132 -240 -63 -132 -256 -285 38 -22 86 -21 6 -55 -164 96 63 93
$$ packed form
3577A07j91j47J29j14L45j18k9M26l85m3k9M5j32J45Q1R2k96L64l96J90J30n8
3599A16q8J93l56J10J63j01m9j0j2M7mL9j09Q8o0M2k28J92k50J66J94j10K24l35
3623a38k1N7pK36j21j12j54L13k12L29k26p3J15J05k78K04j56L01l23j4K33J02
3645A60J35m58J03j4K8L53k82j61J77j90J94k2J55j45J30l2R9l42R7J41J2j38
3667@M2j08J95k94J59K06M6j41K33n62J35J85J6J8k11J96k17P8Ok61M94k8l83
3690a96M3K32j92K19mj59N7q8O6K86m19N0J38j1J16k46J33N5j26M95k06k66J82
3713A59j94j74K38k28L9L7M38l20q5q2K71k90N08m87K56J51l21L33j67j02j40
3734a60M0o6M32j53k13M36l53J69l72J77o9j24k9L23o0J08j07K7o1j09K60l3L0
$$ plain form
3757 93 186 -29 -57 128 -63 184 -40 -41 494 -62 -196 104 -243 -3 212 107 133 -147 158 19 -241 -115
3779 -115 45 -7 222 31 -100 178 -116 9 -50 -95 209 46 34 -11 51 -79 61 -134 82 55 -166 133
3801 133 -279 177 -59 86 21 -254 -137 -116 18 -125 204 -197 47 -70 175 168 -127 85 -74 -98 99 -156
3823 -156 -51 -34 -102 -54 227 -293 -3 383 -36 105 -183 -76 -11 -130 -31 10 151 -6 -76 44 -25 -8 -94
3846 -94 34 -114 164 46 -52 77 101 259 -67 -37 3 -21 18 -182 -225 -31 20 7 21 131 -68 107 -107 88
3870 88 -393 119 -133 -91 81 70 176 123 40 -294 -49 -280 -117 -27 -114 4 -116 -4 142 -21 22 -33 16
3893 16 -71 -122 6 -181 -208 35 8 -101 82 0 -280 174 -164 208 139 -26 59 -94 -124 51 71 24 -1 -30
3917 -30 -46 33 -1 101 -268 11 297 30 242 -27 51 3 0 -34 -91 18 33 -89 -45 81 -58 205 -90 -133
$$ packed form
3757I3R3k15k8J85j91K47k24jN35n56j34L00l47K40K15j05K6k80L05j39k60J26
3779a15J60n2K29j91j31K78k94J25n9m5L04j63j2m5O2j30J40j95K16k7k21K99
3801A33m12M56k36J45o5k75J17K1J34j43L29m01K44j17K45pk95K12j59k4J97k55
3823a56J05J7o8M8K81n20K90L86m19J41k88J07O5j19R9M1J41j57p0J20o9J7q6
3846i4J28j48K78j18r8J29K4J58l26L0M0k4L9k00m3J94N1j3J4J10j99J75k14J95
3870H8m81N12k52M2J72j1J06n3q3l34K45k31J63R0q7J18j20J12J46j63M3n5M9
3893A6q7n1J28j87k7K43k7j09J83q2k80M54l38L72o9j65Q5j53l0J75K0m7k5k9
3917c0j6P9l4J02l69K79K86k67K12k69P8m8ll4n7J09J5j22M4J26j39K63k95m3
$$ plain form
3941 -133 41 -77 191 20 -243 210 -79 138 167 -105 33 5 -54 -127 -56 -465 -64 -210 126 -51 -155 8
3963 8 -121 -139 293 -188 -1 171 181 181 70 40 191 -150 -159 -163 -105 2 84 -149 32 86 -241 133 51 -163 50
3988 50 37 -69 -102 89 212 -148 70 -189 -166 129 -198 40 229 -47 350 134 1 218 9 83 58 60 124
4011 124 62 -241 26 173 35 121 -174 -239 70 -228 -13 86 -105 -190 -23 -89 -25 -141 -40 -72 -13 8 -16 98
4035 98 -333 -177 147 -61 -107 -73 42 78 11 -94 -25 -72 -96 -270 123 -182 -106 64 124 -150 68 55 34 -148
4059 -148 36 -61 -113 89 34 -147 -250 -21 -291 86 -72 -85 -247 60 -46 -96 -157 48 108 43 -66 64 182
4082 182 -117 24 230 85 -359 150 10 -57 -88 20 157 -53 182 -4 -95 -72 -4 -120 -96 -174 13 172
4104 172 -116 -6 65 43 -145 151 -154 -98 -38 -99 -61 -176 -103 -52 147 -166 -47 -67 47 -118 -23 19 23 95 -212
$$ packed form
3941a33J74j18K68j71k63M53k89K17K9k72J38k8n9p3P1m09M01j46L36j77j04J63
3963Hj29j8M32m81J87J72J0%j11l0J51l41rmN8J07Q2k33J81N4l27L74q2k14K13
3988E0j3j06l3J91J23l60K18k59K3K95l27K38J89k76L97k16j33K17k09P4k5KO4
4011A24o2l03K67J47j38Q6k95o5L09k98K15R9j91q5J67o6O4j16J01l2N9K1k4J14
4035I8m31J56L24k08m6L4J15L6o7j05O9m7k4j74L93l05P6J70O0k74K18j3k1j82
4059a48J84r7n2K02n5j81j03K29k70L77j58j3j62L07j06n0o1K05O0o5j09J30J18
4082A82k99J41K06j45m44N09j40o7l1J08J37k10K35j86r1K3O8j16K4p8J87J59
4104A72k88J10P1k2j88K96l05N6O0o1L8j15P3N1J99l13J19k0J14j65R5M2MP2l07
$$ plain form
4129 -212 -165 254 -131 21 3 70 72 203 95 57 -324 46 -21 76 -209 143 -81 43 -71 -71 -22 -138 193 -100
4153 -100 -253 93 49 -71 168 -101 -55 -64 -30 -90 153 -195 101 -154 109 86 4 228 107 120 39 -75 -139 105
4177 105 246 -75 208 99 33 246 -93 -163 -120 -64 -91 61 211 56 45 -12 -58 99 126 -151 52 161 126
4200 126 169 -184 -84 5 -127 73 83 -28 28 -273 92 -24 -234 -97 29 -62 -94 -103 33 -135 140 170 -142
4223 -142 66 55 -65 145 80 -113 18 -100 -70 -15 -25 -117 265 78 -159 -80 -151 69 -276 -27 103 -225 -25
4246 -25 201 -8 48 235 104 156 228 106 -137 84 -125 -113 -49 46 61 2 -198 -39 147 78 40 -24 -192 187
4270 187 -49 64 -108 -142 34 -165 -47 42 52 -94 47 -249 101 -59 149 142 92 -155 -33 9 144 -254
4292 -254 -44 84 -37 146 67 -38 -63 66 -240 17 66 13 -4 169 -61 53 -159 104 95 128 49 35 -47 -184
$$ packed form
4129b12M7M19l85J52j8O7KJ31j08l8l81L70o7R7k85L52k24J24j14%M9j16L31k93
4153a00j53L46m4j20K39k69M6rL4o0K43l48K96k55K63k3q2K24j21J3q1j14o4K44
4177A05J41l21K83j09o6K13l39p0M3N6k7J52J50j55j1n7m6J57K7k77K03J09l5
4200A26M3l53J00Q9j32K00J0j11N6l01L65j16k10J37J26r1l2rJ36j68K75L0l12
4223a42K08j1j20K10o5j93J31j18L0N5j0r2L82j87k37P9p1K20l45K49J30l28K00
4246b5K26k09N6J87j31N2P2j22k43K21k09J2O4R5J5n9k00J59J86o9l8o4j68L79
4270A87k36J13j72l4J76j99J18Q9J0j46J41k96L50j60K08pn0k47J22M2J35l98
4292b54K10J28j21J83p9j05k5J29l06K57M9n3j7J73k30J14k12K63rL3p9j4q2j37
$$ plain form
4316 -184 51 -5 -26 38 34 -122 157 130 -28 -112 -21 57 -12 -255 -15 -98 125 -111 -60 -183 -277 83 165 -150 -65
4341 -65 219 185 -86 -162 23 -63 -105 -2 318 -31 30 238 35 -309 -8 273 -250 125 -38 278 -89 -98 -66
4364 -66 -233 92 -407 20 170 17 142 -56 -23 123 -68 -273 -24 -111 197 -154 -158 -157 -90 80 149 95 -100
4387 -100 16 -119 -287 -98 -21 132 275 -136 -18 162 127 -188 280 40 24 222 -172 -188 58 80 6 -314
4409 -314 18 -26 124 -105 60 -140 103 -140 93 18 131 66 73 -7 -66 -90 130 -215 -16 1 29 -122 -229
4432 -229 350 -12 37 -7 215 -114 -25 -170 -89 40 162 209 -174 102 51 62 117 216 69 -47 68 2 -164
4455 -164 54 -225 -39 -60 121 -113 -89 -32 140 31 -106 -1 42 -71 -49 276 -2 -35 130 40 -102 153
4477 153 -15 92 0 -26 -107 -243 49 -83 272 76 11 -63 -163 -10 32 53 -15 -16 -214 -146 -107 -129 -139 177 116
$$ packed form
4316a84K35n6k1O4mj56K79k7j58q4R1P8o9k43K40q3K23k36N1j23r4L60Q2l15Q5
4341f5K84l4k71p6J85q6m2J03L20l49O1K08k03l44L01K81n23L75j63L16l67rL2
4364f6j67L25m99M27J50j53J25j98L3J46j91k05K49q7L08l51mJO7J70O9n4j95
4387a00J16j35j68J89P7J53J43m11J18J80l5l15M68k40j6J98l94j6K46K2p4l20
4409c14L32m4J50k29J65k00K43k43K33p5J13o5Pq0n9k4K20l45J99J7K8j51j07
4432b29N79l62M9m4K22l29Q9j45Q1J29J22M7l83K76n1J1N5R9j47j16J15o6j66
4455a64K18k79J86k1J81k34K4N7J72j09j37J05M3j13K2L25k78l3J65r0j42K55
4477A53j68J07r2k6q1j36K92j32L55j96o5p4j00J53M2K1o8jj98O8L9k2j0L16o1
$$ plain form
4502 116 -58 152 -104 -305 -133 32 6 19 -72 86 -32 103 -105 -54 220 -29 -113 85 20 -232 -177 165
4524 165 12 -71 -149 133 -188 -65 -195 7 127 -298 115 -14 -12 135 -71 21 168 -137 -70 54 36 -127
4546 -127 69 -199 -23 159 22 224 -24 -220 -149 92 180 -28 109 217 84 -70 -29 110 90 82 74 -12 49
4569 49 -96 -126 -91 -53 -45 13 71 -121 98 -40 255 48 -37 5 -94 27 458 53 -144 69 168 -140 23 6
4593 6 -122 -198 -19 -198 -13 -124 102 20 34 148 41 -31 -338 38 25 58 200 -46 153 38 -103 -45 -155
4616 -155 99 -42 55 -21 4 3 45 -143 0 124 53 -7 148 -165 -45 -117 57 -128 -14 -52 -116 66 -2 3 198
4641 198 -78 23 54 -142 104 -114 -141 -145 -112 -9 21 -148 70 46 -75 54 25 -29 69 -230 177 -49 149
4664 149 -120 -167 -93 -162 -20 -75 95 180 79 269 -87 -104 75 -31 -116 52 -168 -21 58 -214 -99 -115 -11
$$ packed form
4502A16j74K10k56k01J72J65k6J3r1J58j18J35k08N1K74k49q4J98o5k52N5L42
4524A65j53q3p8K82l21J23j30K02J20m25M13j29KJ47k06R2J47l05O7J24j8j63
4546a27J96k68J76J82j37K02k48j96P1K41Q8k08J37J08j33j54M1J39k0qqq6O1
4569D9j45l0L5L8QN8N8j92K19j38K95k07q5M2r9J21M31m05j97K13R9l08J63j7
4593Fj28p6J79j79J85j11K26q2J4J14j07p2l07L76j3L3J42k46J99j15j41N8j10
4616a55K54j41R7p6K5jM2j88J43J24p1o0J55l13J20p2J74j85J14l8o4J82o8NJ95
4641A98k76J01L1j96K46k18k7mL3J03L0j69K18k4j21J29k9n4R8k99M07k26J98
4664A49k69m7P4o9J42n5J70Q5j01J90l56j7J79j06q5J68k20J47P9k72J15j6J04
$$ plain form
4687 -11 85 -40 -120 -267 4 -110 -133 29 162 137 -64 137 -186 164 159 168 72 -88 -383 -130 289 -167 -31
4710 -31 -41 114 -60 -231 -55 207 -244 -58 92 -130 -94 147 102 -180 188 -68 -127 265 -20 -168 -84 100
4732 100 300 76 13 -82 9 -6 -113 -132 49 110 43 -28 207 -81 -45 23 -341 -74 -221 -29 -73 228 -146 87
4756 87 -75 -81 -125 -15 42 58 -150 -150 5 52 406 -97 -152 -47 -82 -46 142 161 119 242 70 69 242 -97 80
4781 80 169 -216 161 39 -186 -38 -101 -153 -7 -89 -139 30 -17 2 -82 -28 104 -290 85 187 323 -218 31
4804 31 -77 -162 120 -14 168 65 136 181 -149 27 -45 77 -40 -191 283 -302 -158 -178 35 -184 -70 32
4826 32 58 -27 -46 -11 255 57 67 182 36 126 -47 15 54 -148 -211 -206 -99 -26 -115 -30 -162 -188 -59 -30 68 347
4852 347 241 -53 46 190 21 171 134 -93 105 56 51 -61 30 -140 103 37 99 -49 -147 151 -63 146 -138
$$ packed form
4687a1R6j25q0j47K71j14k3J62J33k5k01K01l23L50nRr6j60k95K53M19m56J36
4710c1j0J55j74j71J76K62m51J86J50k22L6K41m5k82L68k56n9L92k85j48Q4J84
4732A00K00k24o3r5R1j5j07j9J81O1o7p1K35k88L6O8l64K67j47J92m4L01l74K33
4756H7j62om4J10N7J6k08%J55M7L54n03n5J05l5L6J88J9m2J23j72jJ73l39J77
4781H0Q9l85L77j22k25J48o3n2J46q2n0J69m7J9q4N4J32l94L75J02J36n41K49
4804C1j08q5K82j34J82j03P1M5l30J76p2J22j17j51M74n85J44k0K13k19J14J02
4826C2K6q5j9L5K66j98J0J15j46R0j73O2L9k02o3NJ07P3q9Q5j32k6J29K9R8K79
4852C47j06k94R9J44j69J50l7k27J98m9nj12R1j70K43o6O2j48r8K98k14K09k84
$$ plain form
4875 -138 -173 360 -177 42 -38 -59 126 91 -259 -77 -37 126 -5 -128 -335 22 -180 1 70 66 -81 50 124
4898 124 310 30 -183 208 130 107 -117 169 -19 77 148 78 -215 -18 -248 -125 -122 202 -51 130 -173 -80 -156
4921 -156 -158 -87 -144 -12 -60 249 187 267 -14 -168 104 183 -127 -117 156 -1 -76 -123 27 -84 28 59 -50 239
4945 239 17 -117 42 178 -109 -72 80 -166 -209 281 -60 69 -15 -119 195 -82 84 15 114 149 -95 1
4967 1 -2 -47 143 -204 -183 129 -9 -260 148 132 -76 82 15 44 34 69 -100 -145 -115 -18 27 74 147 83 -112 -210
4993 -210 202 111 77 156 31 -25 -5 -77 -172 44 26 -9 -145 -128 57 185 155 -103 -61 -69 234 81 100 42 289
5018 289 -76 145 41 174 -102 -28 -58 150 7 -225 -20 -60 -128 69 -134 152 -102 -157 -346 92 157 298
5040 298 40 -47 -44 -60 232 -111 38 313 -20 77 -50 -43 32 -130 83 324 82 -79 51 -64 263 -121 -163
$$ packed form
4875a38l5N33n37K19q0k1J85l5l50J82M0J63j31j23k07L57k02J81O9mj47J31P4
4898A24J86k80k13L91p8k3k24K86j88R6P1p0k93J97k30J23LL24k53J81l03R3p6
4921a56kP1n7J32m8L09o2Q0k81j54K72P9l10J0K73j57p5m7J50j11J12L1j09K89
4945B39k22j34J59J36k87L7J52k46m3M90l41J29q4j04L14k77J66o9R9L5k44R6
4967Alm5J90l47K1L12j38k51M08j6k08J58o7K9j0L5j69m5L0R7M5M7P3o4j95r8
4993b10M12r1l4P9j25n6K0p2r5K16j8l5j36J7J85J28l0k58M2qL03j53J9n8K47
5018B89l65K21j04J33k76P4l0K08j43k32K05m0o8J97k03K86k54n5j89M38O5J41
5040B98k58q7Lj6K92l43J49K75l33R7j27PP5j62K13K41k42j61J30j15L27l84m2
$$ plain form
5063 -163 -6 -56 -106 24 -148 14 83 -234 279 190 235 62 -70 -257 105 -41 99 -5 -21 159 197 248 -304
5086 -304 -93 -72 35 113 101 -103 47 103 171 -130 -127 31 -14 194 -57 -212 366 -136 -116 -90 76 85 -95 279
5110 279 -47 95 31 -34 0 45 32 10 -142 -54 -163 169 71 -98 -13 213 -141 -113 -33 161 156 -11 -110 -38 -153
5135 -153 228 120 142 66 -128 33 -272 -49 69 -20 -7 102 -252 -57 144 -137 32 -79 156 -26 174
5156 174 63 20 -35 -221 24 55 44 -30 -118 202 -148 -235 8 88 33 40 119 -126 -184 -40 193 -24 -71 79 -251
5181 -251 -50 -72 -108 36 -37 -32 42 33 90 86 77 -115 -62 -11 172 26 65 -153 -15 -129 -8 112 -203 -6 -21 -86
5207 -86 -33 53 263 124 -78 -127 -99 135 -41 -130 159 -112 192 -216 -43 -268 -120 -51 125 191 124 -30 -131
5230 -131 199 -8 17 -47 182 69 -2 191 105 -45 -315 111 54 64 76 88 -17 86 -255 95 -59 117 264
$$ packed form
5063a63J57n0n0J30j72J62O9l17N13q9M5j73j32j87L62j46J40j04j6J80L8N1n52
5086c04K11K1J07P8j2k04J50N6O8l01LJ58m5K08k51j55N78n02K0K6J66Rj80L74
5110B79l26J42o4o5L4M5j3k2j52Q8j09L32r8j69Q5K26l54K8Q0J94nj67r9P2j15
5135a53L81j08K2p6j94J61l05K23J18q9J3J09l54J95K01k81J69j11K35j82K00
5156A74j11m3n5j86K45L1j1p4q8L20l50q7K43Q0n5PP9k45n8J44K33k17m7J50l30
5181b51K01k2l6J44p3NP4rN7mrj92N3N1J83j46L9k18J38j14J21J20l15J97j5o5
5207h6N3Q6K10j39k02m9K8K34j76q9K89k71L04m08J73k25J48O9J76O6o7j54j01
5230a31L30k07K5o4K29j13p1J93q6j50k70M26n7J0J2J2j05J03l41L50j54J76J47
$$ plain form
5253 264 -178 -13 -125 132 -80 115 96 -123 -212 -194 97 1 184 73 132 160 145 -19 198 -120 -109 302 -207
5276 -207 30 92 19 -87 162 54 -113 113 -55 68 -142 49 136 1 -155 48 230 -197 122 77 -173
5297 -173 170 -34 57 195 227 -62 41 -26 69 80 341 -49 53 173 -71 494 7 324 225 -70 -131 -70 61
5320 61 101 215 56 -30 -26 135 86 -48 -35 -163 12 -146 68 -102 -101 7 191 127 58 -135 181 84 -231 81
5344 81 -153 -53 -42 -75 -252 72 100 7 -103 -106 -30 -191 58 16 342 65 121 -90 -32 -41 91 -235 -105 -89 95
5369 95 311 238 332 249 20 -38 -145 119 -5 -296 -139 -136 92 -132 123 -236 -40 62 11 246 -37 34 14
5392 14 -56 220 19 -78 262 -70 -187 -66 336 61 -235 -76 215 -6 91 -28 71 260 -312 -37 -73 81
5414 81 127 -305 90 -12 -109 -24 -29 76 3 171 349 224 -112 -20 136 -29 -117 7 -100 -165 -131 -218 31 225
$$ packed form
5253B64m42J65j12K57k12J95j9k19q9J8K91r6J83j11N9K8j5j64K17l18J1M11n09
5276b07K37O2p3j06K49j08j67K26j68J23k10J91Q7j35j56K03J82m27L19m5k50
5297a73L43k04R1J38L2k89J03o7R5J1K61l90J02J20k44N65m87L17r9k95o1O1J31
5320F1M0J14j59q6MJ61m9j34J3j28J75j58K14j70JJ08J84o4o9j93L16r7l15L12
5344H1k34J00J1l3j77L24K8r3j10lP6j61K49m2L26k77N6k11N8rJ32l26J30J6J84
5369I5K16p3R4q3k29n8j07K64j24k91J57LK28k24K55l59J96J02n1K35k83P1k0
5392A4p0K76k01r7L40l32j17J21M02k75k96J59K91k21R7j19R9J89n72K75l6J54
5414H1M6m32L95j02r7Q5nJ05p3J68J78j25l36R2J56j65q8J24j07o5L4q7K49J94
$$ plain form
5438 225 -176 -19 112 -154 155 100 0 72 217 20 -162 90 -12 176 -110 -105 -62 -130 123 -83 10 -72 47
5461 47 -169 -46 141 192 -237 -34 -141 47 -81 -73 282 -198 -17 119 -263 211 -23 -42 172 57 -167 49
5483 49 -9 -68 -38 -3 -67 -211 121 -13 -224 291 -14 -363 -115 -63 38 -37 97 220 -147 -4 231 -33 -59
5506 -59 99 42 -169 -100 -90 23 60 205 229 57 -23 -133 -202 -7 -79 124 103 35 20 -164 5 -34 -117 -60 -1
5531 -1 -295 65 -222 -163 -221 -202 299 -39 4 53 -88 88 122 47 8 -30 34 191 22 -46 -200 241 28 163
5555 163 89 -90 -8 -86 -167 133 358 -66 37 135 73 -72 113 309 -10 -172 -92 -124 -159 -283 -138 139 64
5578 64 -83 248 -52 84 184 42 -143 29 -249 -88 114 150 -81 -139 -72 -110 -17 -47 98 -164 126 -222
5600 -222 179 -213 115 -2 121 6 18 97 -83 83 -335 -182 112 375 39 112 -54 -122 -221 -50 284 -48
$$ packed form
5438B25m01J57J31k66L09n5j00P2J45j97j82K52j02J88k86NM3o8K53k06R3q2J19
5461D7k16J23J87N1m29K03j07J88j28QL55m80J81J36l82M74k34j9K14j15k24K16
5483D9n8n9L0L5o4j44L32j34k11N15l05l49K48N2J01p5J34J23l67J43K35k64k6
5506e9J58n7k11O9J0J13L7J45K4j72q0j10o9J95p2K03k1o8j5j84J69l9q3N7N9
5531ak94L60k87N9n8J9N01l38M3M9j41J76L4p5l9l8O4J57j69o8j54M41k13J35
5555A63p4j79Q2p8q1L00K25m24J03R8o2j45J85J96l19j62Q0l2l5j24J45K77p5
5578F4j47L31l00J36J00j42j85J72k78J61K02L6k31n8O7l8R3l0J45k62K90l48
5600b22M01l92L28j17J23j15J2P9j80J66m18J53K94K63l36P3j66o8r9J71L34l32
$$ plain form
5622 -48 246 60 0 -192 -101 -64 -189 212 171 -112 -78 -72 123 -181 -149 -69 -389 -216 309 52 -203 87 62 -167
5646 -167 -100 -14 39 18 36 -45 179 -41 -64 -12 -30 -103 -132 -14 -64 45 -35 -195 -35 -194 161 -24 26 -30 -49
5671 -49 -31 131 -32 -107 92 -51 -85 7 116 -27 75 -100 72 -35 -61 139 24 349 -221 -21 -139 -195
5693 -195 -116 223 109 -30 -154 -177 49 89 177 96 58 187 -36 198 -181 -116 -13 151 158 -28 -3 -6 39 102 83
5718 83 338 163 37 -8 -113 14 -17 204 18 43 75 114 115 182 55 23 -10 32 355 68 204 246 -188 -28
5742 -28 188 -43 124 258 106 -155 -47 -413 9 -112 98 -36 123 -120 -43 183 -83 54 242 57 35
5763 35 -69 -131 -56 -162 -144 -110 64 -148 103 -106 168 180 141 17 -46 -38 129 -160 -5 -50 148 -9 235 -49
5787 -49 -217 154 -110 186 -30 2 -65 -205 281 -202 -269 21 -10 76 30 -105 -40 -113 131 107 73 -52 -57 -58 -20
$$ packed form
5622d8K94j86o0j92R1L7j25M01m1k83L4OJ95l04L2Q0l20J73N25k57k55K90k5k29
5646a67O7Q6N3k1J8q1K24k20k3N2j8p3k9J18n0J09q0j60J60j59L55j85N0n6j9
5671d9J8J62j63p5J99j43l4R2J09j43J02j75J72j07k6K00j15L25n70K00j18n6
5693a95P9L39j14j39j24k3K26M0Q8q1l8J29k23K34l79O5J03J64Pj86K5lM5O3j9
5718H3K55j75j26m5j05J27l1K21j86K5L2L9JO7j27l2l3M2L23k87J36M2m34J60
5742b8K16k31J67J34j52k61J08l66M22j21K10j34J59k43P7K26k66J37J88j85k2
5763C5j04o2P5j06J8L4J74k12K51k09K74J2l9j24o3QJ67k89J55m5J98j57K44k84
5787d9j68L71k64K96k16L2o7j40M86m83o7K90l1Q6m6j35O5p3K44k4l4j25njL8
$$ plain form
5812 -20 211 -210 95 97 -275 -17 -239 -299 -4 -213 -8 190 -152 149 -9 -138 -129 83 122 102 71 32 149
5835 149 182 31 -72 -63 178 -97 173 -25 -8 57 -21 232 167 221 -31 -91 -132 99 -266 149 115 33 242 -155
5859 -155 -170 14 49 128 6 -52 51 166 156 33 -189 -198 222 28 34 58 115 214 -121 190 -29 87 -46 -200
5883 -200 2 60 -113 84 -46 42 169 0 18 37 54 -148 -13 19 108 60 32 -30 -110 207 -24 -66 187 34
5907 34 -24 -238 129 137 -57 62 -47 5 -63 -123 0 0 -7 -59 -133 41 130 330 131 134 -52 -55 122 155 243 11 -75
5934 -75 48 -57 43 -123 -322 -149 -199 99 67 45 -68 -195 -34 192 68 196 -200 -235 114 127 -165 134
5956 134 -25 227 -157 -21 93 -51 33 -119 -27 -179 9 160 -26 1 -95 19 50 -56 -150 -197 -226 108 -202
5979 -202 67 80 -157 435 55 48 -48 -86 64 130 -110 83 -319 28 193 114 -243 176 209 43 -87 -58 48
$$ packed form
5812b0K31m21L05Kl72K58k22o0K95k09K05J98l42L01j58j29RK12L9k0l1l9J17
5835A49L3j51j03RK41k75K70j98J7O5p8K53o5N4k52o0m1K31l65M15l4q2K09l97
5859a55j5J84L5P9j22n8J03J15j0j23k22rM20j94OK4N7R9l35L11k19J16j33j54
5883b00K02N8j73J97j30Q8J27j69J8J9J7k02J35L2Q9m8k8o2q0L17k31m2K53j53
5907C4n8k14L67Qj94J19j09N2o8o0J23%pn2p4J74Q9K00j99Lj86lJ77L3Q8k32q6
5934g5J23j05J00j66j99J73n0K98l2k2j13j27J61K26j24J28l96l5L49J3k92K99
5956A34j59K52l84J36J14j44Q4j52R2j52J88J51j86K7r6J14L1j06r4m7k9L34l10
5979b02K69J3k37N92l80pr6l8J50O6k40J93m02L47J65p9l57M19L3j66j30K9J06
$$ plain form
6002 48 -117 71 88 112 282 -133 -111 -57 -88 -91 147 -12 0 61 53 146 -9 24 -41 32 -217 115 64 32 -132 -34
6028 -34 -27 -151 81 -19 -57 66 -7 98 64 -79 31 122 -32 -78 98 -134 -209 148 -79 34 -32 217 -115
6051 -115 -146 133 -10 46 65 -474 -11 -61 136 42 -155 55 -91 95 351 -26 -4 31 10 -56 -215 7 133
6074 133 -180 22 4 -132 177 -175 22 -182 -27 185 -55 71 187 138 119 -199 -137 -135 -43 -84 90 -38 -108
6097 -108 3 -105 117 248 28 -14 -61 -4 162 -42 30 -248 -230 88 220 148 -39 -50 87 63 55 -59 5 29
6121 29 -120 -79 74 107 -69 41 -11 -25 55 -4 -330 114 -136 22 251 -157 -125 81 -226 250 -296 56 159
6144 159 -108 -112 79 49 -185 -119 -34 142 69 17 -177 -32 -34 -23 -117 -221 78 -83 24 -99 54 -4 5 232 108
6169 108 -32 -120 -131 246 9 232 67 -204 -4 -112 -50 -63 148 127 -187 72 104 41 -62 -110 -56 91 4
$$ packed form
6002D8j65J88J7K4J70m15K2N4l1lK38j59J2O1qR3j55L3o5P3k49L32n1l2j64R8
6028c4Pj24K32j00l8J23p3J05l4j43J10R1j54m6J76k32p5L57k27J13o6K49l32
6051a15l1K79j43N6J9n39M63n0J97r4j97K10j46J86K56l77K2L5k1o6j59K22J26
6074A33l13K02j8j36L09l52J97k04J55K12k40J26J16m9j9l18O2KR2m1J74j28p0
6097a08J11j08K22J31k20m2m7N7J66k04P2k78J8L18J32p2j87j1J37k4qj14O4K4
6121B9j49M1J53L3j76J10n2j4Q0n9l26M44k50J58K29m08L2K06l07M76n46L52J03
6144A59k67mJ91l0k34O6Q5J76p3n2j94J45kJ1r4j04K99j61J07j23J53n8RK27j24
6169A08j40q8j1L77k37K23j65k71K00j08O2j3K11k1l14K59L2o3j03m8N4J47q7
$$ plain form
6192 4 -12 -51 204 251 0 163 -150 -94 122 277 103 -33 -263 -259 10 204 -187 240 -308 151 105 253 34
6215 34 17 44 54 -86 -148 42 9 -46 -5 73 -112 -258 -109 -34 -220 -121 77 -125 245 -19 -127 127 -140 10
6239 10 -338 -87 -109 -122 34 -295 4 -166 -100 311 110 -119 4 161 15 -25 -235 280 -61 78 193 -136
6261 -136 -102 99 -90 53 7 -12 -41 -53 83 -181 -59 -118 -129 97 -30 -217 215 8 32 197 340 -31 66
6284 66 32 67 -78 -200 61 325 -108 -90 -143 -176 -192 -120 -164 -9 -8 -105 -119 -286 -52 -44 11 144 62 18 -225 195
6310 195 36 -46 -20 246 132 -53 149 194 -104 -106 -148 0 -311 -206 -237 -107 -73 5 37 -87 130 -171 -77 306
6334 306 -102 -61 256 -243 36 36 -12 153 64 -121 103 -111 -145 -133 -39 269 84 83 -88 91 117 -236 159 24
6358 24 -209 72 -106 -117 57 1 292 262 -127 5 39 121 260 -49 -74 -23 97 -69 280 80 -93 174 -248
$$ packed form
6192Dj6l9K55M7k51J63l13N6K16J55j74j36k30MK69J94l91M27n48M59m6J48k19
6215C4j7K7J0j40o2J90l3n5M1P8j85j46J49P5j86R9J98k02L70k64j08K54k67J50
6239A0l48K51k2j3J56l29K99j70O6M11k01k29J23J57j46m0k10N15l41J39J15l29
6261a36L4K01j89J43m6j9k9j2J36k64J22n9j1K26j27j87M32k07K4J65J43l71R7
6284F6l4L5j45j22K61K64m33J8n3l3j6P2m4J55Jr7j4j67K34QN5J33q2m4k43M20
6310A95j59q2K6K66j14j85K02M5k98km2J48l11J05l1J30L4P8L2j24K17l01R4L83
6334C06m08M1L17m99K79%m8J65q9j85K24k14l4J2R4L08j85jj71J79K6l53L95j35
6358B4k33K81j78j1J74n6K91l0l89J32L4Q2J39l09k5N1J20j66L49k00j73K67m22
$$ plain form
6381 -248 -257 161 13 84 253 -158 -127 169 -111 -99 -165 23 -162 -132 98 314 233 23 -119 -56 58 -46 -82
6404 -82 22 -81 137 -253 -206 28 -41 -182 100 7 -63 -176 133 -129 -1 199 -94 38 -178 -129 -60 29 7
6427 7 89 136 112 -282 -209 369 126 -18 38 -210 251 22 155 77 -6 -119 -287 -160 38 -22 -220 151 14
6450 14 -8 -38 -58 217 221 41 -36 -56 -43 49 -66 -278 -1 87 159 340 -364 -30 104 -262 83 -93 75 138
6474 138 156 108 -165 28 -192 36 -87 57 -18 -80 253 -157 -68 77 -30 -79 -75 22 121 256 -22 -15 101 151
6498 151 -5 216 -171 -15 294 15 225 -46 126 236 -238 -142 -150 105 -73 -189 -46 -15 -10 -31 261 -56
6520 -56 128 -36 -44 -100 200 144 209 1 193 -374 -5 158 8 -100 -37 76 134 -141 126 32 -127 47 -137
6543 -137 137 -7 81 11 7 -161 88 -96 131 158 -308 -167 -83 21 -8 -140 -10 6 10 -66 45 85 62 198
$$ packed form
6381b48rM18j48P1J69m11L1K96k80J2o6J88j85L0K30K16q1k10j42O3J14j04l6
6404h2J04j03K18l90M7K34o9j41K82r3p0j13L09k62J28K00k93J32k16M9O9Q9k2
6427GQ2M7k4l94P3N78k43j44N6k48M61k29J33p8q3j13j68J27J98o0j98L71j37
6450A4k2l0k0K75Mj80p7k0J3R2j15k12K77Q8P2J81p04L34J34l66L45j76J68O3
6474A38J8m8k73J93k20K28j23J44p5o2L33m10Q9J45j07m9MR7R9J35k78PJ16N0
6498A51j56K21l87J56L09k79K10k71J72J10m74R6qK55j78j16J43L1Nk1K92l17
6520e6J84j64qn6L00n6O5k08J92n67L69J63j50j08O3J13N8k75K67r4j59J74j84
6543a37K74j44Q8p0mj68K49j84K27K7m66J41Q4J04k9j32J30J6Mp6J11M0k3J36
$$ plain form
6567 198 -196 -58 -109 -153 67 29 1 -148 41 76 9 182 -35 41 122 -216 -194 125 -72 -1 -13 19 156 -68
6591 -68 -79 -198 62 81 126 18 17 51 -397 -77 205 -253 -24 -12 -110 101 -203 -1 57 -112 72 50 -103 -258
6615 -258 -56 -7 -34 -190 -193 -94 25 -132 230 70 63 -146 -103 -345 55 44 -36 -80 -251 70 -109 80 6 60
6639 60 -167 -8 73 106 288 210 -17 155 129 -28 -29 240 -344 -233 37 183 -330 -188 76 -178 155 -82
6661 -82 12 -263 10 215 -262 -67 -72 6 -34 138 -105 137 -55 -113 12 -16 49 -37 -89 -70 -17 123 127 -109 32
6686 32 155 -34 -50 165 248 64 -29 -148 -172 -159 161 41 9 27 -51 -39 -109 -172 -158 119 -126 -151 -239 -44 66
6711 66 6 -304 -104 -209 46 -73 143 20 23 -62 -46 209 -26 -106 -31 -129 -210 -37 -4 -64 61 4 108 78 110
6736 110 70 -11 203 -48 59 94 -124 -26 -134 147 269 101 40 126 201 106 130 21 -185 -261 -137 8 -44 81
$$ packed form
6567A98l94J38n1m4K20l8k8j49J89L5o7J73k17P6Q1l38K2L19j97P1j2L2J37k24
6591f8j1j19K60J9M5j08jL4m48L20K82m58K29J2r8K11l04K02N8j69J84k2j53j55
6615b58K02M9k7j56lR9J19j57L62j60pk09M3k42M00j1q0m4j71L21j79J89p4N4
6639F0k27J59Q1L3J82p8k27J72k6j57jK69n84J11K70J46n13J42K64k54L33k37
6661h2R4k75K73K05m77J95nP8m0J72k43K42j92n8J25k8O5q6n2J9N3J40Mk36J41
6686C2J23j89j6K15Q3j84r3j19k4J3L20j20l2J8p8J2p0o3J4K77k45k5q8J95J10
6711F6o0l10K00j05K55j19K16j23Lq5J6K55k35q0P5r8q1J73L3o0J25n7J04l0L2
6736A10m0q1K14k51J07L5k18R8j08K81J22j68o1Q6P5r5K4j09k06p6J24J45n2J25
$$ plain form
6760 81 -321 135 264 112 -255 173 90 -33 161 -38 -58 25 94 -301 24 150 222 276 114 209 80 -72 -163
6783 -163 250 133 50 -6 119 55 26 258 -37 -184 -229 41 -105 40 258 -26 33 150 303 -304 162 22
6805 22 -88 -6 -74 -51 13 65 -25 7 -23 129 72 207 37 47 -119 -270 -37 -57 -227 93 50 -88 125 -105
6829 -105 82 -136 118 39 -126 43 113 -306 12 -127 -101 163 -153 -169 -5 -108 60 7 81 -159 65 -74
6851 -74 -264 -65 210 -81 -134 -25 -12 -13 74 -391 76 123 -87 167 23 19 81 -167 -46 -27 121 45 23 -20 287
6876 287 12 -165 345 250 143 -120 -21 -112 -191 61 171 36 128 -289 242 -215 -319 -97 -135 54 51 204 -206
6899 -206 140 84 -81 35 42 180 -121 -196 -1 -190 45 110 -86 58 -67 180 -141 -149 -36 -127 38 260 68
6922 68 52 120 73 183 -15 28 -153 -78 -88 -78 110 -19 1 -234 43 1 -82 -55 112 -24 -273 35 -22 325
$$ packed form
6760H1m02M56J29j52l67M28q3j23J94j99k0Q3O9l95L25J26P2N4j62R5j29j52r1
6783a63M13j17q3n6J25o4k9K32k95j47m5K70j46J45K18k84N9J17J53o07M66j40
6805B2j10Q2o8K3O4N2r0L2l0J52n7J35j70J0j66j51K33k0j70L20m3j38K13k30
6829a05J87k18K54p9j65J69P0m19L18j39K6K64l16j6J64j03J68n3P4k40K24j39
6851g4j90J99K75k91n3J09J3jQ7m65M67M7k10K54j44mO2k48J21J9J48p6k2m3L07
6876B87k75j77N10r5j07k63R9r1p9K52J10j35R2m17N31m57j04K22l8J89lJ53m10
6899b06L46n6j65J16PJ38l01p5J95j89K35O5j96J44j25K47l21qJ13r1J65K22j92
6922F8j6O8m7J10j98M3j81P5j0J0J88j29K0k35K77m2q3K7J67j36k49L08n7L47
$$ plain form
6946 325 134 68 -366 18 -7 -127 -127 127 32 96 26 -136 -9 -45 -74 -215 -13 -236 215 -165 -138 -99 -39 -227
6970 -227 5 54 -227 -196 -151 -304 -15 -167 -2 80 -59 -10 -144 70 -130 75 -139 -203 -22 149 -89 -8
6992 -8 -39 1 -82 130 -57 2 40 -104 146 -136 41 -31 196 -226 -78 138 -146 43 -12 155 -180 320 -47
7015 -47 146 131 100 125 34 128 -87 62 216 78 -72 245 -15 50 167 34 103 32 179 101 113 -204 -9 -28
7039 -28 97 20 -13 -67 -82 -20 -213 -171 -171 287 112 379 -138 -56 -2 -108 -55 63 -138 -110 105 -127 -59 58 -8
7064 -8 188 -116 116 125 -171 -211 -208 233 -131 -185 160 -60 -196 63 -110 133 78 -219 61 97 57 102 43 -43 104
7089 104 -112 -34 338 -316 111 170 296 200 -91 143 135 168 258 -147 26 209 -9 133 14 -280 139 -248
7111 -248 -53 -221 -178 390 -177 102 -85 -52 231 7 -45 45 -136 -194 -95 44 -58 -16 -81 -211 99 -83 -40
$$ packed form
6946C25j91o6m34L84k5j20%K54r5O4p0j62J27l6k9j41K02k23M51l80K7L9O0j88
6970b27K32M9k81L1M5j53K89j52J65Q2j39M9j34K14k00K05k14o4J81J71k38Q1
6992hl1M0q3K12j87N9L8j44K50k82J77p2K27m22J48K16k84J89n5J67l35N00l67
7015d7J93j5l1K5r1R4k15J49J54j38j50L17k60O5J17j33O9p1J47p8J2l17J95j9
7039b8J25p7l3n4j5O2j93M2%M58j75K67n17Q2N4j06N3J18k01K8K15k32O8J17o6
7064hJ96l04K32Rk96m0LM41l64n4L45k20j36K59j73K43n5k97K80L6m0M5n9q6J47
7089A04k16P8L72o54M27N9J26r6k91K34qL3R0m05J73J83k18J42j19k94M19l87
7111b48J95j68M3N68n67K79j87L3K83k24n2R0j81n8R9J39j02M2o5j30L10j82M3
$$ plain form
7134 -40 46 -49 -2 2 -62 -91 -81 -41 -329 -68 77 -216 56 49 -16 4 -80 23 -129 -89 -82 -163 158 127 -215 -71 -121
7161 -121 -70 104 -116 254 -150 -186 60 -75 -175 -70 -69 -217 -89 71 -242 46 -30 118 11 99 -52 -136
7183 -136 -237 15 -185 191 154 -161 -112 143 -114 48 216 -316 -63 75 261 -14 -114 77 -164 -342 -296
7204 -296 -83 -64 265 92 124 39 -1 103 61 -188 187 -29 -33 -45 -111 -78 110 206 -85 119 -173 16 -85 112
7228 112 20 46 -179 -113 -143 -186 102 50 -120 -41 51 -31 -388 -161 -73 -159 119 -28 218 120 184 -107 39 69 74
7253 74 -1 124 27 7 -113 219 60 79 216 -30 52 13 -54 -8 -248 -246 142 53 -269 -224 -81 -190 137 59 231
7278 231 19 -3 65 -6 -5 59 -141 -83 40 213 -74 49 327 127 119 106 -102 352 -179 -76 -118 -145 47 91
7302 91 -67 -101 394 -182 78 182 -108 263 -185 -293 36 125 61 -225 -49 108 59 128 -165 -89 13 -77 -148
$$ packed form
7134d0Q6r5M7Mo4k9J0M0k88K61J45k93K72po5K0q4J03j52M0Pq1L21l1l42J44n0
7161a21N1J74k20L70m04l6K46j35j00J05Jj48J28J60l13K88p6J48j07Q8j51q4
7183a36j01K52k00L76l7l15M9K55k57J62J68n32K53J38J86k75j00J91k41j78M6
7204b96K13J9L29j73L2q5m0J04m2k49L75k16mj2o6L3J88R6k91K04k92J89j01J97
7228A12r2K6k25O6l0m3K88n2j70P9R2q2l57K27Q8q6K78j47K46r8O4k91J46L0N
7253G4p5J25r7k0j20L32j59J9J37k46Q2l9o7M6k40KL88q9l22M5J43j09L27p8J72
7278B31k12k2O8p1JO4k00N8J23J73k87J23K78k00qj3k08M54n31J03m2k7J92M4
7302I1j58l4M95n76K60J04k90L71m48j08L29Q9o4k86J76J57m9O9k93P6J02r0p1
$$ plain form
7325 -148 -27 -348 -110 264 -57 86 43 38 78 -60 -82 181 132 -51 84 -161 67 117 -155 218 -178 220
7347 220 -16 -184 173 94 131 200 135 -250 -252 28 211 104 -40 -42 98 -214 62 -173 5 -210 107 157 73
7370 73 108 -162 -194 317 77 -61 -293 -63 -7 -6 -16 -25 -49 -162 187 104 -91 93 143 181 -78 -43 -34 -173 219
7395 219 127 63 172 -172 286 209 107 297 -202 -92 -61 -108 -98 -232 -156 98 -157 12 -250 48 157 133 -99
7418 -99 212 182 23 39 -104 25 120 -196 249 -169 20 -50 -32 -36 -242 -111 145 -108 27 55 -48 119 -233
7441 -233 166 -48 -186 94 60 50 147 -61 -264 -147 -83 -116 180 -273 -86 -144 42 201 -70 -97 97 173 -69
7464 -69 198 -111 -72 5 -272 -80 32 -62 71 67 -217 53 82 -106 249 -70 72 30 79 154 -125 -129 13 -177
7488 -177 7 -218 -63 30 49 41 -157 -62 -18 -10 81 -273 230 33 -51 -113 29 91 -138 139 -82 154 70 195
$$ packed form
7325a48J21l21K38L74l21J43m3nM0j38k2K63m9j83J35k45K28N0k72L73l96L98
7347B20k36j68L57p9L7O9o5l85kK80J83j07j44kJ40l12K76k35J78k15L17N0q4
7370G3L5k70l2N11k40j38k32K30N6Jj0rk4j13L49q3j95J84N0L8k59L5Rj39L92
7395B19r2o4J09l44M58p7j02J90m99J10L1m7J0j34P6K54k55J69k62K98J09k4k32
7418i9L11l0j59J6j43J29R5l16M45m18J89p0J8mk06J31K56k53J35K8j03J67l52
7441b33L99k14j38K80l4j0R7k08k03J17O4l3K96m53J87n8J86J59k71k7J94P6k42
7464f9K67l09L9P7k77J92J12r4J33mk84K70K9j88L55l19J42m2M9P5k79mJ42j90
7488a77J84k25J55R3J9qj98R5M4QR1l54N03j97q4o2J42O2k29K77k21K36q4J25
$$ plain form
7512 195 -154 123 -23 -56 -169 162 -144 -126 -47 -160 -208 103 45 101 -168 59 39 -33 231 241 7 75 -366
7535 -366 66 233 -164 -125 11 231 -214 172 28 -45 -117 -22 23 -15 -263 -146 193 90 53 -38 -190 -133 -119
7558 -119 -95 89 124 29 -204 -138 -22 188 139 85 145 -149 -69 126 89 209 -48 13 -22 -234 118 -24 -57 -23
7582 -23 -114 198 -33 -95 -280 -224 -129 -107 -134 110 -120 -67 14 -96 48 -17 -134 -240 -29 259 105 -31 -72 150
7606 150 107 84 121 87 133 -29 -169 -8 -159 80 152 -43 8 25 57 160 -198 24 -119 -105 205 -61 22 -110
7630 -110 -184 -197 -12 -46 -39 94 -200 110 18 16 -74 78 -123 60 -62 82 -266 -97 -130 90 57 226 14 253
7654 253 -139 -88 -88 -19 274 340 -3 55 -104 140 303 4 -1 -60 120 188 -28 163 -149 23 -65 -16 170 -12
7678 -12 -50 -3 -96 16 131 291 -231 13 -59 3 264 -76 223 -247 50 72 -154 -35 -83 -194 202 -266 10
$$ packed form
7512A95l49K77j46l3j13L31l06J8P9j13m8L11n8N6k69K27k0p2K64J0k34O8m41
7535c66M32J67l97L9J36K20m45L86j44p3p2R5M5l8k48J17L39j03l7r1j52N7J4
7558a19K4J84L5r5k33O6J16K10m9n4O0k94Q0J95l7J20k57O1l5k12L52j42l3L4
7582b3r1L12k31o2j85N6R5K2k7K44k30N3Q1j10J44o5j17j06K11K88j54j36m1K22
7606A50m3k3L7l4M6j62j40J61j51K39P2j95N1J7L2J03l58K22j43J4L10k66Q3j32
7630a10p4j3J85l4PJ33k94L10r2kr0J52k01J83j22J44l48J69l3K20l3J69k12K39
7654B53l92N1%O9K93O6l43N8j59K44J63k99nn9J80O8k16J91l12J72q8M9J86j82
7678a2l8M7r3J12J15J60n22K44p2O2K61l40K99m70K97K2k26J19m8j11L96m68K76
$$ plain form
7701 10 50 -33 -90 26 -1 95 -257 -116 96 -12 -157 189 37 -312 -112 4 35 110 23 -249 -137 41 -169
7724 -169 204 79 -124 13 -229 -18 17 10 -32 0 245 -111 -122 133 41 -10 -164 -15 2 16 69 -108 14 173
7748 173 104 -66 214 106 -13 -88 28 -5 -62 -199 -86 -33 75 190 106 160 34 -46 -1 -121 -4 222 -116
7771 -116 49 -215 -92 -44 189 -11 -120 -31 155 396 23 164 206 -267 82 191 -19 32 -21 -149 259 -115
7793 -115 -99 -79 -126 28 167 -114 152 -100 44 -65 92 -277 -405 66 -23 101 -210 -112 39 191 -81 -105
7815 -105 -167 -106 -47 -127 -200 145 -39 58 -167 -88 77 -131 230 274 147 -65 81 101 106 68 236 -145 54 -72
7839 -72 30 62 -201 45 -213 150 -12 1 72 -71 60 -79 -72 21 50 31 139 249 307 -47 35 55 -40 115
7863 115 269 58 -40 -130 72 -51 -75 145 11 155 -52 -55 13 15 -150 41 -8 57 -135 -113 -2 37 90 95 -108
$$ packed form
7701A0M0q3n7J16k7R6l52J41K12j08j45L46j52l49K00J16L1P5q7k72J12J78k10
7724a69L73j25k03J37k42K11L5pm2L2K45l56j1K55r2n1j54J49J7J4N3j77J22J59
7748A73o9j70K80j08j19p5J16l3n7j37J13N3J08J15q4N4j26q0M5j20J17K26l38
7771a16J65k64J23M8K33k00j09Q9J86K41l73J41M2m73L49J09k10N1n3j28M08l74
7793a15J6K0m7J54J39k81K66k52J44j09J57l69j28M71q9J24l11R8J51J52k72k4
7815a05o2O1N9q0p3L45j84R7k25P9J65k08L61M4j27k12J46K0Nl8J68l81J99j26
7839g2J02L2k63K46k58L63j62J3P1j43J31j39PR3K9j9J08J10N8l54Q2K0r5J55
7863A15J54k11r8r0K02j23k4K20j34J44k07lO8Kj65J91m9O5j92K2J11L9N3Nk03
$$ plain form
7888 -108 34 141 -128 -61 -25 57 41 -73 35 -129 -131 -10 -16 -196 42 -188 -42 137 202 -273 342 -211 -95
7911 -95 -41 72 42 -36 -120 50 75 -343 61 19 -46 -96 -57 170 -50 -37 96 48 -186 50 177 204 -150 -99 5
7936 5 29 -6 271 77 -70 -99 -77 25 -62 275 161 -52 142 22 39 220 -43 -67 -34 -245 66 -3 -265 -59
7960 -59 -21 216 -226 -100 -115 -93 -187 -88 -120 9 87 -26 88 19 96 -27 136 -96 196 1 -5 64 262 -53
7984 -53 108 -25 56 -44 -211 -261 -214 -119 236 23 167 -41 -228 138 -168 259 22 149 166 -111 320 -8
8006 -8 -288 63 145 64 73 24 -98 250 -115 -226 -196 -48 0 31 -8 -185 -107 -207 157 14 110 -113 -116 4 -187
8031 -187 -52 -13 -90 -16 132 -39 11 13 187 -233 100 199 208 12 -266 53 167 113 2 -62 75 228 -235 -117
8055 -117 33 75 43 -77 60 -185 -24 -98 -216 -192 -17 -113 -239 212 -90 -146 16 -270 -87 -259 275 -25
$$ packed form
7888a08J42J07k69O7L6Q2j6j14J08j64kJ21oj80K38k30J46J79O5m75O15n53J16
7911i5N4J13l0p8q4J70K5m18M04m2o5n0L9K27k20J3J33m8k34K36J27K7l54N1J04
7936EK4l5K77j94j47k9K2J02q7L37j14k13J94j20J7J81k63k4L3k11L11o9k62K06
7960e9L8K37m42J26j5K2r4R9l2J29P8j13J14o9P7j23J63k32K92j95oO9J98l15
7984e3J61j33Q1j00j67n0M7R5L55k13J44k08j87L66l06M27k37J27J7k77M31l28
8006hk80L51Q2q1Rm9j22L48l65j11L0J48M8L1l9j77P8j00L64j43R6k23lJ20j91
8031a87J35L9p7P4J48j71N0KJ74m20L33R9Rj96k78L19J14n4j11o4J37J53m63J18
8055a17J50M2l2j20J37k45J61p4j18K4J75r6j26M51l02n6J62k86J83j72N34l00
$$ plain form
8077 -25 -12 -204 175 -221 -7 201 201 146 -81 -146 70 20 -192 -83 33 46 94 121 229 147 239 199 -69 -11 186
8102 186 -50 63 -124 22 -106 -385 -97 87 -146 -158 -71 -79 -186 -70 -96 148 -78 154 168 83 50 -78 310
8125 310 -35 -83 72 -133 84 -140 136 100 155 -20 5 166 128 -3 -22 42 134 -12 200 -43 -237 -40 -293
8148 -293 156 -212 140 -236 99 -192 -109 -217 169 -4 63 63 -104 -198 345 -37 50 233 -221 -67 341 -53
8170 -53 -51 -166 137 64 104 -97 28 -16 95 174 292 90 84 33 97 115 25 90 -78 -195 47
$$ packed form
8077b5J3j92L79l96K14K08%n5k27o5K16n0k12J09J16J3M8K7J08q2R2m0k68N8J97
8102A86k36J13j87J46j28k79K88J84k33j2Q7qj07J16k6K44k26K32J4q5l3j28L88
8125C10l45m8J55k05K17k24K76l6N5j75K5J61l8j31j9O4R2j46K12k43j94J97k53
8148b93M49l68L52l76L35k91Q3j08L86j73O7%j67r4N43l82Q7J83m54J54M08l94
8170e3Kj15L03p3M0k01J25m4J11P9J18k02on1O4J8r0O5j68j17K42
8191D7
$$ Imaginary data points
##PAGE= N=2
##DATA TABLE= (X++(I..I)), XYDATA
$$ plain form
0 0 0 0 0 0 0 0 0 0 0 0 0 0 0 0 0 8 -8 8 -8 8 -16 16 -16 24 -24 32 -33 40 -48 56 -64 72 -80 91 -104 118 -131
37 -131 147 -165 183 -206 228 -253 279 -311 343 -379 416 -460 507 -558 615 -677 748 -824 913
56 913 -1011 1127 -1256 1412 -1595 1818 -2098 2457 -2939 3622 -4676 6523 -10717 44187 -52402
71 -52402 -90466 74530 69897 -30364 -40877 36053 25126 -7860 2054 1978 -1591 22890 2805
84 2805 -14187 -4055 20446 16396 -28697 -13153 39384 -3564 -28394 9243 7633 -5973 -262
97 -262 -5408 -9661 1734 14183 -15139 -28324 17707 18207 -27304 -23976 12895 16850 -26046 -21798
111 -21798 22805 -7961 -29894 11848 1773 -19267 -1875 -4050 -12435 -5384 4959 -7770 -26042
124 -26042 4327 15099 -28288 -22278 22628 9370 -41135 -22271 40335 836 -53434 2846
$$ packed form
0@%%%%%%%%%%%%%%%Qj6J6j6J6k4L2l2M0m8N6o5P3q8J04j20J36j52J71j95K22k49
37a31K78l12L48l89M34m81N32n90O54p22P95q76R67j065J173j292J425j572J737
56I13j924K138k383K668l007L413l916M555n396O561q298J1199j7240N4904r6589
71e2402l8064J64996m633j00261j0513P6930j0927l2986R914p6l569K4481k0085
84B805j6992J0132K4501m050m5093J5544N2537m2948k4830L7637j610j3606N711
97b62n146m253J1395J2449k9322j3185M6031N00m5511L328L6871L955m2896M248
111b1798M4603l0766k1933M1742j0075k1040J7392k175q385P051J0343j2729j8272
124b6042L0369J0772m3387O010M4906j3258n0505J8864O2606l9499n4270N6280
$$ plain form
136 2846 28339 -17684 -24670 595 11698 -8665 -19018 5061 -1152 -11856 5510 -5507 -16542
149 -16542 3086 9176 -8656 -18770 3346 10410 -10670 -4184 -1602 -8488 8151 332 -15086
162 -15086 -1129 8450 4326 -16991 -13530 24973 7037 -28357 -1424 17275 -1956 -11564 2283
175 2283 7879 -8021 -881 9579 -8080 -2200 10377 -1452 -6596 -1155 11572 4223 -15576
188 -15576 4764 14010 -8392 1714 7007 -6157 1577 8956 2550 -8689 -340 16940 -2560
201 -2560 -13652 10746 13716 -4466 -10831 6252 16391 -5214 -5098 8975 -2223 3543 8658
214 8658 -5743 1264 7518 1641 -866 -1761 9008 6209 -7855 2307 7253 756 1882 1086 1436
229 1436 -737 3825 8431 -8203 -2043 15027 -3194 -6746 7342 5900 -1040 -7104 5106 12307
$$ packed form
136B846K5493m6023o986K5265J1103k0363j0353K4079o213j0704J7366j1017j1035
149a6542J9628O090j7832j0114K2116P064k1080O486K582o886J6639p819j5418
162a5086J3957R579m124k1317L461L8503j7936l5394K6933J8699j9231r608J3847
175B283N596j5900P140J0460j7659N880J2577j1829n144N441J2727p349j9799
188a5576K0340R246k2402J0106N293j3164P734P379o406j1239Q349J7280j9500
201b560j1092K4398K970j8182o365J7083J0139k1605J16J4073j1198N766N115
214H658j4401P007O254n877k507q95J0769k799j4064J0162M946o497J126p96L50
229A436k173M562M606j6634O160J7070j8221l552J4088j442o940o064J2210P201
$$ plain form
243 12307 -8161 -4738 9267 323 -2505 1349 2997 821 -4021 2494 1435 -606 6023 -4722
257 -4722 -5228 7714 1555 -2851 -2357 1173 6159 -7708 -4191 11410 -2164 -7239 2814 1361
271 1361 -98 -2236 1046 760 -5962 3442 3447 -7050 -521 2038 201 -1702 -4505 4790 448 -7433
287 -7433 3259 659 -2636 3461 -5215 -3327 4159 710 -1727 -5487 1260 5351 -7245 -2406 6538
302 6538 -1122 -5512 -3978 5558 3374 -8358 307 2980 -5209 2031 125 -2129 1843 -3261 -690
317 -690 759 -1827 2762 -2799 -3447 4091 -942 -1876 458 -708 184 -2903 1782 2969 -6737 797
333 797 4312 -3798 480 453 242 250 -4989 4078 3843 -6594 85 1503 -371 1785 -1951 464 392
350 392 -1821 2072 -1413 925 3181 -5619 -430 3606 174 909 -2801 842 3899 -4676 1592 4310
$$ packed form
243A2307k0468L423J4005q944k828L854J648k176m842O515j059k041O629j0745
257d722n06J2942o159m406M94L530M986j3867L517J5601j3574n075J0053j453
271A361j459k138L282k86o722R404Nj0497O529K559j837j903k803R295m342p881
287g433J0692k600l295O097q676J888P486l449k437l760O747M091j2596M839Q944
302F538p660m390J534R536k184j1732Q665K673q189P240j906k254L972n104K571
317f90J449k586M589n561o48P538n033r34K334j166Q92l087M685J187r706P534
333G97L515q110M278k7k11Qn239R067k35j0437O679J418j874K156l736K415p2
350C92k213L893l485K338K256q800N189M036l432P35l710L643L057q575O268K718
$$ plain form
366 4310 -3752 -159 590 672 1760 -2272 1448 876 -2248 3551 -344 -1818 1854 -1367 1811 632
382 632 -1660 2642 -2145 -362 4252 -2582 1087 1642 -3536 1488 1216 939 1109 -4168 1877 2755 -2551
399 -2551 1404 657 -253 -197 -2134 3501 1532 -3268 1770 -1447 275 3581 -2885 22 1035 -1655
415 -1655 2312 -887 -96 2629 -3141 772 2242 -1271 1406 -780 -162 1195 -1919 2704 278 -4017
431 -4017 1928 350 468 1032 -3789 1330 1412 -2205 2538 -1109 -707 2079 -3094 713 2691 -815
447 -815 -114 -2891 521 3536 -1989 -503 -455 -1124 2760 -1978 -795 2637 -1903 565 -662 -1903
463 -1903 4120 -1380 -2859 1319 -885 1868 -261 -3045 1703 -378 383 1366 -3298 803 1212 -1500
479 -1500 1353 -1148 640 1107 -4043 1640 2026 -1811 1331 -1963 -1173 2565 -816 1748 -894 -3579
$$ packed form
366D310q062L593P49Q2J088m032L720n72l124N799l895j474L672l221L178j179
382F32k292M302m787J783M614o834L669N55n178N024k72k77J70n277O045Q78n306
399b551L955p47r10N6j937N635j969m800N038l217J722L306o466K907J013k690
415a655L967l199P91K725n770L913J470l513K677k186O18J357l114M623k426m295
431d017N945j578J18N64m821N119Q2l617M743l647M02K786n173L807J978l506
447h15P01k777L412L015n525J486M8o69L884m738J183L432m540K468j227j241
463a903O023n500j479M178k204K753k129k784M748k081P61R83m664M101M09k712
479a500K853k501J788M67n150N683L86l837L142l294P90L738l381K564k642k685
$$ plain form
495 -3579 2402 732 -690 219 -1690 1931 -618 -2555 2767 104 -166 -110 -2949 2847 1787 -2877
511 -2877 426 -1047 1575 2541 -4301 -173 1806 120 691 -3004 701 4130 -2666 -2260 998 2760
527 2760 2175 -5441 -1307 5167 -30 -1257 -1906 -322 3464 -2356 -790 2493 -1318 858 -678 -2216
543 -2216 2963 1214 -646 -1449 -2305 3809 1183 -3421 736 133 777 225 -1999 2537 248 -2357
559 -2357 1615 -336 -133 1468 -1849 1433 -123 -728 2761 -1491 -1657 1193 -235 2190 -701 -2647
575 -2647 1719 -334 726 821 -2290 1293 271 -1273 1233 -1484 1702 1957 -4786 -426 3357 1561
591 1561 -840 -4409 2077 4737 -3340 -1861 2036 1401 53 -4034 1749 3884 -2372 -610 -349 -141
607 -141 3319 -1731 -1817 630 177 3054 -1731 -3112 3108 697 -1166 -245 -706 3012 -1288 -3330 2223
$$ packed form
495c579N981j670j422R09j909L621k549j937N322k663k70N6k839N796j060m664
511b877L303j473K622R66o842M128J979j686N71l695L705L429o796M06L258J762
527B760n85p616M134O474n197j227o49J584L786n820J566L283l811K176j536j538
543b216N179j749j860q03q56O114k626m604M157o03O44n52k224M536k289k605
559b357L972j951K03J601l317L282j556o05L489m252j66K850j428K425k891j946
575b647M366k053J060R5l111L583j022j544K506k717L186K55o743M360L783j796
591A561k401l569O486K660q077J479L897o35j348m087N783K135o256J762K61K08
607a41L460n050q6K447m53K877m785j381O220k411j863R21m61L718m300k042N553
$$ plain form
624 2223 1032 610 -784 -2789 2421 1200 -923 1172 -1838 54 1541 -1432 1640 -282 -956 2003
640 2003 -1517 -206 2186 -1021 410 -900 -1105 2378 -1228 -167 667 -2476 1325 1388 -1117 -427
656 -427 -1703 2106 1165 -3758 1220 1980 -1570 -571 -805 2226 1066 -3640 797 1260 -425 1290 -2138
673 -2138 -451 1267 -518 1333 -1094 -920 2253 -2098 -538 1566 -246 865 -1937 -1493 3526 -204
689 -204 -831 -248 -1122 2208 -544 -1702 2055 -670 -563 144 -1010 2172 -748 -1572 1964 -1081 332
706 332 901 -1369 646 -515 260 2060 -1750 -79 803 -1858 1653 270 -1326 519 -842 806
722 806 478 -1447 2085 -309 -2059 1317 -47 1154 -314 -2293 1773 283 -649 1249 -1748 488
738 488 1033 -1423 1040 113 -312 1039 -2103 724 1982 -1360 205 -829 96 2319 -1651 -480
$$ packed form
624B223j191m22j394k005N210j221k123K095l010J892J487k973L072j922o74K959
640B003l520J311K392l207J431j310k05L483l606J061Q34l143L801O3k505O90
656d27j276L809r41m923M978P60l550R99k34L031j160m706M437M63j685J715l428
673b138J687J718j785J851k427J74L173m351J560K104j812J111k802M44N019l730
689b04o27N83q74L330k752j158L757k725J07P07j154L182k920q24L536l045J413
706C32N69k270K015j161P75J800l810J671Q82k661L511j383j596J845j361J648
722H06l28j925L532k394j750L376j364J201j468j979M066j490r32J898k997K236
738D88N45k456K463r27m25J351l142K827J258l342J565j034R25K223l970J171
$$ plain form
754 -480 397 -856 1693 -1281 -451 1986 -1660 -660 1020 -241 1324 -1459 -1516 2139 -983 296
770 296 460 -1392 672 -384 -406 1471 -1185 73 184 -1669 2113 322 -1045 644 -1244 1022
786 1022 1031 -1085 1337 -904 -550 1812 -1028 158 407 -1279 1176 -342 3 1305 -1709 481 904
803 904 -1165 1068 -564 -758 1216 -1356 1141 973 -1731 884 -706 -132 1665 -1335 5 25 -1061
820 -1061 1630 -332 -338 1061 -2081 207 1214 -712 1027 -968 -957 1417 -1293 774 372 -1938 1033
837 1033 -315 -271 1167 -1641 427 492 -1189 1510 -418 -784 914 -1197 699 905 -1345 635 -930
854 -930 -14 1740 -1338 340 114 -1550 1079 -13 -132 757 -1695 398 971 -889 1305 -734 -1172
871 -1172 1233 -1195 872 431 -1541 886 -737 -2 1670 -1378 329 120 -1147 1668 -241 -388
$$ packed form
754d80Q77j253K549k974Q30K437l646J000J680j261J565k783n7L655l122J279
770B96J64j852K064j056k2J877k656J258J11j853L782j791j367J689j888K266
786A022Rk116K422k241L54K362k840J186K49j686K455j518L45J302l014K190M23
803I04k069K233j632j94J974k572K497j68k704K615j590N74J797l000J340K0j086
820a061K691j962oJ399l142K288J007j926J739j995J1K374k710K067m02k310K971
837A033j348M4J438k808K068O5j681K699j928l66J698k111J896K06k250J980j565
854i30R16J754l078J678k26j664K629j092j19Q89k452K093N73j860K194k039m38
871a172K405k428K067m41j972K427j623P35J672l048J707k09j267K815j909j47
$$ plain form
887 -388 1090 -1564 920 787 -975 1235 -670 -418 1169 -921 893 -41 -1627 1496 -394 -93
903 -93 804 -1714 607 565 -836 1531 -651 -612 1023 -1209 1047 874 -1459 634 -762 213 1470
920 1470 -1116 382 -235 -1442 1192 -15 -383 655 -1528 886 495 -1037 1221 -922 -601 1015
936 1015 -830 751 110 -1038 1297 -814 98 1619 -1454 293 106 -777 1821 -564 -974 131
952 131 -1031 1274 552 -1470 993 -1037 -357 1331 -1188 850 -19 -1336 1098 -360 226 907 -1556
969 -1556 297 379 -427 1229 -1199 -243 944 -1026 881 457 -1092 1076 -842 -24 1367 -1237 525
986 525 -337 -865 1949 -446 -603 551 -1286 1003 469 -1086 1094 -936 -117 951 -631 1007 -124
1003 -124 -1322 710 -246 371 1085 -1760 703 89 -931 1420 -887 -245 635 -1450 980 124 -1099
$$ packed form
887c88J478k654K484j33j762K210j905K52J587k090J814r34j586L123j890L01
903i3Q97k518K321m2j401K367k182L9J635k232K256j73k333K093j396R75J257
920A470k586J498o17j207K634j207l68J038k183K414l91j532K258k143L21J616
936A015j845J581o41j148K335k111R12J521l073J747j87q83K598k385m10J105
952A31j162K305p22k022K463k030O80J688k519K038q69j317K434j458N86O81k463
969a556J853Q2q06J656k428R56J187j970J907m24j549K168j918Q18J391k604J762
986E25q62n28K814k395j57J154j837K289n34j555K180k030Q19J068j582J638j131
1003a24j198K032r56O17P14k845K463o14j020K351k307O42Q80k085K430q56j223
$$ plain form
1020 -1099 1099 -761 -134 1018 -1097 761 -237 -842 1472 -306 41 550 -1464 879 768 -647
1036 -647 686 -956 -42 1146 -1278 885 386 -943 818 -820 586 1356 -1366 173 15 -85
1052 -85 1823 -958 -577 787 -1252 700 104 -419 1053 -1376 -453 1070 -653 775 -198 -1621 1093
1069 1093 -710 143 443 -1512 1045 239 -1181 1049 -462 243 210 -1231 1355 52 -1161 772
1085 772 -540 461 1336 -1275 306 -150 -723 1627 -512 -210 261 -1237 1062 261 -575 942 -1207
1102 -1207 -264 598 -923 831 -363 -931 1022 -860 473 1036 -1380 429 158 -194 1237 -844
1118 -844 112 829 -1576 461 548 -295 657 -1436 310 1280 -1132 660 -400 -566 1598 -473 -188
1135 -188 313 -1271 973 -202 -815 1500 -913 -736 487 -540 1393 -323 -1304 764 -681 590
$$ packed form
1020a099K198j860O27J152k115J858r98o05K314j778L47N09k014K343j11j415
1036f47J333j642R14J188k424K163m99j329J761j638J406P70k722J539j58j00
1052h5J908k781L81J364k039J952n96n23J472k429R23J523j723J428r73j423K714
1069A093j803Q53L00j955K557q06j420K230j511P05l3j441K586j303j213J933
1085G72j312J001Q75k611J581m56n73K350k139L02M71j498K299q01q36J517k149
1102a207R43Q62j521J754j194n68J953j882J333N63k416J809k71l52J431k081
1118h44R56P17k405K037Q7q43R52k093J746R70k412J792j060j66K164k071K85
1135a88N01j584K244j175o13K315k413J77J223j027J933j716r81K068j445J271
$$ plain form
1151 590 1004 -1353 604 -231 -700 1041 -513 399 395 -1448 1137 258 -462 828 -710 248 829 -478
1169 -478 1072 -359 -616 1113 -374 289 696 -1335 405 268 -331 1211 -1050 192 671 -1181 902
1186 902 156 -772 462 -887 534 850 -965 585 -169 -255 1331 -414 175 493 -976 833 -126
1203 -126 -143 1301 -1272 -211 723 -637 867 -712 -642 969 -789 382 366 -1186 613 -141 -302
1220 -302 1093 -773 290 229 -1155 1417 -105 -795 591 -1007 293 843 -754 698 -583 -431
1236 -431 1168 -571 284 378 -1443 642 58 -90 748 -1187 366 333 -821 1194 41 -499 667
1253 667 -735 517 473 -987 728 -531 -381 1103 -791 288 260 -672 788 -269 -94 941 -1126
1270 -1126 265 633 -854 743 -633 -334 843 -523 504 300 -999 787 -401 -397 1204 -947
$$ packed form
1151E90M14k357J957q35m69J741j554R12mj843K585q79p20J290j538R58N81j307
1169d78J550j431k57J729j487O63M07k031J740j37n99J542k261J242M79j852K083
1186I02p46r28J234j349J421L16j815J550p54q6J586j745N89L18j469J809r59
1203a26j7J444k573J061R34j360J504j579P0J611j758J171j6j552J799p54j61
1220c02J395j866J063o1j384K572j522o90J386j598J300N50j597J452j281J52
1236d31J599j739Q55R4j821K085n84j48Q38j935J553l3j154K015j153n40J166
1253F67j402J252m4j460J715j259J50J484j894J079k8r32J460j057J75J035k067
1270a126J391L68j487J597j376K99J177j366J027k04j299J786j188MJ601k151
$$ plain form
1286 -947 238 25 -455 1225 -322 -384 580 -1397 604 509 -708 603 -730 -330 1013 -742 590
1303 590 337 -1107 982 -473 -284 978 -1118 427 144 -988 1157 -553 -591 628 -716 570
1319 570 433 -490 537 -709 24 1254 -928 -68 -107 -1038 1139 -120 -60 529 -1084 548 581 -660
1337 -660 649 -752 -473 682 -655 493 7 -862 708 -525 23 913 -957 257 28 -647 1263
1354 1263 -580 -321 558 -938 787 336 -822 537 -151 -104 1011 -718 568 20 -807 829 -225
1371 -225 -235 408 -1364 447 205 -134 971 -1005 -341 620 -684 451 81 -872 576 -594 259 898
1389 898 -1071 342 172 -669 1088 -83 -240 339 -816 527 299 -558 911 -677 -152 821 -434
1406 -434 372 -536 -791 789 -591 63 777 -1066 193 185 -563 931 -478 -155 531 -830 820 126
$$ packed form
1286i47J185k13m80J680j547o2R64j977K001r5j217J311j333M00J343j755J332
1303E90k53j444K089j455J89J262k096J545k83j132K145j710l8J219j344J286
1319E70j37r23J027j246P33J230k182Q60l9r31K177j259O0N89j613J632L3j241
1337f60J309j401K79J155j337J148m86q69J570j233N48Q90j870J214k29o75J910
1354A263j843K59Q79j496J725m51j158J359o88M7J115j729J286n48q27J636j054
1371b25j0O43j772J811k42l39J105j976O64R61j304J135l70r53J448j170Q53O39
1389H98j969J413j70q41J757j171j57N79j155J343k28q57J469j588N25R73j255
1406d34Q06r08k55J580j380O54P14j843J259qp48J494j409L23O86j361J650o94
$$ plain form
1424 126 -1079 522 -490 -176 994 -386 389 -222 -859 850 -421 -149 597 -873 228 497 -405
1441 -405 765 -699 -114 594 -643 795 161 -697 756 -595 73 789 -799 372 41 -313 867
1458 867 -421 -400 311 -1096 754 89 -327 590 -709 99 671 -852 476 -238 -696 906 -365 234
1476 234 715 -1119 6 154 -460 527 -556 -223 301 -674 966 215 -730 528 -836 237 941 -926
1494 -926 209 -145 -580 702 -312 182 225 -930 617 502 -423 355 -593 -39 415 -609 461 -279
1512 -279 -645 742 -304 150 238 -751 390 -176 -573 594 -501 -87 12 -574 734 8 -329 672
1530 672 -588 -139 677 -715 413 -175 -448 922 -608 126 325 -821 381 29 -383 846 -712
1547 -712 -222 611 -818 765 -281 -700 590 -559 84 248 -769 506 -211 -273 613 -324 187 100
$$ packed form
1424A26j205J601j012L14J170j380P75o11o37J709j271K72P46j470J101K69r02
1441d05J170j464N85P08j237J438o34q58J453j351O68P16j588J171l31l54J180
1458H67j288K1P11j407J850o65m16R17j299Q08N72j523J328p14m58J602j271N99
1476B34M81j834J125J48o14R87j083L33N24r75J640p51r45J258j364J073P04j867
1494i26J135l54m35J282j014M94M3j155J547j15r25P78r48N54M54j024J070p40
1512b79l66J387j046M54Q8r89J141n66l97J167j095M14R9n86J308p26l37J001
1530F72j260M49Q16j392J128n88k73J370j530P34J99j146J202l52m12J229j558
1547g12M90Q33j429J583j046m19J290j149O43J64j017J275p17o2Q86r37N11q7
$$ plain form
1565 100 -606 650 464 -277 696 -616 112 682 -545 514 -253 -657 469 -502 289 335 -934 676
1583 676 -110 -276 657 -435 -40 273 -773 529 133 -481 515 -649 303 647 -659 302 -286 -356 575
1602 575 -325 355 29 -723 522 41 -159 736 -690 -13 432 -294 505 -475 -481 365 -625 342 458 -514
1622 -514 378 -170 36 694 -492 -71 293 -580 742 159 -466 363 -755 101 649 -458 622 -170
1640 -170 -266 703 -419 340 242 -559 529 227 -105 696 -670 275 435 -386 642 -310 -551 415 -176
1659 -176 366 200 -720 415 -135 -305 645 -607 20 86 -707 744 -142 -107 288 -772 525 288 -255
1678 -255 720 -250 -438 761 -605 531 360 -568 230 -191 95 648 -307 161 186 -465 527 -177 -347
1697 -347 210 -441 445 355 -479 423 -513 -262 493 -373 396 166 -647 556 -110 -237 331 -576 298 135
$$ packed form
1565A00p06J256j86p41R73j312P28N70j227J059p67m04J126r71P91M6j269J610
1583F76p86j66R33j092L95L13j046J302l96o14R96j164R52L44j306R61n88p0R31
1602E75r00O80l26p52J245m81k00Q95j426O77M45p26P99r80oQ46r90R67J16r72
1622e14Q92n48K06O58j186M21L64q73J322n83o25Q29j118Q56N48j107J080p92
1640a70r6R69j122P59r8q01J088l02l32Q01j366R45J60q21J028r52k41R66n91
1659a76N42j66r20J135n50j70R50j252O27O6p93J451q86L5L95j060J297k37n43
1678b55R75r70j88J199j366J136j71r28P98m21K86N53r55M68K5o51R92p04j70
1697c47N57o51Q86r0q34R02r36K51P55q66P69k30q13J203o66j27N68r07Q74j63
$$ plain form
1717 135 -165 567 -261 -148 315 -493 501 145 -653 204 -430 -313 607 -639 -17 197 -567 644 -274
1736 -274 -181 395 -630 388 182 -431 436 -428 -177 439 -260 62 4 -733 587 -110 -19 550 -623 202
1756 202 197 -319 657 -9 -326 133 -585 386 250 -361 509 -433 113 637 -551 508 103 -510 725 68
1776 68 -49 656 -887 377 161 -351 550 -470 -198 367 -122 243 242 -692 426 -343 51 605 -535
1795 -535 145 -47 -202 792 -479 -194 477 -738 202 348 -350 320 -238 31 595 -334 159 46 -629
1814 -629 368 -117 43 426 -659 301 424 -317 558 -574 -67 1 -480 488 42 -561 598 -159 68
1833 68 702 -544 244 -165 -287 501 -260 -11 169 -548 344 116 -139 647 -470 -134 551 -466 448
1852 448 1 -779 277 -376 140 320 -556 77 160 -611 697 -300 188 38 -438 404 136 -256 134 -628
$$ packed form
1717A35l00P32q28J13M63q08R94l56p98Q57o34J17R20j246O22K14p64J211r18
1736b74R3N76j025J018k06o13Q67q64K51O16o99L22n8p37J320o97R1N69j173Q25
1756B02nn16R76o66l17M59p18R71j36o11Q70r42N46N24j188J059m05o13J235o57
1776F8j17P05j543J264k16n12R01j020K72N65m89L65jr34J118p69L94N54j140
1795e35O80j92j55R94j271K85O71j215R40J46o98O70n58K69N64r29M93j13o75
1814f29R97m85J60L83j085R60J23p41Q75j132N07O8m81R68m46o03J159p57K27
1833F8O34j246P88m09j22P88p61K49J80p17Q92k28k55P86j117L36O85j017R14
1852D48m47p80J056o53N16J80q76O33Q3p71J308r97M88j50m76Q42k68l92L90p62
$$ plain form
1872 -628 -164 391 -664 481 58 -472 421 -75 101 305 -515 402 41 -284 545 -205 -93 401 -418
1891 -418 551 139 -155 96 -269 235 490 -457 408 -19 -313 692 -376 116 142 -585 482 165 -235
1910 -235 345 -605 -57 477 -291 364 -18 -547 655 -341 506 -72 -471 403 11 -327 686 -154 -235 159
1930 159 -328 493 6 -288 351 -410 147 386 -355 204 -24 -635 569 -80 271 218 -749 422 188 -268
1950 -268 441 -244 -23 241 -301 622 50 -401 538 -265 173 363 -440 255 -242 -276 369 -422 -49 167
1970 167 -492 595 -11 -397 420 -491 568 131 -367 379 -256 -406 570 -234 440 75 -590 414 2
1989 2 -292 825 -478 -179 109 -210 487 23 -471 193 -129 -137 267 -419 427 -25 -75 577 3 -121 220
2010 220 -210 362 -62 -71 264 -386 36 386 -205 485 -99 -632 290 -255 248 98 -602 384 144 -311 430
$$ packed form
1872f28M64N55j055J145m23n30Q93m96J76K04q20R17l61l25Q29p50J12M94q19
1891d18R69m12k94K51l65N04K55r47Q65m27k94J005j068M92K6p27J067l17m00
1910b35N80r50N48N34p68O55l82n29J202r96Q47n78l99Q74l92l38J013q40q1L94
1930A59m87Q21m87k94O39p61N57K39p41N59k28o11J204o49L51n3r67J171k34m56
1950b68P09o85K21K64n42R23n72m51R39q03M38J90q03O95m97l4O45p91L73K16
1970A67o59J087o06l86Q17r11J059m37m98P46o35j50R76q04O74l65o65J004m12
1989Bk94J117j303K99K88l19O97m64m94O64l22qM04o86Q46m52n0O52n74j24L41
2010B20m30N72m24rL35o50M22L50n91O90n84n33R22n45N03j50p00R86k40m55P41
$$ plain form
2031 430 -698 -76 24 -484 646 75 -54 264 -349 186 294 -97 301 60 -613 383 -90 271 119
2050 119 -711 176 106 -23 328 -555 109 180 -299 523 -224 -255 288 58 312 -15 -223 256 -275 -316 598
2071 598 -387 -10 -28 -479 437 139 -343 183 -530 191 408 -142 588 -211 -459 328 -147 587 190 -849
2091 -849 371 -191 -141 437 -239 241 19 -111 494 -82 -223 191 -455 216 -15 -492 184 -69 -20 313
2111 313 -58 381 150 -496 399 -87 -78 402 -132 182 193 -327 440 -187 -86 407 -118 271 79 -589 241
2132 241 -325 -112 381 -265 227 -64 -760 508 163 -125 290 -671 370 325 -396 410 -57 174 338 -356
2152 -356 194 168 -629 462 -138 -47 621 -348 196 83 -445 241 -148 -438 337 -371 528 214 -282 263
2172 263 -52 -266 689 -174 226 262 -383 236 -197 -44 204 -499 545 267 -373 468 -221 -270 276 -364
$$ packed form
2031D30j128O22J00n08J130n71j29L18o13N35J08l91L98k41o73R96m73L61j52
2050A19q30Q87p0j29L51q83O64P1m79Q22p47l1N43k30K54l27k08M79n31m1R14
2071E98r85L77j8m51R16k98m82N26p13P21K17n50P30p99k48P87m75P34l97j039
2091h49J220n62N0N78o76M80k22j30O05n76j41M14o46O71k31m77O76k53M9L33
2111C13l71M39k31o46Q95m86RM80n34L14J1n20P67o27J01M93n25L89j92o68Q30
2132B41n66K13M93o46M92k91o96J268l45k88M15r61J041m5p21Q06m67K31J64o94
2152c56N50k6p97J091o00R1O68r69N44j13n28O86l89k90P75p08Q99l14m96N45
2172B63l15k14R55q63M00L6o45O19m33J53K48p03J044k78o40Q41o89m9N46o40
$$ plain form
2192 -364 0 145 -586 343 -16 106 510 -300 193 136 -459 452 -255 -33 431 -453 34 137 -253 249
2212 249 -215 -71 373 -164 11 77 -430 284 -193 45 138 -408 266 -47 -147 441 -307 -218 -80 -368 309
2233 309 155 -394 134 -230 -101 237 -551 303 296 -149 303 -141 160 408 -182 453 80 -348 252 -361 -22
2254 -22 -22 101 152 -234 -377 330 50 26 80 -595 242 -172 -276 681 -158 -108 60 -437 340 277 -315 59 -129
2277 -129 -109 197 -59 227 -122 -353 536 -18 113 204 -561 164 85 -297 283 -311 -76 408 -359 654 244
2298 244 -414 280 2 194 104 -305 36 10 -409 393 -168 -39 -37 -557 304 99 -109 341 -595 17 236
2319 236 -129 340 -161 -273 264 -227 -38 167 -540 286 -71 -214 354 213 -173 -13 -433 525 -44 -254
2339 -254 283 -398 142 314 -471 198 -61 -252 366 -236 34 -76 -298 295 13 -36 527 -166 -116 331 -186
$$ packed form
2192c64L64J45p31R29l59J22M04q10M93n7n95R11p07K22M64q84M87J03l90N02
2212B49m64J44M44n37J75O6n07P14m77K38R3n46O74l13j00N88p48Q9J38k88O77
2233C09j54n49N28l64J29L38p88Q54pm45M52m44L01K48n90O35l73m28O00o13L39
2254b2%J23N1l86j43P07k80k4N4o75Q37m14j04R57q39N0J68m97P77o3n92L74j88
2277a29K0L06k56K86l49k31Q89n54J31R1p65P25p9l82N80n94K35M84p67J013m10
2298B44o58O94k78J92r0m09L41k6m19Q02n61J29Kn20Q61k05k08M50r36O12K19
2319B36l65M69n01j12N37m91J89K05p07Q26l57j43N68j41l86J60m20R58n69k10
2339b54N37o81N40J72p85O69k59j91O18o02K70j10k22N93k82m9N63o93N0M47n17
$$ plain form
2360 -186 370 -15 -411 371 -276 251 250 -231 185 -128 -168 372 -68 119 37 -266 8 -51 -196 86 -162 -32
2382 -32 184 -294 251 -131 -366 177 -92 191 212 -365 351 -447 -330 348 -499 -10 204 -256 320 -223 -415
2403 -415 233 -270 266 338 -255 268 -148 79 372 -211 72 79 -282 384 282 -167 192 -345 -91 212 -48
2424 -48 366 7 -515 398 -69 122 375 -432 -33 179 -131 377 -125 -102 -43 -354 124 -116 -356 234 -231
2445 -231 164 320 -394 250 -48 -24 228 -159 -35 166 -331 576 66 -145 387 -556 16 32 -329 328 29
2466 29 -86 43 -339 204 259 -291 114 -122 -103 498 -284 -62 121 -250 251 15 -517 40 -283 238 350
2487 350 -151 450 -143 -212 228 10 252 153 -339 486 -162 -106 305 -320 34 246 -315 219 -139 -375 85
2508 85 -328 213 312 -42 228 -190 130 377 -31 -144 -289 -255 -19 183 101 110 -433 -54 -26 -186 263 -267
$$ packed form
2360a86N56l85l96P82o47N27jm81M16l13m0N40m40J87q2l03K74n9j45K82k48J30
2382c2K16m78N45l82k35N43k69K83K1n77P16p98J17O78q47M89K14m60N76n43j92
2403d15O48n03N36P2n93N23m16K27K93n83K83Pl61O66j02m49L59n37K54L03k60
2424d8M14l59n22R13m67J91K53q07L99K12l10N08n02K3N9l11M78k40k40N90m65
2445b31L95J56p14O44k98K4K52l87J24K01m97R07n10k11N32r43N72J6l61O57k99
2466B9j15J29l82N43N5n50M05k36J9O01p82K22J83l71N01k36n32N57l23N21J12
2487C50n01O01n93o9M40k18K42r9m92Q25o48N6M11o25L54K12n61N34l58k36M60
2508H5m13N41R9l54K70m18L20K47m08j13j45L4K36K02q2Rn43L79K8j60M49n30
$$ plain form
2530 -267 -26 194 -232 245 91 -116 181 -168 -63 372 -271 -5 63 -30 146 25 49 84 -255 150 335
2551 335 -532 85 -362 -160 313 -316 240 134 -352 307 -321 83 200 -347 -86 -64 -190 404 -376 140
2571 140 165 -369 64 99 -426 104 -23 -209 312 -407 202 -175 -233 387 -89 -32 371 -202 93 -98 -264
2592 -264 458 -152 -396 235 -320 302 -103 -312 97 -150 30 374 -468 -109 -143 -210 197 -92 -127 -19 -308
2613 -308 134 220 -245 376 -440 23 146 -284 179 53 -357 536 -46 -301 15 -316 206 41 -118 228
2633 228 -117 76 196 -153 340 23 -182 110 -260 87 164 -253 217 164 -382 243 -85 58 56 -219 253
2654 253 -44 -59 93 -379 -6 152 -218 182 -106 -174 56 -426 -206 303 -437 313 8 -160 397 -224 128
2675 128 -25 -229 377 27 -125 -98 -99 -73 237 -136 -77 -200 -570 321 -21 29 395 -320 90 256 109 108 19
$$ packed form
2530b67K41K20m26M77j54k07K97l49J05M35o43K66O8r3J76j21K4L5l39M05J85
2551C35q67O17m47K02M73o29N56j06m86O59o28M04J17n47K61K2j26N94p80N16
2571A40K5n34M33L5n25N30j27j86N21p19O09l77n8O20m76N7M03n73K95j91j66
2592b64P22o10k44O31n55O22m05k09M09k47J80L44q42L59l4o7M07k89l5J08k89
2613c08M42Q6m65O21q16M63J23m30M63j26m10Q93n82k55L16l31N22j65j59L46
2633B28l45J93J20l49M93l17k05K92l70L47P7m17M70n3n46O25l28J43kk75M72
2654B53k97j5J52m72L73J58l70M00k88o8K30m82K20N09p40P50l05j68N57o21L52
2675A28j53k04O06l50j52K7jK6L10l73N9j23l70Q91l42N0L66p15M10J66j47jq9
$$ plain form
2698 19 68 121 -475 224 64 -114 9 -373 -97 333 -242 185 -121 -89 247 59 8 217 -220 52 -22 22
2720 22 294 -316 -64 112 -260 -89 152 -5 244 -57 20 -91 -57 -56 -38 -102 220 -52 -116 344 -208 465 234
2743 234 -87 328 1 -112 150 -521 121 -112 24 107 42 52 20 -472 -17 65 -16 164 10 36 99 -250 284
2766 284 179 -24 61 -85 61 103 -262 -95 14 -277 364 -102 288 -81 -238 336 105 -271 286 -113 167
2787 167 150 -242 183 -53 -199 246 -78 70 266 -44 504 -22 2 71 -404 108 189 -87 453 210 -287
2808 -287 32 -167 126 144 -337 252 -171 -150 164 -345 -2 18 -244 221 -190 -72 216 80 -29 142 -323
2829 -323 360 -71 -18 212 -226 99 315 -38 157 -69 -25 150 -338 123 158 -142 227 -146 170 242 -231
2850 -231 74 211 -390 59 -460 -420 77 -182 -128 -91 -376 125 -135 53 176 -298 44 11 -140 329 146
$$ packed form
2698A9M9N3n96O99j60j78J23l82K76M30n75M27l06L2L36j88n1K09m37K72p4M4
2720B2K72o10K52J76l72J71K41j57K49l01P7j11L4JJ8o4L22k72o4M60n52O73k31
2743B34l21M15l27j13K62o71O42k33J36Q3o5J0l2m92M55Q2q1J80j54K6O3l49N34
2766B84j05k03Q5j46J46M2l65J67J09k91O41m66L90l69j57N74k31l76N57l99K80
2787A67j7l92M25k36j46M45l24J48J96l10N48n26K4O9m75N12Q1k76N40k43m97
2808b87L19j99K93J8m81N89m23K1L14n09L43K0k62M65m11J18K88j36j09J71m65
2829c23O83m31N3K30m38L25K16l53J95k26M4J75m88M61L5l00L69l73L16P2m73
2850b31L05J37o01M49n19M0M97k59N4L7k85N01k60J88J23m74L42l3j51M69j83
$$ plain form
2871 146 -34 277 -298 -164 -29 -80 123 -384 -114 204 -479 45 82 81 121 94 -68 219 -434 28 16 -120
2893 -120 49 -311 -185 175 103 99 79 -258 35 -35 -77 280 -121 49 129 -136 136 -195 -264 251 -184 388 76
2916 76 -327 -75 -337 -191 371 -17 30 306 -155 102 -66 -246 65 -371 -1 158 -80 205 -94 105 89
2937 89 -17 63 117 -283 -150 -112 -127 214 15 -36 98 -143 188 32 -170 120 -231 199 -103 -145 218 -165
2959 -165 -323 112 -104 76 -28 -82 172 18 36 -50 -307 281 -30 45 376 -78 -332 -44 -92 -7 78 -145
2981 -145 144 -64 -129 142 -201 215 -59 -301 375 237 94 132 -115 -126 -26 -202 290 -32 -249 4 -86
3002 -86 205 69 -32 287 -108 72 -138 32 178 -174 23 174 4 -93 -200 -110 306 -190 45 55 -395
3023 -395 -2 -139 -25 146 -77 -279 299 70 -102 -123 -134 103 -178 -47 -40 -66 -28 103 -139 -222 -115 25
$$ packed form
2871A46j80L11n75J34J35n1K03n07K70L18o83N24L7jM0k7j62K87o53M62j2j36
2893a20J69l60J26L60p2mk0l37K93p0m2L57m01J70Q0k65K72l31o9N15m35N72l12
2916G6m03K52k62J46N62l88M7K76m61K57j68j80L11m36L70J59k38K85k99J99j6
2937H9j06Q0N4m00J33L8j5L41j99n1J34k41L31j56k02K90l51M30l02m2L63l83
2959a65j58M35k16J80j04n4K54j54J8q6k57N88l11P5L31m54k54K88m8Q5Q5k23
2981a45K89k08o5K71l43M16k74k42O76j38j43L8k47j1J00j76M92l22k17K53r0
3002h6K91j36j01L19l95J80k10J70J46l52J97J51j70r7j07R0M16m96K35J0m50
3023c95L93j37J14J71k23k02N78k29j72k1j1K37k81J31Pk6L8J31k42q3J07J40
$$ plain form
3045 25 256 169 184 265 -78 -130 -108 172 95 -37 -37 -92 38 268 229 -102 -70 -252 -173 324 -183 204 116 -35 -161
3070 -161 -223 54 -9 -326 201 52 -112 -6 -186 115 191 -227 82 165 -252 186 -27 188 307 -65 298
3091 298 -356 -166 -52 -70 245 72 -102 300 215 64 253 19 91 125 -183 222 -86 -89 121 36 -5 91 20
3114 20 -77 100 -179 427 7 167 -48 -152 -149 -61 -127 214 -158 230 -55 31 222 -142 -337 -52 21 -128 35
3137 35 -525 65 -145 66 215 -160 -20 -64 -114 172 -131 -244 -4 -134 -111 -9 130 141 -69 -49 46 -157
3159 -157 40 -9 133 143 218 -133 95 -349 -47 -120 -177 177 153 -73 79 -231 67 284 253 -181 -119 99 39
3182 39 8 -347 152 -138 306 -91 -49 256 -34 79 -2 -179 169 -43 -112 436 9 229 76 -412 -37 -223
3204 -223 -129 -12 -173 31 -39 -79 47 -100 -45 157 169 -46 -86 -214 -105 -109 -384 244 -85 -168 208 98 77
$$ packed form
3045B5K31q7J5Q1l43n2K2K80p7j32%n5J30K30l9l31L2j82P9M97n07L87q8j51j26
3070a61o2K77o3l17N27j49j64J06j80L01P6m18L09Q3m17M38k13K15J19l72L63
3091B98o54J90J14j8L15j73j74M02q5j51J89k34P2L4l08M05l08lK10q5m1R6p1
3114B0r7J77k79O06m20J60k15j04LQ8o6L41l72L88k85Q6J91l64j95K85P3j49J63
3137C5n60N90k10K11J49l75J40m4n0K86l03j13K40j30K3J02J39J1k10K0R5k03
3159a57J97m9J42J0P5l51K28m44L02p3n7L54k4k26J52l10K98K17l1m34O2K18o0
3182C9l1l55M99k90M44l97M2L05k90J13q1j77L48k12o9N48m27K20j53m88L75j86
3204b23R4J17j61K04p0m0J26j47N5K02J2k15m0j28J09mk75O28l29q3L76j10k1
$$ plain form
3227 77 -3 27 -89 -182 125 -38 -51 -43 -234 -121 326 -159 148 92 -259 7 48 229 73 -140 -34 6 43 -14
3251 -14 232 -89 130 -176 -29 -75 68 47 -129 -85 226 -108 -34 -44 -14 76 -95 -61 399 20 -64 23 -139 85
3275 85 -7 -58 242 24 -156 244 -116 188 -17 -78 104 -163 141 -154 -146 93 124 122 236 -73 93 16 1 -11
3299 -11 27 -113 198 -447 185 55 -50 216 -115 33 329 37 56 151 -350 185 -212 -341 238 -138 -123 0
3321 0 -238 75 -143 -33 73 -31 2 246 -104 -156 -14 140 83 -129 -141 -118 34 12 -19 -319 -96 60 137
3344 137 201 6 -15 101 115 258 -192 -223 70 -138 181 97 -274 114 113 169 252 105 88 -29 -35 -39 -216 110 242
3369 242 -277 44 -3 -66 60 -145 138 -133 -113 165 -53 -29 110 28 -108 126 -98 133 140 -18 222 -128
3391 -128 115 -296 -243 23 -247 10 111 -117 -77 44 16 149 -139 166 -6 -162 275 67 102 41 -205 -64
$$ packed form
3227G7q0L0j16r3L07j63j3Qj91J13M47m85L07n6l51K66M1J81j56k13J06M0L7n7
3251a4K46l21K19l06J47m6J43k1j76M4L11l34P4j0L0R0j71L4M60l79q4Q7j62K24
3275H5r2n1L00k18j80M00l60L04k05o1J82k67L04k95QK39L1kJ14l09J66p7j5j2
3299a1L8j40L11o45O32j30j05K66l31J48K96k92J9R5n01N35l97j29N79l76J5J23
3321@k38L13k18J10J06j04L3K44l50n2J42J54n7k12j2K3J52k2l1l00K23J56P7
3344A37O4j95k1J16J4J43m50l1K93k08L19q4l71L88jN6Q3j47j7j17omj77L26J32
3369B42n19L21m7o3J26k05K83k71K0K78k18K4J39q2j36K34k24K31Pj58K40l50
3391a28K43m11N3K66k70K57J01k28M0J21k8J33k88L05j72j56M37k08L5o1k46J41
$$ [...]
8191g5
##END NTUPLES=NMR FID
##END=
