##TITLE=1H_Pr TGF
 CDCl3
 8 sc, 
 6.10.2023
##JCAMPDX= 6.0         $$ Bruker NMR JCAMP-DX V2.0
##DATA TYPE= NMR FID
##DATA CLASS= NTUPLES
##ORIGIN= UXNMR, Bruker Analytische Messtechnik GmbH
##OWNER= root
$$ XWIN-NMR		Version 3.5
$$ Fri Oct  6 14:43:38 2023 Russian Standard Time (UT+4h)  she@DPX200
##.OBSERVE FREQUENCY= 200.13135
##.OBSERVE NUCLEUS= ^1H
##.DELAY= (6, 6)
##.ACQUISITION MODE= SIMULTANEOUS
##.ACQUISITION SCHEME= undefined
##.AVERAGES= 8
##.DIGITISER RES= 18
##SPECTROMETER/DATA SYSTEM= spect
##.PULSE SEQUENCE= zg30
##.SOLVENT NAME= CDCl3
##.SHIFT REFERENCE= (INTERNAL, CDCl3, 0, 15.7039)
##AUDIT TRAIL= $$ (NUMBER, WHEN, WHO, WHERE, WHAT)
$$ ##TITLE= Audit trail, XWIN-NMR		Version 3.5
$$ ##JCAMPDX= 5.01
$$ ##ORIGIN= Bruker BioSpin GmbH
$$ ##OWNER= she
$$ F:/spectra/data/she/nmr/H-F/1/audita.txt
$$ ##AUDIT TRAIL=  $$ (NUMBER, WHEN, WHO, WHERE, WHAT)
(   1,<2023-10-06 14:42:31.15 +0400>,<she>,<DPX200>,
      <created by zg, POWCHK disabled, PULCHK disabled
       configuration hash MD5:
       00 E9 B6 7A A2 85 ED C7 34 08 36 98 17 FE 4E 26
       data hash MD5: 16K
       3A 7F 4C AC EC FC 57 82 BE 01 35 73 69 43 18 00>)
$$ ##END=
$$ 
$$ hash MD5
$$ BB 0C 4B 22 14 DD 06 81 1B 41 FE 83 BE 57 5C F5
##$RELAX= 
##$RELAX= 
##$RELAX= 
##$RELAX= 
##$RELAX= 
##$RELAX= 
$$ Bruker specific parameters
$$ --------------------------
##$DU= <F:/spectra>
##$EXPNO= 1
##$NAME= <H-F>
##$PROCNO= 1
##$TYPE= <nmr>
##$USER= <she>
##$AMP= (0..31)
100 100 100 100 100 100 100 100 100 100 100 100 100 100 100 100 100 100 
100 100 100 100 100 100 100 100 100 100 100 100 100 100 
##$AQSEQ= 0
##$AQ_mod= 1
##$AUNM= <au_zg>
##$AUTOPOS= <>
##$BF1= 200.13
##$BF2= 200.13
##$BF3= 200.13
##$BF4= 200.13
##$BF5= 200.13
##$BF6= 200.13
##$BF7= 200.13
##$BF8= 200.13
##$BYTORDA= 1
##$CFDGTYP= 0
##$CFRGTYP= 5
##$CHEMSTR= <none>
##$CNST= (0..31)
1 1 145 1 1 1 1 1 1 1 1 1 1 1 1 1 1 1 1 1 1 1 1 1 1 1 1 1 1 1 1 1 
##$CPDPRG= <>
##$CPDPRG1= <>
##$CPDPRG2= <>
##$CPDPRG3= <>
##$CPDPRG4= <mlev>
##$CPDPRG5= <mlev>
##$CPDPRG6= <mlev>
##$CPDPRG7= <mlev>
##$CPDPRG8= <mlev>
##$CPDPRGB= <>
##$CPDPRGT= <>
##$D= (0..31)
0 1.2 0 0 0 0 0 0 0 0.06 0 0.03 0 0 0 0 0.0002 0 0 0 0 0 0 0 0 0 0 0 0 
0 0 0 
##$DATE= 1696588950
##$DBL= (0..7)
120 120 120 120 120 120 120 120 
##$DBP= (0..7)
150 150 150 150 150 150 150 150 
##$DBP07= 0
##$DBPNAM0= <>
##$DBPNAM1= <>
##$DBPNAM2= <>
##$DBPNAM3= <>
##$DBPNAM4= <>
##$DBPNAM5= <>
##$DBPNAM6= <>
##$DBPNAM7= <>
##$DBPOAL= (0..7)
0.5 0.5 0.5 0.5 0.5 0.5 0.5 0.5 
##$DBPOFFS= (0..7)
0 0 0 0 0 0 0 0 
##$DE= 6
##$DECBNUC= <off>
##$DECIM= 32
##$DECNUC= <off>
##$DECSTAT= 4
##$DIGMOD= 1
##$DIGTYP= 9
##$DL= (0..7)
0 120 120 120 120 120 120 120 
##$DP= (0..7)
150 150 150 150 150 150 150 150 
##$DP07= 0
##$DPNAME0= <>
##$DPNAME1= <>
##$DPNAME2= <>
##$DPNAME3= <>
##$DPNAME4= <>
##$DPNAME5= <>
##$DPNAME6= <>
##$DPNAME7= <>
##$DPOAL= (0..7)
0.5 0.5 0.5 0.5 0.5 0.5 0.5 0.5 
##$DPOFFS= (0..7)
0 0 0 0 0 0 0 0 
##$DQDMODE= 0
##$DR= 18
##$DS= 0
##$DSLIST= <SSSSSSSSSSSSSSS>
$$ [...]
##$SUBNAM2= <"">
##$SUBNAM3= <"">
##$SUBNAM4= <"">
##$SUBNAM5= <"">
##$SUBNAM6= <"">
##$SUBNAM7= <"">
##$SUBNAM8= <"">
##$SUBNAM9= <"">
##$SW= 18.05172834244
##$SWIBOX= (0..15)
0 0 2 0 0 0 0 0 0 0 0 0 0 0 0 0 
##$SW_h= 3612.71676300578
##$TD= 16384
##$TD0= 1
##$TE= 0
##$TE2= 300
##$TE3= 300
##$TEG= 300
##$TL= (0..7)
0 120 120 120 120 120 120 120 
##$TP= (0..7)
150 150 150 150 150 150 150 150 
##$TP07= 0
##$TPNAME0= <>
##$TPNAME1= <>
##$TPNAME2= <>
##$TPNAME3= <>
##$TPNAME4= <>
##$TPNAME5= <>
##$TPNAME6= <>
##$TPNAME7= <>
##$TPOAL= (0..7)
0.5 0.5 0.5 0.5 0.5 0.5 0.5 0.5 
##$TPOFFS= (0..7)
0 0 0 0 0 0 0 0 
##$TUNHIN= 0
##$TUNHOUT= 0
##$TUNXOUT= 0
##$USERA1= <user>
##$USERA2= <user>
##$USERA3= <user>
##$USERA4= <user>
##$USERA5= <user>
##$V9= 5
##$VALIST= <valist>
##$VCLIST= <CCCCCCCCCCCCCCC>
##$VD= 0
##$VDLIST= <DDDDDDDDDDDDDDD>
##$VPLIST= <PPPPPPPPPPPPPPP>
##$VTLIST= <TTTTTTTTTTTTTTT>
##$WBST= 1024
##$WBSW= 4
##$XGAIN= (0..3)
0 0 0 0 
##$XL= 0
##$YL= 0
##$YMAX_a= 555477
##$YMIN_a= -623327
##$ZGOPTNS= <>
##$ZL1= 120
##$ZL2= 120
##$ZL3= 120
##$ZL4= 120
##$ABSF1= 10
##$ABSF2= 0
##$ABSG= 5
##$ABSL= 3
##$ALPHA= 0
##$AQORDER= 0
##$ASSFAC= 0
##$ASSFACI= 0
##$ASSFACX= 0
##$ASSWID= 0
##$AUNMP= <proc_1d>
##$AZFE= 0.1
##$AZFW= 0.1
##$BCFW= 1
##$BC_mod= 2
##$BYTORDP= 1
##$COROFFS= 0
##$CY= 11.3945322036743
##$DATMOD= 1
##$DC= 2
##$DFILT= <>
##$DTYPP= 0
##$F1P= 15.7292609196834
##$F2P= 12.9074282941183
##$FCOR= 0.5
##$FTSIZE= 0
##$FT_mod= 4
##$GAMMA= 1
##$GB= 0.15
##$INTBC= 1
##$INTSCL= 1
##$ISEN= 128
##$LB= 0.24
##$LEV0= 0
##$LPBIN= 0
##$MAXI= 10000
##$MC2= 0
##$MEAN= 0
##$ME_mod= 0
##$MI= 1.114404
##$NCOEF= 0
##$NC_proc= 0
##$NLEV= 6
##$NOISF1= 3.799351
##$NOISF2= 2.8
##$NSP= 1
##$NTH_PI= 0
##$NZP= 0
##$OFFSET= 15.70392
##$PC= 1
##$PHC0= -22426.38
##$PHC1= 7.252712
##$PH_mod= 1
##$PKNL= yes
##$PPARMOD= 0
##$PSCAL= 0
##$PSIGN= 0
##$REVERSE= no
##$SF= 200.130013532006
##$SI= 16384
##$SIGF1= 3
##$SIGF2= 2
##$SINO= 400
##$SIOLD= 16384
##$SREGLST= <1H.CDCl3>
##$SSB= 0
##$STSI= 0
##$STSR= 0
##$SW_p= 3612.71676300578
##$SYMM= 0
##$S_DEV= 0
##$TDeff= 0
##$TDoff= 0
##$TI= <>
##$TILT= no
##$TM1= 0
##$TM2= 0
##$TOPLEV= 0
##$USERP1= <user>
##$USERP2= <user>
##$USERP3= <user>
##$USERP4= <user>
##$USERP5= <user>
##$WDW= 1
##$XDIM= 8192
##$YMAX_p= 0
##$YMIN_p= 0
$$ End of Bruker specific parameters
$$ ---------------------------------
##NTUPLES= NMR FID
##VAR_NAME=  TIME,          FID/REAL,        FID/IMAG
##SYMBOL=    X,             R,               I
##VAR_TYPE=  INDEPENDENT,   DEPENDENT,       DEPENDENT
##VAR_FORM=  AFFN,          ASDF,            ASDF
##VAR_DIM=   8192,          8192,            8192
##UNITS=     SECONDS,       ARBITRARY UNITS, ARBITRARY UNITS
##FACTOR=    0.0002768,     1,               1
##FIRST=     0,             0,               0
##LAST=      2.2672688,     0,               0
##MIN=       0,             -623327,         0
##MAX=       2.2672688,     555477,          0
$$ Real data points
##PAGE= N=1
##DATA TABLE= (X++(R..R)), XYDATA
0@%%%%%%%%%%%%%qJ6j6J6j6J6k4L2l2M0n0N8o7P5q8J01j13J29j46J67j90K12k38
36a26K68l00L33l70M09m52N01n53O10o74P44q18R01r94J094j205J329j469J628
55H56j806K012k255K540k882L300l827M514n443O767q793J2233j9093L7524j73057
70a47410m75917N71641M86330m07236l24665L13382J93607k06068j08807P5359
80b9784k0263J7649J60319k6867k52691K6762L03845l5004l53422M583L33725
91A28852M9497k17601l7585Q6791k3268j2317O5116m5197p7244J21054J10979
102A49077j75170j43615J77726J28389j69293q2743J53374M7748q7805R914P695
113A5297q9067K7332J30739l3604j23841M7830J08759p1138j10686P8055R8158
$$ plain form
0 0 0 0 0 0 0 0 0 0 0 0 0 0 0 -8 8 -8 8 -8 8 -16 16 -16 24 -26 32 -35 40 -48 53 -60 69 -77 90 -100 112 -126
36 -126 142 -158 175 -195 214 -238 263 -290 320 -354 390 -428 473 -521 573 -632 697 -772 856
55 856 -950 1062 -1193 1347 -1535 1765 -2062 2452 -2991 3776 -5017 7216 -11877 25647 -147410
70 -147410 -623327 -51686 434644 27408 -297257 16125 209732 3664 -105143 -29784
80 -29784 -50047 -32398 127921 101054 -151637 -124875 178970 143966 -209456 -204873 128852
91 128852 178349 -39252 -76837 9954 -13314 -25631 39485 -5712 -82956 38098 149077
102 149077 -26093 -169708 8018 136407 -32886 -115629 37745 85493 -2312 7602 15297
113 15297 -73770 -46438 84301 50697 -73144 -25314 83445 12307 -98379 -20324 77834
124G7834q9171o4316J28435L8867j63349j6329J70051l0687j76891P6397J93811
135A44652p7029j78845N7660J23495o2848p2465Q0612M8343o8078r066M9013m3751
147h307n3337O5928M6996o6352j9798P3060L11q0277l270O2691L69l4720K6691
160I985K8950n1524l6653N3858K5936n3671m551N8725m250m4587J4642J7994l4301
173a9447j487M5247j901l4382J4064K2615l2307k6929L4978K5495l0000j2507
185a6561K7782m995k6029K7391K6552n1084l4619O3454M0402o2519l6757N7675
197A0692K6787n7340k2236N5205K5937l7880j9266J8724O122l649L818j1394j3123
210a7603K2541K3324k4038k7943J8750J8846k0950j0763K7514J2409k5398j0793
$$ plain form
124 77834 -11337 -75653 52782 91649 -71700 -88029 82022 51335 -125556 -49159 144652
135 144652 67623 -111222 -53562 69933 7085 -65380 15232 63575 -4503 -13569 35444 -8307
147 -8307 -61644 4284 51280 -15072 -34870 38190 38501 -41776 -45046 17645 18014 -16706 9985
160 9985 38935 -12589 -49242 4616 30552 -23119 -27670 31055 26805 -17782 -3140 14854 -19447
173 -19447 -20934 24313 22412 -11970 2094 24709 -7598 -34527 451 25946 -4054 -16561
185 -16561 11221 6226 -19803 7588 34140 -16944 -51563 11891 52293 -10226 -46983 10692
197 10692 37479 -19861 -42097 13108 39045 1165 -18101 623 6745 3096 6914 -4480 -17603
210 -17603 4938 28262 4224 -23719 -4969 13877 -7073 -17836 9678 22087 -3311 -14104
222a4104J6254k887j2892J9040J1907l0501j1587L6100J0414l3804o318L0727
234A2349M362k2849q60J5920r49j1365k365K756M781Q385k609j8322l648K3317
248H903Q777k4839r623K5569O017k7838m065K8917K148k6797o06K0550l132j1715
262g734P766M701j0304L407J4389n882j3416O358O645p944l195R030K094p458
276a543K66N153l502l838O380K418j1425k546J6247L607k0623n008J9045K956
290G587j6929K047J5347l113j1262K967N530k387K364K871o459o76R347j104j2833
305f703p99J1185J297o930J682O535k835o888K51M585j990k304M799O03q031P99
321d744R068l797j0087O123J1087m749p119N335K180n295M03L544k006O89M246
$$ plain form
222 -14104 2150 -737 -13629 5411 17318 -13183 -24770 11330 21744 -12060 -18378 12349
234 12349 16711 -6138 -6998 8922 7973 -3392 -5757 -3001 1780 10165 7556 -10766 -14414 8903
248 8903 17680 -7159 -16782 8787 14804 -13034 -17099 11818 13966 -12831 -13437 7113 3981 -7734
262 -7734 32 4733 -5571 -2164 12225 6343 -7073 -715 5930 -2014 -5209 3821 5915 -1543
276 -1543 -1277 3876 374 -3464 2916 5334 -6091 -8637 7610 11217 -9406 -14414 4631 7587
290 7587 -9342 -7295 8052 4939 -6323 -3356 2174 -213 2151 5022 -1437 -2113 7234 6130 -6703
305 -6703 -7502 3683 4980 -1950 -268 6267 3432 -3456 -3205 1380 -610 -2914 1885 2488 -5543 -4744
321 -4744 4324 527 -9560 -3437 7650 2901 -4218 1117 3297 -1998 -1595 1949 -57 632 4878
336D878l184o182L380O017l884n683M345O754k141p032r7M839k683n926L085O042
352B528k208k982K906n99l031L834L559n786j954O507J518n836l11L602j134j220
368f07K116j91j058L319N69n507k247M415L395k867n623Q4O916Q75p965k484O145
385g15K993k533j308o62J599M976k068p852J335R393m74p596j192N026M310o41
401D591m906l558K869N287J14o124k016N468L911n389p063J947P097J819n911
416a864l290L990N327k972o167j014N782O440j601p773q85O018k41l584J550J911
432A627j436L487K348p197n039N829O746k847q485j503J0624N785j2584j0721
446a3366Q913J3320k522j2243m359R991J1830o126j7127J126J7670L777j4062
$$ plain form
336 4878 1694 -4488 -1108 4909 1025 -4658 -313 6441 4300 -2732 -2829 2010 -673 -6599 -3514 2528
352 2528 320 -2662 244 -355 -3386 448 4007 -1779 -3733 2774 4292 -1544 -1855 1747 613 -607
368 -607 1509 1318 260 3579 4148 -1359 -3606 809 4204 1337 -4286 -4202 2714 3589 -4376 -6860 -715
385 -715 2278 -255 -1563 -2225 -626 4350 2282 -5570 -4235 5158 4684 -2912 -4104 922 5232 4591
401 4591 -315 -3873 -1004 4283 4397 -1727 -3743 1725 5636 247 -6816 -4869 2228 4047 -1864
416 -1864 -5154 -1164 4163 1191 -4976 -5990 -208 6232 4631 -3142 -4027 1991 1750 -1834 -284 1627
432 1627 191 3678 6026 -1171 -6210 -381 6365 3518 -4967 -6470 4154 9939 -2645 -13366
446 -13366 -4453 8867 6345 -5898 -10257 -266 11564 5438 -11689 -10563 7107 10884 -3178
459c178p458J1169J2256o521j5630J5J3728O176p773p420K672O543M0p093m774
474g248L144P567L832n919q688L521P901l486q147K581Q951M482n619j1094j41
489h363J1444J915p282K407N085m853j892M894l235o017O524Q489l973j0544q22
504f223Q557L462q478l117Q271K877p026k718J173N95M274O292o458j3903L467
519h955J8577J176j8931k619J9850M161j9342q309J4900J3088o220j4775K49J4467
533G317K167j4487n517J0878P661k197o523p341K325J0231m52r360P69Q381N13
548D365o544n268L562R725L66j1188j851J2254K055j1753j910J1245J712j0021
562c251O46Q420m134q280O131Q319o339n635M075O72m779J858O010k20n176j561
$$ plain form
459 -3178 -10636 533 12789 6268 -9362 -9347 4381 10557 2784 -4636 -1964 4579 4619 -2474 -7248
474 -7248 -4104 3463 7295 1376 -7312 -3791 4110 624 -7523 -4942 4009 8491 2872 -8222 -8363
489 -8363 3081 4996 -2286 121 5206 353 -1539 3355 120 -5897 627 9116 5143 -5401 -6223
504 -6223 2334 5796 -2682 -5799 2472 5349 -1677 -4395 -3222 -2627 1647 7939 1481 -12422 -8955
519 -8955 9622 10798 -8133 -10752 9098 13259 -6083 -14392 508 13596 7376 -7399 -7150 7317
533 7317 9484 -5003 -10520 358 8019 5822 -701 -8042 -5717 4514 4062 -5298 -4529 3852 4365
548 4365 -2179 -7447 -3885 5840 6206 -4982 -6833 5421 7476 -4277 -6187 5058 6770 -3251
562 -3251 -2605 5815 1681 -6599 -468 7851 1512 -4123 -48 624 -4155 -2297 3713 3493 -1683 -3244
578c244K684r50m195N489Q153o772q638P595O728q921n905Q915N781l515l211
593fL29L71k821j249M570L588k602j203N04m057m013N395O789k697p325Q78P011
610C462j443r341J840J1360o02j1003K03R324J867q523m024Q451P779p344j0377
625h371O179R821m672o780M588M184n128m472K477M103J347p84k278m070j216
640e072N234L033m602j644N560L82o239q19M442J629k162r08K646K089l467k961
656b859K560J380j279L045J955n604l335M456K055k463m0J642j828k165M41K492
672D53J090k095j703J697Q45k295q9K097J654r91j882J108J595j203k269Q06L904
689B722J917k555m556k67M498J02l355K210K986l079k938R87J68N35J666r98j975
$$ plain form
578 -3244 -560 -1510 -5705 -216 7937 1165 -7473 122 6850 -2071 -7976 939 6720 3205 -6
593 -6 323 694 -2127 -3376 1194 4782 2180 977 1481 -2576 -6589 -1194 5595 2898 -4427 -3549 3462
610 3462 2019 -7322 -5482 5878 5276 -5727 -5524 3800 5667 -2856 -6880 1571 9350 2006 -8371
625 -8371 -2192 7629 2957 -3823 765 4949 -179 -4651 -2174 1929 3276 2492 214 -3856 -5072
640 -5072 162 3195 -1407 -3051 2509 2891 -3348 -4167 275 1904 -258 -1166 1480 3569 102 -2859
656 -2859 -299 1081 -198 2847 4802 -802 -4137 319 2374 -89 -129 1513 -315 -2480 -2039 453
672 453 1543 -552 -2255 -558 287 -2008 -2097 0 1654 663 -1219 -111 1484 281 -1988 -1182 2722
689 2722 4639 2084 -2472 -2739 1759 1861 -1494 716 3702 623 -2315 -1328 -1160 -625 1041 43 -1932
706a932K092J555k760j942J304R33J140Q98o84q26j17m16O65J515l27n70Q45k92
724A081j759J21K670j64l731NL017Q8j453j06J43n75JM8j461J011J913m37j290
743h78Q07l17q97RQ00R98J801l15k199l86O89n49Q92J068m02p49P56l15k281O60
763h08J999j069j555R75J801r57j772j066J020J415J38j137m8J481k34j255L59
780g13J112L07o77k12K81J797K13k129j036J814N17j422J84J154l44j084P7l65
798e26k93L90k5k35N70L17n73n76k72p0R79O14k74K92j57j88k39K90M86j95J75
819D90N51l57j21N03n33j299J22J215L28n69J10n05n11j72k38O4M7N25J50L9j63
840c24m77L30N32q25L93J329J39k37k50l52q12N37Q32l01l04J281k03j767k03
$$ plain form
706 -1932 160 1715 -1045 -2987 -1683 -750 390 1288 604 -222 -339 -755 -90 1425 1098 528 1373 1081
724 1081 -678 -557 2113 1949 -1782 -1777 1240 1328 -125 -231 -88 -663 -662 -614 -2075 -1064 849 412 -878
743 -878 -71 -388 -1285 -1276 -476 522 2323 2008 -191 -577 112 -437 455 1523 1121 372 1128 813 -1468 -808
763 -808 1191 122 -1433 -458 1343 386 -1386 -2452 -1432 -17 121 -1016 -1064 417 183 -1072 -713
780 -713 399 706 29 -183 98 1895 2108 -21 -1057 757 1274 -148 36 1190 846 -238 -161 -526
798 -526 -819 -429 -454 -689 -119 198 -375 -951 -1223 -1293 -314 300 26 318 161 -27 -266 24 510 315 490
819 490 1041 684 563 1066 533 -766 -644 571 899 330 440 -65 -576 -748 -986 -922 -875 -350 -200 -161 -324
840 -324 -801 -471 61 -764 -371 958 1097 860 610 258 -554 -17 815 514 210 1491 1288 -479 -682
859f82K87O92k72n00m4N36R4o64o30l86R75P54k71p88P54J354r11j282j09J987
879H94k4q49O43L95l04p13L38l37NO35M97j155O8M63n12j256N80N36o34n7J294
900E07L46j733j082J209J370j570o99K289J336j921o93M98K91L0M20j10k4J043
918A507o9j899p19J221J144r55j191J210J379k060j668J706O45j799O45J936o50
935C83j740L27J369p67r57J319J463j068r60J539k38j385J358P37j032q79J214
952F83J70n56L0j33l1n50n61P88R33j029R4R76k320j365K913R01k113O05J808
971A243j276j117R37p6k90J427R60r65j228J074O74j670j284K614J887k594k138
988a822K011J101k261n85K205N57k403r20K155R53k446K5J773o58q98J666p11
$$ plain form
859 -682 -395 297 25 -475 -519 17 111 -553 -1183 -1569 -594 160 -111 -899 -145 1209 298 -984 -1093 894
879 894 870 21 664 1059 755 42 380 43 48 683 1180 25 93 556 44 -1212 -632 -96 -730 -787 507
900 507 853 -880 -1962 -753 617 -953 -1652 637 1973 52 -641 -143 148 178 598 488 464 1507
918 1507 1438 -461 -1180 41 1185 230 -961 249 1628 -432 -2100 -394 251 -1548 -903 1033 383
935 383 -1357 -1030 339 -428 -1385 -66 1397 329 -631 908 670 -715 643 1380 348 -531 683
952 683 853 297 327 194 163 -387 -948 -160 773 -256 -162 814 -1506 -2871 42 943 -1170 -565 1243
971 1243 -33 -1150 -213 -289 -579 848 1808 843 -385 689 1363 -307 -1591 1023 2910 316 -1822
988 -1822 189 1290 -971 -1556 649 1206 -1197 -2117 38 991 -1455 -1430 343 -315 -1213 453 -258
1005b58j056K587J001l183m49L327p37l121J426K524J84j494j923K61J069k67
1021a09k21J040K99j313O80j059k572J921K921p62k057N60J602j255j587L54K152
1038E94P43j93r1j366j192J808Q10j174K28J922j051j859J06J097J1L09n57n84
1056d39j63N1O95M4j323j02K228q87k150J410J957j837k75K551j060k797P66K569
1074A238K13j172N08J114j557k315P53K644L87j075k66r42l26J079q04j129R49
1091g01K019p35k016j72J123N64j177L7K230L34k234o10J025K15O04J312j099
1108G19j886R27R39P7k16Q4K23m16j079j64J086j02l76N00m16p44M34L25j371
1127a456L34K196l69j208L64K88j294P1J607J545j002j052k36L26o30N40J515
$$ plain form
1005 -258 -1314 1273 2274 -909 -1358 1969 1232 -1889 -463 2061 2245 751 -1172 -911 158 -109
1021 -109 -330 710 1009 -304 376 -683 -3255 -1334 1587 825 -1232 -672 930 -325 -1912 -1558 594
1038 594 1337 1144 1053 -313 -1505 303 1113 -61 167 2089 1038 -821 -715 382 393 702 145 -439
1056 -439 -602 -551 144 188 -1135 -1237 991 104 -2046 -636 1321 -516 -791 1760 700 -2097 -1331 1238
1074 1238 1451 279 787 1901 344 -1971 -1218 1426 1813 738 472 -470 -796 283 -521 -1650 -701
1091 -701 1318 583 -1433 -1605 -482 82 -1095 -1058 1172 1506 -728 -1338 -313 -98 506 1818 719
1108 719 -1167 -240 699 776 560 644 867 451 -628 -792 294 192 -184 316 -100 -844 -410 -85 -1456
1127 -1456 -1122 1074 705 -503 -139 149 -1145 -1074 533 2078 1076 24 -212 114 -516 24 1539
1144A539l20j204P0M00n72k87o5J94q1M41M78m93j706J60J135N04n53J93M7p59
1164h79L26O41M28R6k69q65l62J132O78J12l29m67r1l4q3L6O63m73j4l99J83o58
1186f28o47J23J197L97J53o44q31n74L53P72R38K51m69p87j06O28O3j17L08N39
1206I19k18k17M01m93p13L77O17j61k44n18j83J32K3n6R3J66k76l43K2L98K04
1227g0M42q18l41M27o9J74R81M32p92m47N01J18m21K63L94k41l10K14K3j107r5
1248g42L89K11L89N40n04j196m00O06M90K1P8J39p8p72O39P54l40o32M48Q38m14
1269D64k39P10m77p80K62P06l37j71O2m0m86K68O2r3r69K89Q81j66J82j67k88
1290c27k49l1N36M19j84k26L21J00l50L51m2l48K85O80p1n86K01l79j64l82O48
$$ plain form
1144 1539 1219 15 85 485 -87 -374 -439 -245 -326 115 593 100 -1606 -1446 -311 193 -360 -167 -120 -879
1164 -879 -553 88 516 612 343 -522 -884 248 926 1038 709 242 151 117 34 70 733 260 246 -153 30 -628
1186 -628 -1275 -1152 45 442 595 -49 -880 -1454 -1101 -329 609 860 391 -396 -502 126 189 72 380 919
1206 919 701 484 885 392 -321 56 673 512 268 -250 -433 -301 -278 -334 -241 -75 -351 -694 -672 -274 -70
1227 -70 372 -446 -787 -360 -429 -255 726 1158 366 -81 420 538 117 380 774 533 223 437 460 -647 -742
1248 -742 -353 -142 247 787 283 -913 -1313 -707 -217 -196 -118 21 -57 -829 -190 564 224 -408 40 878 464
1269 464 225 935 458 -322 -60 646 309 138 200 160 -326 -58 4 -89 -1058 -769 112 -54 128 -39 -327
1290 -327 -576 -607 -71 348 164 -62 259 359 9 360 318 -30 255 935 864 278 479 100 -64 -446 202
1311B02M41l94n60K29j21l72P4K55qn72O29N90m37n31L9N92n00%R84L8o60L67
1333B85J64k34k32N21N0m01J82L44k47o99o5M39m51j50M95N04j020l06M06K29
1353a86l15K58K05N1l26P6N28k29k72M01J25j75K14K07m57l2M85l22j1k5K00k2
1375C78q6k67j23k01J14m98P24q4k51J27K25p80O6N52l44O7O07K85j56k42K05
1396C18l44J26J45K28K05k57k13L6R2o77M13O4K12l4m92l8j07nK11l7k84KP16
1419B80k84k55k14L46nJ50K73N3k4M09l23o16L26J85J64n05N05j71K34j88o14
1440b74J71J29j85j98L34j42j41R9o2j44j46K4M69o3K84J55n48J40j67K1K29M02
1462C87M44k88l49k21J72J55j92k06J12R45p31q56O68J78p82pN61K68o79j02K18
$$ plain form
1311 202 643 249 -311 -82 -203 -575 -501 -246 -254 -826 -197 393 -44 -575 -536 56 -444 -444 540 578 -82 285
1333 285 449 215 -17 504 554 153 335 679 432 -267 -332 107 -344 -494 1 505 -515 -821 -415 -186
1353 -186 -501 -243 -38 13 -313 -237 291 62 -210 191 316 141 355 562 105 73 558 236 225 200 400 378
1375 378 292 25 -98 -299 -185 -683 41 -43 -294 -167 58 -722 -656 -104 -448 -381 226 511 355 113 318
1396 318 -26 100 245 473 678 421 208 244 336 -341 72 136 348 314 -178 -216 -323 -328 -117 -154 -438 -436 280
1419 280 -4 -259 -473 -127 -132 18 291 344 320 729 406 -210 116 301 465 -40 465 294 528 340 -274
1440 -274 -103 26 -159 -357 -23 -165 -306 -207 -269 -413 -559 -535 -66 -129 155 310 -238 -98 -265 -244 -15 387
1462 387 831 543 194 -27 145 300 108 -98 14 959 228 -628 40 218 -564 -571 -10 258 -421 -523 -305
1483c05l58M12k68N04M67l38l37N48J78n04J4O24k39m79k5N43J98l84k55N1l25
1504b78J18K12l0N3L21p52k81O2L8j20O27K70n91N5J88l38k68J042J97k54J11
1525C82j77j47k56J82K72L01l2l10J12M2o14k01K06M67j4l84l45L18J15l98J59
1546c22L7M72j79k88O8N37k68m97L37J33l06J92N63k45J81J07j73k77J37j17k92
1567b00L16N15n74r5K32o21m78N60P2L81j13l09j64p4K54j08M65L43J86n03k18
1588a33L2K31j50L83K08n01j64O94k25l81J97K36J05o56j24j09r4K60K66R7l19
1609a47n55R8N23q6k0M88l45l26o0K54K33L06J83Nk18k35k24k89L54O99M1n19
1631A60K49k07r89J4P12M24j44j4m22m50J90J83q6R72m76n13K5L82m48M47K14
$$ plain form
1483 -305 -663 -251 -519 -15 452 114 -223 325 503 -1 13 637 398 -81 -106 437 635 251 -4 47 -278
1504 -278 -160 52 22 75 396 -356 -637 -575 -537 -657 -30 240 -351 -296 -108 -446 -714 328 525 271 382
1525 382 205 58 -198 -16 256 557 525 215 327 369 -245 -446 -240 227 213 -171 -516 -198 -83 -481 -322
1546 -322 -285 187 8 -280 -212 325 57 -440 -103 30 -276 -84 479 234 415 522 349 72 209 92 -200
1567 -200 116 631 57 -38 194 -427 -905 -345 -273 108 -5 -314 -478 -552 -298 -406 59 402 588 85 -133
1588 -133 -101 130 -20 363 571 70 -94 600 375 -6 191 427 532 -124 -248 -357 -451 -191 75 172 -147
1609 -147 -702 -604 -81 -167 -187 301 -44 -370 -430 -176 57 363 546 551 333 98 -126 -415 -61 638 679 160
1631 160 409 202 -787 -773 -61 363 219 205 -217 -667 -477 -294 -380 592 116 -397 -372 10 -438 9 223
1652B23j38j27L24M16m66J05J01J41m86M98k40o66oM67j6ok54j00m05K26J5K51
1674a43J56j1k71M3k64j39N83J64N0J26k39J50k98j02O89k72K91L03k24q10n5
1695b73Q6J47L4L31m9o21M2K01P3k80J14J73l41L20l06M39l26k13M20K06O0l11
1717g4J26K08j16J66L49n35j24m8K56L5j71L40M4o57k45M47n8r2K67k31l08J03
1739c18J71n7j82L97J68pk09m2j59l31L64N66M47n26k30M06k88l74L55R5l01J70
1761A15l39M26j08j34K99m34l05Q2M01J17l25j13k68K66J9L40q3j52J79M23K1
1782D27n46L2K46k45Q2P78l79k59j05R9j63j78L88K12m64m9R9R5m41M6nO6J18
1805a46J22J1kM0R1k46o4J0M33K2k02K9L45j55k12j50K67O7j75L55j76k39K45
$$ plain form
1652 223 85 -42 282 698 232 337 438 579 93 591 351 -315 -321 146 130 124 -130 -230 -635 -409 -394 -143
1674 -143 13 2 -269 -226 -490 -629 -46 118 168 294 55 205 -93 -195 494 222 513 816 592 -218 -273
1695 -273 -187 -40 -6 325 276 -345 -303 -102 -29 -309 -195 -22 -363 -43 -349 90 -236 -449 -29 177 237 -74
1717 -74 52 260 144 310 659 124 0 -48 208 243 72 412 456 -201 -446 1 -57 -149 118 -113 -421 -318
1739 -318 -147 -204 -386 11 179 172 -37 -79 -238 -569 -205 361 808 282 52 458 170 -204 151 246 -55 115
1761 115 -224 202 94 -40 259 -175 -480 -398 3 120 -205 -318 -586 -320 -301 39 -44 -196 -17 406 427
1782 427 -119 -87 159 -86 -4 774 395 136 31 130 -33 -211 177 389 -75 -124 -25 70 -371 -325 -330 -264 -146
1805 -146 -24 -13 -15 25 116 -130 -194 -184 249 271 69 98 443 288 76 -74 193 260 85 440 264 25 270
1828B70k59p9l5K20j58j79l38L62J69m52Q0L12K02m2k43K01j52k18L10P8K15O1
1850C25J25l7m50P8L03l9k14J14J01l69J9M2O4k03k85L82J19j04N8k06J04j39
1872b12M6P5J20q5K7K6j57M89j22j61N3K89j15Mk9R8l82l75L72J55k9k02J03K43
1896B31k29j92j4J44k84K46J16P8k25j64J34K75k29K12N7j81J74k54L57l02k3
1917g3L62q0p1j78k1J44o4j52p4J88k87L91l31o8r9K39L2k24L54r9%p0M28k38
1941Ik56M03R5k4j39K79k44J69L1k6m31K08O3N9o6Q1q7j34k92O8J75j78j59J56
1965b40L71j96j97k21K90J05mRN74l33k23J61ol1J21R6J03n0n26K01KK89m12J04
1989a3O1j58R8k1m46K72l7k9J53R4M3Nk08M3K4J57m3q5L87p9K36j02m76K05J46
$$ plain form
1828 270 11 -68 -103 117 -41 -220 -558 -196 -27 -479 -399 -87 115 73 -170 31 -121 -339 -29 49 264 325
1850 325 450 413 -37 41 344 305 91 205 306 -63 -44 -2 62 -141 -426 -44 75 -29 29 -177 -73 -212
1872 -212 -166 -91 29 -56 -29 -3 -160 329 207 46 99 388 273 277 248 346 -36 -411 -39 116 87 -115 -12 231
1896 231 2 -190 -204 -60 -344 -98 18 96 -129 -293 -159 116 -113 99 156 -25 149 -105 252 -50 -73
1917 -73 289 209 138 -40 -61 83 19 -133 -207 -19 -306 85 -246 -314 -413 -174 -142 -366 -12 -111 -111 -181 247 9
1941 9 -247 156 251 227 88 367 123 292 323 297 -134 74 137 196 130 211 124 -10 -302 -234 -59 -237 -396 -240
1965 -240 131 -65 -262 -483 -193 -88 -92 -83 491 158 -65 96 90 59 180 276 379 329 -197 4 6 295 -117 -13
1989 -13 48 -110 -12 -33 -479 -207 -244 -273 -120 -26 17 22 -186 -143 -119 38 -5 -90 297 218 454 352 -124 81 227
2014B27L6m70N80L3k59r9jj49k74K49R5j35Q8j2j03J78j88K67j2j77Q4k41K10
2037g3j82K68L18j54k13J82l9Qk36K22J70j33k03J01R8ko5k5k00K14m08j05K77
2060a80K62L2j22M8j16m38J58L87N7K52J1l63oN3k4J02N24m38N6J4l45J0N7m3
2084e2K47k00L51k09k41r1J04J56j48j74J60j83n3L32P6N4j69m2P6m7L3Q9N85
2107F54j65o59M30k60LK13J26j70NK02m29Q7k84K62p3j40K55j98j66r3J93J99
2129ho8o9J02K35j09j88J88J23l74J67M62n56L09m92M83k42lM32j33l57m9L27
2151A80n21J9J93K95m32K6J18J9j32p6M06l43r2J43J09J30K91k66K36o6n14L37
2173F0N4Q1J00O6R3n59n6J88J49k70l6K23l52J95N7m38K89j8J15J81j58j78O2
$$ plain form
2014 227 263 -207 373 406 147 48 47 -102 -376 -127 -32 -167 -79 -91 -194 -16 -204 63 51 -126 -42 -283 -73
2037 -73 -255 13 331 177 -36 146 107 115 -121 101 271 138 -65 36 134 132 67 42 -158 56 -352 -457 -180
2060 -180 82 114 -8 40 -76 -514 -356 31 88 340 351 -12 -18 35 11 113 637 199 255 269 -76 -66 -9 -52
2084 -52 195 -5 346 137 -104 -195 -91 65 -83 -257 -97 -280 -333 -1 75 129 -40 -82 -6 -53 -20 69 654
2107 654 489 -170 260 0 3 216 342 172 177 379 -50 37 -247 15 -58 -198 57 -141 -307 -400 -207 -8
2129 -8 -76 -145 -43 192 83 -105 83 206 -168 -1 461 -95 214 -278 205 -37 -40 392 259 -98 -147 180
2151 180 -341 -322 -129 166 -266 -240 -122 -103 -235 -311 95 -248 -340 -197 -88 42 333 67 303 237 -277 60
2173 60 114 195 295 361 454 -105 -161 27 176 -94 -130 93 -259 -64 -7 -445 -156 -174 -59 122 -36 -214 -152
2196a52j03K41J95k54K10n3K13k46o8J81J07j61q2K95k27l1K04J30k39m11M68
2217B17l31r4K75k6m4k45K5Q4m7rJ92L92m94m5L12j19q1P3m6L73k28k90J27J38
2241A09l66M56j22N1k56L05j14m81K87J87j25RJ46j06k15L0J46j31m4j14N43j08
2263H7j57K54j85l3J72k56L44L5j84K17j37j99K66q6r9k28J68J62j36k31L43j87
2285g0l86P8M21k02K1J50K1j37J12N1j73J24J01J85j71M08k29l49J3J0N42p8l67
2308G5j8J23j84j46J43l1J72l27L81l98m8oM4j10l6J57K0P0j77N23l11K21k36
2331i9M52j79O8j59L77k61l43N10j85p6J5Q1k41k39J39k08L87l56K85K16m52L
2353b65K41O6m09J88L30r8k71K35j9j37j17L30K3k01L61q7R6k69K07J6N6k83J52
$$ plain form
2196 -152 -255 -14 181 -73 137 84 297 51 -17 164 271 110 28 323 96 65 269 399 160 -251 217
2217 217 -114 -208 67 41 -3 -248 -223 -139 -186 -195 -3 389 -105 -150 162 43 -38 35 -11 362 134 -156 -29 109
2241 109 -257 199 77 128 -128 177 63 -418 -131 56 -69 -60 86 -20 -235 -205 -59 -190 -234 -348 195 87
2263 87 -70 184 -1 -34 138 -118 226 261 77 294 157 -42 224 138 39 -189 -21 141 5 -226 117 -70
2285 -70 -456 -378 43 -159 -138 12 33 -104 8 59 -114 10 111 296 125 533 304 -45 -32 -22 520 442 75
2308 75 57 180 -4 -150 -7 -38 134 -193 188 -210 -258 -264 -220 -330 -366 -209 -189 -119 -296 227 -84 137 -99
2331 -99 353 174 242 83 460 199 -144 366 181 105 120 201 -40 -279 -140 -348 39 -317 -32 184 -268 -265
2353 -265 -24 42 -367 -179 151 53 -218 17 -2 -139 -256 74 97 -104 257 170 266 -3 204 220 276 -7 145
2376A45J11q8k28L60n86l8l1J83L6j05K22j5l0j09K19J4k68N4J84J49j55J86k20
2399a0jp2N0Q6J04j57J06J12m24K58k04N1R1Q6k04Q8j60K58l37J60J9k09L38m6
2423a7O6Lj25j82M50k66J95pK42k14j60J13l73K59K01J76j83l61K86k34L43m67
2445b55R3M8kj57K70p4l30K37J63k64k23N22J15p3nO6Q8l00J87L9Q9j3k54L75
2469C42j39j21k75J41K40j65r4q5r6j43L73j17J62L4r7L8n5Q6O4M3j59K01J26
2492C04l08O2J88K6j67p5r5J29K30m99K08J91j14j2m7m4Q3l8j62p7L36k23n3j73
2516c30K14Nr0J26j23j0rJ67m3K22J1k14J11j31R5L55l59J66j83K68k88K14n6
2539A18N7m29L7L24j67j99K45l3J85l97J43M7K36l30J24J78j51L34l78J60k44
$$ plain form
2376 145 256 168 -60 300 -286 -324 -355 -172 -136 -241 -19 -34 -64 -173 46 60 -208 -154 30 179 24 210 -10
2399 -10 -11 -83 -33 53 157 0 106 218 -206 52 -152 -101 -10 76 -128 -40 -200 58 -279 -119 -100 -309 29 -17
2423 -17 49 52 -73 -255 195 -71 124 117 359 145 -15 98 -275 -16 185 361 178 -183 103 -131 212 -255
2445 -255 -162 -114 -116 -273 -3 -77 -407 -170 -7 -271 -494 28 143 70 65 131 219 -81 106 145 234 221 -33 342
2469 342 203 82 -193 -52 188 23 -71 -156 -252 -395 -22 -139 23 57 -40 -2 -57 29 93 136 -23 178 304
2492 304 -4 58 246 272 105 30 -65 64 294 -205 3 194 80 68 21 -23 60 22 -140 -217 119 -104 -157 -330
2516 -330 -116 -111 -201 -75 -198 -208 -217 -50 -93 129 140 -74 37 -94 1 356 -3 163 -20 248 -40 174 118
2539 118 175 -254 -217 107 -60 -259 -14 -47 138 -259 -116 -69 167 -163 -39 139 -12 322 -56 104 -140
2560a40K63l2m2K90p2l8k14O7j7j50l7K37jm5k15j05K23k81L20p2J15k22J02l0
2584i6J07j91L73j69K05m43K59J12P6Qj24R6j04L4N0j58j53pL98k25q0K49l94
2607a77J12K25j84J16l29K09j71J4J99k29J75o5jJ03M1k79N49J22k73k05K12K99
2629D63l52j7J92O4j91p8k45J64k45J61j30K63p4K3j3m15M09N9m9k08L70p3j60
2652h2M2J93m2P3K2o8j48j19J66K91k00j80K20j33n9k30N5J76L4k95n3r8k26O37
2676b4k2j72J19J3N2l19M03O9l02J22L15Qk36Q4Nj21r2J09L27j73k25L0K51k67
2700d6J55J85k92j45K6J04j05j6j25L68l63N3J48J31k49J10J07j71K38J38k8j04
2722A19j83K69n3j03k20J27J7P3K21j85j53j35L6R5K92j55J5K6l73K49R8j62j73
$$ plain form
2560 -140 123 91 49 339 267 229 15 82 65 -85 -122 115 114 69 -146 -251 -28 -309 11 -61 54 -168 -66 -96
2584 -96 11 -180 193 24 229 -214 45 157 233 241 117 213 109 143 193 35 -118 -125 273 48 -32 217 -177
2607 -177 -65 160 -24 92 -237 -28 -199 -185 14 -215 -40 -105 -106 -3 38 -241 308 430 157 -48 164 463
2629 463 111 94 286 350 159 81 -164 0 -245 -84 -214 49 -25 -2 -15 -430 -21 38 -11 -219 151 78 -82
2652 -82 -40 153 111 184 206 138 -10 -129 37 328 128 -52 168 35 -24 -254 -199 -23 11 -284 -337 -435 -661 -24
2676 -24 -46 -218 -99 -86 -34 -353 50 119 -183 -61 254 262 26 110 115 -6 -98 11 338 165 -60 -30 221 -46
2700 -46 109 294 2 -143 -117 -13 -118 -134 -259 109 -254 -201 -53 78 -171 -61 46 -125 113 251 223 119
2722 119 -64 205 152 49 -171 -44 -27 46 267 82 -71 -206 -170 -75 217 62 77 103 -270 -21 77 -85 -258
2745b58J85J72j26K09m05M14l82L83j37L00q0j36l17q1K95%k4Q4k00k30L59r5
2767g0L9J45k65K4O1om2J13j36Q6L9J90p9j04k19J11J20L25k76R2j37l11N50J07
2791C57j60q5O4j88K4Q4l4j5k51J16r9j25M8N2j39M3L19l5K15n8k39Q9j02J75
2815E6K7K45k56j30P5Q3M9k8j61n9k72N95o4k90QP9O2j45L50k02K42n95K40J70
2839G9r5k08L79j02j96j06K71Q7p3P0k72M79k9r6J19l44L29M9j94m2j74l9J9J38
2863D9J29k13p3O8n0mK3o9KO4mJ26j08J2Q3j82L93l33J85N6o1j14J23j05J81j61
2889A7J33N2k96R3j6L7k86P8L48m05L14j63l7J99l08L61j33K34k98m9ln6K50n
2913F1J33j54l3m8k02J66J22j1j87N35k04j96Q9l19K90j31pJ20j03j10o0K19L6
$$ plain form
2745 -258 -73 99 -27 182 -223 191 -191 192 55 355 275 139 -178 -259 36 36 12 96 -104 -334 25 -70
2767 -70 -31 114 -151 -127 -66 -72 -114 -1 -137 -51 -12 178 99 -5 -224 -113 7 332 56 148 11 -300 250 357
2791 357 197 112 176 -12 12 96 62 47 -204 -88 -187 -312 -264 -212 -351 -308 11 -24 191 133 -106 -17 -119 56
2815 56 83 328 72 -58 17 100 149 121 -40 -99 -371 224 160 -130 -122 -43 19 -126 224 22 264 -331 -91 79
2839 79 -16 -224 155 53 -143 -249 22 109 36 106 -166 313 284 188 307 -37 292 341 147 105 -69 -108 -89 49
2863 49 178 -35 -108 -40 -90 -94 -71 -140 -138 -74 -78 48 -60 -48 35 -147 246 -87 98 154 93 -21 102 -3 178 17
2889 17 150 202 -94 -1 -17 20 -266 -188 160 -245 69 -94 -131 68 -240 121 -12 222 -76 -125 -128 -184 66 61
2913 61 194 40 7 -41 -243 -77 45 34 -153 382 178 -18 71 -248 42 -89 -96 24 -79 -189 -249 -30 6
2936Fn8r5M6K01j37L72m73M34l10l67N49k76J68K20l44J49JJ10n03K43K15Ql38
2959a79L26j97Q8j66k5M2J70q0j47O6R5K06k49o5j74L11l7k06L17J14J37n78M04
2982A73O2m15J57Q1P0n7k03K21L4j84K08j68J79j15j25J48k05q3J71j03L43j29
3004F0k6k3k28K77J4j93l8L86K14m45J5J69r4j60l6J04J38J11k95q7K01k18Q9
3027f5o3J54n1j64Q0M2J77l80L72J00j50j91M2j45K29K28j20l6K75j82l8j5j15
3050a6K14k50K86j0j86p7J54k63K14k13j26R5K55j43R4l9k80J33p0K37J63J24
3072B96j63k32L04k16j7j02J36J25J53k79N1R9k75K29O9k52O3P0m56L39n3K5j1
3095i7P7k11L12M8k21M1J38KP1j06J02k14m0K69L91l26j72K17j02j21l58K96J41
$$ plain form
2936 6 -52 -147 -101 100 -37 335 -138 296 -14 -381 168 -108 60 280 -64 85 86 196 -307 -64 151 159 -179
2959 -179 147 -50 38 -128 -153 -111 59 -21 -168 -102 -7 199 -50 -115 -289 22 -15 -221 96 210 347 -231 173
2982 173 235 -180 -23 58 128 71 -132 89 123 -61 147 -21 158 43 -82 66 -139 -222 -51 -154 189 60
3004 60 34 11 -217 60 74 -119 -157 229 443 -2 13 182 88 -72 -108 -4 134 245 -50 -137 64 -154 -65
3027 -65 -128 26 -25 -189 -109 -67 110 -270 102 202 52 -139 -97 -242 -13 215 95 59 334 152 114 99 -16
3050 -16 198 -52 234 224 38 -39 115 -148 66 -147 -273 -178 77 -66 28 -11 -291 -158 -228 9 172 296
3072 296 133 -99 205 -11 -28 -130 6 131 284 5 56 155 -120 109 178 -74 -11 59 -397 -58 -111 -86 -97
3095 -97 -20 -231 81 129 -92 -51 87 89 160 54 156 -58 -98 171 562 236 64 281 179 58 -300 -4 137
3118A37J80j29k83o6J59o4n9K57O8k80n7L6M8j34J80o2N6k6P9j74O8n5L06j00
3142H5K85k78r5M6k3K5l1K17l83J4L0L30l57J30r9J14K5l25j80L04M66m16L2J51
3166F7j19q7K62k97J35L22k4m9j14j66nO2K27N8j26m65J86J03N6J19k01j54K91
3189H1l73L46m52K21J54O7Q8j6M9j65j25L22n4J16k34k2j80J82p3M4j11J70k2
3212A3j0K12k03j00J80n7l05O79m86r8P4Q0jq2O8k58J19r7O13j70l21J47k5q1
3236a09j31M19j77N5J64K5m2k11K0j04m6L52j40L9j27k03JK2J54J64p2m3j11r
3260a10K04l82L54r2J73m47J21K75l94M82m9j98j11K74K98n09L21q9j59j36L02
3281A28j81J24j50p6J54m0J14j30m30K76R8j37L47J51n14m2J19K02r4R3L2k5K7
$$ plain form
3118 137 317 188 -95 -161 -2 -66 -125 132 200 -80 -137 -101 -53 -187 -7 -69 -13 -39 40 -134 -66 -121 185 85
3142 85 370 92 -3 43 20 45 14 231 -152 -138 -108 222 -135 -5 -104 10 35 -290 -470 -166 300 -116 -84 67
3166 67 -52 -139 123 -174 -39 283 259 210 96 -70 -75 -13 214 272 146 -319 -133 -30 26 145 -56 -210 81
3189 81 -292 54 -398 -177 -23 44 132 116 165 0 -125 197 143 259 25 3 -177 5 -68 -24 -135 35 13
3212 13 3 215 12 -88 92 35 -270 409 -77 -175 -101 -21 -22 -104 -36 -294 -175 -272 341 171 -150 -3 -28 -109
3236 -109 -240 179 2 57 221 246 204 -7 13 -91 -137 215 75 114 -13 -216 -215 -193 -39 125 53 10 -101 -110
3260 -110 94 -288 66 -26 147 -300 -179 96 -298 184 135 -63 -174 100 398 -111 210 121 -38 -174 128
3281 128 -53 71 -79 -155 -1 -41 73 -57 -487 -211 -113 -250 97 248 -266 -308 -189 13 -81 12 44 19 46
3304D6M2J29j80J47k8k05J48K70j10k78k02J99J02K7PJ5j39l83O24m4j58k03J7
3327a57O8L88m73M14k16j75L05L8j47kp4J27o7j57K64j83p2j24L00K52k53o2p1
3350g7n0l40L69J47k27J08q0K9K04k39K86q7Q6P2q6m9j86J27m1J66p5K66q7l71
3374a35K40k7o6L06j27j63k64J53L28r2Nk94j44K20p7L10k08j00j15J92p3K48
3396A17J69k59j17K08J65j75j28l3K72k07rR9l2l6k95K34K30m83J67J15O4k03
3418a37J0k53M78J34l79P1O6o4L1N3m08L49J81j3l10k9L30J22m3j73K52k73J14
3441A09k21J31k18K67l74K46K32j11Q0r5j93j25K51n8J80l45L24k06K32J16M6
3462B68n42K91L04m52K64M0k7o2j61O3K25k79j81J87MJ48r9R7j10j8o7j30J10
$$ plain form
3304 46 88 217 37 184 156 -49 99 369 259 -19 -221 -22 80 107 114 129 -10 -393 231 187 29 -174 -157
3327 -157 -89 299 -174 240 24 -151 154 192 45 43 -31 96 29 -128 136 -47 -119 -243 57 309 56 -6 -77
3350 -77 -127 -467 -98 49 -178 -70 -150 -121 83 -156 130 43 129 201 115 66 -120 7 -34 132 57 323 236 -135
3374 -135 105 78 12 318 191 28 -236 -83 245 153 158 -136 -280 -60 -137 173 -35 -135 -250 -58 -131 117
3396 117 286 27 -90 118 283 108 -20 -53 219 12 3 102 70 34 -261 -27 203 -280 -113 2 66 -137
3418 -137 -127 -380 98 232 -147 -76 -10 -74 -43 10 -398 -49 132 119 -191 -220 110 232 189 16 268 -5 109
3441 109 -112 19 -199 68 -306 -60 172 61 141 46 -147 -272 -21 -79 101 -244 80 -126 106 222 268
3462 268 -274 17 321 -131 133 173 146 84 -77 -14 211 -68 -249 -62 -58 90 -9 88 -22 -40 -107 -237 -127
3485a27L6K49l3m07K94oj64Q6L18k3j99J45j65n8k49O5N01j68r8K83n72K03k30
3508c19K92J01j47K85j90o8J13mp0k65K60j5P7j83L4M32m42k7J97k09L45k49K43
3531A91K8j23OJ86m70m8M14j69O4mK01m74P0j15J68Q4j37j21J75m4j6M7j97J99
3555h5l0R1J95j09M4j26k52L94j59K03q9m1J22k54L7o4K35k0M2q3L0m0j59nJ97
3580G4k34j7J31J41k70K20j36M4N2p0Q4O4K12l77J53K01j28J0J35k79j8K68k67
3603gL9M2j87o6r0J94J06j28q4l9M2J19n1L%J98j3K55l49J02k67K46N5Q3ml39
3629a40J14K45q4j96o6J78K2m42L36o0j40J26K51p0m8O8k78j3K27j96J94L2k18
3652a58q4m6K26J03o0k77L84R8k13J24J9l7n7Qj60j17L30j94N6J31j34K47k39
$$ plain form
3485 -127 -91 158 125 -282 12 6 -158 -72 246 223 24 169 4 -54 -303 -238 263 95 -3 280 -292 -89 -319
3508 -319 -27 74 -73 212 22 -46 67 63 -7 -272 -12 -27 50 -133 -99 333 -109 -136 61 -148 197 -52 191
3531 191 219 96 102 288 -182 -230 184 15 79 75 276 -198 -128 -243 -75 9 -128 -249 -74 -118 -134 -87 -284 -85
3555 -85 -115 -24 171 62 106 -20 -272 122 -37 166 77 36 158 -96 -59 -123 112 92 134 51 81 41 -118 -123 74
3580 74 -160 -177 -46 95 -175 45 -91 -47 5 -65 19 83 295 -82 71 272 144 154 289 10 -8 260 -7
3603 -7 32 74 -113 -179 -269 -75 31 -97 -181 -220 -178 -59 -110 -107 -107 91 78 333 -16 86 -181 65 120 203 199 -140
3629 -140 -26 219 135 -61 -127 51 73 -369 -33 -93 -233 -107 144 74 26 94 -184 -197 30 -166 28 60 -158
3652 -158 -242 -288 -62 41 -19 -296 88 186 -27 97 116 79 22 30 -130 -247 83 -111 -55 76 -58 189 -50
3675e0q0n5j08J97J22j07m3j50N5J58n6L70n2j30j36O2O9j67Q2J4J10L36n02j97
3699b58p4L19Nj44K78m5k53K45j82J62j88J10J52m31J2o7N06K04l98j12K06j92
3721a45K05O0j53L22j90J46o4r9j80O2L26l28K54K6l52K24l75M04j5l7J99m37
3743a47J17P5l36L54p0P1j4k22K58o5n6R8j8j18R1J69J60k06k85r2L86j22J9l50
3767c03L97k57J37K03q2p5j04M0K41j60m2r3N9q5k66N35k58L78k50j1K16j27o
3790H7j79P5J54m2j98K54j93L72n14J23J18J30l06L8L13k18k03J37K62l92L45
3811A63pl16n3K25L02l20j4L2q4J41o6J16J67m13K01j70J29j62J04M8o5M6K1J25
3835A50k40K11p1k08l0K77k92K59l19J9K90r4j3J38j70j2j49M83k0k11k5N2K7
$$ plain form
3675 -50 -130 -185 -293 -96 26 -81 -124 -274 -219 -61 -117 253 201 71 -65 -3 66 -101 -19 -5 105 441 -61 -258
3699 -258 -332 -13 -8 -152 126 81 -172 73 -109 53 -135 -25 127 -304 -292 -359 147 351 -47 -159 47 -145
3721 -145 60 120 -33 289 99 245 181 82 -98 -36 290 -38 216 242 -110 114 -261 143 128 91 290 -147
3743 -147 -30 45 -291 63 -7 64 50 -172 86 21 -35 63 45 -73 18 187 347 141 -144 -236 150 28 47 -303
3767 -303 94 -163 -26 177 95 20 -84 -44 197 37 -5 -98 -39 -124 -390 145 -113 265 15 4 220 93 87
3790 87 -92 -17 137 95 -103 151 -42 330 -184 -61 57 187 -119 -81 232 14 -189 -52 210 -182 163
3811 163 156 -160 -213 12 314 -6 -20 12 -72 69 3 119 286 -127 74 -96 33 -129 -25 23 -42 4 25 150
3835 150 -90 121 50 -158 -188 89 -203 56 -263 -244 46 -48 -61 77 -93 -105 -254 229 209 -2 -27 25 52
3858E2j0P6m4L5j26l0j07J09R6M3J8l37L08Oj80J19J30k27j77J31L01j01j60L20
3882B45l91M6j05J12M3K07n3l0J6J52j03j87K34l05J1K87k60j55L64j95M22m79
3904a24KJ68q9J7M6n5J63N4l24O5L04%j44j32J35L8L1j37K14j92q6J72M3j05q8
3929b4N2n0k25M93l02J31j62K1j82K96k84K37lO6j10j34M06j80j3K93l28K8J22
3952A48q0J36j31K38k41k20J23k10K11R2J47p9k77J1J34o9L0J22Q2m02n4O7M15
3975A93l40J02J63j5j2j71K10j46q8L06J65k27O3p6R3r7l6K6q2n0O6k00P7M2j1
4000d5m6J50j09K50l19L22l36J5J55L2k47L25m8j53K95j53r7J26k9j41m4N2R9
4023E4k03j2L17l53L60m16O7l0N8L74j84Ql1n5q6J37j62l6L89j55P9N0p7k9J60
$$ plain form
3858 52 42 118 74 109 -17 -47 -154 -45 51 94 112 -225 83 89 -91 28 158 -69 -246 -115 186 85 -75 245
3882 245 -146 -100 -205 -93 -50 157 104 74 90 242 139 -48 186 -119 -108 179 -81 -236 128 -67 355 -124
3904 -124 -122 46 -43 -26 20 -35 128 182 -142 -77 227 227 83 -49 86 124 155 18 232 40 -46 126 169 64 -24
3929 -24 28 -22 -247 246 -56 75 -87 -66 -248 48 -236 1 -2 64 -46 -180 226 46 33 326 -2 26 148
3952 148 68 204 73 311 70 -150 -27 -237 -26 66 213 134 -143 -132 2 -67 -37 85 167 -235 -289 -222 193
3975 193 -147 -45 118 103 91 -80 130 -16 -104 202 367 140 203 127 220 123 87 113 31 -19 47 -153 -76 -34 -45
4000 -45 -91 59 -50 200 -119 203 -133 -118 37 69 -178 147 99 -54 241 88 -9 117 88 -53 -97 -45 54
4023 54 -149 -161 156 -197 163 -253 -186 -216 -158 216 32 40 9 -46 -132 5 -157 -193 196 41 120 170 93 64 224
4048B24m13K68N4k48J99l50K60J53j54P5JJ2o0k4j60J61J22o7j54J92k39P4K63
4071A89j2r4l6j54J63J64p1j20Q5q4L20k85K15m8j27k49L7L29j89J15j24k9J17
4094A12k96J09O3O6m3nJ30j39m3J48j63j47J34P0J15k66J9J82K40k99l2J92m3
4117A04J9l9k08L8J45k05J62l62J28M20m09J90j40l8K62L0P7q4l6j79J05j25J16
4140b9N3m7l0J78j12O5N4L23n14j19K76q5j24Q9J54j71Q1n7p7J11p2k4K70k0k86
4165a13P8m0j4o6K37p7QR2Q8j54j22J06k4O3n5M4L51m65Klr9J57j8j9j16J00J76
4192A17o8m8kj8M9j48K11m9lK48l40M0n3l8K97O6l23q8K43p4j46L11k68K46p6
4217H6j40K22l64J52M3L3k57J63K28m14K60p1p7J03J65k29L19j65p3l00L47j7
$$ plain form
4048 224 -189 79 133 -115 84 -266 -6 147 -7 68 69 81 21 -3 -163 -2 120 53 -101 91 -148 -74 189
4071 189 177 83 47 -107 56 220 149 29 114 30 350 65 280 232 105 -144 -107 222 33 148 24 -5 112
4094 112 -184 -75 -12 54 11 6 136 -3 -46 102 -61 -208 -74 -4 111 -155 -136 46 286 -13 -45 147 104
4117 104 123 84 -124 -86 59 -146 16 -346 -218 202 -207 -17 -157 -195 67 97 174 90 54 -125 -20 -145 -29
4140 -29 24 -23 -53 125 13 78 132 455 -59 -178 98 13 -111 -22 132 -39 42 -15 -92 19 -53 -77 193 173 -113
4165 -113 -35 -75 -89 -155 82 5 13 105 193 39 -83 23 -1 62 7 51 402 -63 -61 -64 -163 -6 -24 -43 -159 -59 117
4192 117 49 1 -1 -19 30 -118 93 44 41 289 -51 -11 -64 -102 195 261 -62 -150 93 19 -127 184 -84 162 86
4217 86 -54 168 -196 -44 -1 32 -225 -62 166 -248 12 -59 -136 -33 132 -97 222 57 -16 -316 31 14
4239A4J41J13j55K5j32k7m4J7J25k46J19J9j29m1K57j50k7K61j60K11l85K50N3
4262A09n7l5j39K04l16N7O4K97r9J78k56Qj86M80k2j90K6j76J72j82O7k69o7O60
4286C28k98j01J32k40K81r8M9K03j90j06j97J29j75M62Pj21J25m81R6J75p5J40
4308D5n8J2N0l02J67J63J16l25q5M5N62l94k11K26P5k09L5O9M6j88J95j03K55
4331A86N1j80k88J20j37M00j32LRp9K34J6k1j83M6j18L44l71J21j45J56j33N1
4354e0n8L2j69K65K6q2P5Ko5P5k71M36j42J12k85J49J79l06L47j36k3j55k2J41
4378G5j6l3j48J52l06J10J29N7J1P8p3r0Q8j32K00j21K20k15L8q9j64K82O4p5
4402D2p5K96l87L6J34J08j30J46j55n3J6P9j57J62j10J5m9N1K10l48K94j40l3
$$ plain form
4239 14 155 268 113 138 6 -21 -65 -48 77 -169 -50 -31 -160 -201 56 -94 -121 140 -20 191 -194 56 109
4262 109 52 17 -122 82 -234 -177 -113 184 85 263 7 15 -171 309 287 97 123 -53 119 -63 4 -265 -332 328
4286 328 30 -71 61 -179 102 4 53 256 66 -40 -237 -108 -283 179 186 65 190 -291 -195 -20 -95 45
4308 45 -13 -1 49 -253 -86 77 193 -132 -217 -172 390 -4 -215 11 86 -123 -88 -19 27 -161 34 -69 186
4331 186 237 57 -231 -111 -248 152 20 23 32 -47 187 203 182 -1 45 -73 271 -100 21 -124 32 -101 -50
4354 -50 -108 -76 -245 20 46 -36 39 41 -24 51 -220 216 74 186 -99 50 229 -77 270 134 111 -44 -66 75
4378 75 59 26 -122 30 -276 -166 -37 20 31 109 36 -54 34 -98 102 -19 201 -14 24 -65 -229 53 117 42
4402 42 -33 263 -124 -88 46 154 24 170 15 -38 -22 57 -100 62 -48 -33 -82 -31 179 -169 125 -15 -48
4425d8J65p6j48j24J75K42j69j04K26j39J79k84N4j38J50J4n0q6J81J04j45J05
4447H4k61J33j23K93j18k1k76K67l23L75q0J71K6o3%O2j52m3J00J90j61qk25L02
4471A49m24L49J88j89m4q0K16l14J00J75m6j67%L2M4J27m0K08m63L44o2k18J08
4494gk6lL32j79l11K68O2l47L80j47J15l84L79j1m5k52J48k4K3J5n8K71r0j98
4518h9n2P1j3J64j84J47q6K41m5k29j37J37J76q6q8jn6j3N5J36J36Jk39K88k10
4543B4M2j08l5J95k33L0k02J38K54j25j80K65j11k69L30n1M8J04m4q7k63K26J65
4566A13l22M15Jj94q1J55j17J28q9J84r5r8K85l03J35r8q9l7o8j84J95nK17R1
4590A39j7J3L1k46P6O7p0J09j03m4j5K2K25K5j59k88L74o6j14J46j59J00l9O8
$$ plain form
4425 -48 117 41 -107 -231 -56 186 17 -87 139 0 179 -105 -51 -189 -39 -25 -75 -161 20 124 -21 84
4447 84 -177 -44 -167 126 8 -13 -289 -22 -345 30 -50 121 147 84 84 146 -6 -49 51 241 80 72 -153 149
4471 149 -275 74 262 73 29 -51 165 -149 -49 126 80 -87 -87 -55 -11 116 76 284 -179 165 103 -115 -7
4494 -7 -33 -36 296 117 -194 74 136 -211 169 22 137 -247 132 121 76 -176 -28 -52 -29 -14 -72 199 109 -89
4518 -89 -141 -70 -83 81 -103 44 -42 199 154 -75 -212 -75 101 15 -73 -74 -130 -143 -88 48 184 185 -54 234 24
4543 24 66 -42 -77 118 -115 -85 -287 -149 105 -20 -200 65 -46 -315 15 -36 12 116 72 -15 -278 -52 113
4566 113 -209 206 207 13 -68 87 -30 98 9 193 98 0 285 -18 117 19 -70 -107 -175 -359 -164 -169 48 139
4590 139 122 135 166 -80 -4 63 -7 102 -1 -45 -60 -38 187 212 53 -235 139 73 -41 105 -54 46 7 75
4614G5l1m4j14K19p4j26J73L4j35p4j65M16j01J54j48P0m3k78K30K28k71k02L22
4637A15j89r9j79M52l0k23n3J61j56K46j07J71k03J20j0l9J86j8j74L0K62l13
4659e0j30K93n5J56n8p6k79J33l4n9L11l41K29o9q1J65k45Q6J99j09J10L1l33
4682b06o7L37j14J42p2M5n3J8l3J15p3mqJ27n3J16m89K27j64K54O5j33N5r7j06
4707a71L29j83q2J40J24k83K87j14k6m9j05L05j55l8j16K27J9p4q8K29j61J12
4729A27r1j45J77k08J38k1q4J63O0j64o7o1K61k95J72k6Q1j72p8J88J24j12M9
4752A6J40l68M15j15k79L25k28J3M59m65M8j10Q5L4r7K2J34l2J43k12K02j12p7
4775e9j0J60J42j82J53l26K16j61k70M21K51l90J66r7J2n1j2R6j79K31Q1l26N3
$$ plain form
4614 75 44 0 -114 105 31 -95 78 112 -23 -97 -262 154 53 207 59 129 86 -192 38 266 -5 -207 115
4637 115 -74 -173 -352 100 70 -153 -206 -45 -201 45 -62 109 -94 26 16 -23 163 145 -29 1 263 -50
4659 -50 -180 113 58 214 156 80 -199 -66 -100 -159 152 -189 40 -29 -110 55 -190 -104 95 -14 96 127 -206
4682 -206 -273 64 -50 92 20 65 12 30 -3 112 39 35 27 154 101 217 -272 -45 -209 45 110 -23 32 -65 -171
4707 -171 158 -25 -107 33 157 -126 161 47 21 -28 -133 172 17 -21 -137 90 109 35 -53 176 15 127
4729 127 36 -109 68 -140 -2 -23 -107 56 116 -48 -115 -176 85 -210 -38 -64 17 -155 -233 -45 79 -33 16
4752 16 156 -212 203 88 -191 134 -94 -81 378 -87 -39 -149 -64 -30 -127 -105 29 -3 140 -72 130 18 -59
4775 -59 -69 91 233 51 204 -122 94 -67 -337 84 335 -55 111 14 26 -25 -37 59 -120 111 192 -134 -81
4798h1J90p4j45K83j62j4m2P6q6O5q4l5J46j08j32K04L9l05K01p4o5M8K21r8R6
4823F4R2j53J30k12J99j32K51k91J09k36M4J49M6j77NN1K58j94l5N8k01L75j69
4846C1Q4q5K08j77j01J40k23K51m2Qk28J02l2J52L2J08j34j16j4L7P2j03R7l18
4870b51K52k7j51L33j79KK19r3p4K23m06J40n9n6J7J31j10J39l10J81J45l37J61
4893a10J55J58M1k56L4k21N6J54k7J34q6Rm90N65k5q2k4N1njK61l40J95j52j73
4918a79L92l8q3l53M79k77M30n34NK34j07K17l07k5J41M0k07Q6KN4J96l44K62
4941H4j47J08k49j60L55R0k81K61k55J24J43nk28K42J0KR3l72J28m7K40k30J08
4964A4k5R6j01j36mP1r1P3l56O55o0j49q3M7J50J60j73o5J21j06j32J3N01n39
$$ plain form
4798 -81 109 35 -110 173 11 -3 -45 31 -55 10 -74 -109 37 -71 -203 1 40 -265 -64 -138 -203 -155 66 -32 64
4823 64 156 3 133 -79 120 -12 239 -52 57 -179 -135 14 60 -117 -112 -61 197 3 -32 26 -175 200 31
4846 31 115 30 238 61 -40 100 -123 128 86 94 -134 -32 -64 88 120 228 94 -22 -36 1 73 -30 67 -251
4870 -251 1 -26 -177 156 -23 -21 198 105 31 254 -152 -12 -71 -127 -110 21 -89 50 -260 -79 66 -271 -110
4893 -110 45 203 244 -12 22 -199 -143 11 -16 118 32 41 -449 116 91 9 -15 36 31 30 291 -49 146 -6 -179
4918 -179 213 175 92 -261 218 -59 371 -163 -158 76 -31 186 -121 -146 -5 35 -172 -86 -84 -30 166 -178 84
4941 84 -63 45 -204 -364 -9 81 -200 61 -194 -70 73 68 -160 82 92 94 187 -185 -57 -104 136 -94 14
4964 14 -11 85 -16 -152 -156 -85 -176 -103 -459 196 136 -13 -96 -49 101 261 88 23 144 38 -94 -81 420 -119
4988a19m3M5K45k78R5J02j41m9J36R5j49J42r5m9j3k46L44N8j64J11j39K65k28
5011g5r2K24J76k14q0J32r2l7J71j67o2K84k7j42R7j9k10O7J50j11J00j87J16
5034BM7j98L28p7k95J18L86m18K33k79J32J86k61K17O2k68L32l82J74j55N1J48
5056H3pJ88k48K58q3k92K21j04j33P9j20J98r1M9o6L9K01m39K65r7K22k35L07
5079A95j52j97K25q2K39j31p0k1j38J0K12k5k07k56N09k10K50l22J27J16k22k53
5101d03N90j33J51k07J57k7j36j79L68P1l97kJ41l7M03m96K16j40j66M15j34j07
5123e2k3J66N7k18o5L54k80n1N6J28j96K59j26l21L70r4Rj78J69J2j3l00J46j53
5147c44M15j73J47J8j12Q1o9j1L0j80%J77j28J33N5q7%p5j0o9L76j42J49k46K27
$$ plain form
4988 -119 -162 -117 128 -150 -55 47 -94 -143 -7 88 -61 81 -14 -63 -76 -322 22 80 -84 27 -112 153 -75
5011 -75 -167 57 233 19 -61 71 -21 -58 113 -54 -116 168 141 -1 96 77 -133 -66 84 -27 73 -114 2
5034 2 49 -149 179 102 -193 -75 311 -107 126 -153 -21 165 -96 121 183 -85 247 -135 39 -116 -65 83
5056 83 76 264 16 274 191 -101 120 16 -117 -38 -158 40 -51 -2 -68 -29 172 -267 -2 -99 123 -112 195
5079 195 43 -154 71 -11 228 97 27 6 -132 -122 90 65 -142 -398 111 -99 151 -171 -44 72 -150 -403
5101 -403 187 54 205 -2 155 128 -8 -187 181 252 -145 -147 -6 -43 360 -136 80 -60 -226 189 55 -52
5123 -52 -75 91 148 -70 -135 219 -61 -112 -56 72 -124 135 9 -312 58 -36 -27 -205 -36 -24 -37 -337 -191 -344
5147 -344 71 -102 45 63 -49 32 -37 -48 -18 -198 -198 -21 -149 -16 39 -48 -48 -123 -133 -202 174 32 181 -65 162
5172A62k6j44O4j64J99M9lk75k5r0K51K76l52J79j7Qp9m5L1j02K72j25m01L78
5196B1j57M1m0O7Q9j18M6J67j0m6l91J81M35k78n1Q0kn7R9j25K37P7l16j10K39
5221G8j67L63k29j63P6J1o1k54L69J16j86K93m00K83j06p6j18J93J75j58J65m95
5243b91L02j04K58j61K14o7j26k15K15J5J52l96J17J73k18m5K02p2L1p7J02J80
5265A89l17L87k23j44J72l7J0N8o8j1O3R6l2q5k9J2k00J86j21J74j76J82k53J19
5289d8M6O0j43L10l20j7J42j09j8K71L3l20L64k58j27q5K50j97R6K05o4L09l03
5312G7q5k4j15K34K2P4j29j80p3J19J42k38K7Q6J13mj64P8m3K09J6k65P2L22k08
5337F3j49J06p3K44m00K39k08J57k9K80j29j07P9j23J98j39N4J79k55J94k85j33
$$ plain form
5172 162 136 -8 56 -108 91 140 137 -138 -163 -253 -2 274 -78 101 84 92 13 -32 -1 -103 169 44 -357 21
5196 21 -136 -95 -135 -68 21 -97 -51 116 106 60 -331 -150 285 7 -44 36 34 -23 76 -49 188 265 -51 -161 78
5221 78 -89 274 45 -118 -42 -31 -92 -346 23 139 -47 246 -154 129 23 -53 -171 22 197 39 204 -291
5243 -291 11 -93 165 4 218 151 25 -190 25 40 192 -204 -87 86 -132 -177 25 -47 -16 -93 9 189
5265 189 -128 259 36 -108 64 27 37 95 27 16 79 175 143 58 29 41 -159 27 -94 80 -96 86 -167 -48
5289 -48 -2 58 -85 225 -95 -112 30 -79 -97 174 207 -113 251 -7 -134 -219 31 -166 -70 135 71 380 77
5312 77 -8 -32 -147 87 109 183 54 -126 -199 -80 62 -176 -149 -63 50 46 -118 -40 -83 126 142 -123 -51 271 63
5337 63 -86 20 -53 191 -209 30 -178 -21 -50 230 101 -6 73 -50 148 9 63 242 -13 181 -104 -237
5359b37N5L88j33j83K99l65K82k1M2r9M3N5j12K8n6Q0m0J06r0M1k24Q0J53j26
5383c4n2J12r4m7j40K41j09K88k28j14O3J00J23J41k66p0j58L04j80J97j7Nj87
5406a22r4J00K43Mk39J03p8l4K47J23j92O2n42K67K13r3J58P1l22l4M0J30j17
5429a06p6L52j31J64p3L0k18m3K61p8j23J80k00N0J45Lk6j69P6j66K39j71K10
5452A30ml31L43j40Pj72L10j42K94n09J24j18K85l23N6K67o2N3J43j44q1K2N8
5475F6M1j34j7O5k10Q2N7o1k6J01j56J72K19p0j91K6r3q1K62q4P3j50J87j01n8
5500h1J58k37O5K86j37J54m24K6K24j65m0J82j10l85N60m68J45L58j3Lj92k3K76
5523A62k21J1M1j44J61L2K50m12K00j03K68l45Q3j64J88K0j68R3J28l65J20R8
$$ plain form
5359 -237 -182 206 73 -110 189 -176 106 85 127 28 71 126 14 42 -14 66 26 132 42 83 -141 -61 92 -34
5383 -34 -86 26 -68 -115 -255 -14 -123 165 -63 -177 -114 -14 109 250 -16 -86 -244 60 -120 77 60 65 -122
5406 -122 -216 -116 127 131 -108 -5 -83 -117 130 253 61 123 -419 -152 61 -32 126 197 -125 -159 -119 11 -106
5429 -106 -182 170 39 203 130 160 -58 -101 160 82 -41 139 -61 -11 134 137 111 -58 18 -148 91 -80 130
5452 130 126 -205 138 -2 5 -167 143 1 295 -214 -90 -208 77 -246 -190 77 15 68 211 67 -14 8 66
5475 66 107 -27 -44 21 -189 -107 -50 -111 -137 -36 -192 -20 199 129 -62 -36 -129 -210 52 -32 41 -109 78 -23 -81
5500 -81 77 -160 -95 191 54 208 -216 -190 34 -131 -171 11 -99 -484 76 -392 -247 111 98 101 -91 -114 162
5523 162 -59 -48 -7 -151 10 42 292 -120 80 -23 245 -100 -17 -181 7 27 -141 -48 80 -285 -165 -67
5545f7j3l9J32J66j89k5j08%J9K14j2Lk45J5L29k59K27N4m32K52P5L3o9k1n3M9
5571C6J35k38l1o4L3K33r0l3j30K20l48K99J69l03M30l58J64k44J72J75k79J88
5593A36j49j03M67m98M35m85K03L17j82%r1k7k14J57j12O0m3On9L91m3k73J78
5616G1n2O6o4m85K52L96l00K19o0q7k17L10O4j6k57J73J69l42R9J21l9j37J34
5639A8P0k23K46j91j40J47J94j53J51k06l0K28q7j79N5L66k83R5rk4m6k7r2K14
5663I4r5j5J77Pj74j82L10k70J02j2R2k5j95L95k95m5M7R8j80K50L6J23j23m4
5687G6L9j07O1j91j5Q2k38L21k15J64N4l3J8m6Q5j69J23j7k87L66r0J96O5l99
5711a57J60J83j35m6QK1J0M2L5j25K3J17Lk72J17j68K14q5Q9M3k08L20k8o1j40
$$ plain form
5545 -67 -80 -119 13 179 -10 -35 -143 -143 -124 90 78 81 -164 -149 180 -79 148 202 -230 22 97 130 61 40 -13 36
5571 36 171 -67 -98 -162 -129 104 14 -19 -149 71 -277 22 191 -112 318 -40 124 -120 52 227 -52 136
5593 136 -13 -116 351 -147 288 -197 6 323 141 141 50 23 -191 -34 -146 -86 -129 -123 -182 209 166 -107 71
5616 71 19 85 21 -464 -212 184 -116 103 43 -44 -261 49 113 97 -160 13 182 -160 -61 60 21 -116 18
5639 18 88 -135 111 -80 -220 -73 121 -32 119 -87 -117 111 24 -155 -100 266 -17 78 69 45 -1 -28 -120 94
5663 94 -1 -16 161 168 -6 -188 122 -148 -46 -58 34 9 -186 209 -86 -131 -84 14 -166 84 120 243 120 76
5687 76 115 8 69 -122 -137 -55 -293 28 -187 -23 31 -2 16 -30 55 -114 9 -8 -295 71 -19 177 242 -157
5711 -157 3 186 51 5 13 34 44 86 121 -4 19 136 139 -133 -16 -184 30 -55 34 77 -131 189 161 100 -40
5736d0j52K96R7j5l78M05k90K63l87K9L64l97L45j84J39q2J83l69M5J91l0j77
5758a44K30m2J49k12jJ6k7n2J23j5J58m17L24m7j64K37k47K16k75J96m0r3j2p7
5782b16L25j20J0j55J33K6K54q5k82m1L88k78J54l50J54N5K9J57j52n8J97l27
5804a82k2K76l33K22l2l18N75j66j70J41o7L4M7n8k97L00m0M1O0M7jj11J15J72
5828B33q7j68q1L96l07K09k25j74J16P3q5K49n5p6j32Q5J08R4k7j34Ll12K08J3
5852g6M56l88K73k62j7L0P6j83K54r2n8J52k87N5J98k63N4P7K5k84N18j77j52
5875g1J21l30L42j72r8N5J0K48k4r6Ok20J67K30n2j73m6J94k67J07K04r1j87Q
5899a35K87r2j78P9j82L14M3l38K61j53L20j07j73J03j74K10j70O5J1p9L7K9k2
$$ plain form
5736 -40 -192 104 201 186 -192 213 -77 186 -201 -172 192 -205 140 -44 95 13 196 -173 -128 63 33 -144
5758 -144 86 44 193 -19 -20 -4 -31 -83 40 25 183 -234 90 43 -121 116 -131 85 -190 6 -34 -127 -139 -216
5782 -216 109 -11 -1 -156 -23 3 257 172 -110 -151 237 -41 113 -237 -83 -28 1 158 6 -52 145 -182
5804 -182 -204 72 -261 -39 -71 -389 186 20 -150 -9 -76 -42 5 -53 -350 -50 -90 -49 11 58 57 -54 61 233
5828 233 146 -22 -103 293 -14 195 -30 -204 -88 -15 -100 149 94 18 -114 -29 79 173 146 12 15 -297 -89 -76
5852 -76 380 -8 265 3 -14 16 92 -91 163 71 13 165 -122 -67 131 -132 -78 -1 24 -260 258 81 -71
5875 -71 50 -280 62 -110 -208 -153 -143 105 81 -15 -9 -229 -62 168 116 -57 -103 91 -176 -69 135 44 -143 -135
5899 -135 152 60 -118 -39 -221 93 136 -202 59 -94 226 119 -54 49 -125 85 -85 -20 -9 -88 -51 -22 -44
5922d4j07K36k48R6%n6K01l1j63J15j64N1K60l40K98l4j87K39j97P7P5M7O6l30
5946a40K12k6j25N8j53L41m1J16k00O2j27l6K45k76P1j33K89k97p4J28R8k01K47
5969C8k43L99l2j58j96J96j23K59k44K3j4M1K25k54K91j62M9k22J88k02K17k3
5991E3j08k9P0J64j27J34l09P8J91k22j75L88r0j56Q4N7K34l37L38k57l87L45
6013f1p7R3N4K17k17J62j76m9n2J27N6J6L1L8j40L22m43J1R4J65j36j17j08L06
6037A16l20J67J43lk34L13Q4l58J14J92p8o6K36q6j7l65L94j63q4j90K08J25o1
6060F7j13J13k52J48O3l11K15j08j3K80k12J47k23M66r0k15p3p7L03M7k18J61
6082A05o1J2j02j20M25k21P8k85K12Q3j8q7m4J0q0J24J27q9k21J70j18J47j55
$$ plain form
5922 -44 -151 85 -163 -67 -67 -123 78 47 -116 -1 -165 -114 146 -194 104 70 -117 122 -75 2 77 124 190 -140
5946 -140 72 46 -79 -21 -174 167 126 242 42 104 -23 -59 186 -90 -19 -152 137 -160 -234 -106 -8 -209 38
5969 38 -205 194 162 4 -192 4 -119 140 -104 -81 -95 -54 171 -83 208 46 95 -127 61 -141 76 53
5991 53 -55 -84 -14 150 23 157 -152 -74 117 -105 -280 108 18 -138 -54 3 237 -100 238 -19 -406 -61
6013 -61 -138 -45 9 226 9 171 -5 -54 -106 21 77 93 124 162 22 344 -99 -88 6 171 35 -82 -190 116
6037 116 -204 -37 106 103 -131 182 266 -92 22 214 136 70 306 220 203 -162 232 69 -15 -205 3 128 67
6060 67 -46 67 -185 -37 26 -285 -70 -178 -191 89 -123 24 -199 267 177 -38 -111 -188 115 162 -56 105
6082 105 44 56 -46 -166 259 38 116 -169 43 126 108 21 -23 -13 -93 31 158 69 -152 18 -100 47 -108
6105a08%P6o6mJ20N8J00j20m1L74l09k06R2M8k36N2R7M85m48j77K87K55k97j67
6129a35R8J48k63K65k74K11J30k05K52l70O6K91j77k59n8L26j36K7J26j91L93
6150B65k95k28K55r7K6J39j84K58n6M8k4n35M34j03J9j06K71j95J04J31k43J21
6172EJ12r6j4j78L90k36j16K82r3J3j64K60J17j34k03o0lnL08j88J06k45L09k31
6196f4j8P1n5J59j61O5n6L7l00L48R6J38j80Mj19J10M9q5Jj6J03j01q8j28M04
6221B14j67j7l6j75J09q1J54Mj02O6K22o1J2n3j46N3j55J45KK39k2k76l6M8J46
6246H7j53Q3O0L9j46N2O7m0j0j51J20n9l8L6o4j34L92l68L16l84L23r0K81l44
6270a25J08O4J24k15J47q6l6m9k3P1m9r1K36l8j06o7L50k75q4J37k75M12j33j20
$$ plain form
6105 -108 -108 -32 -98 -102 18 76 176 56 15 389 80 -126 -34 14 -222 -170 -73 412 -36 -213 74 329 32 -135
6129 -135 -37 111 -152 113 -161 50 180 -25 227 -143 -77 214 37 -222 -280 46 -90 -63 63 -128 265
6150 265 -30 -258 -3 -100 -74 65 -119 139 83 131 107 -428 6 -97 -78 -184 87 -108 -4 127 -116 5
6172 5 117 21 7 -171 219 -17 -133 149 56 69 -95 165 282 148 -55 -115 -118 -123 185 -3 103 -142 167 -64
6196 -64 -82 -11 -66 93 -68 -3 -59 -22 -322 26 122 260 80 84 -35 75 124 39 40 24 127 26 -62 -190 214
6221 214 47 30 -6 -181 -72 -153 1 5 -97 -31 191 130 142 89 -57 -4 -159 -14 -12 227 205 -71 -107 -59 87
6246 87 -66 17 77 116 -30 22 89 49 39 -112 8 -51 -89 -53 -117 -251 141 -227 89 -295 28 -62 219 -125
6270 -125 -17 47 171 -44 103 17 -19 -68 -91 -20 -69 -160 76 38 -68 -135 215 -60 -144 -7 -282 130 -3 -123
6294a23r4Q7j22J13K16j42l9K37R6j17l03K04J39j15k3K8m7l48J88K00n2oJ84
6317A61m3J53m65M10q6j13J22p5l8l1K42l55K84J32j62N9r9k07J55j87L62k43
6339b4j17q1J66K19k64J59L4l7K31l16J8j15qJ89J6n8O9k9k53o6J98K19l03N9
6363i4K92l15O6o1j39M17l25K02j09J42J47k09P1j20Q0O0Ln7j28J5N1j06J71J63
6387B17k06k13K31J01K8k65K12n6q0R6q9M5l8K0J82l2p4j93K52j24m7j05j7M31
6411B76k19j06n4K57j28J43k61J57k13l9J93j01j62K51l8q8L7%mJ55j19K69l07
6434a01L02r8m9k47J12m7k3J82P7j55R0M1j46L2j15L28l9j62J84j80R5l04J85
6457c8L3k31L8K07K52k59O9l0l7p7J92R1k15K24j63o5n0N3j42O2M0O9j08Q1j58
$$ plain form
6294 -123 -217 -130 -252 -139 77 -65 -104 133 229 112 -191 13 152 37 14 42 -5 -353 -165 35 -17 -23 161
6317 161 118 271 -194 216 130 17 139 64 26 -5 237 -118 166 298 136 195 96 -111 44 -143 219 -24
6339 -24 -141 -222 -56 163 -101 58 92 55 286 -30 -12 -127 -135 54 70 12 81 52 -201 -267 -69 150 -153 -94
6363 -94 198 -117 -51 -112 -251 166 -159 43 -66 76 223 14 85 -35 45 105 108 51 -77 -62 -11 -117 54 217
6387 217 11 -202 29 130 158 -107 105 49 -31 65 -24 21 -17 3 185 153 79 -114 138 14 -33 -138 -155 276
6411 276 57 -49 -103 154 26 169 -92 65 -148 -187 6 -95 -257 -6 -44 -132 -95 -95 -99 56 -63 206 -101
6434 -101 201 103 54 -193 -81 -128 -151 31 108 -47 43 84 -62 -30 -145 183 144 -18 166 -14 81 -223 -38
6457 -38 -5 -236 -198 9 261 2 71 41 4 -73 119 210 -5 219 56 -9 -59 -6 -148 -86 -46 23 -85 -4 -162
6482a62j4J03N8j45K36j53q2q6K81q4P3j32K44k90M7J93j71J22R6j67L7K88k70
6505B2n8L18%J1k62k65J88o0M27l16k1k52K6K21Q3j07O3k9l2O4P2k29J24J8r7
6530i1K93l15J08O9p9n0J63j70kK44j31Q3q9k72L6J06J86n1j63J67r7K61m31K35
6554A0j95m7J08J50k07J64J54MJ7l70M41l42r2R6J92r8kk93K38j69K48J20j42
6577a5j32K66k54K49j34R3j38R3l18L88K21m10PL2L4M2m1j43M57l21K08l3K3j97
6601b3m12N56k17Q2J64Q5k42J2j18J12M9j83L40k26K56k78J03k6l9j73J60j55
6623a73J93k9R8o5k08P8R4L6L4j77K76R5j58j52J86j28J86k41j1Q0j03L06m54
6646b37O1P6l0L9J53j25k5j3L0j18J30Joj9P6J86j74j06N1k2j01K22j15p8J95
$$ plain form
6482 -162 -176 -73 -15 -160 76 -77 -159 -245 36 -48 25 -107 137 -153 -106 87 -84 38 134 -33 4 292 22
6505 22 -36 282 282 293 31 -234 -46 -106 321 5 -16 -268 -242 -21 62 -45 18 -11 -43 21 93 -136 -12 6 -91
6530 -91 202 -113 -5 64 -15 -65 98 -72 -74 170 39 122 33 -239 -203 -97 89 38 -125 42 -55 206 -225 10
6554 10 -185 -232 -124 26 -181 -17 137 141 158 -212 229 -113 -205 -109 83 -15 -17 -310 -72 -241 7 127 -15
6577 -15 -147 119 -135 114 -20 73 -65 28 -290 98 319 -91 -84 -52 -18 24 -17 -160 297 -24 184 151 174 -23
6601 -23 -435 121 -96 -14 150 235 -7 5 -113 -1 48 -135 205 -21 235 -43 60 34 -5 -178 -18 -173
6623 -173 20 -9 89 24 -184 -106 -12 24 58 -119 157 252 94 -58 128 0 186 -55 -66 14 -89 217 -237
6646 -237 -176 -100 -130 -91 62 -63 -88 -101 -71 -189 -59 -58 -64 -83 -7 179 5 -101 -50 -72 -173 49 -66 -144 51
6671E1l3l7Q7j18N9P8J25l67J94j59K4L39Kl66j2K90k96L3L31k65P8P3j66J00
6695D5j78L69n29J70L13K0j46j06J95l34L92k42jO5J28j36k86N09k45K11k70k03
6717b59N26j20k37J59j54M9r9P7m1p2K35R3j82J36j43J52j9m8J3j7L0J2j76l1
6741a16j10J82n8K46j76J07N9Lj23J2J11l22L71r9J02l09Q7k9J7K82k73J02j55
6764h9m2Q6L6P0k02J28O2k09J82m2l3M1Nk3J5o8j6l8J24M3pj2M6o2o5K1J90j63
6792b2M8j15k3L70j88M3lk0k1l07J45J01k26L82k83L37k67L7P4j27k95K92J46
6815G8o7m4l7J65q2k2p4l5J03p6K26k33J26j3jM1o4O5l2k25K18m1J51k87L44p3
6841A11k62L38L4k70O6k64K99k8j11k9l0L02l09K73m3l5p4L18r0j11r3p0o9K13
$$ plain form
6671 51 18 -19 68 -50 9 87 212 -155 39 -120 -96 243 245 -121 -133 157 -139 -106 225 -40 38 111 -55 45
6695 45 -133 236 -293 -123 190 210 64 -42 153 -181 211 -31 -32 33 161 25 -261 248 3 214 -56 -259
6717 -259 267 147 -90 69 -85 -36 -135 -58 -99 -171 64 157 -25 111 -32 120 101 53 66 49 79 91 -85 -116
6741 -116 -226 -44 -102 144 -32 75 134 137 14 26 137 -185 186 87 189 -120 -33 -62 -45 237 -36 66 -89
6764 -89 -131 -45 -9 61 -141 -13 49 -160 22 -20 -53 -12 -7 -30 -15 -83 -99 -137 -13 30 23 11 57 -5 -70 -49 141 -22
6792 -22 26 -89 -112 258 70 113 110 90 69 -238 -93 8 -218 164 -119 218 -49 -12 62 -65 -360 -68 78
6815 78 11 -33 -70 95 13 -9 -83 -118 -15 -91 135 -98 28 15 14 55 -9 56 24 -201 17 -24 127 -160 184 111
6841 111 -151 187 221 -49 17 -247 52 24 -87 -116 -146 156 -153 120 77 42 -32 286 196 85 -8 -78 -147 66
6865F6J1N7l27K73k08K03p8k2k14K0K57j1Q1j7j01M0k6j59K73J47k51Q5j74L04
6889B29Lj87J48l77L30l94K85R6k02r6j63K41K65l28J20M6M6M7k49M9J56k5K63
6912C03k97P2p5k6l3N2J18k23K61j48r1J6p1K29r1K4n0J75k7j31J6J3p8K06l93
6937b49J68N1k22O91n69o5K62k27L50mm9l24L9K51k47J54L29n16L18j24j40J02
6959b1r4L27k82J99j65J30j08J45k1k65J55q2J88k2J31k50L61l59Q3J15l31M09
6981B43k35K08P1n4k83N8n7K8Q9J58j41j00o3p8P7j14J48l0Q5j79K14J5l2Qk46
7006b10K82l05L98j39Oq7J94r1l8J37k20O1j29K47j37M7L2j34K54o7n5j68Q5K31
7030A94l31J38j04n4J93K43l74q3l7J82N2j14K24n3K05o1k15j49J81j48N8m2L46
$$ plain form
6865 66 77 134 -193 80 -128 75 -3 -25 -239 -219 38 27 108 91 -10 30 4 -155 118 265 14 99 -75 229
6889 229 232 45 193 -184 146 -248 37 133 -69 -165 -328 -87 178 -150 -30 16 62 109 -140 -91 65 40 303
6912 303 6 78 3 -23 -56 -4 114 -109 152 4 -87 -71 -142 87 -4 20 -30 145 118 -13 3 16 -62 144 -249
6937 -249 -81 -30 -252 439 -130 -195 67 -160 190 186 137 -187 -148 103 -144 10 339 -177 141 17 -123 -21
6959 -21 -115 212 -70 129 -36 94 -14 131 110 -155 0 -82 106 84 215 -35 326 -33 50 165 -166 243
6981 243 8 216 287 233 -50 8 -49 -21 68 226 85 -15 -78 -156 -79 -193 -45 -75 10 -169 45 60 28 36 -210
7006 -210 72 -233 165 26 32 -55 139 48 10 147 -73 -12 -141 106 -31 16 48 -86 168 101 46 -122 -37 194
7030 194 -137 1 -103 -157 36 279 -95 -178 -215 -33 19 -95 129 76 281 220 5 -144 37 -111 -53 -95 251
7053B51l11J7J05j07K7n3J19J20j33r8J10O2j50J8Q7Q2o9j57k4J7M17l87N7J5
7077A5j85J74p6J6Q2r7J14k96N6K22K47k76o3K1R3o9k12J22K25p3npJ47k41K05
7102A39n9j51J43j95K60j34K18l82K98k53L41m9o0j47K78k50l73L66J1k55Q3L76
7124B05m7k90K72j41L2l18K6L50k07M7R4k8K7o2j81K97k2N7k68J58k62L72J60
7147B71m56Kj0j13K56L9M8qQ5LQ1k98J35L8K36m52J34J77k19J83j24j78lL0J89
7172D6J10p1r2QM0k09oJ74ql3k27K31o4J98j03r5K02p4k77j11J82K21j57K16J35
7197B36l00j42K00k11K45j15K89j09j91K51k26R4J17o2m4M1k6j15J79k15j81K88
7219Cl1M2k38L70Rm15K06K48k04J5oj03l8L3J66j26J2Q9m1J04n3J91k93n3OO0
$$ plain form
7053 251 -60 -43 62 -45 -18 -71 48 168 35 -63 47 109 -41 -23 64 146 77 -80 -104 -87 330 -57 0 15
7077 15 -170 4 -72 -56 26 -71 43 -253 -197 25 272 -4 -67 -46 47 -22 -234 -112 113 40 35 28 175 -66 139
7102 139 80 -71 72 -123 137 3 221 -161 137 -116 225 176 116 -31 247 -3 -376 -10 1 -254 -171 205
7124 205 158 -132 140 -1 31 -287 -261 89 -118 -71 23 -5 22 -40 -221 76 54 111 -157 1 -261 111 271
7147 271 -185 -183 -193 -306 -50 -11 37 29 114 117 198 -100 35 73 309 -143 -9 168 -51 132 8 -170 -173 -143 46
7172 46 156 85 -7 1 41 -168 -174 0 -8 -41 -268 -37 -101 97 -6 -101 101 27 -250 -361 -179 42 -115 101 236
7197 236 -64 -206 -6 -217 28 -87 202 93 -98 153 -73 21 138 76 32 73 47 -68 111 -104 -285 3
7219 3 -28 14 -224 146 155 -260 -54 194 -10 5 -1 -104 -142 -109 57 -69 -57 32 -9 95 42 233 -60 -113 -107 -47
7245d7r3J98L23n28j8Q3L01j5p0k39J9k7K20l33M58l93K51o3j69J47j25K69k07
7268e8J93j47qK08k45K8K2LJ5M3J45m03K61j63o4K85r8m41K93K46j73pO0m5J2
7293c8N4j45K31r8p2J42l36K91M1j51n1M8J32P3J40k79p0J42Q9n3k06J54k11J97
7317B4j3k99J55J5O4k5J43m3J7l51J57j41J34L99k91L23j62k05K84j0j61P8l28
7340b36L72n1j52J0M1l7J94j86P6o4J17l56M73k20k6L37n11K84P0m4n00O43j00
7363A34r0O5l26M50j59K07n49K05J96L5l37L91l07J01K10k87j80J23K48j93j45
7384b08K00l0J12j94J81qj10m9J40r5J0J71k12P4j8K06j98J7J45l02K25k01K77
7407A33p0K16n23L30p7j49l2L29o1j23j02J22K0l59K79K65l92J36n1J13R4L3j52
$$ plain form
7245 -47 -140 58 381 -147 -165 -82 219 204 134 -105 -86 -113 107 -226 232 -161 90 27 -142 5 -120 149 -58
7268 -58 135 -12 -20 188 -57 -29 -7 -4 11 54 199 -204 57 -106 -170 115 17 -424 -131 115 -58 -65 -5 -50 -38
7293 -38 16 -129 102 4 -68 74 -262 29 70 -81 -132 -84 48 121 261 -18 -88 54 143 90 -116 38 -173 24
7317 24 11 -288 -133 -118 -54 -79 64 21 38 -313 -156 -297 -163 236 -55 268 106 -99 185 175 14 92 -236
7340 -236 136 85 -67 -57 -16 -53 141 -45 31 -33 84 -272 201 -19 -45 292 -219 65 135 91 -409 234 134
7363 134 44 109 -217 233 74 281 -268 -63 133 168 -169 222 -85 16 226 -61 -241 -118 130 -63 -208
7384 -208 -8 -38 74 -120 61 53 -57 -106 34 -61 -51 120 -92 -18 -36 170 -28 -11 134 -168 57 -144 133
7407 133 63 279 -244 86 9 -140 -172 157 96 -27 -129 -7 13 -346 -67 198 -194 -58 -109 4 98 131 -21
7430b1J29j10j16K18r2Q7j65J07J19J48l31J4j32K28lj01k63L88m7P6k61O1j35
7453b02J12J73l34L42j96R0l6J33N9J10o0l77K63o5m7MQ7J89l04j1K36j17j99
7476a50J38L45m12L42l11l6K03k00K13R0l83K40J56l03M5K28k04p3J45k89L79
7497A63J03m31K32j62Q1j4o3J26k17M9kK11j32o7R3J39O2k10K8J29j14r3Q4L18
7521C13jl11j84K66j49J4lK04r2l41L16J11M5q4o6k1J51j11l1m3k7Q6m7o9Q1k5
7547a8K59l16j09J35K7K6k61j0L29j04Q6J04j22q7J59K0J37n4k11M5J68J1j77
7570C7k11M23l62k1L04m17N22l98k9J30m1Q1J00k56q5o3P0K24l4l0N2J34j65j4
7594d9K73n2j33J48j71Q5n8O4M1j42R6l57J47O1J42j84J10J52k85J96j85p6K21
$$ plain form
7430 -21 108 -2 -118 100 8 95 -70 37 156 304 -27 -13 -145 83 80 -21 -284 104 57 133 -128 -67 -202
7453 -202 -90 83 -251 91 -105 -15 -51 82 141 251 191 -186 77 12 -35 -31 56 245 -59 -70 166 49 -150
7476 -150 -12 333 -79 263 -48 -84 119 -81 132 222 -161 79 235 -68 -23 205 1 -72 73 -216 163
7497 163 266 -165 67 -95 -14 -28 -91 35 -182 -133 -135 76 -56 -123 -30 109 171 -39 -11 118 4 -89 -5 313
7521 313 312 1 -183 83 -66 -52 -55 149 57 -284 32 143 188 104 38 17 168 57 26 -17 -44 42 -5 -74 7 -18
7547 -18 241 -75 -184 -49 -22 4 -257 -267 62 -42 44 148 26 -61 98 118 255 201 -10 35 203 214 37
7570 37 -174 249 -113 -134 170 -247 275 -123 -152 -22 -63 18 118 -138 -223 -286 -216 8 -26 -56 -4 130 -35 -49
7594 -49 224 172 39 187 16 101 43 107 148 6 102 -255 -108 -47 95 -89 21 173 -112 84 -101 -177 44
7617D4k60J57o5Q5J17j67LL96k22j03K77k19j9L24l15k9j07K04k79J95j6N4p3
7640a8J53K4j07k45J93j03J98j94m4K81j30l3kK91m62M79k4k1k44J66M2k78m0
7663a18P1O9o7R7N3p8j75K45j14o9J01rj59J48n9J4J60j08j15J01m7J41l26L80
7687A36l01L66r4j72J13k9L08m33j35L87j79qj8j93L61o0MJ0l4J04k79J40j2l65
7711c83N83q8j61L01k25r6p1J47P1k36J45L1K11j55j88j83K69J01r7o0J84OJ50
7734B56l31R2n4n5J05j50rL18n5j68j32J38r9J17N1J66kn69L33L18k41J84j82
7757C1N0j03j39M23j20k06J83p0j74K07K3k54N5K74L6l59J31k78L13O5l75J14
7779a73J2J47R0K64m99K24j54l7j2K07O1J51l11P4J22l67J27K44q2k02j2J73n6
$$ plain form
7617 44 -216 -59 -124 -39 78 -89 -86 310 88 -15 262 43 24 348 33 4 -103 101 -178 17 1 55 -18
7640 -18 135 159 52 -193 0 -103 95 -99 -143 138 8 -25 -27 264 -198 281 257 236 -8 158 200 -78 -118
7663 -118 -47 22 -45 52 105 27 -148 97 -17 -86 15 6 -153 -5 -64 -50 110 2 -113 -12 -59 82 -244 136
7687 136 -165 201 107 -65 48 19 327 -106 -241 146 -33 -41 -59 -252 109 49 53 63 29 133 -146 -6 -18 -383
7711 -383 200 112 -49 252 27 -69 -140 7 78 -158 -13 18 229 74 -114 -297 -28 73 -24 -84 100 106 256
7734 256 -75 17 -37 -92 13 -137 -146 172 117 -51 -183 -45 -144 -27 24 190 188 -381 -48 270 29 213 31
7757 31 81 -22 -161 262 142 -64 119 49 -125 82 105 -149 -94 180 216 -143 -12 -290 23 88 -287 -173
7779 -173 -161 -14 76 340 -159 65 -89 -126 -138 69 130 281 -30 44 166 -201 -74 170 88 -114 -126 47 -9
7802iM8j72k16M24R2M4k03j11J39J16q1l95L61K79j54j20q3N4L9n2K11j04O3l15
7826a45L2P1K15j45j01J3M7Pj8k06k7R4J64Q8m27N14p0j07J74j45j20J98j72M4
7850b2N5r3j51J33M52m53J05O7j28L6M3j58J7J81R7M9m31K27J2n3j61J27J13m2
7874B2k01K97k45NJ34p9k8J77O6k70J65l4O1j27n5K6j4O1N5L17l68n7R6r6Q9P3
7900G0J21j03l18J48Q1j26L2J97j66R3J78j77P6k51J17P0Q7Q6j73R9j01O2o6O1
7924I7O0k63L31j14o2j62R9l03K24j58K63m8N5q8O5n9JM6K33j05j52K87l32M2
7948d3j06K15J17j60NJ21k84J89R3m4J11j71J7k48K69j04J96q4j38M1k22L81o2
7971H9j03nJ19j51l44M42j2kN3j55M18m38M2K43j09nk28J16L9L0k0j13K14j55
$$ plain form
7802 -9 39 -133 -349 75 167 211 8 -103 36 152 71 -324 37 316 162 42 -41 13 52 0 211 107 170 -145
7826 -145 -113 -42 173 28 -73 -60 -13 -6 -24 -230 -257 -163 1 89 -338 176 106 -1 173 28 -92 106 -66 -22
7850 -22 33 -60 -211 -78 374 -79 26 93 -35 1 44 -114 -97 84 181 230 -201 26 38 -15 -176 -49 64 22
7874 22 -179 118 -127 -122 12 -67 -95 82 148 -122 43 9 70 -57 -112 -86 -100 -39 16 333 -35 -92 4 -92 -3 70
7900 70 191 88 -230 -82 -1 -127 -95 102 -64 29 207 30 106 -145 -28 42 129 215 42 141 40 102 36 97
7924 97 157 -106 225 111 49 -113 -14 -317 -93 -251 12 -36 19 -69 -4 -63 -62 -16 217 112 -40 247 -85 -43
7948 -43 -149 66 183 23 28 149 -135 54 147 103 214 43 60 -188 81 -23 173 89 -49 -8 -230 151 89
7971 89 -14 -19 100 -51 -395 47 35 33 86 -69 349 -89 -47 196 87 82 -146 -30 9 39 19 -94 120 -35
7995c5J11M7j72r3K83j26M1k94P9J54mJ0L2m9q1K57o6q8J36k73J08J83l84J86
8019c8Q8j86K9K10n36K42J66q7J48j07L04j37l3o8j94J67N9pj29J39j79K01Kk22
8043a68L07j04n3K47p7q2k66K12nJ27P7l28K08j94j69L02J9M9j04j9JQJ49o1j86
8068a10k05L35n4q7K93m50L49K24qk88K2K0k3O4k38k3L83j45J01j23J64R0k39
8091E2j07L0J9j39L01k23J40k49J96N9J67l70K22or5O5j22L9q0q3J55J83l27K77
8115A04J95j82j32j20K27l85K90j50K9J25rj09K10k15O9rj95J72K89l18J43J31
8137A60J34k15j90M7r9Q3K45m5o4q8O7O0j81J36k02l1J10M3L44l08R1q8J04l0
8161H3j08L20l56P6k08J62J21o8O2L40n17J01L80k76l7m0k19K92Ql85M02j26L3
$$ plain form
7995 -35 76 123 -49 -142 141 15 56 -238 -159 -5 -9 1 33 -16 -97 160 94 6 142 -131 -23 160 -224 -38
8019 -38 50 -136 -107 103 -433 -191 -25 -112 36 -71 233 96 63 -5 -199 -32 27 20 -109 30 -149 52 54 -168
8043 -168 139 35 -18 229 152 70 -196 16 11 138 215 -113 95 -99 -268 34 53 102 -2 -21 -20 -12 137 76 -110
8068 -110 -315 20 -34 -121 172 -278 71 295 287 -1 21 41 18 82 -156 -179 204 59 160 37 201 291 52
8091 52 -55 -25 -6 -145 156 -67 73 -176 20 79 246 -124 98 92 -3 62 -60 -21 -101 -184 -29 154 -173 104
8115 104 299 117 -15 -135 92 -293 -3 -153 -124 1 -8 -117 93 -122 -53 -62 -257 -85 204 -114 29 160
8137 160 294 79 -111 -64 -163 -80 165 120 56 -32 35 95 -86 50 -152 -183 -73 -30 314 6 97 9 113 83
8161 83 -25 295 -61 15 -193 -31 90 22 84 424 -93 8 388 112 75 35 -184 108 116 -269 133 7 40
8184D0k14J76j07J59o9mJ73
$$ plain form
8184 40 -174 2 -105 54 -15 -19 154
8191A54
$$ Imaginary data points
##PAGE= N=2
##DATA TABLE= (X++(I..I)), XYDATA
0@%%%%%%%qQqJ6j6K4l2M0m9N7p2Q9j13J37j62J94k28K68l14L68m29M95n68O50
31C47p43Q44r57J083j221J374j540J724j925K145k388K651k939L254l596L969
47B082m379M827n318N858o453P113p843Q661r581J0621j1810J3183j4793J6708
61H876j9030K1919k5627L0584l7589M8309o6936J08285l63672J90318O60040n46020
73I457l54087L16001K80020k91910j29772J23652O9854k9011J10275l7714k02011
84a35246J3897K85108m3380l25083K1922L66497K4076k78638n9787J47799J663
95A8828m2060M5776j1437p1596Q6416R0744j52939j35534J78585J38747j70746
106b5216j02816J70880O8138j25887k6769M1956n2116J7027J18734k8359j29353
$$ plain form
0 0 0 0 0 0 0 0 0 -8 0 -8 8 -8 16 -16 24 -25 32 -40 49 -64 73 -89 105 -123 145 -169 199 -230 265 -303 347
31 347 -396 448 -509 574 -647 727 -813 911 -1014 1131 -1257 1394 -1545 1709 -1887 2082
47 2082 -2297 2530 -2788 3070 -3383 3730 -4113 4548 -5033 5588 -6222 6961 -7832 8876
61 8876 -10154 11765 -13862 16722 -20867 27442 -39494 68791 -294881 -104563 555477 9457
73 9457 -344630 -28629 251391 -40519 -170291 -46639 23215 -5796 104479 66765 -135246
84 -135246 -121349 163759 120379 -204704 -182782 183715 207791 -70847 -130634 17165 18828
95 18828 -23232 22544 11107 -60489 25927 116671 -36268 -171802 6783 145530 -25216
106 -25216 -128032 42848 110986 -14901 -41670 286 -51830 -34803 83931 55572 -73781
117g3781M0228J14657o1412j11357P3727J05940q0860q0099J09376N1188j50164
128f2557l2414J66211o749j72163N8533J88333q0472j90517O5650J52123n8570
139B7408r5810P4062O1331p4697k8993N7489k0152n2176N7415N3049o5578l2832
151c9484P0498Q248p8555q72P2203K189m9131R975K9316l9076l1923N4443L2493
164D0324n5145j7443N6614R7n1981J0683L3300k3844q469L9717j791m2065P179
177a2824K9351k1814k1999L5130K6726l5035k1121K9103N472k5534J6979K5864
189C0298m1708l1988N6885L6377o4807l8510O1436L3873n6135k4161N5858K2197
201C9615m9442k3246K9351J5116q749l88m654j0271J6802J8320k3595k5226K3321
$$ plain form
117 -73781 -33553 81104 19692 -91665 -17938 88002 7142 -72957 36419 87607 -62557
128 -62557 -94971 71240 64491 -107672 -49139 139194 58722 -131795 -66145 85978 27408
139 27408 -68402 5660 66991 -7706 -36699 20790 638 -51538 5877 58926 -6652 -39484
151 -39484 31014 39262 -39293 -40165 32038 34227 -14904 -4929 24387 -14689 -46612 7831 40324
164 40324 -14821 -32264 24350 24447 -27534 -16851 16449 -7395 -15864 23853 22062 -20003 -12824
177 -12824 16527 -5287 -27286 7844 34570 -465 -21586 7517 12989 -12545 4434 30298
189 30298 -11410 -43398 13487 49864 -14943 -53453 7983 41856 -14279 -38440 17418 39615
201 39615 -9827 -33073 -3722 11394 2645 2257 -2397 -12668 4134 22454 -1141 -26367 -3046
214c046K5915j8527j5582K2363R334k9089j2012K2238O037j3411J1094J0641k7343
227a1388j3651L3891J2294l3636p013L3675M060k8811m028J8049m59j1870K348
240f539J0004M718J809n753j5551j075K2020Q011k2698q420K4623P017k8949o628
254a7411K7720L279k7574P0K5469j130j7692L839O446r441P17J4201l810j3479
268h796N305R003q175n641R355L739o050M59P133j755n881L052J902q924j280
283f554J5295L937j8878n947J8789K473j8312j56J6673j405j2532L301P806m220
297B70k799J806m385l72J0069P04j1236l56J1496R25q882J080P171j039o567J366
313g49M703k342m623K649K521n119J036Q777k790j0951L326R755n639q651O271
$$ plain form
214 -3046 22869 4342 -11240 11123 20457 -8632 -20644 1594 7631 -5780 5314 15955 -11388
227 -11388 -25039 8852 21146 -12490 -19503 14172 18232 -10579 -14607 3442 2983 -8887 -6539
240 -6539 3465 8183 9992 4239 -11312 -12387 9633 17644 -5054 -13474 11149 18166 -10783 -17411
254 -17411 10309 13588 -13986 -13916 11553 10423 -7269 -3430 3016 -6425 -5708 8493 4683 -8796
268 -8796 -3491 5512 -2663 -8304 1051 4790 -1260 -801 6332 4577 -1304 1748 3650 -5274 -6554
283 -6554 8741 12678 -6200 -12147 6642 9115 -9197 -9353 7320 5915 -6617 -3316 4490 270
297 270 -2529 -723 -5108 -5480 4589 5293 -5943 -6299 5197 6122 -2760 -1680 5491 4452 -2115 -749
313 -749 3954 1612 -3011 -362 2159 -2960 -1924 6853 4063 -6888 -3562 6193 554 -8097 -1826
328a826N406n093j206L572k304j885L163m03l119M741O734m587o950L052N571
343D866k776n942K142O645j502o474K161M575l358m222L612K269k199J611J517
358B925n997l980O248K549n208N50N650r26l041N51M3j345K862K384l448n16M718
375D019J463n495n171J430P375J918o910j730O478J304o008k654J181K270L676
390C146j272o626J204P286k239q614M96Q022M520k112n012k316K771L895q72n531
406c254O53O983L470o532o942K524P058N9o136j620N678M189m624p133m7N599
422g5L729k743o360R11P076R5n602M53K715q39J739L056n058l621O411M760n155
439A492p956J455J0966M790j1811q729J0126J1090o958j3070p23J1885R201q055
$$ plain form
328 -1826 3580 -1513 -2719 853 -1451 -3336 -173 -576 -3695 1046 7780 3193 -3757 -705 4866
343 4866 2090 -3852 -1710 4935 3433 -3041 -880 3695 337 -3885 -273 1996 -203 1408 2925
358 2925 -3072 -7052 -804 1745 -3463 -2913 2737 1811 -1230 -679 -636 -1981 881 3265 -183 -699 4019
375 4019 5482 -13 -5184 -3754 3621 5539 -1371 -3101 3377 4681 -1327 -3981 -2800 -530 3146
390 3146 1874 -4752 -3548 3738 1499 -7115 -6619 1403 5923 3811 -1201 -3517 -746 3149 2277 -3254
406 -3254 -2601 4382 7852 1320 -5622 -3098 3960 4019 -2117 -3737 1941 6130 1506 -5627 -5674 -75
422 -75 3654 911 -5449 -4538 2538 2633 -2969 -2516 199 -640 1099 4155 -903 -4524 1887 6647 1492
439 1492 -6464 -5009 5957 10747 -1064 -9793 333 11423 4465 -8605 -9328 2557 11758 3703
453C703j5398K716J6346N89j6021m366J4199J0876q690j5045K272J4738L380j0693
467a394o132O030P999r57p756l254M843N673R97o212n642M878Q192m588r090K801
483c612Q330P25p220p584L265J2191J009j0601j106O148l156k653O557K76n523
498b954M143O349o199r554K389J0822L209q168l561P032J748q475k959N088L133
513B043K395K739p491j1844M532J6634q10j8003r93J9886L054k0285p094J7115
527A878J0964j0279j3034L881J5538R43j5328m709J3048O457n962o651k368M491
541a131R256j819j0986o11Q646k00o902j661N383P235k618j1760k106J2422K843
556E991j0985j422J1534J702j0904j768Q943j962p240O881R022o492q188M062
$$ plain form
453 3703 -11695 -8979 7367 7956 -8065 -12431 1768 12644 3954 -11091 -8819 5919 9299 -1394
467 -1394 -7526 -1496 6503 5546 -2210 -5464 -621 5052 6049 -163 -5805 -927 7265 2677 -6413 -3612
483 -3612 4718 5443 -1777 -9361 -6096 6095 7104 -3497 -4603 1545 -1611 -4264 2293 2569 -2954
498 -2954 1189 7538 1339 -8215 -5826 4996 8205 37 -3524 3508 5256 -3219 -6178 -1090 2043
513 2043 4438 7177 -314 -12158 -7626 9008 8198 -9805 -10798 9088 12142 -8143 -15237 1878
527 1878 12842 2563 -10471 -6590 8948 9891 -5437 -10146 2902 9359 3397 -3254 -5622 -1131
541 -1131 8125 6306 -4680 -5291 3355 3155 -3747 -5408 -25 7210 4592 -7168 -9274 3148 5991
556 5991 -4994 -6416 5118 6820 -4084 -5852 3091 1129 -6111 770 9792 3300 -4888 -826
570h26K318l910J827N494l96n722j261K798m02l526L442O329n877q377P584P384
586F879q965o968Q853O071n182l867K126J784j712o72L683J881l564k036J867
601A78o92j758N010M686n040p852J685P469m98p638J909R771k809j1955o2J0438
617B842J357p878j880P976N820r028j0215P004J1040m006p260M896M763n814m647
632e030L892M609J03k020j814j540N5M439J568n682k771N364J471n345m65M764
648A598O76l863j539K383J921k173k113L369K143k255J88J215m186j686N871L595
664E144l185j701R97j749j990J547L367P74k176j841P74M81k549k06K293J275
680A255n48j147k45Q49j813j828J712L794J358k619l983J124M250O1l930J160
$$ plain form
570 -826 1492 -2418 -591 4903 4507 -1215 -2476 322 -80 -3606 -164 6165 288 -8089 -505 6879
586 6879 -2086 -9054 -201 5870 688 -3179 -1053 731 -981 -1653 2030 3911 347 -1689 178
601 178 -514 -2272 2738 7424 2384 -5468 -3783 3686 3188 -4450 -2541 7230 4421 -7534 -7596 2842
617 2842 4199 -3679 -5559 2417 8237 -791 -11006 -4002 7038 3032 -4228 668 5431 -383 -5030
632 -5030 -1138 3471 3574 1554 -260 -1800 -1745 2694 4262 -1420 -4191 1173 2644 -2701 -3166 1598
648 1598 2274 -1589 -3128 -745 1176 -997 -3110 259 2402 147 335 1550 -2636 -4322 1549 5144
664 5144 1959 258 1255 -494 -2484 -937 2430 3204 1028 -813 -39 442 -2107 -2313 -20 1255
680 1255 707 -440 -685 164 -1649 -3477 -1765 2029 3387 768 -3215 -2091 2159 2220 -1710 -550
696e50L723k265k450K419J050j467N88j077k010K533J709k330j829J489P39j98
712G4m70r01l87R11R17L22L66j195j669O77J108m92Q93K573m55l714l07K739O50
731A640j947O67J399o33k32m57j907L94J905m58j119N87P54j424o25L92K29J380
749E45m64j707M24J624L9r13N99m03o54J023J065j009O66J725j444k560J141K024
767A721p43j268k53J145R98j553j709m10K038K45o70J67P60l32j544n40R14J514
785D80O73j632n05K323r2k114lJ791N9l70L79q8k23k50n69p63Q85P17k58l69l2
806C9k81k30K37o91j59N27L96J11j75J48p35k70Q37j75L01J126K17j229m9Q03
826G48p4o01M39N81k61J05j62o32l85o47J85N21J46Q5o4n8j263m70J357J48m36
$$ plain form
696 -550 3173 908 -1542 877 1927 460 1048 -29 -2039 494 2203 -127 -1956 -467 272 74
712 74 -396 -1297 -1684 -773 144 466 832 -363 -2032 -1355 -247 -739 154 2727 2272 -1442 -1749 990 1640
731 1640 -307 360 1759 1126 894 437 -1470 -1076 829 371 -748 -161 593 -831 -1456 -1064 -835 545
749 545 81 -1626 -1202 422 461 -452 147 -256 -910 113 1178 169 835 2560 1116 -1444 -303 1721
767 1721 978 -290 -543 602 1600 47 -1662 -2072 -34 211 -459 -292 468 136 -1408 -1948 -1034 480
785 480 1153 -479 -984 1339 1247 -867 -870 921 980 610 989 901 678 428 -141 -904 -19 698 440 71 39
806 39 -242 -472 -235 -926 -1085 -558 -162 -51 -226 -78 -813 -1083 -246 -421 -120 1006 1223 -6 -55 748
826 748 674 73 512 1093 832 937 775 143 -242 -889 -704 -183 -37 48 -16 -74 -1337 -1807 -450 -302 -738
847g38N69J3j50L35L25o86n91J208P38j041J32J219K11j148p89R0M84O71l7m01
867D14m49L44r4j022q42R44J531n61j480N35O84k19j387L75J344L49j26J24Q0
886E44o12LL07o98N95J169j75q42k3M81j074l53J117O89j208o23J328M46k000
905i29j300J990J105j616m52J030L33o52k01q9K29J037J81p82m76J592N16j083
923D33j751J349J672r78j449J701O92k037q37J769l88j495Q21J273m31j537P09
940d84N87j334o04K182J77j101Q62P43j500j203J815M24q8K03P18n40n16p63P30
959C08P71q68J48P48r53j654J934Q71k508m81K405m79j372J002L39j061N53M35
977A38j308j23J525J185j120j477J942J443k808j892K872K078j972p73J861%k739
$$ plain form
847 -738 -169 -156 -306 29 354 -332 -923 285 1023 -18 114 1333 1544 396 -393 -303 181 852 815 414
867 414 -35 309 215 -807 -1649 -705 826 265 -1215 -680 4 -215 -1602 -1227 117 466 340 464 544
886 544 -68 -65 242 -456 139 1308 1133 291 268 749 -325 -678 439 1128 -80 -703 625 1071 -929
905 -929 -2229 -239 866 -750 -1202 -172 161 -491 -692 -781 -552 485 666 -116 -592 1000 1516 433
923 433 -1318 31 1703 725 -724 977 1669 -368 -1205 564 176 -1319 -498 775 344 -1193 -484
940 -484 103 -1231 -1835 347 524 -577 285 1028 -472 -1675 140 564 476 679 1397 857 341 -422 308
959 308 1079 211 359 1107 154 -1500 434 1305 -1203 -1684 721 242 -1130 -128 211 -850 -297 138
977 138 -1170 -1293 232 1417 297 -1180 762 2205 -603 -2495 377 2455 483 -290 1571 1571 -1168
994a168q92K938Q70k106j05J808j263j983R75L20r50K211J612l254q25K800p80
1011B08k992J182L639l7j984r35M77J192l34o26Q00O60j011P92o25j972J376K187
1029A997j163k500J063J401l67j872J47J791j52j066l56j32N7J491J134j571q07
1046i05J742r98j455J353J798P3k40j118q84m5N64P38M4m03k59J411j060k843
1064b487J178K342j333o49K293q77l359Q77L091m94j659Q14J264q26j684P26K654
1081A871l53j832j05L27K08J061k30j414O54J285r89j849M04J401P50j387l16
1098e14R86p5k599j4K165O80nM47j302j921O74J925J18q1K08L19n50j086q4R08
1118A99O41l03M20K31j263K80K07j416K41J700q9j399J73J48r17k00J181R85j044
$$ plain form
994 -1168 -2060 878 1748 -358 -463 1345 82 -1901 -926 -606 -1556 655 2267 -987 -1812 988 208
1011 208 -2784 -1602 2037 2000 16 -919 -442 750 416 -210 590 1250 239 1031 406 -1566 -190 1997
1029 1997 834 -1666 -603 798 431 -1441 -1294 497 345 -721 -1077 -1209 -1152 339 1473 -98 -905
1046 -905 837 -161 -1616 -263 1535 1608 1368 250 -634 -679 -115 623 667 264 5 1416 356 -2487
1064 -2487 -1309 1033 -300 -949 1344 467 -2892 -2015 1076 582 -1077 -263 1001 175 -1509 -783 1871
1081 1871 1518 -314 -419 -92 116 1177 947 -467 187 1472 483 -1366 -962 439 1189 -198 -514
1098 -514 472 397 -2202 -2216 -51 629 624 1071 -231 -2152 -1478 447 565 484 692 1011 461 -625 -709 199
1118 199 840 537 957 1188 -75 205 412 -1004 -763 937 848 -551 -378 -230 -1147 -1347 -166 819 -225
1137b25j057M62J172n79o5J286m18j349O3J538j17j48k1j50l79K40K29q3o99K97
1157cJ025K84j542p53O1p9M38J117K22l42p05r29n10J306Q01l54J15K6k37J00
1177D1j94N8M32J35ML59J6o52p85L00J086Om81m86m21k03N49M78M6m41q95m51
1199a499O09J126K90p61L01m2r97N73M36J85n1L73L32n56l98k53LP65N78j58j43
1220G13r9j097l00L78L42M67K03o75p35L69m03P9M04M80l88l16J033j95q05J53
1240c92M65l36N89M30N5o65M4J07K81k32R3k06n14R1M56L63o10m57N7l21j71R13
1262D0K99k15p21l22O59M6q9P00m8n19L34M29o21k65k3P27K14q1M06n07p63q5
1284d05N14K19n11M5K33q3o14M72Pm51o7L99J57k9K0j8k49j76L81K54j29r9O15
$$ plain form
1137 -225 -1282 -820 352 -227 -292 994 576 -773 -710 828 711 563 542 392 13 253 482 399 -300 -3
1157 -3 1022 1306 -236 -989 -928 -1007 -569 548 770 428 -277 -1206 -1716 -410 391 37 152 178 -59 41
1177 41 -153 -95 337 472 476 835 851 199 -586 -286 800 806 325 -161 -582 -785 -236 242 288 -153 -1048 -1499
1199 -1499 -890 236 526 -235 66 24 -973 -400 36 221 170 543 875 319 -79 -332 -329 436 1014 856 713
1220 713 614 -483 -783 -405 -63 404 607 -68 -803 -434 -837 -758 -354 126 -262 -578 455 260 -545 -392
1240 -392 73 -263 326 756 811 146 190 297 578 346 439 233 -281 -190 266 629 19 -438 -381 -702 -873 40
1262 40 339 124 -597 -919 -260 -214 -303 397 349 -170 164 593 -28 -293 -316 411 625 544 950 443 -320 -405
1284 -405 109 328 -183 -138 95 12 -602 -130 -123 -574 -641 -242 -85 -114 -94 -112 -361 -537 -156 98 -31 -130 485
1307D85j84k8J18K5k77l79P23M08n05J83l00m46n42N94L61n30j06K23M52j116
1327h41K1N64J11m60p2P57Rm06M83j64l28K42O09K0j81m48R70n22k63K11N24o36
1349B00l29L86K37n06l79J89k52o3j17Q14k3m78n3o8j84K59M59j36r4N05r6l93
1371a22k5L62J52j79N59k09L1k40j81K41l14k33K94L82o14m8L41r8o35q9N29m4
1393a40n2M5K7k46j37L69L17k51O3K23J52j17J86J10l10o9j68M22O6n2L8l84n53
1416d61j4L12K81l34J03L76l80l59P9j6k33Q38m03p3K46M30n37p7J18L41L45J49
1438G31m94M23j58o22j38N65j09J31n0K38n69j42J79l87O6J92L73k57k83j24m8
1459d83j1J64K27j4o0K60L3J30qj88MN76n04j92Q06J93r85m46R55r5n87m1K98
$$ plain form
1307 485 301 273 391 416 139 -240 483 891 386 569 269 -177 -719 -125 236 -294 -400 -177 275 -841
1327 -841 -820 -256 -145 -605 -677 80 89 -317 166 2 -326 -84 525 545 364 -84 886 364 101 312 836 200
1349 200 -129 257 494 -12 -391 -202 -454 -517 -634 180 157 -321 -374 -442 -626 -367 92 -44 -138 367 271 -122
1371 -122 -147 215 367 188 747 538 569 329 148 389 75 -158 136 518 -96 -144 197 99 -536 -625 -96 -140
1393 -140 -192 -147 -120 -366 -503 -134 183 -68 -5 218 370 253 439 549 239 170 2 424 490 438 476 92 -461
1416 -461 -475 -163 118 -216 -113 263 -117 -476 -397 -413 -646 192 -211 -284 -38 392 -145 -222 -104 237 582 731
1438 731 237 660 502 -120 -258 307 198 329 279 517 -52 -194 -15 -402 -336 -144 229 -28 -311 -435 -483
1459 -483 -494 -330 -103 -117 -177 83 116 246 238 50 54 630 126 -66 740 933 -52 -498 457 362 -225 -266 32
1482C2J58k13n1o3J44p82P8M21N58m97j35O94n28l83j48R97M81l15l17J21p4l42
1504a64N66l3k32L99j96k86ok12k93O26J95o45N3K12l03k76N90O9m21K04k37J35
1526b55K48J34k16L56j07l70m8N71J11j83K69j03j46m63K51L33J98n95L14P6j67
1547B08k79n07K54J40L94o30Q6L97n80j53O71k75M22K20k76j19K63k38m59R31
1567D70p2j96N3K95k86m9j41J42k13j83K36m77M58J9p1l47J76M7n72M9O30K68
1589B36m19L65j21m21n2N05K16p8l0O76n30n65J09J64J94J54J68l1k00j065L53
1610c72M07P9o8L30m57m60M7o3K64lK07Jk8Q8j44j5K92K70K51m23L5k1j82j47
1634a12N37K75l15j89n5k08J61K0J61j88l95m71Q6P17k48k42P15j05p88N52Qm42
$$ plain form
1482 32 190 -23 -74 -137 7 -775 -697 -276 282 -215 -350 344 -184 -567 -715 282 763 448 131 252 178 -164
1504 -164 402 369 137 536 340 54 48 -164 -457 169 364 -281 -228 -16 -319 -595 -5 64 -357 -153 -390 -255
1526 -255 -7 127 -89 267 160 -210 -258 313 424 241 510 407 261 -202 49 382 580 -15 299 375 208
1547 208 -71 -578 -324 -184 210 -420 -334 63 -517 -670 1 -274 148 368 92 -27 236 -2 -461 470
1567 470 398 202 255 550 264 215 74 216 3 -180 56 -421 37 56 -15 -362 -186 -139 -711 -662 -32 236
1589 236 -183 182 61 -360 -412 93 309 231 201 877 347 -218 -109 55 249 403 571 540 340 -725 -372
1610 -372 35 114 46 376 -81 -541 -494 -557 -293 -296 -89 -88 -116 -28 -172 -187 105 375 626 203 238 217 35 -112
1634 -112 425 700 385 196 141 -67 94 114 275 87 -308 -779 -693 24 -224 -466 249 144 -644 -92 -84 -526
1656e26K85M88J53l61k84K31k13O8M88K23k36j71J38k56m92M16O15r3o69l2K92
1677F4j66o1l51N19r5l09K93j91k1k16P31m34P3L57o9m47k9L96O45k52j60k22
1699E5l22K78L85J10l31l3k01r2j69k34O38mm57J95J15k35l90M76j31J45J55N47
1721E00m44m89J69L14J59q3L50L38j070K96N35k40m06L76k63J44n2o3K04n28k00
1742d53L75k0k54J22j12j1j07M71L58q12O8K48J7J5N58O2n30j49O7M63P1m1L32
1765G38k50m41J34L1l06j41L49O5k85M8P7k31m29M48M16k38j98P1J37k93j1L75
1787F6L3l07O4P9L27J11k15L3K0r8p1K23j60p2k00J15k79M0K20r8j29K68j12M4
1811i8l72K60j5j98K66L37k38j22M5O6J26l00O18o8j88q7L56k02j80O0J98m63
$$ plain form
1656 -526 -241 247 400 39 -245 -14 -227 -159 329 552 316 145 283 27 -465 -49 566 473 -196 -228 64
1677 64 -102 -163 -514 5 -90 -399 -106 -297 -318 -534 197 -237 -164 193 124 -323 -352 44 689 437 277 55
1699 55 -267 11 396 506 175 142 -59 -151 -320 -554 84 80 -377 -182 -67 -302 -692 -216 -347 -202 -47 500
1721 500 56 -433 -264 50 209 126 476 814 -256 40 575 335 -71 305 42 186 134 71 275 -253 -453
1742 -453 -78 -98 -352 -230 -342 -353 -460 11 369 -443 -375 -127 -110 -95 463 525 -5 -154 -87 376 447 406 738
1765 738 488 47 181 212 -94 -235 114 179 -106 -58 19 -212 -641 -193 223 -15 -213 -142 -5 -298 -309 66
1787 66 99 -208 -144 -65 262 373 158 191 211 113 42 265 105 33 -167 -52 -331 -291 -71 -169 -298 -30 -142 -98
1811 -98 -470 -210 -225 -423 -157 180 -58 -180 -135 -69 57 -243 375 307 119 32 388 186 6 66 264 -199
1833a99J51L82j79n1m69L49o9j03K6L64l94j23J68J25k43l3M15K1k37L68J66k93
1855A42m47J43L27P4m9M4n4N0n8Kr8k54O1L42p5l63K5J00k39O0K1P9L7j7nk40
1881c92j21N96%l03P9L67O8l1P6j41m9j24J97J36m0l17M22J24q61J03J96j52r7
1904b64J66K62l79k47K73K44l88J31L27O5k35l29L56P3q7jK00J18j40J19R9j11
1926B52k24k75K88r3J3p1L36o5lj85l10j23O18r7j97L6j04j78N0N31j86J1k7k23
1950b26O00l44M2o5J82j15L45j03j59n5Q0k67n1J29J82K44m60j87K52p6j50Q5
1972a17J7k27L19p5J57k70K2K50l74L49K21k22K23j15j12j82K70j25M05k36K86
1993D64q9j62k82l2O6Nk07K38r5k11L32l58j8L2L48k33rp7K03m5J12p9K17J32
$$ plain form
1833 -199 -48 334 155 104 -365 -16 -85 -188 -162 202 -192 -315 -147 -22 -265 -298 117 138 -99 269 435 142
1855 142 -305 -162 165 239 190 234 180 230 172 174 76 -178 -117 225 150 -213 -188 -88 -327 -267 -246 -167 -130 -147 -152 -392
1881 -392 -513 83 83 -220 -141 226 294 263 339 198 149 25 222 358 318 1 423 547 -314 -211 -15 -167 -264
1904 -264 -98 164 -215 -462 -189 55 -333 -202 125 190 -45 -374 -18 55 -32 -33 167 285 145 264 363 252
1926 252 28 -247 41 -52 -39 -110 226 161 158 -27 -337 -460 158 61 -136 -100 -204 -382 -332 199 13 24 -3 -226
1950 -226 374 30 72 7 189 74 419 316 157 102 182 -85 -136 -7 175 419 -41 -228 24 -52 -202 -117
1972 -117 -100 -327 -8 -83 74 -196 -174 76 -298 51 272 50 273 158 46 -136 134 9 414 178 464
1993 464 375 213 -69 -101 -35 -30 -237 1 -94 -305 27 -331 -349 -317 31 -202 -211 -288 -85 -130 -18 -97 120 252
2017B52j24j9L08J17l31n7J68k40j72K18Q0m4Jk85Qqj28J01J7P1K13j84k88Mk30
2042e52N13k86M05O4R8m6l63O7L37k15L14O3j27J31l95j14J9M31k35m07M48k51
2064a01l94M43k75J59j61J37M5r3R0Q4R9J7o9j63r6N63k70J12K17P3j35j18Q6
2087B50j90j69J26N22m51j93R7j95J73k15J75K14l01p0J90j56j51J22M11o5k08
2108h4q9L78j79k87L95J99j87K3j5l7m1J96q6k46J60Jl4k00K78j95o3K31j00k32
2132b14l1M3J10J14L8l36L62L4l57J99L0K63k30J29P7k82J78O1J05R4j52nl30
2155a00q5K16J29j13M3j1P3m17l03L58j43L89M4j14j46j10J26RP4j03K81O6j51
2178A2J7M19j91j18K5m3j06K26O2l01j68K30L22m38j35k1R6J50m1j88J46m13J32
$$ plain form
2017 252 128 109 417 534 203 146 314 74 -98 120 200 156 157 -128 -120 -128 -256 -155 -138 -67 146 -38 -326 -322 -552
2042 -552 -39 -325 80 144 242 196 -167 -100 237 22 336 399 272 403 8 -106 -87 344 109 -298 150 -101
2064 -101 -495 -52 -327 -168 -329 -192 -147 -240 -150 -66 33 50 -19 -182 -278 285 15 127 344 417 282 164 250
2087 250 60 -109 17 539 88 -105 -8 -203 -30 -245 -70 144 -157 -227 -37 -193 -344 -222 189 124 -84
2108 -84 -173 205 26 -261 134 333 146 169 154 117 76 272 186 -60 100 101 67 -133 145 -50 -113 118 18 -214
2132 -214 -245 -202 -92 22 60 -276 86 120 -237 -38 -8 255 25 154 231 -51 127 188 293 387 235 230 -100
2155 -100 -185 31 160 47 90 79 152 -265 -568 -210 -353 36 80 -34 -180 -290 -164 -155 -81 -184 97 163 12
2178 12 29 448 257 139 164 121 15 241 303 2 -166 64 386 -52 -187 -208 -112 38 -3 -191 -45 -458 -326
2201c26oJ38K30R9o3j17n17M71L09k23L17R2j72j58j52J35j41J33J32K86k72p7
2223A18K2l57M1L7K71k53k75L12Rj22q9K51M4k27k5M23k81N1J87K4KM6k2O5j14
2248A38R9K3j76k83L23j20j35J38J0Q4j30p6J74k56j82J00K44l16J20M9mJ23j10
2271a63J9K70Q4l3K33l53L8j96K36q4m7K33j82K62l82L21l00l45M02L3l89K65
2293g8k17J06J2j50K40k12K80k5J37p7k59J75n7K6J66K04O6j58Lok25k94L45P7
2317G9J35r8J1j87l30M25p5j85j92L25j36J9q3K45K5l2j32J32K65j00J05k20l57
2340c61L54J34n5j20L13Q7k61Q2o7O6k24J76J77j70k7j55M7K27n54k7L46k28J98
2363d2j17J46k61K34O2rj48K4m8K60N8L04m22j18K23J89j55k42K30q0K4m17K20
$$ plain form
2201 -326 -332 -194 36 135 72 -45 -562 -91 218 -5 312 404 232 74 -78 57 -84 49 181 467 195 118
2223 118 140 -217 -176 -139 132 -121 -396 -84 -75 -197 -286 -35 9 -218 -243 180 -101 -50 137 161 163 209 187 252 138
2248 138 237 260 84 -199 124 4 -131 7 17 101 -29 -105 69 -187 -369 -269 -25 -341 -221 -172 -176 -53 -163
2271 -163 -144 126 210 177 410 57 95 -101 135 51 4 237 55 317 -65 256 -44 -389 13 46 -343 -78
2293 -78 -295 -189 -177 -327 -87 -299 -19 -44 93 16 -243 -68 -125 -99 67 271 337 179 182 176 -49 -343 2 79
2317 79 214 116 127 -60 -390 35 -40 -225 -417 -92 -228 -209 -292 -47 -22 -54 -186 -54 211 111 216 -4 -361
2340 -361 -7 127 72 -48 265 352 91 173 106 172 -52 124 301 131 104 -51 -4 223 -331 -358 -12 -240 -42
2363 -42 -159 -13 -274 -40 22 13 -135 -111 -159 101 159 463 41 -77 146 335 180 -62 168 88 112 -305 -85
2386h5J08l03J06K71J07j80l19J86m14K61k2K74j22K31j26K28k45J48J66j73o4
2407C3J59j4l9j56K32k23J74j03K92l37l13K54j71K09O6j63j22L95l99L10k01
2428a17k90M29J33j15k33K98l15M15k87K90J0k10J00K18j8l8k93j0k7K6M2P3j85
2451a04o2j2o1J18n6K2k9K89k09R4l69M32M0j92P5J05J85n9j67j0J17k23J80l5
2475F9L00k13M3J90m19P2j62N5m9O5P8j95K26j76k13L4M1K17l0K7J03p1L86m66
2499h8L11O4k45K15k8J5l14J71J23l35K83j82L20r9r7%O2n9k33m4R4nj22k7R4
2524a26J14j84j1J34P9j72N46l84J68j24j59K57M3j4J33o8j42j54K88k92L1O8
2546C1J24K8k43j17J36j6j12J71J50l09j11M6j25K50j33J41L36k23K27j57JJ24
$$ plain form
2386 -85 23 -280 -174 97 204 24 -295 -109 -523 -262 -284 -10 -132 99 -27 201 -44 104 270 97 33
2407 33 192 178 139 -17 215 -8 166 63 355 18 -295 -41 -212 -3 63 -100 -222 173 -226 84 -117
2428 -117 -407 22 155 40 -193 105 -210 205 -82 208 218 8 108 326 308 270 -23 -33 -60 -34 8 81 -104
2451 -104 -166 -178 -239 -121 -177 -155 -184 105 -104 -10 -379 53 93 -99 -24 81 266 207 40 30 147 -76 104 69
2475 69 369 156 199 389 -30 42 -120 -65 -114 -49 29 -166 60 -116 -329 -295 -254 -37 -67 -40 63 -8 378 -88
2499 -88 223 287 42 257 229 244 -70 101 224 -111 172 -10 310 211 114 114 176 117 -116 -160 -66 -71 -193 -220 -126
2524 -126 -12 -196 -207 -73 6 -166 380 -4 164 40 -119 138 181 167 300 232 90 -64 224 -68 -37 31
2546 31 155 183 -60 -177 -41 -57 -169 2 152 -157 -268 -222 -347 -97 -230 -89 247 24 251 94 95 219
2568B19L4l40L00K00m72O5k0J29k41K26J3M1l60n8K16N4k32J57j23k3J08n4J25
2591c6P5J00j60j02Q8p1K0K11l53L84rp2Q3j56J7R1j10J78j70l8J13m20L57j84
2615a64J58Qk37M4J75r9L23k40m5j5r7J51K48k09LJ49J78l16J56o2OM8K56k51
2639A68q1j16n4j65J61K82j42l54J78J77q3l73L45J96k78J48J1K2j58k40L13J72
2661A29K38l36K28l80M3Q0K00Q7j4N6k4n90O2M69o9l02o2J47k06j26L01K1o7n2
2685a67O1mq5J61J12m43M55pO5K7n0o4K76j16j92J34J58k79r7L37j38k15K76q1
2709A24l18q8M43j58R1m07J51r6L21k60L00l05jL37O6n9k44M3O6L67M9k09k14
2732aj97K00J91j69O4J17l54k4j29J64L38m80r0M10k45J73k60P7J22K25r8j98
$$ plain form
2568 219 253 -87 213 413 -59 6 -14 115 -126 100 113 154 -206 -264 -48 6 -226 -69 -192 -215 -107 -161 -36
2591 -36 39 139 -21 -123 -35 -106 -86 125 -228 156 147 75 158 2 19 110 0 178 8 -30 83 -337 20 -164
2615 -164 -6 2 -235 -191 -16 -115 208 -32 -77 -92 -189 -38 210 1 4 153 331 15 171 109 115 163 419 168
2639 168 87 -29 -83 -248 -87 195 53 -301 -123 54 -29 -402 -57 139 -139 9 20 42 -116 -356 -43 129
2661 129 367 31 259 -121 -78 2 202 289 275 331 307 -283 -221 248 179 -123 -185 -38 -244 -370 -69 -48 -115 -167
2685 -167 -106 -110 -195 -34 78 -365 90 83 148 175 125 61 337 221 29 163 321 42 -55 282 144 -71 205 124
2709 124 -194 -282 161 3 94 -313 -162 -258 63 -197 103 -202 -203 134 200 141 -103 -60 6 373 422 213 -1
2732 -1 -198 2 193 24 88 205 -149 -173 -302 -138 200 -280 -370 40 -205 -32 -292 -215 -93 132 34 -164
2754a64J38o2m6r8L42J59j10k30R9K10m19K35M96n10j87N4L2J19k22l9J91k12
2776b24K98j7k2j55l09K81Q6K32k62q5K44m81L73J10Q4o1p2k63L50k48J29j08
2798a20L64n0o4K3j65o0K86j64k28L50j63l36K96LQ7k75K05j15lm1L6J03P2J99
2822B40m86J68J92j69J53J8r5M7j41k2J57N5j88P4N2j44L8J38j88k6q9K05P1n1
2846IJ13m26L69r3k07J22J3J16n8K02J33k29j97K38j72J35P7Q0j77k30L61j08
2868G1q2R8q2K22k02j74L32o6l11J26k5K6J28k0L0j44q7R4J89p6K40m63o1N18
2892B81k15q0j09P2J3NL46p6k89J53l62M45j02K8m37J0L22M6k91K93j22j87k4
2915b80J33L46O8m83K90M6o3J42q0K56l51K06m25K54Qk0K6j29K22n2j72j58J18
$$ plain form
2754 -164 -26 -88 -134 -232 110 269 159 -71 28 238 -181 54 550 40 -147 -93 -61 58 -164 -203 -12 -224
2776 -224 74 57 35 -120 -429 -148 -62 170 -92 -177 67 -414 -41 69 153 92 20 -243 107 -141 -12 -120
2798 -120 244 194 130 153 -12 -72 214 50 -178 172 9 -327 -31 -28 59 -216 -11 -126 -129 -170 -134 -31 41 240
2822 240 -246 -78 114 -55 98 116 21 68 -73 -95 62 117 -71 3 55 -89 -51 87 -101 -127 -216 -11 60 9
2846 9 122 -304 65 -28 -235 -113 -100 16 -42 160 293 64 -133 105 -67 68 145 225 48 -182 179 71
2868 71 -11 87 5 227 25 -149 183 117 -194 -68 -93 -67 61 41 71 -73 -160 -66 123 47 287 -176 -237 281
2892 281 66 -14 -123 -51 -38 -33 313 237 -52 101 -261 184 82 110 -327 -317 5 51 -240 53 -69 -256 -280
2915 -280 -147 199 267 -216 74 120 57 199 119 375 24 230 -195 59 67 47 73 -56 166 114 -58 -216 -98
2938i8k88J93R3j45J98q7o8K77l35L42K0l58J40K18l24L96j72J72k33q4L74j07
2960A24J66n3l25J83o1j3J73l31J8J97j15J84l94K69n7m6l6J30J50l75K15j03
2982a00L70n02K91p7j1l6J71J67l37J67m6J87L4k20k37N18l23%Qp3Q9J5j92J41
3006Dj87K27kj19j40KK54Pl7K50k86K3L23k79R5Nj24J23o2O7MM4k36jK38l7N0
3033B06k75j39J86k7J42q8J11q5J15l76m4J87N1j83Q3M15l8k94J13l21J83K96
3055B18j90J94j40Ok65K18Q2j45J21j51J6%m3j57K99j12J13o4l2j53L04k1k05
3078a07O7M0J06k03N4l8J95r4J84n3r5j87J19K10n3j00K40k61K7r1p5K44l7J11
3102B03l01P1j0Om84M48o5m9J41p7J79J20k2j2J06k37n2M4K0L9p0o5J35PM1k79
$$ plain form
2938 -98 -386 -193 -100 -245 -47 -134 -202 75 -260 82 102 -256 -116 102 -222 174 2 174 -59 -143 231 124
2960 124 290 237 -88 95 34 21 194 -137 -119 78 -37 147 -247 22 -35 -81 -117 13 163 -212 3 -100
2982 -100 270 -232 59 -18 -29 -65 106 273 -64 103 57 244 278 58 -179 339 16 16 24 -49 40 55 -137 4
3006 4 -183 44 42 -77 -217 -215 39 46 9 259 -27 -4 319 40 135 140 16 139 77 144 148 192 -44 -45 193 156 206
3033 206 -69 -208 -22 -49 93 5 116 31 146 -230 -274 -87 -36 -219 -136 279 241 -53 60 -261 -78 218
3055 218 28 222 82 88 -177 41 123 -22 99 -52 -36 -36 -79 -236 63 -49 64 0 -32 -185 119 98 -107
3078 -107 -40 0 106 -97 -43 -81 114 20 204 151 56 -131 -12 198 145 45 285 24 51 -40 -115 129 92 203
3102 203 -98 -27 -37 -31 -515 -67 -132 -181 -40 -117 62 182 160 148 254 17 -35 9 29 68 -2 -67 68 75 116 -163
3128a63j84K67N5N2p3J50j18J3l23L95J15l97K14j09j04OJ85J55Q0L6j68j71K20
3151A33k15J01K51j45j71MP4%j14j97L32J08r2n4l36kK69j01K06j20L15m82J34
3174a02k6J53J33J33k10Lk45r4K20L6R2j45q2L53o0k0k99J82K39l83K55n44N56
3197A45m74K8J85L27m02Rj04J9K89M1K55l54L35l01J72j79J71j5j47q0p6L65k10
3220aJ74j24L07k99l14J26Q9L0j10J01K68l73J89j04j47L9j1L19j41k48K80K4
3242G4l15L25k49N11m69R5M4K37O8r3j15k3o1J40j86J63k10R1q7Qj30J14k76J26
3266b18J04r2j04L63J26k98L7j47L97n60M46l7l3j78L59r8j37j40L60L1k39r3
3288a51N9r7K12k33K72J08l84O1K41J8o1r5q0RK01P0j54j15K31q8R2J7J0KL7n5
$$ plain form
3128 -163 -347 -80 -25 27 -46 104 -14 -1 -324 71 186 -211 3 -106 -210 -204 -19 136 216 252 84 -87 133
3151 133 -82 19 270 125 -46 -42 32 32 -82 -279 53 161 69 15 -321 -323 -54 -155 51 -69 246 -236 -102
3174 -102 -128 25 158 291 81 84 -161 -255 -35 1 93 -52 -134 219 159 139 -160 22 261 -122 133 -411 145
3197 145 -329 -301 -116 211 -191 -182 -286 -267 22 63 318 -36 299 -2 170 -9 162 147 0 -80 -156 209 -1
3220 -1 173 49 356 57 -257 -131 -42 -12 -122 -21 247 -126 63 -41 -188 -149 -160 159 18 -230 50 74
3242 74 -241 84 -165 346 -123 -28 16 253 321 228 113 90 29 169 -17 146 -64 27 -60 -52 -182 -68 -344 -218
3266 -218 -114 -206 -310 53 179 -119 -82 -229 168 -392 54 17 -16 -194 165 67 -70 -210 150 181 -58 -151
3288 -151 -92 -189 23 -210 62 170 -214 -153 88 106 45 -50 -130 -121 80 150 -4 -119 112 24 116 133 143 145 182 127
3314A27K02j34j91J83l32J98r3J75q3k64k24L62l3j11K27o8M0j72l7R3R4j62K67
3337F4L1k85L8K51j93k46J61L95Pr2j94j73L48j79K64P5l51ML9j87J69J22j01
3360c3j15m5J74q9m3K50k61K24Pm6L24l91o7K63m8K65l53J7J58k56K03k26J81
3383I3j93q4Q2Q2n5N8p6l05M31j95N7J60q1J18k68R4L77J57n17r7J27J89m51L46
3407D9O9j3k40K17J44k07j90J88J75j28M6o9J73j58k14J55r5K10j19j82J26j29
3429a92K71J25m82J56J23j95K66pQ8j77J01J97j04K35k54k9j08J7Q7k37K83j65
3451aj97K01o1K93k47j62k99M83j1j53L08j60J67m9k23L02j13j55l0J09K61p0
3473A93j62j72J27j0O2k45L61K1k00j65j6J70L3j83K18m9Mk80J6K37o6k0j50J91
$$ plain form
3314 127 329 195 4 187 -145 53 -40 135 52 -212 -436 -74 -107 -218 9 -59 -19 -191 -228 -135 -41 -203 64
3337 64 95 -190 -152 99 -94 -340 -179 216 223 131 -63 -236 112 -67 197 272 -79 -75 -36 -223 -54 68 -33
3360 -33 -148 -193 -19 -108 -151 99 -162 62 69 23 347 -44 -111 152 104 369 16 33 191 -65 138 -88 93
3383 93 -100 -184 -102 -20 -75 -17 -93 -398 33 -162 -105 55 -26 92 -176 -82 295 452 -65 -162 -35 154 -297 49
3407 49 118 105 -135 82 226 19 -171 17 192 64 110 41 214 56 -158 -3 -98 112 -7 -189 -63 -192
3429 -192 79 204 -278 -122 1 -194 72 65 153 -24 77 274 170 405 151 122 14 31 118 -119 164 -1
3451 -1 -198 3 -58 235 -12 -174 -473 10 -1 -154 154 -6 161 112 -111 191 78 -77 -107 2 263 193
3473 193 31 -141 -14 -24 38 -207 154 175 -25 -190 -206 -36 -3 -186 32 -17 -13 -293 -277 -40 -106 -126 -276 -85
3497h5Q9j08nK44k75K51k81K40J14r6k2J15k12J70p5k44Q3K16p8Mj94K35R6m14
3521b32P2J96j84k4K82k28M3O4q1O4P0J45l29J30J78J08m23K4L54j27l65L61r6
3544BrP8k42K06K04k91k0k9J58j31N0Lj62L78l51P6L49m48K03O9n6q1J39k3l0
3569D2J07k31j84K38K33j87J17j93J71M1k62o3j06M33k69m1L15m2k19N8J69k01
3591g4j62L35L4M7j34j44j21J93J96j1j70M35j55k38k27K16K50l12K49j70j39
3612a02J49j17J47P7k03q5L38l65K48l46L67l6J41l54j1k7oM32j83k02J6N82n48
3635h8l2K2M09Pk98K61j39k26L5j2Q1j61L50l35K3n2P5Lm1K49l68L09j40q8M1
3660a15J88k78J76J66k53J17O5j37J12K85j24k41K95l40O3j28K51n5k84K61J24
$$ plain form
3497 -85 4 -104 -109 135 -140 111 -170 70 184 88 66 181 -31 139 64 -180 -97 119 41 45 -149 86 182 -232
3521 -232 -160 36 -148 -172 110 -118 -75 -11 -92 -28 42 187 -142 -12 166 274 -149 -125 229 102 -263 98 2
3544 2 -7 71 -171 35 239 -52 -72 -101 57 -74 -24 -21 -183 195 -156 -80 269 -179 24 93 37 -44 95 72 42
3569 42 149 -82 -266 -28 205 18 135 -58 113 154 -108 -171 -277 156 -113 -154 161 119 -100 -42 127 -74
3591 -74 -236 99 133 180 46 -98 -219 -26 170 159 -11 424 269 31 -196 20 270 -42 207 37 -102
3612 -102 47 -70 77 154 -49 -134 204 -161 87 -259 108 72 213 -141 -152 -179 -185 247 64 -138 -122 460 -88
3635 -88 -120 -98 311 318 20 281 142 -84 -49 -61 20 -141 209 -126 -103 -155 -80 -77 -118 131 -237 72 -68 -156 -115
3660 -115 73 -205 -29 137 -116 1 66 -71 41 326 202 -39 256 -84 -21 -149 102 47 -237 24 148
3681A48j92LK94l36k24M97l65J53J25j58J30k03J10p5o9M7J21J77k28J11K65j83
3703A48O9j53O2j17J7L5j07k52J70L8j38J63L21n07K56J86k58L3q6k4Q5o7K47
3726A21j65m4j1J12J24j27M1J47k97K88k42l1K22k69J74M5j36J90p7J1j84M8J86
$$ plain form
3681 148 -44 -41 253 -83 -307 190 -175 -22 103 -55 75 -128 -18 -93 -162 -115 6 183 -45 66 331 148
3703 148 217 64 126 9 26 61 -46 -298 -128 -90 -228 -65 256 -251 5 191 -67 -34 -120 -144 -59 -126 121
3726 121 -44 -88 -99 13 137 10 51 198 -99 189 -53 -84 138 -131 43 88 -48 142 65 76 -108 -60 126
$$ [...]
8191A60
##END NTUPLES=NMR FID
##END=
