##TITLE=1H_Pr TEBn
 D2O
 8 sc, 
 11.3.2024
##JCAMPDX= 6.0         $$ Bruker NMR JCAMP-DX V2.0
##DATA TYPE= NMR FID
##DATA CLASS= NTUPLES
##ORIGIN= UXNMR, Bruker Analytische Messtechnik GmbH
##OWNER= root
$$ XWIN-NMR		Version 3.5
$$ Mon Mar 11 16:28:44 2024 Russian Standard Time (UT+4h)  she@DPX200
##.OBSERVE FREQUENCY= 200.1313
##.OBSERVE NUCLEUS= ^1H
##.DELAY= (6, 6)
##.ACQUISITION MODE= SIMULTANEOUS
##.ACQUISITION SCHEME= undefined
##.AVERAGES= 8
##.DIGITISER RES= 18
##SPECTROMETER/DATA SYSTEM= spect
##.PULSE SEQUENCE= zg30
##.SOLVENT NAME= DMSO
##.SHIFT REFERENCE= (INTERNAL, DMSO, 0, 15.7039)
##AUDIT TRAIL= $$ (NUMBER, WHEN, WHO, WHERE, WHAT)
$$ ##TITLE= Audit trail, XWIN-NMR		Version 3.5
$$ ##JCAMPDX= 5.01
$$ ##ORIGIN= Bruker BioSpin GmbH
$$ ##OWNER= she
$$ F:/spectra/data/she/nmr/H-F/1/audita.txt
$$ ##AUDIT TRAIL=  $$ (NUMBER, WHEN, WHO, WHERE, WHAT)
(   1,<2024-03-11 16:27:30.51 +0400>,<she>,<DPX200>,
      <created by zg, POWCHK disabled, PULCHK disabled
       configuration hash MD5:
       00 E9 B6 7A A2 85 ED C7 34 08 36 98 17 FE 4E 26
       data hash MD5: 16K
       CB D2 8E D0 3C FA 9D 4E 66 FD 2E 01 86 CE 31 CA>)
$$ ##END=
$$ 
$$ hash MD5
$$ A7 5A 9E 6A D1 09 CF 8E 46 F4 B3 C1 BB 4F 6C 0E
##$RELAX= 
##$RELAX= 
##$RELAX= 
##$RELAX= 
##$RELAX= 
##$RELAX= 
$$ Bruker specific parameters
$$ --------------------------
##$DU= <F:/spectra>
##$EXPNO= 1
##$NAME= <H-F>
##$PROCNO= 1
##$TYPE= <nmr>
##$USER= <she>
##$AMP= (0..31)
100 100 100 100 100 100 100 100 100 100 100 100 100 100 100 100 100 100 
100 100 100 100 100 100 100 100 100 100 100 100 100 100 
##$AQSEQ= 0
##$AQ_mod= 1
##$AUNM= <au_zg>
##$AUTOPOS= <>
##$BF1= 200.13
##$BF2= 200.13
##$BF3= 200.13
##$BF4= 200.13
##$BF5= 200.13
##$BF6= 200.13
##$BF7= 200.13
##$BF8= 200.13
##$BYTORDA= 1
##$CFDGTYP= 0
##$CFRGTYP= 5
##$CHEMSTR= <none>
##$CNST= (0..31)
1 1 145 1 1 1 1 1 1 1 1 1 1 1 1 1 1 1 1 1 1 1 1 1 1 1 1 1 1 1 1 1 
##$CPDPRG= <>
##$CPDPRG1= <>
##$CPDPRG2= <>
##$CPDPRG3= <>
##$CPDPRG4= <mlev>
##$CPDPRG5= <mlev>
##$CPDPRG6= <mlev>
##$CPDPRG7= <mlev>
##$CPDPRG8= <mlev>
##$CPDPRGB= <>
##$CPDPRGT= <>
##$D= (0..31)
0 1.2 0 0 0 0 0 0 0 0.06 0 0.03 0 0 0 0 0.0002 0 0 0 0 0 0 0 0 0 0 0 0 
0 0 0 
##$DATE= 1710160049
##$DBL= (0..7)
120 120 120 120 120 120 120 120 
##$DBP= (0..7)
150 150 150 150 150 150 150 150 
##$DBP07= 0
##$DBPNAM0= <>
##$DBPNAM1= <>
##$DBPNAM2= <>
##$DBPNAM3= <>
##$DBPNAM4= <>
##$DBPNAM5= <>
##$DBPNAM6= <>
##$DBPNAM7= <>
##$DBPOAL= (0..7)
0.5 0.5 0.5 0.5 0.5 0.5 0.5 0.5 
##$DBPOFFS= (0..7)
0 0 0 0 0 0 0 0 
##$DE= 6
##$DECBNUC= <off>
##$DECIM= 32
##$DECNUC= <off>
##$DECSTAT= 4
##$DIGMOD= 1
##$DIGTYP= 9
##$DL= (0..7)
0 120 120 120 120 120 120 120 
##$DP= (0..7)
150 150 150 150 150 150 150 150 
##$DP07= 0
##$DPNAME0= <>
##$DPNAME1= <>
##$DPNAME2= <>
##$DPNAME3= <>
##$DPNAME4= <>
##$DPNAME5= <>
##$DPNAME6= <>
##$DPNAME7= <>
##$DPOAL= (0..7)
0.5 0.5 0.5 0.5 0.5 0.5 0.5 0.5 
##$DPOFFS= (0..7)
0 0 0 0 0 0 0 0 
##$DQDMODE= 0
##$DR= 18
##$DS= 0
##$DSLIST= <SSSSSSSSSSSSSSS>
##$DSPFIRM= 0
$$ [...]
##$SUBNAM2= <"">
##$SUBNAM3= <"">
##$SUBNAM4= <"">
##$SUBNAM5= <"">
##$SUBNAM6= <"">
##$SUBNAM7= <"">
##$SUBNAM8= <"">
##$SUBNAM9= <"">
##$SW= 18.0517328524113
##$SWIBOX= (0..15)
0 0 2 0 0 0 0 0 0 0 0 0 0 0 0 0 
##$SW_h= 3612.71676300578
##$TD= 16384
##$TD0= 1
##$TE= 0
##$TE2= 300
##$TE3= 300
##$TEG= 300
##$TL= (0..7)
0 120 120 120 120 120 120 120 
##$TP= (0..7)
150 150 150 150 150 150 150 150 
##$TP07= 0
##$TPNAME0= <>
##$TPNAME1= <>
##$TPNAME2= <>
##$TPNAME3= <>
##$TPNAME4= <>
##$TPNAME5= <>
##$TPNAME6= <>
##$TPNAME7= <>
##$TPOAL= (0..7)
0.5 0.5 0.5 0.5 0.5 0.5 0.5 0.5 
##$TPOFFS= (0..7)
0 0 0 0 0 0 0 0 
##$TUNHIN= 0
##$TUNHOUT= 0
##$TUNXOUT= 0
##$USERA1= <user>
##$USERA2= <user>
##$USERA3= <user>
##$USERA4= <user>
##$USERA5= <user>
##$V9= 5
##$VALIST= <valist>
##$VCLIST= <CCCCCCCCCCCCCCC>
##$VD= 0
##$VDLIST= <DDDDDDDDDDDDDDD>
##$VPLIST= <PPPPPPPPPPPPPPP>
##$VTLIST= <TTTTTTTTTTTTTTT>
##$WBST= 1024
##$WBSW= 4
##$XGAIN= (0..3)
0 0 0 0 
##$XL= 0
##$YL= 0
##$YMAX_a= 451317
##$YMIN_a= -533248
##$ZGOPTNS= <>
##$ZL1= 120
##$ZL2= 120
##$ZL3= 120
##$ZL4= 120
##$ABSF1= 10
##$ABSF2= 0
##$ABSG= 5
##$ABSL= 3
##$ALPHA= 0
##$AQORDER= 0
##$ASSFAC= 0
##$ASSFACI= 0
##$ASSFACX= 0
##$ASSWID= 0
##$AUNMP= <proc_1d>
##$AZFE= 0.1
##$AZFW= 0.1
##$BCFW= 1
##$BC_mod= 2
##$BYTORDP= 1
##$COROFFS= 0
##$CY= 11.3945322036743
##$DATMOD= 1
##$DC= 2
##$DFILT= <>
##$DTYPP= 0
##$F1P= 15.7292609196834
##$F2P= 12.9074282941183
##$FCOR= 0.5
##$FTSIZE= 0
##$FT_mod= 4
##$GAMMA= 1
##$GB= 0.15
##$INTBC= 1
##$INTSCL= 1
##$ISEN= 128
##$LB= 0.24
##$LEV0= 0
##$LPBIN= 0
##$MAXI= 10000
##$MC2= 0
##$MEAN= 0
##$ME_mod= 0
##$MI= 1.114404
##$NCOEF= 0
##$NC_proc= 0
##$NLEV= 6
##$NOISF1= 3.799351
##$NOISF2= 2.8
##$NSP= 1
##$NTH_PI= 0
##$NZP= 0
##$OFFSET= 15.70392
##$PC= 1
##$PHC0= -25309.67
##$PHC1= 9.38731
##$PH_mod= 1
##$PKNL= yes
##$PPARMOD= 0
##$PSCAL= 0
##$PSIGN= 0
##$REVERSE= no
##$SF= 200.130013532006
##$SI= 16384
##$SIGF1= 3
##$SIGF2= 2
##$SINO= 400
##$SIOLD= 16384
##$SREGLST= <1H.CDCl3>
##$SSB= 0
##$STSI= 0
##$STSR= 0
##$SW_p= 3612.71676300578
##$SYMM= 0
##$S_DEV= 0
##$TDeff= 0
##$TDoff= 0
##$TI= <>
##$TILT= no
##$TM1= 0
##$TM2= 0
##$TOPLEV= 0
##$USERP1= <user>
##$USERP2= <user>
##$USERP3= <user>
##$USERP4= <user>
##$USERP5= <user>
##$WDW= 1
##$XDIM= 8192
##$YMAX_p= 0
##$YMIN_p= 0
$$ End of Bruker specific parameters
$$ ---------------------------------
##NTUPLES= NMR FID
##VAR_NAME=  TIME,          FID/REAL,        FID/IMAG
##SYMBOL=    X,             R,               I
##VAR_TYPE=  INDEPENDENT,   DEPENDENT,       DEPENDENT
##VAR_FORM=  AFFN,          ASDF,            ASDF
##VAR_DIM=   8192,          8192,            8192
##UNITS=     SECONDS,       ARBITRARY UNITS, ARBITRARY UNITS
##FACTOR=    0.0002768,     1,               1
##FIRST=     0,             0,               0
##LAST=      2.2672688,     0,               0
##MIN=       0,             -533248,         0
##MAX=       2.2672688,     451317,          0
$$ Real data points
##PAGE= N=1
##DATA TABLE= (X++(R..R)), XYDATA
0@%%%%%%%%%%%%%lMrJ6j6J6j6K4l2L3m1M8n4O5p4Q6r9J12j29J46j64J85k08K35
$$ 0 0 0 0 0 0 0 0 0 0 0 0 0 0 -3 1 -8 8 -8 8 -8 16 -16 17 -24 24 -30 35 -39 47 -52 60 -69 77 -87 98 -110 125
37A25k62K92l25L60m03M47m94N47o05O69p36Q11q93R83j085J195j319J458j615
$$ 125 -137 155 -170 190 -213 234 -260 287 -318 351 -385 426 -467 516 -569 626 -693 765 -850
56h50J794k000K243k529K874l297L836m550N534o994R382j3966K5973j19561l81019
$$ -850 944 -1056 1187 -1342 1532 -1765 2071 -2479 3055 -3939 5443 -8523 17450 -102111 -483130
71d83130n0118K27135L47944K40506Q2010l8905p3830j10914j56213j90401j40923
$$ -483130 -533248 -306113 41831 282337 364347 325442 251612 140698 -15515 -205916 -346839
82c46839k8116J03028J83244K05376J65597P8545n4192j79671k33197j65402k2450
$$ -346839 -374955 -271927 -88683 116693 282290 360835 306643 126972 -106225 -271627 -294077
93b94077J07984J54736J33126R0175N2770r554j13741k17178k27121r8886J07193
$$ -294077 -186093 -31357 101769 191944 244714 235160 121419 -95759 -322880 -421766 -314573
104c14573K56939K60807J39263r237j05395j40404j48198j38246q8110J5660J29504
$$ -314573 -57634 203173 342436 333199 227804 87400 -60798 -199044 -287154 -271494 -141990
115a41990J83151J42729M3144m8292r1560r6372q8521p0632k5122M9587J21594
$$ -141990 41161 183890 227034 178742 87182 -9190 -97711 -168343 -193465 -143878 -22284
126b2284J46826J07579K1674p4785j51391j82153j43326l0058J18411K22643K12617
$$ -22284 124542 232121 253795 179010 27619 -154534 -297860 -327918 -209507 13136 225753
137B25753R0728o3028j51828j41951p7340k4970q145O519N2219J12347J30071
$$ 225753 316481 253453 101625 -40326 -117666 -142636 -150781 -144262 -92043 20304 150375
148A50375O9728m3388j33962j46323q3759M421P0647J00539R9335P4751K6895
$$ 150375 220103 176715 42753 -103570 -187329 -182908 -112261 -11722 87613 162364 189259
159A89259l5383r1045j16797j04313n9792M916P9681J42619J56639R5254k4353
$$ 189259 153876 62831 -53966 -158279 -218071 -213155 -133474 9145 165784 261038 236685
170B36685j36553j70879j10147l572P5339R2512O8552M0983K2578l829m8466r1692
$$ 236685 100132 -70747 -180894 -184466 -109127 -16615 51937 92920 115498 111669 63203 -28489
182b8489r7019m9202K4849Q2000R9309Q4209N2929J0267m4280r9017j24433r6202
$$ -28489 -125508 -174710 -149861 -67861 31448 115657 168586 178853 134573 35556 -88877 -185079
194a85079k1120O2999J14039J13957P1498P778n6210r9779j02634n9303J3784
$$ -185079 -206199 -143200 -29161 84796 156294 164072 107862 8083 -94551 -153854 -140070
205a40070P6293R6495P2680K8490r514l8189o6203q8463q4171l5763M2623J07528
$$ -140070 -63777 32718 105398 133888 124374 86185 19982 -68481 -152652 -188415 -145792 -38264
217c8264J19608P3856N439m6819o9544p0731o1151l9818L53N1472Q9310Q9408
$$ -38264 81344 155200 160639 113820 44276 -26455 -87606 -127424 -127071 -75599 13711 103119
229A03119M6671j9048p7763j03871q6867l1587L9203R5572J09391P4973J1575
$$ 103119 149790 130742 52979 -50892 -137759 -169346 -130143 -34571 74820 149793 161368
240A61368m6529p5861p5236n8724l4622l053L8852P8430R2088O4529M207n7136
$$ 161368 114839 38978 -36258 -94982 -129604 -132657 -93805 -15375 76713 141242 145449 88313
252H8313q9075p9979m1994M898M5676P1336P4633N2194N459m8550q4760q7668
$$ 88313 -762 -80741 -122735 -117837 -72161 -825 73808 126002 131461 82911 -1849 -89517
264h9517n4648n37N2571Q5452Q8448N9421Q878m5312q1559q5353n8471j3705L1842
$$ -89517 -144165 -144702 -92131 -6679 81769 141190 150068 104756 23197 -62156 -120627 -134332 -102490
277a02490O4235P5042O2266K6106k2300o4540p9918o1742j8159K9771O3006P1590
$$ -102490 -38255 36787 99053 125159 102859 38319 -41599 -103341 -121500 -91729 -28723 42867
289D2867N7535K5726j6700n7936q2757p7612l9566J6767O7651R0115P7111L6091
$$ 42867 100402 126128 109428 51492 -31265 -108877 -148443 -131676 -64025 26090 103201 139292
301A39292j5247n7570p6846o8863l6834O563M5380O6286O3565L9170J49l9954
$$ 139292 124045 66475 -10371 -79234 -116068 -109505 -64125 2161 65726 104896 105045 65091
313F5091o6889p0221m5242o5M6607P4469P4154M4850J421m1277o8793p3683n4079
$$ 65091 -1798 -72019 -117261 -117326 -70719 3750 77904 122754 124175 82898 14105 -59578 -113657
326a13657j5271L0175O5669P6826N8935J8545k7746o1135p0579n2735j6576K4701
$$ -113657 -128928 -98753 -33084 43742 102677 121222 93476 32341 -38238 -90973 -107549 -82848
338h2848N6163O5496N1204J7623k2604n4825o7857n6104k3802J8205N4684P1730
$$ -82848 -26685 38811 90015 107638 85034 30209 -37648 -93752 -117554 -99349 -44665 27065
350B7065O3109L0660j2151n0646o9505o3570l5031N710M2658O3275O0510L5487
$$ 27065 90174 120834 108683 58037 -11468 -75038 -110069 -104359 -61701 1574 62084 97571
362I7571k148l8747n9874n8386l4291K407L8695N9973N9529L6654J2l6998o1313
$$ 97571 95423 56676 -3198 -61584 -95875 -93468 -54773 5200 64729 101383 101395 64397 3084
375C084o3071m2285o398L1802N8584O4097M6543J2899k5060n2915o0864m6167
$$ 3084 -59987 -102272 -108670 -76868 -18284 45813 92356 105255 80195 27280 -33584 -79751
387g9751j5271K1330M9065N7032M3484J3636k1065m7178n5919m3684j5823J8720
$$ -79751 -95022 -73692 -24627 32405 75889 89525 68460 21282 -34637 -78321 -94144 -75424
399g5424M7120N8292M9435K1423j4795m5463n9974n2389k5327R914M0516N5677
$$ -75424 -28304 29988 79423 100846 86051 40588 -19386 -71775 -97102 -87188 -46672 9005
411I005N0007K6794n590l4602n1026m8022k7000M117L3915N0515M8182K6887l958
$$ 9005 59012 85806 80216 45614 -5412 -53434 -80434 -76317 -42402 8113 56295 83182 79224
424G9224l4189n1812m9885k9679J088L1469N0738N1725L4006M379k6394m7412
$$ 79224 45035 -6777 -56662 -86341 -85253 -53784 -3046 48679 82685 87064 60670 13258
436A3258n1155l7067q604K2951M5227M9543L5329P574k1805m2299m6525l4024
$$ 13258 -37897 -74964 -83568 -60617 -15390 34153 69482 77056 55251 12952 -33573 -67597
448f7597q679J9887M1342M8318L7016J1115j8928m1418m9150l9622j5608J3769
$$ -67597 -76276 -56389 -15047 33271 70287 81402 62474 21056 -28094 -67716 -83324 -69555
460f9555L9104N0399M2969J8694j2197l7308m7273l9472j7854Q464L1658M3103
$$ -69555 -30451 19948 62917 81611 69414 32106 -15167 -54639 -72493 -64029 -32371 10732
472A0732L9220K0860o623l1939m4731m0004k1054O251L0929M4862M3594K5918
$$ 10732 49952 70812 64189 32250 -12481 -52485 -73539 -67288 -36359 8503 52097 78015
484G8015k878l0954m7563m5190k5801J077K6398M0855M1991K8780N713k0732m0020
$$ 78015 75137 44183 -3380 -48570 -74371 -73294 -46896 -6041 35950 64730 70443 49711 9691
497I691m3207k9266m237K1626L8484M1047K9252O748k0094m0333m6036l2736o370
$$ 9691 -33516 -62782 -67019 -45393 -6909 34138 63390 70138 50044 9711 -36325 -69061 -75431
510g5431K1987M0255M2585L1026J0868j2101l2229m2258l7458j8609R035L3153
$$ -75431 -53444 -13189 29396 60422 71290 59189 26960 -15298 -52756 -71365 -62330 -29177
522b9177M3323L7058J6601r999l2450m2673l6481j5269J2290L4023M1337L2967
$$ -29177 14146 51204 67805 57806 25356 -17317 -53798 -69067 -56777 -22754 18583 51550
534E1550J4324p059k5488l6886l8004k7044k968K5096M4543M5338K6250k622k7321
$$ 51550 65874 58815 33327 -3559 -41563 -68607 -71575 -46479 -1936 43402 69652 67030 39709
547C9709l9581l6327k1644q37K0012L4202L6159K5213M013j8317l4237l8348k9187
$$ 39709 128 -36199 -57843 -58680 -38668 -4466 31693 56906 60919 42602 8365 -29983 -59170
560e9170r258J6493L8086M5110L3184P046k1086l8152l8760k6301q039J1293K7227
$$ -59170 -68428 -51935 -13849 31261 64445 71491 50405 12253 -26507 -52808 -60847 -49554 -22327
573b2327L5879L2898J6166q828l0205l8260l1636j2946P842K5588L5713L4366
$$ -22327 13552 46450 62616 53788 23583 -14677 -46313 -59259 -51417 -25829 9884 44250
585D4250J9914m810k9540m2347l6256j6122Q889K7650L5443L2288J8935j025k1388
$$ 44250 64164 59354 29814 -12533 -48789 -64911 -56022 -28372 7071 39359 58294 57269 35881
598C5881l4306l4429k1486j791J7648L0481L4718K6561P743j7806l7537m0471
$$ 35881 1575 -32854 -54340 -56131 -38483 -8002 26716 53277 61020 43214 5677 -34794
610c4794k4353K271K4106L3089K8354J7731M400r405k4343l3805l1560j4911J0479
$$ -34794 -59147 -56876 -32770 319 28673 46404 50804 41399 17056 -16749 -48309 -63220 -52741
623e2741L2045L9856L0997J1072j2580l0058l5959k7789q718J2213K6462K9133
$$ -52741 -20696 19160 50157 61229 48649 18591 -17368 -45157 -53875 -41662 -15200 13933
635A3933K1854J0082l631j7413k8877l1831k1053J773K6145L8895L3440J4602
$$ 13933 35787 45869 42238 24825 -4052 -35883 -56936 -55163 -29018 9877 43317 57919
647E7919p541k3603l0629k7954j7580j287J7482L0290L0979J9277O21j7666k6843
$$ 57919 50378 26775 -3854 -31808 -49388 -50675 -33193 -2903 28076 47353 47974 30308 3465
660C465k7934j8921m173J3505K7886L1671K2547L722j6333k9356l0826k1983n116
$$ 3465 -24469 -43390 -47563 -34058 -6172 25499 48046 51768 35435 6079 -24747 -46730 -51846
673e1846J3159K7545L1359K3706N699j2473k4741k6290j9828r214M212J7131K8080
$$ -51846 -38687 -11142 20217 43923 49622 37149 12408 -13882 -33710 -42924 -38712 -21581 6499
686F499K8713J6075n932k7236l4313k6292o983J2293K4050K5726K0463J0062l594
$$ 6499 35212 51287 45355 18119 -16194 -42486 -49469 -37176 -13126 12600 33063 43125 39531
699C9531j6648k5527k5191j6650p26J5965K7502K9584J9565K42j9842l1054k8175
$$ 39531 22883 -2644 -27835 -44485 -45211 -29246 -1744 27840 47405 47647 27805 -3249 -31424
712c1424j2911N396J8673K2403K0159J3212L497r397k2108k8007k1901n211J4731
$$ -31424 -44335 -38939 -20266 2137 22296 35508 39005 29608 7500 -20507 -42408 -47619 -32888
725c2888K7630K8597J8522K490j2301k3387k6451k0306n853J0610K2957K5698
$$ -32888 -5258 23339 41861 44351 32050 8663 -17788 -38094 -43947 -33337 -10380 15318
737A5318J9047O420p795j9707k5054k1527r037P334K1786K6080K0456Q124o476
$$ 15318 34365 40785 32990 13283 -11771 -33298 -42335 -35001 -13215 12865 33321 41445 34969
750C4969j8163k5002k3567j2757M283K0609K8667K3566R648o444j7811k1959j9537
$$ 34969 16806 -8196 -31763 -44520 -40237 -19628 9039 32605 42253 35809 17998 -3961 -23498
763b3498j2593j394J2632K2788K5580J6951M31j6106k6146k5110j4374J473J6314
$$ -23498 -36091 -37485 -24853 -2065 23515 40466 40897 24791 -1355 -26465 -40839 -39366 -23052
776b3052K4524K3115J3347k07j3217k0446k1142j6365o129P717K0170K6196K1693
$$ -23052 1472 24587 37934 37727 24510 4064 -17078 -33443 -39572 -31855 -11685 14511 36204
789C6204P095j1049k3748k5808j7181l343J0288J8829K1649J7444P385o120j8492
$$ 36204 43299 32250 8502 -17306 -34487 -37830 -27542 -8713 12936 30380 37765 31645 13153
802A3153k4185k0301q984O132J8831K4665K0995R990m823j7999k4061k1106j0000
$$ 13153 -11032 -31333 -40317 -34185 -15354 9311 30306 40296 35473 17474 -6587 -27693 -37693
815c7693L194J5922K1779K0546J2031r06j4278k2703k1726j2649J355J4691K1430
$$ -37693 -34499 -18577 3202 23748 35779 34873 20595 -2108 -23834 -36483 -35128 -20437 993
828I93K0949J3317J188j1942k1380k3294j6292k314J2528K2169K3066J5086K381
$$ 993 21942 35259 36447 24505 3125 -20169 -36461 -38775 -26247 -4078 18988 34074 36455
841C6455j0862j9187k0921j5903m526P828J8235K1329J7091O447p117j7816k2913
$$ 36455 25593 6406 -14515 -30418 -34944 -27116 -8881 12448 29539 35986 28869 11053 -11860
854a1860j8615o855P369J8705K2482J7754O702o033j5862k0432j8108r964K458
$$ -11860 -30475 -37330 -29961 -11256 11226 28980 35682 29649 13787 -6645 -24753 -34717 -32259
867c2259J4476K1512K0452J1213l089j4961k0943j9313j0240K114J3196J9720
$$ -32259 -17783 3729 24181 35394 32305 17344 -3599 -22912 -33152 -31038 -17842 1878
879A878J9096J1377k82j2334j9281j9593j2833j377J0940J9480K0799J3726K088
$$ 1878 20974 32351 32069 19735 454 -19139 -31972 -33349 -22409 -2929 17870 31596 33684
892C3684j0538j8733j9871j4397k584Q387J7455J9811J4944M327p868j7027k0001
$$ 33684 23146 4413 -15458 -29855 -32439 -24052 -6597 13214 28158 32485 24617 7590 -12411
905a2411j5007m657P119J6237J9321J5645O065n999j5485j9513j6721o863M252
$$ -12411 -27418 -32075 -24956 -8719 10602 26247 32312 26313 10828 -8685 -25406 -32269 -28017
918b8017J5228J9311J7085Q410m052j3974j8867j6712q611K422J2751J8424J6895
$$ -28017 -12789 6522 23607 32017 27965 13991 -4876 -21588 -30199 -27777 -15026 3398 20293
931B0293R570j617j2062j8366j7327j0396R71J1662J7922J7682J0541N91j0635
$$ 20293 29863 28246 16184 -2182 -19509 -29905 -28934 -17272 650 18332 28873 29464 18829
944A8829j7157j7865j1851j369R354J6754J7726J2441K399q373j6361j7638j2743
$$ 18829 1672 -16193 -28044 -29413 -20059 -3305 14421 26862 29261 20888 4527 -13111 -25854
957b5854l087P626J5560J7929J3174L802o914j5109j7621j4006m797N852J4626
$$ -25854 -28941 -21315 -5755 12174 25348 29150 22236 7127 -10494 -24500 -29297 -23445 -8819
970h819J7593J4481N857m883j3742j7625j4793o489L897J3078J7157J5176P087
$$ -8819 8774 23255 29112 24229 10487 -7138 -21931 -28420 -24523 -11445 5712 20888 27975
983B7975l220j2458j6754j5355p999K391J1776J6702J5678Q758j349j1038j6564
$$ 27975 24755 12297 -4457 -19812 -27811 -25420 -13644 3058 18736 27494 26145 15107 -1457
996a457j5900r529O11J0211J5928J6045R991N75r161j5470j6270j0906j284Q480
$$ -1457 -17357 -26886 -26275 -16064 -136 15909 25900 26475 17314 1844 -14426 -25332 -26616 -18136
1010a8136J5173J6486J1171K011p724j4893j6380j1491l288P140J4116J6314J2642
$$ -18136 -2963 13523 24694 26705 18981 4088 -12292 -23783 -27071 -19931 -5815 10499 23141
1023B3141M163o176j3646j6385j3307m783N410J3214J5801J3471N536m286j2626
$$ 23141 27304 21128 7482 -8903 -22210 -26993 -21583 -8369 7432 20903 26439 22153 9527
1036I527j5818j3653o100L168J1981J5659J4371O948k609j1321j5764j4332p702
$$ 9527 -6291 -19944 -26044 -22876 -10895 4764 19135 26083 23474 12153 -3611 -17943 -25645
1049b5645J821J0480J5387J4545Q320n76r765j4855j4928r167k59R255J4593J4737
$$ -25645 -23824 -13344 2043 16588 24908 24332 14567 -288 -15216 -24383 -24642 -15387 -794 13943
1063A3943R725Q72q386j4166j4766j0325j654P380J3805J5298J0649K640o536
$$ 13943 23668 24540 16154 1988 -12778 -23103 -24757 -17377 -3572 11726 22375 25015 18479
1076A8479j3795j5263j1287l389O265J3180J5046J1429M118n196j2410j4962j2078
$$ 18479 4684 -10579 -21866 -25255 -18990 -5810 9236 20665 24783 19587 7177 -7785 -19863
1089a9863m878M469J1992J4965J2363N469l617j1540j4797j2516o234K802J0721
$$ -19863 -24741 -20272 -8280 6685 19048 24517 20900 9360 -5437 -17953 -24187 -21385 -10664
1102a0664J4655J3011O801j987j0063j4237j3589p373J041R584J3991J3725P926
$$ -10664 3991 17002 23803 21816 11753 -2484 -16073 -23446 -22405 -12821 1170 14895 22821
1115B2821m88q544j3897j3760q501l46Q089J3620J3766Q984J211p382j3109j3977
$$ 22821 22333 13789 -108 -13868 -22369 -22715 -14626 -1006 12760 21744 22955 15573 2464 -11513
1129a1513r749j791O544J2963J3933J0176K358n815j2291j3836j0791l195N285
$$ -11513 -21262 -23053 -16509 -3546 10387 20563 22921 17106 4815 -9021 -19812 -23007 -17722
1142a7722J1704J4138J0780M153m753j1087j3901j1477m542L672J0734J3776J1691
$$ -17722 -6018 8120 18900 23053 18300 7213 -6688 -18165 -22707 -19035 -8301 5475 17166
1155A7166N200k802j0161j3652j2095o037K481R580J3446J2334O769j832r165
$$ 17166 22366 19564 9403 -4249 -16344 -22381 -19900 -10320 3126 15460 22229 20397 11232
1168A1232j3253j2367p164P36Q818J2654J2735P773k28q092j2444j2823q278n26
$$ 11232 -2021 -14388 -21552 -20816 -11998 656 13391 21164 20936 12844 400 -12423 -20701 -21227
1182b1227P430J2331J2765Q794J237o863j1752j3160q981j966O014J1713J3008
$$ -21227 -13797 -1466 11299 20093 21330 14467 2715 -10445 -19426 -21392 -15378 -3665 9343
1195I343R578K557n484j1378j2785j0141l223N137J0393J2892J0485M023m169
$$ 9343 18921 21478 15994 4616 -8169 -18310 -21533 -16396 -6003 6889 17374 21397 17228
1208A7228j0255j2924j0531m450L073J0139J2604J0793N311k856r303j2743j1289
$$ 17228 6973 -5951 -16482 -20932 -17859 -7720 4884 15677 20988 18132 8829 -3914 -15203
1221a5203n336K196Q666J2198J1536O096q35q329j2197j1583p105N54P646J1909
$$ -15203 -20539 -18343 -9677 2521 14057 20153 19318 10989 -1208 -12791 -19896 -19342 -11696 213
1235B13J1912P260L1p208j1636j1763p726m33O314J1435J1690Q345J572o020j1248
$$ 213 12125 19385 19416 12208 572 -11191 -18917 -19350 -13036 -1601 10089 18434 20006 13986 2738
1250B738j1723q814k200N418J0774J1985R043K636m666j0339j1941r328k975L962
$$ 2738 -8985 -17799 -19999 -14581 -3807 8178 17221 19857 15191 4852 -7089 -16417 -19392 -15430
1264a5430R552J1842R492L922l151r394j2031r936m294K968Q870J1530J0692M792
$$ -15430 -5878 5964 15456 19378 16227 6833 -5198 -15134 -19428 -16460 -7590 3940 14632 19424
1278A9424k315q636j1475j0362n364J429Q120J1073J0499O050j171p081j1059
$$ 19424 17109 8473 -3002 -13364 -18728 -17299 -9179 1894 12393 18443 17272 10191 -868
1291h68j0748o495M48O825J0912J0862O695K07o190j0785j0931p264q87O081J0237
$$ -868 -11616 -18111 -17663 -10838 74 10936 17631 17838 11648 863 -10068 -17332 -18219 -12138 -1901
1306a901J0921P554J503n287r692j0872q021k473M808R557J0843Q470K635m010
$$ -1901 9020 16574 18077 12790 3098 -7774 -15795 -18268 -13460 -3903 6940 15410 18045 14035
1320A4035r547j0886q691k733L629Q924J0913Q249L761l008q141j0615r302m326
$$ 14035 4488 -6398 -15089 -17822 -14193 -5269 5644 13893 17654 14646 6505 -4110 -13412 -17738
1334a7738K106P973J1056R696M663j918p918j0591r250n042J331P251J0155R201
$$ -17738 -15632 -7659 3397 13093 17756 15838 7920 -2671 -11921 -16963 -15632 -8381 1774 10975
1348A0975N695p96o593j0024r784o058J59O180J0272J0040O402j3n957r747r863
$$ 10975 16670 15874 9281 -743 -10527 -16585 -16426 -10246 26 10066 16468 16455 10498 751 -9112
1363i112o566o96N186R339R924P245J038m824r010r972p026j723M255Q658J0047
$$ -9112 -15678 -16374 -11188 -1849 8075 15320 16358 11534 2524 -7448 -14474 -16197 -11942 -3284 6763
1378F763P486K436l879q651j0268p969k445L362Q243J0061P870L286k767p685
$$ 6763 14249 16685 12806 4155 -6113 -14082 -16527 -13165 -4922 5139 13009 16295 13528 5843
1392E843r847q275l840K303P168R739Q572M336j695o968j0077q831m438J616O678
$$ 5843 -4004 -12279 -16119 -13816 -6648 3091 11663 15999 14304 7336 -2741 -11572 -16010 -14394 -7716
1407g716R745Q581M663m79o308r263q910n705L43N798R165R220N870L66n525r153
$$ -7716 2029 10610 15273 14794 8486 -777 -9687 -15392 -15049 -9251 -86 9134 15004 15370 9845 692
1423F92r095o005o41N000Q510R062O405J211m362q609q985o839j762L995Q131
$$ 692 -8403 -14408 -15049 -10049 -1539 7523 13928 15139 10777 2168 -6817 -13656 -15418 -11423 -3292
1438c292R632P099K073l838p567r391p284k726L087P575R329P192L164k620p302
$$ -3292 6340 13439 15512 11674 4107 -5284 -12568 -15294 -12207 -4632 4697 11889 15053 12433 5131
1453E131r038p545l279K149O870Q945P737L843j552o483r139q279l863J036O215
$$ 5131 -3907 -11452 -14731 -12582 -5712 3233 10970 14813 13261 6778 -2361 -10640 -14503 -13467 -7252
1468g252R053P910M717r14n630q584q156m737l0N209Q013Q440N716P2m999q410
$$ -7252 1801 9711 14428 13514 7884 -700 -8856 -13593 -13623 -8414 -401 8039 13755 13827 8828 418
1484D18q535n196m85M590Q067Q450N694Q95m077p782q572o003j387L385P492Q659
$$ 418 -8117 -13313 -13798 -9208 -1141 7309 13003 13898 9821 2039 -6533 -12536 -13923 -10538 -3046 5613
1500E613O453J934k994p618q431o381k386K958O901Q389O562K734k455o749q281
$$ 5613 12066 14000 11006 3388 -5043 -11424 -13810 -10852 -3951 4438 11000 13734 11279 4530 -3751
1515c751o912l117K130O296Q361P216L492j738o074q006p228m107J302N696P821
$$ -3751 -10663 -13780 -11650 -5354 3007 10223 13715 11977 5903 -2103 -9331 -13438 -12136 -6440 1381
1530A381P535L978o40n253p840p786m011L96M926P657P533M681J53m461p896p595
$$ 1381 8916 12894 12254 7001 -839 -8625 -12636 -12240 -7314 343 7876 12557 12710 8249 353 -7242
1546g242n104l83M211P426P532N539O03l856o851p622n575j091L312O711P701
$$ -7242 -12346 -12729 -8518 -1092 6440 11979 12582 8726 1875 -5747 -11322 -12413 -9101 -2390 5311
1561E311N681J793l245o611p715o082k023K809O553P944N978K388k353o288p469
$$ 5311 10992 12785 9540 2929 -4786 -10868 -12891 -10082 -3529 4415 10393 12781 10428 4140 -3329
1576c329o427l017K200N727P588O375L223j711n604p181o538l466J436N025P397
$$ -3329 -9756 -12773 -10573 -4846 2742 9117 12340 10629 5025 -2156 -8694 -12160 -10724 -5699 1698
1591A698O774L570p37n240p275o778l781M10M643O913O928M476j48m221o952o808
$$ 1698 8472 12042 11305 6065 -1210 -7988 -11769 -11359 -6716 197 7125 11601 11453 7232 280 -6528
1607f528m641k89L855O850O972M624N84l399o675p116m771j108L410O241P126
$$ -6528 -11169 -11458 -7603 -753 6219 10843 11427 8028 1353 -5763 -10534 -11642 -8232 -1991 5135
1622E135N130J632l262o069o925n646j630K644N770O993N641K123k081n767o884
$$ 5135 10265 11897 8635 2566 -4359 -10005 -11635 -8991 -3221 3772 9413 11536 9455 3688 -3196
1637c196n918k418J981N526O878N927K498j626n179o793o086k721J020M877O806
$$ -3196 -9114 -11532 -9551 -4025 2853 8780 11278 9652 4473 -2320 -8406 -11127 -10107 -5230 1576
1652A576O218L447q61m736o573o417l560N37M347O607O020L876%m192o270o381
$$ 1576 7794 11241 10380 5644 -929 -7346 -10906 -10369 -6022 585 6605 10481 10481 6289 19 -6362
1668f362l871l05L526O585O203M353M59l438n966o627m406q02L100N930O264M919
$$ -6362 -10233 -10538 -7012 -427 5776 10129 10588 7150 1184 -5443 -9849 -10651 -7551 -1621 4643 9562
1684I562J202k939n448o773m689j849L101N046O519N173J762k377n400o157n267
$$ 9562 10764 7825 2377 -4396 -9085 -10934 -7833 -2787 3732 8905 10667 8290 2890 -3267 -8534
1699h534j978K063M661O643N327K369j344n079o530n415k625J207M459O149N845
$$ -8534 -10512 -8449 -3788 2855 8182 10551 9207 4128 -2402 -7817 -10442 -9235 -4776 1373 7218
1714G218K972q46m172o212o023k790K24M197O222N412L373P5l847n981n787l960
$$ 7218 10190 9344 5172 -1040 -7063 -9853 -9629 -5432 790 6202 9575 9650 5803 -178 -5965 -9925
1730i925J18L622N790N996L706O75l458n570o169l686j133L209N283O174M234
$$ -9925 -9807 -6185 -395 5601 9307 9982 6524 954 -5215 -8901 -10034 -6825 -1542 4632 8866
1745H866P13k415n287n892m750j110K169N251N930M893J583k103n014o186m648
$$ 8866 9579 7164 1877 -4015 -8765 -9875 -7706 -2455 3475 8368 9951 7848 2834 -3352 -8000
1760h000j939J941M917N662M862K150j376m494n855n094k472J150M526N644N272
$$ -8000 -9939 -7998 -3081 2581 7443 9593 8217 3723 -2132 -7226 -9698 -8548 -4022 1622 6894
1775F894K663j137l970n671n186k861O38L581N683N479L296l65l675n377n606
$$ 6894 9557 8420 4450 -1221 -6407 -9268 -8630 -5049 634 6113 9409 9044 5369 -8 -5614
1790e614l577K27L406N293N640L606k19k828n399n320l746p47L033N011N559M093
$$ -5614 -9191 -8964 -5558 -265 5375 8981 8762 5934 535 -4785 -8531 -9278 -6245 -1234 4325 8418
1806H418P58k737m824n617m039j185K242M916N691M206J407j981m542n862m143
$$ 8418 9176 6439 1615 -4002 -8041 -9226 -6984 -2068 3623 7829 9236 7255 2713 -3149 -7292
1821g292j948J961M342N407M667J910j696m204n154m813k155R98M382N356M755
$$ -7292 -9240 -7279 -2937 2470 7137 9047 7351 3147 -2007 -6820 -8975 -7977 -3595 1761 6516
1836F516K460j145l736n585m662k646N45L720N227M886K821l12l074n065n250
$$ 6516 8976 7831 4095 -1490 -6152 -8798 -8253 -4533 694 5580 8401 8089 5015 -50 -5300
1851e300k953m1L193M994N183L121J37k994m918n065l345j73K527M557N252L440
$$ -5300 -8253 -8294 -5101 -107 5076 8197 8334 5340 422 -4643 -7988 -8161 -5634 -1077 4175 7615
1867G615J044k740m513m895m001q75K083M501N235L674J287k014m255n377l509
$$ 7615 8659 5919 1406 -3489 -7490 -8365 -6282 -1781 3454 7128 8415 6401 2146 -3231 -6740
1882f740j560J612M163N259L904J725j585l957m932m274j797J347L758M774M395
$$ -6740 -8300 -6688 -2525 2734 6638 8363 6778 2821 -2111 -6385 -8182 -6835 -3077 1697 6092
1897F092K163j017l764m737m533k030O12L297M740M357K761k38l551m601m556
$$ 6092 8255 7238 3474 -1263 -5796 -7826 -7214 -3917 823 5180 7941 7703 4152 -449 -5005
1912e005k889K05L325M463M682K771K46l048m356m813k864j09K396M198M782L133
$$ -5005 -7894 -7689 -4364 99 4781 7552 7798 4750 394 -4419 -7283 -7392 -4996 -798 3984 7117
1928G117N78k404m335m399l440q74K108M294M682L468J064j901m295m707l492
$$ 7117 7695 5291 956 -3443 -6883 -7757 -5649 -1355 3327 6795 7859 5958 1663 -3044 -6536
1943f536j225J677L984M657L714J248j553l279m724m008j465J005L617M544M053
$$ -6536 -7761 -6084 -2100 2557 6271 7519 5966 2687 -2037 -6045 -7510 -6505 -2888 1656 5709
1958E709J994j122l222m834m012j917P53L130M488M291J992n83k838m503m187
$$ 5709 7703 6581 3359 -1475 -5487 -7404 -6651 -3521 967 5258 7250 6667 3829 -674 -4861
1973d861k233j04L011M534M289K581k88k404m620l963k857m3K310M259M323K733
$$ -4861 -7094 -7198 -4187 347 4636 7217 6929 4525 -95 -4058 -6915 -6958 -4648 -389 3934 6667
1989F667N19k248m014m463k935o86J844L978M476L102R34k007l543m373l354r90
$$ 6667 7186 4938 924 -3539 -6474 -7160 -5316 -1338 3138 6240 7174 5167 1624 -2749 -6103 -7093
2005g093J501L556M607L187J365j455l422m208l450j647J350L303M164L410J914
$$ -7093 -5592 -2036 2571 5758 7123 5668 2246 -1962 -5412 -7059 -5709 -2406 1758 5168 7082
2020G082r99l276m372l505j910P48L205M126L735J980o50k677l957m189j848Q4
$$ 7082 6083 2807 -1565 -5070 -6980 -6232 -3027 1099 4834 6814 6164 3487 -470 -4659 -6507 -6423
2036f423K640M095L985K192l28k483l753l786k441N4J930L890L812K677L89k166
$$ -6423 -3783 312 4297 6489 6161 3678 -75 -3861 -6302 -6248 -4318 -428 3384 6061 6450 4284
2052D284l619m002k405q64K081L366L967K883Q79j757l257m279l123n70J624L142
$$ 4284 665 -3337 -5742 -6606 -4525 -1159 2808 5691 6570 4813 1556 -2723 -5846 -6416 -4792 -1650
2068a650L803L385J031j352l419l930k924j417J402K959M102L035J107q06k892
$$ -1650 2153 5538 6569 5217 1798 -2132 -5056 -6473 -5071 -2112 1990 5025 6132 5326 2434
2083B434m014l380j167O95K882L681L605J337n40k702l731l216j934L53K365L845
$$ 2434 -1580 -4960 -6127 -5432 -2550 1131 4736 6073 5533 2831 -900 -4116 -6050 -5697 -3332 513
2099E13L426J882j65k055l868l524k020j30K228L588L500K281J30j786l536l638
$$ 513 3939 5821 5656 3601 -267 -3791 -5811 -5941 -3713 -125 3375 5656 5786 4000 464 -3174
2115c174k312l99J664L369L922K303O17j675l285l628k672o10J543K861L641K970
$$ -3174 -5486 -5885 -4221 -852 3070 5373 5990 4315 1030 -2598 -5270 -5880 -4337 -1476 2165 5135
2131E135P25j336l001l375l086j008J291K923L421L047J076r94k591l723l051
$$ 5135 5860 4524 1523 -1852 -4938 -5946 -4655 -1732 1689 4736 5812 4818 2227 -1496 -4547
2146d547j241P93K560L598L027J576o33k615l325l151j699L15K522L438L190J663
$$ -4547 -5788 -4995 -2435 1163 4190 5766 5133 2518 -807 -3958 -5657 -5342 -2820 618 3808 5471
2162E471j92k105l546l261j947P1K129L433L241J736M28j880l093l493k055p50
$$ 5471 5279 3174 -372 -3633 -5580 -5509 -3380 53 3294 5030 5458 3578 485 -3008 -5063 -5813
2178e813K091L196L384K064L48j351l164l212k427n15J332L229K957K611P05j096
$$ -5813 -3722 -526 2858 4922 5270 3919 755 -2457 -4884 -5399 -4067 -838 2119 4730 5435 4339
2194D339l274l056k285j132J130K769K936L020R87r10k670l148l046r29N07K645
$$ 4339 1065 -1991 -4276 -5408 -4278 -1509 1427 4447 5434 4524 1854 -1294 -4340 -5269 -4762 -2117
2210b117L466K615J215m41k364l102k951j633M19K527K888K925J627k36k032l329
$$ -2117 1349 3964 5179 4738 2374 -728 -3679 -5312 -4893 -2366 522 3447 5074 4838 2806 -523
2226e23k830j777L29J900K942L153J807j07j597l156k981j923n03J790K896L127
$$ -523 -3353 -5130 -4801 -2901 41 3194 5001 4894 3297 141 -2840 -4763 -5266 -3476 -580 2547
2242B547K086L59j370k869l036k103n63J282K625L134K363M59j028k621k928k533
$$ 2547 4633 4992 3622 753 -2283 -4386 -4949 -3667 -1042 2092 4455 4914 3886 1265 -1663 -4196
2258d196j036J065K839K893K395J185j109k027l478k502p66M88K368K948K805
$$ -4196 -5232 -4167 -1328 1565 3960 5145 4036 2009 -1469 -3971 -4737 -4249 -1881 1067 3872
2273C872J285q26k196l067k581j367M63J997L038K621J425j09j948k929k920j448
$$ 3872 5157 4331 2135 -932 -3513 -4880 -4417 -2420 618 3239 4664 4555 2607 -322 -3242 -4690
2289d690J33J843K859K832J459J16j291l150k643j931j70J411K732L026J820K05
$$ -4690 -4557 -2714 145 2977 4436 4552 3261 111 -2532 -4463 -4633 -3222 -490 2536 4356 4561
2305D561j344k587l098j803n83J390K566K735K346N62j026k576l016k280m95J009
$$ 4561 3217 630 -2468 -4271 -4854 -3464 -898 1837 4183 4745 3719 1143 -1873 -4153 -4648 -3639
2321c639K298K929K320P29r02k407k773k229r85P73K068K928K304J241o08k253
$$ -3639 -1341 1588 3908 4637 3735 1328 -1445 -3674 -4659 -3886 -1818 1110 3414 4655 4047 1794
2337A794k753k392j221L96J886K948K690Q23J03j976k844k627j262K71J585K692
$$ 1794 -959 -3351 -4572 -4176 -2290 658 3348 4171 4274 2298 -546 -3173 -4435 -4164 -2579 113
2353A13K734J347l1j442k584k690j538k63J594K509K614J627M75j231k697k718
$$ 113 2847 4194 4163 2721 137 -2553 -4091 -4354 -2760 -251 2363 3990 4465 3234 537 -2181
2369b181j706l68J029K494K670J736P85j193k246k701k071m30R08K100K593K205
$$ -2181 -3887 -4255 -3226 -732 1938 3674 4459 3266 1020 -1681 -3752 -4182 -3274 -1174 1419 3624
2385C624P62r34k072k659k314q41Q72K032K511K142J136m08k122k479k311j040
$$ 3624 4386 3452 1380 -1279 -3593 -4434 -3562 -1530 981 3123 4259 3851 1729 -750 -3061 -4101
2401d101J46J845K784K319J176l56j847k457k034j571J73J621K241K603J342J60
$$ -4101 -3955 -2110 674 2993 4169 3813 1966 -491 -2525 -4096 -3923 -2302 -61 2542 3884 4044
2417D044j696k110k591j556r3J351K104K700J595K75j331k220k407j753k48J071
$$ 4044 2348 238 -2353 -3909 -4002 -2651 -547 2153 3748 4023 2692 472 -1935 -3688 -3936 -2865
2433b865K230K014K163L64j020j822k389k019o19R25K093K332K090N62p62j910
$$ -2865 -635 1379 3542 3906 2886 1064 -1325 -3344 -3963 -3038 -945 1387 3477 4039 3277 1367
2449A367k312k197q49N60K033K336K084Q02m24j847k161k111j022J77J740K487
$$ 1367 -945 -3142 -3991 -3431 -1398 938 3022 3824 3400 1553 -608 -2719 -3741 -3564 -1824 663
2465F63J979J176l36j511k469j982j083OJ451K004K438J231q3j266k146k068j208
$$ 663 2642 3818 3482 1971 -498 -2480 -3563 -3557 -2106 -102 2336 3567 3484 2218 72 -1996 -3204
2482c204m84J042K074K552J453K63j042k070k364j461n01R93K221K094J746K08
$$ -3204 -3688 -2646 -572 1980 3433 3696 2654 584 -1780 -3241 -3742 -2749 -528 1566 3312 3520
2498C520p83j934k151j568o63Q02J670K263J932O16q86j432k130k046q00N46J645
$$ 3520 2737 803 -1348 -2916 -3579 -2777 -1107 1156 3088 3704 2818 1386 -744 -2790 -3590 -3044 -1399
2515a399K142J868J053o36j641j756k333q37K46J540K182K058R00j02j578j842
$$ -1399 743 2611 3664 3028 1387 -369 -2702 -3539 -3293 -1753 429 2487 3387 3285 1707 -135
2531a35k112j196J6J504J957K067J050M05j385k084j942j292j85J228J973J870
$$ -135 -2247 -3443 -3427 -1923 34 2101 3151 3556 2171 87 -1855 -3147 -3332 -2104 -131 1739
2547A739J390J66r06j909j890j538m59J025J988J775J527L64p99j677k176j336
$$ 1739 3129 3295 2389 480 -1410 -2948 -3407 -2382 -394 1381 2908 3272 2473 796 -1380 -2716
2563b716o32M75K078J763J776O77o84j662j884j665r89Q28J408K033J711N19l00
$$ -2716 -3348 -2873 -795 968 2744 3421 2737 1075 -809 -2474 -3463 -2635 -1227 806 2517 3036 2736
2580B736j323j848j776j085M87J349J675J854J132k36j285j727j990j182O3J352
$$ 2736 1413 -435 -2211 -3296 -2809 -1460 215 2069 3201 2965 1680 -47 -2037 -3219 -3156 -1804
2596a804J646K166J028p7r33j760k067j257O5Q23J751J982J366Q5p31j671k121
$$ -1804 -158 2008 3036 2959 2026 266 -1801 -3058 -2993 -2170 -419 1563 2929 3014 2283 612 -1509
2613a509j344l27R98J499J810J453L70m99j704j770j446n85O37J292J851J907
$$ -1509 -2853 -3180 -2182 -683 1127 2580 2950 2451 747 -1023 -2469 -3054 -2417 -1125 726 2633
2629B633L99n77j197j764j686q01M39J396J667J602P87j89j171j950j612j017
$$ 2633 3032 2455 1258 -506 -2192 -2993 -2554 -1158 509 2111 2898 2709 1538 -412 -2024 -3041
2645c041K60J458J518J787O91O3j075j741j681j373K58J065J699J679J237P9q16
$$ -3041 -2781 -1323 195 1982 2673 2736 1661 -80 -1761 -3134 -2876 -1811 -112 1567 2804 2883 2067
2662B067j900j835j101l03J203J637J595J333J36p89j452j766j247m19P37J728
$$ 2067 167 -1668 -2769 -3072 -1869 -232 1363 2696 2832 2043 591 -1175 -2422 -2841 -2104 -376
2678c76J398J449M23n08j423j766j626p05Q55J301J782J617M84n16j334j563j557
$$ -376 1022 2471 2894 2386 963 -803 -2429 -3134 -2279 -978 804 2421 2905 2389 1055 -508 -2065
2695b065n46J72J250J491J591P91m30r78j794j431p32m2J219J700J580R68j80
$$ -2065 -2611 -2439 -1189 302 1893 2684 2254 1276 -518 -1949 -2681 -2723 -1504 196 1776 2744 2564
2712B564j006j728j522q92L1Q99J494J599J246j53p96j425j874q97l00J020J482
$$ 2564 1558 -170 -1692 -2584 -2553 -1654 -160 1439 2685 2532 1736 311 -1563 -2460 -2760 -1740 -258
2729b58J319J159M69o18j426j740j160l15M70J527J518J300N43q02j042j708j164
$$ -258 1061 2220 2689 2071 645 -1095 -2255 -2570 -2100 -573 945 2245 2788 1986 944 -764 -1928
2746a928q10M53J235J713J417M06l45j156j538j539m81M93R68J484J433O15kj098
$$ -1928 -2738 -2285 -1050 663 2080 2486 2141 985 -553 -2092 -2573 -2080 -1112 372 1805 2420 2418 1320
2764A320j458j592p09k8R88J515J455J054j26j013j208j649j107P8P74J470J565
$$ 1320 -138 -1730 -2439 -2467 -1479 36 1491 2545 2419 1406 198 -1451 -2558 -2480 -1706 -236 1329
2781A329R20J89q01j495j401r54j86R15J052J555R59M57p65j075j721j254q1L90
$$ 1329 2249 2438 1637 142 -1259 -2213 -2399 -1484 -432 1123 2082 2539 1774 699 -1022 -2276 -2357 -1967
2799a967J194J622J210K42l02j220j454j445k65L65R59J639J290N18r5j253j636
$$ -1967 -773 849 2059 2301 1999 779 -675 -2120 -2385 -2020 -1061 578 1868 2386 2291 1038 -598
2816e98j167p71J78J232J474J307O02j70q50j359j238r51M7R76J410J234P84J28
$$ -598 -1765 -2536 -2358 -1126 348 1655 2257 2087 1237 -122 -1360 -2311 -2264 -1288 122 1356 2140 2268
2834B268p86j330j421r23J7M52J492J413R21J97q03j034j616p74j63M92J134J306
$$ 2268 1482 152 -1269 -2192 -2175 -1723 -231 1182 2103 2300 1497 463 -1153 -1927 -2090 -1598 -464 842
2852H42J268K53l62j578j351q18o07P08R62J543R53N65n89r34j605q03o61M66
$$ 842 2110 2363 2001 423 -928 -1746 -2353 -1645 -683 860 1813 2378 1789 855 -750 -1553 -2214 -1748
2870a748R34J169J438K98j44r32j373j074p43J85P19J498J097Q94l32q54j060
$$ -1748 -814 355 1793 2091 1947 1015 -358 -1432 -2175 -1990 -1271 227 1324 2218 1886 1032 -28
2887b8j269r21L00Q22R94J459N88J9n85j107j417q69j89P90J220J134R37J89o28
$$ -28 -1297 -2218 -1918 -1096 -102 1357 1945 1964 1379 272 -1145 -2014 -2203 -1413 -193 941 1878 2067 1439
2906A439j261j249p10j0K77J117J369R35K2m02p13j776q47j74Q0J427J117R46
$$ 1439 178 -1071 -1781 -1791 -1514 -397 972 1907 1929 1527 814 -962 -1809 -1983 -1903 -476 641 1587
2924A587N62n85q89j080j063o24K86Q25J286J181N77k75r48j094j172n84J6R94
$$ 1587 2149 1564 675 -405 -1468 -2092 -1806 -981 305 1486 2063 1788 840 -254 -1426 -2010 -1994 -1000
2942a000J288Q78R73j10q96j081j278p89K10N63J126J228Q03k7o37j110j210q22
$$ -1000 288 1166 2139 2029 1133 52 -1226 -2015 -1805 -1242 -116 1112 1915 1888 1251 141 -1069 -1891
2960a891MO09R45J166Q92K28n12j034j312p75l78N73R82J252R44J19k28j162r24
$$ -1891 -1887 -1278 -333 833 1725 1953 1441 407 -905 -1680 -2058 -1485 -503 749 1693 1812 1584 422 -502
2979e02j066l77M71Q44J053Q69N13k07r83r34r68o48K04P80J158R17O13O5p83
$$ -502 -1568 -1945 -1474 -630 423 1292 1805 1598 615 -319 -1287 -1935 -1731 -951 207 1124 1737 1802 1019
2998A019j288j080m04J52N53J189R49M25K47n64r38j343o84P6N36J083Q73O02
$$ 1019 -269 -1349 -1753 -1601 -1048 141 1090 1515 1762 1198 260 -1083 -1767 -1691 -1155 -72 801 1403
3016A403M71o77r65j058o19l00M18J125J031P17L53m57j103r94q08q4K42R42J041
$$ 1403 1874 1197 232 -826 -1445 -1745 -1327 -202 829 1546 1899 1442 339 -655 -1463 -1547 -1305 -363 678
3035F78P51K54l15o54j168r10j51%P49J213O14N92l56o08q53r85n59M01M86J140
$$ 678 1429 1683 1368 714 -454 -1364 -1515 -1515 -766 447 1061 1653 1297 689 -164 -1149 -1708 -1307 -821 319
3055C19O86N77j66m70r97j101n29K81O06Q42P93P91om58j086r44m72j86O88P43
$$ 319 1005 1582 1416 946 -51 -1152 -1681 -1400 -794 48 841 1632 1626 1168 82 -862 -1334 -1520 -832 -89
3075h9P25Q24J83n71q55j070n49j45K61R82R77P19L23m66q61r15p02l76L28Q59
$$ -89 636 1460 1643 1072 217 -853 -1402 -1547 -1286 -304 673 1392 1715 1249 388 -527 -1229 -1605 -1277 -418
3095d18R43P33K83k28o41j109o88l62K95M97Q87R07M14l14m80j042n83o61J22
$$ -418 525 1258 1541 1313 672 -437 -1125 -1487 -1192 -695 192 1099 1513 1199 719 -323 -906 -1567 -1445
3114a445P51Q71O11N95N6o08r34p24n75J25L06R10R93M79K92p79q68n66p73k68
$$ -1445 -694 177 788 1383 1439 831 -103 -827 -1402 -1277 -971 -61 932 1411 1703 924 56 -510 -1283 -1551
3134a551O55P78Q58M46K89m27p53r54n35m4L35N62Q79O72Q6k65n90r84o78l47
$$ -1551 -896 -118 740 1186 1475 1048 295 -659 -1194 -1238 -903 -341 538 1210 1296 1031 441 -543 -1221 -1568
3154a568N08N40R33P35J80k13m48r53o82k87O4O34Q23Q25K37j72n62q60o44l76
$$ -1568 -1060 -520 413 1148 1328 1115 667 -286 -968 -1255 -1191 -557 266 1091 1328 1156 594 -266 -910 -1286
3174a286LN51P63Q63N05r6m65p93r57l49j8N40P16P35N36l1k21q20o35p89J75
$$ -1286 -1283 -732 31 894 1399 1303 838 45 -912 -1261 -1279 -739 -23 712 1248 1217 996 176 -459 -1248 -1073
3195a073J36P27P44N00J20k46n63q59n60j03L44N09P55P82p2k93l02j009m46l59
$$ -1073 -937 -210 534 1034 1154 908 345 -514 -1074 -1177 -833 -324 431 1213 1141 848 546 -463 -909 -1268
3215a268J66O36O62Q42J08k6m96q94m60m08P9O38N65N58M42l8l41j080m17m56
$$ -1268 -1102 -466 196 1038 1146 1120 624 -270 -730 -1138 -1059 -421 144 702 1144 1106 765 -315 -732 -1188
3235a188K0N82O37P29L20J20n49m87q91m72J26N59O05N17L91N2o04k99p18m83
$$ -1188 -1168 -586 51 780 1100 1220 671 184 -707 -1179 -1053 -494 111 628 1019 1071 467 168 -550 -1033
3255a033j07M02O52O65L62j2j43m20q99l55k28NQ52O26N85J36k55p55m47o57j1
$$ -1033 -1140 -738 -86 579 941 929 786 366 -533 -888 -1116 -1111 -259 367 952 1088 833 78 -369 -1026 -1037
3276a037L05M44M52N10M32o2m63r21m25j67q8N12M70Q51J07K1m45n04q40k95K00
$$ -1037 -732 -288 164 674 1106 1044 581 -340 -765 -932 -1020 -508 -38 813 920 941 496 -8 -848 -1143 -943
3297i43K63N39R62K22j37j61o67n70m46l6K68N54P07L30K69m62n10o48o51J58
$$ -943 -680 -141 821 1043 906 745 78 -492 -938 -974 -706 -152 555 885 1154 692 182 -466 -1117 -959
3317i59J21N98P67L43m1k77l71p32l53j03K49L96M94Q17o0k7n13p97n15p0J18
$$ -959 -838 -240 527 870 829 552 181 -551 -904 -1007 -758 -362 132 949 889 862 349 -448 -963 -1033 -915
3338i15N08M98Q28j91k7k87n66m58l32J6L89O30O63L70l56l19o48o12j4J77K44
$$ -915 -407 91 919 728 701 414 -152 -610 -942 -926 -537 93 756 1126 770 451 -197 -809 -823 -646 -402
3359d02M91M77L37j18k10n61n29k86p9M64K11N26L56K71l28n82m18m10mJ38N27
$$ -402 89 566 903 785 575 14 -515 -801 -880 -416 -205 321 677 948 620 38 -380 -790 -794 -656 -129
3380a29L35N91J27j88m28p45k86j76M05J52L91M70L72l26m5o91m38l43K88M77
$$ -129 206 797 924 736 308 -437 -723 -899 -494 -342 49 519 891 565 520 -171 -609 -952 -664 -187
3400a87J19N08K04J11m36l94m49k03O1j6P41N79K72j94j99n07m54l65NK52N91
$$ -187 -68 440 644 755 319 -75 -524 -727 -666 -682 59 638 910 716 517 10 -444 -809 -804 -552 39
3421C9M04K38o1j59l90m19l34j37L50L91M63L92j85J1m15j74m74m89N04L61L09
$$ 39 443 681 620 461 71 -348 -682 -819 -469 -78 385 777 592 603 188 14 -460 -949 -445 -84 225
3442B25K35K04k0m62l31n32J79j22M20L65N03L8k68j14o80j53r2M6J89M76M69
$$ 225 460 664 644 182 -149 -681 -502 -624 -204 161 664 702 434 320 -360 -513 -605 -559 -370 106 575
3463E75J27j42k27l85p16Q9J96P7M31M46K48j2k40m73l75k49r2j2N64N26L91j07
$$ 575 702 560 333 -52 -768 -679 -483 -406 25 471 719 707 467 -6 -381 -630 -722 -734 -170 356 747 640
3485F40l65j80k64m08N7J44L26L73J15O7j94j60n86m8j23k5L32M82K62J85j71
$$ 640 275 95 -169 -577 -520 -376 -50 323 438 505 311 151 -435 -483 -606 -631 -299 183 445 630 459
3506D59k12l85l30k0j38M41L12J81R1L8j90l69m17K1j59L72M09K58J79k36n4m64
$$ 459 247 -138 -468 -488 -626 -185 127 308 399 437 247 -122 -539 -518 -677 -305 104 362 541 305 251 -213
3528b13j77k10P1K65J07L85K70Mj74m93k96Pk59L64M13J56J67O7k7j00o52kk55
$$ -213 -390 -600 -529 -264 -157 228 498 502 328 -165 -461 -454 -713 -349 64 220 387 454 427 327 -325 -327 -582
3551e82oK83O34L03N5k84l12l06l34J3J44J37L12J99oNj08l09j86Nr8L99MK85
$$ -582 -588 -305 329 632 687 403 91 -215 -549 -536 -392 -255 57 256 250 255 147 -162 -348 -343 -441 -42 -38 247
3575B47J11J09l26l2l62l41J46J80J53M93K28m2m12m4m61k1J15n4K94K86Q0K23
$$ 247 358 467 141 109 -253 -594 -448 -268 -115 378 606 564 152 108 -353 -374 -259 -313 -19 267 347 570
3597E70l19j05m47j84J17R0l8M36K09p6J1k02o5k54L9o5L39J32l9K18j78j87j33
$$ 570 251 146 -301 -485 -368 -278 -316 120 329 253 264 62 -3 -257 -218 -283 56 188 149 367 189 2 -131
3620a31k08Mn5k0O79J29L1j17n04K7m0j10o3K35K79K1J18K0n0m39j18J83k36J34
$$ -131 -339 -335 -390 -410 269 398 429 312 -192 -165 -205 -315 -378 -143 136 157 275 295 245 -194 -312 -129 -365 -231
3644b31L03K50K3P5o9l73k06n3M9R6J06K11J82k17N5l11Q3k23j13J54J27J96K00
$$ -231 72 322 345 420 351 -22 -228 -281 -232 -136 -30 181 363 146 201 -110 -27 -250 -363 -209 -82 114 314
3667C14R9k74P4k01k43pk3L81j93K56L0%j0l46L0m11L14J86k6L33k34K48K8n08
$$ 314 413 139 213 12 -231 -238 -261 120 -73 183 213 213 203 -143 -113 -524 -210 -24 -50 283 49 297 325 -183
3691a83m4M5N5k43M02P3K13k50K00l09N4k08J1J42J34J07JJ09k46k8j06n4J3k9
$$ -183 -227 -182 -127 -370 32 105 318 68 268 -41 13 -195 -184 -42 92 199 200 309 63 35 -71 -125 -112 -141
3715a41O5K5L74j47Lj16l13j00J53J83NJ53L1R3m56K67r7j54J19j32J9L76j65
$$ -141 -76 -51 323 176 179 63 -250 -350 -197 -14 -9 144 175 268 -188 79 -18 -172 -53 -185 -166 210 45
3738D5J08q8j36Q8l52J98J39j18J24P5K16j15j98J45j05n8j11J90m8p0K22n9P3
$$ 45 153 65 -71 17 -335 -137 2 -116 8 83 299 184 -14 131 26 -32 -143 47 -1 -71 151 92 165
3761A65j23k03K91l64N4J56L5P5l8L3J22k92R4j56O2R3n4j0K52j0j33k86o5K81
$$ 165 42 -161 130 -234 -180 -24 11 86 48 81 203 -89 5 -151 -89 4 -50 -60 192 182 49 -237 -302 -21
3785b1K3J03m8R4j50L64l84o6k14J38K81l23J58j06J21J43l5n7K19m03J47j21
$$ -21 2 105 57 151 1 365 -19 -85 -299 -161 120 -203 -45 -151 -30 113 78 21 240 -163 -16 -137
3807a37l2J55k6J66j93m4PJ55j70P8KJ34k2J5Rk76R0J60k6r8J93j65K3M0kJ18
$$ -137 -169 -14 -40 126 -67 -111 -104 51 -119 -41 -39 95 73 88 97 -179 -89 71 45 -53 140 -25 -2 38 36 154
3833A54j94j82K17J15r2N4k10J32%J8p1J07k48L02j54O5R5J01j93k9N6j17L04
$$ 154 -40 -222 -5 110 18 72 -138 -6 -6 12 -59 48 -200 102 -52 13 108 209 16 -13 43 -74 230
3856B30l48R6J88j70p9K3n9J16N9M1k49MP4J71k23n9J63Q0n1nJ06P8q3j05N6m0
$$ 230 -118 -22 166 -4 -83 -60 -119 -3 56 97 -152 -148 -74 97 -126 -185 -22 58 7 2 108 186 103 -2 54 14
3882A4n9j02J91N7j12O2K0n7Q3N0m18K86P0O6k05R5J06l6j92OL4K55j22M8Q2j81
$$ 14 -45 -147 44 101 -11 51 71 14 97 147 -271 15 85 151 -54 41 147 111 -81 -75 -41 214 92 140 222 41
3908D1J79k76O6j60M6J24J16r6k13M61k42j27k1j0K8J64k56L51j24P4n4j99j10
$$ 41 220 -56 10 -150 -104 20 136 40 -173 288 46 -81 -102 -112 -84 80 -176 175 51 125 71 -128 -238
3931b38J90l3P7j06K05q2K7m6p8k6K2p8p4L02Q9J4R1n2j93j96M1L5j98L73j22
$$ -238 -48 -81 -4 -110 95 13 40 -6 -84 -110 -88 -166 -240 62 151 165 256 204 11 -185 -144 -109 -307 66 -56
3956e6L24k40K42j66k73J99j42j51J96K65r6K22l8l56j72J02Rj7J48L9K3J78k07
$$ -56 268 28 270 104 -169 30 -112 -263 -67 198 102 324 286 -70 -242 -140 -131 -148 0 39 62 240 33
3979C3J91l15p4Nk43L75p9J50q2K08J1K7m59J42k27J23L24j0L9R2k72K28m77J74
$$ 33 224 -91 -165 -160 -403 -28 -107 43 -39 169 180 207 -252 -110 -337 -214 110 100 139 231 -41 187 -290 -116
4003a16l8Q3O7P3J28J53k41N7j82k08O7j44K26J5L42%M6j61l59M5N0r4J14q2L16
$$ -116 -154 -71 -4 69 197 350 109 166 -16 -224 -157 -301 -75 -60 282 282 328 167 -192 -147 -97 -191 -77 -159 157
4028A57j14R3O5k77n8j17J23j0k6N12j74J38j00j53j52p9j60J29J92L22R1l2o7
$$ 157 43 136 201 -76 -134 -251 -128 -138 -164 348 174 312 212 59 -93 -172 -332 -203 -11 311 402 370 303
4051C03m46m7n8rK48P8n5K61L5Kk56k52k49J35J74J22K45K4J18J28m12k82M1j50
$$ 303 -143 -190 -248 -257 -9 69 14 275 310 312 56 -196 -445 -310 -136 -14 231 255 373 501 89 -193 -152 -302
4075c02k4P3K81K57J8K01k49j72l11j97O3J09K83J18J78Q0k63o5m28n0J74j43
$$ -302 -326 -253 28 285 303 504 255 83 -228 -425 -362 -253 30 148 326 406 143 78 -350 -400 -226 -369
4097c69M08j4L36Q0m0k55k76j85J61P1M2K64p6M59m76J6l64p4m6J41J55J03M26
$$ -369 39 25 361 441 401 146 -130 -315 -154 -83 -41 223 147 606 130 146 -218 -292 -338 -197 -42 61 487
4120D87j70q9q7l98Qq6P6K2K45L42J28j02l70j92p7k13K69p2K34K68OR4j15j60
$$ 487 317 228 141 -257 -249 -335 -259 -237 8 350 478 376 6 -186 -263 -476 -207 -279 -45 223 229 323 208 48
4144D8k55k0KO9K09L36j23J91l06k95l16K5Q8L63j86N33k3j66k10P0l31J53k88
$$ 48 -207 -227 -225 -156 53 389 266 457 151 -144 -460 -435 -347 16 -170 363 340 174 -36 34 -297 -144 -432
4167d32J31L82l5K34K67k91j60m28r5K1K28J73N9M73k60j28j3k85q2l80K59K59
$$ -432 -301 81 46 280 547 256 96 -332 -427 -406 -178 -5 54 527 267 139 126 -159 -241 -621 -362 -103
4189a03L95J13m3j12j40P3m35j73O4L61M4L20J87l18j34l06j22j17N3J89J80L48
$$ -103 292 405 362 250 110 183 -252 -425 -361 0 44 364 551 233 99 -207 -329 -446 -393 -204 -24 324
4211C24K5K0m8l07l07P8j18K08K51P7j1L01j86l28k71Q0l20J96L86K02K06j20
$$ 324 349 369 321 14 -293 -215 -333 -125 126 203 192 493 307 -21 -292 -212 -532 -336 50 252 458 338
4233C38k63P0m02j46j20N8M67J51L43ll13k1k58j60j86N0K28L71K84k71j30Q8
$$ 338 75 145 -257 -403 -523 -465 2 153 496 493 180 159 -99 -259 -445 -395 -167 204 488 217 87 175
4255A75m13k15j4O9K14K75M62n5l82j44k21j04p0n7J92N60K68O0k16j94k16l51
$$ 175 -238 -453 -467 -398 -184 91 553 498 116 -28 -249 -353 -423 -480 -288 272 540 600 384 190 -26 -377
4277c77j25r4M79K07L69oN3k90k75k77k91J62O0M54J79Q3L02l95r4l02j66k29
$$ -377 -502 -596 -117 90 459 453 506 216 -59 -336 -627 -465 -405 49 228 311 613 218 124 -178 -344 -573
4299e73M21J91K49J25K14l05l68j85j05k02J41K01N00K27k71L38l73l60k96j58
$$ -573 -152 39 288 413 627 322 -46 -231 -336 -538 -397 -196 304 531 260 598 225 -135 -431 -589
4319e89J59K43K93L13L7k07k64k0l63j89J13L03K95M64P0rm86r4n10j14J04R9
$$ -589 -430 -187 106 419 456 249 -15 -35 -398 -587 -474 -171 124 588 658 649 163 69 -441 -555 -451 -352
4341c52M89J22K63K0l10k04l72l29J96Q1M42L54j13J19j17l22j48l84j6J84J80
$$ -352 137 259 522 542 232 28 -344 -673 -477 -396 46 400 287 406 289 -33 -181 -565 -581 -397 -217
4362b17M02K57J54n2l27l60k13j05J25L01L59K59j43j42j47m08k14j06J40K49
$$ -217 185 442 596 544 217 -143 -356 -461 -336 -35 324 583 440 298 151 -257 -471 -577 -437 -188
4382a88L38L27P2j51l08l21j37k90K19K51M16J13K41p5j27n33q0l21q4M53M43
$$ -188 150 477 549 398 90 -231 -368 -658 -439 -188 228 341 582 507 380 -153 -233 -554 -638 -185 258
4403B58K35k30K23k14k85l09l82J67J84L31L50K53k83j5l76k06j27o9O2N01L35
$$ 258 493 263 486 272 -13 -322 -704 -537 -353 -22 328 581 298 283 -93 -299 -426 -495 -433 68 403
4424D03P2O5j31l03m26l8k69J84K91O18J17J04k63j16q43%l6J09M60M8L85L61
$$ 403 475 540 409 106 -320 -358 -627 -443 -152 466 583 687 424 308 -535 -535 -571 -462 -2 46 431 792
4446G92k55l28m06j98j98K10L28J47K89L1Q2j45n85q9k12J18j3N96L40O5k09j07
$$ 792 537 209 -197 -395 -593 -383 -55 92 381 412 494 349 -236 -325 -537 -419 -432 164 504 569 360 253
4468B53j46m24l36K22J77K51K15M80j51l51j59l60j36k63M11L19K68L00Kj93j41
$$ 253 107 -317 -653 -431 -254 -3 212 692 541 190 31 -329 -465 -728 -317 2 270 570 572 379 238
4489B38n08k94j59M39o4P51K47k65J40m00l19j33k11K18K46R6O44k94j8r3m69
$$ 238 -270 -564 -723 -284 -348 403 650 385 525 125 -194 -327 -538 -320 -74 22 666 372 354 261 -208
4510b08k47p0L25l3M79K56O2N6l12m07j78k86O8M8N46K82J86k44P8n43l60N7k06
$$ -208 -455 -525 -200 -233 246 502 564 620 308 -99 -277 -563 -495 -447 99 381 567 323 401 -142 -502 -445 -651
4533f51L25L48N12J39j17k41l22l34k16O6J65K66J98L43R5j10m29l06p4j99J02
$$ -651 -326 22 534 673 556 315 -7 -341 -557 -491 -326 -60 138 481 576 466 37 -269 -343 -542 -440
4554d40M79J90M46n2Q0o33k42l45j7J08J93L98L84J03m03l5k60l72j92K44J58
$$ -440 39 229 675 623 703 70 -172 -517 -534 -426 -233 165 549 652 249 214 -46 -418 -610 -366 -208
4575b08N61j1M27j52n14j82m99j77L1M37L21M70K2j71o5l43n48R9R0J11K47M56
$$ -208 353 342 769 617 103 -79 -578 -755 -724 -287 34 504 526 355 290 -53 -601 -502 -412 -301 -54 402
4597D02J77n2k44j64n03l64J09R8M08L94K79k70L36o75k64k93R8o7N34J30M68
$$ 402 579 527 283 119 -384 -748 -639 -541 -133 261 540 270 606 -69 -333 -626 -528 -595 -61 69 537
4618E37K6R4m03o73r4o1n9N86J82L97J43l44j90k90j88q6J0L25K61K68M2omo27
$$ 537 563 657 254 -419 -513 -574 -633 -47 135 532 675 331 141 -149 -337 -423 -413 -88 173 441 483 477 473 -154
4642a54k27k32K30J08M00J42K96n7j49m14o48K22j89N46J65L97K58k12r2m77k31
$$ -154 -381 -613 -383 -275 125 267 563 506 357 -57 -705 -483 -672 -126 39 436 694 482 390 -87 -318
4663c18j47j40K41J08O57m2K5k5k30m34k58L6K26K52K85K76N8k40l63j13k93k27
$$ -318 -465 -605 -364 -256 401 359 384 359 129 -305 -563 -527 -301 -49 236 512 570 330 -33 -146 -439 -666
4685f66K94L14J03M38J28k42l23j55j65j10j09L63J99L56J52M1m23j21m90j88
$$ -666 -372 -58 45 483 611 369 46 -109 -274 -384 -493 -130 69 425 577 618 195 74 -416 -604
4705f04J04J66N05K10M2m8r7l37m83j01J81k3N44L10j0J35j28l84k73l27k06O54
$$ -604 -500 -334 171 381 423 375 278 -59 -542 -643 -462 -485 59 369 359 494 366 -18 -291 -618 -824 -170
4727a70J50M32J90m8k04l97k53j33J5J9L14M06K08O6k90j60m32q2j07k06N77M22
$$ -170 -20 412 602 554 350 -47 -300 -433 -418 -399 -85 321 529 595 305 145 -287 -369 -476 -682 -105 317
4749C17J80j09L55o04k58k70r8K12j4N50J14L53j05n13j00n84l6K33K76K7N67
$$ 317 497 388 743 139 -119 -389 -487 -275 -289 261 375 728 623 110 10 -574 -610 -377 -101 -74 493
4770D93K04km51k49l03l30K93Q8K63L53J26r3j02k05l28l13J80Q9K59M76P8q1
$$ 493 697 695 244 -5 -308 -638 -345 -257 6 359 485 392 290 85 -243 -556 -376 -287 -28 448 526 445
4792D45r9k25m60k23K44K6K15M81n3K91j36l95k19l65j73L26L44pN37k4L3l87
$$ 445 346 121 -339 -562 -318 -292 -77 404 351 642 506 111 -108 -473 -646 -320 24 17 554 530 563 176
4814A76m36j12k10J25K24J75N29J92k51l59j00k67j65P5L14K41K86R7O4m42l37
$$ 176 -260 -372 -582 -457 -233 -58 471 663 412 53 -47 -314 -479 -404 -90 151 437 534 598 156 -181
4835a81l8m18J74K33L18K36J48R5Rn13m04j41n2K35K72J88K54R6j06k64p27J40
$$ -181 -219 -637 -463 -230 88 324 472 567 576 63 -341 -482 -534 -299 -27 161 415 511 405 141 -586 -446
4857d46n8J36L54K03K67J40j78l55k93k43p3J42N02J08J45L82l30m18n4m14k0
$$ -446 -504 -368 -14 189 456 596 418 63 -230 -473 -546 -404 98 206 351 733 403 -15 -69 -483 -503
4878e03J50Q8L51N64j97Ql66k68k5l17j87M57K83K54R9j84J11l24l64j47O8J76
$$ -503 -353 -265 86 650 453 461 95 -173 -198 -515 -702 -245 38 292 391 207 318 -6 -370 -517 -449 -273
4900b73L24K28K90k5j83k15l65j66j08J21K60M89j17J67P7n88k77k55J63K80J50
$$ -273 51 279 569 544 361 146 -219 -385 -493 -372 -112 377 260 427 504 -84 -361 -616 -453 -173 -23
4921b3M93k34J63j67n0n54K7j78J11L66K10L04l2Pk87k88l55k6J87M5L30K99P4
$$ -23 470 236 399 232 182 -372 -345 -523 -412 -46 164 468 436 443 156 -132 -487 -513 -326 -281 49 348 422
4944D22R5k05k15l86r4J60j04L77K09K14k7k66l67j61j80K27j87L13O10jk6O5
$$ 422 517 312 97 -289 -383 -223 -327 50 259 473 446 180 -187 -348 -528 -301 -488 -175 435 434 408 473
4966D73k62l44k97P1P9K53L21J4O8Kk74k32l34qK02J79K98L60k8k20k21k85k25
$$ 473 211 -133 -430 -359 -280 -27 294 308 376 378 104 -128 -462 -470 -268 -89 209 569 541 321 100 -185 -410
4989d10j48N9K88N03l4K45j42l74l6l96q6JJ44L67N05J8j08j04n57k7j60J17J53
$$ -410 -558 -499 -211 292 258 503 361 -13 -49 -445 -531 -530 -386 -19 486 504 396 292 -265 -292 -452 -335 -182
5012a82J32L41J98J6k11l18n52K59k40L04L85J41L41k11j83l62k71r0M8J47L37
$$ -182 -50 291 489 505 294 -24 -576 -317 -557 -253 132 273 614 403 220 -142 -413 -503 -455 -308 29
5033B9K76L6K00o6o11j78j52j3J96M5L74K71q6J45k91l55j66j62J80J65M38o4
$$ 29 305 341 541 475 -136 -314 -466 -479 -283 -238 136 407 321 466 175 -180 -346 -508 -328 -163 275 211
5055B11J36o1ll90m6k38j70M18M20Q3K87j54l70l06Rl36J38K3L93K06L40j63k21
$$ 211 347 286 283 -107 -153 -391 -561 -143 277 360 647 493 123 -183 -174 -510 -372 -349 44 250 590 427 206
5078B06k75j98L3k19M7L26L66j5J01o0j61m22j34KN3K32L78K97j21k43k7p07J81
$$ 206 -69 -267 -234 -453 -406 -80 286 271 372 312 151 -271 -405 -403 -350 -118 260 557 436 193 166 -541 -360
5101c60J40j02J40M79Q4%k34r7k65j42mL2K77J22L02n1R1l61k70k07l3J01K08
$$ -360 -220 -322 -182 297 381 381 147 50 -215 -357 -361 -329 -52 70 372 321 412 51 -219 -426 -459 -358 -150
5124a50J38J92K48J3j96k00l17J4l02L03L73K58J89j07kn57k97J04o8J10P4M73
$$ -150 -12 180 428 441 245 45 -272 -258 -560 -257 116 374 563 456 454 -103 -400 -296 -364 -254 -180 293
5146B93L37l13j23j96j87k65J38p2L45K19J43O7n4l34j9m30n1J76L69J64K22j36
$$ 293 630 317 194 -2 -189 -454 -316 -388 -43 176 319 386 332 -2 -21 -451 -502 -326 43 207 429 293
5168B93l6k05k35j39n7N1J30L30K91J74j24m09l04j13j60j3K39K68M47N0l6l63
$$ 293 257 52 -183 -322 -379 -328 -198 132 423 597 473 64 -240 -353 -513 -526 -287 -19 428 478 442 79
5190G9K3l25k48J38J55K10J30K22K21l46m38J02l79J6l6O91j44J97K06q9k69k46
$$ 79 102 -223 -471 -333 -178 32 162 384 605 259 -179 -77 -456 -440 -476 215 71 268 474 385 116 -130
5212a30k98LJ36J07L30J64k8M9m36l4m06Q5J85K14J84K68J05j28l27j70k54j63
$$ -130 -428 -425 -289 -182 148 312 284 333 -103 -137 -543 -458 -273 -59 125 393 498 370 43 -127 -381 -544
5234e44L09J17L89j02J80J84j87n35M1k99m0K53M27j46L58kj43k79l17Q1q9J45
$$ -544 -235 -118 271 169 349 533 346 -189 -148 -447 -487 -234 193 47 405 403 260 -19 -336 -255 -344 -199
5256a99L7M51j93M42l21j55j38l07J17k2L09K04O9J06l6j70m07j72j05L61m3L74
$$ -199 -162 289 96 538 217 62 -76 -383 -266 -288 21 225 294 400 364 194 -213 -385 -490 -129 -172 202
5278B02K02J61n34J4r3l30m0N5K33K74L35k22L7k8l70l26r3k0L22J74K23J11J50
$$ 202 404 565 31 45 -48 -378 -418 -363 -130 144 479 257 294 266 -104 -430 -523 -543 -221 -47 176 287 437
5301D37l23k57j09j78R0J88K24J12J63q4j3l46ml18k3J81K25J53K05q4kl34k39
$$ 437 114 -143 -252 -430 -340 -152 72 184 347 263 250 -96 -100 -418 -441 -260 -35 118 323 239 237 -97 -336
5324c36j91M40j74K36K29J86m2r7k15k77j04k8J23J61J66J77K83k45j46m88J6
$$ -336 -527 -87 -261 -25 204 390 348 251 36 -241 -345 -373 -250 -89 77 254 537 292 146 -342 -326
5345c26L8q6L29J34J39K90j59j02j84k72j56M1J19M0M44J07n8L6m69j77j48j08
$$ -326 -288 -374 -45 89 228 518 359 257 73 -199 -355 -314 -195 -155 289 396 338 374 -95 -272 -420 -528
5367e28K06K19L53J53r5j51k07l37Q1K4P9J31K68J85P5j3n05r0k60m3M87j4K38
$$ -528 -322 -103 250 403 308 157 -50 -387 -306 -282 -203 -72 196 381 456 443 -62 -152 -412 -455 32 18 256
5390B56P6Q9k14k17r1l46k7NL63K52K69q1k2O8n13j24j50K62n3M42j9K4N4l90
$$ 256 332 421 207 -10 -101 -447 -474 -469 -106 146 415 334 312 380 -133 -257 -407 -145 -198 244 225 249 303 -87
5414h7J27k12k05K01K00k5J77J80O6k94k84Oj57J23J62lJ79L84j66j85k17m42
$$ -87 40 -172 -377 -176 24 -1 176 356 422 128 -156 -150 -307 -184 -22 -25 154 538 372 187 -30 -472
5436d72N7M6J2L11L66J09j29K02n21k57m4j28J09L30K49P9J81k39m13j80J09l9
$$ -472 -415 -369 -357 -46 320 429 300 502 -19 -276 -320 -448 -339 -9 240 319 500 261 -152 -332 -223 -262
5458b62J29N9J37K99P0j24l50j28j70p6J28K40M2J89K41k65L3k07l07p7J10K72
$$ -262 -133 -74 63 362 432 308 -42 -170 -340 -416 -288 -48 -6 183 424 159 192 -15 -322 -399 -289 -17
5480a7J59J95j82O1Q2m35j88J94l79L41K91L22j9j4k93j72j91k00J80J45J63R2
$$ -17 142 337 155 216 298 -137 -325 -131 -510 -169 122 444 425 411 118 -54 -245 -445 -265 -120 43 135
5502A35J67J55j73l03q4j72j05J22K52L14K5J0j82j62k72j06O4q3L18K93J29j56
$$ 135 302 457 284 -19 -103 -275 -380 -258 -6 308 333 343 161 -1 -273 -379 -315 -398 -80 213 342 186
5524A86R8J53o43j46J0j79L47M79P2l2n5j12k64k53j0J27J69J22J12K07op6n31
$$ 186 284 437 -206 -352 -342 -521 -174 305 377 345 290 178 -86 -339 -349 -222 -53 69 181 388 382 306 -225
5547b25J19l70K63r6K72L52K25o8j22m43k60j7J18J16PJ36L54J15j10j82m61k69
$$ -225 -106 -476 -213 -309 -37 315 540 472 350 -93 -353 -370 -252 -136 -129 7 361 476 366 184 -277 -546
5569e46K34O3L24K11K01k06j7k75j11n8k07K16J68P6L05l6o3l36k88j95n0K44
$$ -546 -312 -249 75 286 487 281 264 -11 -122 -180 -387 -171 -3 73 378 342 279 -57 -345 -540 -590 -346
5591c46K40K40L24k12K02k05m47j0O4j50jL14J70J22K10k11k37m65J06j73J50
$$ -346 -106 134 458 246 448 243 -204 -214 -150 -300 -301 13 183 305 515 304 67 -398 -292 -465 -315
5612c15K54K60L09J8l78k80k9k71J59J6J60L89M7Q3k15k66M6k79r8K77J84j66
$$ -315 -61 199 508 526 148 -132 -161 -432 -273 -257 -97 292 339 422 207 -59 -13 -292 -390 -113 71 -95
5634i5M24j01K6n5n80K4P9N6O8L76P1P9Ok50k43L3k70j39L99K89K53j20j19j05
$$ -95 329 228 254 199 -381 -357 -278 -222 -154 222 293 372 378 128 -115 -82 -352 -491 -92 197 450 330 211 106
5658A06k06j26o4m4K40K27O0K52j7k86l46j59p1J66qK70J76L82l9k42k90k27N0
$$ 106 -100 -226 -290 -334 -94 133 193 445 428 142 -204 -363 -434 -268 -276 -6 170 552 513 271 -19 -246 -196
5681a96N1j11J81N93j24j98j45P6m64nJ82R9J8N4K89M4M9l76k15j44J5m4K97K48
$$ -196 -145 -256 -75 518 394 196 51 127 -337 -342 -160 -61 -43 11 300 344 393 17 -198 -342 -327 -371 -74 174
5705A74K09q7j63K4l91l30K93j78L57K33J88N9j32qk34k21k68J16J45K13K60K03
$$ 174 383 296 133 157 -234 -564 -271 -449 -92 141 329 388 256 248 14 -207 -475 -359 -214 -1 259 462
5727D62k55J8k98q6p5q9J15L01K19j03J91k2l73n20J61J28k8K03K45P7K89k70
$$ 462 207 225 -73 -159 -234 -323 -208 93 312 209 400 378 5 -515 -354 -226 -254 -51 194 271 560 290
5749B90k38j75k63J31J9K02L46j34j0J88l59n7j51%m1L28K30q1l1J44m8l70k32
$$ 290 52 -123 -386 -255 -236 -34 312 178 168 356 -3 -60 -211 -211 -252 76 306 225 194 338 290 -80 -312
5772c12q0Q0K74K01K58j50J43l47j02l54j19M12J45RL59j46J57k8l75l56o1O5
$$ -312 -392 -312 -38 163 421 271 414 67 -35 -389 -508 -96 49 58 417 271 428 400 25 -331 -392 -327
5794c27J42J49L16R8r7j04k57j99j7K10k37K18L15QPj7r0l30k25J09J40L15O7
$$ -327 -185 -36 280 378 281 177 -80 -279 -296 -86 -323 -105 210 218 225 208 118 -212 -437 -328 -188 127 194
5817A94K70j39j38j34m22M29k98q9L10L64K02r9j90k68j46l13M6K30J49K27J82
$$ 194 464 325 187 53 -369 60 -238 -327 -17 347 549 450 260 -8 -154 -467 -421 -191 -42 185 367
5838C67n1J91l75k15k93L3o7L00K38K65o3j21j98Mk82j63K50P5k8L90J44k46O1
$$ 367 316 507 132 -83 -376 -343 -410 -110 128 393 330 209 11 15 -267 -430 -180 -105 -133 257 401 155 216
5861B16l37k80P6J11J19J66K21J90k79j01j98k47lkR4K32J87J72k62L1m9k77j56
$$ 216 -121 -401 -325 -214 -95 71 292 482 203 102 -96 -343 -346 -348 -254 -22 165 337 75 106 57 -220 -376
5884c76J3K61J17q6M24R1k59k43m4l48NJ68L44M6L04m2l7m03q4k13l9J72P7M08
$$ -376 -363 -102 15 -71 353 444 185 -58 -102 -450 -445 -277 67 113 417 375 338 -65 -149 -362 -401 -229 -152 256
5908B56j18J86j0N3m97j65n2r5L90R6L85j43k9j11m28L8j31k3J73K34L33o4M1
$$ 256 138 324 314 367 -130 -295 -347 -442 -52 44 429 286 257 146 -282 -244 -375 -398 -225 9 342 278 319
5931C19j29k15p5l46K45j2M05K56m01K43J91l37m20LJ0KK20J34K49J88k60r5j52
$$ 319 190 -25 -100 -446 -201 -213 192 448 47 290 481 144 -276 -273 -263 -261 -41 93 342 530 270 175 23
5954B3k20j03j09K70L29K0J83J38m11l24j49j06R6L63K11J29k05J21pk75j46k45
$$ 23 -197 -300 -409 -139 190 210 393 531 120 -204 -353 -459 -363 0 211 340 135 256 249 -26 -172 -417
5976d17J41L6L84J40N5j42p4k2k23j32J88r3K40J72K3%J25m43j47r5j24J36L64
$$ -417 -276 -240 144 284 339 197 123 101 -122 -254 -66 -159 81 253 276 276 401 -42 -189 -284 -408 -272 92
5999I2K32k1p2k29J23l92j8j01J70L78Q0j1P5j01Q2m09Jk13O5R8K19K06o9J2j10
$$ 92 324 303 231 2 125 -267 -285 -386 -216 162 242 231 306 205 287 -122 -121 -334 -269 -171 48 254 185 197 87
6024H7j61j96k49K39K36J31J16M1M2l9m48m6K8o6O7L60J45J07N1k97k36m1j00
$$ 87 -74 -270 -519 -280 -44 87 203 244 286 247 -201 -247 -219 -285 -218 142 287 394 445 148 -88 -129 -229
6047b29j71L06L05j10L46j76M8k66k36Rp9K04l3L87J99j06j45l86k9k07oJ21L58
$$ -229 -400 -94 211 101 447 271 319 53 -183 -174 -253 -49 -82 305 504 398 253 -133 -162 -369 -375 -254 104
6070A04L5J43P3j36j22j94k68oM8J88L67p8J89k53J89m53j67kJ11K87K1N72k02
$$ 104 139 282 355 219 97 -97 -365 -371 -323 -135 232 154 343 90 279 -174 -341 -343 -232 55 76 648 446
6093D46J1k00m17j03j05q0L28L78k2MK71k70m00k20J9m0L93Q4J22Q6K8j61n3m87
$$ 446 457 257 -160 -263 -368 -448 -120 258 236 240 511 241 -159 -379 -360 -400 -7 77 199 285 313 152 99 -388
6117c88Q3O1NM03K31j28p6J02l74lk29J08Q7J86l1L80j85J62m58k99Q4J47l4R8
$$ -388 -305 -244 -239 164 395 267 191 293 -81 -84 -313 -205 -118 68 37 417 232 394 -64 -363 -279 -132 -166 -68
6141f8n5N61j77jj49l05k0k6L5R6K18J29J98n9l83q1Om13K56J47L14L8R0m3l13
$$ -68 -123 438 261 260 111 -194 -214 -240 -205 -109 109 238 436 377 -6 -87 -81 -494 -238 -91 223 261 351 308 -5
6166eK4N3m36R4m5L19K75r5K49l74j26K7j77j50L16J36l4L17j34Pk06k90n4JJ15
$$ -5 19 72 -364 -270 -315 4 279 184 433 59 -67 -40 -217 -367 -51 85 51 368 234 241 35 -255 -309 -308 -193
6191a93J55P0K48Q4j35j51l50Lk6j40M80O9J83N0Mj40l09l17J70n2J14M87n3J05
$$ -193 -38 32 280 364 229 78 -272 -269 -295 -435 45 114 297 347 351 211 -98 -415 -245 -297 -183 304 251 356
6215C56k36j07J00l44k76K34K4K56L26o3r6k67K52m09O9k3J91K72J04N2j57k37
$$ 356 120 13 113 -231 -507 -273 -249 7 333 270 174 -93 159 -250 -181 -204 -13 259 363 415 258 21
6237B1j2j13k41RK37J27J22K60q9q4l50N3k50J23J10M8K28L49k44j61lk66k40
$$ 21 9 -104 -345 -336 -99 28 150 410 321 237 -113 -60 -310 -187 -77 -29 199 548 304 143 140 -126 -366
6260c66j26J61K95J37J23J45j47j85k03k60L50l54M84J18J06L79m49o1o0k65k65
$$ -366 -492 -331 -36 101 224 369 222 37 -166 -426 -76 -430 54 172 278 657 208 147 87 -178 -443
6281d43L06l7K65n3M23m9n38J04k78M0L5l0L39J28M2l9p3j41m19K29j29K25Q9
$$ -443 -137 -174 91 38 461 412 -126 -22 -300 -260 -225 -255 84 212 254 215 142 1 -418 -189 -318 -93 -4
6304dJ80M8J39k11Q3m36qk9M2Q8M91j36K65k43k36q8j78k7K26P4M8L13q8l27K5
$$ -4 176 224 363 152 235 -201 -209 -238 -196 -108 383 247 512 269 33 -55 -233 -260 -34 40 88 401 313 -14 11
6329A1j94j19M0k3L54J9K96N1k32l47p4%or1K87J74J3J48o4j24l62N0M4j56q9
$$ 11 -183 -302 -262 -285 69 88 384 435 203 -144 -218 -218 -224 -315 -28 146 159 307 243 119 -243 -193 -149 -305 -394
6354c94N03J78P0k1k01k19r3j02O0J3K58J63K54k45o6j09k15j96o5J65K89J80
$$ -394 109 287 357 336 135 -84 -177 -279 -219 -206 52 215 469 224 158 49 -166 -362 -427 -262 27 207
6376B07M9j58l0l1k19k49J96nK67r4L17p3j6j31k87J6J04Jk7K25L04n4k16o4q8
$$ 207 256 98 68 37 -182 -431 -235 -240 27 -67 250 177 161 30 -257 -241 -137 -136 -163 62 366 312 96 32 -56
6401e6j89j78K88j9L95j43J73R1l10k20j29j95M19N6m6K66P7J73l57k48n6m6R0
$$ -56 -245 -423 -135 -154 241 98 271 362 52 -168 -297 -492 -73 -17 -63 203 280 453 96 -152 -208 -254 -164
6424a64O3K70J73J3l2k74r9k05p1J42M3M7L63R1j66K7l38k55L76m64L14l1K49
$$ -164 -101 169 342 355 323 49 -50 -255 -326 -184 -141 -94 269 360 194 221 -117 -372 4 -460 -146 -177 72
6447G2J00J60j58j03l4m68P2O8K69J17K31l15K47j23k75j84K9o6J48K05K51J14
$$ 72 172 332 174 71 37 -431 -359 -291 -22 95 326 11 258 135 -140 -324 -295 -361 -213 -8 243 357
6469C57p6j68k6k44q0L4J2O6M34n7p9L5k40j22r1OL0J01N00k95O3j30Q3k50k16
$$ 357 281 113 87 -157 -237 -203 -191 -125 309 252 173 208 -32 -154 -245 -239 -209 -108 392 97 160 30 113 -137 -353
6494c53J37J71J04J54j10j18K18j45p1k15j68J87K49J74ol4Q5j82m8l03k12L48
$$ -353 -216 -45 59 213 103 -15 203 58 -13 -228 -396 -209 40 214 208 174 259 77 29 -274 -486 -138
6516a38qL55J52m5m3q3m01N3m6j26K45J56O6P8k7M7l56j10o4J50L26q1J47N2P9
$$ -138 -146 209 361 316 273 190 -211 -158 -204 -330 -85 71 137 215 188 235 -121 -231 -295 -145 181 100 247 299 378
6541C78n86K55j61j63o5K83o7L16J17K7l30j63L1m8rj2K88RJ61j50O5j89j72k62
$$ 378 -208 47 -114 -277 -342 -59 -126 190 307 334 4 -159 -128 -176 -185 -197 91 100 261 111 176 -13 -185 -447
6565d47L3K74J37J46N2J04k76J10j61o9j26o7K29ML06K45l92m3j48j61j16K15
$$ -447 -414 -140 -3 143 195 299 23 133 -28 -97 -223 -290 -61 -57 249 494 102 59 -89 -250 -366 -151
6587a51K09o6M33j66m0k19j2l29J66P1k05M23J26P1K1o6l84qk50K25O5P2P9J83
$$ -151 58 -8 425 259 219 0 -12 -341 -175 -104 -309 114 240 311 332 266 -118 -126 -376 -151 -86 -14 65 248
6611B48j81J14j47j44j33n0J85K41R1R0j21O5k31J34k53j94qL02P6J87k6j46j42
$$ 248 67 181 34 -110 -243 -293 -108 133 224 314 193 258 27 161 -92 -286 -294 8 84 271 245 99 -43
6634d3q4j60q9J82L7K56J12Qn7j65k5k01j29q9M53K71j48J37j99K3k29l2P0J27
$$ -43 -127 -287 -376 -194 -157 99 211 219 162 -3 -28 -229 -358 -447 6 277 129 266 67 90 -139 -171 -101 26
6658B6j35Q9J35k6N8j80K34l72j56J83O8K9L87p1k18k9lj72k60J78Q5Q6J68K29
$$ 26 -109 -20 115 89 147 -33 201 -171 -327 -144 -76 -47 340 269 51 22 19 -153 -413 -235 -150 -64 104 333
6682C33k65J20J57l47l18k8L9N05j00K44j49o3lj92n0l78N17n3qJ52m3K62j66
$$ 333 68 188 345 -2 -320 -348 -309 196 96 340 191 128 125 -67 -117 -495 22 -31 -39 113 70 332 166
6705A66m13P8jj61J86K14J51P8k43K83k00m97L03m2L1J34K61o4n7k3k36j29j99
$$ 166 -247 -169 -170 -331 -145 69 220 298 55 338 138 -359 -56 -98 -67 67 328 264 207 184 -52 -181 -380
6728c80R8K42J07L14j56M9p1k31l41J62k7K46J02M3O7J11j14k43k24n2j1p7L16
$$ -380 -282 -40 67 381 225 274 203 -28 -369 -207 -234 12 114 157 224 335 221 -22 -246 -298 -309 -386 -70
6751g0J29J23j3P1j80k11j75R0o0K77M8O9K31k02J25m84K07k6j60J98N3R7J4J80
$$ -70 59 182 169 240 60 -151 -326 -236 -296 -19 29 98 329 127 252 -232 -25 -51 -211 -13 40 137 151 331
6775C31m17J1k46Q7K5R8K35J1J11J34k38k38j26k05L11j15K40L12j91M3k16J20
$$ 331 -86 -75 -321 -234 -209 -111 124 135 246 380 142 -96 -222 -427 -116 -231 9 321 130 173 -43 77
6797G7k88J0j12P5L95q7K4J27k8k69J78m07j1K28J38L41r6j9j37R7j75l69K42
$$ 77 -211 -201 -313 -238 157 70 94 221 193 -76 102 -305 -316 -88 50 391 295 276 139 236 61 -308 -66
6820f6k26M7M49R7p6n3k01j98L0j02jL42j08K91j12J87r3k79j05k00K90J48j59
$$ -66 -292 -245 204 301 225 172 -29 -227 -197 -299 -300 42 -66 225 113 300 207 -72 -177 -377 -87 61 -98
6843i8L50j7Q2r4k13l08J68k23K78J58K66o3j69L3p7j90j25k40L79P0K16L4k5
$$ -98 252 235 317 223 10 -298 -130 -353 -75 83 349 286 117 150 73 -117 -242 -482 -103 -33 183 217 192
6866A92j38k0l63J05L5PK25K8K57k3j35k22J29l38N6n6L33r9K63J27m44O7k23
$$ 192 54 34 -329 -224 -189 -182 43 71 328 305 170 -52 77 -261 -205 -261 72 -27 236 363 -81 -14 -237
6889b37J41q9q5L23rK30O3j56k82J85k77j10J24j57L93o2J45j88K58k98J56l09
$$ -237 -96 -185 -270 53 44 274 337 181 -101 84 -193 -303 -179 -336 57 -5 140 -48 210 -88 68 -241
6911b41J31n0J09J63jk4J7J0k48J67l85K93k2J45N4J55j24k64jj62J35l5K07K04
$$ -241 -110 -160 -51 112 111 87 104 114 -134 33 -352 -59 -81 64 118 273 149 -115 -116 -278 -143 -178 29 233
6935B33Lj34K1p1n2p2j59mL34J21P2j10j0j69l4k33J27j39M2M45nJ18j59m5k6
$$ 233 236 102 123 52 0 -72 -231 -235 99 220 292 182 172 3 -31 -264 -137 -276 -234 211 206 324 165 120 94
6960I4l57O1J95l9O1L7m1J14k6k17k6j40J23K46l3M6K39k04m1K8k40K3O7j42L37
$$ 94 -263 -202 -7 -46 15 52 11 125 99 -118 -144 -284 -161 85 52 98 337 133 92 120 -120 -97 -30 -172 165
6985A65N3m9k2j6mk45r7J17J9J12K33p2R5q2j23j12k67J75q4K24N2j2J1Q7p7j26
$$ 165 218 169 147 131 127 -118 -215 -98 -79 33 266 194 289 207 84 -28 -295 -120 -204 20 72 60 71 158 81 -45
7011d5k01J34k62L02j9J12J38j28k25N6J99l50OK69J67j19J56Q3l46P6r7j00m2
$$ -45 -246 -112 -374 -72 -91 21 159 31 -194 -138 61 -289 -283 -14 153 34 190 273 -73 3 -94 -194 -236
7034b36j41K34J43K70Rk95K7k3k43j19J64K17J72K4J40k60k11l6k3o0J82N4K22
$$ -236 -377 -143 0 270 279 -16 11 -12 -255 -374 -210 7 179 203 343 83 -128 -164 -187 -247 -65 -11 211
7057B11l6o1M8J26m63k10J76j1K25M5n2J30N6j35q6r2o3M1J41LJ10L3j36K08p9
$$ 211 175 114 162 288 -175 -385 -209 -220 5 50 -2 128 184 49 -37 -129 -192 -151 -10 -7 103 136 0 208 129
7082A29k93K7kp3Q3K76l8P9j07p3m4j67R3k39K35K39L1j12P2j08j92M0r3Q2K34
$$ 129 -164 -137 -139 -212 -129 147 109 188 81 8 -36 -203 -110 -349 -114 125 156 44 116 8 -184 -144 -237 -155 79
7107G9r5q6J85k2R2j69j64J07j90K08N1L73j43k05J79k45p0N0k68J75K86O8N6
$$ 79 -16 -102 83 61 153 -16 -180 -73 -263 -55 -4 369 226 21 200 -45 -115 -65 -333 -158 128 196 252
7130B52n1J3k50n9j59N6L1K44o6J52j9Q4k45n9Kj91PL05K70mj83m8l2j82M4k5
$$ 252 201 214 -36 -95 -254 -198 -167 77 11 163 144 228 -17 -76 -74 -265 -258 47 317 313 130 82 50 -132 -88 -113
7156a13P7O3K12o4J2j45j18J17k42J34J6l4K00n6rmK1Jk54J99l72J74K01N6K39
$$ -113 -36 27 239 175 187 42 -76 41 -201 -67 -51 -85 115 59 50 46 67 68 -186 13 -359 -185 16 72 311
7181C11o3j98j7k4l75P4J53K93j58K55r6o4rj55j19J26j19L01j04J04p8j04j62
$$ 311 248 50 33 9 -366 -292 -139 154 -4 251 155 91 82 -73 -192 -66 -185 116 12 116 38 -66 -228
7204b28J00o3m8K18l5J70q8J14N4j34k41J25l25K79J59p2J23K70l17l7k37K23
$$ -228 -128 -191 -239 -21 -56 114 26 140 194 60 -181 -56 -381 -102 57 -15 108 378 61 24 -213 10
7226A0k41J61j5L37qo6O3j86No6k58J85Mj7L55Qk4l42j76J15m8K38l7J18N8O9
$$ 10 -231 -70 -85 252 244 178 241 55 60 -6 -264 -79 -75 -92 263 271 247 -95 -271 -156 -204 34 -3 115 173 242
7252B42M3k16j35r8p6n1j34N57j11J3J73j45o1j28k1N9l6k1J59J49j10R9M8l68
$$ 242 285 69 -66 -164 -240 -291 -425 132 21 34 207 62 1 -127 -148 -89 -125 -146 13 162 52 151 199 -169
7276a69n3J81j43L05p0J55L2k33J41l81J59j48j2K13M5J12P4p6J70m96O0j53L32
$$ -169 -222 -41 -184 121 51 206 238 5 146 -235 -76 -224 -236 -23 22 134 208 132 302 -194 -134 -287 45
7299D5n8P1L8o4R1m6r9k97J25m2R1P7R0MJ7jj36J12r7p5NK82K4J40k38j47j43
$$ 45 -13 58 96 32 123 77 -22 -319 -194 -236 -145 -68 22 26 43 42 -94 18 -79 -154 -149 133 157 297 59 -88 -231
7326b31jk6Q5ON4K75j45J68j61J52k64p2j78K08J82J1J00N6%q4K1m53J40M4r8
$$ -231 -232 -258 -173 -167 -113 162 17 185 24 176 -88 -160 -338 -130 52 63 163 219 219 135 156 -297 -157 -113 -211
7351b11K97l9M93l88p0j94j03o6R1J74l9K39j16K99m14O8k00l1p9J37K90Q5J5
$$ -211 86 47 540 152 82 -112 -215 -281 -190 -16 -55 184 68 367 -47 21 -179 -210 -289 -152 138 223 238
7374B38N9k99J1j69P0J11k71J78K06n6Q2n0N9k45q1n5j9L60KN0Qj41P9r6j32j46
$$ 238 297 -2 9 -160 -90 21 -250 -72 134 78 160 110 169 -76 -157 -212 -231 129 131 181 189 48 127 31 -101 -247
7400b47J33L00j40J15p1n8J34k96j04M0J78j14Q9K21k22J85k87K02k14J05o5J29
$$ -247 -114 186 46 161 90 32 166 -130 -234 -194 -16 -130 -41 180 -42 143 -144 58 -156 -51 -116 13
7422A3J87k87L73o7l04K29m08Q7q1K95Q5j31R6l6O7k46L6j28J46L2J17j9J64r0
$$ 13 200 -87 286 219 -85 144 -264 -177 -258 37 122 -9 87 51 118 -128 -92 -220 -74 -42 75 56 220 130
7446A30j1j35j76M3q3J10J05mL41j62o3l5j16k58N6K33j03K83m6J32Nj12k51k
$$ 130 119 -16 -192 -149 -232 -122 -17 -21 320 158 95 60 -56 -314 -258 -25 -128 155 109 241 246 134 -117 -119
7470a19j25L86k89K04K22k05J76j24k52k6N8L4j02K04m9K91l6j90j8q0n0m4Rm2
$$ -119 -244 142 -147 57 279 74 250 126 -126 -152 -94 -60 -162 42 -7 284 248 58 40 -40 -90 -134 -125 -167
7494a67K94%j3J70l11l9j92o0J99J73jo9J41r1K6j30j69PK01j23K15L6P6n3j99
$$ -167 127 127 114 284 -27 -66 -258 -318 -119 54 53 -16 125 34 60 -70 -239 -232 -31 -154 61 97 173 120 -79
7519g9j54N4JJ20Q3J05L09k29k04J08j45p9l1o9J77lK42j4j19j68P1p1j61oP5
$$ -79 -233 -179 -178 -58 25 130 439 210 6 114 -31 -110 -141 -210 -33 -36 206 192 73 -95 -24 -95 -256 -262 -187
7544a87J80J40R2o0O8l13l9n3J57K4P9o3K46k70K64j83j09n3N2QK0K38j73P7m1
$$ -187 -7 133 225 165 233 -80 -119 -172 -15 9 88 25 271 1 265 82 -27 -80 -28 -20 0 238 65 142 101
7569A01j19j08k28K18K20QP0j62J86k52L9j94NJ14J98l00J51J52j29K08j74p8
$$ 101 -18 -126 -354 -136 84 92 162 0 186 -66 -27 -221 -216 -102 96 -204 -53 99 -30 178 4 -74
7591g4j59L6M8L57j74P4kJ10j06p6m53R1J84N0K41j6RJ7m4k26M8r0J74k65L73
$$ -74 -233 -197 -149 208 34 108 106 216 110 34 -419 -328 -144 -94 147 131 140 157 113 -113 -65 -155 19 -246 127
7616A27p0K00q8l6q1j35j85k3J73J51N8J94j51p9p3k37N5J29pJ09N0J8J4L6k27
$$ 127 57 257 169 133 52 -83 -268 -291 -118 33 91 285 134 55 -18 -255 -200 -71 -78 31 81 99 113 149 -78
7641g8j46M5m2m7L82j84J49O4J7k63r5K7O4R1N2J70j02K3N7j62n5j28pl9J30J59
$$ -78 -224 -179 -221 -268 114 -70 79 143 160 -103 -198 -171 -107 -16 36 206 104 127 184 22 -33 -161 -168 -207 -77 82
7667H2N5L2J7j46p1k9m5j39R5J69P2J86k61R4k75L4oo7K57p5J69K3k45L07n32
$$ 82 137 169 186 40 -31 -60 -105 -244 -149 20 92 278 17 111 -164 -130 -136 -203 54 -21 148 171 -74 233 -299
7692b99K04o3P0N5Q8J04p5J37k27j60n6P9k17J20K03K61j37J47p8m5k91j4J13
$$ -299 -95 -158 -88 -33 55 159 84 221 -6 -166 -222 -143 -360 -240 -37 224 87 234 156 111 -180 -194 -81
7715h1o5R6J58j12K90r1Ml86J69J1j16J51l3L19k5L5l09pq7l70rL47J57J83j90
$$ -81 -146 -50 108 -4 286 195 199 -187 -18 -7 -123 28 -5 314 289 324 15 8 -79 -449 -458 -111 46 229 39
7740C9rj32O4p9j0j14J25P9N6Q7q7J16o3j47j04M5j38L10N8ML7j14j40O8mj66
$$ 39 30 -102 -38 -117 -127 -241 -116 -37 19 106 19 135 72 -75 -179 -134 -272 38 96 100 137 23 -117 -49 -53 -219
7766b19J06K37J2M0q6j35P7l00J72n4k01K45K83K7q9p9P0q1k92J12O4K4J1J23
$$ -219 -113 124 136 176 90 -45 32 -268 -96 -150 -351 -106 177 204 115 36 106 25 -267 -155 -91 -67 -56 67
7790F7K68j62M6k07j35nJ18j23J91l0p5K23K38l62k69K15j41P2J77N5N0j12o2
$$ 67 335 173 219 12 -123 -128 -10 -133 58 28 -47 176 414 52 -217 -2 -143 -71 106 161 211 99 37
7813C7j85J23q4J1n5K69jl2J70M4r0l67r5K33j99K39J94P2k10R5r3k07j2q2K47
$$ 37 -148 -25 -109 -98 -153 116 115 83 253 297 207 -160 -255 -22 -221 18 212 284 74 169 76 -131 -143 -225 22
7838B2j98L64n0j7q7j24r0J43q6l5J65J5Q3j2K5j24j39o4J03Q3K2o9J63n8J24
$$ 22 -176 188 138 121 34 -90 -180 -37 -123 -158 7 22 105 93 118 -6 -145 -209 -106 -23 -1 -70 93 35 159
7863A59J22l05N4l27K52j08J58J46P2k28Q0L6j32j25j40J80J40O5O1Qj78M0j67
$$ 159 281 -24 30 -297 -45 -153 5 151 223 -5 75 111 -21 -146 -286 -106 34 99 160 168 -10 30 -137
7886a37J41k46j03J94L11k52L50j32k7j35k8k51K16K18L5k45K90j11p6j79J86
$$ -137 4 -242 -345 -151 160 -92 258 126 99 -36 -64 -315 -99 119 154 -91 199 88 12 -167 19
7907A9k78J52P2J14J12k79K20j54J14k19o8J57M4QQ6l0O6j44M5j27rl0P3K33J77
$$ 19 -259 -107 -35 79 191 -88 132 -22 92 -127 -195 -38 6 14 100 70 136 -8 37 -90 -99 -129 -56 177 354
7932C54J5j19k83J36l0Qj46J3O0K44l58K4J13j44J05k51J54j7K64L8j6Q5j20M8
$$ 354 369 250 -33 103 73 81 -65 -52 8 252 -106 -82 31 -113 -8 -259 -105 -122 142 180 164 249 129 177
7956A77k52j2j48J89q5J34r1K88Rq8k12o4m4J93j53L61l50K70J88m09q2J64j02
$$ 177 -75 -87 -235 -46 -131 3 -88 200 209 121 -91 -155 -199 -6 -159 202 -148 122 310 -99 -181 -17 -119
7979a19m4J57n4K03j19K78j85l02M6J9p6M5K86jJ82k41O9l42P0o6J43J05q6J18
$$ -119 -163 -6 -60 143 24 302 117 -185 -139 -120 -196 -151 135 134 316 75 144 -198 -128 -194 -51 54 -32 86
8003H6m7J7L4P2j26Qj21p0r3L38O6J11j15R5k86j60k6r5J60J5M04m6mk40R3m0
$$ 86 39 56 90 162 36 44 -77 -147 -240 98 164 275 160 255 -31 -191 -217 -312 -152 -137 267 221 217 -23 70 30
8029C0k08N3l0J08Q2J59J08k89l2j62J82k84L56j72L31l3j99K20j99R5k49N3P1
$$ 30 -178 -125 -155 -47 35 194 302 13 -19 -181 1 -283 73 -99 232 199 0 220 21 116 -133 -80 -9
8052iJ5K1J33j24K2m1k19K5Q4J11j14J32n5K21j22k64K16j04n8k2J01K13j5l7
$$ -9 6 27 160 36 58 17 -202 -177 -93 18 -96 36 -19 202 80 -184 32 -72 -130 -152 -51 162 147 110
8076A10k37J10J10k19l2J57M8P8m4q7K66k91n8J10j71L0pK19N9L4l3M7k30j9j23
$$ 110 -127 -17 93 -126 -158 -1 47 125 81 -6 260 -31 -89 21 -150 -120 -127 92 151 185 152 199 -31 -50 -173
8101a73p3K54k5j7j1K49rrl95l1Q7J19pLJ97j66P7j97J53k64J05QL69j22K20j31
$$ -173 -246 8 -17 -34 -45 204 195 186 -209 -240 -153 -34 -41 -38 159 -7 70 -127 26 -238 -133 -125 244 122 342 211
8127B11j57q1J66k52n3L4L0M6K05N7j59q6N9j23j82J09O7P1K2K93r0r6q9l19O1
$$ 211 54 -27 139 -113 -166 -132 -102 -56 149 206 47 -39 20 -103 -285 -176 -109 -38 -16 277 187 91 2 -317 -256
8152b56K10R2lJ39k8j41j04m6p8J07j12p4K78Q7m8j56M33k92Ql80K35qN8K23k08
$$ -256 -46 46 43 182 154 13 -91 -137 -215 -108 -220 -294 -16 71 23 -133 300 8 16 -364 -129 -137 -79 144 -64
8177f4J78J29j63k13O9m3J69j37m0L59o2k1R0k62
$$ -64 114 243 80 -133 -64 -107 62 -75 -115 244 182 161 251 -11
8191a1
$$ Imaginary data points
##PAGE= N=2
##DATA TABLE= (X++(I..I)), XYDATA
0@%%%%%%%%%qJ6j6J7k5L4m2N4o5P8r6J14j37J66j95K29k67L12l62M18m83N51o29
$$ 0 0 0 0 0 0 0 0 0 0 -8 8 -8 9 -16 18 -24 30 -35 43 -53 61 -76 90 -105 124 -143 169 -193 225 -258 293 -336
32c36P15q08R13j030J159j299J455j626J810k016K238k476K743l032L346l690
$$ -336 379 -429 484 -546 613 -686 769 -857 953 -1063 1175 -1301 1442 -1590 1756 -1934
48a934M068m482M937n443N997o613P305q081Q961r967J1131j2497J4124j6106
$$ -1934 2134 -2348 2589 -2854 3143 -3470 3835 -4246 4715 -5252 5879 -6618 7506 -8600
62h600J8579k1764K6047l2156M1646n8550R7955l67219k10179N35105K87002J43451
$$ -8600 9979 -11785 14262 -17894 23752 -34798 63157 -304062 -514241 20864 307866 451317
74D51317j38216j43361j56993p8102j04657n0012J801J26208J60073J53686N2653
$$ 451317 313101 169740 12747 -65355 -170012 -220024 -218223 -92015 68058 221744 274397
85B74397l2412j36431j84704j99375j04041M2297J98929K42667J85558N8603l6503
$$ 274397 241985 105554 -79150 -278525 -382566 -340269 -141340 101327 286885 345488 308985
96C08985j01207j41152j87962j83031q9159R1701K44080K66848J34629m9859j73799
$$ 308985 207778 66626 -121336 -304367 -393526 -301825 -57745 209103 343732 293873 120074
107A20074j79824j16965m4051J2506P3032J36290J64019J11158p191j23003j68484
$$ 120074 -59750 -176715 -220766 -208260 -135228 1062 165081 276239 269048 146045 -22439
118b2439j36255o7088m806M4747R2591J34304J39719Q6767j1157j08095j62525
$$ -22439 -158694 -225782 -230588 -185841 -93250 41054 180773 267540 256383 148288 -14237
129a4237j58285r8740K701J18452J96825J84630O9631q8296j90644j76163p0960
$$ -14237 -172522 -271262 -268561 -150109 46716 231346 300977 212681 22037 -154126 -225086
140b25086M0425R0233Q1257O2984O6567O8348K5117o7224j52409j64805q7990
$$ -225086 -184661 -94428 -13171 49813 116380 184728 209845 142621 -9788 -174593 -262583
151b62583K9720J16805J39695J08215N3362l424n5794r4022j03230p5619k0674
$$ -262583 -232863 -116058 23637 131852 185214 181790 125996 31974 -71256 -146875 -167549
162a67549L9532Q6091J08991R7150M0635n2922j41678j66563r8518K7866J32686
$$ -167549 -128017 -41926 67065 164215 204850 151928 10250 -156313 -254831 -226965 -94279
173i4279J56245J02222K4036k9851n3827o9802q7225q6280m4771K8538R1326J07400
$$ -94279 61966 164188 188224 158373 104546 34744 -52481 -138761 -183532 -154994 -63668 43732
185D3732P4354K1619k4669n7035p8141q0894n0899J3271Q3599J19238R7400L0143
$$ 43732 118086 139705 115036 58001 -20140 -101034 -151933 -138662 -55063 64175 161575 191718
197A91718m6665j01695j18445r5241l6396M0441J04178J22825Q7094K1011l7829
$$ 191718 145053 43358 -75087 -170328 -206724 -166283 -62105 60720 147814 168825 130996
208A30996o6695p0579o4700n0128j5304M1032R2233J01188N3417k3377q1907r2989
$$ 130996 64301 -6278 -70978 -121106 -136410 -95378 -3145 98043 151460 128083 46176 -46813
220d6813o2614k0038J6032M5009P0557Q3131O8267J8318m8716j01282j12913p8475
$$ -46813 -109427 -129465 -113433 -68424 2133 85264 153531 171849 123133 21851 -91062 -169537
232a69537j3075N7034J04178J08427O6458k805o4754q9814p2696l2554O781L4433
$$ -169537 -182612 -125578 -21400 87027 153485 150680 85926 -3888 -76584 -109138 -102357 -67924
244f7924N1820O2587N8790K8427k4901p7352r8700p3683j6162M3189Q0646Q7078
$$ -67924 -16104 46483 105273 133700 108799 31447 -67253 -140936 -157098 -113909 -33263 53815
256E3815O7214K8801j9048o5397r0873q2654m0129J7596O7242Q7204P3658L3845
$$ 53815 121029 149830 130782 65385 -25488 -108142 -148271 -130675 -63433 23771 97429 131274
268A31274j6665o1278q1967p0159k9683K0969O1654P7333O5490L2842j0023n2584
$$ 131274 114609 53331 -28636 -98795 -128478 -107509 -45855 31478 96968 129810 119787 67203
280F7203p9793q0541m8928L752N5147Q3243P7910M6560L474l7102o6431p5002
$$ 67203 -12590 -93131 -142059 -138307 -83160 83 77993 124553 128027 90925 24494 -50508
292e0508n8717j9251L2435P2538Q2808N7222P628m3475p4361p5451m8678m848
$$ -50508 -109225 -128476 -96041 -23503 59305 116527 124155 80680 6319 -69132 -117810 -122658
304a22658L9938O9910P4519N3521J4130k8832o2846p6290o4405k9600J7723N9975
$$ -122658 -82720 -12810 61709 115230 129360 100528 37682 -38608 -103013 -132613 -114890 -54915
316e4915P9357O7634L0123j7460n5101p0001n9077k8374J1818M7963O8073O3027
$$ -54915 24442 92076 122199 104739 49638 -20363 -79440 -107814 -95996 -48033 20040 83067
328H3067L3151j1689n2989p4739o7244l4312J0782N1814P2844O8724L9815j808
$$ 83067 116218 104529 51540 -23199 -90443 -124755 -113973 -62159 10685 79409 119224 117416
340A17416m2231o6745o7771m4923p111L3186O0792O5678M6356Q876l1008n9342
$$ 117416 75185 8440 -59331 -104254 -111365 -78179 -17387 48291 94647 103523 72515 13173
352A3173o4628m4242p489L2004N9609O5196M7041J0845k9488n9539o8256n2761
$$ 13173 -51455 -95697 -103186 -71182 -11573 53623 100664 111509 82021 22482 -45774 -98535
364i8535j7638K2736N5515O7557N5537K3647j5792m8306o2705n3478k5691J1838
$$ -98535 -116173 -93437 -37922 29635 85172 108819 93027 44721 -17984 -71462 -97153 -85315
376h5315M3798N9071N1773K4745j1356m3915n9504n3111k6331J0268M4094O1397
$$ -85315 -41517 17554 69327 94072 82716 38801 -20703 -73814 -100145 -89877 -45783 15614
388A5614N6740L1317n843m0430n9890n7276l5198j033L2612N3517N5709L7510
$$ 15614 72354 103671 97828 57398 -2492 -59768 -94966 -95999 -63387 -9870 45839 83349
400H3349N865k7892n0739n4026l6573n037K8426N0628N3417L6005M650k8211n0340
$$ 83349 89214 61322 10583 -43443 -80016 -85053 -56627 -5999 47418 83423 88073 59862 9522
413I522n4811l9019r447K3861M8742N6196M3508J5236j8738m5348n4172m3631
$$ 9522 -45289 -84308 -93755 -69894 -21152 35044 78552 93788 75050 29702 -24470 -68101
425f8101j7456J4880M0346N0622M1465J7533j2860l8302m8780m1941j8671J1840
$$ -68101 -85557 -70677 -30331 20291 61756 79289 66429 28127 -20653 -62594 -81265 -69425
437f9425L8733N1490M4697K1157j0980l9113n1543m5753k3492O614L3474M8528
$$ -69425 -30692 20798 65495 86652 75672 36559 -14984 -60737 -84229 -77615 -44141 4387
449D387M6549K7116j374k9458m6366m5021k7613k72K6886M3319M4487K8759J418
$$ 4387 50936 78052 76678 47220 854 -44167 -71780 -72052 -45166 -1847 42640 71399 72817
462G2817k7223m5844m6245k8359J89K7300M4061M5052L0690N740k1512m2428m7703
$$ 72817 45594 -250 -46495 -74854 -74665 -47365 -3304 41748 72438 78178 56666 14238 -33465
475c3465l5467r880J8776L9581M5590L5771J2888j4498l7213m5808l6023j1761
$$ -33465 -68932 -78812 -60036 -20455 25135 60906 73794 59296 22083 -23725 -59748 -71509
487g1509J6738L7869M3114L2622J1487j3398l4106m4353l8442j7582J1114L5921
$$ -71509 -54771 -16902 26212 58834 70321 56923 22817 -21536 -59978 -77560 -66446 -30525
499c0525M6548L9997J9423o719l0453m3758m1908k4209M015L0060M3918L8626
$$ -30525 16023 56020 75443 68724 38271 -5487 -47395 -71604 -67589 -37529 6389 45015
511D5015J9073n756k5828l6915l5689k2807j283K3551M0792M3335K7720J434k5835
$$ 45015 64088 58332 32504 -4411 -40100 -62907 -64190 -40639 153 43488 71208 72642 46807
524D6807m2672m4541k9717m545K3439M1546M3641K8374L502j9582l3681l5099
$$ 46807 4135 -40406 -70123 -74668 -51229 -9683 33958 62332 65834 46252 12571 -22528
536b2528k7151j0942R623L0492M1503L6378J3681j6519l9265m4704l1533p862
$$ -22528 -49679 -60621 -50998 -20506 20997 57375 71056 54537 15272 -29432 -60965 -68827
548f8827J6024L3235L9321L2429J5199q586k9111l9291l5529j9164L503K4910
$$ -68827 -52803 -19568 19753 52182 67381 58795 29684 -9607 -45136 -64300 -60797 -35887
560c5887L9128L9423K3328l323k9694m2609l6942j6035Q439K6132L4018L1533
$$ -35887 3241 42664 65992 62669 32975 -9634 -46576 -62611 -54172 -28040 5978 37511
572C7511K0418J441k0010l6568l9509k5463j646K2166L5108L6454K6238P518j4680
$$ 37511 57929 59370 39360 2792 -36717 -62180 -63826 -41660 -6552 29902 56140 63658 48978
585D8978l4174m1287l1382p243J9385L5845L6903K4160N309j4216k8720l4271
$$ 48978 14804 -26483 -57865 -65108 -45723 -9878 27025 51185 56494 42278 13558 -20713
597b0713k7519r682J1769K8954L4632K8806J3530o291k6296l9105l7323j8261
$$ -20713 -48232 -57914 -46145 -17191 17441 46247 59777 53486 27190 -11915 -49238 -67499
609f7499R835L3716M0442K9247Q922r471k1086k6348k6448k0213m187J7117L4056
$$ -67499 -57664 -23948 16494 45741 54663 45192 24106 -2242 -28690 -48903 -53090 -35973 -1917
622a917L6813K2781j233k4249l6433l4212j9541K940K3594L4892L1793J6892j576
$$ -1917 34896 57677 56444 32195 -4238 -38450 -57991 -55051 -31457 3435 35228 52120 50544
635E0544j6986k5571k7778k3422j1363Q408K8355L7658L0023P748j7648l1545
$$ 50544 33558 7987 -19791 -43213 -54576 -46168 -17813 19845 49868 57616 39968 8423
647H423l1757k0935m049J1563K4640K9999K5492R476j0626k7229l2056k5252r763
$$ 8423 -23334 -44269 -48318 -36755 -12115 17884 43376 52852 42226 14997 -17059 -42311 -52074
660e2074P604K2340L0276K8633J5780l594k3307l2437k8657j3857M781K0806K8999
$$ -52074 -44470 -22130 8146 36779 52559 48965 25658 -6779 -35436 -49293 -44512 -23706 5293
673E293K7183J4760l553k1126k9493k5541j2339L560J6315K3774K5139K0117O333
$$ 5293 32476 47236 43683 22557 -6936 -32477 -44816 -41256 -24941 -1167 23972 44089 50422
686E0422j2769l0292l5231k3987p75K0629L0990K7691J4729j75j2928k1383k3490
$$ 50422 37653 7361 -27870 -51857 -52632 -32003 -1013 26678 41407 41232 28304 6921 -16569
699a6569j8661o973Q726K1367K7145K3157R503q844k5162l2330k5196p095J4162
$$ -16569 -35230 -42203 -33477 -12110 15035 38192 47695 38851 13689 -18641 -43837 -50932 -36770
712c6770K7877K7928J7990L923p626j6898k2128k2749j4924J191J8930K9700K6887
$$ -36770 -8893 19035 37025 40948 33322 16424 -5704 -28453 -43377 -42186 -23256 6444 33331
725C3331J1997o188k0695k6215k2372j1833L571J7843K6360K4005J2909l380j7471
$$ 33331 45328 39140 18445 -7770 -30142 -41975 -38404 -20561 5799 29804 42713 39333 21862
738B1862k4291k3509j4981j165J4844K5514K6291J6609O55j4578k3549k3621j6900
$$ 21862 -2429 -25938 -40919 -42084 -27240 -1726 24565 41174 41829 27251 3702 -19919 -36819
751c6819m300J0961K2958K7408J9509K556j4904k4554k3502j4326k317R484J8355
$$ -36819 -41119 -30158 -7200 20208 39717 42273 27369 2815 -20687 -35013 -37330 -27846 -9491
764i491K2579K0342R587o640k1505k8552k2740q474R159K2231K6149K0430P463
$$ -9491 13088 33430 43017 36377 14872 -13680 -36420 -44894 -35735 -13504 12645 33075 40538
777D0538q134j9112k2680j8383p998L829J4286K1421K1610J4224p27j7080k7201
$$ 40538 32404 13292 -9388 -27771 -35769 -31940 -17654 3767 25377 39601 38874 21794 -5407
790e407k5160j2470M910J8959K4107K1120J1514j133j2991k1688k2614j5406k132
$$ -5407 -30567 -43037 -38127 -19168 4939 26059 37573 36440 23449 1761 -20853 -36259 -38391
803c8391J2489K2253K3520J5758K369j2296k1782k3538j5758k266J1893K1137
$$ -38391 -25902 -3649 19871 35629 37998 25702 3920 -19618 -35376 -37642 -25749 -4612
815d612K2452J6013M039r301j9510k3644j8511o428Q374J9849K4014J8034O747
$$ -4612 17840 33853 37892 28591 9081 -14563 -33074 -39502 -31128 -11279 12735 30769 37516
828C7516o699j7253k1846j9493r402M691J7397K3629K0352Q663n560j8097k1876
$$ 37516 30817 13564 -8282 -27775 -37177 -32486 -15089 8540 28892 37555 31995 13898 -7978
841g978j8576r330L659J4898K1073K0154J1763j306j3411k1252k1517j3447n61
$$ -7978 -26554 -35884 -32225 -17327 3746 23900 35663 34357 20946 -306 -21823 -35270 -35831
854c5831J3032K1899K2036J3329j77j2752j9822j9799j3006k014R904J7995K0857
$$ -35831 -22799 -900 21136 34465 34288 21536 1714 -18085 -31091 -33105 -23201 -5206 15651
867A5651J5824M243r369j9982k2119j5918l985R254J8584K1111J5839N233o945
$$ 15651 31475 35718 26349 6367 -15752 -31670 -35655 -26401 -7817 13294 29133 34366 27421
880B7421j7009k0271j6751o881N296J5812K0189J7910Q002m674j5849k0265j7938
$$ 27421 10412 -9859 -26610 -33491 -28195 -12383 7806 25716 33718 29044 13195 -7070 -25008
893b5008p991M058J4613J9742J8106R221k418j3775j9861j8799j0426J844J2793
$$ -25008 -32999 -28941 -14328 5414 23520 32741 30323 16548 -3313 -22112 -32538 -30694 -17901
906a7901J9490J8292J0848k93j1166j8402j8443j2165p60J0298J8029J8691J2539
$$ -17901 1589 19881 30729 30436 19270 868 -17575 -29740 -30500 -20202 -2173 16518 29057
919B9057J597r962j7466j8553j3285k275Q721J7197J8671J3734L798p668j6434
$$ 29057 30654 20692 3226 -15327 -28612 -30887 -22166 -4969 13702 27436 31234 23566 7132
932G132j8780j4647m789O795J5671J8693J4701N436n800j4796j8025j5004o307
$$ 7132 -11648 -26295 -31084 -24289 -8618 10075 24776 30212 24412 9616 -8409 -23413 -29720
945b9720M867J3646J8732J5122P509m204j3470j8189j5954q035L028J2687J7708
$$ -29720 -24853 -11207 7525 22647 30156 25952 12482 -5707 -21661 -29696 -26668 -13981 3727
958C727J6275R036j883j1815j7170j6744r474R44J0900J6778J6499J0226j76j0265
$$ 3727 20002 29038 27155 15340 -1830 -18574 -28048 -27104 -16204 574 17073 27299 27123 16858
972A6858j6419j6581j0779p05R534J6162J7250J1130J611q550j5880j7022j2292
$$ 16858 439 -16142 -26921 -27626 -18092 -1930 15320 26450 28061 19511 3631 -13391 -25683
985b5683k794Q015J5115J7155J2729L271o707j4515j7106j2945m321O114J3866
$$ -25683 -28477 -20462 -5347 11808 24537 27808 21101 6586 -10520 -23465 -27786 -21672 -7806
998g806J6979J3403M853m933j3483j6903j3779o184M415J2975J6541J4655P045
$$ -7806 9173 22576 27429 22496 9013 -7890 -21669 -27853 -23438 -10463 6078 20733 27778
1011B7778l636j2638j6353j4643p493K688J1262J6058J4943Q198j449j0647j5863
$$ 27778 24142 11504 -4849 -19492 -26985 -24297 -13035 3023 17966 26164 24715 14068 -1795
1024a795j5321q853O71J0104J5686J5564R368J11r348j5230j5533j0129j076Q388
$$ -1795 -17116 -25969 -25298 -15194 492 16056 25424 25535 16187 957 -14576 -24705 -25781 -17393
1038a7393J4533J6024J0742K229p721j4452j5663j1541k631P015J3639J5777J1593
$$ -17393 -2860 13164 23906 26135 18414 3962 -11701 -23242 -25873 -18858 -5219 10558 22151
1051B2151L476n848j3366j5459j2225m457M903J2748J5905J2907M922m261j2218
$$ 22151 25627 19779 6413 -9046 -21271 -25728 -20825 -8077 7828 20735 25657 21396 9178
1064I178j5631j2899o028L361J1325J5599J3350O875k679j0741j5337j3825p254
$$ 9178 -6453 -19352 -25380 -22019 -10694 4905 18255 25130 22451 11710 -3627 -17452 -24706
1077b4706K084J0121J4939J4114P609j002r634j4634j4138q366l8R034J4186J4416
$$ -24706 -22622 -12501 2438 16552 24161 23159 13525 -1109 -15247 -23613 -23651 -14617 -431 13985
1091A3985R183O23q282j3935j4419r702j323P513J3353J4605J0130K329o795j3151
$$ 13985 23168 23791 15509 1574 -12845 -22547 -23870 -16357 -3004 11601 21731 24060 17265 4114
1105D114j4465j0825k768N978J2499J4668J1142L433n187j2094j4480j1604m138
$$ 4114 -10351 -21176 -23944 -17966 -5467 9201 20343 23776 18589 6495 -7985 -19589 -23727
1118b3727M481J1479J4355J2031M985l412j1370j4212j2251n862L111J0424J4173
$$ -23727 -19246 -7767 6588 18619 23604 20192 8822 -5390 -17641 -23503 -20392 -9968 4205
1131D205J2498O213j801j0078j3994j2770o933J274R312J3654J3018P799o13q971
$$ 4205 16703 22916 21115 11037 -2957 -15727 -22660 -21386 -12074 1580 14598 22397 21784 12813
1145A2813j3344j3263p996j49Q151J3069J3215Q793P17p281j2730j3565r190j369
$$ 12813 -531 -13794 -21790 -21939 -13788 -719 12496 21289 22006 14725 1995 -11570 -20760 -22129
1159b2129O700J2210J3685R506K169o010j2029j3003j0369k984N316J1467J3551
$$ -22129 -15429 -3219 10466 19972 22141 16131 4102 -8901 -19270 -22254 -16938 -5471 8080
1172H080J0484L269m372j0994j3303j0966m460M296J0667J3159J1083M894l159
$$ 8080 18564 21833 17461 6467 -6836 -17802 -22262 -17966 -7299 5860 16943 21837 18678
1185A8678j0217j3408j1241n240K504R389J3020J1836O282k109r098j2870j1795
$$ 18678 8461 -4947 -16188 -21428 -18924 -9535 3485 15321 21603 19494 10396 -2474 -14269
1198a4269o522R29Q583J2586J2064P169m98p997j2247j2115p702m36P257J2116
$$ -14269 -20791 -19862 -11279 1307 13371 20540 20042 12045 -202 -12317 -20019 -20455 -13198 -1082
1212a082J2376Q516Q49o609j1858j2653q296j946O045J1324J2429R205K224n549
$$ -1082 11294 19810 20659 14050 2192 -10461 -18757 -20703 -14658 -3334 9095 18300 20524 14975
1226A4975j0541j2478r571k748M532J0316J2674R916L455m067j0319j2301j0146
$$ 14975 4434 -8044 -17615 -20363 -15831 -5515 7159 17075 20530 16463 6144 -6157 -16303
1239a6303m010L142R723J2398J0338M813k549q972j2400j0703n277K182Q217J1979
$$ -16303 -20313 -17171 -7448 4950 15288 20101 17552 8580 -3820 -14523 -19800 -17618 -9401 2578
1253B578J1118N934j461q168j1896j1319n991Q02P666J1618J1176O773l8o837
$$ 2578 13696 19630 18169 10001 -1895 -13214 -19205 -18403 -10737 881 12057 18830 18792 11955
1267A1955j1574j1524p189m43O274J1065J1552P544J493n944j0762j1645q072
$$ 11955 381 -11143 -18332 -18775 -12501 -1436 10116 17660 19153 13209 2447 -9198 -17270
1280a7270j713N459J0588J1208Q385K245m854r812j1273r196k759L959R704J1429
$$ -17270 -18983 -13524 -2936 8272 16657 18902 14048 4236 -7037 -16233 -18992 -15033 -5329 6100
1294F100R172L680l538r107j1408r697l847L008Q647J1383R560M117k241q077
$$ 6100 15272 18952 15414 6307 -5101 -14798 -18645 -15637 -6990 4393 13953 18070 15829 7752
1308G752j0985r523n190J606P664J1136J0139N449j284p224j0739j0326o173P33
$$ 7752 -3233 -12756 -17946 -16340 -8676 2460 12599 18048 16764 9540 -1199 -11525 -17698 -16965
1322a6965O971J0444J0385O212p4o278r988j0233o801o23N467R722J0692P372
$$ -16965 -9994 450 10835 17047 16973 10695 707 -9526 -16327 -16950 -11483 -1761 8931 16303
1336A6303J205n580r769j0552p525j453M957R432J0260P886K067m121r097j0046
$$ 16303 17508 11928 2159 -8393 -15918 -17371 -12414 -2982 7278 15164 17231 13110 4013 -6033
1350f033q304k962L646Q683J0326Q390L438l159q504j0290q727l368K784Q007
$$ -6033 -14337 -17299 -13653 -4970 5356 13746 17184 14025 5521 -4769 -13496 -16864 -14080 -6073
1364f073R880R065L883k366p282j0213q861m742J683P120R830R326N160r80o677
$$ -6073 3807 12872 16755 14389 7107 -3106 -11967 -16709 -15026 -7906 1924 11250 16410 15430 8753
1379H753r717r764n184N18O201R807R457N354k30n681r409r349n993l99N447R105
$$ 8753 -964 -10728 -15912 -15394 -9193 614 10071 15425 15195 9514 105 -9244 -15237 -15636 -10189 -1084
1395a084R362O694J040m922r035r716o982j622M500Q935R946O893J854m117q086
$$ -1084 8278 14972 16012 11090 2055 -7661 -14643 -16265 -11765 -2830 7116 14009 15863 11746 3660
1410C660r155p658k428L346P877R326P915L084l107q107r503p814l133K530P539
$$ 3660 -5495 -13153 -15581 -12235 -4358 4968 12883 15967 12860 4753 -4750 -12564 -15697 -13167 -5628
1425e628R325Q150L628j903o988r142q259m340J390O365R303Q610M644j187o087
$$ -5628 3697 11847 15475 13572 6584 -2558 -10817 -15157 -13767 -7402 1901 10511 15155 13968 7881
1440G881r387q363m963N86O051Q819Q730N105N8n524q643r103n765j59N201Q232
$$ 7881 -1506 -9869 -14832 -14246 -8195 624 9354 14459 14517 8993 350 -8753 -14518 -14677 -9476 -1244
1456a244Q998N966Q35m524q039q854o447j315M190Q097Q550O613J691l485p881
$$ -1244 7754 13720 14555 10031 1992 -6862 -13309 -14624 -10434 -2337 6213 12826 14517 11032 3151
1471C151q825o524k291L239P175Q823P051K778k545p169q820p588l132K364O906
$$ 3151 -5674 -12198 -14489 -11250 -4075 4748 11799 14577 12032 4863 -3957 -11545 -14677 -12313 -5407
1486e407Q914P431L151j835o573q246p640l538J352N771Q493P652M230q77n793
$$ -5407 3507 10938 14089 12254 5681 -2565 -10205 -13743 -12391 -6620 1873 9525 13755 12878 7085
1501G085q528p691m745P17N350Q265Q109M613J20n059p773p839n519l56M436P860
$$ 7085 -1443 -9134 -13879 -13162 -7812 453 8562 13175 13295 8236 463 -7376 -12895 -13251 -8815 -955
1517i55P951N531Q25m268p647p742n936j024L915P144Q257N831J426l494o950
$$ -955 6996 12527 13352 9084 1437 -6305 -12241 -13265 -9350 -2206 6051 11882 13308 9814 2864
1532B864p946o199k162L202O592P879O539K646k758o355p898o685k839K061O410
$$ 2864 -5082 -11281 -13443 -10241 -3649 4230 10769 13415 10657 4302 -3596 -10281 -13120 -11059 -4649
1547d649P845O724K834j534n996p981o837l109J352N607P813O698L961r06n430
$$ -4649 3196 9920 12754 11220 5224 -2757 -9594 -12703 -11351 -5744 2069 8767 12728 11822 6392
1562F392p400p289m266P39M849P501P266M089pm836o848p377m432l96M301P159
$$ 6392 -1008 -8297 -12563 -11824 -6975 526 7792 11881 11874 7038 190 -7187 -11619 -12015 -7714 -555
1578e55P463M731P32m407p043p309m773j055L420O856P175N691J164l026o736
$$ -555 6908 11639 12371 7964 921 -6388 -11161 -12216 -8796 -1940 5235 10926 12090 9064 2328
1593B328p272n596j729L139O184P390N466K017k425o085p195n847k458K150N734
$$ 2328 -4944 -10540 -12269 -9130 -2946 4444 9910 11927 9502 3417 -3778 -9625 -12083 -9933 -4199
1608d199P190O440K723j863n677o903o533k992J439M921P209O392L313j062m757
$$ -4199 2991 9431 12154 10291 4614 -2289 -8822 -11814 -10375 -5454 1755 8147 11460 10398 5641
1623E641o823o676l460N93M618O990O408L896m11m352o704o676m071j45M139O568
$$ 5641 -1182 -7858 -11318 -10725 -6107 883 7291 11187 10776 6424 -280 -6956 -11027 -11172 -7033 -465
1639d65O846M165O83l762o288o911m620p75L368O227O557M810J249k912o073o721
$$ -465 6381 10546 11229 7467 1179 -5732 -10352 -11127 -7759 -1532 5025 9835 11084 8172 2099 -4622
$$ [...]
8191b07
##END NTUPLES=NMR FID
##END=
