##TITLE=1H_Pr TEAOH
 CDCl3
 8 sc, 
 12.3.2024
##JCAMPDX= 6.0         $$ Bruker NMR JCAMP-DX V2.0
##DATA TYPE= NMR FID
##DATA CLASS= NTUPLES
##ORIGIN= UXNMR, Bruker Analytische Messtechnik GmbH
##OWNER= root
$$ XWIN-NMR		Version 3.5
$$ Tue Mar 12 15:50:14 2024 Russian Standard Time (UT+4h)  she@DPX200
##.OBSERVE FREQUENCY= 200.1313
##.OBSERVE NUCLEUS= ^1H
##.DELAY= (6, 6)
##.ACQUISITION MODE= SIMULTANEOUS
##.ACQUISITION SCHEME= undefined
##.AVERAGES= 8
##.DIGITISER RES= 18
##SPECTROMETER/DATA SYSTEM= spect
##.PULSE SEQUENCE= zg30
##.SOLVENT NAME= CDCl3
##.SHIFT REFERENCE= (INTERNAL, CDCl3, 0, 15.7039)
##AUDIT TRAIL= $$ (NUMBER, WHEN, WHO, WHERE, WHAT)
$$ ##TITLE= Audit trail, XWIN-NMR		Version 3.5
$$ ##JCAMPDX= 5.01
$$ ##ORIGIN= Bruker BioSpin GmbH
$$ ##OWNER= she
$$ F:/spectra/data/she/nmr/H-F/1/audita.txt
$$ ##AUDIT TRAIL=  $$ (NUMBER, WHEN, WHO, WHERE, WHAT)
(   1,<2024-03-12 15:48:46.46 +0400>,<she>,<DPX200>,
      <created by zg, POWCHK disabled, PULCHK disabled
       configuration hash MD5:
       00 E9 B6 7A A2 85 ED C7 34 08 36 98 17 FE 4E 26
       data hash MD5: 16K
       A6 48 8E CD 61 1B 52 0D A0 2E 85 33 72 8E 50 08>)
$$ ##END=
$$ 
$$ hash MD5
$$ EE 5F 8C DA CB 03 83 13 F1 56 0F A0 65 5D 3E D3
##$RELAX= 
##$RELAX= 
##$RELAX= 
##$RELAX= 
##$RELAX= 
##$RELAX= 
$$ Bruker specific parameters
$$ --------------------------
##$DU= <F:/spectra>
##$EXPNO= 1
##$NAME= <H-F>
##$PROCNO= 1
##$TYPE= <nmr>
##$USER= <she>
##$AMP= (0..31)
100 100 100 100 100 100 100 100 100 100 100 100 100 100 100 100 100 100 
100 100 100 100 100 100 100 100 100 100 100 100 100 100 
##$AQSEQ= 0
##$AQ_mod= 1
##$AUNM= <au_zg>
##$AUTOPOS= <>
##$BF1= 200.13
##$BF2= 200.13
##$BF3= 200.13
##$BF4= 200.13
##$BF5= 200.13
##$BF6= 200.13
##$BF7= 200.13
##$BF8= 200.13
##$BYTORDA= 1
##$CFDGTYP= 0
##$CFRGTYP= 5
##$CHEMSTR= <none>
##$CNST= (0..31)
1 1 145 1 1 1 1 1 1 1 1 1 1 1 1 1 1 1 1 1 1 1 1 1 1 1 1 1 1 1 1 1 
##$CPDPRG= <>
##$CPDPRG1= <>
##$CPDPRG2= <>
##$CPDPRG3= <>
##$CPDPRG4= <mlev>
##$CPDPRG5= <mlev>
##$CPDPRG6= <mlev>
##$CPDPRG7= <mlev>
##$CPDPRG8= <mlev>
##$CPDPRGB= <>
##$CPDPRGT= <>
##$D= (0..31)
0 1.2 0 0 0 0 0 0 0 0.06 0 0.03 0 0 0 0 0.0002 0 0 0 0 0 0 0 0 0 0 0 0 
0 0 0 
##$DATE= 1710244125
##$DBL= (0..7)
120 120 120 120 120 120 120 120 
##$DBP= (0..7)
150 150 150 150 150 150 150 150 
##$DBP07= 0
##$DBPNAM0= <>
##$DBPNAM1= <>
##$DBPNAM2= <>
##$DBPNAM3= <>
##$DBPNAM4= <>
##$DBPNAM5= <>
##$DBPNAM6= <>
##$DBPNAM7= <>
##$DBPOAL= (0..7)
0.5 0.5 0.5 0.5 0.5 0.5 0.5 0.5 
##$DBPOFFS= (0..7)
0 0 0 0 0 0 0 0 
##$DE= 6
##$DECBNUC= <off>
##$DECIM= 32
##$DECNUC= <off>
##$DECSTAT= 4
##$DIGMOD= 1
##$DIGTYP= 9
##$DL= (0..7)
0 120 120 120 120 120 120 120 
##$DP= (0..7)
150 150 150 150 150 150 150 150 
##$DP07= 0
##$DPNAME0= <>
##$DPNAME1= <>
##$DPNAME2= <>
##$DPNAME3= <>
##$DPNAME4= <>
##$DPNAME5= <>
##$DPNAME6= <>
##$DPNAME7= <>
##$DPOAL= (0..7)
0.5 0.5 0.5 0.5 0.5 0.5 0.5 0.5 
##$DPOFFS= (0..7)
0 0 0 0 0 0 0 0 
##$DQDMODE= 0
##$DR= 18
##$DS= 0
##$DSLIST= <SSSSSSSSSSSSSSS>
$$ [...]
##$SUBNAM2= <"">
##$SUBNAM3= <"">
##$SUBNAM4= <"">
##$SUBNAM5= <"">
##$SUBNAM6= <"">
##$SUBNAM7= <"">
##$SUBNAM8= <"">
##$SUBNAM9= <"">
##$SW= 18.0517328524113
##$SWIBOX= (0..15)
0 0 2 0 0 0 0 0 0 0 0 0 0 0 0 0 
##$SW_h= 3612.71676300578
##$TD= 16384
##$TD0= 1
##$TE= 0
##$TE2= 300
##$TE3= 300
##$TEG= 300
##$TL= (0..7)
0 120 120 120 120 120 120 120 
##$TP= (0..7)
150 150 150 150 150 150 150 150 
##$TP07= 0
##$TPNAME0= <>
##$TPNAME1= <>
##$TPNAME2= <>
##$TPNAME3= <>
##$TPNAME4= <>
##$TPNAME5= <>
##$TPNAME6= <>
##$TPNAME7= <>
##$TPOAL= (0..7)
0.5 0.5 0.5 0.5 0.5 0.5 0.5 0.5 
##$TPOFFS= (0..7)
0 0 0 0 0 0 0 0 
##$TUNHIN= 0
##$TUNHOUT= 0
##$TUNXOUT= 0
##$USERA1= <user>
##$USERA2= <user>
##$USERA3= <user>
##$USERA4= <user>
##$USERA5= <user>
##$V9= 5
##$VALIST= <valist>
##$VCLIST= <CCCCCCCCCCCCCCC>
##$VD= 0
##$VDLIST= <DDDDDDDDDDDDDDD>
##$VPLIST= <PPPPPPPPPPPPPPP>
##$VTLIST= <TTTTTTTTTTTTTTT>
##$WBST= 1024
##$WBSW= 4
##$XGAIN= (0..3)
0 0 0 0 
##$XL= 0
##$YL= 0
##$YMAX_a= 367922
##$YMIN_a= -402723
##$ZGOPTNS= <>
##$ZL1= 120
##$ZL2= 120
##$ZL3= 120
##$ZL4= 120
##$ABSF1= 10
##$ABSF2= 0
##$ABSG= 5
##$ABSL= 3
##$ALPHA= 0
##$AQORDER= 0
##$ASSFAC= 0
##$ASSFACI= 0
##$ASSFACX= 0
##$ASSWID= 0
##$AUNMP= <proc_1d>
##$AZFE= 0.1
##$AZFW= 0.1
##$BCFW= 1
##$BC_mod= 2
##$BYTORDP= 1
##$COROFFS= 0
##$CY= 11.3945322036743
##$DATMOD= 1
##$DC= 2
##$DFILT= <>
##$DTYPP= 0
##$F1P= 15.7292609196834
##$F2P= 12.9074282941183
##$FCOR= 0.5
##$FTSIZE= 0
##$FT_mod= 4
##$GAMMA= 1
##$GB= 0.15
##$INTBC= 1
##$INTSCL= 1
##$ISEN= 128
##$LB= 0.24
##$LEV0= 0
##$LPBIN= 0
##$MAXI= 10000
##$MC2= 0
##$MEAN= 0
##$ME_mod= 0
##$MI= 1.114404
##$NCOEF= 0
##$NC_proc= 0
##$NLEV= 6
##$NOISF1= 3.799351
##$NOISF2= 2.8
##$NSP= 1
##$NTH_PI= 0
##$NZP= 0
##$OFFSET= 15.70392
##$PC= 1
##$PHC0= -25300.3
##$PHC1= 8.98731
##$PH_mod= 1
##$PKNL= yes
##$PPARMOD= 0
##$PSCAL= 0
##$PSIGN= 0
##$REVERSE= no
##$SF= 200.130013532006
##$SI= 16384
##$SIGF1= 3
##$SIGF2= 2
##$SINO= 400
##$SIOLD= 16384
##$SREGLST= <1H.CDCl3>
##$SSB= 0
##$STSI= 0
##$STSR= 0
##$SW_p= 3612.71676300578
##$SYMM= 0
##$S_DEV= 0
##$TDeff= 0
##$TDoff= 0
##$TI= <>
##$TILT= no
##$TM1= 0
##$TM2= 0
##$TOPLEV= 0
##$USERP1= <user>
##$USERP2= <user>
##$USERP3= <user>
##$USERP4= <user>
##$USERP5= <user>
##$WDW= 1
##$XDIM= 8192
##$YMAX_p= 0
##$YMIN_p= 0
$$ End of Bruker specific parameters
$$ ---------------------------------
##NTUPLES= NMR FID
##VAR_NAME=  TIME,          FID/REAL,        FID/IMAG
##SYMBOL=    X,             R,               I
##VAR_TYPE=  INDEPENDENT,   DEPENDENT,       DEPENDENT
##VAR_FORM=  AFFN,          ASDF,            ASDF
##VAR_DIM=   8192,          8192,            8192
##UNITS=     SECONDS,       ARBITRARY UNITS, ARBITRARY UNITS
##FACTOR=    0.0002768,     1,               1
##FIRST=     0,             0,               0
##LAST=      2.2672688,     0,               0
##MIN=       0,             -402723,         0
##MAX=       2.2672688,     367922,          0
$$ Real data points
##PAGE= N=1
##DATA TABLE= (X++(R..R)), XYDATA
0@%%%%%%%%%%%%%%%%%%%%MoLrJ5j4J5j6J6j9K3k4K4k8L5l9M0m3N0n6O0o6P3p9
44d1Q7r7J06j15J25j39J55j69J86k07K33k60K91l30L80m43N19o24P67r69J279
65G34j790K739m832J1209o4208l46575N1213L69664J99648j16051j56343M3767
77a0825R4837n3888r3606N6005J18787p4125k53566o2380L03427L24910n5088
88B94488l63236k27205J38826K40093K9718j15359l4721O5878m29r3388J3587
99e1748J67891O8374j96153k50963L5217L15172K01729j42368k62011o2746J42850
110c4756J03535m4023l9397M8554O876j05666o7733J29643K02834k2896k62345
121h5374j72229J33044K62224O5874j71328j40593L7409Q2866k757l0746M9969
$$ y = [0, 0, 0, 0, 0, 0, 0, 0, 0, 0, 0, 0, 0, 0, 0, 0, 0, 0, 0, 0, 0, 4, -2, 1, -8, 7, -7, 8, -8, 8, -11, 12, -12, 12, -16, 19, -20, 20, -23, 27, -29, 31, -35, 38, -41, 46, -51, 55, -60, 65, -74, 81, -88, 98, -109, 124, -136, 155, -175, 205, -238, 281, -343, 424, -545, 734, -1056, 1683, -3149, 8060, -56148, -402723, -351510, 18154, 217802, 101751, -54592, -10825, 84012, 30124, -63482, -7477, 111310, 37185, -216381, -278761, 24666, 349576, 294488, -68748, -295953, -157127, 82966, 112684, -2675, -37396, 28482, 28053, -65335, -51748, 116143, 184517, -11636, -262599, -227382, 87790, 289519, 147151, -114860, -177606, -34756, 68779, 24756, -14641, 33913, 40789, -64877, -132610, -2967, 199867, 176971, -85374, -257603, -124559, 137665, 203539, 32211, -108382, -70973, 11893, 9136, -21610, 28359]
132B8359O3301p9201j54559N450K01606J52263j10018k43104o1109J72627J58276
143A33891l0914j24595l4304N3034J254m6766L0849J04125J8784j43990j36529
154a75161Q0170K10662O7926j54324j71963K0702J51253O4368o1985n1620K1138
165A166J2483n6901l0253R4529J08498n0654j70123p3631J32068J70161j2788
176A24555j54587q5391O2840R2079N10m3039J3101K7247m5255p2878K1306J25447
188F5935O6596j04493j45322K313J38286R4415n8534j08926j4956N5262K4019
199A4595j7715N163M1784n168q4865m8746P5262J15203N282j21179r0013N3482
211e6915J07892K5858o1344n0491J4499K0275j8510j028M9308L4363m9858r1256
$$ y = [28359, 91660, 12459, -142100, -136650, 64956, 217219, 107201, -135903, -197012, -24385, 133891, 102977, -21618, -55922, -2888, -1634, -48400, -17551, 86574, 105358, -38632, -175161, -94991, 115671, 183597, 29273, -142690, -121988, 29265, 93633, 31648, -19972, 1166, 13649, -43252, -73505, 21024, 129522, 78868, -91255, -164886, -32818, 137343, 124555, -30032, -115423, -52583, 39496, 40006, -3033, 10068, 37315, -7940, -80818, -59512, 65935, 132531, 28038, -117284, -114971, 23315, 117730, 59196, -49730, -64686, -9424, 14595, -3120, 2043, 43827, 38659, -46206, -94952, -19690, 95513, 100795, -20384, -110397, -56915, 50977, 76835, 15491, -35000, -20501, -226, -18736, -19764, 29544, 63907, 14049, -77207]
223g7207n537J04215P8065m5186j03439l1925O7798O2358j4882l7177k614J0537
235E006j7967k7303K8278O7516N245p8281o6042L3563R5483L2138o5733o4196
247e2293R625M9626J9458j9968m847J7116j1604l9601q197N0978N4337k4292p9683
260c9345k9226N2905O3767j602n5352k8070K1568K0451l103k942J5717J1329l0436
273d339l9326J5145N6740K7594l8740n9426j828M9945L0499j6285l0234o118J3721
286b652j384q245J4768K1954n367l5730k3944K8209M6046K882l7541l0451J0828
299b0627L2731P767j4576p423J418k133r044m51K2292J5244j9009k9312m350K7474
313AK7023r564k6798p998J1358J3055O27n891L259L60j1776o913Q846J7918M989
$$ y = [-77207, -82744, 21471, 99536, 54350, -49089, -81014, -13216, 49142, 34260, -2917, -5531, 5006, -12961, -40264, -11986, 55530, 60775, -17506, -83548, -49985, 45498, 77636, 11903, -52293, -42668, 6958, 26416, 6448, 1601, 18717, 7113, -32488, -40685, 10293, 64630, 40338, -39345, -68571, -15666, 48101, 46499, -8853, -36923, -15355, 5096, 1993, -949, 14768, 26097, -4339, -43665, -28520, 28220, 55814, 17074, -42352, -44180, 5765, 36264, 19979, -10255, -16373, -2652, -4036, -12281, 2487, 24441, 19074, -16656, -40600, -12391, 33655, 36537, -1004, -31455, -20627, 12104, 19871, 5295, -2128, -710, -2843, -11887, -12338, 9954, 25198, 6189, -23123, -27473, 1, 27024, 17460, -9338, -17336, -5978, 7077, 7704, 1813, 5072, 5432, -6344, -13257, -4411, 13507, 18496]
328A8496k1050j8060P517J8758Q983r694j4023J777O873Q99O70J905L287j949
342D389j1296k470J1773Q880k608j2619p897Q397Q878q35m514m610J207L175j819
357a969J079M020p21k310l268k3O873J910l745k740k231K923L583k399j438p41
373a197j371K437P02j969M10j148J026L055j500j322J108l34K091j39j994K058
389A913p8l100m05M64L958J703p016m085L392N144L210m957o108L428L567M89
405A519l00p77K340l07o457J1P140M654k623j0493m643R265P508k344o626m565
421f698L890M140k614O85M025J08m142p394L083J3104L400r852j0160j53J1600
436C022O441p022o094J18K107P48k934K890P849l291j0492l903Q023J3967l04
$$ y = [18496, -2554, -20614, -13097, 5661, 14644, 4950, -9073, -7296, -423, 476, 1146, 3051, 6338, 4389, -6907, -9377, 2396, 11276, 8668, -3951, -11848, -3451, 5427, 4592, 78, -4532, -3325, -150, -1969, -890, 3130, 2409, 99, -3169, -3192, 3681, 5591, 1846, -894, -3125, -202, 3381, 982, -456, -1197, -2568, -131, 571, -1398, -988, -2136, -1110, 1945, 445, -877, 231, -103, 1988, 1849, -145, 1913, 1835, -1265, -1670, -1206, 2752, 4455, -2561, -6646, -3254, 1890, 5100, 143, -5965, -2537, 1030, 1519, 1219, 442, 2782, 2475, -3982, -3971, 3169, 7823, 5200, -5293, -9936, -671, 6837, 4493, -2133, -6698, -2808, 1332, -1282, -597, 3428, 3536, -606, -8000, -4917, 8187, 11587, 1735, -8425, -8578, 3022, 9463, 2441, -3653, -3535, -1428, -680, -3614, -724, 7125, 3834, -6658, -10561, -2538, 11429, 11125]
451A1125j4307o689O009R467K406p383k970L687j924m102J057O904N976p651j3465
466a1860J007J2921R320m663j3338k434R181M581r89k609q9J939m943n351O548
481g79Q935M65j0565j1119N413J3680K745p426q043N08P272J133k667K590K175
496D317k514o168k573R366Q957n612j0827m489O514J0371j781p811k059J597K195
511e17l10j151N119J994o575n276K539Q703N887p522q979J001O074M564k326n438
527b213N15J511k254K28J881L175M05o970l119N639N752J043n161n480L494M391
543B837j0r03j895r2P33k494j15L445K52j606l334j425M758K483j866j564j622
560b418J577L319j066p68O0r94J089O3q25J002j091j126R86r07N62J162j984m08
$$ y = [11125, -3182, -9871, -3862, 5605, 8011, 628, -2342, 1345, -579, -4681, -3624, 3280, 9256, 1605, -11860, -10853, 2068, 11388, 6725, -6613, -9047, 134, 4715, 3726, 1117, 1028, 2967, -1976, -7327, -779, 8156, 8621, -1944, -13063, -7650, 6030, 8775, 1349, -6694, -6186, 1086, 2219, -448, 2142, 4317, 1803, -4365, -6938, 2428, 11385, 5773, -5054, -9543, -3029, 7342, 5561, -2250, -4309, -2712, -517, -827, -1978, 3141, 5135, -1440, -6716, -4177, 4526, 10413, 2891, -6088, -5087, 987, 5551, 3225, -2213, -1698, -187, -2441, -2213, -332, 2843, 3248, -3722, -6841, -1202, 4550, 5593, 432, -5048, -1554, 2837, 2827, 1924, 29, -63, 670, -1824, -1939, 1506, 1758, 152, -3182, -4607, 151, 2634, 768, -796, -2418, -841, 2478, 1412, 644, 704, -290, 799, 862, 37, 1039, -52, -1178, -192, -1099, -537, 625, -1359, -1767]
578a767N18M90K522k13k996j06P01L042K172l564k651P11J488K283q72k896P69
595c69n67j818J302J797K533j088o352j193N893M888L16o440m247M207M227mj273
612A812j604M78j425m070K738O902J265o338r010P56J1749N637n725p791k197
627f823O536M211k669K52K253j940n392l858O787J1820j938j4060q567O330J4755
642G697K816j1244o819K780M925J421k352L147M994o098j0657M71J3210J1792
656A6083p599j8860l516J2650J1868k301j1614l436N665O1l034K857P965K666
670I455j2747j2761Q360J8851O538j4092j7746K507J6202N892o261o218K66K103
684C49n884k708J1353J0516o495j8535q279J7055J9897l049j8177j0101Q071J2609
$$ y = [-1767, -1249, -759, 1763, 1550, -1446, -1552, -851, 2191, 4363, 799, -1852, -1141, 347, 2630, 1758, -1138, -369, -936, -2754, -1452, 345, 2878, 1790, -4562, -5755, 138, 5026, 5342, -1098, -5345, -1138, 3089, 3085, 1812, 208, 686, -739, -4809, -2071, 4831, 6096, -242, -9252, -8496, 3253, 8890, 3165, -4626, -6823, -287, 3924, 1255, 1507, 3760, 1820, -3572, -7430, -643, 11177, 9239, -4821, -13388, -7058, 7697, 10513, -731, -7550, -4770, 155, 1576, -776, 2371, 7365, 1267, -9390, -8919, 4291, 16083, 8484, -10376, -13892, -1242, 10626, 8325, -3289, -6725, -1060, -999, -4033, -1176, 6789, 9455, -3292, -16053, -7693, 11158, 17696, 3604, -14142, -11635, 4567, 10459, 4198, -2020, -1754, 349, -5535, -8243, 3110, 13626, 7131, -11404, -19683, -2628, 17269, 14220, -3957, -14058, -5987, 6622]
698F622l86n544K007J496o657q973L707J8372Q113j7543k0174J984K1428J4179
712A8631j1383j6894k15Q880M173l224J111Q557k137j6847p845J5056K1667k06
726A9324k5953j6700J2933K1384M409j4152j0966N469M663m956L48J0908Q444
739A5155j0914k2364o84K5515J8606j1431k7013q414J8985J6278m804j0659j975
752c719L849l256q052P493J8542J784k1028j9922R427K9728J0075k0072k0602
765a5753J247J7304P741p467k844M219l471j1797l667J6801J9906q594k8264j1245
779b5884J9115K5683P1k1686j1166P390R012Q5j720N897M034j3767j6147O925
793a2158K4510J2665j8598k7656m6K3385J4990p239j5173k602O549j007k986Q503
$$ y = [6622, 6236, 692, 2699, 4195, -2462, -11435, -7728, 10644, 18757, 1214, -18960, -16976, 4452, 18631, 7248, -9646, -9861, -981, 3192, -32, 1079, 9636, 7499, -9348, -17193, -2137, 19530, 19324, -6629, -23329, -10396, 10988, 15397, 1245, -9721, -4252, 411, -4545, -4197, 6711, 15155, 4241, -18123, -18807, 6708, 25314, 13883, -13130, -21544, -2559, 13719, 8915, -1744, -3719, 130, -3126, -11178, -3685, 14857, 16641, -4387, -24309, -14882, 14846, 24921, 4849, -15753, -14506, 2798, 10539, 3072, 228, 4447, 976, -10821, -14488, 2313, 22219, 13625, -14639, -25884, -6769, 18914, 18985, -2701, -13867, -6477, 2535, 2620, 900, 6797, 10831, -2936, -19083, -12158, 12352, 25017, 6419, -21237, -21283, 2102, 17092, 9853, -5320, -7922, -1373, -2380, -5366, 3137]
807C137J1531l186k1510j3116J7578K6424R93k3722j9626Q445K0610M076r300
820B334n003J840q82p879O40J7740J1383j4179k3763l940K4185K1632r443k3035
834h370p595J1264J1956k274n151M082O22j0987r291Q928K1735N525k2235k0588
848b2379O867K3885J1655j3258j6340J414Q281J659j909L091P236n029j7507m857
862a7191J7300J8674l597k3693j2805J3581J8083J858j1108p148L528K142m297
875d673L184J0395L995j2059j7240K561K1959J1172j1891j9213l662J4235R784
888H547m246m976M29L54m886m122Q931J4201k484j7670j1119R810J9697L197j5210
903D53j0602K767Q808K463l694J318L085n724r083J279J3487J0943q889j7761
$$ y = [3137, 14668, 11482, -10028, -23144, -5566, 20858, 21851, -1871, -21497, -13052, 7558, 11634, 2334, -2669, -829, -1711, -9590, -8950, 8790, 20173, 5994, -17769, -21709, 2476, 24108, 14665, -8370, -15965, -4701, 7255, 4981, -170, 3912, 4534, -6453, -15744, -6816, 14919, 20444, -1791, -22379, -15512, 8373, 20028, 6770, -9570, -8156, 125, 1784, -125, 2966, 10202, 5173, -12334, -17191, 109, 18783, 15186, -8507, -21312, -7731, 10352, 12210, 1102, -6046, -2518, -376, -4673, -1489, 8906, 12901, 842, -16398, -13837, 8122, 19294, 7403, -11810, -15472, -1237, 8547, 4301, -675, -246, 108, -4778, -8900, 31, 14232, 11748, -5922, -17041, -7231, 12466, 15663, 453, -10149, -7382, 1426, 3889, 195, 1513, 4598, -1126, -10209, -8930, 4557, 15500, 6611, -11150]
917a1150k891J3547J2420k195j2413l808N053K000r96R18M786P70r995q872P169
932e657J4273L903j1717j3431L406J2743M879m607o179K70K722k497j147O126
946C087N177l906j0903n033J0550J1215k626j0829o343N048Q377j76l809J41O44
961F14j454l343J297Q538L042p951q061N17R330O502n536p799o02L480L091r39
977G26j357K472p58m765j132M128O352N09q027m689M127O077K187m628m091J483
993a386J515p97O61P93J574k075m958L44N558K975j476n460j841M565K874n85
1009B281j682j258Q41K25j704J286K271m79k386k622O50M479L96k396j845m31
1025b374K244J485j236M71P6o92J58o44R87J705j225j678q9J13J408K10j707K28
$$ y = [-11150, -14041, -494, 11926, 9731, -2682, -6490, -1437, 563, -433, 485, 5271, 6041, -3954, -12826, -5657, 8616, 12519, 802, -12629, -9223, 3520, 8399, 3792, -2387, -2117, 605, -1892, -3039, 3087, 8264, 4358, -6545, -11578, -1028, 10187, 7561, -3268, -9611, -4563, 3814, 3638, -171, -30, 614, -840, -4183, -2886, 5652, 8694, 743, -7318, -6801, 2529, 9031, 3495, -4304, -4906, -1426, 1665, 726, -631, 1841, 1083, -3682, -4814, -686, 5666, 6175, -1852, -6541, -2414, 3663, 5850, 1222, -2869, -1386, 129, -668, -7, 786, 2360, 285, -4673, -4329, 1229, 4204, 2728, -2732, -4573, -8, 2866, 2281, 599, -659, 182, 407, -1297, -11, 2260, 1781, -605, -3227, -2577, 1902, 2298, -98, -1943, -2374, -130, 1355, 119, 590, 666, -26, 132, -512, 475, 2180, 955, -723, -812, -699, 709, 919, -788, -560]
1043e60j65j90R59l07K5Q58r07J96O87q21O95L77k87N28r44p75J029k00PK2j047
1064h20K14L65j050O23J213j61k15j472l23K589P45m66j116j452J682P81q31L94
1082G00J60j200o24j337J401L350q06k820j899Q50L908R13k389q97r1O96P38o66
1100a3J421J544k869k779L1L013L981j963n390q61K451L242J88k749l16J341j072
1117h00m80J337K719J318m208m735K544N101K408l266n753J34L986J142n90j174
1133c17l1N05k569j096M176L887r23n615l984M375O398l5m082l781P15L387l17
1150F93r15J673P2k214l478o0O321L623m002n757j504N263N438j974l907m37N02
1167f63O78l78M62L474n01n486k973K761O126K254o240n143J931M346K762j893
$$ y = [-560, -725, -915, 44, -263, -238, 620, -287, -91, 596, -225, 470, 847, 560, 1088, 144, -631, 398, 198, 205, 227, -820, -606, -241, -1291, -668, 545, 384, 169, -1303, -1626, 963, 1708, 1242, 126, -1326, 356, 1137, 306, 700, 860, -340, -964, -2301, -900, 2450, 1644, -1176, -3075, -2225, 1683, 2596, 207, -690, -781, -85, 653, -13, 1408, 2952, 83, -2696, -2665, 348, 4329, 2366, -3024, -3885, -1434, 1808, 1996, -753, -1069, 272, -800, -1280, 57, 2776, 4094, -114, -4849, -2305, 2796, 5204, 1938, -3815, -3681, 305, 1447, 857, -317, -348, 157, -2412, -3508, 668, 4555, 3632, -1983, -5967, -1592, 4806, 4771, 689, -3092, -2377, 1010, 693, -222, 1451, 1523, -691, -4169, -4229, 2092, 5715, 1713, -4044, -5548, -285, 5153, 3179, -728, -1165, -663, 15, -363, 99, 3573, 3072, -2414, -5387, -2626, 3500, 5754, -486, -5629, -3698, 648, 3410, 1517]
1183A517k639J372j84k085P95L080L043k049o902j575N645N121r29o139l410L460
1199a879L176l84q01q0P84j575l192K457N590J248m406n865M57O898L150l536
1215B042m223q04K630J133j551R59J816j385l259k055L760O340j166n993l114
1230d870K454N823J016m178j667Q34M82j57n25K190J990l693m143L75M949M067
1246D947k529o171p72M165K834J78k712n53J461j576o95J914K397O33m457m098
1262e034K888M832J038l147m334O18L777L12n93j73L21j15k038n09L788K400j906
1279B125m001k131L525M164j259l168j749Q31K186m16p81J540j93j645j346O71
1295a647L878J617l501k873L45K906K645j985k438L95M28N4J1l01J565n20k696
$$ y = [1517, -1122, 250, 66, -2019, -1224, 1856, 4899, 2850, -4052, -5627, 18, 5139, 4210, -1929, -5339, -1879, 1297, 913, 112, 32, 816, -759, -3951, -1494, 4096, 5344, 938, -4927, -4470, 2428, 5578, 2042, -2181, -2985, -355, 778, -773, 186, 2002, 617, -2642, -4697, -937, 5403, 4237, -1756, -4870, -2416, 3407, 4423, 245, -1422, -588, -106, -263, -788, 1402, 3392, -301, -4444, -4069, 880, 4947, 2418, -3753, -4525, -360, 2474, 2652, -60, -613, 848, -728, -1423, 491, 2888, 3521, -936, -5034, -2146, 2686, 3724, 577, -3757, -3139, 638, 950, 357, 184, 505, 390, -1648, -2157, 1631, 4031, 2125, -1876, -4007, -482, 3682, 2423, -745, -2494, -1663, 523, 107, -674, 866, 673, -972, -2318, -1647, 2231, 3848, 347, -2526, -2181, 725, 3370, 1385, -1053, -658, -230, -176, -165, -466, 1099, 579, -2117]
1312b117l15J764K558N08k865k010J740J871P34q83j600P19K15r06M89R48J25
1329I75o65k283P0K253O89m27j551j112J853R75k58j0o76L11L65o28M97J018p03
1348F93p74o38k47J888q9j348l47k53Q59Q84o98k95K18k03P45J7m54Q66l06n61
1368d3K61k25M75L15j278j22K94J54P88q89r85P09Q9P85K13j073K04P47l46N15
1388E88l8k39M65r34m79R63L80J66r92j758P65J566K13o25j140j33J486j4m07
1407a67O69L7l1q25p94J631J565r49j671j539J143K604l78j836o65J19J050L20
1425B83r80J319N10j368r89Q7K134K102j856k746k64J832K223p61k365l6N25p5
1443d25Pj18J365L84k642j391J932K826Q79k612k879J423K451P92p60j767L60
$$ y = [-2117, -2432, -668, 1890, 2398, -467, -2477, -737, 1134, 1868, 985, -615, 104, 319, -587, -98, 850, 975, 310, -1973, -1903, 350, 1039, 612, -939, -2051, -198, 777, 519, 509, -167, 144, 509, -119, 378, 1396, 693, -81, -719, -966, 922, 833, -515, -862, -1115, -256, 628, -70, -365, -147, -350, 395, 412, -42, 824, 518, -43, 218, -7, 468, 783, -495, -617, -323, -169, 619, -270, -1255, -546, -457, 328, 541, -532, -328, 419, 73, 588, 550, 311, 776, -158, -637, 326, 706, 872, -120, -1878, -1113, 453, 666, 41, -1099, -1232, 254, 240, -167, 502, 539, 508, -317, -1111, 520, 2085, 1136, -535, -2074, -931, 1673, 1295, -541, -1206, -1087, -37, 283, -697, 622, 1132, -236, -1225, -1138, 996, 3098, 1242, -1504, -1768, 64, 2287, 1526, -839, -875, -350, -425, -418, -536, 829, 1213, -1429, -2820, -888, 1938, 2817, 205, -2674, -1251, 1200, 1992, 1232, -535, -175]
1460a75N15j436Q1J675J035q75l214j059L471K682q82k738j770J969K198l88o16
1477D73K11q9r53j309Q06L307O18l375k807J3M261J937k580k537k9J720J064q27
1495i6J37J694p98k632m83K388L587p40m565k027K432L221O61l404j534J424L32
1512d03l07JJ316J482j880l096O44L738K683k022m673n12L468J985o46k154q62
1529a238J383o87j523J742K150j4k976l002K044M798O55k897k972O56L137O81
1545A937j510k84M49l34j365q42K728K495k110l681j134K761L937r47l251q22
1561a973J135J492P9o57J123M05k528j289J283L094J658l469l554P78K954K027
1577B558j501k590K76R97j59j29J005J251p5l196j250L121K829j39l556k287J686
$$ y = [-175, 340, -1096, -1015, 660, 1695, 820, -2394, -3453, 18, 2700, 1818, -920, -2690, -721, 1477, 1089, 473, 684, 595, -358, -1667, -861, 2446, 3064, -311, -3118, -3105, 1156, 3093, 513, -2024, -2053, -333, 731, -96, 41, 1735, 937, -1695, -2178, 210, 3797, 3057, -1508, -3535, -1103, 2118, 2779, -625, -2159, -735, -403, -710, -709, 607, 2089, 209, -2887, -2243, 1495, 4178, 2156, -2517, -3029, 439, 2424, 1778, -376, -1238, 145, -542, -2065, -323, 1827, 1813, -1163, -4165, -2121, 2677, 3332, 435, -2537, -1881, 1256, 1937, 427, 143, 592, 258, -1107, -1949, 779, 3274, 1164, -2517, -3651, -890, 3047, 2100, -1151, -1973, -838, 654, 733, 76, 1199, 1604, -924, -2213, -930, 2164, 3822, 353, -3201, -2423, 531, 2558, 1057, -1533, -1257, -260, -419, -548, 457, 1708, 1633, -1563, -2813, 308, 3137, 2998, -558, -2845, -1159]
1594a159K869l88j080j110M96K35j538N02K684N26j831k789n7L841K099j792k556
1611a048q67K031J339q59n60N94n93r50j003R42L161j93l061j902J287K869J188
1628B375k148j582M77J048N72n14R3J203j253j718Q1J765J879r50k882o21J436
1645g39J553L10j629o42J120j39m05J024N99K66j162j991J144J929O59j257k130
1662a490P5J582L44o33J26l91J42l13p32J417J164n54j077j059J184J784m90j051
1680B8o02J80P35J4n99K94K90p15m06j99J200O23j080o19J35N06Q76o8q34M60
1700B19l7j79J50O7L72J13j243LL23J87K89m97m76N20j03N4L90k48K83J96p64
1721c81M76L46k41L15l82k43M11n49pM89n53J95k79m16P51L19l83L15m19J07N22
$$ y = [-1159, 1710, 1322, 242, -868, -372, -137, -1675, -1173, 1511, 2037, 206, -2583, -2640, 1201, 3300, 1508, -1048, -1915, 116, 1455, 596, 36, 630, 37, -913, -1916, -974, 2187, 1994, -1067, -2969, -1682, 1187, 2375, 227, -1355, -878, 170, 742, 228, 321, 1524, 271, -1447, -1366, 399, 2278, 1328, -1554, -2175, -739, 814, 1124, -505, -1147, -27, -166, -571, 453, 1052, 1318, 156, -1835, -691, 1238, 1897, 640, -1490, -1415, 167, 511, -122, 4, -387, -245, -558, -1290, 127, 1291, 737, -340, -1399, -215, 1569, 1079, 28, -574, -394, 341, 355, -244, 50, 340, -375, -781, -980, 220, 843, -237, -856, -721, -215, 661, 593, -241, 219, 182, 3, 153, 220, 592, 705, -538, -535, -212, -25, 264, -233, -709, -189, -292, -238, 152, -96, 187, 383, -381, 95, 441, 200, 515, 133, -110, 301, -248, -255, 234, -319, -124, -403, -819, -68, 251, -132, 183, -236, -129, 393]
1742C93m89L58O19n36m43q5k29J210k37p70j96k17L60L63n25L15J66l73q1JP26
1763C30J022q74j059J10O51Q37L6j326OM09m97P9J32N46O1j245j041J492J061
1782G30M87j233j398R74J035L90l19n55N6L42j125J97J260K78o91j549r19K195
1800A55J184q68j050q58Q19J126k47l93O80l4o76o98M31K101M13k086j611K52
1818a360K085J175j780j181L6N20M43l34R9J440p68j772k14J609K277j56k884
1835g65j161J470J702K73j370r98P00j80o88O08R06Q12j425k293O57K729J213
1852B190r05k488p18K200J133n94m68j51J26q49q05J435J795n95k122k078J481
1869a413L027K89j890j509K37J707K60o82O92M31j035j386j60K422K015j957l111
$$ y = [393, -96, 262, 881, 345, -98, -183, -412, 798, 561, -209, -405, -622, -262, 101, -424, -109, 57, -316, -397, -396, 330, 1352, 478, -581, -471, 180, 1017, 1053, -273, -267, 142, -355, -276, -144, 402, 463, -782, -1823, -331, 730, 1217, -16, -1414, -440, 595, 985, 666, 111, 167, 509, -616, -419, 841, 1119, 428, -1121, -2040, 155, 1339, 471, -579, -1437, -618, 508, 261, -132, 548, 514, -162, -860, -429, 1672, 2085, -1, -1612, -1360, 725, 1900, 120, -1061, -1025, -505, -62, -396, -297, 1143, 375, -1397, -1611, -2, 2275, 2119, -765, -1926, -456, 1246, 1519, 149, -849, -149, -329, -1017, -409, 497, 1309, -116, -2409, -1752, 977, 2190, 1285, -1203, -1921, 279, 1412, 818, 350, 199, 325, -524, -1329, 106, 1901, 1306, -816, -2894, -1413, 1614, 1903, 13, -1496, -1259, 448, 708, 26, 718, 1149, 114, -1272, -1432, 990, 3005, 1048, -2063]
1886b063m53J800K670o07k209k57N55K01K31l9J425M15k404j505J298K944J081
1903C083k562k938P60K400Q87r07j503J91L82r01K24J327J059k41k790j195K581
1920a43K627l56k424k034J514K094k47m80m77J10l27j570N26K578N38j999k304
1937b374k36L298J748j396j855o78J392J159p54J62Q09p21j497q78J197K849n8
1954B167l167j666J094K411J064j942j142O01L19K25j1Q33J034j430k034J04K308
1971G68J856j043l003m83J639J271r5j032o70P83n59n05J004J575p1j804j861
1988b230J269K574M98j393j962K0J852J78p09N0k10o2r29n19J704J395q32j797
2006a103p82J400K373l29j604p60M23R09J10n11M08J46j180p73K78J656J163j688
$$ y = [-2063, -2516, -716, 1954, 1347, -862, -1119, -564, -363, -132, -171, 1254, 1669, -735, -2240, -942, 2002, 3083, 521, -2417, -1657, 743, 1630, 723, -780, -589, -207, -1108, -884, 443, 1502, 1261, -1529, -2724, -143, 2484, 2128, -296, -2330, -816, 1278, 1031, 551, 74, 184, -143, -1713, -1187, 1391, 1929, -70, -2374, -2610, 688, 2436, 1040, -815, -1493, -101, 1058, 304, 466, 1275, 554, -943, -1821, -624, 2225, 2167, -1000, -2666, -1572, 839, 1903, -39, -1181, -580, -261, -36, -47, 786, 1820, 390, -1644, -1540, 768, 2624, 1581, -1422, -1905, -266, 1005, 910, -122, -792, -9, -568, -1073, -69, 1506, 1435, -369, -2230, -961, 1613, 2111, 718, -1244, -1224, 628, 806, 97, 147, -63, -125, -1054, -1573, 131, 1526, 694, -1103, -1885, -485, 1888, 1559, -45, -805, -382, 527, 637, 126, 534, 680, -500, -1273, -995, 661, 1824, 136]
2024A36j720J92J162J619q03j128j5O14j00L5K33P10J60j847l35J003J368J17
2042A401j662j264P67J053J94m86m19J45J34m66L57R39K49m62j284j75J523P36
2060A280m14j172p87Q98Q42m56l45R3k71m0l90L98J209l03o79m86j31J271P26
2079A243q06o25oK26M37l86o9L73p99k61K23J98Q26j21j083JL78M03M81l72o82
2100d21O34M6Q2m0k61K35k59o22M28L43P3q9o83j42Q05k18J70j14m21M86J65o4
2122A33l7K8jQ6l66L1M85l64qk58l16N69r9j82J73j19rN07k32j54J73k26M74J26
2146D14m21K21q3Jm7k49J92J87n77N8L3N0N54l56m85L13J32L17R5l90M8M56n12
2169d9K25K73j00K37r48m31N44L24K62k88j043N40O58k35M8m8j59N11l17k39P92
$$ y = [136, -1584, -1392, -230, 1389, 586, -542, -557, 57, -43, -8, 225, 935, 1095, -752, -1087, -84, 1284, 1401, -261, -1525, -758, 295, 489, 3, -416, -271, -137, -603, -246, 693, 942, 480, -804, -979, 544, 1280, 866, -306, -1093, -195, 647, 191, -154, -61, -332, -372, -762, -364, 845, 542, -137, -623, -754, 517, 1243, 437, -188, -194, 32, 469, 83, 14, 387, -412, -673, -450, -252, 574, 453, -630, -629, -251, 152, 633, 261, -421, 213, 259, 341, 301, 40, 275, 16, -606, -178, 165, 238, 149, -534, -676, 129, -89, 81, -33, -454, 32, 197, 133, 96, 124, 123, 209, -157, -126, 359, -5, -13, -271, -587, -18, -117, -299, -126, -245, -254, 253, 21, -133, 40, -186, 288, 414, -7, 214, 131, 132, 85, -164, 28, 215, -362, -304, -271, -221, 333, -23, -508, -195, -63, 254, 349, -41, 7, 463, -49, 176, 449, 349, 586, -362, -793, -249, 75, 337, 49, -994, -454, 204, -31, 17, -31, -190, 321, 4, -235, 557]
2190E57J36j93n60p44Q48Q46m31p37m18J74Q27l61q5J51k72P1l11J92J067J80
2210I37q44o16j37J038J033j009q63K54m3M52r9l92N99p7r58j45O35J061J53j429
2230d50o42M22J273M83q69o44M07K69l80K59Q4M47m96j166J94J153O39n80j219
2249h16m80J280O10k59k12l61J01K35m43M16R36k13q82j260O16J542K38j040j160
2268a152J38J016N90o94J13J13l32j73LQ52R01n90j405m52P89J484n4j541m85
2287h79N20L89J07l71J18N36q16p13P17J072P73j180j490L33J288Q23m05j226
2305d04k16O40n1l14N31K22n7j072q46J236J317R3j284j115N67J621M6m45m78
2324ij55L66m17K8Q76M01q81j179m44J316J323q10j147n77Q31J115k59l81J25
$$ y = [557, 693, 500, -60, -804, 44, 890, 459, -278, -696, -522, 305, -56, -141, 10, -262, -191, -502, -310, 757, 937, 93, -523, -660, 378, 1411, 402, -461, -207, -250, 202, 103, -289, 310, 233, -725, -870, -235, 826, 979, -450, -1092, -670, 603, 1086, 217, -427, -20, 249, -131, 128, 212, 659, 163, -1003, -809, 344, 983, 403, -816, -1296, -16, 594, 335, 123, -238, -137, 98, -345, 71, 1007, 794, -88, -1348, -732, 810, 1048, 8, -1152, -1014, 2, 592, -102, 11, 124, -208, -381, -378, 474, 1375, 785, -620, -1072, -283, 1201, 1147, -394, -879, -359, 30, 137, -234, -116, 420, -396, -1109, -392, 680, 1453, 273, -1217, -884, 404, 1227, 822, -404, -620, 20, -31, -345, 186, 408, 351, -721, -1567, -331, 986, 1079, -205, -1320, -753, 868, 914, 469, -9, -164, 202, -215, -187, 689, 1090, 209, -970, -1414, -98, 1225, 415, -732, -1309, -478, 637, 378, -3, 122]
2343A22k49o1k22L70J181L4j328j042M60J172Q54j183j141K71N05L70L5j08K60
2362C00j42r37J12Q04J028o5j584o91J110J036J49j074o63L50K94m18L89L12N0
2381C60m40j133L81J494M83o17j262l06J281P57n96l87r5J19j22m30N35P54n50
2400B26o02r29M87J653O7j086q13L13P27P25o55J0K86m94j90p9P91P27q21j301
2420i58k1P53R77k37j248j08O55J92J43o5N9L04n92l24L52P54M65p56j367M76
2440e46J062J83k54j021O0N32k33l7M18O9k00l85o25J105O96k91n52r22O67R04
2460F30k38k19k95j2O1j76k03O66Q1o16l95k0R06P50p38n77j55M66N80p1l31K38
2482C32o9m28K2Q2M88N5q84k99K09P70J94m59m59K47K38OJ32j02L18o3q50N06
$$ y = [122, -127, -188, -410, -40, 1141, 1175, -153, -1195, -735, 437, 1291, 108, -1033, -762, -257, 113, 148, 40, 300, 158, -779, -667, 137, 1165, 1100, -484, -1175, -65, 971, 1120, 46, -617, -267, 27, -391, -2, 310, 360, -80, -1213, -832, 662, 1145, 528, -734, -1040, 241, 998, 402, 15, -80, 39, -83, -513, 22, 776, 226, -376, -1305, -818, 835, 902, -184, -997, -684, 43, 768, 113, 123, 409, -85, -275, -354, 437, 1164, 343, -958, -979, -226, 751, 514, -734, -842, -187, 5, 148, 83, 142, 446, -146, -470, -118, 636, 1101, 345, -1022, -546, 516, 699, 445, -576, -516, 16, -217, -254, 164, 233, 33, -352, -977, 128, 824, 533, -19, -941, -274, 630, 392, 173, -122, -134, -73, -249, -452, 214, 295, -321, -716, -736, 170, 920, 182, -395, -550, -84, 496, 425, 94, 332, 263, -165, -143, -61, 427, 482, -402, -701, -492, 278, 472, 13, -446, -199, 39, 45, 177, 75, 393, 330, -520, -14]
2504a4L28J95n5r15j38P14J33J01n94m01N60j3j60K42J16m2N1n73J84P54r7l36
2526D0j45j56M95J66m30l6k47K21J17l71J94M64l06r5j76J00O68j23m31j6J1K34
2548A78J31k29k85L35j91Q7j32j24L40k11l11K58J52J59M4l61j35L99J49n1q6
2569A16j87K83k66p0K60q5J66k76l58K24Q5K5M0r6j93M80j44o5L09j80K8P3j22
2592D7J07J84k65o3j16O4K88k61k18K44k93K36J00j44J76j6k02K93j61K3L81k45
2614A59k19J07n2MK3J02j79Lj4l3j00oK55l72J34K35j42K13j85j7K00L1n0J7o0
2639E4j47L23m8k73J9j48K55k44j43N82m70O4K44l33L40J16j80J25Lj43M43r0
2661C49l80N1pj34J84k84o8L09l53J63j4m1L04k28K7K34j20Q9K67l94J80O6k01
$$ y = [-14, 314, 509, 454, -461, -599, 115, 248, 349, -245, -646, -86, -99, -259, -17, 99, 57, 108, -465, -281, 473, 376, 40, -105, -261, 234, 400, -30, -66, -313, -92, 25, -346, -152, 312, 6, -89, -265, -165, 503, 380, -51, -67, -56, 178, 309, 80, -205, 130, -61, 26, -106, -230, 110, -101, -412, -154, -2, 157, 201, -160, -295, 104, 253, 202, 116, -71, 212, -54, -124, 136, 51, 217, -59, -417, -193, -108, -83, -43, -139, -332, 148, 4, -61, 248, 68, 96, 169, 47, 154, 338, 73, 10, -106, -42, 246, -15, -233, 11, -282, -46, 54, -90, 86, 70, -132, 161, 0, 23, 404, 159, -60, 47, -5, -1, 22, 124, -55, -52, -66, -99, -199, -205, 50, -322, -188, 47, -95, 118, -67, -84, 116, 147, 97, 114, 54, -93, 230, 182, -91, -72, -220, 35, -209, -352, 230, -240, -176, 68, -265, 75, 191, 11, 136, 139, -4, 439, 349, -31, 20, 13, -121, 63, -221, -289, 20, -333, -170, -184, -225, 79, -149, -122, 112, -8, 81, 348, -46, 134, 200, -1]
2684aO2l1j50J25k40Q0P8j0j6nl53K58K06p0L37k57kJ71j34R5P7j54p8k5r9K38
2710A02j15k06K58m33J76K66j95J01K51m36J47K91j95J72j49p9L78m57K24Q8k23
2731c4NN8j98K13N7l42L00j77LJ55j02J68j1j83J55R2j68L52k65k34K87j32Q9
2754H8o4j98J83j66j45K55Nm7O1J4j80L59m4l9J04q5JN2j18J50j0k14R1m6k14
2779b07J60j92J83L7k45J93R3p4M17k41j14K17n6l12M42m40K42J37k60J16j21
2800b5k05K64o0n5J7k63K62L2o4R7J56j81J19J5m5J73k56j1L87k95j3m5k47K09
2824c4jj51J43m8k3J68j68j25J68%K85O2k76K37j01mN9k35L2J28k48P2K37m40
2848b63K83j85k54M22M8j21J08k79K29L86j93Q9J7k54J14j49j85L86o6m49m3J28
$$ y = [-1, 61, 30, -120, 5, -235, -155, -77, -87, -103, -108, -461, -203, 3, -67, 270, 13, 11, 182, 48, 143, 220, 66, -12, -37, -136, 102, -13, -219, 39, -394, -218, 48, -147, -46, 205, -231, -84, 207, 12, 184, 35, -44, 334, -123, 101, 189, -34, -29, 29, -169, 44, 101, -241, 59, -118, -115, 40, -62, 106, 95, -88, 67, 159, -9, 343, 78, -156, 131, -1, 88, 24, -174, 9, -157, -302, -47, -42, -89, -28, -14, -194, 165, 121, 82, 186, 101, 102, 154, 36, 186, 176, -38, 53, 7, -207, -47, -239, -56, -19, -264, -71, 22, -52, 365, 124, 10, 227, 171, -141, 301, -139, 103, 240, -20, 96, -25, -230, 34, -26, -81, -64, -327, -65, -33, -97, 0, 156, -25, 94, 109, 64, 237, -19, -30, 357, 62, 49, 4, -243, -34, -35, -186, -43, -91, -114, 54, -114, -239, -71, -71, 214, 276, 0, 237, 136, 132, 191, -44, -12, 116, -132, -60, 177, -263, 20, -165, -419, 3, 51, -70, 38, -241, -12, 374, 181, 270, 287, 33, 147, -2, -187, 199, 133, -316, -359, -231]
2870b31J99J17k68l3J34J56J34r2j97L47j71j95J27J98m2J50m43j20J26K24k9
2891I1k42k01J61LL5J36RL15k48k24K53R7K16m28j80MK99K59k68j04Pq5L7q0J14
2916b4J83l07Nl43M44L24K5j92j79j16L71l5L3j39j1p3k20m8K20M14m74k23l2
2939c97K06M36l5m66J31J03J22L21k99j06K30l27j40M16j8P1l76m04J78L75J99
2960B20K4o07J71L79k7n1k6j9J25l18k54M67L03j00m29l29L98L81j67k03k85K57
2982i0j6j41J83K93k24o6j73o0P26J45l52j66l94K43L88j72j55O7j20j80M8m2
3004b58N17k28m29j9K07M37K37n70j35K51J34J76j35m3J42k59l17MM38J95j83
3025A62p72J88M56M0O3k31j44L35nj71L25l7O1k73l67L09L07N3j62o15RN66J67
$$ y = [-231, -32, 85, -183, -216, -82, 74, 208, 116, -81, 266, 95, -100, 27, 225, 183, 333, -110, -230, -104, 120, 91, -151, -352, -191, -188, -153, -17, -8, 307, 59, -165, 88, 185, 401, -27, -207, -203, 96, 355, 87, -17, -10, -95, -58, -138, -24, 159, -148, -143, -486, -42, 282, 307, 115, -64, -180, 191, 156, 189, 50, 39, -34, -254, -302, -82, 332, -142, -365, -397, -191, 245, 210, -256, -125, -22, 100, 421, 122, 16, 246, -81, -221, 195, 177, 248, -128, -532, -354, 21, 220, 244, -363, -192, 187, 160, 109, 83, 64, 189, -129, -383, 84, 387, 287, -142, -471, -73, 308, 141, -62, -347, -90, -106, -247, -64, 229, 5, -61, -234, -294, 432, 577, 225, 59, -335, -92, 296, 124, -31, 36, -84, -264, -216, -258, 259, 31, -398, -417, -210, 227, 464, -106, -241, 10, 144, 320, 185, 142, 284, 25, -292, -288, 150, 345, 162, -610, -422, 34, 74, 137, -94, -238, 97, 92, -79, 246, 209, 270, -3, -370, -61, 246, 299, 137, -478, -469, 97, 264]
3048B64l83J6n6O1l6r4L26L54m28l06j51N42L50j30l55j81o0L81J05m27J7J66
3070b5j98o5L2J98N09p15l31L30L31K99j33m00L10j1j04Q3r8p8K93m56k17N19
3092G3J58l6l95m58N17L22O5n8j36j29Q4j08K24L12k99K4j45r4J54L16m51o9k85
3115d14J39M51k23l9J7M9J1L2o8L69J4l93j12J24L27K7l74k13J93j0J84j81p6
3138a66K44k10j82K49P8K78om91r5L78P4K71l66l00L45j68j8J09r7Q5j23k45K23
3161a33J98J08k17j80r0M04K13j29ml44K89j82j93L35J5j11P7m92K87L40j99j12
3183a20k50J13K42R1k06L60j52p7J41p0K34l5k56k08J93m2K95k68j5j6k15M17
3205A56j25k21L02j13k19L04p0Q1K90m91J1R3K10J09j63m86K14K34k72K96l69
$$ y = [264, -119, -103, -159, -98, -134, -228, 98, 452, 24, -282, -433, 109, 459, 329, -26, -207, -267, 114, 219, -208, -191, -25, -223, -288, -256, -58, 451, -264, -595, -265, 66, 365, 232, -168, 142, 131, 27, 110, 12, -66, 227, -229, -446, 73, 231, 195, -200, -658, -141, 181, 246, 188, 52, -77, 7, -101, 123, 435, 136, 160, 15, -79, 75, 391, -60, -129, -414, -275, 176, -47, -86, -69, -20, -9, 23, -45, 324, 338, -55, -167, -43, 284, 311, -63, -276, -83, -93, 91, -90, -166, 78, -132, -314, -65, 13, 291, 285, -206, -301, 77, 151, 422, 56, -244, 101, -67, -85, 24, -73, 12, -111, -356, -133, 65, 173, -44, -224, -314, 90, 303, 174, 170, -174, 115, -67, -260, 75, 90, -21, 56, -436, -149, 191, -8, -120, -370, -257, -15, 76, -130, 230, 78, 1, 142, 72, 306, 271, 15, -193, 0, -42, 253, -15, -30, -46, -261, 156, 31, -190, 112, -1, -220, 84, 14, 95, 385, -106, -95, -2, 208, 317, 154, -332, -118, 116, -156, 140, -229]
3226b29Q1J75k36R8J89n4J04j52j10K68P3jl9j53k6J4r7MK46k58J08l8l16L52
3250CK01k55K4k86L48J56r4l1m5q8N4J13j1P8k28j81K51J45r5k9j97J02J15p9
3274b9m8Np8J57L7L4j98J41J93ok16k2J48MQ8k50j98K22j73L3J14q1J50m3r7J09
3300dj8nJ37k43p4L71j78J38L4j23J08j13r4m8K07k54J30j49K1K08l0P3j35j0
3324e1J72j52Q5j9l1qJ03j33J5J27k18Mo9j26J92NK9K6l8J41K2r2j38L11l6j02
3350A9K01l52L64k35j39R1P0j87K23k47R9J23j22J05J6p7k5K08j83K60k14n1K54
3373B01j13R0j20j2K3l6j69J23m6j28J85n6RJ4j29J52p8K30m7Q4k78K95k89l3
3397a28K65j98J91q6o1r1L1N7J80r5j35P2j59J59K02k29J83L1k36K44r9n6p7l9
$$ y = [-229, -148, 27, -209, -111, 78, 24, 128, -24, -134, 134, 207, 206, 167, 14, -12, 2, -95, -91, 155, -103, 5, -33, -349, 3, 204, -51, -27, -313, 35, 191, 97, 66, 21, -67, -13, 100, 89, 167, -61, -242, 9, 154, 59, 30, -167, -65, 50, -29, -77, -72, -150, 7, 44, 78, -120, 21, 214, 208, -8, -30, 118, 122, 210, -40, -238, -16, -189, -156, -42, -123, 27, -16, -113, -4, -22, -27, 110, -133, -207, 164, -14, 124, 158, 35, 143, 30, -64, -112, 95, -159, -29, -178, -157, 51, 21, 94, -41, -51, 121, -31, 54, 35, 4, -4, 99, -34, -19, 108, -110, -106, -175, -301, -109, -104, -75, -49, -87, 54, 76, -16, -154, 157, 121, 19, 220, -132, 232, -3, -142, -51, 19, -168, 55, -192, -93, 30, -92, 13, 29, -48, -73, 135, -48, 212, -2, -53, 201, 88, 178, 58, 46, 69, 33, -136, -13, -59, -187, -2, -58, -49, -35, -164, -12, -90, 140, 93, 177, -101, 194, -95, -128, 137, -61, 130, 44, -17, -108, -77, -20, 160, 65, -70, 2, -157, 2, 204, -25, 158, 189, -47, 197, 98, 42, -35, -74]
3421g4j22J58L2j36J00j77K96j6l50K41l5J19j25rP8J15m8R9j12j45J54j7n5j26
3445a55J50R5j52k40K16K14r3j53K38j89J08Q0k47J69K4k35K20L1M7k2k05m5n1
3468a95P6R1q1O4Q8k59J02K45k29L00k44J07J8j29J00j10J71j14J29l02Q0K00
3490A08j89Q2l9q3P6K9jj32K69k18J86p7J20n6r9J99m1j34N2N7j84R6k56L5K17
3515A7k78K11J32j83N9P6q3N5n6J21m8m3l4K38j49J84l82J92J51j32k59K63j36
3538h4r6K38j91L8P8o2K26j79j79K73L3p9N4Kn5J35l30K55k10O9J75j02k13J63
3562d1j43Q0Q8p5O4N2n4J52p9m8J51k00p9L52k39M4N0p5N1j45N8P1l8j26J59j84
3588a54K16L2M7j9%j59O6J07j58K09o1j45M4J2j11Q8j89J52P9j66K24j51o4J62
$$ y = [-74, -196, -38, -6, -142, -42, -219, 77, 61, -289, -48, -83, 36, -89, -98, -20, 95, 47, 146, 34, -111, 43, 26, -29, -155, -5, 90, -62, -302, -86, 128, 35, -118, 120, -69, 39, 119, -128, 41, 65, -170, 50, 81, 128, 106, -99, -144, -195, -119, -28, -109, -45, 43, -216, -114, 131, -98, 202, -42, 65, 83, -46, 54, -56, 115, 1, 130, -172, -92, 108, -81, 1, -38, -121, -45, -16, -17, -149, 120, -98, 88, 11, 131, 75, -24, 175, 134, 0, 52, 109, -75, 21, -235, -200, 17, -261, -50, 82, -101, -42, 34, -49, 6, -50, 71, 23, -20, -54, 184, 35, 219, -163, 29, 180, 48, -211, 52, -84, -180, 58, -133, -95, -17, -79, 147, -32, -211, 62, 95, 16, 70, 72, 17, 152, -178, 77, -133, -64, 111, 9, -204, -41, -184, -104, -16, -91, -27, 25, -29, 123, 44, -4, 147, -53, -132, 220, -19, 25, 75, 0, 51, -94, -36, 35, -3, -129, 30, -154, 62, 94, 141, 122, 122, -37, 29, 136, -22, 187, 126, -19, 25, 37, -74, 14, -175, -23, 56, -110, 114, -37, -101, 61]
3612F1r6K5J1J04K6J83k12r8J07j37J08o3q5J52k76J31Q2Oj3m7j03K86L8j27j8
3637D5j89J39J90r1j49K24k45p5n0O6R0J12j68N6l3L9J54k29N4P4L4j80J79P2
3661A19R1k30k69M62j67M3j8j37K8Lq2J0J45J01j03J4j46J12K2O1l0k2J13k9k3
3686F8N3k3l24J97o5j20K01p2J2m5%J28K5j39R1j17J23J24n4q6O7j40K91j42j22
3711f9P2Q2j66j45J46K8J75k7k04M8j14K86J02j80j19J38N3q2q2P7J94k31p9J08
3735A1Oj6M6p1jM3j56N3L1J19m9j41pK55O9j0j56n7J11j53J15j88L6R9l5p4l8
3762a58L19l34J45q4R3L84l10m9J24k35J39J78k61K05j78J63j45j16N2J46p5m6
3784d3o1P7J25L8o4m9r3J02J11mj17K9j17j8J07j19J62lk55K17p2n5K4M0k2J83
$$ y = [61, -35, -10, 1, 105, 131, 314, 102, 4, 111, -26, 82, 19, -66, 86, -190, -59, 23, 29, 16, -31, -134, 152, 190, 63, 45, -144, -5, 185, 94, -55, 169, -76, -151, -201, -135, -45, 67, -101, -45, -78, -39, 115, -114, -60, 14, 48, -132, 47, 119, 210, -20, -289, 173, 6, 49, 31, -106, -78, -75, -157, -147, -2, 99, -4, 10, -136, -24, -2, 59, 29, 7, 120, 91, 68, 121, 98, -226, -29, -94, -214, -13, -85, -73, -118, -118, 10, 35, -104, -13, -130, -7, 117, 63, -23, 44, -96, 195, 53, -69, 3, 85, -81, -226, -80, -52, 123, 96, -108, -60, -174, 112, 214, 34, -85, 53, 106, 24, -58, 19, 213, -18, -97, 11, 17, 1, 47, -24, -25, 18, -138, -85, -54, 65, 16, -125, -132, 123, 192, 182, 26, -31, 80, -73, 42, -146, -110, -11, -46, -120, -158, 161, -173, -28, -112, -19, 365, 55, 6, 130, -105, 34, 212, -49, 156, -22, 141, -4, -120, -68, 78, 3, -43, -104, -27, 98, 136, 72, 23, -70, 32, 143, 139, 22, 51, -66, -84, 23, -96, 66, 63, -192, 25, -47, -102, -78, -38, -60, 123]
3810A23k39PM3n4L58k16j8R5o7mJ47k71LO6%R7j04K5J13k32J26PQ7M2k6k71K36
3837G3J31j10l7j17J13q2K54k41P8j27m8j22R0N2J31j29M0j15J98K84k77K6J19
3860A84q8O6n7r5O5j06o7K4L0O8m5j94J20J06JM7J8j32Q0m5l7j0j3J11J4k48K04
3887AN8n0J8p5j18K21j47r2K02j64Q3J62j27O8K09l48J20N2K6o2J3L2qj28M8J06
3913A00j49l6O3k0P2j35J31n1l4mO9l4M7J94l83M4J32j7J67j98m5K27j84J6J2
3938a6j51J74k9k40K89m6J77l10K61j07P9j92R3J89j78J24q5j77L2N5RK1%k1Q4
3963C5j3q3L5O7N1k17J32M9Ojk9p8J32p9p6M6j33L8P3J09l8k09J19L6k0p7K25
3990A00Q0j30Q6p9Kj2N6k03J29r5R5k9j72J22P7k22J09J51j80J84j82J48K02k58
$$ y = [123, -116, -109, -66, -120, 238, 22, 4, 99, 32, 28, 175, -96, -93, -27, -27, 70, -34, -9, 104, -128, -2, 5, 92, 134, 108, -163, 73, 204, 94, 57, -60, 53, -29, 225, -16, 62, -65, -113, -235, -145, -93, 38, -91, -51, -166, 32, 316, 39, 65, 184, 96, 162, 105, 10, 75, -31, -98, -74, -44, 24, -21, -215, -95, 11, 12, 59, 77, -55, 25, -20, -57, -67, -80, 31, 45, -203, 1, 59, 9, 27, -48, -166, 55, -92, -184, 18, -146, -63, 99, -28, 40, 249, -99, 21, 73, 99, 37, 50, 82, 74, -54, -6, 100, -49, -85, -22, -42, 30, -105, 26, -25, -59, -63, 6, -28, 19, 213, -170, -126, 6, -11, 156, -42, -87, 140, -44, -28, -16, -167, 7, -22, -262, 27, -19, 158, -152, 109, 2, 81, -111, -18, 171, -7, 117, 32, -145, -113, -58, -49, -28, -28, -49, 35, 22, -61, -26, 41, 92, -125, 7, 56, 62, 61, 32, -46, 86, 7, -69, -23, -156, -118, -45, 64, 26, -183, -64, -28, -48, -125, 100, 180, 50, 136, 57, 59, 47, 103, -100, 29, -66, 29, 0, -172, -50, 27, -195, -86, 65, -115, 69, -113, 35, 237, -21]
4014b1K4j01J86k9J46j97J70j66l9J1k6O0j3j56O6M4l2N4j61J45J07j25P4J61
4038A82k09L1K1j05J00j02J19k3J9j18m8QoO2Q8n9O1J10j40j5n6R2j65K02J17
4063A66j72o5J29j57k4J39j29M0M3k8kJ9O1j7r3M9R0J22j47J9j20J54m0j11L23
4088B49m11J49N2j4j74J62k38K47rm6P9l3N9j9k5L6n6J04m0m1j2j20J09m0N9M4
4114G1j81J06o7J18P0j43p6N4Q3J42k14r4J79k22R7J17m2R4j8j14L0m2o0J04n9
4139f7m7mLM4R1o6m0N3n4LJ89L7r8K0QJ36k98j6J45l7q4K8n1J21j4j21k9J24L3
4168IJ19k1j47M6r2K55j31J22l6k40J28M5K9o6L3j97N2j7L7K03n8j32R5j20J73
4193H9j8r0J04j62q8J25Q3r6J23j00K4K7j72J94m1j22J63j6k8L1K8N2J38k31m5
$$ y = [-21, 3, -98, 88, 59, 205, 8, 178, 12, -27, -16, -42, 18, 5, -151, -85, -41, -73, -19, -180, -35, 72, -53, 21, 182, -27, 4, 25, -80, 20, -82, 37, 14, 33, -85, -133, -125, -131, -69, 19, -40, 21, 131, -9, -24, -80, 12, -153, 49, 166, -6, -71, 58, -99, -123, 16, -113, -73, -30, -58, -60, -41, 20, 3, -90, -41, 49, 171, 24, 43, -77, 77, 37, -74, 249, -162, -13, 39, 25, -149, 13, -225, 22, 13, -33, 46, 13, 72, 53, 28, 64, 8, 112, 72, 31, 19, -101, 8, -32, 27, 71, -110, -4, -71, 47, 117, -26, -102, -48, 35, 177, -37, -131, 48, -174, -77, 40, -2, 92, 74, -40, -10, -52, -112, -8, -67, -114, -118, -115, -71, 20, -46, -86, -33, -87, -84, 105, 142, 44, 64, 72, 208, -90, -106, 39, 2, -82, -54, -105, 16, 2, -119, -148, -24, 9, 128, 107, -40, 6, -86, 169, 38, 160, 124, -116, 12, 57, 86, 20, 53, -144, -92, -109, -72, 131, 73, -59, 36, -84, 89, 71, -19, 85, -77, -165, -40, 43, -53, 70, -30, -6, 21, -151, 43, 2, -120, 43, 27, -1, 30, 58, 110, 248, 17, -28]
4218b8Q5R0j82Q3j12J14k76P7Q7P4p9K12k08K14r5j2m8m6j02J22J61j38N6j4p3
4243c8J15q5j01J04k5l7lJ26L5j89M5L8p8J54jj58L52l45Q0q8L46j48N6k54q8
4268a87K42r8J33j7k32nJ10J88k24J56o2N9j12J14P6j35K70j30j01m7J47k06J37
4291G6N4l33J08J06p1M5n5J69k59J19L6j67J55J66l89J17K03j00m4N2j5q9J92
4314G6j59J34k18m4L28r6r9J48j04K3R3j40J54Q7k19o6L15j61k7n5l0J92k34O3
4338c9L6K9rl9l2M5K7j88J69R8q1J5p6P3j8k6R7j95J75l7p8J01O2k64J41l6K3
4365b7pl8Q2P3m6P3J40rk81M3K0o1K57l06Q7M2o3o7J82r3r8K5J4n6Q1K13j27q6
4393c3L6r7O4p4Q7m4P3m6J44k39K0J9k2J96j01J08j11J53j29j20O6j13L34k15
$$ y = [-28, 57, 147, -35, 48, -64, 50, -226, -149, -62, 12, -67, 145, -63, 151, 56, 44, -4, -50, -152, -30, 131, -7, 49, 35, -38, 77, -8, -109, -5, -30, -67, -70, 56, 91, -98, -53, -15, -93, 61, 60, -98, 254, -91, -11, -99, 247, 99, 155, -99, -187, 55, -43, 90, 73, -159, -164, -54, 134, -90, 66, 4, 63, -49, 65, 141, 6, 276, 146, 45, -2, 145, -61, 76, 130, -203, -95, 11, -60, -15, -70, 99, -160, -41, -5, -172, -17, 149, -240, -123, 80, -20, -64, -12, -27, -116, 76, -83, 51, -167, -211, 117, 21, -78, 70, -34, -11, 82, -58, 96, 183, -36, -102, 213, 52, 25, -30, -60, 132, -102, -39, -3, 26, 17, -22, -54, -9, 18, -170, -1, 97, 16, 31, -45, 28, 10, -16, 81, -114, 61, 24, -54, 47, 109, -155, -14, -50, -27, -34, -72, 10, 83, 37, 110, 250, 241, -40, 3, 23, -38, 219, -87, 0, 42, -21, -88, 94, 1, -97, -72, -58, -114, -33, 180, 53, -33, 3, -94, -30, -104, -17, -61, 12, -34, 110, -129, -109, -90, -112, 84, -17, 91, -20, 133, 4, -116, -50, -163, 171, -44]
4417d4K42j06j16L8R9k0n6L3RR5k13o0o5J0n0J51j01J3J86j61J23k4J31L6q1k27
4443a58J12O4l1l6m0Q7J17k54J34p2M3J36j02K2q4O8Q6N2j26J34K4q9j05M7P4
4468A03j33L8j76J89L3j59J19j87K49j26q8K27k08O8o2J45p1rJ03n6P8p9RL4n8
4493a7J6j62Q8RJ55P9q8q7k0K82j81J12k35J30n2j23J06%N3n0J72l54J95j33o0
4518a65J33O3k1J28j15j05lP7n4O5J04Qj03j5p5M2O0J8k1j99K71k43o1J66J02
4543E7o2n7O3j4J8J05r2J24j76o0J3J45r8n0K83j18R2j77l8O5N4L3j53P2K2k6
4569B5j72J72R6j81j98L08j84J34K3O7k16J21j1j3P1j84K93r4l53J47J15N7K7
4592E0p6J57N0j60j15J09k8o7K9j51K70j70J21Pj27M8po5R0J1M7p4n0J54j26n2
$$ y = [-44, 198, 92, -24, 14, 113, 93, 37, 70, 79, 174, -39, -99, -164, -154, -204, -53, -154, -141, 45, -116, 7, -17, 114, 150, 69, -158, -46, 18, -13, -49, -89, -2, 115, -139, -5, -77, -34, 102, 0, 22, -62, 6, 92, 144, 18, 152, 176, 87, -18, 29, 103, -30, 8, -168, 21, 54, -105, 14, -173, 76, -50, -138, 89, -119, -51, -113, 32, -39, -48, 55, -1, 77, -2, 7, 41, -17, -1, -163, -75, -66, 89, 168, 80, -7, -27, 255, 74, 186, -49, 81, 29, -94, 12, 12, 65, 15, 187, -167, 28, -105, -165, -32, 31, 10, 138, 23, -82, -85, -8, -62, 3, 107, 115, 12, -3, -78, -36, 24, 42, 21, -178, 93, -150, -211, -45, 57, -5, -62, 1, -13, 5, 110, 18, 142, -34, -94, -81, 64, -34, -84, 199, 81, 173, -4, -42, 23, 77, 110, -43, 29, 51, 25, -147, 25, 121, -60, -258, 50, -134, 0, 23, 90, -126, -5, -16, -29, 42, -142, 151, 57, -296, -149, -34, 23, 50, -26, 131, 181, 21, -94, 15, -13, -80, -51, -202, 68, -102, 19, 26, -101, -53, -60, -125, -35, -24, 23, -51, -101, 53, -73, -125]
4618a25K43j64J66lj23ro7q4J85j45J13j10J09O8j18o6K4J15O2n7J75k90J36k2
4642A3N2j28J00j47J40K1j58J70J6p2p1M8p2M3K72k65m7O8M0K01l19J36n4o5J18
4667D0K2m7Jj38K00o6p8J24j81O4nK6k6J77r3Mj09R4j49J56k9p6nJ07j6O7j96
4694a32J68k2r6P1N0r9Q1j44J50K09l36N7O3m2nkJ3J48o9N8j22k2Q0j17j6%N3
4721b3k8p5J34m7j5J32n1m4J05J3j57Kj68J75p5J45k2n4P3p7J23M6j68J04o8j22
4747a42J94O7q1O0j06p0j5O8l0j3j81J85M4P5m7j70J36N5j61M4l6LJ75p4R1Pn5
4774B3k7O4Jpn3j3j0k2K9o0j1J14J9j13J16r4lK07l7j04O1j28K22j74nJ30o9j0
4802D6oO9n0j73K2J01k8J9M7p1j16l8K97j86Q8Q7r9J27k38K05n9j36J23J12o5
$$ y = [-125, 118, -46, 120, 117, -6, -15, -82, -166, 19, -126, -13, -123, -14, 54, -64, -130, -106, 9, 71, 14, 189, -101, 35, 13, 65, -63, 37, -110, 30, 51, -107, 63, 79, 7, -64, -16, -88, -45, 227, -38, -85, -17, 23, 224, -95, 41, -13, -78, 40, 62, 15, 16, -122, 78, 12, -66, 58, -123, -59, -64, -38, -64, 113, 20, 24, -85, 9, -140, 16, -13, -89, -94, 13, -3, 64, -132, 36, 14, -82, -11, 39, -60, 21, -123, 27, 236, -100, -43, 20, -22, -27, -29, -16, 132, 63, 121, -1, -23, 57, -60, -76, -76, -23, -51, -126, 8, -39, -54, 78, 27, -17, 88, 101, -56, -54, -222, -47, -122, 23, 1, -53, 20, -57, 66, 112, -56, 48, -20, -142, 52, 119, 38, 98, -8, -78, -93, -25, -55, -68, -249, -64, -20, 55, 8, -162, -26, 29, -132, -88, -124, -121, 54, -20, 71, 78, 23, -4, 60, 61, 54, 1, -12, -22, -44, -15, -75, -86, 28, 47, -66, 50, -44, -47, 160, 123, 19, 80, -48, 174, 0, -5, 125, 56, 46, 40, 109, 59, -114, -92, 9, -19, 0, 47, -24, -140, -178, 119, -67, 21, 108, 9, 136, -102, 103, 44, -92, 31, 143, 78]
4827G8m1n1M8j48Q2m4K4Lk6Q7j44K47oK7m4m6o0j90K97qPj19JJ64k60oJ61q4k0
4856g1q9R2O3J4P4r9N4j59J66M0j67J37K9j5j17L5k08L15j53K27j37o6P6K8p8
4881io4M9R2Kj21P0o2K5K5o0q1n2Q6J69j78J35p1R2p8j8j37J04J83%N8m5l1J1
4909I4j59N7J26q7q7Q7j39j30K80j99Q1O5M8Q5l1qj07L0%qO1P9Jk26J98j26Q0
4936F5j65J07%Qr1N5k1Q1m9r0J18j01J00l0J06k11J8P2j4P3J5n6L6p3J83r2j10
4963f6o0K01Qj01P5r3M2l5nL9JJ50k14j64K04m3o3J28M9r7j68K85k08J58m6j6
4989c9nK71j97j07J40n6J83r6p0q4r2n2L15q7RK7j9O0j53J3j2L6J18j81J10j01
5015f9J54k83K91j23k3L8o3N6O8r8M5N4q0j05j3k5L00kj92n2J05Q4q6N1J23q1
$$ y = [78, 37, -14, 34, -114, -32, -76, -52, -49, -75, 12, -132, 115, 109, 136, 92, 46, -14, -204, 93, 85, 92, -27, -26, 138, -122, -128, 33, -51, -71, -160, -68, -5, 9, 83, -16, 38, -121, 45, 85, -82, 55, 84, 69, -48, -13, -221, 94, -59, 168, 31, -35, 41, 69, -9, -73, -24, 68, 70, -51, 19, -43, -18, 7, -53, -134, -186, -100, 69, -109, 26, -45, 47, -31, -49, -186, -82, 101, 101, 159, 114, 83, 94, -65, -8, 118, 31, -56, 31, -108, -238, 42, -157, -76, -11, 37, 122, 91, 83, -24, 6, 6, -2, 59, 138, 139, -87, 111, -15, 65, -100, 7, 7, 15, -76, -21, -42, 39, -10, -100, 18, -83, 17, -13, 93, -118, -100, -28, -42, 31, 46, -10, 26, -47, 136, 44, -66, -126, 75, 83, -18, 57, -36, 6, -29, -34, 5, 6, 156, -58, -222, -18, -61, -124, 4, 53, -44, -212, 73, -135, 23, -23, -39, -44, 227, 30, -77, 63, 7, 190, 94, 24, -60, -152, -204, 111, 24, 33, 60, 41, 101, -52, -39, -51, -15, 103, -78, 32, -69, 85, -198, 93, -30, -53, -15, -78, -22, 46, -52, -7, 47, -33, -138, -151, -176, 124, 122, -70, -122, -17, 67, -19, 32, 155, 74]
5041G4k9j0q7O8O6k8OJp2j2J12j57N1J63j42j4J74j32j4l5O6O6j63rM9J69k09
5068d8pPPJk1Q2n0k5Q2k08J01L3P9Q5o3PM9r3J2k3j2M6o5j6L3N0n9J32j16k3K3
5099@MJ24j93M7R3j34n1J40k4j0j1N6j13o4p4K37Q3j27p9Q7q1J93J7o4j02J28
5125H2Ko8J33K8k17L6O4L5j04J1j17m1J61j15J86k2qj22K4N3o3J11j09L0N6L9
5151F5j65J68QPK7r7k1M3r3j18J05N2P9k5j8j11J83j2K1j59J13p2RJ74k76Q8R6
5178G1q2P5j11J10Jk09J24p7P9pM0R1j01Q7n5j08K7M8L0L1j01J77k26p6P9K4J88
5205A29j65P9j6j01J21k09K33K3n7kj51P8l6J97q3l5P0j08k9n6PJ45j72J21m0
5230e7Q3N3k49K15J04j69m0P4j20R6M2l8q1J67o1j90J7L9J78o3j19RJ70k9O5j00
$$ y = [74, 45, 35, -52, 16, 82, 54, 60, 61, -11, -23, 89, -68, -17, 146, 4, -10, 164, 32, 18, -17, 49, 115, -48, -57, -8, 161, -48, -55, -48, -41, -40, -61, 21, -29, -54, 28, -180, -79, -46, 33, 118, 55, 62, 111, 18, 30, 7, -5, 41, -24, -40, -7, 43, -16, 116, 0, -23, 0, 4, 128, -65, -18, 75, -59, -110, 30, 6, -4, -15, 41, -72, -136, -210, 27, 110, -17, -96, -9, -90, 103, 120, 56, -46, 82, 84, 16, 149, 177, -40, -4, 60, 95, -9, 2, -115, -156, 5, -110, 76, 54, 46, -76, -52, 1, -62, 49, -60, -30, 26, 65, -100, 68, 76, 83, 110, 13, -8, 35, -58, -176, -71, -19, 60, 35, 17, -94, 89, 77, 98, -61, 52, -20, -11, 163, -113, -25, 71, -11, 64, -47, 63, 64, -145, -21, -98, -19, -26, 14, 105, 4, 91, 36, -72, -45, 3, 33, 64, -37, 140, -86, -162, -83, -59, 129, -36, 43, 27, -74, 47, -162, 71, 94, 37, 35, -116, -38, -74, 123, 40, 5, 75, -33, -62, -118, -111, 34, -138, -17, -57, 26, 79, -170, 45, 149, -20, -60, 14, -106, -10, 32, -6, -87, 80, 19, -171, -154, -115, 63, 0, -119, -110, 60, 31, 96, -4]
5256dm6j2Q6K3l1K5J5Kmn9K9N1o9Qj36J30N1k2j50J27n5l4J26P9q9O7p8K2o1j28
5286a37Q5R4j4l3O2j62J13L9J66j99p9K2P0p8j4J06J23J6j01q6P9q7J04q0m9N5
5312A5k28J45j15K98k17K18n8r0j6N9Q4J7j23R6k2k10l1J54m6O7O5L6j47J36j00
5337a3r8K07j18p5J97n2r0J65p7o8J21M5k48k3J11O4n2J3j56K40k49J16pl0K73
5362A96j57j37j14K83k2j1J09r3L2k28J38P4j27Q2P0j04M1J4n1K9L4j0J04j39
5386A3lo9kP6M7l4J5O3j94P8J25j13O3p4N6n6j1K6Q5j47K10r0k07O0rl4P7J25
5414G6qP7j33JJ26j31O8j46k7P0j89Q9M1J60N8j57rk1Q7j56J49L1J54l9j59k4
5440a2J27j5j36j00J15Q4q0J40j63oR8m0K9l05K03J0q5J28m8K49j36l5j31L7P3
$$ y = [-4, -50, -62, 24, 47, 16, 41, 56, 58, 54, -5, 24, 75, 6, 14, -122, 8, 59, 37, -113, 14, -41, -75, 51, 130, 41, 108, 30, 52, -9, -137, -52, 42, 28, -5, 57, -105, 8, 47, 213, 14, -65, -43, 27, -51, -65, 41, 164, 180, 79, -7, 72, -15, 89, 9, -40, 15, -213, -68, -183, 115, -102, 116, 58, -32, -48, 11, 95, 112, -11, 85, 63, -147, -178, -24, -70, -3, 62, 98, -49, 87, -13, -111, 96, -22, -97, 100, 48, -42, 123, 46, -22, 99, 144, -104, -127, -16, 48, -4, 9, -147, 93, -156, -40, -47, -77, 196, 39, -98, -212, 71, 49, 38, 147, 54, 86, -142, -4, 70, -57, 25, 95, -9, 32, 46, -5, 24, 58, 48, 152, 13, 10, -59, -61, 15, 62, 28, 43, 106, -88, -10, 115, 2, 65, -9, 47, -9, -20, 6, 91, -56, 154, 64, -143, -83, -92, -126, -49, 76, 68, 145, 12, 13, 139, 8, 76, -70, -97, -27, -216, -127, -86, 74, 132, -25, -34, -55, 32, -124, 25, 56, 210, 171, 12, -12, 115, 100, -36, -136, -21, 63, -17, 123, -40, -46, 52, 12, 41, -264, -61, -51, -136, -8, -56, 193, 57, 22, -109, -72, 1]
5465Aj5L4j92J11J6P1o1j6KJ17n5K7L6j13J16j93LJ72o5m9J6J58j31R7m0j9r3
5492f5J57r9L1J75j59p6Q9p4J76j55J50j12pK1K4k2j32K39j21j41J92j70J6J22
5516E9M1r3J5K6j66J47pl6J2M7o0k2J01j50R0K5K9o5k7J37l19lK82j97J38k7m4
5543f7M0QO8o7P1l7Q3k08J94k1p5Q1n7L1Q2o8r2l6m4J02R8r3o9m0L17l63J65J06
5571A09p6p4j23K79j02j01K10j94K39k28o0K1L0m6J24M7p6J20j44q3K78r3p7k1
5595d1Q9M4q1l7n1M5m7J85j81L3J13j54P6j17K34j8Rn3K0j19J10R5l23K06NO2
5621A04r3k3lk1r6l0K74k36K37m4p8rRnR4j00N3r4J02j11J35k8j8Pq0kQk1O9J22
5651A22j64Q5n3l4j14J1J27K9j64K01n4P4k13K56j47j24O4K2J01j68J54n9J44
$$ y = [1, -14, 20, -172, -61, -45, 26, -35, -51, -49, 68, 13, 40, 76, -37, 79, -114, -111, 61, -4, -53, -37, 121, -10, 87, 47, 28, -65, 92, -7, 24, 199, 40, -36, 53, -21, 155, 0, 150, 38, 31, 52, 76, 54, -78, 161, 40, -101, 91, -79, -63, 59, 100, 7, 22, 48, -118, 29, 22, -14, -2, 45, -15, -37, 64, -86, 4, 29, 58, -7, -34, 103, -216, -219, 63, -134, 4, -23, -67, -27, -19, 49, -18, 53, 16, 99, -109, 85, 64, -11, 70, 13, 44, 126, 58, -34, -70, -114, -12, 86, -7, -76, -116, 201, -162, 3, 109, 33, -41, -164, 115, 13, -88, 122, -72, 167, -61, -121, -100, -70, -116, 8, 55, -21, 99, -45, -128, 150, 57, -20, -41, 48, 92, 11, -26, -77, -32, -79, 106, -75, -42, 71, -83, -7, -124, 110, 92, 101, 48, 68, -51, 59, 154, -169, 37, 42, 104, 11, -12, -15, -36, -132, -162, 112, -124, 113, 69, -9, -18, -9, -14, 80, -20, 33, -61, 41, -70, 65, 37, 19, 26, -54, -56, -48, -69, 0, 122, -42, 43, -10, -44, -158, -147, -20, 9, -155, 46, -8, 66, -147, 109, -38, -162, -98, -76, 25, -143, 11, -48, 96]
5674I6n3j12K7N3r8M8R2k26L64j90n8J38j91J52R6k09N7J16q6j88K68j55qK11
5698A44k57K36q8j3j10nl0J79k1j65K36q6j09J48J5j24q0J01J65m5O5q5j39O0
5722hM5j6R1p7J6n7j13J47J11q7L8M1m5m0J13j89P7j33K9P5q1j11K69q7l7l0J52
5749I3j86O9nJ30j81L9J85j09J8j44p9J75J2Rp6J51q5K2L1ko2j32J36L4q9K16
5775A70j56n8J8j84K55r4R2K8q4j09J17q2p3L01j12j01M5Q0r7L4ql9j02J30N6
5800B7J72k15M3j30M1rm3J55Q7j91N0o7J82j19j72L09k7O0j19J3J0l3j28J53m1
5825Hr0K7L1q3n8K1J30j05J42Mpj6q3R5p0p3O5L0L6J38j62J22j16L3j25J56j28
5852g8L3oK7NR3m8O0p6K0l7k8O3k7j72J78j40n3J77K6n7L8k0JO3j49Q8Q1n9J34
$$ y = [96, 43, -69, -42, 11, -87, -39, 53, -173, 191, 1, -57, 81, -110, 42, 138, -71, -14, 102, 16, -172, 96, -59, -67, 144, -113, 123, 35, 22, -88, -93, -123, 56, 35, -130, 106, 20, -89, 59, 74, -50, -130, -29, 136, 91, 156, 71, -68, -8, 37, 21, 112, 35, 51, -6, -119, 28, 139, 52, 90, 131, 86, 46, 159, -30, 47, -86, -57, 18, -63, -174, 95, 8, -29, -59, 93, -93, -24, -29, 101, -80, -41, 144, 35, 53, -91, -170, 5, 17, 26, -50, 101, 16, 38, 69, 67, 5, -127, 9, 43, -46, 170, 14, -44, -26, -210, 45, -49, 43, 71, -13, -122, -5, -87, -160, 141, 29, -72, -27, 53, -44, -10, -18, -57, -159, -29, 27, 199, -16, 27, -103, -62, -71, -114, 41, 128, -63, -13, -80, 102, -17, -189, 120, 93, 153, 34, 47, 57, 24, -104, 49, 8, -82, -55, -24, -107, -165, -144, -14, -119, 23, 27, 20, 4, -79, 16, -54, -127, -62, -32, 4, 142, -20, 102, -14, 19, -106, 50, -78, -45, -51, -24, -19, 74, 26, 86, 10, 30, -7, -35, 28, 1, -171, 7, -133, -186, -9, 17, -40, -2, -22, -21, 42, -107, -19, 62, 3, 137]
5881A37Q1k01j08J24M9r1j0l6K8Q2P0k25j6J10m1N3k4k9m5J19j25n5L01j91Q0
5906C7j0N2O9j14m8J43L7j40p0j8j66J31Q6M4J50j44o3N3J5qR0J5j72nk0M9m5
5933e2J15L1m2k51Q5J09j37J89p0O2k5k6j34O3J90r7j0l7L2pR9J25j57j23O3J0
5959Er0J51n9K3N0O9j80R9qJ07j77lq1J65l0m7J82j62k9j9Q8P1j24q7N8K9J55
5986A56nj48l2J19j81M7Q5N0o0j16K1J8K1j05O2O4k4K37k43J53l46J62Q4L4J4
6011F7%j12N1M7k23J77Q6r9J2p4M6O8j22O3K91l19J08j43P3RJ73j87J56j65j8
6036c5J49j34K8k7O7j12J37rq0rO5j3n2K04j34J88l77J09jm5M2N2R2o7p0J36j27
6063b3J03Mn1Oj81J41l4J65j17j8j93K17r6J35M1j05Q9j78j05K74n6j12J67N0
$$ y = [137, 218, 17, -91, 33, 82, -9, -19, -55, -27, 55, 125, -100, -116, -6, -47, 6, -18, -47, -92, 27, -98, -153, 148, -43, 37, 27, 79, 148, 34, -14, 129, 166, 26, -44, -62, -228, -97, -11, 33, 183, 39, -24, 29, 44, 36, 126, 141, -31, -36, -56, -7, -52, 63, 94, 52, -199, -114, -5, -142, 47, -23, 39, 14, -12, -146, -83, 107, 10, 0, -37, -5, -12, 87, 212, 55, -68, -5, 5, -85, 66, 7, 30, 80, 149, -31, 68, 60, 167, -10, -13, -94, 71, 41, -6, 176, 14, -15, -34, 54, 125, 1, -86, -28, 1, 156, 151, 3, -29, 90, -91, -44, 41, 91, 31, -85, -64, -46, -25, -130, -68, -4, -28, 209, -34, 119, -227, -65, 19, 53, 67, 67, -45, 6, 53, -170, 7, 93, -6, 6, -68, -22, 46, -76, -13, 278, -41, 67, -76, -3, 6, 179, -8, 148, -17, -35, 114, -20, 8, -19, 48, -64, 73, 64, -16, -25, 40, 27, -25, 179, 45, 233, -144, -35, -36, -81, -39, 13, 105, 38, -32, 104, -23, 80, 84, 33, 39, -142, -1, -35, 130, 13, -5, -198, 19, -77, 58, 99, -6, 83, -95, -200, 74, 18, -94, 73, 123]
6087A23j63J38l2j80K89j82J38p7j63k0o6K72L0M3j25%K52j74m2j41L1J47j08
6110a0k8O1j97J34L4L7k9%J23p4M7j68K22j41j13O3nR6j23J49k87J19K05m0P4
6135A49j27j03J8J79j46J91k39M0M6R3j47n1J58rl2r0k2J16o4Q2j79K26j86MJ14
6160B1o8O7j96Q0K3K6O0J01j24j0O8k8M3q5l7Ol8J47L6l80K47NP9j75M2R1n5K30
6188A76j88j07K13m3J4Q5n1j86J04Q3k00Q6k8q8J02Q9j37R8m2j06J27j19K37j14
6212EnQ5j22J1m7J88p5J6m9K7k32K25j52J33n4J4J50r4n6k5O2R2j72k0R4J00l3
6239F6q1J52k09K24j53MK9R0j78L5l2j65J60q9Q8J02k5j03J16q7M0J00N6p9N5
6264A16n9j47L12k21j2L5m3P5l1m4qO7o9J20j0j05p4J44o7O8n2K8o0J96j58J07
$$ y = [123, -40, 98, 66, -114, 175, -7, 131, 54, -109, -129, -195, 77, 107, 150, 25, 25, 277, 103, 61, -80, -49, 98, -10, -38, 23, -174, -40, -6, 31, 2, 2, 125, 51, 98, -70, 152, 11, -102, -39, -44, 52, -71, 78, -209, -90, 115, 75, 149, 22, -81, -63, 116, -30, 161, -78, -38, 8, 101, -46, -97, 61, 52, 20, -70, -92, 24, -40, 42, -137, 89, -97, -93, 21, -47, 20, -176, -96, -73, -47, 13, 114, -10, -20, 48, 20, 63, -22, -59, -53, -91, 56, 92, -288, -41, -36, 43, -132, -90, 1, -54, 176, -12, -119, 94, 51, 65, 150, 99, -87, 17, 100, -100, -14, -42, -130, -28, 61, -76, 22, -20, -126, 1, -118, 119, 5, 0, 85, -37, -26, -73, 115, 40, 56, 7, 34, -198, 27, -125, 8, -46, -32, 118, 24, -32, -57, 5, 97, -75, -95, -1, 99, 66, -15, 137, -72, 152, -1, 3, 32, 122, -56, -21, -53, -218, -58, -147, -59, 43, 18, -85, 31, -56, -16, 84, 140, 61, 116, 57, -90, 222, 1, -11, 24, -19, 56, 25, -19, -27, 40, -29, 91, 81, -24, -98, 46, -21, 47, -5, 23, -37, 159, 1, 108]
6290A08n2n9P0r3k0k1M8L9J07p5M8r9l5M9Oo8K3o7M1O8j67J50N1j22R4k15K95
6317A04k26M3K9j7J49j03m1L8o9J12J5N1n8r4K61j53Oj12o2RJ58l4j1J10j13J48
6343A40k96L4K32k55K33p0j09P7L1o6lQ2Q5j17M7j75J03r3J05jj7mRM1K0m6J28
6370A15k0Oj14m0P5Q8J3o6p4oM4k7j07Q4J0j7r6J93Q1p4m5M3j62J05%j1P1J54
6398B23j36n8m1K4m9J06J5L9p6k19L26j81J21j93nJ38P5j66L1J56n2rkj30K09
6423A46p6j28O9Or3ML5M4j22K08j70R2n5M1J64k19J0K6qm2J14n8J28k91K41j63
6449i7O3J24j44Qk3K0O6m4l0pKK2N2o4M8j23J22rL1Oj25Q4o6J52j78J08O5j51
6477h8Q7k8J3M0j12K78j68k02nJ62m2L8J40j28j55J87m4j2P1O6n4j35K8j02L84
$$ y = [108, 56, -3, 67, -26, -46, -67, -19, 20, 127, 52, 100, 1, -34, 15, 21, -47, -24, -91, -50, 18, -149, 1, 52, -70, 24, -191, 104, -122, -79, -50, -67, 82, -21, -62, -24, -93, 19, 34, 85, 27, -67, 194, 41, 47, -65, -127, -118, 40, 6, -5, 105, -8, 140, -156, -122, 110, -145, 88, 18, -91, -14, 17, -49, -52, 30, 115, -2, 45, -130, -27, -120, -15, -16, -33, -37, -28, 13, 33, -13, 115, 95, 101, -13, -53, 22, 110, 123, 57, -17, -23, 21, -6, -113, -29, -19, -36, -132, 61, 142, 68, 23, 66, -96, 9, 9, -2, 69, 223, 87, 29, -12, 12, -37, 69, 84, 123, 47, -172, 154, -27, 94, -99, -104, 34, 109, -57, -26, 130, 78, 69, 67, -63, 146, 70, -58, 11, 17, -76, -72, -37, 7, -115, 93, -77, 15, -40, 1, 165, -54, -44, -18, -26, -68, 46, -12, 116, -175, 66, -97, -34, 90, -54, -46, -69, -49, 17, -27, -57, -64, -62, -40, 12, -52, -4, -127, -5, -14, 17, 23, -102, -18, -84, 68, -110, -2, 63, -88, -1, -29, -16, 24, -88, 190, 22, -180, -185, -23, -65, -27, 113, -15, -170, 17, -27, -39, 32, 98, 44, -91, -63, -165, 219]
6502B19k34m5R7j3m9Q2m2J36j60lj06l2L2Q0o8J05j72K06k5n9J8kJ29j44j22K85
6528A13l80L04J17K8j73L8L1l5mK0j20Q5p0kJ63k18L4Q9Pj51J08j02J81j21K3
6553c5J7K4k9O1k4r3M8j06K35n8m9J02p1n3P6m1K2ok6J37K6j6k33J27j63K14m7
6580C9j45K91j45j05rM4p5l6Q2N8o8o8N1K50k18lJ30o0pJ48k31j3lR8r1Q2m7L8
6608a3P9K2M7j12j37J99p3Kr5J55j23K3K06j48k3p9J09j38J12Nk2J55j94J5Oj4
6634c6J4QN2j50J40r7N9k8R3j65J94j16J14Mm0k4Q3p0j43o7K57j56j9Q2J35p7
6660D7K4k9jj57J25q5K75l31n4J50P7j07j5K01j0j03kP5n6J60l82L08n1n0Q6n9
6686C6m4r1J11J05j43O3r6l8J32j50K7P1L7q6qP5l2l0J3JJ99j67Q8j64Q4q0K29
$$ y = [219, -15, -60, 37, 24, -25, 57, 15, 151, -9, -12, -118, -150, -118, -38, -106, -1, -173, 33, 8, -51, -33, -35, 94, -50, -172, 113, -267, 37, 154, 182, 9, 47, 78, 43, 39, 59, -61, 24, -46, -48, 115, -103, -69, 20, 27, -124, -16, -118, 63, -58, -35, -18, 6, -23, 38, 14, -79, -31, -137, 98, 40, -9, 93, 22, -31, 45, 4, 26, 20, -6, 131, 157, 141, -92, 35, -128, 86, 39, -106, 185, 40, -65, -74, -30, -105, -141, -59, -1, -69, -137, -86, 164, -54, -57, 73, 13, 6, 154, -77, -90, -93, 5, -86, -4, -51, -13, 66, 88, 135, 23, -114, 85, 12, 14, -81, 74, -49, -26, 180, 32, 9, -70, 39, -99, 13, 18, -4, 151, -43, -28, -22, -36, -22, -14, 38, -112, 28, -69, -10, -38, 55, -110, 84, -32, 82, 86, 46, 22, 105, 35, -108, -175, 82, -74, -93, -11, 124, 47, 71, 42, 41, -116, 9, -76, 199, -132, -186, -36, 41, -66, -81, 120, 110, 7, 5, 80, 24, 184, -198, 110, 59, 9, 95, 36, -8, -99, 12, 117, -26, 37, -59, -97, 35, -115, -88, -17, 20, -66, -74, 1, -31, -61, -48, -47, 152, -15, 73, -91, -7, -87, 142]
6713A42l52J79j44L7J60p6M2o4o3m3J76N0j50J03R6L2j24L0m7k4Q5j17Q5L3q4
6738c8M1j21P2n9K09k24J29r5R0k1k8J75k04J47M5N4k15K0L0k8j74K56j27J84
6762A18j05J28k7j3K3kl37K27R2j24O4j61J35k9lL5N7K2j14kjJ5r4M4q7j0K1K10
6790H2j9J49k51J30j16qK07Kj89r0Q6J54j64r8J5L7R5ml8Kn6J12r0R3J16k70q
6817a21J80J31l93J67Q8O8L4j53l6J00J10k86Q5R3j16j05K79K1j19j19K31j9p4
6840D6L5Nj88J31k1J11j07k9P4r0J07j80J53k1r1J8j03J24l4N3M4j41J94p2N3
6865G1r2R4n6kJ12j54p2J32K0j23P1J5P8j22j1l6L8lJ53k00O8K1l7J05l5j11K71
6892A95r6j52N2J21n1N0M4k98J9J60R7p6k04J86N2n2p2J90j25K8j02MK00j85J06
$$ y = [142, -210, -31, -175, -138, 22, -54, -12, -76, -139, -182, -6, 44, -106, -3, 93, 125, 1, 31, -16, -40, 45, -72, 13, 46, -38, 3, -118, -46, -105, 104, -120, 9, -86, 4, -17, -45, 130, -74, 73, 118, 172, -43, -23, 7, -21, -195, 61, -66, 118, 13, 141, 114, 101, 124, 122, -215, 12, 104, -20, 44, -117, 18, -11, -14, 21, 78, 100, -14, -16, -17, -2, -96, -52, -139, -149, -128, 82, 63, 212, -39, 91, -25, -33, 174, 176, -13, -103, -17, 137, -27, -125, -110, -73, 22, 18, -20, -18, -74, 38, -52, 41, 157, -113, -121, 59, 190, -203, -36, 52, 120, 154, 1, -35, 65, 175, -111, -26, 67, -49, -154, 125, 146, 27, -92, 139, 120, 46, 81, 86, -102, 29, 8, 119, 12, -17, 57, -33, 74, -106, 47, 26, -65, -47, -150, -26, -60, -7, 37, -104, 90, 18, 71, -21, 73, 17, 15, 127, -27, -99, 33, 53, -70, 1, 16, 94, -28, -39, -75, -37, -40, 113, -87, -19, 2, -35, 70, 35, -76, 195, 99, -53, -1, 120, 69, 119, 163, -135, -116, 44, 141, 65, -139, 47, 99, 47, -25, 165, 40, 68, -34, -30, 170, -15, 91]
6917I1j31j67L26Q9l23J29n3N6o6O3o2J50j54R3l5q6J84q0m2q5J05k47K09Q5j31
6942h2J56N7j96K3Q3Lq5N1kJ15j33k5o3J51j8j32J36K3L2j42J0l9N6j45J21R9
6968E4o8J04j14j28K31M9k03J89j90L8J17n1JrLj5l8J59k59J70P4p5p7jQ9j14
6994f4o0P3L4J53n5o6J4m6qK6K3r0N2J07k6r1j09J85j7Q4m1j79QJ94j12j07J08
7021a0m9RJ68j73j16K33n2L1j01L3K10kj40j85K14k1j25j3J09kj9OL4k63L33j7
7047I2k12P1n3J66k67K20j33R7O5R2r4m9r2J79r2o2J44R1j27K3R6j05j12j9L08
7072B27j72j04LN4m6K9J19q3M4P0O0j95K3p4q1J84Q8j14j49K35j36L7O3j82J09
7097Ij0j40K21j04J60p8j6o3K42l14K00Qj16J2k9P6O9j53J42n9OJ31j05j95R6
$$ y = [91, -40, -207, 119, 208, -115, 14, -39, 17, -49, 14, -48, 102, -52, 41, 6, -80, 104, 24, -18, -103, 2, -245, -36, 49, -82, 74, 131, -65, -42, 41, 44, -41, 10, 8, 123, -10, -35, -98, 53, 35, -97, 39, 62, 94, -48, -38, -77, -21, -166, -45, 54, -14, 90, -24, -152, 79, 128, -75, 114, -76, -38, 79, 28, 29, 20, 23, 8, -30, 129, -130, 40, 114, 39, -38, -39, 50, -64, -124, -51, -17, 136, 81, 15, 29, -17, -25, 1, 24, -66, -14, 93, 67, -24, -133, 52, 35, 119, 78, -101, -93, 101, -11, -118, -10, -59, -50, 118, -55, -171, 62, 10, 41, -60, -27, 183, 181, 41, -144, 70, 49, -76, -89, 20, 18, -1, 5, 39, -224, 109, 92, -120, -49, -102, 64, -203, 17, -116, -19, 46, 138, 44, -5, -97, 82, -10, -72, 72, 163, 36, 59, 155, 50, -62, -81, 227, 55, -49, -46, 8, -38, -9, 110, 27, 71, 141, 201, 6, 29, -45, -126, 58, 146, 32, -117, 118, -18, 19, 82, -100, 9, -1, -141, 80, -24, 136, 58, 42, -21, 221, -93, 107, 115, -1, 11, -18, 58, 127, -26, 116, 57, 63, 194, 89, -106, -10]
7122a0Q1J01k17J31N9j11j61P5M8J0J22k60K87j38j36J72L1p4n3K7J29j65K0j12
7146a44J39Q9%k06QJ06m2L2K6q2Q1Q6n1k57K74K7j05M0j02J50M3Qr6Q0j15P1M
7173F4k4k25J34o7K8mJ16M4j33J64j60K0K5l5N1L1k45P6L3P7R4L5K3j53L5J9L7
7200F0J04j84k3M9r0J14k1M7lk7J51r0q6J59r4j19J24J1o7Pk3R3Q0m3N9k1j02
7227F5q1j89P2J51r3L0j4J56r0K16j59k3J7l6M%q9R3l4j15J72p9Q0K7J3m7j34
7254h7K5r4M9J33J49j48L2j51P3j2n0J98n5p8J35r6K32k88J90j06K9j97J11K3
7278A7j83J43RP4ol3o8J17m2N6j21k8K04m2j2j41o7M8O3L7p3l2O3O4j62J47Om4
7306fL4r2LJ25r7K07o9J15j94l7jl3Q8o9j1J22Qk65J52rm4N3Kl3Kj1J07k7P8j01
$$ y = [-10, 71, 172, -45, 86, 145, 34, -127, -52, -4, 6, 128, -132, 155, 17, -119, 53, 84, 10, -43, -16, 113, -52, -32, -144, -5, 84, 84, -122, -114, -8, -50, -18, 8, -74, 7, 93, 42, -215, 59, 86, -19, 21, -81, 69, 112, 120, 24, 104, -11, 60, 64, 40, -185, -51, -118, -90, -94, 22, 66, -67, 97, -63, -43, -18, -53, -2, 29, -216, -140, -107, -30, 64, 99, 122, -31, 4, 23, 60, 164, -20, -43, 6, -84, 30, 9, 56, 53, 26, 177, 87, 1, 160, 66, -53, 71, 82, 15, 22, -1, 92, 172, 129, 188, 167, 65, -16, -205, -133, 18, -75, -45, -59, 97, 7, 223, 64, 41, 58, 22, 26, 26, -63, 30, -4, -119, 53, -26, 54, 81, 94, 47, -87, -62, -156, -107, 26, 175, 27, 59, -92, -19, -31, -81, 117, 62, -16, 119, 23, 255, -33, 157, 51, 80, -117, -6, 17, -166, -23, -14, 60, 54, 21, -47, 70, 28, 84, -37, -65, 139, 97, 85, -56, -123, -75, -12, 25, -48, -80, -17, 47, -115, 32, 38, -6, 28, -64, -61, 64, -33, 174, 105, 220, 26, -11, -12, -45, 43, -26, -37, 85, 93, -172, -20, -29, -73, -20, -18, -51, -49, -60, 47, 20, 98, -3]
7336cl5Q7M3j18N9J77j76k21J35n9O0N0n6j6J80j15k6J82k9p7K8Lrq9m0P8j15
7363a02N9o8J0R6o7l2J40K4m2j62K2J34l3M1J17k38N0ONJ62J8k8o2k6k1l2Q7j8
7391D0J5p4p2RJ36j15N0k6o3R1l3P3k9l6M4P3k6j97kL2J19j40J74j00R8L2j62
7418h9J67j14j5K9j1j9k7K6M0k8j1N0kr8K01j23q2J09k5J31l0M4p2q8N2j08K22
7445A29j71J3o7J63J11k62K9l0K08l8j6j82K0J96N5j02Q9j77K42j21J8o2j0j59
7469a24L4RJ86l4rj30O2k3N4N1j35r8J55jP2k61J91m1J2J04k67J45J92l6p9K8
7495E7K6k93J84o3K56j70K7m2r6N6J52j33J37j40l4J19N8j54j22K05rj30J58j75
7519a26J67J6j42J07r9Q3j7k6J38j66L2L6Rn2P1J26j80j28J67j4j28l9K57k70
$$ y = [-3, -38, 49, 92, -26, 33, 210, 34, -187, -52, -111, -51, -1, -57, -73, 107, -8, -34, 148, 119, 42, 70, 73, 64, -25, -65, 13, -102, -43, -111, -101, -5, -72, -104, 36, 60, 18, -144, -122, 12, -21, 20, 137, -101, -51, -45, -40, 122, 140, 112, 50, 24, 3, -29, 58, 40, 55, -19, -91, -82, 54, -61, -11, -37, -100, -9, -42, 31, 2, -34, 10, 83, 57, -140, -142, -110, 9, -131, 43, -57, 41, 73, -89, 78, -36, -51, -22, -33, -52, -79, -53, -13, -41, -52, -2, -4, -102, 99, -24, -106, 3, -22, 109, 79, 123, 51, -37, 15, -93, 129, -42, -29, -96, 67, 178, -84, -55, -85, 123, 85, 69, -113, -93, 103, 158, 56, 145, -32, 210, 89, 107, 45, 35, -124, -90, -81, 105, 71, 62, -68, -6, -29, 25, 76, -59, -157, -2, -3, 69, -192, -1, -42, -30, 74, -193, -48, 144, 108, 29, 57, 83, -210, -26, -89, 167, -3, 24, -18, -114, -58, 94, -39, 98, -42, -76, 43, 101, -53, -175, 30, 21, -109, 49, -126, 41, 57, -85, 22, -77, 6, -11, -37, 101, -65, -33, 3, 12, -40, 31, 157, -23, -151, 16, 2, -126, -165, 92, -178]
7543a78J73p8M6L6J55k59L7Q6k2K3l3Q6k17L05j57N6p4O0j40mJ32qj29J91m9L1
7569F9k7nO2j01k9J04j30rJ10j50J78n4q4R1M4q8j55P0M7J03j34PL2j65J66pK40
7596A85j34k8m8P5o6K7p5P9p8K1N3j90J46K16j60M4j64J2J5q4M0J07j90J79N6
7621C8P4N2k25J64Jnj00l8j5J12j17L3K9j34P0K06o4Nj07M0j3J5j6r6Q5pJ09j17
7649b1R0rq9L1J62k38J67k86J47J10j3O0o9r7O1R5j49nJ46j03M6k7j43J13k1q0
7675a22j53K06R6j5p3J89j04J11k11K9J4J3JJ7N2J63k69J26O0p2m3lK24j97m7
7700hM1l7k3K02k83J78p5oK6j05J66j11j0NJ46j65o3J81lq8J6L5j06n2J54Nl4
7727a4p5R3j60K82j43R3j3n1j2n2J06j94J39P7l8K5n7R1M8k81J50n1Q5o4K03j79
$$ y = [-178, -5, -83, -37, -1, 154, -105, -68, 18, -4, 19, -14, 72, -145, 160, 3, 59, -15, 45, -95, -99, 33, 25, -104, 87, 38, 69, 42, 37, 99, -2, -31, 73, -57, -66, 44, -106, 72, 18, -66, 25, 69, -19, -174, -104, -57, 46, -88, -81, -49, -214, -48, -55, 185, 51, 23, -25, 50, -16, 11, -64, 15, -63, -42, 11, -179, -33, 183, 23, 67, -97, -85, -70, -154, -114, -7, -197, -18, 38, 112, 164, -61, 103, 104, 99, -1, -39, -54, 58, -59, -26, 3, -131, -61, 145, 81, 86, -21, 19, 6, 21, 5, -91, -6, -13, 96, -21, 69, 60, -29, 2, 164, -74, 93, -193, -46, 64, 51, 111, 42, -55, 6, 101, -48, -53, 93, -10, 36, 9, -134, -21, -42, -122, -275, -69, 27, 12, -61, 128, 24, 135, -76, -47, -33, -20, -19, -2, 50, 213, -56, 70, 130, 58, 15, 12, 236, 39, -8, 33, -4, -27, 175, -108, 70, -5, -11, 15, -90, 76, -35, -45, -40, 106, -59, -122, 59, 56, -32, -16, 19, -87, -139, 15, 20, -14, -89, 4, -156, 126, -17, 76, 63, 12, 0, -52, 54, -140, -1, 76, 38, 63, 6, 97, 145, -136, 14, -37, 48, -16, 187, 8]
7753HO8N9p0p3j08Q4l1J3j04K86j90P0q1M2O4j25o7J12k2P1J29j69n2M7Q1l9p6
7780g3LK15r6j07M8QN5q3o4K18n7j95J24p8O8J07r7L3j6k7J34j27J28O2r2o5j57
7807a31J41J35j4j26k9J87q5m8Pj67K42j02R8j57R5N3j26j27J71%K2j9qq8K54
7832A78q1k53J29Q1q6r3J30J00k41J51J06j13J7m7j50M3J30K9j65J10q7n7J20
7855d9j9j09K16p3J38j63K59j21m9K4m6j2Rn7o0K50N3j24l1K4o1M6j27K00j94
7880g6J86k23P2L7K2n7L2J54k24J37j25J31j49J87Mk41O4J24p0Q7j50k9P3mn5
7905i3J33j18J9M0q0J89O9j46N0r2r5J75o5k2J21j36J19j24p9jK43j56o5J19q5
7930h0r8L52j56o1J5j08J65k9o4P5q4j8n8K15K5k44K79n8j36n6P7mP9M1pj09J27
$$ y = [8, 76, 135, 65, -8, -116, -32, -63, -50, -154, 132, -58, 12, -69, -27, 37, -88, -155, -43, -65, 6, 135, -34, -86, -39, 42, 3, -73, -70, 145, 49, -58, -10, -2, 53, -30, -94, 124, 67, -128, -4, -82, -14, 93, -4, 29, 13, -14, 120, -7, 121, 183, 91, 26, -131, 10, 145, 131, 5, -24, 163, 78, 30, 37, -130, 112, 10, 108, -49, 46, 99, -27, -154, 17, 17, 39, 20, 12, -76, 178, 97, -156, -27, 54, -32, -125, 5, 105, -136, 15, 121, 8, 25, -22, -172, -129, 1, 30, -135, -25, -112, -169, -49, -68, -177, 39, -34, 104, -59, 200, 79, 30, 54, 8, -4, 5, -52, -112, 138, 191, 67, 36, 60, -1, 45, -82, 118, -76, 110, -113, -41, -4, 18, -39, -7, 147, -77, 60, -65, 66, -83, 104, 108, -133, -69, 55, -15, 72, -78, -107, -34, -38, -93, 40, -78, -59, -19, -99, 90, 159, 13, 63, -29, -124, 51, -14, -36, 85, -51, 68, -56, -135, -136, 107, -49, -114, 5, -80, -178, 174, 18, -43, -28, -136, 29, 0, -64, 11, -73, -91, -149, 66, 91, -153, 126, 68, -68, -124, -47, -51, 28, 69, 62, -47, 80]
7957H0k36J03J05o5p7K0J22J1j28L4R7m1J50j66R4j64q6J60J6n0l6Q7J6R7m6j51
7983e4J12j34J54q5Q8m5k0L8j61K09j42M8J1J45k25O2R1K5q0r7J28j20J35p1j4
8008bj8lk8J29n4j75J34J77N1j68k15K49l5O9l04K67j28k18N26k52L7o2j19P9
8032f3O0RJ06j10J87k17J06j60J05q1J20q9l7P2j67K53j63K43j11O8k36P3J8j07
8056a21J07j11k3L8R2P4M2j24P2j21K34k12j81J79Q7qj37J28j6K5j43N4J43j12
8080c4J58k08R0R3j82N4K45l70J12J60n8n0O7j36J16jj28k7N2o9J40j2q3J17l35
8105b89L59r5m8O6O6l0k2j22Q7j17J84m4r3j2J83k95J67Q2M6j16oJ84j82kQ7O8
8131A06j81P7J41j28m7j17P5Q7M4j45J54j31O0N5L3j24p9J70q8qJ13j87J53L5
$$ y = [80, -156, -53, 52, -13, -90, -70, 52, 63, -65, -31, 66, 25, 175, 9, 103, -61, -147, 13, 29, -21, -57, 30, 46, 143, 97, -54, 58, -76, 78, -7, 81, 36, 16, 54, -107, 102, -40, 8, 19, 164, -61, 1, 92, 117, 37, -60, 68, -52, 83, 12, -2, -20, -23, -51, 78, 24, -151, -17, 160, 211, 43, -172, 77, 42, 111, -193, 74, -54, -272, 254, 2, 39, -23, -142, -63, -3, 6, 112, 2, 189, -28, 78, -82, 23, -58, 62, -27, -64, 8, -159, 94, -69, 174, 63, 131, -105, -32, -14, -121, -14, -125, -148, -110, -18, 56, 98, -26, 46, -75, 159, -53, -234, -55, 32, 24, -113, 15, -1, 24, -119, -65, 78, -34, 124, -84, 6, 99, -83, -29, 216, -154, -42, 118, 60, 10, 77, -59, 57, 56, -72, -99, -47, -116, 24, 12, -71, 46, -289, 70, -25, -73, -7, 59, 29, 7, -115, -28, -145, 39, -5, -98, -110, 73, -222, -55, 27, 73, -43, -49, 135, -47, -49, 38, 106, -75, 2, 143, 15, -32, -149, -74, 13, 57, -88, 66, -65, -5, 50, 83, -41, -120, 50, -38, -46, 67, -120, 33, 68]
8155F8ok3o5p0J75j04j7Q8J8n2l9P6j5j5j70K10q1P6O8r6n2J14j17K8L9p8Q7j40
8183i3J2Q4p1O4j09R3O3l8
$$ y = [68, 62, 39, -26, -96, 79, -25, -42, 46, 64, 12, -27, 49, 34, 19, -151, 59, -22, 54, 122, 26, -26, 88, -29, -1, 38, -40, 47, -93, -81, 3, -68, -4, -113, -20, 43, 5]
8191E
$$ Imaginary data points
##PAGE= N=2
##DATA TABLE= (X++(I..I)), XYDATA
0@%%%%%%%%%qJ6j6J6j6K4l2M0m8N6p2Q8j04J26j50J76k08K40k79L25l73M23m80
32b56N50o27P07p96Q94j002J124j255J395j554J728j912K116k338K580k848L140
49A646l458L810m199M627n104N637o233O910p688Q587r641J0895j2419J4324j6778
64i084K0073k4763L2026m4895P4500k69794n8853N17735P0182k00813k24307P6373
76d1620R7899l6008j04942O2819Q6174o1707j83690M1470L03889K03638k17090
87A50832l84693j14849K68265K64027k8634j79102m2764P6162J9531p3427J5660
98b8992J26386J2198j99818j55570J39533L14162R0552k51025k63986K5825K11160
109B0425J04724q2265p5407L4535J3414p5353k3679J29466J33791r4399k52771
$$ y = [0, 0, 0, 0, 0, 0, 0, 0, 0, 0, -8, 8, -8, 8, -8, 16, -16, 24, -24, 32, -40, 48, -56, 70, -80, 96, -112, 128, -151, 174, -199, 224, -256, 294, -333, 374, -422, 472, -530, 594, -661, 734, -820, 908, -1004, 1112, -1226, 1354, -1494, 1646, -1812, 1998, -2201, 2426, -2678, 2959, -3274, 3636, -4052, 4535, -5106, 5789, -6630, 7694, -9084, 10989, -13774, 18252, -26643, 47857, -221937, -280790, 236945, 307127, 106314, -117993, -41620, 56279, 20271, -84671, -21852, 64322, 2615, -181075, -139605, 164284, 367922, 150832, -233861, -348710, -80445, 183582, 154948, -24154, -66918, 9244, 28775, -44652, -28992, 97394, 109592, -90226, -245796, -106263, 207899, 298451, 47426, -216560, -190735, 20425, 125149, 42884, -32523, 2012, 15426, -59927, -83606, 45860, 179651, 85252, -167519]
120a67519p3975K20715K41617k7884k34074j24489R7375J19985n999m9086K1096
131A7762L5055p4354j07279N7034J91336P0680j73401k15681K5176K27458J27218
142A81004r9184j53501j6168Q5858K5490l9169K1355P1159j8602j33389p5496
153a50643J26285J86483j0544j99441j33819Q8897J77108L4425j06727o6980L1433
164b3523K9510l1696j1239Q2309O5482q5257j48378p098J65269J32232p7464j77849
176h7702m6287J11286R9781k2159o9003j537K7252l2151m3536M3848J04595J8424
188A02811j26785j12818N9953J54438N3087j03090j14254J5285Q5371K7041k9998
199A1041j0800K2650j2419o6307j6086R0079Q5830m0677j28162n2082R4508J09828
$$ y = [-167519, -241494, -20779, 220838, 192954, -41120, -165609, -68234, 51751, 45752, -3334, 17762, 52817, -21537, -128816, -71782, 119554, 190234, 16833, -198848, -173672, 53786, 181004, 81820, -71681, -87849, -1991, 23499, -15670, 5685, 76844, 58242, -75147, -150643, -24358, 162125, 151581, -47860, -181679, -92782, 84326, 118751, 12024, -54956, -23523, 5987, -25709, -36948, 45361, 110843, 25586, -122792, -129890, 35379, 167611, 90147, -87702, -133989, -22703, 77078, 54919, -14084, -15621, 11631, -20520, -64056, -20208, 84387, 102811, -23974, -136792, -76839, 77599, 130686, 27596, -86658, -71373, 13998, 41039, 11041, 241, 22891, 10472, -55835, -71921, 18158, 103988, 63311, -64851, -116933, -22425, 87403]
211H7403r540q9018m6945L3269L8497r923n644L3715J0768n6969o4704K7512J06586
224E5007M3611q1922r8973M441R1695N6097l8909n3566L75K0467m982j3028K7672
237G985M7511j7453p9782l6134O1291Q7259k0q7909n4852L7033O1305J1103l3345
250C992j5613J4519n854k6447P673M9329L0910m2403p2595j853P2081N1002k7568
263C7173o5065j8406L8219K7429q665j0429O249L190k5067k4023K7751N2103N252
276D5711n1648m7176J9394O0263J9445l4002l3934J475K1839M910r009R286J2915
289A9469j3881l1194q185L5573L8079j3946m5459j8441K5487L5282J424k4629
301d21r512O291J990l222L017J6531O001k3628k4184Q177L0567J7267j9773l0244
$$ y = [87403, 77863, -11155, -58100, -24831, 13666, 3743, -1901, 31814, 42582, -14387, -79091, -51579, 55007, 98618, 16696, -82277, -77836, 13859, 69956, 31047, -22519, -22144, -1677, -6659, -19687, 7985, 55496, 38043, -41739, -77873, -16582, 70677, 70657, -17252, -72104, -35071, 26234, 37337, 3992, -11621, 2898, -2956, -29403, -21730, 27599, 58509, 16106, -56489, -58342, 13739, 64741, 37173, -27892, -46298, -8079, 19350, 10685, 256, 6505, 9695, -15372, -39395, -11644, 40459, 45711, -5937, -53113, -33719, 26544, 45989, 11987, -21947, -20472, 1367, 6277, -2732, 6554, 19469, 5588, -25606, -33791, 1782, 39861, 25915, -19544, -37985, -12498, 22784, 24208, -421, -9933, -3642, -1652, -4874, -1857, 14674, 20675, -2953, -27137, -18960, 11607, 28874, 9101, -21143]
315b1143k04K0489J2510l289r870J19K450q015j640J2388J2781k972k1393j2892
329b0681J5438J9846R13j5254j3718M728J1138L59k255N95L74k358p162Q44J3306
344F113O094p840j1539l011J1306R537m940p265k977K088M076j427j123K719j464
359C47l894p14J431O106J048n221k170J071L108L654k783k805P84m55J974J087
375B568l219l56K92k68K154j720k299J636L78R29O48j785J413J255k946P81K309
392A770J762M57o010l015N718M144m61n534n842M203N175j388j447q08P39N61
408B4l940J136P668K178n310p829j166J1186O566o736p568k177M668N093l351
423D42j804K888j342m305l111M349J1305N9j2283o737N362J2092M469r922p128
$$ y = [-21143, -21347, -858, 11652, 8363, -1507, -1388, 1062, -6953, -8593, 3795, 16576, 13604, -7789, -20681, -5243, 14603, 15516, 262, -13456, -8728, 2410, 2769, 514, 1109, 1483, -875, -8037, -7193, 6113, 12207, 4367, -7172, -10183, 1123, 10660, 5720, -1545, -4522, -2434, 1642, 215, -908, 1811, 347, -3547, -4261, -2830, 3276, 4324, -897, -3067, -1996, 1112, 4766, 1983, -822, -38, -493, 1481, 2568, -651, -1007, -715, -983, 1171, -549, -2848, -1212, -834, 95, 743, -1042, 371, 1626, -1320, -539, 1770, 3532, 3989, -2021, -5036, 682, 4826, 4365, -1169, -7011, -2808, 2367, 979, -468, -1276, -537, 24, -3916, -2780, 4888, 7066, 1756, -6073, -7239, 3947, 10513, 3777, -3791, -5968, -1300, 3793, 442, -1362, 1526, 184, -4121, -7232, -2883, 8422, 8481, -3802, -10539, -5177, 6915, 11384, 1462, -5666]
438e666L116L810Q60k151Q30M716m526r961L48J0069R371m496j5152l439J1134
453a137R043q86q391l704N732Q65l402K413N188J721q504j0596N069J3897L781
468A1089r290j2664M33J2390M525m562l675k35K384j976k787O690P436l889j0491
483d622o041Q243J3536j736j1844o274L247Q234J044n367Q30J972l177l291N72
498d674Q841O352q237j0454R78R206Q382m313j0186o67M161K091m77j725K104
513A382J195o776l392N531P395K120q546p892M961Q339K112l589n666Q82L546
528A602j413m69K195J022j620n675k154P156M597k700n610l717M841N648j199
543B504k394j018L74J692j206J13L065m04k861j993m27M243K033m198k256j96
$$ y = [-5666, -2550, 1260, 2120, -31, 799, 5515, 989, -8972, -8624, 1445, 10816, 6320, -8832, -12271, -1137, 7906, 7020, -1371, -5075, 657, 1522, -1880, 533, 5721, 7442, -1062, -11658, -6589, 7308, 11089, 1799, -10865, -10432, 1958, 6483, 1921, -1754, -1989, 395, -1581, -4368, 2322, 9758, 5869, -4622, -10663, -2420, 11116, 9380, -2464, -8738, -5491, 2743, 3787, -1580, -750, 1222, -1955, -5246, -4674, 4167, 10519, 2282, -8172, -7194, 2012, 10394, 6081, -4105, -4772, -611, 1480, 1003, -722, 1382, 2577, -4199, -7591, -2060, 5335, 7455, -1091, -8983, -4022, 4317, 6429, 2840, -2826, -1944, 1602, 189, -280, 1915, 2937, 1317, -4358, -6512, 644, 5241, 2541, -3069, -6786, -1945, 3703, 2504, 110, -908, -534, 1158, -48, 65, 3130, 2726, -135, -2128, -2555, 1688, 3721, -477, -2733, -2929]
559b929J626L037j365k067R91j10J099J126j207P52J79j458J257J77n47R56k151
576f34q77J632l67R53k98l277J12K456J690J134l553k608L087K413R33o99l038
593i41O53R92j250J304J504j37k109n126N17O639K816l210n754k781N964N426
609D507j989k335j117L26O24k033K714N944j668p554n523L535J1240K316r510
624e23p438J181P485M408m107k324K174j598l456J79O847Q401n371j4007l059
639a1208J0829J2346j688j4256o235O738O394K06l559K71L346n624p475M841J2941
654G867N903j1404j6349K467J7154Q731p404j3103k069Q789K108l667J879M453
668E355j147j1313p807J2086J7500j464j7964j2992Q974J8881K528j1199o844
$$ y = [-2929, -1303, 1734, 369, -1698, -707, -817, 282, 1408, 201, 953, 1132, -326, 931, 1108, 561, 1517, -634, -1511, 121, -246, 707, 409, -2868, -2756, -300, 1390, 2524, -1029, -3637, -550, 1863, 2796, 2097, -941, -288, 704, -546, 758, 2262, 2125, 16, -5110, -4593, 2046, 4862, 1652, -4102, -6883, -919, 4507, 2518, 183, -934, -608, 16, -2017, 697, 6641, 4973, -2581, -8104, -4569, 6671, 8987, -523, -7961, -6780, 705, 5113, 1006, -1318, 856, -742, -4198, -4019, 2828, 11229, 5858, -8149, -11208, -379, 11967, 10279, -3977, -10212, -3474, 2920, 3126, -433, -162, 3184, -2440, -9915, -5074, 7867, 13770, 2366, -13983, -11516, 5638, 14369, 6965, -6138, -8207, 582, 2690, -977, 902, 5355, 4208, -7105, -14912, -2826, 14674, 13210, -4754, -17746, -8772, 10109, 12637, 1438, -5406]
681e406K163M249k196j638R189N663j0921j5446o71J9081J5676j1138k1032m099
695a6526J3580J3173k748r487N25K483m569l690O395J4558J391k0431j4958J0692
709i612K2451O858j7506j7958M683J3500L410m422k118M868k547j3041j089J8049
723E526J5195q615k5475r208K0836K1063l769j9192r711Q821Q326m149j132P730
737F246K451j2346j5665O721K6445J0286k0159k4300Q58K5038J4466j1717j4444
750f120l88O296N3m726O238J2979m806k1780j1039J6887K7267N79k6992j6999
764b2551J0673K0748N480j1836o418M525j347p134J473J5472J1330j4829k6379
777b0793p72K5351J9899r466k5902p834J5263J1526j581m980K057J650j0864r503
$$ y = [-5406, -3243, 1006, -1190, -2828, 6361, 12024, 1103, -14343, -15014, 4067, 19743, 8605, -12427, -16526, -2946, 10227, 7479, -2008, -1483, 1000, -3569, -7259, -864, 13694, 15085, -5346, -20304, -9612, 12839, 19697, 2191, -15767, -11084, 2416, 5826, 1404, -714, 4154, 1607, -11434, -12523, 5526, 20721, 12106, -13369, -22577, -1741, 19322, 15553, -3639, -13350, -4529, 3797, -352, -1484, 6246, 8697, -3649, -19314, -12593, 13852, 24138, 3979, -20321, -19463, 5575, 20041, 8324, -6120, -6508, -212, -159, -4885, 1353, 14332, 9526, -12254, -23293, -6406, 20861, 21440, -5552, -22551, -11878, 8870, 14350, 2514, -3904, 621, -726, -7860, -6387, 9085, 20415, 5586, -20793, -21565, 3786, 23685, 14219, -11683, -19517, -4254, 7272, 5691, 711, 2768, 4418, -6446, -15949]
791a5949J2888K1926J988k3548k2176R773K7776Q546j5849j7171L09J1297J907
804A717l319N698O002p826j6990m065K1985K1598r184k7156j1567J6778K2331
817A6002r73j5867o056L957J787l568J897J3252M203j8081j8392O345K6366J4151
831B5023j7896k4468K15J8268J1680n287r361J832J559p839l661J1296J5717k903
845A4175k4382j4011J6036K4049L210j9435j6050O579J3473J830l770N79L543
858E826n349j2804J571J9253J1877j1741k3407n774K0218J7161n744j5589o448
871a0950O790N855l066J836P563p82j2491j0699Q929K1399M761j8622j6785L805
885a2457J7955Q166r304q735J214J700k315j011P730R439p350j7419l456J5157
$$ y = [-15949, -3061, 18865, 20853, -2695, -24871, -15098, 12678, 21224, 5375, -11796, -11487, -190, 1717, -1602, 4096, 10098, 2272, -14718, -18783, 3202, 24800, 15616, -11540, -23107, -6329, 16002, 15029, -838, -6894, -2937, -1150, -4718, -2821, 10431, 14634, -3447, -21839, -15494, 10872, 25023, 7127, -17341, -17126, 1142, 12822, 7535, -1826, 6, 1565, -6274, -9935, 1361, 17078, 14175, -10207, -24218, -8182, 15867, 19077, -358, -16408, -9829, 3644, 5474, 1704, 2283, 5826, 477, -12327, -10756, 8497, 20374, 8633, -14774, -20548, -330, 16831, 11087, -4502, -10950, -4160, 1695, -1371, 465, 8028, 7246, -5245, -15944, -7015, 14384, 19145, 523, -16262, -12457, 5498, 13664, 4360, -4375, -3161, -1461, -3776, -4787, 2943, 12382, 5032, -12387, -15843, -686]
899f86J6906k911j8942p991R212J0589J259o221j619K630m634o148M798J1801
913H043M704j2397j5893L533J7059Q807p818j3662j515R095L882k028l3K057q07
928C027q245m626R916J2045k357j4090r993P628J4610J277r203o141J673M867
942C88m01j338N066K611o006p979j31J1759Q565p266j2129k373P927Q277k401
957D569o570n00J498q54j010J832O180O28q877n495M847R568L618p963p844K085
973d288O036K192j746k871J102l12l856M00M624L995k236q033k550O790O093p85
989D555n098l673K813L443r34n6P06k93j672l544J318N597J233m193m623l47N329
1006E61K886k498k220n72J148J460r09N62K348j302k449j126J470L755j46l893
$$ y = [-686, 16220, 13309, -5633, -13624, -4412, 6177, 7436, 1215, -404, 2226, -2408, -8556, -3758, 8043, 12747, 350, -15543, -12010, 5049, 13856, 6038, -7624, -9139, -44, 3838, 1810, 1777, 3834, 3027, -5218, -9844, 72, 12117, 9760, -4330, -14323, -6695, 7915, 9192, -11, -6152, -4479, 388, -13, -1351, 3715, 6326, 320, -7659, -7790, 3969, 12534, 5268, -6861, -9234, -1307, 6970, 4569, -2001, -2501, -1003, -1857, -2867, -1035, 5145, 5773, -3104, -8599, -3752, 5816, 9434, 1471, -6373, -4288, 1748, 3940, 2194, -677, 425, 113, -3743, -3343, 1281, 5276, 3040, -4993, -7543, -753, 5340, 4555, -543, -4216, -1403, 2040, 1106, 1050, 1756, 1463, -209, -3753, -2435, 3162, 4395, 202, -4421, -4768, 561, 3447, 949, -1271, -1843, -695, 765, -144, 418, 2766, 1464, -985, -2111, -641, 3114, 2968, -925]
1022i25j397N70K167J082j876o24P14p24K26N72L06J635j001j801P31Q61R26J12
1040A554j679l63M85l26N13p1o76O08p42l22R45n18K53P68o82N03j15r46J455
1059F44M14n59K52p20j84Q04p75m2J069j010m83j106M4K556M57j517j005l96J671
1078A14J494j055q6L13q94k38j80J170K386j690l328p00J623K968N03l712j039
1095b351J247Q63O94k70M42J167k510j987J949L075K121k947n123P24L749K328
1111C171j187l315q27J692m04m46J602J618j55l719k980M101N494nm638m423J831
1128b590N375O76k534j400l27N67j298p16L939K296l392m719j746N738N837k385
1144C321n363j988K214M232P6k076N45R7k342j470J212N104J770o234n103J456
$$ y = [-925, -2322, -1752, 415, 1497, -379, -1003, -289, -1013, -787, -215, 91, 1726, 725, -1076, -345, 516, 1442, 1554, -125, -488, -3, -329, 184, 113, -563, 45, -697, -1019, -74, -592, -339, 429, -253, 250, 135, -811, 644, 1058, 499, 751, 31, -153, 651, -124, -166, 903, -107, -590, -1696, -1652, 904, 1361, -156, -1161, -1557, 114, 1608, 553, 467, 780, -114, -352, -532, 638, 3024, 1334, -1994, -2694, -1071, 1897, 2400, -1312, -2351, -1104, -241, 453, 183, 625, 1792, -718, -2705, -756, 2319, 4440, 1493, -3630, -2906, 843, 3171, 1984, -1331, -2158, -466, -870, -1316, 286, 1904, 1749, -1970, -4950, -849, 4645, 4640, 2, -4421, -2590, 2785, 3461, 927, -473, -800, -233, -1531, -2247, 1692, 3988, 596, -4123, -5869, -131, 5706, 3321, -2042, -4030, -1816, 2416, 2492, 416, 961, 1058, -1284, -2754, -1542, 3562, 5332, -902, -6005, -4549]
1160d549O083L857l587n353P27K220J293j16J90J801p38m943p11M357M990p39
1176D782p016m162M248N109O09l218l101J096J319j187P73L111R16k900n201O73
1192d149P172L268l268o094j898M869L759j847j987n12J61p49j771K334M897r32
1208C253n343l851K835P338J601n699l633P27L907J505k162k16J253j689k831
1223c005j48L796M544k916o785j137M679N147k22n458j660K515J593J72n00R72
1239A587J044l285l566K665M687J669l997n943P43N296K519k055l016o21K059
1254b14j22p42K297J562j067l542k246L961M890j162m269l284J828M233n1k292
1270b20m38k10q1n52j8L311J427l283l023r4M456L365k409m089k81J805K039k75
$$ y = [-4549, 1534, 5391, 1804, -3549, -2822, -602, 691, 575, 765, 2566, 1828, -3115, -3826, 531, 5521, 4782, -2234, -6396, -2148, 2961, 3570, 352, -2749, -1653, -334, -1521, -748, 2363, 3279, 379, -4822, -4149, 3023, 6291, 3023, -3071, -4969, -100, 3659, 1812, -175, -687, -526, -1275, -3046, -712, 4185, 3253, -2090, -5941, -3106, 4232, 5833, 134, -3499, -2772, 1135, 2640, 478, 262, 1515, -174, -3005, -3153, 643, 5187, 2271, -4514, -5651, -972, 4175, 3953, -1505, -3165, -650, 943, 1115, 615, 1587, 2631, -654, -4220, -1555, 3132, 4801, 804, -5139, -4396, 900, 3419, 1364, -1652, -2273, -214, -336, -1078, 1219, 2781, 1714, -1828, -4074, -113, 4777, 3615, -654, -3938, -2110, 2123, 2072, -220, -658, -868, -949, -1501, -1519, 1792, 3219, -64, -3087, -3181, 1275, 4640, 2231, -1858, -2139, -334, 1705, 1430]
1288A430j694P75j56k120j78J224K838M10l872k362K028L362J434k330l069J310
1304i70J679Q1J50l81M21k99k436M0K471J151p48k906j514K650K039l88j313j288
1322a561J032J105n31L73J088o10n97j308J12K499J40j484j292r78J745J375j092
1339A6m60k03q7P31k16K17J187q06o78J53l4J506O2j570m17K48M89O52q01p76
1359g87N07l46M39K80n80M51P6n16O46J89L9N55r32l49Q04K71rn11j196P17O94
1380D42k50M5j005l46J286n07N4L26l18N87m20m58J087J012p75o59j108Q42J856
1399A691n73j356o81j14J604o5r87K30K9k08j05l06J299J601j533j677k93J587
1417A43K295q39k385l96Q42J041p2j106M63N47j696n61R34J704J155k335k447
$$ y = [1430, -264, 511, 355, -1765, -1943, -719, 2119, 2529, -1343, -3705, -1677, 1685, 3119, 789, -2280, -970, 709, 790, 940, 559, 980, 681, -1755, -1715, 756, 1907, 1159, -1747, -3261, -611, 1428, 1040, -273, -1561, -529, 576, 45, 418, 1506, 896, 299, -1009, -897, 1602, 1742, 258, -1034, -2012, -267, 1108, 16, -444, -647, -734, -3, -219, -2, 1185, 379, -299, -146, -180, 1326, 1388, -182, -599, -351, 138, 790, -11, -787, -280, -626, -187, 93, -487, -36, 40, -476, 170, 359, 398, 953, 21, -328, 476, 747, 738, 227, -969, -252, 442, 192, 237, -768, -1114, 172, -335, -281, 45, -273, 314, -106, -564, 523, 1535, 760, 101, -1007, -165, 1691, 1118, -238, -919, -1033, 571, 506, -481, -251, -222, -430, -535, -841, 458, 2059, 526, -1151, -1444, 143, 2438, 1599, -786, -1182, -340, 701, 629, -477, -14, 533, -1163, -1724, -790, 914, 2069, -266, -2713]
1434b713J223K658J316j174k500K48J570k03l5N6Q2J30k276p40K522J928l86l164
1452a458j789K082K929l8j386j323L89J033m28j35J724K64j706k291k73L680K029
1469C303k456l130p11K315K526j071j567M40J2k74l27J100K442j2l829j716J747
1486a208L841J047l759k730J330J829R19j080q95J222q56j824N61K733K274j708
1502A696m618l94L980K759p55l441j578K168J106r26O3N36M14j803k534J628M177
1519B478P08l341l498O80M616J591k294j772k00J501O5j179J423J577j418k705
1535a768j770K600M392r27m150j919J577L595O51k456o36Q22j48m40m7K213J767
1552C356k966l397N20L432K878k081m364%K176J437k36j218L59O63j902n87K039
$$ y = [-2713, -1490, 1168, 2484, 1310, -1190, -942, 628, 425, 390, 446, 528, 658, -1618, -2358, 164, 2092, 1706, -1458, -3247, -1165, 1764, 1726, 340, -983, -594, 439, 11, -124, 1600, 1864, 158, -2133, -2406, 1274, 3303, 847, -2283, -2994, -679, 1847, 776, -791, -351, -339, -613, -940, 160, 2602, 2590, -1239, -2955, -1208, 2633, 3680, -79, -2809, -1479, 350, 1269, 189, -706, 516, -340, -2164, -1603, 1130, 3404, 1696, -2922, -3316, 664, 3423, 2668, -773, -2351, -183, 923, -3, 60, 596, 1010, -793, -3327, -1699, 2478, 3186, -155, -3653, -2973, 1643, 3234, 940, -832, -1032, 469, 534, -645, 778, 2355, 937, -1768, -3538, -938, 3454, 2527, -1623, -3542, -1965, 1630, 2281, -175, -811, 11, -137, -577, -624, 1589, 3356, 390, -3007, -2487, 945, 3823, 1742, -2622, -2622, -446, 991, 755, -463, -104, 559, -1343, -1930, 109]
1569A09K370M48l506k860K497L474N77k281k752N01K000m60m40O65M78q75k243
1586b298l41L559K295j843l286j216L152L025j217j973o70L91Q09q25J40J974
1602A676k81k395j861Q66L844J323l262k500M49K559J677j294j283P79J02q75
1618d76j33Q86K123p42l524p80J933K575N01l125j634J370J290L21m80k80Q08
1635F33o72j380O83K177J024j361k835o9K589J048o82j693r15J259J56m76M02
1652a12P95n03j002j065J716K238n55j455j523P02K009J74j199l60j4k3r2m12
1670f81R56O49j226r58k45J189J637p31j286J19L70Q12J32o03K45Q8o45j52K31
1689i9P51M13j510p22O25M86N09k15r24L44L33l05M12K27J20K78r32m2O81L24
$$ y = [109, 2479, 2927, -579, -3439, -942, 2532, 3109, 828, -1924, -1423, 577, 117, -323, 342, 820, -55, -2298, -2639, 920, 3215, 1372, -1914, -3130, 22, 3047, 1830, -143, -813, -422, 387, -438, -298, 1676, 1395, -1000, -2861, -1995, 1849, 3172, -90, -2590, -2141, 418, 2095, 801, -482, 297, 399, -476, -609, 277, 2400, 1658, -1866, -2646, -713, 1862, 2363, -762, -2396, -1026, 264, 585, 105, -175, 633, -39, -1419, -736, 1441, 2465, 1104, -1731, -1800, 789, 1837, 1155, -538, -1453, -194, -38, -514, -112, 683, 180, -822, -1887, -171, 2067, 1512, 57, -1466, -764, 1245, 1419, 220, -140, -154, -177, -269, -681, 275, 924, -302, -1260, -1505, -316, 1321, 590, -696, -577, -207, 605, 737, 134, 379, 467, -178, -330, -99, 652, 1065, -445, -1167, -542, -56, 453, 238, -686, -342, -9, -314, 98, 325, 445, 723, -209, -251, 430, 754]
1709G54j74m55o61L52J55m92O33l28j25J82n30N08N18m47K75j49j7K84K1k28M04
1730D80j58l62O4l73L57M75o67m4l4l28M67j60P9O17l84m54J67L70O97O4j106
1751b33J07K14K22K63m22j80L20o83l55O09K33N31r03j029O85J007M13k85p38
1770b24j95J037l45J07L06k23L0q63q80J623O93m71j343p71Q68J468m03n41k62
1789c89o7M92k90m4J312J49j049r64k2J922R32j484j826n8R67J151n55q16M92
1808a47J19p29j61Q19J635j86k118r79J326J899Q69k324j452R61P71K15l20m57
1826b59Q36p39j506K77J925J293j020k489n86K476J618m91j549j021J412J84m91
1843a30O26M23j00j455j708J281K773J59j982k212J63K749R57j117o24j39L18
$$ y = [754, 580, 125, -536, -184, -29, -521, 112, -216, -341, -159, -689, -181, 337, -110, 165, 16, -1, 283, 304, 76, 480, 322, -40, 24, -349, 8, 483, -184, -228, -262, -590, -123, -283, -204, 413, 29, -425, -258, 112, 809, 873, -233, -126, 88, 310, 573, 151, -29, 291, -392, -747, -138, 95, 626, -277, -1306, -621, 386, 799, 514, -224, -419, 618, 273, 380, 686, 463, 493, -370, -1250, 373, 1066, 595, -748, -1519, -651, 817, 414, -127, -389, -456, 36, -254, -298, 1014, 1163, 114, -850, -872, 1050, 1982, 498, -1328, -1386, -419, 732, 177, -639, -147, -28, -757, -918, -99, 1536, 1350, -768, -1747, -421, 1478, 2347, 23, -1429, -468, 303, 518, 198, -259, 577, -162, -1668, -1391, 534, 1827, 807, -1682, -2268, 208, 1826, 1335, -214, -1235, 177, 361, -130, 496, 919, 819, -636, -2344, -1063, 1710, 1869, -113, -2325, -2162, 587, 1544, 427, -197, -336, -18]
1860a8p2m16J270J537j501k221p76J915K819o29k948j122J108J657J66j128K06
1877a53N83j067o27O05K235J116k397k761P64K621J729j373k929JJ404N55k45
1894F1j71O65K6k112o80K257K262K8k941k349J966K958R4j458j672M05J115p62
1912c08P4J066M31j244k290k61L173J983j498k690r98K264K201o98j180m9M6j2
1930A0n93N62K010l65k605j514R29L020J014k613j976K37J725J106o62l26N89
1947E48n35j090L07J438J836p37l433p56K310J903J54k563j166J174N49j8J82
1964A03J88M00r95j670J080K530P06j602k617J19K587J248j083j275o78P67J4
1981a78m06P85P75n81j626j170J586K789l58k137j258O71K230L27j248j21O3j61
$$ y = [-18, -90, -506, 764, 2301, 800, -1421, -2197, -282, 2537, 1908, -1040, -2162, -1054, 603, 769, -359, -153, 430, -637, -1264, -659, 1576, 2692, 295, -2466, -1702, 919, 2648, 1275, -1654, -1653, -249, 306, 61, -110, 555, 581, -1531, -2211, 46, 2308, 2336, -605, -2954, -988, 1970, 2064, 606, -1066, -661, 454, -308, -234, 832, 1263, 19, -2271, -2532, 641, 2624, 1126, -1564, -2562, -298, 1903, 1205, 25, -24, 22, 10, -583, -21, 1989, 1624, -981, -2495, -1566, 1454, 2468, -145, -2121, -1884, -159, 947, 285, -41, 548, 13, -1077, -770, 668, 2504, 1767, -1666, -2422, -112, 1791, 1945, -618, -1784, -610, -61, -79, 103, 291, 691, -304, -1974, -894, 1636, 2342, 740, -1877, -1758, 829, 2077, 994, -281, -959, -192, -178, -584, 201, 976, 395, -1231, -2401, -815, 1974, 1616, -521, -1779, -1108, 1122, 1449, 201, 80, 143, -18]
1999a8k84j37J142J041j897j769J71J879J696q92k170j74R91J162n5o35L11K23
2017E85j087j97R45J137M15k183j350R55J656M50q69j703K43J051j33L0K78J93
2035D16j07j120j90J674R26l77j771j100J606J467o64p98o21J31N47m11J64O34
2053D06n5n33r25K61J792M55j392o36n3R83R01q43m42K22k92j01Q7J1Q24k85j224
2074h39j96M88J184K53j107o18N99N01L92j89n15M14k47l20J79K27L74j67j329
2093i16J53P05M76j22p01l37M47K75m3L57m25K89l7l94L82N55k56j00o04l12R87
2114C79k92o8l57l41L53N29m31K11K2k17K84k8j09M88k41k14K95m29M67m1l08
2135d8J35l82N7N51n17j96K03k4K29o0k02J91J66J5R8o8O0K16m81j72L79l5K34
$$ y = [-18, -302, -439, 703, 1744, -153, -1922, -1751, 128, 1824, 932, -1238, -1412, -421, 741, 686, 51, 362, 585, -502, -699, 246, 1383, 1798, -385, -1735, -780, 876, 1326, 457, -1246, -1003, 48, -85, -55, 223, 416, 309, -811, -1001, 673, 1599, 1222, -549, -1649, -43, 1424, 760, -38, -659, -528, 19, -392, -228, 406, 351, -182, -1107, -846, 946, 1401, 9, -627, -680, 303, 1204, 361, -81, 141, -151, -252, -165, -154, 670, 385, -839, -1035, -547, 637, 890, -217, -835, -236, 265, 657, 468, -47, 367, 120, -200, -21, 206, 580, 413, -916, -763, -58, 418, 296, -405, -742, -295, -20, -63, 294, -131, 158, 121, -273, 109, 664, 408, 308, -296, -608, 379, 87, 19, -338, -679, -326, 203, -228, -17, 5, -212, 72, 44, -65, 423, 182, -32, 263, -166, 301, 260, -48, 87, -295, -238, 313, -204, -400, -197, -221, 8, -52, -254, -63, 103, 118, 216, 148, 208, 424, -57, -229, 150, 115, 349]
2158C49l67o37L01L20R2N9o04M5M83j92K01K63R5k65k08l26P97L99l70k73p00
2179e38L62O68k76m24k20L5J37j8o2O93J2o30k62nQ94P41p30q06k0M06O30q1p32
2202b26K18j05j20j93Q9P41K64j146m45L37R22O45p91r70N09N61J83k8l61K39
2222C23n7o93K12N51L97k44j467m21J154J039k23o76p65O08O39m19L07K95%m23
2242A37r61M51J395K16j052j113j97J257Q08r97l43l36L94L04l42N02O99o90o04
2261d72j86N06J645j71j665m77L23Q87P03j240k21J21j42m9PO07P60p77j272J81
2281i32J312R72m31j770P0J007L11M8k93k30K67r59l18Q46R08pj248j218O98J686
2301G19J06l84j360K75J110M3l29L71m9k30q07n79J520R01q33j230q71R40J554
$$ y = [349, -18, -655, -354, -34, 58, 117, -487, -442, 41, -151, 50, 313, 408, 143, -65, -391, 406, 805, 435, 162, -538, -176, 492, 216, -208, -428, -393, -256, -274, -336, 357, 369, -261, -523, -528, 366, 1107, 377, -429, -449, -43, 587, 506, -226, -8, -113, -233, -426, -337, 404, 668, -478, -923, -586, 336, 981, 190, -780, -271, 290, 473, 445, 84, 323, 266, -427, -215, 336, 733, 489, -978, -1399, -245, 794, 571, -105, -870, -262, 377, -42, 265, 560, 560, 137, -824, -373, 1022, 1238, 186, -927, -1124, 133, 941, -56, -399, -735, -341, -37, -379, 123, 822, 132, -472, -658, -152, 1493, 1322, -343, -820, -497, 390, 1093, -147, -368, -247, -389, -438, -431, 176, 936, 159, -1113, -932, 380, 1352, 921, -849, -779, 228, 539, 587, 294, 64, 331, -628, -946, -100, 808, 801, -447, -1665, -967, 719, 825, 441, -919, -644, 466, 509, 180, 551, 502, 272, -535, -1114, 406, 1307, 474, -756, -1627, -687, 867]
2320H67j99q70m79J50O79L7m56R08L78j030p47J39J295R43j460j293J16J026R67
2339I71n68j091L95K24n13K08M62P19j14j358n13Q73J368M52j314j239P27P10
2357C99p8j96l31J01R4r09J97J172M81o45j243n35J777Q17n16q47o40Q49M91l79
2377E9Q6M38m75l86n51L47J324Qj248q33J90J440O15j011l89J46L0N51m06L27
2397B62O76o81p82k09P24J238l95j627l98P26Q16J51p03l53N42j46k29M26M64
2416E02M27q73r20M13J134L93m10j443m9J026o7O3k44k41K41l51l67Q37N33j35
2436D69p13o53P27R89q4m73o48OP78n4m57L15m7k73m06k63R51O73p46p15j16N99
2458a41R47l73p17K3K22L10m3j69M94q4p35l55J54Q66J92o07r07M82K80N33l39
$$ y = [867, 668, -202, -681, -531, 148, 185, -271, 637, 1015, -15, -762, -623, 672, 1615, 155, -1138, -1022, 4, 971, 403, -688, -293, -69, -582, -374, 88, 807, 693, -665, -1178, -305, 1063, 1515, 201, -1038, -311, 399, 321, 125, -206, -105, -11, -920, -723, 449, 930, 285, -958, -1493, 284, 1101, 585, -262, -902, -53, 438, 59, 145, 583, 108, -278, -829, -482, 842, 850, -398, -1231, -1041, 399, 1014, 3, -386, -240, -210, 341, -65, 262, 938, 257, -525, -734, -10, 1228, 833, -794, -1192, -466, 350, 501, -202, -555, -13, -159, -388, 38, 502, 929, 56, -864, -451, 683, 1076, 666, -777, -826, 200, 133, 196, -48, -289, -48, -399, -766, 71, 604, 469, -244, -897, -170, 819, 735, 262, -386, -380, 398, 344, -113, 202, 155, -118, -524, -787, 164, 837, 91, -624, -740, -141, 806, 433, -284, -261, -39, 271, 228, 59, 553, 469, -266, -621, -467, 399, 591, -16, -923, -441, -161, 372, 33]
2479C3l13L23M2k38N6L77K43n2p14l57R03J66J01o34p15O39L24m48J15rr6J60
2501i4k97J56P88j10k99n75L3R08L03n77j67k59J78L24l35j29J91k16j11k65K28
2522c25Q89l29m72r1l3P22K13n48j52J82l5J37k11J10R0j47l27Q8K18J62L9o19
2544d39j4M22k7J66r7j46M81l42m6K21M2J15l84j89L34J2m4J88n14M8K51J0r1
2567d3j4l55L59J11k46L99Pj03j4m19M27J45l9k64L5k38K14n6k85K10k1m6J35
2590a01q5J30K43k58J46J2r3K95j81j25J17q2m1J36k27J12J26l56M2J50j14J67
2612A3K4j89L41k29K17K7k39K15K18l28K36j85J1M1k41n9P3j60J67L6l20K40K3
2635f8n2K54r0m8K63j11n2J03q1k37M63n30L39j37j85K40k38n8M29m20r4K72o2
$$ y = [33, -280, 43, 85, -153, -97, 280, 523, 471, -243, -600, 303, 469, 570, -64, -779, -140, 184, -264, -149, -158, -254, -94, -391, -235, 553, 443, 144, -431, -398, 510, 813, 236, 69, -190, -12, 312, -23, -152, 39, -177, -288, -553, -325, 564, 235, -237, -328, -361, 361, 574, 26, -126, 56, 21, 158, -53, 57, 147, 0, -327, -239, -21, 141, 180, -439, -453, -31, -58, 108, 11, -135, 346, 4, -42, 179, 221, 336, -48, -237, 97, 109, 65, 253, -261, -213, 38, 48, -43, -57, -412, -53, 58, -188, 211, 218, 115, 101, -318, 109, 254, 215, -49, -14, -252, -38, -94, -379, -169, -190, -236, -101, -186, -56, 187, -71, 75, 87, -6, 289, 108, -17, 100, 18, -23, 113, -114, -2, 124, -232, -190, -40, -154, 13, 37, -152, 189, -40, 177, 204, -35, 180, 398, 70, 306, 121, 132, 173, -68, -127, -54, -214, -47, -11, -331, -91, -68, -120, 134, 44, -4, 259, 148, 96, 199, 118, -119, 344, -186, 153, 16, -169, 71, -167, -225, 204, -216, -310, -38, -100]
2658a00Q1m5k9J70J49k45L17j44j09J38j39j09J42l24L32j77k43L05R0l59L88
2679H9k80J6K92o3j11K42nK7K0j93P8l7J07j90l41K49R8k1q4o0j43M05j57j08
2703a70L48j03Q6p2q8J21K07k03j98J34K1Q1j37j77J33j19J62p1j31Q5P2J26k4
2726H3K9j3Q7j31qJ57k65K18kk16K45l85j2J56J0K4m9p2O2O8j91R5L26l07K31
2751A40m4j19K79j74P6j04n4J5J38l85J07M5n4j07P1j57J86p3R6K81l18K32J70
2774B47k06R9j3j55J50r4j71K07q8j61L9k87K77J48m0kKj14M09k91J1K28P0j54
2798A11J22q6Q4k1k65M9o9M5J31j54k69L21j28JJ61k24L23K3l65L12j00K62m8
2821B16j64n2J62k41K00j98m4P3o4j86K77j85Q8N8j34K52L60l36k11J20J20J68
$$ y = [-100, -19, -64, -93, 77, 226, -19, 298, 154, 45, 183, 44, -65, 77, -247, 85, -92, -335, -30, 60, -299, 89, -191, -175, 117, 54, -57, 185, 180, 207, 227, 34, 112, 75, 182, -8, -349, -100, -2, -23, -107, -167, -310, 95, -62, -170, 178, 75, 161, 89, 1, 122, 329, 126, -72, 62, 83, 164, 27, -150, -17, -136, 26, -45, -176, -91, -19, 107, 83, 112, 99, 186, 55, 47, 204, -61, 157, 155, -61, 184, -201, -213, -57, -47, -23, -72, -144, -82, -14, -205, -110, 216, -91, 140, 96, -23, 256, 82, 158, 54, 0, 15, 153, -232, -125, -80, -134, -241, -170, -327, -141, -214, -118, 163, -155, 77, 247, 41, 140, 127, -28, 122, 28, -143, 64, -24, -185, -146, -433, -156, -8, -48, -50, -48, -162, 247, -44, -33, 195, 265, 111, 233, 147, 231, 210, -55, -6, -75, -30, 101, -53, -322, -1, -129, -128, 33, -191, 132, 155, -210, 102, 2, 264, 216, 52, 0, 162, -79, 121, -77, -121, -48, -112, -298, -21, -206, -118, -60, -194, 58, 418, 82, -129, -9, 111, 279]
2843B79k9j49J64j76j86N9k87L10K60o20J30k7K14L70l44j29J81j5N9J99j64J65
2865B64q7l29K0J00J72J33n17qR8P0J93j77k82M42k06p7L26r9K19j11j77N7K49
2888B73L26l53k98k63L30k6OK1j38j36m9k45L40M02j43m1k46J00M00J5l13P0l0
2911Bj67L32l48K17J00k15j94j08K79L64j51l98L2O1L06K05l42pJ3N3OK13j95
2934E8K93m68k69L57J42J86l03m02J40J28L41p0k10JJ65j62q4M03L9p5k29m70
2956d89N13J64L3k54l95J16L11Ro7J30r6n8j40r9M81J87k87k20j78L76O37m84
2978A90m99J89L9K51k54PJ97L0k79l21L01M14Q1n98L2O0J98J88J17l35R6j6j57
3001f9J89j43M59n22k72r0M85J21Q5m76k65M19J59J44O2l81K71Nn03M99K72j54
$$ y = [279, 250, 101, 265, 89, -97, -38, -325, -15, 245, -375, -245, -272, -58, 312, -32, -161, 20, 5, 64, 263, 99, 264, 177, -152, -132, -32, 140, 273, -244, -252, -154, -84, 109, -68, -350, 92, -114, -191, 135, 36, 255, 144, -33, 24, 273, 599, 246, -52, -315, 15, -11, -5, 16, -122, -258, -307, -552, -212, 190, 47, 6, -240, -140, 260, 275, -38, 32, 2, -165, 167, -181, 36, 136, -79, -273, -381, -102, 262, 111, -287, -255, -194, 112, 317, -25, -32, -19, 34, 40, 253, 58, 351, -117, -386, -29, 113, 299, -4, -406, -266, -138, 203, 133, -77, -76, 89, -73, -157, 246, 285, 210, -19, -489, 24, 188, 221, -33, -428, -312, -1, 8, -59, 71, -25, -83, -223, -322, 159, 346, 59, -161, -339, 37, 674, 190, -309, -120, -81, 170, -84, -77, 120, 150, -129, -450, -149, 265, 346, -252, -220, -160, 38, 226, 343, 8, 104, 88, -69, 120, -23, 436, -86, -358, -448, 37, 158, 243, -233, -498, -79, 80, 224, 286, -95, 176, 181, -322, 177, 449, 295]
3023B95o2o39P7N79j7j53j89k29J48K36l24L20J11k01j01j36M07L53j94l15o2
3044i6j75N16J50m32j55M7M6p3j07L62L45n40l45K68L70K36j68m08j10K66L09
3065C06R0l57j80J90j87P0K2Q6J42l48m53M35K72R8l32k25N5N12j50J06k2j41
3087a1K63m86%N71P4k39l97k25M64L67k20k02j72R3K15j44o2K51N4k28p1n1M67
3110C11R9l25k65P8K30K88m01k17J72k03O5J01k1J55kk87NO1N30J76o37k73M27
3133F7P0N9j4l03K48j12k45K18nM4k14k78K41N24j48Mj33k67N02j22J6K7k53L5
3157c9J95k82J78R7P4m39j80oM35R8k13Jj21K33K4j13K42j6j03j17l0J5N89m72
3181E0q8n0L8J28P1k94L1M5j93J29J40M7j6Rk20K13J5K08jn41K31K33r4K8k63
$$ y = [295, 233, -406, -329, 250, 233, 80, -109, -338, -190, 46, -278, 42, 153, -48, -149, -285, 122, 475, 281, -34, -96, -271, 245, 395, -37, -192, -145, -99, -172, -279, 83, 428, -112, -457, -189, 181, 417, 249, -159, -269, -3, 306, 396, 39, -141, 49, -138, -68, -46, 40, 182, -166, -619, -184, 88, 186, -146, -371, -316, 196, 46, 152, 130, -11, 252, -234, -234, 337, 411, 172, -225, -450, 14, 381, 161, -41, -213, -120, 95, -49, -111, 140, 194, -34, -105, -156, 311, 410, 85, -180, -102, 128, 416, 15, -202, -30, -233, -168, -67, -88, 67, 65, -222, -217, -156, 374, 550, -87, -360, 67, 137, 196, 182, -121, 127, 15, -230, -12, -17, 27, -187, -465, -224, 300, 152, 156, 23, -244, 258, 136, 152, 179, -74, -39, 156, -126, 52, 149, 223, -216, -396, -402, 33, 131, -82, -81, -202, 31, 55, -58, 184, 168, 65, -52, -82, -67, 522, 50, -38, -88, -50, 78, 149, -145, -114, -69, -262, -133, 7, 54, 38, 47, -173, 40, 55, 263, 262, -279, -48, 185, 91, 119, -144]
3206a44L6J11k78J31J46j52K04j50k53L75K13k84L08l73R7L57l08N0K11m66L47
3227A78k71j9L60k56l9P0k59J99K40k45L4j7j00K70P8k38j2Q6K1r6j99L20J81
3250B86m60j32R5J90K08j23l35K85j30R8J46j30K56j55k54K86mr9J43j66k12Q7
3272a20J20M5j44j18L09j26r5K40j03n1m2r4J27J59O7R3k19n3J9O0k7j07M5j46
3296a61M7j2J39J22k81K06n7p2P6Q4j35J45j83J87J10q1m4m3l1L5o6j86K60k6
3320C3j61l8J17R0jj85o3J47Q1J41l9J3k6r4J0J00j69R0O2l27J92N4k27R4R6k97
$$ y = [-144, -108, 3, -275, -144, 2, -150, 54, -96, -349, 26, 239, -45, 263, -110, -13, 344, 36, 86, 297, -169, 178, -93, -112, 248, -8, -47, 23, -236, -37, 203, -42, -8, -25, -125, 145, 223, -15, -27, 59, 80, -16, -215, 105, 286, -174, -306, -211, -21, 187, 64, -271, 14, -116, -18, 128, -2, 254, 99, -155, 131, 127, 28, 171, 5, -207, -120, 0, 45, -99, -217, 92, -34, -129, 111, 8, -43, -85, -179, -52, 107, 174, 267, 48, -5, 14, 74, 47, -60, -15, -161, -114, -126, 13, 135, -146, 60, 3, -69, 7, 91, -44, 101, -82, 105, 215, 134, 90, 47, 16, 51, -15, -201, 59, 33, -128, -166, -49, 41, 40, -145, -208, -61, 20, 161, 122, 135, 109, 15, 25, 125, -44, 46, 108, -219, -27, 27, -200, -106, -10, -307]
$$ [...]
8191e5
##END NTUPLES=NMR FID
##END=
