##TITLE=1H_Pr T-B1
 CDCl3
 8 sc, 
 10.12.2021
##JCAMPDX= 6.0         $$ Bruker NMR JCAMP-DX V2.0
##DATA TYPE= NMR FID
##DATA CLASS= NTUPLES
##ORIGIN= UXNMR, Bruker Analytische Messtechnik GmbH
##OWNER= root
$$ XWIN-NMR		Version 3.5
$$ Fri Dec 10 12:03:58 2021 Russian Standard Time (UT+4h)  she@DPX200
##.OBSERVE FREQUENCY= 200.131346
##.OBSERVE NUCLEUS= ^1H
##.DELAY= (6, 6)
##.ACQUISITION MODE= SIMULTANEOUS
##.ACQUISITION SCHEME= undefined
##.AVERAGES= 8
##.DIGITISER RES= 18
##SPECTROMETER/DATA SYSTEM= spect
##.PULSE SEQUENCE= zg30
##.SOLVENT NAME= CDCl3
##.SHIFT REFERENCE= (INTERNAL, CDCl3, 0, 15.7039)
##AUDIT TRAIL= $$ (NUMBER, WHEN, WHO, WHERE, WHAT)
$$ ##TITLE= Audit trail, XWIN-NMR		Version 3.5
$$ ##JCAMPDX= 5.01
$$ ##ORIGIN= Bruker BioSpin GmbH
$$ ##OWNER= she
$$ F:/spectra/data/she/nmr/H-F/1/audita.txt
$$ ##AUDIT TRAIL=  $$ (NUMBER, WHEN, WHO, WHERE, WHAT)
(   1,<2021-12-10 12:02:58.20 +0400>,<she>,<DPX200>,
      <created by zg, POWCHK disabled, PULCHK disabled
       configuration hash MD5:
       00 E9 B6 7A A2 85 ED C7 34 08 36 98 17 FE 4E 26
       data hash MD5: 16K
       2D E0 DB DE 20 67 5F C7 50 95 2C FC ED 19 C5 67>)
$$ ##END=
$$ 
$$ hash MD5
$$ 30 7F 67 57 8D 21 39 EC 39 85 9E C5 22 6E CF 8E
##$RELAX= 
##$RELAX= 
##$RELAX= 
##$RELAX= 
##$RELAX= 
##$RELAX= 
$$ Bruker specific parameters
$$ --------------------------
##$DU= <F:/spectra>
##$EXPNO= 1
##$NAME= <H-F>
##$PROCNO= 1
##$TYPE= <nmr>
##$USER= <she>
##$AMP= (0..31)
100 100 100 100 100 100 100 100 100 100 100 100 100 100 100 100 100 100 
100 100 100 100 100 100 100 100 100 100 100 100 100 100 
##$AQSEQ= 0
##$AQ_mod= 1
##$AUNM= <au_zg>
##$AUTOPOS= <>
##$BF1= 200.13
##$BF2= 200.13
##$BF3= 200.13
##$BF4= 200.13
##$BF5= 200.13
##$BF6= 200.13
##$BF7= 200.13
##$BF8= 200.13
##$BYTORDA= 1
##$CFDGTYP= 0
##$CFRGTYP= 5
##$CHEMSTR= <none>
##$CNST= (0..31)
1 1 145 1 1 1 1 1 1 1 1 1 1 1 1 1 1 1 1 1 1 1 1 1 1 1 1 1 1 1 1 1 
##$CPDPRG= <>
##$CPDPRG1= <>
##$CPDPRG2= <>
##$CPDPRG3= <>
##$CPDPRG4= <mlev>
##$CPDPRG5= <mlev>
##$CPDPRG6= <mlev>
##$CPDPRG7= <mlev>
##$CPDPRG8= <mlev>
##$CPDPRGB= <>
##$CPDPRGT= <>
##$D= (0..31)
0 1.2 0 0 0 0 0 0 0 0.06 0 0.03 0 0 0 0 0.0002 0 0 0 0 0 0 0 0 0 0 0 0 
0 0 0 
##$DATE= 1639123377
##$DBL= (0..7)
120 120 120 120 120 120 120 120 
##$DBP= (0..7)
150 150 150 150 150 150 150 150 
##$DBP07= 0
##$DBPNAM0= <>
##$DBPNAM1= <>
##$DBPNAM2= <>
##$DBPNAM3= <>
##$DBPNAM4= <>
##$DBPNAM5= <>
##$DBPNAM6= <>
##$DBPNAM7= <>
##$DBPOAL= (0..7)
0.5 0.5 0.5 0.5 0.5 0.5 0.5 0.5 
##$DBPOFFS= (0..7)
0 0 0 0 0 0 0 0 
##$DE= 6
##$DECBNUC= <off>
##$DECIM= 32
##$DECNUC= <off>
##$DECSTAT= 4
##$DIGMOD= 1
##$DIGTYP= 9
##$DL= (0..7)
0 120 120 120 120 120 120 120 
##$DP= (0..7)
150 150 150 150 150 150 150 150 
##$DP07= 0
##$DPNAME0= <>
##$DPNAME1= <>
##$DPNAME2= <>
##$DPNAME3= <>
##$DPNAME4= <>
##$DPNAME5= <>
##$DPNAME6= <>
##$DPNAME7= <>
##$DPOAL= (0..7)
0.5 0.5 0.5 0.5 0.5 0.5 0.5 0.5 
##$DPOFFS= (0..7)
0 0 0 0 0 0 0 0 
##$DQDMODE= 0
##$DR= 18
##$DS= 0
##$DSLIST= <SSSSSSSSSSSSSSS>
$$ [...]
##$SUBNAM2= <"">
##$SUBNAM3= <"">
##$SUBNAM4= <"">
##$SUBNAM5= <"">
##$SUBNAM6= <"">
##$SUBNAM7= <"">
##$SUBNAM8= <"">
##$SUBNAM9= <"">
##$SW= 18.0517287032376
##$SWIBOX= (0..15)
0 0 2 0 0 0 0 0 0 0 0 0 0 0 0 0 
##$SW_h= 3612.71676300578
##$TD= 16384
##$TD0= 1
##$TE= 0
##$TE2= 300
##$TE3= 300
##$TEG= 300
##$TL= (0..7)
0 120 120 120 120 120 120 120 
##$TP= (0..7)
150 150 150 150 150 150 150 150 
##$TP07= 0
##$TPNAME0= <>
##$TPNAME1= <>
##$TPNAME2= <>
##$TPNAME3= <>
##$TPNAME4= <>
##$TPNAME5= <>
##$TPNAME6= <>
##$TPNAME7= <>
##$TPOAL= (0..7)
0.5 0.5 0.5 0.5 0.5 0.5 0.5 0.5 
##$TPOFFS= (0..7)
0 0 0 0 0 0 0 0 
##$TUNHIN= 0
##$TUNHOUT= 0
##$TUNXOUT= 0
##$USERA1= <user>
##$USERA2= <user>
##$USERA3= <user>
##$USERA4= <user>
##$USERA5= <user>
##$V9= 5
##$VALIST= <valist>
##$VCLIST= <CCCCCCCCCCCCCCC>
##$VD= 0
##$VDLIST= <DDDDDDDDDDDDDDD>
##$VPLIST= <PPPPPPPPPPPPPPP>
##$VTLIST= <TTTTTTTTTTTTTTT>
##$WBST= 1024
##$WBSW= 4
##$XGAIN= (0..3)
0 0 0 0 
##$XL= 0
##$YL= 0
##$YMAX_a= 374386
##$YMIN_a= -523768
##$ZGOPTNS= <>
##$ZL1= 120
##$ZL2= 120
##$ZL3= 120
##$ZL4= 120
##$ABSF1= 10
##$ABSF2= 0
##$ABSG= 5
##$ABSL= 3
##$ALPHA= 0
##$AQORDER= 0
##$ASSFAC= 0
##$ASSFACI= 0
##$ASSFACX= 0
##$ASSWID= 0
##$AUNMP= <proc_1d>
##$AZFE= 0.1
##$AZFW= 0.1
##$BCFW= 1
##$BC_mod= 2
##$BYTORDP= 1
##$COROFFS= 0
##$CY= 11.3945322036743
##$DATMOD= 1
##$DC= 2
##$DFILT= <>
##$DTYPP= 0
##$F1P= 2.36226072786647
##$F2P= -0.459571619588291
##$FCOR= 0.5
##$FTSIZE= 0
##$FT_mod= 4
##$GAMMA= 1
##$GB= 0.15
##$INTBC= 1
##$INTSCL= 1
##$ISEN= 128
##$LB= 0.24
##$LEV0= 0
##$LPBIN= 0
##$MAXI= 10000
##$MC2= 0
##$MEAN= 0
##$ME_mod= 0
##$MI= 1.114404
##$NCOEF= 0
##$NC_proc= 0
##$NLEV= 6
##$NOISF1= 3.799351
##$NOISF2= 2.8
##$NSP= 1
##$NTH_PI= 0
##$NZP= 0
##$OFFSET= 15.70392
##$PC= 1
##$PHC0= -15874.7
##$PHC1= 15.8008
##$PH_mod= 1
##$PKNL= yes
##$PPARMOD= 0
##$PSCAL= 0
##$PSIGN= 0
##$REVERSE= no
##$SF= 200.130013532006
##$SI= 16384
##$SIGF1= 3
##$SIGF2= 2
##$SINO= 400
##$SIOLD= 16384
##$SREGLST= <1H.CDCl3>
##$SSB= 0
##$STSI= 0
##$STSR= 0
##$SW_p= 3612.71676300578
##$SYMM= 0
##$S_DEV= 0
##$TDeff= 0
##$TDoff= 0
##$TI= <>
##$TILT= no
##$TM1= 0
##$TM2= 0
##$TOPLEV= 0
##$USERP1= <user>
##$USERP2= <user>
##$USERP3= <user>
##$USERP4= <user>
##$USERP5= <user>
##$WDW= 1
##$XDIM= 8192
##$YMAX_p= 0
##$YMIN_p= 0
$$ End of Bruker specific parameters
$$ ---------------------------------
##NTUPLES= NMR FID
##VAR_NAME=  TIME,          FID/REAL,        FID/IMAG
##SYMBOL=    X,             R,               I
##VAR_TYPE=  INDEPENDENT,   DEPENDENT,       DEPENDENT
##VAR_FORM=  AFFN,          ASDF,            ASDF
##VAR_DIM=   8192,          8192,            8192
##UNITS=     SECONDS,       ARBITRARY UNITS, ARBITRARY UNITS
##FACTOR=    0.0002768,     1,               1
##FIRST=     0,             0,               0
##LAST=      2.2672688,     0,               0
##MIN=       0,             -523768,         0
##MAX=       2.2672688,     374386,          0
$$ Real data points
##PAGE= N=1
##DATA TABLE= (X++(R..R)), XYDATA
$$ plain form
0 0 0 0 0 0 0 0 0 0 0 0 -8 8 -8 16 -16 24 -24 32 -40 48 -56 72 -80 96 -112 131 -152 176 -205 234 -269 305
32 305 -349 394 -445 501 -564 631 -705 786 -876 973 -1081 1196 -1324 1462 -1613 1780 -1960
49 -1960 2161 -2380 2623 -2890 3189 -3523 3901 -4328 4818 -5388 6058 -6864 7845 -9082
63 -9082 10687 -12866 16010 -20963 29951 -51458 215694 -9341 -462556 41307 292479
74 292479 18019 -182906 49659 128686 -340 -100124 -61908 -22872 84916 150169 40657
85 40657 -162094 -112826 121677 156484 -66142 -106257 62612 58242 -115079 -85020 55589
96 55589 46345 4081 37015 -43810 -127884 24673 162549 1771 -128472 13331 97409
107 97409 -47148 -111338 2420 59179 8429 -20829 -34951 -53229 -4031 68558 28772 -59427
$$ packed form
0@%%%%%%%%%%qJ6j6K4l2M0m8N6p2Q8j04J28j52J76k08K43k83L28l81M39n03N74
32C05o54P43q39R46j065J195j336J491j662J849k054K277k520K786l075L393l740
49a960M121m541N003n513O079o712P424q229R146j0206J1446j2922J4709j6927
63i082J9769k3553K8876l6973N0914q1409K67152k25035m53215N03863K51172
74B92479k74460k00925K32565P9027j29026r9784L8216L9036J07788O5253j09512
85D0657k02751M9268K34503L4807k22626m0115J68869m370j73321L0059J40609
96E5589r244m2264L2934q0825q4074J52557J37876j60778j30243J41803Q4078
107I7409j44557o4190J13758N6759n0750k9258j4122j8278M9198P2589l9786q8199
$$ plain form
119 -59427 -23491 64956 2574 -105648 -14604 125371 26660 -117802 -13799 93578 -45589
130 -45589 -100879 109493 157029 -86941 -140459 81149 112760 -67672 -57370 95258 56068
141 56068 -84089 -64689 32650 42233 19340 14851 -22171 -53979 -3476 54674 17947 -33317
153 -33317 6679 38993 -40067 -86164 20800 93968 -2265 -68207 3800 23374 -41912 -8064
165 -8064 68474 16007 -52761 -7296 18837 -30234 -14184 45464 13088 -45779 -22687 9510
177 9510 -5838 -2591 25351 11330 -25416 -19976 10052 6327 -11336 11223 31847 -16360 -52207
190 -52207 13470 56519 -18920 -47111 50258 62807 -54045 -59420 58915 64227 -33400 -35543
202 -35543 27433 20652 -16848 -13176 86 8123 22383 7345 -33761 -28864 25390 40226 -9477
$$ packed form
119e9427L5936Q8447o2382j08222R1044J39975r8711j44462J04003J07377j39167
130d5589n5290K10372M7536k43970n3518K21608L1611j80432J0302J52628l9190
141E6068j40157J9400R7339R583k2893m489l7022l1808N0503N8150l6727n1264
153c3317L9996L2314p9060m6097J06964P3168r6233o5942P2007J9574o5286L3848
165h064P6538n2467o8768M5465K6133m9071J6050N9648l2376n8867K3092L2197
177I510j5348L247K7942j4021l6746N440L0028l725j7663K2559K0624m8207l5847
190e2207O5677M3049p5439k8191R7369J2549j16852n375J18335N312r7627k143
202c5543O2976o781l7500L672J3262Q037J4260j5038m1106M897N4254J4836m9703
$$ plain form
215 -9477 -36217 7064 33772 -15096 -45413 11165 48682 -2410 -35230 -2163 6423 -12095
227 -12095 13856 32197 -12360 -31342 12203 18258 -21905 -10571 30741 13920 -29090 -26468
239 -26468 232 11155 13651 6458 -14220 -21652 -203 15399 533 -11194 9552 21404 -14093
252 -14093 -38570 4332 43981 8906 -28272 -3624 15135 -8075 -7623 21014 12884 -12941 -4862
265 -4862 5252 -8254 -4525 17462 8993 -15476 -12167 3396 1520 -2716 3968 3269 -7883 -7511
279 -7511 4339 4409 -6944 -2930 14201 6284 -17147 -7637 19587 8265 -16983 -2471 19836
292 19836 3265 -15204 -2424 7906 937 1682 5019 -5042 -7843 3332 2585 -6280 737 11315
306 11315 -653 -17183 -9317 8880 9567 -2076 -3924 928 -4029 -7823 4910 13911 2834 -6192
$$ packed form
215i477k6740M3281K6708m8868l0317N6578L7517n1092l2820L3067Q586j8518
227a2095K5951J8341m4557j8982M3545O055m0163J1334M1312j6821m3010K622
239b6468K6700J0923K496p193k0678p432K1449J5602j4866j1727K0746J1852l5497
252a4093k4477M2902L9649l5075l7178K4648J8759k3210M52K8637q130k5825Q079
265d862J0114j3506L729K1987q469k4469L309J5563j876m236O684o99j1152L72
279g511J1850P0j1353M014J7131p917k3431R510K7224j1322k5248J4512K2307
292A9836j6571j8469J2780J0330o969P45L337j0061k801J1175p47q865P017J0578
306A1315j1968j6530P866J8197O87j1643j848M852m957l794J2733R001j1077r026
$$ plain form
320 -6192 -1168 -1313 -6997 3229 15636 3181 -13712 -8618 1936 862 1803 6011 259 -8923
334 -8923 -6743 224 982 1930 5059 -771 -11194 -8496 4737 8367 -331 -2886 2409 810 -4346
349 -4346 1563 10322 5885 -3156 -1917 2025 828 1117 3987 1444 -2742 -847 2621 384 -1248
364 -1248 1763 3304 -1258 -3019 1100 1940 -2494 -2991 380 268 -1191 1330 368 -4851 -2183 6297
380 6297 5990 -2176 -3136 1596 2101 -1170 -1733 957 3258 -953 -8001 -7150 1898 7195 2091 -6320
396 -6320 -7508 254 5686 432 -5439 848 5991 -3503 -10791 -2078 7988 5851 -1358 -5114 -3575
411 -3575 3692 9508 4545 -1337 1110 3931 1448 -1455 -696 3317 5935 -404 -8598 -5330 5837
426 5837 6280 -1110 -2661 256 -24 288 1443 17 -1243 330 -1107 -4188 -3034 -1068 811 2380
$$ packed form
320f192N024j45n684J0226J2407j2455j6893N094J0554j074R41M208n752r182
334h923K180O967P58R48L129n830j0423K698J3233L630q698k555N295j599n156
349d346N909Q759m437r041J239L942j197K89K870k543m186J895L468k237j632
364a248L011J541m562j761M119Q40m434m97L371j12j459K521r62n219K668Q480
380F297l07q166r60M732N05l271n63K690K301m211p048Q51R048N297n104q411
396f320j188P762N432n254n871O287N143r494p288Q713J0066k137p209l756J539
411c575P267N816m963n882K447K821k483k903P59M013K618o339q194L268J1167
426E837M43p390j551K917k80L12J155j426j260J573j437l081J154J966J879J569
$$ plain form
442 2380 -763 -6203 -1845 6950 4275 -3774 -2689 1608 165 -1043 -1452 -5467 -4619 2564 2143 -8117
458 -8117 -8855 2690 8701 46 -10691 -5461 11651 11194 -10528 -15499 6745 15258 -3453 -12738
472 -12738 124 8813 4573 -727 -3248 1405 10377 8449 -4548 -7146 4490 11620 5206 -7393
486 -7393 -11237 2964 13928 -788 -14121 1638 15178 63 -12409 -969 9753 5832 -2282
499 -2282 -6950 -4786 3768 5118 -2121 -2919 -253 -1403 958 3461 -2303 -2188 8689 3566 -12504
514 -12504 -6514 9293 3490 -8571 -4471 995 -3535 -4286 1561 4852 -141 -8514 -4760 9274
528 9274 6463 -11387 -7008 12995 5113 -15272 -6450 12581 7504 -5287 -3782 1274 3884 6675
542 6675 3379 -4255 -3172 4380 6468 -151 -7056 -4160 7521 6303 -10562 -10163 11459 14192 -7509
$$ packed form
442B380l143n440M358Q795k675q049J085M297j443j208m09m015Q48P183m21j0260
458h117p38J1545O011q655j0737N230J7112m57k1722m971K2244Q513j8711r285
472a2738J2862Q689m240n300k521M653Q972j928j2997k598J1636P130o414j2599
486g393l844J4201J0964j4716j3333J5759J3540j5115j2472J1440J0722l921q114
499b282m668K164Q554J350p239p98K666j150K361K503n764J15J0877n123j6070
514a2504N990J5807n803j2061M100N466m530p51N847L291m993q373L754J4034
528I274k811j7850M379K0003p882k0385Q822J9031n077j2791J505N056K610K791
542F675l296p634J083P552K088o619o905K896J1681j218j6865L99K1622K733k1701
$$ plain form
557 -7509 -13371 4288 11055 1221 -6157 -4882 717 4390 510 -6021 -1831 5406 1994 -3684 -3201
572 -3201 57 5838 7974 -3480 -13751 -1088 12263 655 -12720 -3284 6691 -1012 -8285 -1806
586 -1806 5413 2542 -4355 -4763 2711 4307 -2646 -1194 5973 -1752 -11205 591 11807 691 -7340
601 -7340 1846 4929 -1413 687 4361 -138 -557 3543 297 -3415 354 3557 1388 -2657 -6321
616 -6321 -1983 8576 5296 -7737 -4619 7006 2924 -4980 -1003 2502 1294 1892 -1187 -5920 1457
631 1457 8489 -707 -7854 -333 5132 3358 998 -3159 -4725 3622 6095 -5864 -7772 5035 6989
646 6989 -5242 -7868 -401 4511 2821 -3841 -6357 1666 6338 -1145 -3966 2441 1738 -3444 -196
661 -196 2675 -1411 732 4997 -1021 -5397 1481 4729 -479 -1199 966 -777 -826 1479 -30 -1730
$$ packed form
557g509n862J7659O767r834p378J275N599L673l880o531M190P237l412n678M83
572c201L258N781K136j1454j0271J2663J3351j1608j3375R436R975p703p273O479
586a806P219k871o897m08P474J596o953J452P167p725r453J1796J1216j1116q031
601g340R186L083o342K100L674m499m19M100l246l712L769L203k169m045l664
616f321M338J0559l280j3033L118J1625m082p904L977L505j208N98l079m733P377
631A457P032r196p147P521N465j774k360m157j566Q347K473j1959j908J2807J954
646F989j2231k626P467M912j690o662k516Q023M672p483k821O407p03n182L248
661a96K871m086K143M265o018m376O878L248n208p20K165j743m9K305j509j700
$$ plain form
677 -1730 457 -685 -2544 -95 1830 257 387 234 -3549 -1496 3761 1515 -2245 1136 1784 -2729
693 -2729 -786 3091 602 -1429 1110 461 -2182 1373 2653 -1418 -1370 390 -1715 -1942 2593 2063
709 2063 -2378 -1858 456 -836 -299 1015 -55 -557 676 -1560 -970 3078 1681 -3042 -569 2595
725 2595 -539 -676 2596 1057 -2245 -42 553 -958 1639 2478 -2391 -3003 1468 1338 -1501 96
741 96 606 -1841 -948 326 -585 663 1183 -2216 -2618 1190 1344 -310 1518 1101 -2623 -851 2982
758 2982 972 -264 1335 -169 -2102 424 1854 -400 -263 665 -2043 -2166 2048 2314 -488 -622
774 -622 -491 -1366 -66 1749 -39 -607 122 -1216 -1102 1824 1689 -583 -101 687 -1206 263 3146
791 3146 1056 -1926 -446 -100 -934 593 1407 -1304 -1508 114 -753 -988 1238 1246 -1687 -1759 -138 542
$$ packed form
677a730K187j142j859K449J925j573J30j53l783K053N257k246l760L381O48m513
693b729J943L877k489k031K539o49k643L555J280m071M8J760k105k27M535n30
709B063m441N20K314j292N37J314j070n02J233k236N90M048j397m723K473L164
725B595l134j37L272j539l302K203N95j511K597Q39m869o12M471j30k839J597
741I6N10k447Q93J274r11J248N20l399m02L808J54j654J828m17l724J772L833
758B982k010j236J599j504j933K526J430k254J37R28k708j23M214K66k802j34
774f22J31q75J300J815j788n68P29j338J14K926j35k272M82P88j893J469K883
791C146k090k982J480L46q34J527Q14k711k04J622q67k35K226Qk933p2J621O80
$$ plain form
809 542 559 807 -1475 -1531 514 35 -608 1568 1527 -1264 -1175 1046 1244 1113 1428 -740 -1726 646 1603
828 1603 -368 -459 536 -516 -1689 15 1356 538 201 -940 -1461 -190 1590 830 -174 -671 -1025
845 -1025 -528 1043 1000 -88 287 438 -966 -400 1956 1177 -468 -603 -710 -1128 189 1284 -542 -1547
863 -1547 -678 -441 -1009 231 627 -688 -936 -803 -192 185 650 -110 -663 -704 -495 747 1393 294 -1167
882 -1167 -344 1085 494 227 1221 595 -675 -103 318 -105 515 1292 -251 -1670 -290 1283 748 -441
900 -441 -512 23 395 341 38 223 256 -277 -628 -391 103 1064 1088 -454 -1165 488 1659 665 -180 327 -113
921 -113 -1059 -56 722 -476 -1176 -71 -190 -1599 -1074 866 1050 -995 -1642 128 838 -107 394 327
939 327 -917 -824 732 967 -730 -552 1039 870 -848 -843 1501 1945 62 -1487 -640 701 698 -126 -842
$$ packed form
809E42J7K48k282n6K045m79o43K176m1k791Q9K221J98j31L15k168r86K372R57
828A603j971r1R95j052j173J704J341q18l37j141n21J271J780p60j004m97l54
845a025M97J571m3j088L75J51j404N66K356p79j645j35j07m18J317J095j826j005
863a547Q69K37n68J240L96j315k48J33O11L77M65p60n53m1K09J242O46j099j461
882a167Q23J429n91k67R94o26j270N72M21m23O20P77j543j419J380J573n35j189
900d41p1N35L72n4l03J85L3n33l51K37M94R61K4j542p11J653J171r94q45N07m40
921a13r46J003P78j198p00J105j19j409N25J940J84k045o47J770P10r45N01o7
939C27j244R3J556K35j697J78J591j69j718NK344M44j883j549Q47J341lq24p16
$$ plain form
958 -842 -670 -107 360 -175 -708 543 1483 -10 -1278 43 1115 944 49 -1249 -1318 680 1897 26
976 26 -1644 190 1851 -167 -1636 427 1923 313 -1844 -1031 797 291 -914 -143 2 -2030 -1173
993 -1173 1546 801 -2023 -951 1799 -101 -1799 65 2316 -285 -2237 -34 1161 -55 -310 1107
1009 1107 315 -1301 -426 1779 1176 -478 -508 318 377 -512 -372 711 593 -919 -866 -77 449 643 836
1028 836 -390 -1173 226 1104 457 -239 21 -123 -48 836 -107 -736 1195 1348 -1571 -2014 1956 2254 -919
1047 -919 -1681 71 950 56 -362 146 303 -756 -1097 260 735 -878 74 1282 -1093 -2158 1259
1064 1259 2621 -1086 -1798 1275 981 -1204 -14 1715 157 -1212 -222 518 467 84 -81 -3 -431 -732
1082 -732 211 1127 -228 -1273 51 279 -628 74 1063 -206 -1261 310 436 -433 470 951 -459 -832
$$ packed form
958h42J72N63M67n35n33J251R40j493j268J321J072j71q95j298o9J998J217j871
976B6j670J834J661k018j469K063J496j610k157Q13J828n06j205P71J45k032Q57
993a173K719p45k824J072K750j900j698J864K251k601j952K203J195j216k55J417
1009A107p92j616Q75K205o03j654l0Q26N9q89J40J083j18j512N3P89N26J94J93
1028H36j226p83J399Q78o47o96K60j44P5Q84r43o29J931J53k919m43L970K98l173
1047i19p62J752Q79q94m18N08J57j059l41J357M75j613R52J208k375j065L417
1064A259J362l707p12L073k94k185J190J729j558j369R90P40n1l83j65P8m28l01
1082g32R43R16j355j045J324K28r07P02R89j269j055J571J26q69R03M81j410l73
$$ plain form
1100 -832 716 462 -339 833 840 -1037 -911 785 982 -520 -716 270 147 -293 -463 424 597 -514 -726
1119 -726 368 548 -667 35 918 -699 -1298 1008 1221 -514 -524 1226 149 -981 585 1470 -304
1136 -304 -758 148 211 -436 376 207 -315 -786 -173 5 326 -114 -126 341 -67 -726 -7 967 -380 -962
1156 -962 333 309 -711 -24 1032 -401 -878 878 240 -564 382 798 -446 -741 329 277 -567 72
1174 72 166 -279 -162 -36 206 296 150 -344 164 224 -153 53 735 -357 -824 301 700 -833 135 1292
1194 1292 11 -495 431 767 -744 -257 843 -307 -664 361 448 -293 -533 -386 -528 21 -277 -49
1212 -49 394 -209 -550 28 297 -494 -498 632 73 -800 54 764 -341 -431 537 25 -388 514 1043 -358
1232 -358 -346 132 -329 -346 307 102 -44 -381 -367 71 369 281 -35 235 65 -504 10 375 -66 -615 198
$$ packed form
1100h32J548k54q01J172Pj877J26J696J97j502j96R86j23m40j70Q87J73j111k12
1119g26J094J80j215P02Q83j617n99K306K13j735j0J750j077j130J566Q85j774
1136c04m54R06O3o47Q12j69n22m71O13J78L21m40j2M67m08o59P19R74j347n82
1156i62J295k4j020O87J056j433m77J756o38q04R46M16j244k95J070n2q44O39
1174G2R4m45J17J26K42R0j46m94N08O0l77K06O82j092m67J125L99j533R68J157
1194A292j281n06R26L36j511M87J100j150l57J025Q7p41k40J47j42N49k98K28
1212d9M43o03l41N78K69p91mJ130n59q73Q54P10j105r0R68n12m13R02N29j401
1232c58J2M78m61j7O53k05j46l37J4M38K98q8l16K70j70n69N14L65m41n49Q13
$$ plain form
1253 198 210 -310 277 880 218 -321 301 412 -385 144 553 -277 -637 166 292 -381 -142 -158 -248 -27 -60
1274 -60 21 442 -131 -343 -138 96 -42 -7 352 -283 -634 150 320 -304 -317 500 -256 -633 415 616 -359
1295 -359 -237 168 -414 -476 511 537 -241 -129 -108 122 95 370 -6 142 173 -395 65 494 288 2 235 7
1317 7 -254 -18 588 -327 -174 326 130 81 109 480 -329 -292 -127 75 -271 222 -103 -176 -209 -2 -63 208 81
1340 81 -283 -215 67 -180 181 321 -147 -407 152 -2 -95 101 437 13 -450 365 341 -166 31 252 -164
1361 -164 -486 210 373 53 -157 -282 -401 -97 75 106 93 4 -220 -173 213 48 42 225 182 -299 89 463
1383 463 48 -182 129 98 -53 261 101 -331 -198 76 51 -293 26 -117 123 -325 -327 -111 -149 -55 -11 51 167
1406 167 -344 -34 166 -21 -70 135 -25 -43 -183 310 -109 -294 -16 159 18 117 81 -73 16 27 -74 -118
$$ packed form
1253A98J2n20N87O03o62n39O22J11p97N29M09q30l60Q03J26o73K39j6r0K21l3
1274f0Q1M21n73k12K05K34j38L5L59o35l51P84J70o24j3Q17p56l77J048K01r75
1295c59J22M05n82o2R87K6p78J12K1K30k7K75l76J48L1n68M60M29k06k86K33k28
1317Gk61K36O06r15J53N00j96m9K8L71q09L7J65K02l46M93l25p3l3K07o1K71j27
1340H1l64O8K82k47L61J40m68k60N59j54r3J96L36m24m63Q15k4n07J97K21m16
1361a64l22O96J63l20k10j25j19L04J72L1j3q9k24M7L86j65oJ83m3m81L88L74
1383D63m15k30L11l1j51L14j60m32J33K74k5l44L19j43K40m48kK16l8R4M4O2J16
1406A67n11L10K00j87m9K05j60j8j40M93m19j85K78J75j41R9l6j54Q9J1j01m4
$$ plain form
1428 -118 -406 -187 -108 43 141 -80 -28 310 -7 -199 120 21 -242 86 -171 27 13 104 276 -7 125 -60
1450 -60 -91 188 -96 -188 199 -215 5 -150 -23 180 -87 134 20 -12 -46 -218 116 -34 7 18 43 -5 -222
1473 -222 -7 244 139 -124 61 42 88 270 188 9 71 -156 49 42 16 -347 -66 67 130 -285 -122 -23 -259
1496 -259 -67 -150 107 -176 32 17 -157 -40 -115 72 189 -127 -3 -24 129 79 360 -249 42 23 269 221
1518 221 357 -10 -407 10 70 -76 91 -1 -120 45 -105 69 296 -265 -24 40 -25 123 46 89 93 -107 -145
1541 -145 118 -42 240 -110 -87 0 -314 81 225 -119 -72 -300 81 90 -62 72 -15 62 -31 61 240 168 -198
1564 -198 -195 -33 47 -58 200 9 -237 -90 146 344 170 213 24 -263 -154 -216 176 -83 -48 -91 -124 -59 204
1587 204 -100 -37 59 -296 -192 -67 -36 8 59 -70 166 -74 321 168 -60 42 170 170 153 322 -184 -127 282
$$ packed form
1428a18k88K19P9J51R8k21N2L38l17j92L19r9k63L28k57J98j4R1J72k83J32j85
1450f0l1K79k84r2L87m14K20j55J27K03k67K21j14l2l4j72L34j50M1J1K5m8k17
1473b22K15K51j05k63J85j9M6J82q2j79O2k27K05pk6l63K81J33O3m15J63R9k36
1496b59J92q3K57k83K08j5j74J17p5J87J17l16J24k1J53n0K81o09K91j9K46m8
1518B21J36l67l97M17O0j46J67r2j19J65j50J74K27n61K41O4o5J48p7M3Mk00l8
1541a45K63j60K82l50K3Q7l14L95J44l44M7k28L81Rj52J34q7P7r3R2J79p2l66
1564a98LJ62Q0j05K58j91k46J47K36J98j74M3j89k87J09o2L92k59L5m3l3O5K63
1587B04l04O3R6l55J04J25L1M4N1j29K36k40L95j53k28J02J28%j7J69n06N7M09
$$ plain form
1610 282 -152 -104 45 -18 -85 -50 -96 53 -81 63 6 -265 -63 -8 12 9 -113 -168 -109 57 -160 -234 190 -156
1634 -156 -232 41 -132 -155 -57 176 67 -419 35 26 -57 -129 148 -204 42 83 -91 79 -270 -67 78 -82 239
1657 239 -257 149 -88 -211 -259 256 359 -68 186 99 128 111 288 -115 -9 -79 -109 -221 -52 -114 -238 -15
1679 -15 -68 -76 179 56 76 -155 331 -67 -76 219 -170 56 135 -2 -51 -174 109 61 -73 121 192 -185 152 68
1703 68 118 24 151 -108 -116 69 -123 -153 -83 65 61 -220 -12 -31 -191 75 1 13 37 -106 51 -103 -59 112 -118
1728 -118 -102 -78 -74 262 289 76 111 62 -337 -147 152 107 13 48 61 -265 195 -53 -164 92 47 -180 -32 97
1752 97 148 -101 42 169 -29 -134 88 220 15 100 95 -89 197 188 -105 -68 106 -146 -295 91 104 66 22 12
1776 12 9 -7 154 163 -46 231 -123 38 106 74 -350 110 -22 -40 -71 -21 -107 -35 224 -15 61 -81 59 -13 -7 8
$$ packed form
1610B82m34M8J49o3o7L5m6J49j34J44n7k71K02N5K0lj22n5N9J66k17p4M24l46
1634a56p6K73j73k3R8K33j09m86M54rq3p2K77l52K46M1j74J70l49K03J45j60L21
1657B39m96M06k37j23m8N15J03m27K54q7K9j7J77m03J06p0l0j12J69o2j24K23
1679a5n3qK55j23K0k31M86l98rK95l89K26P9j37m9j23K83m8j34J94P1l77L37q4
1703F8N0r4J27k59qJ85j92l0P0J48mk81K08j9j60K66p4J2K4j43J57j54M4J71k30
1728a18J6K4ML36K7k13L5m9l99J90K99m5r4L5J3l26M60k48j11K56m5k27J48J29
1752I7N1k49J43J27j98j05K22J32k05Q5nj84K86rk93L7J74k52j49L86J3l8m4j0
1776A2lj6J61Rk09K77l54J61O8l2m24M60j32j8l1N0q6P2K59k39P6j42J40p2OJ5
$$ plain form
1802 8 79 -304 213 -123 -7 -105 29 -61 -113 178 -178 -131 160 -121 -35 170 -157 -181 -137 197 94 157 107 116 -167
1827 -167 -234 56 45 -108 176 -71 174 49 98 -177 -119 4 -213 -28 330 62 -139 -16 -209 -86 -78 -9
1849 -9 -78 -116 76 77 -33 138 -103 -243 32 182 -309 -50 444 -275 -103 76 37 54 -34 123 -93 -26 -64 6
1873 6 -59 44 -128 -109 -112 -12 30 140 194 -74 -270 87 -73 110 156 160 -244 -208 67 -47 -178 65 13 -2 25
1898 25 100 -133 -95 -86 -193 -128 233 84 57 222 -153 62 159 185 -57 96 80 33 94 233 178 -223 -209 57 -306
1923 -306 19 138 -86 -282 50 18 -23 -75 -12 -56 -14 -48 -167 14 181 138 103 56 51 -94 249 158 -61 56
1947 56 242 -9 -20 99 115 165 120 80 48 -43 95 -117 -91 49 -49 -10 271 -186 -120 -239 11 131 101 284
1971 284 302 217 134 -150 13 107 167 -281 181 26 -116 -86 30 -78 -101 -238 -22 -150 -20 38 29 -35 -97 -90 88
$$ packed form
1802HP1l83N17l36J16r8J34r0n2K91l56M7K91k81Q6K05l27k4M4L34j03O3n0Rk83
1827a67o7K90j1j53K84k47K45j25M9k75N8J23k17J85L58k68k01J23j93J23QO9
1849io9l8J92Jj10J71k41j40K75J50m91K59M94p19J72J79l9J7q8J57k16O7l8P0
1873Fo5J03j72J9lJ00M2J10N4k68j96L57j60J83M6Mm04L6K75j14j31K43n2j5K7
1898B5P5k33L8Rj07O5L61j49k7J65l75K15R7K6k42J53j6m7O1J39n5m01J4K66l63
1923c06L25J19k24j96L32l2m1n2O3m4M2l4j19J81J67m3l5m7nj45L43r1k19J17
1947E6J86k51j1J19J6N0m5m0l2r1J38k12K6J40r8L9K81m57O6j19K50J20l0J83
1971B84J8q5q3k84J63R4O0m48M62j55j42L0J16j08k3j37K16j28J30N8ro4o2PJ78
$$ plain form
1996 88 -275 -100 -217 30 147 -396 -16 -98 -138 -19 106 89 145 25 84 -57 33 -83 114 -151 0 -55 -51
2019 -51 47 264 -363 -15 -51 -52 101 -35 9 -75 182 -18 -142 57 -91 134 -95 -13 -71 114 -52 -9 27 7
2043 7 -1 155 -217 -203 226 -102 211 -46 49 -76 -110 78 -24 -66 -82 102 -161 -82 -105 -76 -80 175 -24 -74 -11
2068 -11 100 -129 68 -39 12 120 -33 5 -105 -122 80 44 -50 51 116 77 22 -237 -103 193 95 156 128 -39
2092 -39 -54 -51 -54 78 -93 244 109 202 -51 4 100 -152 127 34 88 -122 92 -89 -31 -25 -135 56 48 73 -142 211
2118 211 34 72 -201 153 -26 -164 28 10 60 99 -95 106 -29 -202 7 -266 213 -1 99 168 -74 99
2140 99 120 -4 16 -226 -165 -51 -73 49 66 86 -66 11 -150 56 -38 69 -29 -99 54 16 -29 151 10 -34 -94
2165 -94 58 -25 -178 186 -164 33 -24 117 134 382 -118 225 -71 -286 250 4 -234 -91 59 -78 -88 -126
$$ packed form
1996H8l63J75j17K47J17n43L80q2m0J19J25j7N6j20N9j41R0j16J97k65J51n5M
2019e1R8K17o27L48l6jJ53j36M4q4K57k00j24J99j48K25k29Q2n8J85j66M3L6k0
2043GqJ56l72J4M29l28L13k57R5j25l4J88j02m2j6J84k63P9k3K9mK55j99n0O3
2068a1J11k29J97j07N1J08j53L8j10j7K02l6r4J01O5l9n5k59J34K96r8O1k8j67
2092c9j5LlJ32j71L37j35R3k53N5R6k52K79r3N4k10K14j81N8Oj10J91qK5k15L53
2118B11j77L8k73L54j79j38J92j8N0L9j94K01j35j73K09k73M79k14J00O9k42J73
2140I9K1j24K0k42O1J14k2J22J7K0j52P7j61K06r4J07r8p0J53l8m5J80j41m4o0
2165i4J52q3j53L64l50J97n7J41J7K48n00L43k96k15N36k46k38J43J50j37j0l8
$$ plain form
2187 -126 102 53 -132 306 -179 91 -342 77 -25 -11 -20 125 -219 145 -255 -73 51 147 19 53 -170 -218
2209 -218 35 126 11 -18 262 -193 -165 -16 -38 -158 62 232 -15 104 182 -38 -223 -67 -29 -129 -139 12
2231 12 -121 -81 14 74 100 -30 254 9 -13 60 -561 -2 -13 -66 -123 -30 -36 -15 -168 -154 114 34 7 91 44 -97
2257 -97 155 13 -71 -36 -116 -217 -54 -91 -12 187 -21 62 16 86 26 -75 88 14 25 274 125 169 -142 109
2281 109 77 79 81 52 -44 51 165 -30 -47 -40 -34 -287 -245 102 -261 -30 171 -177 131 181 -46 -37 47 103 -129 52
2307 52 157 -108 -2 -185 61 -30 -108 -25 -41 -13 293 -233 -3 183 -57 -2 -16 284 29 -56 267 17 -89
2330 -89 274 -184 -31 77 45 1 112 -157 -132 -28 43 -208 -180 -96 29 35 -97 -27 159 188 63 -10 -106 64
2354 64 62 76 63 -100 -222 -56 -80 32 -79 170 36 122 176 -301 -11 133 31 134 61 27 -111 -1 28 54
$$ packed form
2187a26K28m9j85M38m85K70m33M19j02J4rJ45l44L64m00J82J24R6j28L4k23m8
2209b18K53R1j15k9K80m55K8J49k2j20K20J70k47J19P8k20j85J56L8j00j0J51
2231A2j33M0R5O0K6j30K84k45k2P3o21N59j1n3n7R3oK1j53J4K68q0k7Q4m7j41
2257i7K52j42q4L5q0j01J63l7P9J99k08Q3m6P0o0j01J63p4J1K49j49M4l11K51
2281A09l2KKk9r6R5J14j95j7POk53M2L47l63K31K01l48L08N0k27RQ4N6k32J81
2307E2J05k65J06j83K46r1p8Q3j6K8L06n26K30J86k40N5j4L00k55q5L23k50j06
2330h9L63m58J53J08l2m4J11k69K5J04P1k51K8Q4J25Oj32P0J86K9j25p3r6J70
2354F4kJ4j3j63j22J66k4J12j11K49j34Q6N4m77K90J44j02J03p3l4j38J10K9K6
$$ plain form
2378 54 -205 -146 -182 0 213 -47 50 -357 -124 -16 -14 111 -28 -29 36 74 9 97 -83 -63 15 -85 -269 77 25
2403 25 -133 161 -30 165 -129 -156 -162 -259 -18 80 113 -276 64 -45 11 -168 301 15 -138 177 120 105 -187
2426 -187 102 101 123 112 -119 82 40 47 104 -114 63 68 -135 -143 358 210 -26 68 -13 222 -70 -203 -248 -216 -75
2451 -75 -155 -65 53 39 -78 143 64 197 202 -72 96 -56 -181 71 -233 41 -182 28 46 1 122 202 126 164
2475 164 8 -57 164 -47 -100 -149 97 99 -242 65 205 8 -158 52 132 44 43 153 85 58 -170 -6 -47 -194
2499 -194 -139 340 -115 67 -130 48 207 -46 92 111 117 -116 242 -39 236 52 -44 -143 122 55 -57 -6 -206
2522 -206 119 -17 33 56 -78 -127 144 31 190 11 -135 95 -99 -73 68 7 84 -28 -39 85 -191 13
2544 13 84 -23 85 153 27 29 50 -165 98 15 310 209 -114 -25 165 -56 49 -34 -173 92 170 111 13 -109
$$ packed form
2378E4k59N9l6J82K13k60R7m07K33J08KJ25j39jO5L8o5Q8j80K0P8j00j84L46n2
2403B5j58K94j91J95k94k7or7K41R8L3l89L40j09N6j79M69k86j53L15n7j5k92
2426a87K89jK2j1k31K01m2PN7k18J77Nk03qN01j48k36R4q1K35k92j33m5L2J41
2451g5q0R0J18j4j17K21p9J33Nk74J68j52j25K52l04K74k23K10J8m5J21Q0p6L8
2475A64j56o5K21k11n3m9K46Kl41L07J40j97j66K10Q0q8jJ10o8k7k28J64m1j47
2499a94N5M79m55J82j97J78J59k53J38J9Ok33L58k81K75j84r6r9K65o7j12N1k00
2522b06L25j36N0K3j34m9K71j13J59j79j46K30j94K6J41o1P7j12j1J24k76K04
2544A3P1j07J08O8j26KK1k15K63q3K95j01l23Q9J90k21J05q3j39K65P8n9r8j22
$$ plain form
2568 -109 150 75 -45 171 -211 -146 -68 -53 198 265 -73 -100 -93 39 39 82 -199 -155 -133 76 -184 -104 -316 13 -9
2593 -9 249 90 44 13 52 197 -75 -24 -93 -186 -22 -127 236 188 -26 -159 -37 -105 124 197 -51 -36 -111 21
2617 21 -120 90 109 46 189 51 129 -29 91 47 -260 70 -36 -199 -194 -30 -4 96 -10 54 96 -35 -139
2640 -139 29 154 -123 93 -131 71 -98 -100 59 106 -110 -155 9 -214 -124 131 -147 -166 153 19 -46 69
2662 69 -1 107 -147 -95 204 -7 61 -213 72 -178 67 -2 -10 -37 -32 197 -89 -109 150 -236 -65 -281 -35 -203
2686 -203 34 -3 59 -74 61 -80 141 16 69 -31 -43 32 181 -254 66 14 -6 264 70 92 -90 -8 66
2709 66 115 93 -64 177 -26 20 130 -95 266 -63 -32 120 183 92 -86 -28 183 71 -14 -116 20 -93 102
2732 102 7 -156 -66 40 -74 254 -25 77 113 -55 170 -168 7 -72 -318 86 -55 -144 -273 83 -21 44
$$ packed form
2568a09K59p5j20K16l82O5P8J5K51O7l38k7PJ32%M3k81M4K2K09k60Q0k12L29k2
2593iK58j59m6l1L9J45k72N1o9r3J64j05L63m8k14j33J22o8K29P3k48J5p5J32
2617B1j41K10J9o3J43j38P8j58J20m4l07L30j06j63NJ64K6J00j06O4M2j31j04
2640a39J68J25k77K16k24K02j69kJ59M7k16m5J64k23R0K55k78j9L19j34o5J15
2662F9p0J08k54N2K99k11O8k74K85k50K45o9qk7NK29k86k0K59l86J71k16K46j68
2686b03K37l7O2j33J35j41K21j25N3j00j2P5J49m35L20n2k0K70j94K2j82Q2P4
2709F6M9k2j57K41k03M6J10k25L61l29L1J52O3r1j78N8K11j12q5j02J36j13J95
2732A02r5j63R0J06j14L28k79J02L6j68K25l38J75p9k46M04j41q9j29L56j04O5
$$ plain form
2754 44 -8 285 104 25 132 -80 278 240 74 11 -19 -4 -57 -63 11 -21 127 145 189 -120 -58 39 -63 -238 -157 -45
2780 -45 -250 -78 -36 -210 -18 34 -437 3 -7 168 -126 231 -188 125 56 -108 -24 -56 -175 92 230 -58
2802 -58 -7 20 142 -90 118 161 -82 22 -253 -17 -91 17 305 113 18 136 -43 -51 -79 1 13 -241 359 82
2826 82 -41 -64 107 -47 72 -110 -3 -7 60 -13 -65 -19 -5 -95 230 -164 -233 -25 -59 65 -139 12 133 116
2850 116 203 -48 71 140 -6 -157 214 -66 92 -11 -76 100 50 -80 -268 -12 75 -255 -1 119 -139 52
2872 52 -308 112 85 -188 44 -129 55 -33 -58 -96 47 -50 -145 200 82 107 -266 -26 11 65 -150 -133 72 -16
2896 -16 5 117 -134 -382 65 22 -122 137 -195 102 -81 160 41 138 -52 150 78 -6 -100 126 20 -253
2918 -253 17 95 70 -77 -216 -86 -128 -233 -31 99 -14 -36 -9 84 -142 97 119 -46 -163 34 -117 120
$$ packed form
2754D4n2K93j81p9J07k12L58l8j66o3l0J5n3oP4l2J48J8M4l09O2R7j02j75Q1J12
2780d5k05J72M2j74J92N2m71M40j0J75k94L57m19L13o9j64Q4l2j19K67J38k88
2802e8N1K7J22k32K08M3k43J04k75K36p4J08K88j92r5J18j79qk8Q0J2k54O00k77
2826H2j23k3J71j54J19j82J07mO7p3n2M6J4r0L25l94o9K08l4J24k04J51J21j7
2850A16Q7k51J19O9j46j51L71k80J58j03o5J76n0j30j88K56Q7l30K54J20k58J91
2872E2l60M20k7k73K32j73J84q8k5l8J43r7r5L45j18K5l73K40L7N4k15J7K05q8
2896a6K1J12k51k48M47m3j44K59l32K97j83K41j19R7j90K02p2q4r4K26j06k73
2918b53K70P8k5j47j39J30m2j05K02J30j13k2K7R3k26K39K2j65j17J97j51K37
$$ plain form
2940 120 208 0 125 274 -152 -34 -349 24 31 -233 135 59 4 33 368 40 144 35 214 120 -64 213
2962 213 9 67 -46 128 -202 136 18 -90 102 -72 103 88 -111 -42 -180 27 130 -64 -17 -125 -148 -153
2984 -153 0 64 86 -41 77 78 86 -143 -47 -159 101 -37 28 89 142 -21 -153 -22 64 253 -127 184 43 229
3008 229 -77 7 42 -16 125 25 132 62 56 63 338 41 -5 75 -53 -223 -1 -41 0 -227 -199 -41 141 63 89
3033 89 -61 291 85 70 134 106 -8 -29 64 -12 51 58 -101 -150 93 87 195 -86 -43 127 90 -214 13 10 241 -182
3059 -182 -73 -94 -94 -194 -107 122 48 -31 214 -43 54 -10 68 30 -152 123 -45 164 -50 52 -26 -52 -213 139
3083 139 -73 172 164 -220 25 20 0 -66 -82 -10 -47 189 59 -112 -43 76 -1 169 -331 -197 82 -67 16 48
3107 48 173 -23 211 127 -96 -157 -362 212 -111 -116 -84 -58 -7 92 -37 50 -75 -109 -1 -77 -202 -268 -14 -99 -155
$$ packed form
2940A20Q8k08J25J49m26J18l15L73Pk64L68p6n5K9L35l28J04j09J79r4j84K77
2962B13k04N8j13J74l30L38j18j08J92j74J75j5j99O9j38K07J03j94M7j08k3n
2984a53J53O4K2j27J18JQk29R6j12K60j38O5O1N3j63j32J31Q6J89l80L11j41J86
3008B29l06Q4L5n8J41j00J07p0oPK75k97m6Q0j28j70K22m0M1k27K8J58J82p8K6
3033H9j50L52k06j5O4k8j14k1R3p6O3Pj59m9K43oJ08k81M3J70l7l04K27lK31m23
3059a82J09k1%j00Q7K29p4p9K45k57R7o4P8l8j82K75j68K09k14J02p8k6j61L52
3083A39k12K45ql84K45nk0o6j6P2l7K36j30j71O9J19p7J70n00J34K79j49Q3L2
3107D8J25j96K34q4k23o1k05N74l23nL2K6N1R9j29Q7j25l4J08p6j25o6K54q5n6
$$ plain form
3132 -155 -45 -56 76 166 -157 39 -101 -36 -142 34 -34 36 185 15 -93 -29 -205 46 11 -158 33 48 -58
3155 -58 31 -32 27 -88 -17 -148 -97 145 157 -75 -25 -146 78 109 7 140 199 26 -38 -119 112 211 -46 26 17
3180 17 -106 179 46 137 51 -42 -237 123 15 161 -144 68 83 -129 50 -13 50 61 -234 89 -75 -170 -79
3203 -79 -54 -35 -73 -4 -54 -104 182 215 56 15 -291 -170 130 142 9 -111 -201 -57 -119 210 -118 -54 340 156
3227 156 -15 -2 -37 71 65 -35 33 39 -180 129 -1 -3 93 67 229 -67 -63 29 -59 78 -109 60 235 -76 52
3252 52 -195 19 -87 61 -6 170 -79 111 -13 -46 305 -98 -407 -163 134 30 153 2 8 -290 88 -214
3274 -214 -166 163 111 -93 -150 226 -73 -170 -37 54 92 70 -21 -176 -106 -153 163 -40 2 37 431 -41 230 263
3298 263 102 223 -215 -99 -10 -148 -80 60 -29 -46 -55 -138 255 -170 65 -96 95 125 126 -24 -292 96 291
$$ packed form
3132a55J10j1J32R0l23J96j40O5j06J76o8P0J49j70j08O4j76K51l5j69J91J5j06
3155e8Q9o3N9j15P1j31N1K42J2k32N0j21K24L1j02J33N9j73o4q1K31R9k57P2r
3180A7j23K85j33R1q6r3j95L60j08J46l05K12J5k12J79o3O3J1k95L23j64r5R1
3203g9K5J9l8O9n0n0K86L3j59m1l06J21L00J2j33j20r0J44o2L29l28O4L94j84
3227A56j71J3l5J08oj00O8Ok19L09j30kR6k6J62k96MR2q8J37j87J69J75l11J28
3252E2k47K14j06J48o7J76k49J90j24l3L51m03l09K44K97j04J23j51Ok98L78l02
3274b14M8L29n2k04n7L76k99r7J33R1L8k2r1j55P0m7L16k03M2L5L94m72K71L3
3298B63j61J21m38J16Q9j38O8J40q9j7rq3L93m25K35j61J91L0Jj50k68L88J95
$$ plain form
3321 291 23 59 -103 -247 -11 -103 -31 59 -82 -213 -46 73 100 15 120 238 179 8 -180 -93 102 -51 262
3344 262 -69 -71 -108 -102 -77 53 -68 195 -88 68 36 -116 -176 58 168 74 202 25 40 -72 54 -19 358 86
3368 86 27 22 -53 194 -33 -21 -123 -223 219 24 -32 184 115 42 -61 -8 116 -63 69 -28 110 7 -27 49
3392 49 -130 -57 15 -48 -138 27 -20 -80 -23 -114 197 -43 130 243 4 13 118 73 139 80 -8 -178 -38 8 -173
3417 -173 -1 -112 34 58 49 -65 -120 -80 -5 22 -4 -7 39 -67 -132 14 115 10 -31 256 2 -77 57 320 234
3442 234 87 149 -32 175 122 -5 202 21 12 -114 105 170 13 -113 -29 54 236 9 -74 15 223 -193 -32
3465 -32 155 -154 -366 184 -127 -38 82 -314 -423 -19 -71 -285 142 -84 -174 11 -90 69 38 -66 220 -88
3487 -88 147 -158 -10 -64 -61 -3 92 -9 104 -187 -119 -83 -2 128 -13 67 -29 -315 -29 242 -165 -71 99 57
$$ packed form
3321B91k68L6j62j44K36r2P2R0j41j31J67J19K7q5J05J18n9j71j88Q7J95j53L13
3344B62l31kl7OK5J30j21K63k83J56l2j52o0K34J10r4J28j77J5j12J26p3L77k72
3368H6n9np5K47k27J2j02j00M42j95n6K16o9p3j03N3J24j79J32r7J38j03l4P6
3392D9j79P3P2o3r0J65m7o0N7r1L11k40J73J13k39RJ05m5O6n9q8j70J40M6j81
3417a73J72j11J46K4rj14n5M0P5K7k6lM6j06o5J46J01j05m1K87k54p9J34K63q6
3442B34j47O2j81K07n3j27K07j81rj26K19O5j57j26Q4Q3J82k27q3Q9K08m16J61
3465c2J87l09k12N50l11Q9J20l96j09M04n2k14M27k26r0J85j01J59l1j04K86l08
3487h8K35l05J48n4LN8R5j01J13k91O8L6Q1J30j41Q0r6k86K86K71m07R4J70m2
$$ plain form
3511 57 -15 22 -140 79 -100 29 182 -80 145 11 58 -34 -17 8 -32 49 -12 31 159 -219 -147 45 57 68 -128
3536 -128 -66 36 -200 157 -48 -322 -65 -119 -122 -215 81 -159 18 137 38 63 186 67 -126 -59 -19 -66 -58 17
3560 17 69 -31 132 141 28 18 -89 -172 -90 140 -25 -185 12 -5 28 -8 -15 -139 -65 15 102 208 132 6 95 61
3586 61 -44 -41 -178 82 0 -8 101 -134 -97 38 -173 -28 -90 152 132 -182 116 62 36 -72 -392 43 50 -3 261
3611 261 52 91 -329 -16 -55 -13 -131 251 -112 151 20 167 177 61 70 -7 -148 -24 -171 -188 -220 49 -166
3634 -166 -83 -184 111 13 142 -253 105 128 21 126 -101 187 -69 49 263 404 -16 12 -66 53 -10 -3 30
3657 30 95 158 21 136 44 -106 -35 95 4 176 -189 30 56 -164 175 105 15 167 -107 148 373 -43 93
3680 93 -253 45 19 -32 166 -86 31 105 85 -21 57 -239 36 -73 22 -57 -182 -31 115 -13 183 63 113
$$ packed form
3511E7p2L7j62K19j79J29J53k62K25j34M7r2J7K5m0Q1o1M3J28l78P2J92J2J1j96
3536a28O2J02k36L57k05k74K57n4lr3K96k40J77J19r9K5J23j19j93O7M0m7QP5
3560A7N2j00J63Rj13j0j07q3Q2K30j65j60J97j7L3l6pj24P4Q0Q7J06p6j26Q9l4
3586F1j05Lj37K60q2qJ09k35L7J35k11J45o2K42k0l14K98n4k6j08l20M35Pn3K64
3611B61k09L9m20L13l9M2j18L82l63K63j31J47J0j16Rp7j41J24j47j7l2K69k15
3634a66Q3j01K95r8J29l95L58K3j07J05k27K88k56J18K14J41m20K8p8J19o3PL3
3657C0O5O3j37J15r2j50P1J30r1J72l65K19K6k20L39p0r0J52k74K55K25m16J36
3680I3l46K98k6n1J98k52J17P4k0j06P8k96K75j09R5p9j25J51J46j28J96j20N0
$$ plain form
3703 113 141 -80 -117 -209 -136 138 95 -78 -101 -242 13 -33 -22 18 -27 197 89 -86 159 179 -62 191 52 6
3727 6 -181 121 0 60 -37 174 -98 55 -131 136 93 -63 -70 151 158 -127 -63 -7 165 4 17 -58 84 -36
3751 -36 107 -25 -159 142 67 -25 -167 -244 -103 110 -18 102 47 -77 153 4 -83 -231 -86 137 -92 16
3773 16 -228 137 -145 37 -180 -171 109 -250 -259 87 117 -151 -72 79 54 -103 28 153 -19 13 51 64 134 40
3797 40 -116 187 138 -74 28 -51 31 4 -67 -39 -139 207 85 -168 -150 43 7 -104 19 170 133 -276 72
3820 72 -68 -18 138 -235 -198 138 -327 -116 -160 -122 -24 29 341 -3 250 -213 27 -144 58 -136 101 42 25
3843 25 -288 -231 -56 -15 -251 402 -61 332 -25 -44 129 -2 -24 57 177 -12 -30 -240 8 -135 -32 -29 161
3866 161 -86 64 -95 -33 -51 -12 183 169 132 78 30 -7 72 88 -41 311 129 -165 -265 -109 -145 -309 -107 127
$$ packed form
3703A13K8k21l7r2P3K74m3j73k3j41K55m6J1M0m5K24j08j75K45K0k41K53j39m6
3727Fj87L02j21O0r7K11k72J53j86K67m3j56pK21Pk85O4N6J72j61J3p5J42j20
3751c6J43j32j34L01p5r2j42p7J41K13j28J20n5j24K30j49q7j48J45K23k29J08
3773A6k44L65k82J82k17RK80l59rL46L0k68P9J51k5j57J31J25j72L2L8J3P0r4
3797D0j56L03m9k12J02p9Q2k7p1K8j00L46j22k53J8J93l6j11J23J51l7m09L48
3820G2j40N0J56l73L7L36m65K11m4L8R8N3L12l44K53m63K40j71K02j94K37n9j7
3843B5l13N7J75M1k36O53m63L93l57j9J73j31k2Q1J20j89j8k10K48j43J03LJ90
3866A61k47J50j59O2j8L9J95j4l7n4m8l7P9J6j29L52j82k94j00J56l6j64K02K34
$$ plain form
3890 127 -44 113 -173 -41 13 -39 -54 33 169 137 101 -75 0 116 -39 75 38 73 -216 38 104 205 -168
3913 -168 -9 -244 -93 302 250 16 -161 45 -157 35 -48 -38 -6 24 95 198 -170 149 -157 175 79 30 -27
3936 -27 58 104 149 294 -104 -38 23 -20 121 97 -7 -77 -224 148 408 60 -253 14 -112 96 -103 62 201
3959 201 -123 140 -207 250 80 -291 178 -136 -269 -25 75 -21 8 -15 -24 -70 23 -184 -109 -36 70 -3 229
3982 229 -74 115 -23 -218 -7 -37 -163 85 116 31 -40 -51 -19 -316 -158 -134 -72 77 169 20 -127 -120 3 -96
4006 -96 -190 354 -81 -23 -45 -100 -266 61 -157 -135 -93 120 169 -146 -62 176 -156 159 46 -2 170 7 227
4029 227 -53 -65 -154 -52 -1 98 -10 4 184 121 12 194 143 -94 -25 59 47 -73 -110 340 103 -22 -15 -191
4053 -191 -60 -71 -70 108 59 219 67 36 -15 12 -55 -47 104 -18 82 -166 42 -45 -39 88 -43 1 -1 82 8 -217
$$ packed form
3890A27j71J57k86J32N4n2j5Q7J36l2l6j76P5J16j55J14l7L5k89K54O6J01l73
3913a68J59k35J51L95n2k34j77K06k02J92q3J0L2L0P1J03l68L19l06L32r6m9n7
3936b7Q5M6M5J45l98O6O1m3J41k4j04p0j47L72K60l48l13K67j26K08j99J65J39
3959B01l24K63l47M57j70l71M69l14j33K44J00r6K9k3rm6R3k07P5P3J06p3K32
3982B29l03J89j38j95K11l0j26K48L1q5p1j1L2k97J58K4O2J49R2j49j47PJ23r9
4006i6r4N44m35N8k2n5j66L27k18K2M2K13M9l15Q4K38l32L15j13m8J72j63K20
4029B27k80j2q9J02N1R9j08J4J80o3j09J82n1k37O9Q4j2j20l7M50k37j25Pj76
4053a91J31j1JJ78m9J60j52l1n1K7o7QJ51j22J00k48K08q7OJ27j31M4kQ3p4k25
$$ plain form
4079 -217 -39 -237 -115 -97 65 73 176 102 11 106 194 168 -145 52 5 86 -88 106 27 -221 50 -56 27 72
4103 72 25 34 42 154 106 73 -249 -88 -37 -167 88 -80 165 91 151 143 239 44 -171 -142 -65 218 57 -19 124 61
4129 61 -21 -23 19 -177 -59 3 -205 -61 78 175 211 103 -36 218 -87 224 52 89 -68 277 186 -204 102
4152 102 -35 -151 347 86 -198 -41 -131 -62 48 134 -139 -140 148 53 -53 -42 50 -25 22 166 104 -47 137 42
4176 42 -196 76 64 -92 205 -33 -58 -58 262 105 -12 81 -150 -6 -130 108 -110 69 70 235 132 290 20
4199 20 200 17 -91 210 63 110 103 208 -250 62 -32 200 -47 57 -22 -215 56 146 -251 -114 167 62
4221 62 4 -177 -8 -122 13 15 -53 164 155 144 55 10 86 -31 -206 -137 126 -90 6 142 -114 23 -72 130 -109
4246 -109 179 266 38 103 75 -42 128 195 -66 -62 38 326 -207 91 -18 -89 152 -313 30 -73 219 57
$$ packed form
4079b17J78j98J22J8J62QJ03p4r1R5Q8k6l13J97m7Q1j74J94p9k48K71j06Q3M5
4103G2m7RQJ12m8l3l22J61N1j30K55j68K45p4O0qR6j95k15K9P7K83j61p6J43o3
4129F1q2kM2j96J18O2k08J44J39R7L6j08j39K54l05L11j72L7j57L45r1l90L06
4152A02j37j16M98k61k84J57r0O9J10Q6k73jK88r5j06J1R2p5M7J44o2j51J84r5
4176D2k38K72j2j56K97k38k5%L20j57j17R3k31J44j24K38k18J79JJ65j03J58k70
4199B0J80j83j08L01j47M7pJ05m58L12r4K32k47J04p9j93K71R0l97J37K81j05
4221F2n8j81J69j14J35Ko8K17rj1q9m5P6j17j75O9K63k16R6J36k56J37r5K02k39
4246a09K88Q7k28O5k8j17J70O7k61MJ00K88n33K98j09p1K41m65L43j03K92j62
$$ plain form
4268 57 -132 38 151 -284 65 46 -65 53 7 -174 85 175 -51 -53 -185 68 -79 147 180 -137 236 148 93
4291 93 51 80 87 -70 119 -166 -95 -213 63 50 40 -30 -36 248 158 111 -42 -35 -36 -180 -24 130 147 19 237 224
4317 224 97 13 -181 118 -4 -136 -68 152 -171 24 -98 -181 142 3 162 23 58 -107 -197 129 20 113
4339 113 -115 -20 5 118 -56 38 33 34 154 -58 -198 -150 -249 5 208 213 -11 175 -99 -321 -57 19 -41 -203
4363 -203 126 -18 -205 161 -71 28 19 -87 -45 -14 -139 50 92 48 22 353 145 -59 21 -34 -75 138 -199 60
4387 60 -55 -242 76 -92 264 -137 -75 -171 81 -20 -145 40 -238 -79 -97 80 111 -118 -8 -131 48 -128
4409 -128 -166 -61 -36 -237 -107 -140 -5 -32 19 96 81 210 -21 23 121 56 -72 -70 162 77 -74 -161 -208 -172 -179 -101
4435 -101 -33 -161 218 97 236 66 303 -228 46 29 53 -166 99 117 4 -63 -138 -13 -27 112 -63 86
$$ packed form
4268E7j89J70J13m35L49j9j11J18m6j81K59R0k26kj32K53j47K26L3l17L73q8n5
4291I3m2K9Pj57J89k85P1j18K76j3j0p0oK84r0m7j53Pjj44J56J54J7j28K18j3
4317B24j27q4j94K99j22j32O8K20l23J95j22q3L23j39J59j39L5j65r0L26j09R3
4339A13k28R5K5J13j74R4nJJ20k12j40M8r9K54K03Nk24J86k74k22K64P6o0j62
4363b03L29j44j87L66k32R9rj06M2L1j25J89M2m4k6L31k08k04Q0n5m1K13l37K59
4387F0j15j87L18j68L56m01O2r6K52j01j25J85k78J59j8J77L1k29J10j23J79j76
4409a28l8J05K5k01J30l3J35k7N1P7j5J29k31M4R8o5j28KK32q5j51q7m7L6pP8
4435a01O8j28L79j21J39j70K37n31K74j7K4k19K65J8j13o7p5J25j4J39j75J49
$$ plain form
4457 86 -60 138 62 57 65 29 -171 -44 -24 -2 -11 -281 -43 63 53 -102 -26 -212 20 -219 49 225 114 114 71
4482 71 94 183 -58 -65 -206 165 -17 -11 34 100 66 58 -68 161 -11 -120 -239 115 -27 47 34 176 -54 42 -121
4507 -121 -76 68 90 141 -1 29 -41 125 151 29 203 -93 111 -219 -234 -22 -165 -41 174 10 79 -7 -169
4530 -169 -109 -36 31 164 -31 165 138 59 171 128 -218 38 -91 190 -59 -92 182 60 -53 -28 -250 -89 -187
4553 -187 -126 -186 -205 -327 24 341 49 1 -142 46 117 70 3 95 65 19 -277 208 -184 57 -62 66 105 -44
4577 -44 -134 -56 -121 17 -49 -71 107 -24 -204 74 163 2 -134 90 -93 -103 -117 120 256 -13 329 15 27
4600 27 121 -53 132 -69 -58 110 226 -104 -2 181 87 -40 52 -53 -41 -62 -246 23 -5 140 -36 -39 -58 269
4624 269 -4 -20 -164 -184 57 149 -104 79 -187 90 -123 -42 217 -112 -73 13 184 -36 -192 -228 59 -14 66
$$ packed form
4457H6j46J98p6nQl6k00J27K0K2rk70K38J06j0j55P6j86K32k39K68J76j11%m3
4482G1K3Q9k41pj41L71j82OM5O6l4qj26K29j72j09j19L54j42P4j3J42k30R6j63
4507a21M5J44K2N1j42L0p0J66K6j22J74k96K04l30j5K12j43J24K15j64O9q6j62
4530a69O0P3O7J33j95J96k7p9J12m3l46K56j29K81k49l3K74j22j13K5k22J61r8
4553a87O1o0j9j22L51L17k92m8j43J88P1m7o7R2l0m6k96M85l92K41j19J28L9j49
4577d4r0P8o5J38o6k2J78j31j80K78Q9j61j36K24j83j0j4K37J36k69L42l14J2
4600B7R4j74J85k01J1J68J16l30J02J83r4j27R2j05J2k1j84K69k8J45j76lj9L27
4624B69k73j6j44k0K41R2k53J83k66K77k13Q1K59l29L9Q6J71k20j56l6K87p3Q0
$$ plain form
4647 66 206 116 301 42 -62 112 0 -162 -58 197 -172 -210 -99 -172 -109 -169 119 103 -45 -62 43 -26 136
4670 136 -10 -188 134 -45 -155 304 257 -16 51 -39 27 203 -133 273 348 -38 -42 22 68 -232 -47 -14 293
4693 293 77 -12 34 -8 275 -291 14 184 -173 187 -132 -117 -46 -119 110 -91 -91 27 -65 -247 295 -130 156
4716 156 -45 -20 -230 -46 -27 304 -7 -167 108 92 -32 -68 183 -123 194 229 -83 19 222 -133 67 -136
4738 -136 349 220 -9 99 -78 8 -274 21 -26 174 182 -89 -379 -138 -74 -32 -255 -13 105 41 13 -59 -105
4761 -105 14 51 200 88 130 93 63 88 129 71 -51 130 232 -36 63 -20 -54 -57 -13 38 150 60 58 -13 283 -8
4787 -8 38 -118 95 13 35 165 2 36 -73 -207 -16 -73 -1 -3 101 122 8 -171 103 67 -16 326 -134 189
4811 189 52 221 -217 201 100 -38 -33 -177 41 -40 -222 -141 42 80 107 91 205 -36 258 -24 -121 35 98
$$ packed form
4647F6J40r0J85k59j04J74j12j62J04K55l69l8J11p3O3o0K88j6j48j7J05o9J62
4670A36j46j78L22j79j10M59m7k73O7r0O6J76l36M06P5l86mO4M6l00J85L3L07
4693B93k16q9M6m2K83n66L05J70l57L60l19J5P1p3K29k01%J18r2j82N42m25K86
4716A56k01K5k10J84J9L31l11j60K75j6j24l6K51l06L17L5l12J02K03l55K00k03
4738a36M85j29k29J08j77Q6k82K95m7K00Qk71k90K41O4M2k23K42J18o4k8p2m6
4761a05J19L7J49j12M2l7l0K5M1n8j22J81J02k68R9q3l4lM4N1J12r0kp1K96k91
4787hM6j56K13q2K2J30j63L4j09j34J91n7P2kJ04K1j14j79K74l6q3L42m60L23
4811A89j37J69m38M18j01j38Nj44K18q1j82Q1J83L8K7j6J14k41K94k82r7J56O3
$$ plain form
4834 98 165 184 196 32 123 111 8 -82 43 -191 -138 -87 169 -204 117 154 -107 178 -30 -72 -207 -101 -9 68
4858 68 391 -163 22 141 -11 66 -85 75 -7 -95 -157 -76 -120 58 -69 -245 49 -38 -90 13 68 20 -124 97
4882 97 -155 -31 -37 41 -101 -17 161 197 -119 -89 -279 -147 105 149 -120 -247 -170 -41 47 119 96 -165 -29 -104
4906 -104 -41 -26 18 -138 160 -145 171 -15 63 -120 44 43 34 3 17 40 88 -47 178 -37 -155 -140 -101 -155 -150 66
4932 66 12 -56 -95 51 -65 81 212 -155 184 32 63 -100 -24 -50 8 37 273 240 210 39 7 -69 26 -84 144
4957 144 -110 -90 -95 77 113 -23 9 -144 273 101 271 -6 -66 97 -24 176 196 -225 123 -69 60 164
4979 164 -29 1 35 -19 -48 -36 -16 48 -64 11 48 161 64 -113 3 244 24 30 -37 -222 92 -233 -125 -29 31
5004 31 35 -147 23 -9 40 118 -64 24 -197 -49 143 91 -148 55 -34 255 84 -217 -140 -170 -181 164 2 -250
$$ packed form
4834I8O7J9J2j64R1j2j03r0J25k34N3N1K56l73L21L7k61K85k08m2j35J06R2P7
4858F8L23n54J85J19j52P7j51J60q2q8o2Q1m4J78j27j76K94q7n2J03N5m8j44K21
4882I7k52J24oP8j42Q4J78L6l16L0j90J32K52M4k69j27P7J29Q8P2k3k61J36p5
4906a04O3J5M4j56K98l05L16j86P8j83J64jrl1J4K3M8j35K25k15j18J5L9n4NK16
4932F6n4o8l9J46j16J46J31l67L39j52L1j63P6k6N8K9K36l3l0j71l2p6R5j10K28
4957A44k54K0nJ72L6j36L2j53M17j72J70k77o0J63j21K00K0m21L48j92J29J04
4979A64j93L0L4n4k9J2K0O4j12P5L7J13r7j77J16K41k20Oo7j85L14l25J08R6O0
5004C1Mj82J70l2M9P8j82Q8k21J48J92n2k39K03q9K89j71l01P7l0j1L45j62k52
$$ plain form
5028 -250 27 40 106 75 -94 155 104 -104 265 -201 57 -96 195 57 -130 -89 187 -173 5 34 149 215
5050 215 -195 10 -339 163 109 -37 175 -39 101 187 -61 134 53 -121 -32 -31 222 98 288 -180 149 5
5072 5 157 46 -203 157 -207 159 3 -112 54 47 -277 51 -25 152 144 -52 75 -31 111 -143 78 -70
5094 -70 97 82 -4 72 -204 -76 -187 -311 -80 173 59 -60 -161 129 36 -183 -33 4 122 159 57 194
5116 194 -76 35 -85 -78 -105 -188 -157 -41 -126 11 45 -68 -47 50 158 -128 -50 -98 41 31 -230 8 183 -62
5140 -62 -71 157 24 -29 36 144 -64 -201 122 -78 -52 -76 -155 192 -15 -4 230 -92 -132 -51 45 52 -57 -102 -211
5165 -211 -20 65 -69 157 141 -11 13 -90 -99 -91 -13 -73 92 -58 -54 -109 -118 7 123 -273 137 -39 113 -68 88
5190 88 -20 72 -63 131 -7 105 6 -13 61 -73 152 175 59 -22 128 -221 -57 -31 -51 183 38 -40 58 -10
$$ packed form
5028b50K77J3O6l1j69K49n1k08L69m66K58j53K91j38j87M1K76l60J78K9J15O6
5050B15m10K05l49N02n4j46K12k14J40Q6k48J95q1j74Q9JK53j24J90m68L29j44
5072EJ52j11k49L60l64L66j56j15J66pl24L28p6J77qj96J27j06J42k54K21j48
5094g0J67j5q6P6k76J28j11j24K31K53j14j19j01K90r3k19J50L7J18L7j02J37
5116A94k70J11j20Pk7q3L1J16q5J37L4j13K1R7J08k86P8m8J39j0k61K38J75k45
5140f2rK28j33n3O5J08k08j37L23k00K6k4p9L47k07J1K34l22m0Q1R6Pj09m5j09
5165b11J91Q5j34K26j6j52K4j03rQP8o0J65j50Mn5rJ25J16l96M10j76J52j81J56
5190H8j08R2j35J94j38J12r9j9P4j34K25K3j16q1J50l49J64K6k0K34j45p8R8o8
$$ plain form
5214 -10 -129 -227 129 -63 53 168 -150 118 259 89 -111 43 -63 -38 -39 24 86 40 -44 40 128 -116 145 176
5238 176 70 198 -68 6 47 38 -57 -124 122 128 -30 18 117 -60 262 -10 -104 -142 123 -80 -170 -84 70 -291 255
5263 255 -16 -299 -70 135 62 -53 -29 -182 8 -95 102 -96 -213 -131 19 111 65 -14 353 161 209 -87
5285 -87 101 119 -231 97 27 111 -131 -254 163 -129 108 28 -108 93 37 -121 140 204 -47 -174 268 55
5307 55 -210 -151 163 -213 28 186 -48 235 -262 106 -142 83 -355 40 -142 -46 -23 -98 160 22 -209 -59
5329 -59 -179 60 165 -124 -62 24 -143 10 -159 18 -172 -202 165 -50 17 -172 67 -49 -92 43 137 -88
5351 -88 10 -76 100 117 14 88 -143 245 55 -145 52 39 204 -83 161 128 61 -75 -16 220 -53 111 64
5374 64 41 39 -115 46 150 -163 -57 -194 -3 297 -68 -172 -138 -87 24 146 130 -199 239 246 105 -171 93
$$ packed form
5214a0j19r8L56j92J16J15l18K68J41j70k00J54j06K5jO3O2m6q4Q4Q8k44K61L1
5238A76j06J28k66P4M1rr5o7K46Oj58M8R9j77L22k72r4l8K65k03r0Q6J54l61N46
5263B55k71k83K29K05p3j15K4j53J90j03J97j98j17Q2J50R2m6p9L67j92M8k96
5285h7J88J8l50L28p0Q4k42j23M17k92K37q0j36K01n6j58K61O4k51j27M42k13
5307E5k65N9L14l76K41J58k34K83m97L68k48K25m38L95j82R6K3p5K58j38k31J50
5329e9j20K39J05k89O2Q6j67J53j69J77j90l0L67k15O7j89K39j16m3J35R4k25
5351h8R8q6J76J7j03P4k31L88j90k00J97j3J65k87K44l3o7j36N9K36k73J64m7
5374F4k3kj54J61J04l13J06j37J91L00l65j04L4N1J11J22j6l29M38Pj41k76K64
$$ plain form
5397 93 -3 -147 -134 28 130 -36 16 9 17 42 27 -220 120 118 -105 76 -26 -134 -148 -1 -55 21 70 -62 215
5422 215 128 166 50 -33 -40 150 121 -88 -173 191 -17 -19 143 108 -167 -81 261 -42 5 -46 -208 -53 -253 159
5446 159 42 95 259 -79 -41 -107 269 102 153 65 120 52 -54 -145 120 -144 81 -111 166 306 94 39 164
5469 164 230 61 181 29 -69 -176 194 73 -191 429 197 8 -72 -61 219 -40 -58 38 93 -123 -30 127 -167
5492 -167 90 -35 143 155 153 -165 444 -4 52 235 42 -38 157 40 112 -132 -48 -5 107 -153 113 105 -66
5515 -66 42 22 -156 113 -189 -148 99 -255 199 142 -37 46 145 -28 42 -67 -50 -76 40 -135 -9 58 46 -101
5539 -101 11 15 147 8 -28 231 29 41 75 72 -348 -93 -27 29 -16 14 -214 -83 425 216 281 271 176 178 58
5564 58 37 13 34 149 107 87 -72 101 84 -109 101 -10 33 -54 109 -190 70 -3 -64 161 -77 -66 -65 172 -82
$$ packed form
5397I3r6j44J3J62J02j66N2pQK5j5k47L40kk23J81j02j08j4J47n4P6M9j32K77
5422B15q7L8j16q3pJ90k9k09q5L64k08kJ62l5k75Q6L42l03M7n1j62J55k00M12
5446A59j17N3J64l38L8o6L76j67N1q8N5o8j06r1K65k64K25j92K77J40k12n5J25
5469A64O6j69J20j52r8j07L70j21k64O20k32j89q0J1K80k59j8R6N5k16R3J57k94
5492a67K57j25J78J2kl18O09m48N6J83j93q0J95j17P2k44Q4M3J12k60K66qj71
5515f6J08k0j78K69l02M1K47l54M54n7j79Q3R9j73P0j09J7k6J16j75J26O7j2j47
5539a01J12MJ32j39l6K59k02J2L4lm20K55O6N6m5L0k28J31N08k09O5j0r5Kj20
5564E8k1k4K1J15m2k0j59J73j7j93K10j11M3q7J63k99K60p3o1K25k38J1JK37k54
$$ plain form
5589 -82 -54 -44 -9 -43 140 48 -42 -116 -208 42 319 235 -141 -129 -19 60 171 151 -98 143 20 206 160 21 -192
5614 -192 -30 -39 -69 90 -108 41 -165 -48 -64 117 -8 99 193 -85 -311 -137 -115 124 136 50 -61 -206 -23
5637 -23 -195 -6 69 215 244 -53 -156 97 82 124 52 142 191 103 23 -131 18 109 -67 14 148 -5 126 -33
5661 -33 32 134 -35 44 -89 161 132 76 110 118 201 -32 -68 -34 120 -19 -226 -18 139 13 -1 -180 206 -21
5685 -21 209 59 87 144 -116 -161 66 -35 -79 187 -173 108 -59 144 172 207 -28 -147 31 60 1 20 26 -1
5709 -1 -38 97 12 146 -152 174 191 60 122 300 16 94 -133 29 183 229 158 98 225 -66 140 8 83 -37
5733 -37 -27 -158 -42 -163 -39 -120 269 46 -84 -79 156 -13 10 -85 -76 178 -105 23 -48 -65 169 152 15 -36
5757 -36 16 140 -198 -216 75 -98 170 -22 -22 -93 85 -85 201 -212 86 96 80 -26 117 176 384 214 -100
$$ packed form
5589h2K8J0L5l4J83r2r0p4r2K50K77q4l76J2J10P9J11k0k49K41j23J86m6j39k13
5614a92J62rl0J59j98J49k06J17j6J81j25J07R4k78k26J74K2K39J2q6j11j45J83
5637b3j72J89P5J46K9k97j03K53j5M2p2R0M9q8q0j54J49R1j76Q1J34j53J31j59
5661c3O5J02j69P9j33K50k9n6L4QQ3k33l6L4J54j39k07K08J57j26j4j79L86k27
5685b1K30j50K8N7k60m5K27j01m4K66l60K81j67K03K8L5k35j19J78K9n9J9Ok7
5709al7J35q5J34k98L26J7j31O2J78k84P8k27J62J54M6p1o0J27k91K06j32P5j20
5733c7J0j31J16j21J24q1L89k23j30NK35j69K3r5RK54k83J28p1j7K34j7j37n1
5757c6N2J24l38j8K91j73K68j92%p1J78j70K86m13K98J0j6j06J43N9K08j70l14
$$ plain form
5780 -100 68 -92 -54 -78 120 105 200 -131 50 -166 5 -65 279 44 -182 145 70 41 -95 -35 -108 82 -1
5803 -1 1 -15 200 34 68 -17 36 20 4 43 76 74 83 84 -60 64 -43 110 -105 190 -221 -156 66 50 138 -151 39
5830 39 120 -71 -210 131 103 12 109 36 -70 -1 11 64 34 83 244 -2 -29 24 82 3 -193 102 -128 -206 -76
5855 -76 -210 30 193 -177 -158 -24 -25 -207 145 41 -3 -309 -59 82 -109 79 70 -52 150 -160 -45 -265
5877 -265 -11 45 -111 -176 -134 -93 -6 -12 52 111 34 46 192 129 67 -57 -72 -29 -70 19 -112 69 42 -19 53 -173 72
5904 72 -21 39 116 -9 181 58 53 -44 102 61 -202 50 -91 84 -33 13 251 111 94 44 69 -116 -227 30
5928 30 35 127 -49 70 30 -232 191 -7 -87 21 -15 112 -80 -100 -249 -295 -23 -39 -140 -25 -57 -86 4 81 21
5953 21 -178 60 266 113 108 -282 -27 -64 47 152 182 -127 130 -123 -57 73 -175 -102 34 18 -88 -6 38
$$ packed form
5780a00J68j60L8k4J98j5R5l31J81k16J71p0L44k35k26L27p5k9j36O0p3J90q3
5803aKj6K15j66L4q5N3j6j6L9L3kRJj44J24j07J53k15K95m11O5K22j6Q8k89J90
5830C9Q1j91j39L41k8r1R7p3j06O9J2N3l0M9J61k46k7N3N8p9j96K95k30p8J30
5855g6j34K40J63l70J9J34jj82L52j04m4l06K50J41j91J88rj22K02l10J15k20
5877b65K54N6j56o5M2M1Q7oO4N9p7J2J46o3o2j24j5M3m1Q9j31J81k7o1P2k26K45
5904G2r3O0P7j25J90j23nr7J46m1k63K52j41J75j17M6K38j40j7n0K5j85j11K57
5928C0NR2j76J19m0k62M23j98q0J08l6J27j92k0j49m6K72j6j01J15l2k9R0P7o0
5953B1j99K38K06j53nl90K55l7J11J05L0l09K57k53O6J30k48P3J36j6j06Q2M4
$$ plain form
5976 38 -125 65 139 -199 164 94 266 -154 -166 -180 111 35 259 -188 57 41 64 -45 143 88 -48 -195 -86
5999 -86 -22 -109 97 27 -21 193 94 42 74 -106 97 26 145 186 80 -108 -43 297 -77 -151 -11 -62 -47 -140 -193
6024 -193 -73 141 -109 121 41 159 57 200 215 -46 74 -122 -123 -96 -78 81 -322 53 87 38 -284 20 278
6047 278 -13 96 -24 -235 -57 -171 -238 9 -2 13 -5 -97 -107 190 -97 -32 -155 100 -48 65 98 -214 -5
6070 -5 -210 213 163 -413 198 18 167 -186 98 -27 16 -147 -366 -183 -22 -107 2 147 40 -47 101 -150
6092 -150 11 -39 110 309 -38 195 76 67 45 -81 274 83 -77 166 -166 112 -9 -39 -225 152 -39 30
6114 30 83 57 -203 37 302 -10 -173 -47 -5 -44 -133 -100 -220 -6 -137 -144 136 -164 -160 176 66 72 37 -33 33
6139 33 20 -65 159 216 56 57 42 80 195 81 -116 -203 -70 92 -145 284 -27 73 44 -35 -34 -135 280 187 -193
$$ packed form
5976C8j63J90P4l38L63p0J72m20j2j4K91p6K24m47K45j6K3j09J88n5j36j47J09
5999h6O4q7K06p0m8K14r9n2L2j80K03p1J19M1j06j88O5L40l74p4J40n1J5r3n3
6024a93J20K14k50K30q0J18j02J43J5k61J20j96jK7J8J59m03L75L4m9l22L04K58
6047B78k91J09j20k11J78j14o7K47j1J5j8r2j0K97k87O5j23K55j48J13L3l12K09
6070ek05M23n0n76O11j80J49l53K84j25M3j63k19J83J61q5J09J45j07q7J48k51
6092a50J61n0J49J99l47K33j19rk2j26L55j91j60K43l32K78j21l0j86L77j91O9
6114C0N3k6k60K40K65l12j63J26M2l9q9L3j20K14j31pK80l00ML36j10Ol5p0O6
6139C3j3q5K24N7j60Jj5L8J15j14j97q7J33J62k37M29l11J00k9p9Jj01M15r3l80
$$ plain form
6164 -193 -150 7 -135 -157 9 113 292 8 -110 52 33 -44 30 108 115 94 235 -48 45 -95 22 105 -134 -37
6188 -37 25 133 164 -60 18 160 -158 -32 140 -24 -130 34 -217 95 57 62 114 -56 -195 -17 -69 93 61
6211 61 112 37 -157 63 -85 -80 -126 -29 -3 72 -49 90 -128 37 60 44 -229 2 16 65 -177 64 203 78
6235 78 56 -245 140 -262 -10 148 93 -21 -73 -89 -17 54 145 -30 -262 -14 -37 32 -99 254 -22 -25 142 -137
6259 -137 110 -75 148 -100 -100 -20 92 130 15 -1 147 162 73 98 -120 215 83 -42 41 -154 32 7 -290
6282 -290 -64 -213 124 -128 43 101 61 269 229 -3 -52 -120 48 -234 147 44 97 -133 -233 -6 -29 -195
6304 -195 -242 82 -56 109 -223 55 14 -126 101 -32 284 98 -57 122 13 115 -106 -54 0 -26 -53 102
6326 102 62 -124 -109 163 9 113 1 -84 123 -182 -2 -58 -11 -165 26 -47 -231 147 13 -155 -213 158
$$ packed form
6164a93M3J57j42k2J66J04J79k84j18J62j9p7P4P8Pk1J41k83R3j40J17Q3k39R7
6188c7O2J08L1k24P8J42l18J26J72j64j06J64k51L12l8NN2j70j39J78n2J62l2
6211F1N1p5j94K20j48Nm6R7K6P5j21J39k18J65K3j6k73K31J4M9k42K41J39j25
6235G8k2l01L85m02K52J58n5j14n2j6P2P1R1j75k32K48k3O9j31L53k76lJ67k79
6259a37K47j85K23k48%Q0J12L8j15j6J48J5q9K5k18L35j32j25Q3j95J86k5k97
6282b90K26j49L37k52J71N8m0K08m0k32m9o8J68k82L81j03N3k30j00K27k3j66
6304a95m7L24j38J65l32K78m1j40K27j33L16j86j55J79j09J02k21N2N4k6k7J55
6326A02m0j86J5K72j54J04j12q5K07l05J80n6M7j54J91p3j84L78j34j68n8L71
$$ plain form
6348 158 121 -123 -133 195 162 269 -30 -140 278 -38 53 -250 78 24 -16 212 -30 -387 -61 52 154 -107
6370 -107 107 3 179 -36 114 55 208 -179 -156 23 6 115 -164 132 -15 238 147 -36 10 -160 184 -20
6392 -20 -5 121 -212 -174 135 -176 117 122 -43 141 29 277 -175 102 87 105 113 -126 -136 -104 -91 -235 52 49 -191
6417 -191 118 -42 -188 73 -43 -115 17 32 -14 -60 -246 130 73 -59 43 -68 -106 -103 9 82 -49 82 -30
6440 -30 80 7 -105 65 116 -171 6 11 61 -141 -140 242 110 53 152 107 44 -23 24 61 35 207 71 183 -126
6465 -126 -31 -153 -87 -1 -125 40 -39 -151 50 -265 -209 41 42 201 30 -66 7 111 205 -37 -73 152 -40 30
6489 30 67 127 -99 -50 -76 -105 -13 64 -131 -145 -144 33 -249 37 8 150 101 75 -18 -219 23 -69 87 -47 105
6514 105 3 -217 18 107 -110 122 -98 149 -83 37 -2 192 143 -78 -151 18 -228 151 127 321 139 237
$$ packed form
6348A58l7k44j0L28l3J07k99j10M18l16R1l03L28n4m0K28k42l57L26J13J02k61
6370a07K14j04J76k15J50n9J53l87K3J79j7J09k79K96j47K53r1j83M6j70L44k04
6392b0J5J26l33L8L09l11K93Nj65J84j12K48m52K77j5J8Qk39j0L2J3j44K87lk40
6417a91L09j60j46K61j16p2J32J5m6m6j86L76n7j32J02j11l8LJ12P3j31J31j12
6440c0J10p3j12J70N1k87J77NN0k02JL82j32n7R9m5o3o7M7L7k6J72j36J12l09
6465a26R5j22O6Q6j24J65p9j12K01l15N6K50JJ59j71r6P3J04R4k42l6K25j92P0
6489C0L7O0k26M9k6k9R2P7j95j4JJ77k82K86k9J42m9k6r3k01K42r2J56j34J52
6514A05j02k20K35Q9k17K32k20K47k32J20l9J94m9k21p3J69k46L79k4J94j82R8
$$ plain form
6536 237 97 42 -79 -173 -16 3 89 -30 72 28 -52 -69 -58 134 70 -177 246 8 68 -4 51 -305 -96 29
6560 29 -119 45 -88 198 -56 78 -50 240 -104 -102 236 -156 -6 -162 -206 -182 209 106 -76 -126 21 -2
6582 -2 -42 -26 16 -9 15 226 130 -24 -74 52 50 -67 58 -175 5 92 -160 -25 4 3 -15 120 -189 -152 -79 47
6608 47 88 -20 -21 23 -185 -7 211 174 -126 -18 177 69 19 58 -57 187 36 116 -160 -109 -67 -94 -59 -301
6632 -301 -231 -171 -84 159 233 202 224 -82 -96 282 -254 65 -1 -332 43 -4 -53 -94 45 -90 81 -21 70 48
6656 48 147 12 -59 0 -52 -141 158 -95 -28 284 59 -70 104 27 -11 -242 -30 346 81 145 -27 142 -140
6679 -140 -59 171 212 -114 -22 -83 -179 -55 -26 -14 -19 125 -16 -84 -135 -258 -57 263 -266 71 -163 65 13 56
6703 56 175 168 266 129 -48 -36 122 -111 97 108 -62 21 -46 -125 -209 -42 -99 -9 -183 42 -31 -52 -222 -60 174
$$ packed form
6536B37j40n5j21r4J57J9Q6j19J02m4q0j7J1J92o4k47M23k38O0p2N5l56K09J25
6560B9j48J64j33K86k54J34j28K90l44KL38l92J50j56m4K4L91j03j82n0J47k3
6582bm0J6M2k5K4K11r6j54n0J26kj17J25k33J80Q7k52J35K9jj8J35l09L7P3J26
6608D7M1j08jM4k08J78K18l7l00J08J95j08n0L9j15K44j51Q0k76N1M2k7L5k42
6632c01P0O0Q7K43P4l1K2l06j4L78n36L19o6l31L75m7m9m1J39j35J71j02R1k2
6656D8R9j35p1N9n2q9K99k53O7L12k25j29J74p7l8k31K12L76k65O4j72J69k82
6679a40Q1K30M1l26R2o1r6J24K9J2nJ44j41o8n1j23K01L20n29L37k34K28n2M3
6703E6J19pR8j37j77J2J58k33K08J1j70Q3o7p9q4J67n7R0j74K25p3k1j70J62K34
$$ plain form
6728 174 290 -38 158 -51 -5 -101 70 -26 -7 -17 43 41 -1 -153 -90 -169 -116 75 -28 189 -176 -37 84 -342
6752 -342 -142 303 244 -158 53 -5 -366 92 111 -211 -67 178 102 -31 88 -193 90 109 114 264 -132 116
6774 116 132 -79 179 89 -46 46 -201 -105 -158 -184 -176 120 7 17 -255 -33 -52 -14 189 47 -163 -83 251 95
6798 95 37 -89 14 -127 -3 274 159 35 116 38 -103 -322 -10 2 86 187 -74 129 -138 146 216 208 -258
6821 -258 -20 239 -62 -17 -20 203 164 136 31 -270 -82 99 31 -125 262 83 27 -55 105 -112 -226 182 59
6844 59 230 14 44 -77 -95 -23 147 6 -133 27 -7 3 -215 -113 129 243 20 -134 78 20 -134 -266
6866 -266 -43 -133 -1 -153 -136 88 -23 31 35 -24 57 -197 217 23 -31 -106 35 346 72 11 -112 71 178
6889 178 -106 26 147 -273 -8 -97 -18 2 102 66 -122 -108 -156 -89 115 11 -111 -67 -194 93 92 132 249 3
$$ packed form
6728A74J16l28J96k09M6r6J71r6J9j0O0km2j52O3p9N3J91j03K17l65J39J21m26
6752c42K00M45n9m02K11n8l61M58J9l22J44K45p6j33J19k81K83J9NJ50l96K48
6774A16J6k11K58r0j35R2k47R6n3k6QK96j13J0k72K22j9L8K03j42k10Q0L34j56
6798I5n8j26J03j41J24K77j15j24Q1p8j41k19L12J2Q4J01k61K03k67K84P0qm66
6821b58K38K59l01M5lK23l9k8j05l01J88J81o8j56L87j79n6q2J60k17j14M08j23
6844E9J71k16L0j21j8P2J70j41j39J60l4J0k18J02K42J14k23j54K12n8j54j32
6866b66K23r0J32j52J7K24j11N4Mn9Q1k54M14j94n4p5J41L11k74o1j23J83J07
6889A78k84J32J21m20K65q9P9K0J00l6j88J4m8O7K04j04j22M4j27K87jM0J17k46
$$ plain form
6913 3 -159 -33 87 -178 -78 -51 -61 111 -54 27 260 -59 -221 -262 102 -194 -29 -76 -167 78 -17 35 28 -65
6937 -65 200 196 -81 222 54 104 32 -102 -69 33 -59 21 -31 197 99 166 193 43 -115 67 -188 131 -72 146
6961 146 -101 -14 108 -110 144 -107 8 76 -22 146 -94 -195 151 -189 143 -319 63 94 126 -215 -168 -192
6983 -192 109 200 48 -96 -87 -127 94 11 -122 -13 102 -35 147 -152 -91 10 164 101 270 -163 -230 -92 -238
7006 -238 -29 30 -20 -145 156 93 -72 123 16 90 -184 -54 -164 -13 5 129 136 -225 -119 92 176 78 -136
7029 -136 14 47 240 -53 -155 122 -8 -48 -69 85 -91 85 94 24 198 172 -84 79 -169 82 57 187 16
7052 16 -40 52 -169 112 -32 174 34 -99 -124 10 70 102 208 -6 33 -112 -36 -5 108 83 114 -113 -49 -229
7076 -229 -164 -6 -47 63 57 357 -129 85 -74 55 1 70 153 232 72 -40 -47 -30 -208 100 -40 -46 -92 -4 69
$$ packed form
6913Cj62J26J20k65J00K7j0J72j65Q1K33l19j62m1L64k96J65m7r1K45r5N2pr3
6937f5K65mk77L03j68N0p2j34L3J02r2Q0n2K28r8O7K7j50j58J82k55L19k03K18
6961A46k47Q7J22k18K54k51J15O8r8J68k40j01L46l40L32m62L82L1L2l41M7k4
6983a92L01R1j52j44Rm0K21q3j33J09J15j37J82k99O1J01J54o3J69m33o7J38j46
7006b38K09N9n0j25L01o3j65J95j07P4k74J30j10J51J8J24Pl61J06K11Q4r8k14
7029a36J50L3J93k93j02K77j30m0k1J54j76J76Rp0J74k6k56J63k48K51k5J30j71
7052A6n6R2k21K81j44K06j40j33k5J34O0L2J06k14L9j45P6L1J13k5L1k27O4j80
7076b29O5J58m1J10oL00m86K14j59J29n4O9Q3P9j60j12pJ7j78L08j40om6Q8P3
$$ plain form
7101 69 -42 46 188 -142 -196 128 263 -162 180 -7 -92 195 -63 120 -235 56 101 147 -108 -130 -180 -85 -227
7124 -227 51 71 29 -182 128 -86 -48 80 -117 35 -177 25 23 44 -69 114 -29 -75 9 42 228 202 107 109
7148 109 30 -48 60 116 -33 84 -31 58 -143 231 -167 61 -187 -75 -48 240 -99 -247 -7 186 -49 -176
7170 -176 -37 -298 -117 -151 -29 -183 -55 -26 18 110 5 -119 71 -17 9 -86 87 150 -129 75 -11 5 -65 85
7194 85 16 19 98 -30 -193 -14 306 -37 0 103 86 11 -171 82 108 -59 -27 -277 32 -82 -250 20 -124
7217 -124 60 157 -128 28 132 -82 -104 218 -114 -130 36 19 49 176 43 -171 20 75 -139 -40 5 -77 63
7240 63 134 -72 121 102 152 225 78 104 158 80 129 -10 263 -127 -3 39 -53 -43 103 -70 35 274 228 28
7264 28 196 95 -66 19 -71 124 336 -104 68 159 121 -14 0 -79 75 -9 141 114 -213 111 52 33 74 -32
$$ packed form
7101F9j11Q8J42l30n4L24J35m25L42j87q5K87k58J83l55K91M5M6k55k2n0R5j42
7124b27K78K0m2k11L10k14L8J28j97J52k12K02kK1j13J83j43m6Q4L3J86k6r5K
7148A09p9p8J08N6j49J17j15Q9k01L74l98K28k48J12K7K88l39j48K40J93k35j27
7170a76J39k61J81l4J22j54J28K9M4R2j05j24J90q8K6r5J73O3k79K04q6J6p0J50
7194H5o9LP9j28j63J79L20l43L7J03j7p5j82K53K6j67L2k50L09j14j68K70j44
7217a24J84R7k85J56J04k14k2L22l32j6J66j7L0J27j33k14J91N5k14R9M5q2J40
7240F3P1k06J93j9N0P3j47K6N4p8M9j39K73l90J24M2r2J0J46j73J05K39m6k00
7264B8J68j01j61Q5r0J95K12m40J72R1l8j35J4p9J54q4J50k7l27L24n9j9M1j06
$$ plain form
7288 -32 -240 -9 50 21 78 41 -210 -185 -169 -147 20 -56 -205 176 -128 217 102 360 77 -111 -42 63 26 248
7312 248 157 275 -29 -3 30 73 118 -41 -150 -98 46 -2 112 -242 -5 120 -191 103 -136 25 67 2 14
7335 14 -33 159 90 203 -166 -73 -95 70 268 9 -190 112 -133 -64 -50 53 290 52 53 -11 131 6 -92 87
7359 87 -86 -134 -69 -128 121 64 8 96 -73 -29 114 136 9 178 -182 -29 -24 -109 -71 -123 38 -74 111 120 203 176
7385 176 240 102 104 -90 129 258 -53 -35 12 -55 -3 -14 -281 111 2 -31 31 88 -117 127 35 -269 -54 -233
7409 -233 114 312 -91 284 78 45 296 80 -36 73 132 28 -54 -175 -119 74 -64 -8 -11 95 147 -74 -23
7432 -23 -152 -27 284 -52 -91 288 -181 -125 171 107 90 33 -57 189 14 -287 9 -87 -99 47 -195 16 73
7455 73 2 128 108 -225 -123 236 23 23 90 -69 117 -101 11 61 -26 17 76 99 -23 -149 103 -82 -28 60
$$ packed form
7288c2k08K31N9k9N7l7k51K5J6K2J67p6j49L81l04L45j15K58k83j88O9J05l7K22
7312B48r1J18l04K6L3M3M5j59j09N2J44m8J14l54K37J25l11K94k39J61M2o5J2
7335A4m7J92o9J13l69R3k2J65J98k59j99L02k45O9J4J03K37k38Jo4J42j25r8J79
7359H7j73m8O5n9K49n7n6Q8j69M4J43K2j27J69l60J53Nq5L8n2J61j12J85RQ3k7
7385A76O4j38Kj94K19J29l11J8M7o7N2j1k67L92j09l3O2N7k05K44r2l04K15j79
7409b33L47J98m03L75k06l3K51k16j16J09N9j04q2j21N6J93j38N6lJ06N2k21N1
7432b3j29J25L11l36l9L79m69N6K96o4j7n7r0K46j75l01K96r6j2J46k42K11N7
7455G3p1J26k0l33J02L59k13%O7j59J86k18J12N0q7M3N9K3j22j26K52j85N4Q8
$$ plain form
7479 60 -149 -84 185 -116 175 181 0 223 -20 -34 99 73 61 -184 70 123 147 217 295 230 0 123 -122 13
7503 13 232 -56 186 -77 -111 84 -158 132 -71 50 11 134 31 91 159 -34 -29 121 -158 -42 -15 153 -50
7526 -50 140 -78 75 68 -158 114 98 142 171 -37 28 144 -2 115 -82 41 -20 -150 31 -127 214 -133 159
7549 159 120 -100 106 -64 -238 43 -18 -71 -36 77 117 124 -62 43 177 -102 137 46 205 -184 21 13 126
7572 126 -140 133 8 -69 100 -9 -27 0 -182 65 -29 -224 209 -21 152 57 138 -44 5 198 83 -181
7594 -181 80 62 115 -71 -38 41 21 78 92 61 -70 -80 -184 86 -49 -32 58 90 12 -79 42 -122 109 82 -4
7619 -4 56 4 -100 35 -12 -10 -30 94 57 115 -91 264 13 113 90 127 280 -119 -129 140 86 -3 -17 254 -169
7644 -169 -238 119 -369 6 -38 158 157 -102 -47 35 98 35 -89 -115 215 -61 -147 14 151 98 -16 -98 87 -80
$$ packed form
7479F0k09O5K69l01K91Oj81K23k43j4J33k6j2k45K54N3K4P0P8o5k30J23k45J35
7503A3K19k88K42k63l4J95k42K90k03J21l9J23j03O0O8j93NJ50k79J16K7J68k03
7526e0J90k18J53pk26K72j6M4K9k08O5J16j46J17j97J23o1j30J81j58L41l47K92
7549A59l9k20K06j70j74K81o1n3L5J13M0Pj86J05J34k79K39r1J59l89K05qJ13
7572A26k66K73j25p7J69j09j8K7j82K47r4j95M33k30J73r5Q1j82M9J93j15k64
7594a81K61j8N3j86L3P9k0N7J4l1j31j0j04K70j35J7R0L2p8r1J21j64K31k7q6
7619dO0n2j04J35m7Kk0J24l7N8k06L55k51J00k3L7J53l99j0K69n4q9j4K71m23
7644a69o9L57m88L75m4J96jk59N5Q2O3o3j24k6L30k76q6J61J37n3j14q2J85j67
$$ plain form
7668 -80 27 -189 -220 -60 -278 -54 108 46 -185 152 25 -34 -96 -12 2 43 121 187 181 248 -88 -8 -102 -32 97
7693 97 -42 -58 378 38 -83 12 95 86 -306 -162 -234 173 9 -25 204 10 -158 -102 -163 -12 -7 -202 164 123
7717 123 -103 153 -10 77 -127 -167 166 207 52 -129 136 58 -86 -220 73 150 -31 28 -13 -111 -59 66 -127
7740 -127 -73 280 -33 142 159 49 -95 24 2 66 29 -141 169 149 -13 167 16 104 44 -73 55 265 -56
7763 -56 -44 388 186 102 -53 124 -42 -158 141 42 39 226 -22 192 49 77 76 182 189 -217 -59 -59 -35 217 56
7788 56 -137 74 -199 -303 -167 116 44 -66 23 -224 -27 -131 40 282 84 -40 11 -159 29 19 128 113
7810 113 -105 -186 43 -57 -89 188 32 64 42 52 -118 -81 101 179 27 57 -39 -205 -93 -68 -12 129 114 220
7834 220 -63 -114 46 -105 -113 89 12 84 355 -175 -4 204 87 -146 -169 41 77 -112 -44 -219 -207 65 118
$$ packed form
7668h0J07k16l1J60k18K24J62o2k31L37j27n9o2Q4J4M1P8O6oO7l36Q0r4P0J29
7693I7j39j6M36l40j21R5Q3rl92J44p2M07j64l4K29j94j68N6o1J51Nj95L66m1
7717A23k26K56j63Q7k04m0L33M1j55j81K65p8j44j34K93P7j81N9m1r8N2J25j93
7740a27N4L53l13J75J7j10j44J19k2O4l7j70L10k0j62J80j51Q8o0j17J28K10l21
7763e6J2M32k02q4j55J77j66j16K99r9lJ87k48K14j43K8jJ06Pm06J58%K4K52j61
7788E6j93K11k73j04J36K83p2j10Q9k47J97j04J71K42j98j24N1j70J88j0J09j5
7810A13k18q1K29j00l2K77j56L2k2J0j70L7J82P8j52L0r6j66J12K5N6J41j5J06
7834B20k83n1J60j51qK02p7P2K71n30J71K08j17k33k3K10L6j89O8j75J2K72N3
$$ plain form
7857 118 73 89 102 155 53 -49 -150 154 -17 -48 -36 -373 -119 139 -34 222 298 -50 -213 65 24 55 -39
7880 -39 -115 -208 45 -2 173 -141 62 12 44 -133 -125 -160 30 103 33 -44 -61 -100 194 95 -70 145 65 490 -112
7905 -112 -183 87 141 -204 -70 -18 74 60 316 -30 150 6 -114 254 -8 81 -16 -81 -62 -136 -131 -205 17 -72 -266
7930 -266 94 -110 25 -406 -46 203 -85 -47 -125 120 155 -148 51 16 119 175 283 138 106 213 19 -50
7952 -50 -30 64 -36 193 207 206 5 10 21 32 132 -126 88 -20 -116 -201 -187 214 125 125 11 26 -118 -108 100 -9
7978 -9 17 -92 320 3 72 -117 -55 306 -5 -287 -177 -175 269 253 -172 -263 -142 19 195 -8 133 75 -100
8001 -100 -282 -129 -59 -208 24 -177 195 194 -104 183 100 -27 -27 153 96 35 -38 -67 8 357 -239 -84 25 28
8025 28 154 136 113 -37 11 174 21 -21 -25 -35 -41 -25 -9 327 -186 61 138 206 -24 -103 318 -33 -145 -79 -58 4
$$ packed form
7857A18m5J6J3N3j02j02j01L04j71l1J2l37K54K58j73K56P6l48j63K78m1L1r4
7880c9p6r3K53m7J75l14K03n0L2j77Ql5J90P3p0p7j7l9K94r9j65K15q0M25o02
7905a12p1K70N4l45J34N2R2j4K56l46J80j44j20L68k62Q9r7o5J9p4Np4K22q9j94
7930b66L60k04J35m31L60K49k88L8p8K45L5l03J99l5J03N6J08j45l2J07j94o9
7952e0K0R4j00K29J4jk01NJ1J1J00k58K14j08r6q5J4M01q9%j14J5j44J0K08j09
7978iK6j09M12l17O9j89O2L61l11k82J10KM44j6m25r1J21J61J76k03J41n8j75
8001a00j82J53P0j49K32k01L72jk98K87q3j27%J80n7o1p3k9P5L49n96J55J09L
8025B8J26j8k3j50M8J63j53m2mj0oJ6J6L36n13K47P7O8k30p9M21l51j12O6K1O2
$$ plain form
8051 4 -252 161 228 -127 143 83 14 -57 -190 -13 -17 -149 50 38 -138 127 22 -44 -111 -52 -91 -107 95 75 -59
8076 -59 -13 11 267 -135 -2 51 37 -182 79 -45 170 25 80 118 7 -199 -209 203 -61 83 39 69 110 22
8100 22 -18 198 -89 295 -169 26 -94 157 7 -65 -22 -133 221 -97 -294 29 -21 -204 134 -53 -35 -41 99
8123 99 -174 63 -11 -153 37 -3 -42 29 -232 -115 -44 -267 -191 -16 211 36 64 -145 70 3 -264 -28 30
8146 30 145 -31 25 -191 -5 31 -146 -82 65 -6 -87 -111 51 -33 157 -1 45 -100 25 -252 -46 86 -62
8169 -62 243 -117 -22 77 -137 -290 20 -40 99 -39 -28 155 -185 -75 75 -59 213 -49 85 130 196 -42
$$ packed form
8051Dk56M13O7l55K70o0o9p1j33J77mj32J99j2j76K65j05o6o7N9l9j6K02k0j34
8076e9M6K4K56m02J33N3j4k19K61j24K15j45N5L8j11k06j0M12k64J44m4L0M1q8
8100B2m0K16k87L84m64J95j20K51j50p2M3j11L54l18j97L23n0j83L38j87J8oJ40
8123I9k73K37p4j42J90m0l9P1k61J17P1k23P6J75K27j75K8k09K15o7k67K36N8
8146C0J15j76N6k16J86L6j77O4J47p1q1k4J62q4J90j58M6j45J25k77K06J32j48
8169f2L05l60R5R9k14j53L10o0J39j38J1J83l40J10J50j34K72k62J34M5O6k38
8191d2
$$ Imaginary data points
##PAGE= N=2
##DATA TABLE= (X++(I..I)), XYDATA
$$ plain form
0 0 0 0 0 0 0 0 0 0 0 0 0 0 8 -8 8 -8 8 -16 16 -24 24 -32 32 -40 48 -56 64 -73 86 -97 111 -126 142 -162
34 -162 182 -203 228 -256 283 -315 354 -391 432 -479 530 -585 642 -709 779 -860 947 -1044
52 -1044 1151 -1271 1407 -1563 1738 -1943 2185 -2473 2825 -3265 3836 -4598 5682 -7334 10141
67 10141 -15790 31492 -164523 -523768 37614 374386 21845 -215918 44227 163222 -16183
78 -16183 -113829 -23157 46615 89449 89769 -30045 -170695 -77493 155216 160559 -72026 -115612
90 -115612 75876 95429 -77622 -57550 100911 76363 -28629 -16175 -40158 -94094 33928
101 33928 154800 -4512 -141803 11513 121879 -21245 -92026 38842 95706 5341 -45740
112 -45740 -33782 -29062 6791 55237 9041 -73850 -36328 54109 9739 -83901 -5095 118179
$$ packed form
0@%%%%%%%%%%%%Qj6J6j6J6k4L2m0M8n6O4p2Q8j04J20j37J59j83K08k37K68l04
34a62L44l85M31m84N39n98O69p45Q23r11J009j115J227j351J488j639J807j991
52a044K195k422K678k970L301l681M128m658N298o090P101q434J0280j3016J7475
67A0141k5931M7282j96015l59245N61382L36772l52541k37763K60145J18995j79405
78a6183r7646R0672O9772M2834L20j19814j40650R3202K32709N343k32585m3586
90a15612J91488J9553j73051K0072J58461k4548j04992J2454k3983n3936J28022
101C3928J20872j59312j37291J53316J10366j43124p0781J30868N6864r0365n1081
112d5740J1958M720L5853M8446m6196q2891L7522R0437m4370r3640P8806J23274
$$ plain form
124 118179 18631 -131656 -35514 92722 -24646 -103367 71794 120085 -111687 -159864 82667
135 82667 133233 -64266 -73986 90291 60468 -88340 -56092 66019 61065 -2137 -15591 -27197
147 -27197 -38379 12678 62771 20408 -37305 -3080 36959 -20942 -57521 38127 97304 -11122
159 -11122 -88009 -5818 40294 -24260 -13126 59038 12988 -62402 -11572 39338 -5607 -8903
171 -8903 43854 13906 -49600 -22536 24268 6085 -7497 12553 433 -33068 -21343 15190
183 15190 13267 -9609 1274 17547 -19180 -48082 9494 50809 -19750 -57177 28879 49800
195 49800 -57358 -63503 59630 66322 -42820 -46626 34569 31320 -18258 -11648 12795 13386 12752
208 12752 -1393 -30494 -18463 32344 37849 -15170 -37119 8280 35757 -9023 -36757 16413
$$ packed form
124A18179r9548j50287R6142J28236j17368p8721J75161M8291k31772m8177K42531
135H2667N0566j97499r720J64277k9823j48808L2248J22111m954o3202j3454j1606
147b7197j1182N1057N0093m2363n7713L4225M0039n7901l6579R5648N9177j08426
159a1122p6887Q2191M6112o4554J1134P2164m6050p5390N0830N0910m4945l296
171h903N2757k9948o3506K7064M6804j8183j3582K0050j2120l3501J1725L6533
183A5190j923k2876J0883J6273l6727k8902N7576M1315p0559l7427Q6056K0921
195D9800j07158o145J23133O692j09142l806Q1195l249m9578O610K4443N91o34
208A2752j4145k9101J2031N0807N505n3019k1949M5399K7477m4780k7734N3170
$$ plain form
220 16413 49565 -7324 -45423 -3082 19933 -4440 5256 22977 -14340 -33600 13268 28205
232 28205 -12739 -9443 30490 13227 -31111 -20367 15782 21182 7929 -4177 -18278 -18231 4972
245 4972 18222 683 -13518 2578 12818 -14879 -31945 9365 42345 1804 -38810 -10323
257 -10323 19558 -2426 -9995 16519 11185 -17045 -8991 10510 660 -1502 16293 8449 -16594
270 -16594 -10829 10105 7729 -1774 1788 2242 -7499 -7311 4464 4860 -6564 -4504 9115 2659 -17382
285 -17382 -8375 18144 8171 -18453 -5320 18831 2727 -17533 -1941 13334 3095 -1709 2980
298 2980 -2934 -5887 5127 7055 -3117 625 9291 -884 -14893 -4282 13911 10120 -6512
311 -6512 -8893 -1293 -2185 -5073 4437 11467 -1451 -11395 -2747 2950 -1241 4857 13761 598 -15193
$$ packed form
220A6413L3152n6889l8099M2341K3015k4373R696J7721l7317j9260M6868J4937
232B8205m0944L296L9933j7263m4338J0744L6149N400j3253j2106j4101M7K3203
245D972J3250j7539j4201J6096J0240k7697j7066M1310L2980m0541m0614K8487
257a0323K9881k1984p569K6514n334k8230Q054J9501r850k162J7795p844k5043
270a6594N765K0934k376r503L562M54r741J88J1775L96j1424K060J3619o456k0041
285a7382R007K6519r973k6624J3133K4151j6104k0260J5592J5275j0239m804M689
298B980n914k953J1014J928j0172L742Q666j0175j4009J0611J8193l791j6632
311f512k381P600q92k888R510P030j2918r944Q648N697m191O098Q904j3163j5791
$$ plain form
326 -15193 -6040 8749 6292 1479 3181 -1464 -8459 -3890 5053 4658 2019 1405 -3192 -10271 -5734
341 -5734 6667 7001 -4673 -9255 -2320 -1226 -5417 -801 6995 1841 -6947 -4056 2852 2308 1064
356 1064 3214 1226 -3118 -885 3285 1277 -1253 1520 3306 -463 -1736 2396 3708 -589 -1400
371 -1400 2237 2136 -994 -95 -557 -4388 -2277 5246 3734 -4649 -4320 2500 4080 768 518 3224
387 3224 4011 -141 -5040 -2502 5728 7316 -807 -8376 -6175 2567 6826 226 -5584 -24 5441
402 5441 -3253 -9198 28 8390 2136 -7563 -9183 -4816 1770 5454 -593 -6353 -1998 3134 1712
417 1712 -629 1671 5121 5374 -267 -6490 -1689 8206 6602 -3521 -4789 786 1876 1740 2881
432 2881 1996 696 1839 1604 -1002 -142 2125 1727 652 -2144 -6006 -1694 6115 3161 -4823 -2538
$$ packed form
326a5193R153J4789k457m813J702m645o995M569Q943l95k639o14m597p079M537
341e734J2401L34j1674m582O935J094m191M616P796n154q788K891O908n44j244
356A064K150j988m344K233M170k008k530K773J786l769j273M132J312m297q11
371a400L637j01l130Q99m62l831K111P523j512q383L29O820J580l312k50K706
387C224P87m152m899K538Q230J588q123p569K201Q742M259o600n810N560N465
402E441q694n945R226Q362o254r699j620M367O586L684o047n760M355N132j422
417A712k341K300L450K53n641o223M801R895j604j0123j268N575J090j36J141
432B881q85j300J143k35k606Q60K267l98j075k796l862M312P809k954p984K285
$$ plain form
448 -2538 4548 3573 659 1020 -489 -430 4494 2688 -7350 -7237 3225 6181 -4235 -12023 -4487 9844
464 9844 7380 -11971 -14542 7928 15015 -6824 -16863 -1009 7803 -691 -7613 -6607 -1106 5552
478 5552 3224 -7378 -6765 6942 11859 2737 -7741 -6967 6125 14020 -1327 -14264 732 14462
492 14462 -1044 -13778 637 12808 4848 -4478 -4967 81 7241 6738 -2557 -4415 393 5 -341
507 -341 2704 -896 -2153 6424 4303 -8941 -2767 13970 7382 -7643 -3570 4539 -380 -3177 1576
522 1576 3015 -2685 -8171 -3244 7963 5248 -10400 -7038 11313 5168 -15689 -6932 12708 4980
536 4980 -11639 -8228 1471 2828 2562 -57 -5215 -2094 6322 6786 -550 -5335 -961 7607 5208
551 5208 -9357 -8396 10982 11969 -10255 -14034 6726 13666 -320 -7336 -2010 4356 5469 419
$$ packed form
448b538P086r75k914L61j509N9M924j806j0038J13J0462K956j0416p788P536J4331
464I844k464j9351k571K2470P087k1839j0039J5854Q812q494o922J006N501O658
478E552k328j0602O13J3707M917r122j0478P74J3092P895j5347j2937J4996J3730
492A4462j5506j2734J4415J2171p960r326m89N048P160n03r295j858M808l88l46
507c41L045l600j257Q577k121j3244O174J6737o588j5025M073Q109m919k797M753
522A576J439n700n486M927J1207k715j5648L362J8351o145k0857Q757J9640p728
536D980j6619L411R699J357k66k619n158L121Q416M64p336m785M374Q568k399
551E208j4565R61J9378R87k2224l779K0760O940j3986p016N326O366J113n050
$$ plain form
565 419 -5593 -1712 4849 904 -5116 -2816 2450 5337 5011 -4050 -9492 2746 15465 2790 -11719
580 -11719 -1665 9484 410 -8367 -1692 5217 600 -6059 -5013 2717 4413 -2485 -3343 3459 -1064
595 -1064 -9409 444 10802 -1322 -11344 -1288 4447 -2884 -2633 2978 -351 -1860 2862 1454
609 1454 -2156 1666 4542 675 -2670 -4047 58 7527 3552 -8795 -5859 7090 3645 -5835 -1537
624 -1537 4385 1619 -127 -1025 -3800 1456 7263 -1278 -8818 340 7302 2181 -1616 -2505 -2633 4237
640 4237 6669 -3562 -5672 6659 7942 -5188 -7409 2143 5736 1106 -4720 -5181 2225 6190 -1730
655 -1730 -6237 1082 2243 -3768 -1201 2861 -857 -1303 2700 -1118 -5658 1498 5619 -630 -2584
670 -2584 1241 798 -199 1819 890 -1204 427 671 -1676 411 2384 13 -1141 -483 -2572 -1170
$$ packed form
565D19o012L881O561l945o020K300N266K887l26r061n442J2238J2719j2675j4509
580a1719J0054J1149r074q777O675O909m617o659J046P730J696o898q58O802m523
595a064q345R853J0358j2124j0022J0056N735p331K51N611l329j509M722j408
609A454l610L822K876l867l345j377M105P469l975j2347K936J2949l445r480M298
624a537N922k766j746q98k775N256N807q541p540R158O962n121l797q89j28O870
640D237K432j0231k110J2331J283j3130k221R552L593m630n826m61P406L965p920
655a730m507P319J161o011K567M062l718m46M003l818m540P156M121o249j954
670b584L825m43r97K018r29k094J631K44k347K087J973k371j154O58k089J402
$$ plain form
686 -1170 3507 1365 -3368 -324 1666 -2282 -1825 2794 727 -2412 481 958 -1231 1114 3010 -872
702 -872 -1931 1411 275 -707 3033 2181 -2636 -1924 1354 380 -396 1007 -129 -1444 -4 -1122 -1256
719 -1256 2074 1030 -3658 -1763 2921 66 -1413 1787 979 -2347 -177 1886 79 1104 2437
734 2437 -1845 -2387 2305 2330 -1192 -219 1095 -1208 -588 1286 -22 -224 492 -2135 -2628 1333 1875
751 1875 -1458 -596 -122 -2626 -1113 2487 996 -1587 261 256 -1564 694 2763 -64 -906 614 -1044
768 -1044 -1096 2299 2234 -1300 -1811 -112 -361 353 1891 -251 -1389 -171 -717 -1118 1118 1221 -1716 -1456
786 -1456 7 -728 121 2667 772 -2235 17 1838 515 1096 1462 -591 -1601 721 438 -546 1161
803 1161 1041 -1857 -1743 644 1276 397 -102 -1444 -1434 774 219 -1056 117 390 -1869 -1943 1031 1171
$$ packed form
686a170M677k142m733L044J990l948M57M619k067l139K893M77k189K345J896l882
702h72j059L342j136r82L740q52m817P12L278r74p76J403j136j315J440j118j34
719a256L330j044m688J895M684k855j479L200q08l326K170K063j807J025J333
734B437m282n42M692K5l522R73J314k303O20J874j308k02P16k627m93L961N42
751A875l333Q62M74k504J513L600j491k583J848nj820K258K069k827q42J520j658
768a044n2L395o5l534n11J699k49P14J538k142j138J218n46m01K236J03k937K60
786a456J463p35Q49K546j895l007K252J821j323N81L66k053j010K322k83r84J707
803A161j20k898J14K387O32q79m99j342J0K208n55j275J173K73k259p4K974J40
$$ plain form
821 1171 -101 121 -872 -1479 1140 2417 -200 -695 761 -2 -1308 516 1567 343 -701 -650 -1042
838 -1042 370 1813 545 -920 -588 -405 -124 766 635 -627 -469 19 -858 -431 1938 1375 -1064 -580
856 -580 604 472 1170 1733 -453 -1271 176 766 81 348 570 -917 -1257 -452 180 430 296 -216 -1099
875 -1099 -988 -348 287 870 -666 -2092 -959 789 68 -665 293 202 -649 107 867 232 277 765 -350
894 -350 -1601 85 1577 511 -1005 -904 -94 176 103 -176 254 64 -138 -541 -27 257 778 611 -942
913 -942 -1224 535 1360 292 -332 590 442 -41 896 1466 286 -645 313 465 -541 -437 968 883 -1377
932 -1377 -1783 476 1136 -160 -372 311 -830 -978 699 746 -1004 -1390 236 153 -1307 -1012 1120 1472
950 1472 -423 -1631 147 1649 1146 -247 -347 -357 76 489 -391 -803 -86 801 -518 -1349 140 1355
$$ packed form
821A171j272K22r93o07K619J277k617m95J456p63j306J824J051j224j044N1l92
838a042J412J443j268j465L32J83K81Q90j31j262J58M88q77M27K369n63k439M84
856e80J184j32O98N63k186q18J447N90o85K67K22j487l40Q05O32K50j34n12q83
875a099J11O40O35N83j536j426J133J748p21p33R58r1q51P56P60o35M5M88j115
894c50j251J686J492j066j516J01Q10K70p3k79M30j90k02m03N14K84N21j67j553
913i42k82J759Q25j068o24R22j48m83R37N70j180r31R58J52j006J04J405q5k260
932a377m06K259O60j296k12O83j141j48J677M7j750l86J626q3j460K95K132L52
950A472j895j208J778J502n03j393j00j0M33M13q80m12P17Q87j319q31J489J215
$$ plain form
968 1355 822 -455 -1075 -477 753 1815 -245 -2078 135 1672 -307 -1728 241 2077 457 -1459
984 -1459 -286 1687 1008 -456 97 156 -1000 -366 1721 711 -2334 -1232 1345 157 -2154 -88
1000 -88 1924 -598 -2313 -128 1377 -354 -745 362 -125 -1482 -405 1232 1200 -776 -730 464 867
1017 867 -226 -211 709 461 -1042 -809 198 221 188 -3 -807 -1298 264 1346 49 -960 -228 -113 36
1036 36 599 -16 -940 578 1048 -1505 -1601 2054 2538 -1132 -1952 671 1714 126 -268 254 112 -302
1054 -302 -922 380 791 -860 -540 1048 -589 -1996 976 2347 -1432 -2553 1036 1488 -1232 -481
1070 -481 1469 -341 -1402 -25 703 410 -107 -201 -317 -49 -47 737 1163 -174 -1115 115 565 -539 -443
1089 -443 845 -186 -1309 -134 543 -382 -223 698 -741 -893 468 986 -470 148 474 -955 -223
$$ packed form
968A355n33j277o20N98J230J062k060j833K213J537j979j421J969J836j620j916
984a459J173J973o79j464N53N9j156O34K087j010l045J102K577j188k311K066
1000h8K012k522j715K185J505j731l91J107m87j357J077J637l2j976M6J194M03
1017H67j093J5R20k48j503K33J007K3l3j91q04m91J562J082j297j009P32J15J49
1036C6N63o15r24J518M70k553r6L655M84l670q20K623J043j588l94N22j42m14
1054c02o20J302M11j651L20J588j637j407K972J371l779j121L589M52k720P51
1070d81J950j810j061J377P28k93n17r4j16K68KP84M26j337r41J230M50j104R6
1089d43J288j031j123J175O77r25J59R21j439j52J361N18j456O18L26j429P32
$$ plain form
1106 -223 1369 925 -663 -946 321 432 -392 -206 529 440 -626 -946 412 773 -327 -136 492 -545
1124 -545 -1537 815 1048 -1074 -1127 1120 293 -1104 211 1230 -232 -814 430 803 16 280 739 -266
1142 -266 -817 75 575 409 -156 -249 346 155 -754 53 1087 -36 -1170 414 581 -518 -200 623 -293
1161 -293 -1262 336 675 -607 -1 852 33 -652 635 621 -453 -370 343 -142 -478 -51 106 146 -57 -657
1181 -657 -95 576 -284 -18 277 -239 -1062 423 880 -753 -146 1053 -198 -986 446 1036 -440 -273
1199 -273 859 150 -380 577 764 -82 -113 -55 167 88 -73 210 123 -57 -788 -77 626 12 -324 345 144
1220 144 -812 -129 771 -667 -995 327 71 -457 226 767 -402 -493 164 337 -114 123 451 -335 -296 -184
1240 -184 -303 -88 -121 -324 -61 30 -159 -113 376 -131 -788 219 372 -308 285 759 -133 -855 -133 399 -152
$$ packed form
1106b23J592m44j588k83J267J11q24J86P35q9j066l20J358L61j100J91O28j037
1124e45r92K352K33k122n3K247q27j397J315J019j462n82J244L73p87K64M59j005
1142b66n51Q92N00j66n65r3N95j91r09Q07J034j123j134J584J67j099L18Q23r16
1161b93r69J598L39j282O06Q53q19o85J287j4j074Q3P13m85l36M27J57M0k03o00
1181f57N62O71q60K66K95n16q23J485M57j633O07J199j251p88J432N90j476J67
1199b73J132p09n30R57J87q46l1N8K22p9j61K83q7j80p31P11P03o14l36O69k01
1220A44r56O83R00j438l28J322k56n28O83N41j169r1O57J73m51K37L28p86L9J12
1240a84j19K15l3k03K63R1j89M6M89n07o57J007J53o80N93M74q92p22P22N32n51
$$ plain form
1261 -152 90 576 107 -315 489 632 -259 -143 56 -155 -78 -1 258 80 -36 -527 -106 335 163 -195 338
1282 338 -134 -556 -6 489 -495 -373 281 -58 -813 235 730 -124 -308 433 -79 -170 595 518 -132 -288
1302 -288 -126 94 -62 -72 -8 -94 -85 -235 -68 257 -137 -386 118 40 103 -19 524 -167 -430 -50 428 -228
1324 -228 51 533 -6 -349 365 174 118 188 51 -210 -117 263 80 -83 162 -427 -191 262 -30 -196 216
1345 216 14 -426 171 151 -271 -56 409 -268 -624 16 467 -361 13 287 -43 -300 253 76 72 -56 -9
1366 -9 46 -3 58 204 -75 -165 34 -107 362 39 -51 166 274 -183 -76 403 -143 -187 269 -1 -114 227 340
1389 340 164 40 215 197 -170 39 464 -233 -133 154 242 41 186 45 -242 -43 20 -44 138 11 -323
1410 -323 90 250 -172 -138 421 57 -440 184 115 -56 -10 225 227 -19 -205 11 184 25 50 -308 -132 65
$$ packed form
1261a52K42M86m69m22Q04J43q91J16J99k11P7P7K59j78j16m91M21M41j72l58N33
1282C38m72m22N50M95r84J22O54l39p55J048M95q54j84P41n12r1P65p7o50j56
1302b88J62K20j56j0O4q6Rj50J67L25l94k49N04p8O3j22N43o91k63L80M78o56
1324b28K79M82n39l43P14j91n6P0j37k61R3L80j83j63K45n89K36M53k92j66M12
1345B16k02m40N97k0m22K15M65o77l56O40M51q28L74K74l30k57N53j77mj28M7
1366iN5m9O1J46k79r0J99j41M69l23r0K17J08m57J07M79n46m4M56k70j13L41J13
1389C40j76j24J75j8l67K09M25o97J00K87Q8k01J45j41k87J99O3o4J82j27l34
1410c23M13J60m22L4N59l64m97O24o9j71M6K35Kk46j86K16J73j59K5l58J76J97
$$ plain form
1432 65 156 185 111 -201 -49 -172 -20 -119 -41 93 -208 -60 287 157 -61 11 74 -284 321 -80 29 -6 120
1455 120 -27 -296 58 181 263 -85 -99 -253 -51 -54 -177 -65 -69 -307 -169 -51 -80 -15 -41 44 100 35 137 8
1479 8 -103 -20 85 124 -84 47 -26 -95 -80 12 257 264 14 -232 107 -120 -95 69 77 -138 -287 -263 279 194 -250
1504 -250 -20 119 -131 -134 434 -77 -18 -82 4 -147 -58 -110 88 -175 -497 112 -151 -178 -196 -356 -128 20 -298
1527 -298 137 339 10 -387 -111 -234 -29 165 -148 -96 -112 -272 -219 116 222 -96 -261 -42 303 82 -2
1548 -2 274 138 -398 174 319 -80 -22 136 -192 -138 120 299 143 -181 -145 -26 -20 -89 204 29 39 1 -86 -42
1572 -42 78 -85 -42 203 -116 -29 -18 31 -32 -214 -164 -144 124 -82 -97 175 -196 -179 -105 121 48 -267 -83 -129
1596 -129 -17 -139 -12 16 -137 -234 17 -70 103 -36 -130 95 -68 315 -58 346 78 -154 241 98 -131
$$ packed form
1432F5R1K9p4l12J52j23J52r9P8J34l01J48L47j30k18P2O3l58O05m01J09l5J26
1455A20j47k69L54J23Q2l48j4j54K02lj23J12mk38J38J18k9O5k6Q5N6o5J02j29
1479Hj11Q3J05L9k08J31p3o9J5R2K45Pk50k46L39k27K5J64Qk15j49K4N42q5m44
1504b50K30J39k50lN68n11N9o4Q6j51Q9n2J98k63l22O09k63k7j8j60K28J48l18
1527b98M35K02l29l97K76j23K05J94l13N2j6j60N3L35J06l18j65K19L45k21q4
1548bK76j36n36N72J45l99N8J58l28N4K58J79j56l24L6J19Oo9K93j75J0l8q7M4
1572d2J20j63M3K45l19Q7J1M9o3j82N0K0K68k06j5K72l71J7P4K26p3l15J84m6
1596a29J12j22J27K8j53r7K51q7J73j39r4K25j63L83l73M04k68k32L95j43k29
$$ plain form
1617 -131 1 88 -33 -302 213 61 13 26 69 -213 48 -185 -93 -135 209 -60 -23 78 177 -177 -62 294 -197
1640 -197 -21 -48 353 -277 200 -10 -138 -23 22 -67 -130 -98 -273 10 51 70 -272 -116 20 181 -222 83
1662 83 -136 -5 -88 -69 -243 114 -30 -11 -86 24 -83 -61 18 71 -186 169 152 -97 153 0 164 -138 160
1685 160 68 16 63 -23 53 141 -157 42 116 -33 265 -34 -342 25 14 287 126 -229 -2 63 82 -24 -1 1
1709 1 -297 -55 29 -109 -128 -103 -35 -215 29 170 -75 294 28 -101 -145 115 197 -271 173 -54 -248 -104 174
1732 174 -23 -175 39 -170 -358 306 147 -21 35 -9 64 169 340 198 -337 124 43 8 -139 184 93 55
1754 55 -115 1 136 -23 104 -148 -43 -37 -13 27 99 -78 -89 228 -86 -217 333 232 -354 -187 -66 170
1776 170 -83 159 118 -43 15 -198 -115 222 -31 -171 -249 -3 247 226 226 -105 -29 3 -241 130 -48 54 15
$$ packed form
1617a31J32Q7j21k69N15j52m8J3M3k82K61k33R2m2L44k69L7J01R9l54J15L56m91
1640a97J76k7M01o30M77k10j28J15M5q9o3L2j75K83M1J9l42J56J36J61m03L05
1662H3k19J31q3J9j74L57j44J9p5J10j07K2P9N3k57L55j7k49K50j53J64l02K98
1685A60r2n2M7q6P6Q8k98J99P4j49K98k99l08L67j1K73j61l55K27O5J9j06K3K
1709Ak98K42Q4j38j9K5O8j80K44J41k45L69k66j29m4K60Q2m68M44k27j94J44K78
1732A74j97j52K14k09j88O64j59j68N6m4P3J05J71j42n35M61q1l5j47L23r1l8
1754E5j70J16J35j59J27k52J05OK4M0P2j77j1L17l14j31N50j01n86J67J21K36
1776A70k53K42m1j61N8k13Q3L37k53j40p8K46K50k1%l31P6L2k44L71j78J02l9
$$ plain form
1799 15 -128 251 332 -98 185 222 -150 126 340 33 43 118 -139 -157 -61 197 -408 168 186 8 13 139 -17
1822 -17 105 76 21 41 303 57 -55 110 -83 -153 199 76 -279 -73 97 116 -62 -131 -126 93 -203 -51 -82
1845 -82 106 -146 54 -147 -176 19 121 85 25 -9 -74 -54 170 -27 -118 257 -359 -56 225 250 90 -80 86
1868 86 -91 66 -7 2 37 -46 -112 7 265 91 15 42 -191 -63 -84 209 -15 -34 -36 10 2 21 6 -13 -128 -228
1894 -228 19 130 135 -107 -133 -70 -221 -76 50 72 5 -93 65 1 -130 268 59 -8 -126 -166 -137 154 174 209
1918 209 67 -41 13 -20 82 53 291 -465 111 53 -186 12 -171 -188 49 67 -3 104 57 -25 61 46 15 -63
1942 -63 368 91 -82 55 80 -148 -64 34 -52 -78 -341 -110 48 -64 135 -10 4 117 -140 -110 103 50 87
1965 87 74 137 288 -10 6 -214 112 50 -215 -58 -54 -117 -212 113 144 -238 -212 229 -248 127 110 -71 -114 -53 63
$$ packed form
1799A5j43L79Q1m30K83L7l72K76K14l07J0P5k57j8R6K58o05N76J8j78NJ26j56
1822a7J22k9n5K0K62k46j12J65j93p0L52j23l55K06J70J9j78o9NK19k96J52l1
1845h2J88k52K00k01k9J95J02l6o0l4o5K0K24j97r1L75o16L03K81K5j60j70J66
1868H6j77J57p3RL5q3o6J19K58j74p6K7k33J28k1K93k24j9kM6qJ9j5j9j15j00
1894b28K47J11Nk42k6O3j51J45J26K2o7r8J58o4j31L98k09o7j18m0K9K91K0L5
1918B09j42j08N4l3J02k9K38p56N76n8k39J98j83j7K37J8p0J07m7q2Q6j5l1p8
1942f3M31k77j73J37K5k28Q4R8q6k6k63K31J58j12J99j45J4J13k57L0K13n3L7
1965H7j3O3J51k98J6k20L26o2k65J57Mo3r5L25L1l82K6M41m77L75j7j81m3O1J16
$$ plain form
1990 63 38 -66 279 9 -77 -54 11 96 -10 13 -128 -42 -55 269 -9 257 -153 162 26 -33 110 -405 -161
2013 -161 93 22 14 -50 20 -39 -214 184 14 -85 116 -5 -31 147 -120 229 183 9 224 -24 37 -5 -261 -213
2037 -213 26 232 -100 -28 134 49 109 -30 -108 -72 -222 279 -9 76 -178 128 316 -18 -34 137 145 -157 107
2060 107 -155 30 -33 40 -270 -17 7 -35 24 -126 43 70 -146 -84 -249 -32 17 -171 0 47 109 228 160 -85
2084 -85 143 122 -2 107 -130 -19 0 -163 280 -45 -47 -168 -85 79 120 156 46 36 62 21 112 -7 97 159
2108 159 -72 175 18 131 135 -72 92 135 102 73 -147 78 200 -51 95 -90 -32 -29 349 86 116 -250 -200
2131 -200 131 97 -243 -144 -182 -20 6 -73 -183 -52 -102 -132 -52 14 -23 -81 147 -232 49 -87 -152 256 19 160
2155 160 142 61 -58 -183 130 -205 46 119 -117 157 57 -279 -15 -58 21 19 55 -169 204 130 236 6 -37
$$ packed form
1990F3k5j04L45k70q6K3O5Q5j06K3j41Q6j3L24k78K66m10L15j36n9J43n15K44
2013a61K54p1qo4P0n9j75L98j70r9K01j21k6J78k67L49m6j74K15k48O1m2k56M8
2037b13K39K06l32P2J62q5O0j39p8L6j50N01k88Q5k54L06J88l34j6J71Ql02K64
2060A07k62J85o3P3l10K53K4m2N9j50J69K7k16O2j65K17M9j88J71M7O2J19o8k45
2084h5K28k1j24J09k37J11J9j63M43l25kj21Q3J64M1L6j10j0K6m1R1j19J04O2
2108A59k31K47j57J13Mk07J64M3l3k9k20K25J22k51J46j85N8LL78k63L0l66N0
2131b00L31l4l40R9l8J62K6p9j10J31n0l0Q0O6l7n8K28l79K81j36o5M08k37J41
2155A60j8q1j19j25L13l35K51P3k36K74j00l36K64m3P9kL6k24L73p4J06k30m3
$$ plain form
2178 -37 15 84 -275 56 81 128 117 -242 181 52 153 228 -67 294 160 -59 -263 122 335 95 -129 -88 212
2201 212 -103 -132 -160 226 -72 52 -95 185 103 -282 154 171 -141 -59 -75 -54 38 31 71 45 -24 -148 243 -134
2225 -134 143 223 52 -177 -134 25 -106 133 -65 -151 82 143 -51 130 -207 157 7 102 -93 -77 70 -66
2247 -66 -169 164 188 143 -24 80 53 169 -145 -216 105 -106 -85 19 -24 -110 27 -54 91 -100 66 111 55 38
2271 38 -224 176 65 159 -2 187 44 67 125 -60 -117 -199 -32 109 262 134 -7 109 190 -205 -31 123
2293 123 181 -100 -32 -87 104 -175 -153 -36 -267 87 -48 78 102 -134 -226 -60 105 77 -35 155 181 214 -167
2316 -167 -204 139 -93 250 124 147 11 -170 0 58 -90 -119 -90 52 -395 232 125 147 62 227 -17 -143
2338 -143 -95 -62 94 -137 28 -145 -156 6 75 -129 -2 -117 -93 169 25 -308 67 80 69 32 12 67 -7 31
$$ packed form
2178c7N2O9l59L31K5M7j1l59M23j29J01P5k95L61j34k19k04L85K13k40k24M1L00
2201B12l15k9k8L86k98J24j47K80q2l85M36J7l12Q2j6K1R2pM0k6o9j24L91l77
2225a34K77Q0j71k29M3J59j31K39j98q6K33O1j94J81l37L64j50R5j95J6J47j36
2247f6j03L33K4m5j67J04k7J16l14p1L21k11K1J04m3q6J37q1J45j91J66M5n6j7
2271C8k62M00j11R4j61J89j43K3N8j85n7q2J67J41J53j28j41J16Q1l95J74J54
2293A23N8k81O8n5J91k79K2J17k31L54j35J26K4k36r2J66J65k8j12J90K6L3l81
2316a67l7L43k32L43j26K3j36j81J70N8j48k9K9J42m47O27j07K2q5J65k44j26
2338a43M8L3J56k31J65j73j1J62O9k04J27j15K4K62j44l33L75J3j1l7k0N5p4L8
$$ plain form
2362 31 123 13 -50 -114 213 133 106 148 82 -288 -3 -22 166 -32 -131 -240 95 310 -24 157 194 -5 -21 4
2386 4 29 -50 28 -11 -88 -112 -1 -177 86 -197 61 -25 86 -199 -174 115 37 -83 195 163 -186 -138 82 161 -142
2411 -142 105 66 55 76 -78 -140 40 -50 66 -43 69 113 -41 186 21 -46 -35 123 209 -73 158 139 53 -43
2435 -43 -98 316 -69 126 -3 46 175 -61 118 -198 49 -77 -55 228 34 75 -16 84 291 -103 94 64
2457 64 104 31 -89 119 114 24 289 128 60 -38 -41 -169 -111 -233 61 72 -282 92 -57 2 13 40 -1 -396 66
2482 66 76 23 -77 11 -61 110 163 -112 -71 70 4 -117 15 171 -46 225 -14 111 -187 -119 -48 -47 -140 -23
2506 -23 17 -21 -55 66 -58 -330 -35 20 -159 -261 25 -78 155 18 20 -145 181 -56 24 -152 148 9 240
2529 240 18 -90 -175 -45 239 193 175 -127 -79 -32 -129 -91 -78 25 211 145 -275 54 73 286 -121 -14 -128
$$ packed form
2362C1R2j10o3o4L27q0k7M2o6l70K85j9J88j98r9j09L35K15l34J81L7j99j6K5
2386DK5p9P8l9p7k4J11j76K63k83K58q6J11k85K5K89p8j20K78l2l49M8K20P9l03
2411a42K47l9j1K1j54o2J80r0J16j09J12M4j54K27j65o7J1J58Q6k82K31j9q6r6
2435d3n5M14l85J95j29M9J29k36J79l16K47j26K2K83j94M1r1J00K07l94J97l0
2457F4M0p3j20K08nr0K65j61o8r8lj28N8j22K94J1l54L74j49N9J1K7m1l95M62
2482F6J0n3j00Q8p2J71N3k75M1J41o6j21J32J56k17K71k39J25k98O8P1Jr3J17
2506b3M0l8l4J21j24k72K95N5j79j02K86j03K33j37Kj65L26k37Q0j76L00j39K31
2529B40k22j08q5J30K84m6j8l02M8M7r7L8J3J03J86o6m20L29J9K13m07J07j14
$$ plain form
2552 -128 -89 267 79 -124 -25 103 -29 124 -227 -187 -213 126 11 -206 125 -321 -140 165 108 -21 140 81
2574 81 76 -275 -26 -122 -101 -71 260 -2 -167 -75 186 -108 16 -327 -47 36 115 -87 -152 -71 -328 27 126 -23
2598 -23 26 -34 108 131 -63 86 44 -53 201 -8 -1 66 -246 -14 -8 -180 129 -89 40 -254 -292 -84 130 53
2622 53 -35 31 235 10 -8 -106 220 58 -168 50 43 46 -268 97 174 -75 127 5 -231 -57 50 -162 -13
2645 -13 114 151 80 -131 -1 93 159 -140 125 177 -117 0 35 -179 -280 -137 228 -54 -109 35 -188 72 5
2668 5 119 158 -241 52 134 -190 63 15 -15 213 155 157 30 157 62 -115 -58 -38 -28 25 -1 150 115 18 -53 -22
2694 -22 136 76 35 50 7 272 -155 -170 33 -81 105 102 -24 73 -157 -25 81 -10 -80 -215 1 235 67 -32
2718 -32 -51 108 54 50 -135 49 -54 107 -203 49 -3 42 112 -42 51 -41 239 51 -294 -113 -192 -178 155 -361
$$ packed form
2552a28L9L56j88k03R9J28j32J53l51M0k6L39j15k17L31m46J81L05n7j29J61n9
2574H1nl51K49r6K1L0L31k62j65R2K61k94J24l43K80Q3P9k02o5Q1k57L55R9j49
2598b3M9o0J42K3j94J49m2r7K54k09PO7l12K32Oj72L09k18J29k94l8K08K14p7
2622E3q8O6K04k25j8r8L26j62k26K18pLl14L65P7k49K02j22k36J74J07k12J49
2645a3J27L7p1k11J30R4O6k99K65N2k94J17L5k14j01J43L65k82n5J44k23K60o7
2668EJ14L9l99K93Q2l24K53m8l0K28n8Kj27J27r5j77N7K0J0N3k6J51l5r7p1L1
2694b2J58o0m1J5m3K65m27j5K03j14J86lj26R7k30J32J06r1p0j35K16K34j68r9
2718c2j9J59n4mj85J84j03J61l10K52n2M5P0j54R3r2K80j88l45J81p9J4L33n16
$$ plain form
2742 -361 -119 79 172 -151 35 80 52 -108 16 146 -143 135 -29 149 -65 289 -71 -164 -4 49 44 -21 -71
2765 -71 -151 92 -55 -10 165 -48 4 -70 -30 76 20 -87 91 85 -339 20 10 -202 117 -65 -106 80 247 58
2789 58 152 -25 -58 212 176 79 55 211 -116 -131 -108 301 15 -164 268 -132 53 46 -32 -53 -86 15 70 15 124
2814 124 171 -180 113 -35 -142 -170 177 -71 -116 -130 -127 -199 -44 19 29 -98 67 -163 -107 44 43 112 120 -64 -70 7
2840 7 -61 96 -43 -244 -108 195 -140 -53 -88 39 -81 -134 14 13 -40 202 94 146 80 222 -63 59 139 18
2864 18 68 -98 73 120 134 72 35 -200 -75 -89 -10 148 56 -90 -126 46 -77 85 -85 113 114 -65 96 208
2888 208 -35 -32 149 -74 -74 -15 -53 16 3 -83 146 -50 -80 -142 -113 -12 89 -193 205 34 178 -255 92 81
2912 81 -119 -110 -89 -136 135 -203 -181 124 -50 48 -284 4 61 -44 99 -2 63 26 209 25 247 0 -122
$$ packed form
2742c61K42J98R3l23J86M5k8j60J24J30k89K78j64J78k14L54l60r3J60N3no5n0
2765g1q0K43j47M5J75k13N2p4M0J06n6j07J78om24L59j0k12L19j82m1J86J67j89
2789E8R4j77l3K70l6r7k4J56l27j5K3M09k86j79M32m00J85pp8k1l3J01N5n5J09
2814A24M7l51K93j48j07k8L47k48m5j4Lp2J55O3J0j27J65k30N6J51jO9Qj84oP7
2840Go8J57j39k01J36L03l35Q7l5J27j20n3J48jn3K42j08N2o6J42k85J22Q0j21
2864A8N0j66J71M7J4o2l7k35J25j4P9J58r2j46l6J72j23J62j70J98Jj79J61J12
2888B08k43LJ81k23%N9l8O9j3q6K29j96l0o2K9J01J01k82L98j71J44m33L47j1
2912H1k00RK1m7K71l38K2L05j74R8l32K88N7j05J43j01O5l7J83j84K22k47j22
$$ plain form
2935 -122 195 186 35 -169 -224 301 221 291 -120 47 93 -52 223 -1 0 -142 25 114 117 -36 -199 138 159 -46
2959 -46 -19 -6 -25 -201 -95 -75 140 101 -46 -136 56 -55 -149 19 171 -30 60 135 -249 -197 7 41 150 52
2983 52 -77 -152 172 -235 12 -119 14 95 -62 74 75 96 62 -142 55 -85 41 58 12 -24 35 28 -195 58
3007 58 131 39 -114 59 110 -166 90 -266 -89 -116 81 47 -78 -70 -115 204 -193 -43 0 113 115 19 103 202 222
3032 222 -189 -108 205 0 -43 95 -150 185 144 65 178 162 -91 8 -91 0 -78 -47 306 -43 18 -206 -50 -123
3056 -123 -86 130 -253 -176 -23 -165 169 45 82 176 67 -157 -15 260 54 -37 -7 247 -130 -117 -209 139 27
3079 27 -33 -42 -68 124 8 -322 124 258 61 -31 130 22 205 13 -73 100 -51 -64 168 92 31 -47 -160 91
3103 91 -52 60 -115 -134 39 48 10 -189 50 225 385 101 156 -181 -338 -165 -63 -185 -230 77 170 -113 -40
$$ packed form
2935a22L17rj51k04n5N25q0P0m11J67M6j45K75k24Jj42J67Q9Lj53j63L37K1k05
2959d6K7J3j9j76J06K0K15l9j47r0J92j11r4J68J52k01R0P5l84N2K04L4J09r8
2983E2j29p5L24m07K47j31J33Q1j57J36JK1l4k04J97j40J26J7m6l6N9pk23K53
3007E8P3r2j53J73N1k76K56l56J77k7J97l4j25Qm5L19l97J50M3J13Kr6Q4R9K0
3032B22m11Q1L13k05m3J38k45L35m1p9J13j6k53R9r9R1p8L1L53l49O1k24J56p3
3056a23L7K16l83P7J53j42L34j24L7R4j09k24J42K75k06r1L0K54l77J3r2L48j12
3079B7o0rk6J92j16l30M46J34j97r2J61j08J83j92q6J73j51j3K32p6o1p8j13K51
3103I1j43J12j75j9J73Rl8j99K39J75J60k84N5l37j57J73J02j22m5L07R3k83P3
$$ plain form
3126 -40 201 127 -47 5 -207 -63 -142 -309 -70 70 -186 50 -90 -333 -2 205 131 66 -7 -230 -114 -36 28
3149 28 209 119 156 134 221 -268 -18 -193 76 282 -116 -11 174 7 183 41 -108 140 66 129 -33 188
3171 188 72 22 57 -82 69 -27 -22 30 80 -198 0 86 47 129 168 153 55 -69 86 17 57 267 -47 -252 13
3196 13 195 91 9 40 -58 10 72 -63 -114 -1 17 217 -3 27 -65 129 -219 68 108 50 -52 24 124 -151
3220 -151 190 116 -53 -106 -21 74 183 -132 15 35 -306 -113 -13 123 112 -69 -96 -145 8 -80 215 -11 119
3243 119 -69 -112 55 3 -32 0 -23 238 -80 7 -256 -62 35 -113 104 94 -200 -251 110 -75 -119 -23 -89 -165
3267 -165 193 76 29 -103 159 -105 3 -37 62 -16 2 277 15 182 320 -111 -175 158 -76 50 -69 130
3289 130 -269 141 285 88 35 -208 -48 283 85 4 -33 -155 114 -115 -197 42 211 -177 -149 3 115 -210
$$ packed form
3126d0K41p4j74N2k12J44p9j67K39J40k56K36j40k43L31K07p4o5p3k23J16P8O4
3149B8J81r0L7k2Q7m89K50j75K69K06l98J05J85j67J76j42j49K48p4O3j62K21
3171A88j16n0L5j39J51r6NN2N0k78J98Q6l9Q2L9j5r8j24J55o9M0K10l14k05K65
3196A3J82j04q2L1r8O8O2j35n1J13J8K00k20L0r2J94l48K87M0n8j02P6J00k75
3220a51L41p4j69n3Q5R5J09l15J47K0l41J93J00J36j1j81k7m9J53q8K95k26J30
3243A19j88m3J67n2l5L2k3K61l18Q7k63J94R7j48K17j0k94n1L61j85m4R6o6p6
3267a65L58j17m7j32K62k64J08m0R9p8J8K75k62J67J38m31o4L33k34J26j19J99
3289A30l99M10J44j97n3k43J60L31j98q1l7j22K69k29q2K39J69l88K8J52J12l25
$$ plain form
3311 -210 104 14 -65 195 -6 -58 45 7 35 41 -12 56 -43 -123 -129 -116 180 86 -95 61 -45 60 57 -55 -89 -231
3337 -231 -173 -107 -333 -159 -117 78 87 35 277 104 -52 153 -39 25 -26 -85 -211 -29 27 17 -66 47 85 121 79
3362 79 -47 -129 63 89 -132 131 78 -28 131 68 154 -104 -166 -11 -29 1 -101 -175 17 -50 -247 4 -211 76
3386 76 124 -5 130 -23 -174 133 -160 11 -74 -59 5 -167 238 21 34 26 71 19 117 -63 -18 4 129 -84
3410 -84 -51 -96 119 4 -82 77 -214 0 -118 -252 -32 -25 0 8 -58 1 -21 -24 -12 -140 43 110 -99 14 155
3435 155 27 120 183 -110 98 -117 108 199 179 45 224 327 42 -146 -144 -17 -68 -161 126 -240 -39 60 123
3458 123 6 -25 -99 82 -2 64 -76 113 9 -23 9 -217 37 5 -28 -152 119 230 129 269 -194 -109 -153
3481 -153 42 83 136 76 -228 81 5 -41 -56 -83 84 -227 125 -42 13 -161 -188 -198 32 -25 131 195 151 56 33
$$ packed form
3311b10L14r0p9K60k01n2J03l8K8On3O8r9q0oJ3K96r4j81J56j06J05lj12l4j42
3337b31N8O6k26J74M2J95Rn2K42j73j56K05j92O4n1n9j26J82N6j0q3J13L8L6m2
3362G9j26q2J92K6k21K63n3j06J59o3Q6k58o2J55j8L0j02p4J92o7j97K51k15K87
3386G6M8j29J35j53j51L07k93J71q5J5O4j72M05k17J3qM5n2R8j80M5K2J25k13
3410h4L3m5K15j15q6J59k91K14j18j34K20PK5Qo6N9k2lJ2j28J83O7k09J13J41
3435A55j28R3O3k93K08k15K25R1k0j34J79J03k85j88KJ27n1r3K87l66K01R9O3
3458A23j17l1p4J81q4O6j40J89j04l2L2k26K54l2l3j24K71J11j01J40m63Q5m4
3481a53J95M1N3o0l04L09p6m6j5k7J67l11L52j67N5j74k7j0K30n7J56O4m4r5k3
$$ plain form
3506 33 -32 -13 176 146 -126 -136 94 66 74 -124 21 -167 111 -390 189 -112 118 76 -60 29 -18 -21 -26 -318 -60
3531 -60 -106 1 -31 80 -63 -49 341 213 -45 -168 285 12 77 -19 -110 110 -150 99 -42 -172 -25 -25 208
3554 208 -90 -24 -83 140 33 23 -243 36 -131 -81 85 -77 42 -105 -267 -176 -36 -192 -322 19 161 7
3576 7 119 -294 235 92 151 -2 -126 -40 -138 39 -73 180 -97 165 -177 -119 -116 87 -99 9 153 82 -131
3599 -131 85 75 93 -95 22 -163 21 140 -1 61 43 186 -20 43 73 213 -125 -158 58 -53 -75 174 129
3622 129 -124 -70 -35 -335 -356 -211 -64 -150 96 97 -56 103 -304 23 -61 -128 -34 131 -253 80 -212 -117 31
3645 31 -150 -7 -137 103 -73 -158 72 -64 -52 -22 -115 81 -107 137 47 -62 -43 -188 36 -45 33 -56 69
3668 69 -81 -109 47 193 157 91 -91 -227 -21 31 148 -29 -255 264 -77 -72 -178 113 36 -29 280 -4 53
$$ packed form
3506C3o5J9J89l0k72j0K30k8Qj98J45j88K78n01N79l01K30m2j36Q9m7lnk92K58
3531f0m6J07l2J11j43J4L90j28k58j23M53k73O5r6r1K20k60K49j41j30J47%K33
3554B08k98O6n9K23j07j0k66K79j67N0J66j62J19j47j62R1J40j56j30L41J42j54
3576GJ12m13N29j43N9j53j24Q6r8J77j12K53k77K62l42N8LK03j86J08J44p1k13
3599a31K16j0J8j88J17j85J84J19j41O2j8J43k06O3L0J40l38l3K16j11k2K49m5
3622A29k53N4L5l00k1J45J47q6K46Jj53J59m07L27q4o7R4J65l84L33k92R5J48
3645C1j81J43j30K40j76q5K30j36J2L0r3J96j88K44r0j09J9j45K24q1P8q9J25
3668F9j50k8J56J46l6o6j82j36K06N2J17j77k26N19l41Nj06K91p7o5L09k84N7
$$ plain form
3691 53 -107 112 -47 -75 37 5 31 -121 185 267 -30 94 4 46 -27 171 -30 -44 32 216 -122 48 112 -94
3715 -94 24 -112 143 -29 -162 -162 140 64 16 -132 343 86 130 -8 -5 215 95 -28 113 44 54 -102 -27 -51
3739 -51 -237 5 23 -180 276 -303 -186 -102 -118 -26 49 -112 -278 -199 -28 -3 39 144 23 -87 -146 -119 -185 70
3763 70 -18 -189 21 -67 -44 139 123 14 49 -3 85 55 123 -168 -124 5 -109 63 -47 -73 -44 -36 -22 -101 -76 92
3789 92 -73 25 35 -10 -49 74 138 23 -189 186 98 150 233 -136 -70 82 1 -51 -28 -36 137 -252 120 2 67
3814 67 73 -292 -74 -86 111 41 -112 95 76 211 -75 185 69 -42 54 -7 -151 16 -11 83 -46 183 -279
3837 -279 11 -42 132 248 171 41 -2 153 152 222 68 -160 -48 63 -124 -85 9 38 -129 -90 85 -141 -62 202
3861 202 -182 -19 -34 99 -55 -60 13 -16 95 147 -81 -106 50 1 -16 132 -47 -68 1 123 33 167 -122 56
$$ packed form
3691E3j60K19j59k8J12l2K6j52L06Q2k97J24r0M2p3J98k01j4P6J84l38J70O4k06
3715i4J18j36K55j72j33%L02p6m8j48M75k57M4j38LK20j20j23J41o9J0j56P5k4
3739e1j86K42J8k03M56n79J17Q4j6R2P5j61j66P9J71K5M2J05j21j10n9K7o6K55
3763G0q8j71K10q8K3J83j6j09L5n2Q8l0O8k91M4J29j14J72j10k6K9QJ4p9K5J68
3789I2j65R8J0m5l9J23O4j15k12L75q8N2Q3l69O6J52q1n2K3qJ73l89L72j18O5
3814F7Ol65K18j2J97p0j53K07j9J35k86K60j16j11R6o1j44J67k7R4j29K29m62
3837b79K90n3J74J16p7j30m3J55jP0j54k28J12J11j87L9R4K9j67L9J75k26P9K64
3861B02l84J63j5J33j54nP3k9J11N2k28k5J56m9j7J48j79k1O9J22r0J34k89J78
$$ plain form
3885 56 -87 -125 63 -65 -32 -12 -137 82 148 -105 283 -102 160 63 210 118 -308 -83 -228 87 -362 80
$$ packed form
3885E6j43l8J88j28L3K0j25K19O6k53L88l85K62r7J47r2m26K25j45L15m49M42
$$ [...]
8191I0
##END NTUPLES=NMR FID
##END=
