##TITLE=1H_Pr T-Am
 CDCl3
 8 sc, 
 15.12.2021
##JCAMPDX= 6.0         $$ Bruker NMR JCAMP-DX V2.0
##DATA TYPE= NMR FID
##DATA CLASS= NTUPLES
##ORIGIN= UXNMR, Bruker Analytische Messtechnik GmbH
##OWNER= root
$$ XWIN-NMR		Version 3.5
$$ Wed Dec 15 11:46:45 2021 Russian Standard Time (UT+4h)  she@DPX200
##.OBSERVE FREQUENCY= 200.131346
##.OBSERVE NUCLEUS= ^1H
##.DELAY= (6, 6)
##.ACQUISITION MODE= SIMULTANEOUS
##.ACQUISITION SCHEME= undefined
##.AVERAGES= 8
##.DIGITISER RES= 18
##SPECTROMETER/DATA SYSTEM= spect
##.PULSE SEQUENCE= zg30
##.SOLVENT NAME= CDCl3
##.SHIFT REFERENCE= (INTERNAL, CDCl3, 0, 15.7039)
##AUDIT TRAIL= $$ (NUMBER, WHEN, WHO, WHERE, WHAT)
$$ ##TITLE= Audit trail, XWIN-NMR		Version 3.5
$$ ##JCAMPDX= 5.01
$$ ##ORIGIN= Bruker BioSpin GmbH
$$ ##OWNER= she
$$ F:/spectra/data/she/nmr/H-F/1/audita.txt
$$ ##AUDIT TRAIL=  $$ (NUMBER, WHEN, WHO, WHERE, WHAT)
(   1,<2021-12-15 11:45:44.04 +0400>,<she>,<DPX200>,
      <created by zg, POWCHK disabled, PULCHK disabled
       configuration hash MD5:
       00 E9 B6 7A A2 85 ED C7 34 08 36 98 17 FE 4E 26
       data hash MD5: 16K
       92 FA BE 8D 89 18 2E C3 90 32 C7 92 79 5E A0 E1>)
$$ ##END=
$$ 
$$ hash MD5
$$ FE 4B A5 48 A6 53 8A 24 4F 95 B2 AF 1A 49 90 B8
##$RELAX= 
##$RELAX= 
##$RELAX= 
##$RELAX= 
##$RELAX= 
##$RELAX= 
$$ Bruker specific parameters
$$ --------------------------
##$DU= <F:/spectra>
##$EXPNO= 1
##$NAME= <H-F>
##$PROCNO= 1
##$TYPE= <nmr>
##$USER= <she>
##$AMP= (0..31)
100 100 100 100 100 100 100 100 100 100 100 100 100 100 100 100 100 100 
100 100 100 100 100 100 100 100 100 100 100 100 100 100 
##$AQSEQ= 0
##$AQ_mod= 1
##$AUNM= <au_zg>
##$AUTOPOS= <>
##$BF1= 200.13
##$BF2= 200.13
##$BF3= 200.13
##$BF4= 200.13
##$BF5= 200.13
##$BF6= 200.13
##$BF7= 200.13
##$BF8= 200.13
##$BYTORDA= 1
##$CFDGTYP= 0
##$CFRGTYP= 5
##$CHEMSTR= <none>
##$CNST= (0..31)
1 1 145 1 1 1 1 1 1 1 1 1 1 1 1 1 1 1 1 1 1 1 1 1 1 1 1 1 1 1 1 1 
##$CPDPRG= <>
##$CPDPRG1= <>
##$CPDPRG2= <>
##$CPDPRG3= <>
##$CPDPRG4= <mlev>
##$CPDPRG5= <mlev>
##$CPDPRG6= <mlev>
##$CPDPRG7= <mlev>
##$CPDPRG8= <mlev>
##$CPDPRGB= <>
##$CPDPRGT= <>
##$D= (0..31)
0 1.2 0 0 0 0 0 0 0 0.06 0 0.03 0 0 0 0 0.0002 0 0 0 0 0 0 0 0 0 0 0 0 
0 0 0 
##$DATE= 1639554343
##$DBL= (0..7)
120 120 120 120 120 120 120 120 
##$DBP= (0..7)
150 150 150 150 150 150 150 150 
##$DBP07= 0
##$DBPNAM0= <>
##$DBPNAM1= <>
##$DBPNAM2= <>
##$DBPNAM3= <>
##$DBPNAM4= <>
##$DBPNAM5= <>
##$DBPNAM6= <>
##$DBPNAM7= <>
##$DBPOAL= (0..7)
0.5 0.5 0.5 0.5 0.5 0.5 0.5 0.5 
##$DBPOFFS= (0..7)
0 0 0 0 0 0 0 0 
##$DE= 6
##$DECBNUC= <off>
##$DECIM= 32
##$DECNUC= <off>
##$DECSTAT= 4
##$DIGMOD= 1
##$DIGTYP= 9
##$DL= (0..7)
0 120 120 120 120 120 120 120 
##$DP= (0..7)
150 150 150 150 150 150 150 150 
##$DP07= 0
##$DPNAME0= <>
##$DPNAME1= <>
##$DPNAME2= <>
##$DPNAME3= <>
##$DPNAME4= <>
##$DPNAME5= <>
##$DPNAME6= <>
##$DPNAME7= <>
##$DPOAL= (0..7)
0.5 0.5 0.5 0.5 0.5 0.5 0.5 0.5 
##$DPOFFS= (0..7)
0 0 0 0 0 0 0 0 
##$DQDMODE= 0
##$DR= 18
##$DS= 0
##$DSLIST= <SSSSSSSSSSSSSSS>
$$ [...]
##$SUBNAM2= <"">
##$SUBNAM3= <"">
##$SUBNAM4= <"">
##$SUBNAM5= <"">
##$SUBNAM6= <"">
##$SUBNAM7= <"">
##$SUBNAM8= <"">
##$SUBNAM9= <"">
##$SW= 18.0517287032376
##$SWIBOX= (0..15)
0 0 2 0 0 0 0 0 0 0 0 0 0 0 0 0 
##$SW_h= 3612.71676300578
##$TD= 16384
##$TD0= 1
##$TE= 0
##$TE2= 300
##$TE3= 300
##$TEG= 300
##$TL= (0..7)
0 120 120 120 120 120 120 120 
##$TP= (0..7)
150 150 150 150 150 150 150 150 
##$TP07= 0
##$TPNAME0= <>
##$TPNAME1= <>
##$TPNAME2= <>
##$TPNAME3= <>
##$TPNAME4= <>
##$TPNAME5= <>
##$TPNAME6= <>
##$TPNAME7= <>
##$TPOAL= (0..7)
0.5 0.5 0.5 0.5 0.5 0.5 0.5 0.5 
##$TPOFFS= (0..7)
0 0 0 0 0 0 0 0 
##$TUNHIN= 0
##$TUNHOUT= 0
##$TUNXOUT= 0
##$USERA1= <user>
##$USERA2= <user>
##$USERA3= <user>
##$USERA4= <user>
##$USERA5= <user>
##$V9= 5
##$VALIST= <valist>
##$VCLIST= <CCCCCCCCCCCCCCC>
##$VD= 0
##$VDLIST= <DDDDDDDDDDDDDDD>
##$VPLIST= <PPPPPPPPPPPPPPP>
##$VTLIST= <TTTTTTTTTTTTTTT>
##$WBST= 1024
##$WBSW= 4
##$XGAIN= (0..3)
0 0 0 0 
##$XL= 0
##$YL= 0
##$YMAX_a= 99568
##$YMIN_a= -130410
##$ZGOPTNS= <>
##$ZL1= 120
##$ZL2= 120
##$ZL3= 120
##$ZL4= 120
##$ABSF1= 10
##$ABSF2= 0
##$ABSG= 5
##$ABSL= 3
##$ALPHA= 0
##$AQORDER= 0
##$ASSFAC= 0
##$ASSFACI= 0
##$ASSFACX= 0
##$ASSWID= 0
##$AUNMP= <proc_1d>
##$AZFE= 0.1
##$AZFW= 0.1
##$BCFW= 1
##$BC_mod= 2
##$BYTORDP= 1
##$COROFFS= 0
##$CY= 11.3945322036743
##$DATMOD= 1
##$DC= 2
##$DFILT= <>
##$DTYPP= 0
##$F1P= 2.36226072786647
##$F2P= -0.459571619588291
##$FCOR= 0.5
##$FTSIZE= 0
##$FT_mod= 4
##$GAMMA= 1
##$GB= 0.15
##$INTBC= 1
##$INTSCL= 1
##$ISEN= 128
##$LB= 0.24
##$LEV0= 0
##$LPBIN= 0
##$MAXI= 10000
##$MC2= 0
##$MEAN= 0
##$ME_mod= 0
##$MI= 1.114404
##$NCOEF= 0
##$NC_proc= 0
##$NLEV= 6
##$NOISF1= 3.799351
##$NOISF2= 2.8
##$NSP= 1
##$NTH_PI= 0
##$NZP= 0
##$OFFSET= 15.70392
##$PC= 1
##$PHC0= -15871.44
##$PHC1= 11.60079
##$PH_mod= 1
##$PKNL= yes
##$PPARMOD= 0
##$PSCAL= 0
##$PSIGN= 0
##$REVERSE= no
##$SF= 200.130013532006
##$SI= 16384
##$SIGF1= 3
##$SIGF2= 2
##$SINO= 400
##$SIOLD= 16384
##$SREGLST= <1H.CDCl3>
##$SSB= 0
##$STSI= 0
##$STSR= 0
##$SW_p= 3612.71676300578
##$SYMM= 0
##$S_DEV= 0
##$TDeff= 0
##$TDoff= 0
##$TI= <>
##$TILT= no
##$TM1= 0
##$TM2= 0
##$TOPLEV= 0
##$USERP1= <user>
##$USERP2= <user>
##$USERP3= <user>
##$USERP4= <user>
##$USERP5= <user>
##$WDW= 1
##$XDIM= 8192
##$YMAX_p= 0
##$YMIN_p= 0
$$ End of Bruker specific parameters
$$ ---------------------------------
##NTUPLES= NMR FID
##VAR_NAME=  TIME,          FID/REAL,        FID/IMAG
##SYMBOL=    X,             R,               I
##VAR_TYPE=  INDEPENDENT,   DEPENDENT,       DEPENDENT
##VAR_FORM=  AFFN,          ASDF,            ASDF
##VAR_DIM=   8192,          8192,            8192
##UNITS=     SECONDS,       ARBITRARY UNITS, ARBITRARY UNITS
##FACTOR=    0.0002768,     1,               1
##FIRST=     0,             0,               0
##LAST=      2.2672688,     0,               0
##MIN=       0,             -130410,         0
##MAX=       2.2672688,     99568,           0
$$ Real data points
##PAGE= N=1
##DATA TABLE= (X++(R..R)), XYDATA
0 0 0 0 0 0 0 0 0 0 0 0 0 0 0 0 -8 8 -8 8 -8 16 -16 16 -24 24 -32 32 -40 48 -56 64 -72 80 -89 104 -117 129
36 129 -145 165 -184 207 -229 255 -281 312 -345 382 -422 464 -512 565 -621 685 -756 832 -918
55 -918 1019 -1130 1258 -1406 1581 -1791 2046 -2366 2782 -3348 4160 -5439 7744 -13237 56342
70 56342 -11871 -122927 11862 81753 11966 -65166 4354 53161 -5096 -39955 -1342 7494
82 7494 10527 13135 4215 -29584 -35148 21235 44056 -14305 -30436 -673 12259 968 -11427
95 -11427 -273 13269 6610 3271 -19554 -23096 28123 40320 -11612 -35721 -1848 31364 2226
108 2226 -21672 13509 15614 -18015 -11254 7371 3979 -6232 5475 14881 -22418 -30914 23723
121 23723 28527 -17667 -21897 12051 14902 -22822 -12689 35663 11282 -32007 -5898 24028 4468
134 4468 -20327 4200 32016 -5716 -32095 3192 22153 6814 -8369 -9160 864 588 875
147 875 1658 -9800 2568 14749 -11899 -23194 5195 25549 3161 -27737 -3567 23555 -4873
160 -4873 -16424 11624 17779 -7358 -18928 7973 18531 -9125 -6459 14638 1852 -13844 -5421
173 -5421 12777 9392 -11617 -5504 6073 -4466 -4429 2537 2465 1048 -5312 -4905 -984 705 8640
188 8640 -107 -11765 3650 9004 -5070 -7138 7182 16308 -5683 -19319 7969 17109 -3518
201 -3518 -8325 2192 6966 -3686 -7380 6918 2131 -6727 3675 1480 -10355 -5492 9756 11080
215 11080 -12607 -16298 11937 11618 -10499 -8680 7680 11207 -6700 -11795 7489 9112 -1272
228 -1272 -1026 -1426 300 1620 689 3715 -736 -3298 1468 -1765 -368 2136 -3493 35 2608 -2864
244 -2864 -5977 -3410 8719 6479 -12854 -7422 10403 5834 -7241 -7125 9726 9703 -11386 -6886
258 -6886 11076 6398 -4587 -4297 4828 4492 -6998 -641 8399 -1312 -5659 -992 2671 1333 -5240
273 -5240 -417 4701 -2960 -4388 -1054 1136 3593 -2075 -4119 1003 995 1467 -1016 -1305 5233 1088
289 1088 -4838 940 3649 2262 -1445 -1725 4041 -1179 -4406 4345 3024 -3730 -3339 1020 3713 -4435
305 -4435 -5669 6068 2856 -7232 -3943 3269 5369 -3484 -5557 5050 3192 -4587 -1024 3017
319 3017 4073 -1025 -3797 3273 2875 -1671 652 915 1654 -353 -4061 1905 3148 -2002 -2255 -1131
335 -1131 1972 508 -5274 600 4373 -1815 -4233 -1440 3889 2303 -5581 -303 5503 -784 -3326
350 -3326 233 4929 2654 -5049 -326 5455 -654 -2430 937 2795 800 -4503 -550 4296 -1586
365 -1586 -2809 28 999 75 -3972 -616 4061 -1288 -3376 -353 1515 2120 -2693 -1678 4081 1014
381 1014 -2153 -610 1563 3598 -1178 -2420 2977 865 -1530 427 1140 1003 -2432 -1710 3698 -402
397 -402 -4414 275 2646 433 -4696 -3345 5532 2124 -5188 -2217 2528 3478 -1744 -3794 3372 3165
413 3165 -1914 -1164 766 2350 649 -1876 1956 1059 -2355 722 1647 308 -1931 -2592 2834 1532
429 1532 -4259 -1608 1828 1351 -1779 -4064 1338 3252 -2128 -1615 725 1230 362 -1910 1695 2444
445 2444 -2208 -153 2414 1225 -787 -2064 2016 3414 -2702 -2590 1258 2051 600 -3410 -1719 2463
461 2463 135 -1106 -1390 -1499 1530 459 -1161 -865 -1297 1770 2421 -1898 -1681 523 2629 2738 -2975
478 -2975 -2179 3136 2994 6 -3492 -1267 5176 1532 -3871 -2509 1359 3770 -909 -5000 214 2579
494 2579 -41 -1567 -2376 849 1325 -1204 -14 -389 -885 1779 1037 -244 -1300 -738 3677 1737 -3206
511 -3206 -913 2361 2644 -1047 -3689 2219 3400 -2339 -2634 768 2276 -682 -4012 1223 2944 -3178
527 -3178 -2957 1620 2751 -1420 -5096 1636 5496 -2064 -3944 1273 4194 903 -4112 146 4308
542 4308 -312 -1569 648 582 74 -867 1659 1097 -3983 -701 4019 371 -4122 -3008 3795 3864 -4866
559 -4866 -4366 3288 3691 -1354 -4725 -43 5110 -65 -3074 113 1752 1599 -746 -636 1577 -687
575 -687 -144 2488 -426 -2191 -257 2529 1954 -3795 -2808 3761 1685 -3444 -3035 1788 3476 -2510
591 -2510 -3854 2443 2125 -1921 -1602 1182 2617 -1531 -2144 2945 1563 -1862 -775 1465 2342 -679
607 -679 -2203 1697 1667 -574 -1140 -1050 1122 985 -1782 -582 -350 -97 666 -1241 -698 68 -692 1128
625 1128 183 -1555 49 910 1674 -140 -2660 1035 3113 -6 -1907 -911 2460 2232 -2325 -1572 1591
642 1591 1276 -10 -1778 -776 1787 2 -917 -800 -910 937 331 -1025 -461 -583 752 1078 -1298
659 -1298 -445 689 906 1046 -1338 -720 2109 1065 -582 -1002 535 2562 -700 -2037 1141 921 -620
676 -620 -1221 -360 1501 -946 -1810 1172 301 -1233 -756 132 1450 -1094 -1755 1842 1155 -1196 -465 612
694 612 1780 -414 -1546 1520 1224 -696 -391 -16 1434 38 -1752 757 1078 -698 -902 -364 889
711 889 -75 -2224 230 1038 -798 -975 -632 1196 498 -1870 306 1792 -95 -802 -137 1416 953
728 953 -1750 323 1782 -142 -454 -226 778 668 -1547 -72 1034 -797 -710 -178 217 158 -1337 -140
746 -140 985 -868 -686 143 451 435 -1134 -49 1640 -189 -603 251 793 1101 -907 -488 1853 79
764 79 -874 4 427 779 -1082 -1066 1259 -213 -1316 -197 375 697 -1360 -1067 1446 3 -1464 -122
782 -122 503 977 -633 -954 1442 676 -888 223 470 1103 -53 -1093 1290 639 -898 -23 365 551
800 551 -492 -1433 839 701 -1390 -567 193 491 -423 -1661 621 1148 -972 -701 196 951 133 -1304
818 -1304 661 1408 -303 -286 385 784 439 -1028 385 972 -954 -102 495 131 -84 -1074 186 868
836 868 -1396 -550 408 168 -404 -1235 188 1198 -694 -707 462 581 475 -740 -117 1553 -184 -439
854 -439 363 334 771 -665 -196 1287 -471 -951 453 304 39 -1111 -552 1406 -530 -1393 308 374
872 374 94 -1189 -518 1550 -289 -1099 557 398 231 -242 -130 1235 0 -764 870 577 -33 -336
890 -336 -337 1286 21 -1136 58 321 219 -484 -1122 607 523 -1032 -542 -50 373 -11 -924 388 640
909 640 -747 46 547 207 -151 -365 1166 661 -1262 123 1249 151 -628 -685 1186 732 -1384 -308
927 -308 582 -305 -335 -584 157 317 -1194 281 385 -510 -191 -35 328 450 -823 -90 750 153 193 -573
947 -573 17 1335 -80 -382 216 185 645 -538 -807 631 -116 -422 174 -264 -172 -439 -43 455 -1226
966 -1226 -756 991 292 -659 -524 293 1467 -426 -932 707 778 404 -153 -587 948 579 -30 -1 -557
985 -557 677 822 -887 -361 367 -188 -17 -348 185 37 -935 468 510 -1210 -352 643 539 -525 -1256
1004 -1256 1099 1299 -1305 -546 1044 848 -495 -816 1304 953 -1252 -47 1185 0 -633 -519 1033
1021 1033 542 -1598 -409 695 -183 -355 -761 311 802 -724 -230 360 12 163 -389 55 725 -628
1039 -628 -260 659 228 -167 -325 559 1132 -933 -767 1487 418 -961 -1214 663 1546 -1263 -1580 1074
1057 1074 688 -737 -907 347 808 -1064 -565 1146 13 -854 475 828 326 -874 127 1788 -460
1074 -460 -875 564 722 78 -552 -222 917 -175 -530 27 -300 94 13 -732 177 -129 -176 -174 -602 401
1094 401 216 -774 440 464 -216 -285 128 776 202 -895 562 830 -618 -162 389 679 -212 -783 610
1113 610 260 -871 71 228 -46 -600 -458 554 42 -1025 211 175 -103 109 -388 28 421 -97 314
1132 314 -197 -235 842 -68 -419 455 276 219 -354 18 738 -440 -539 761 102 -563 -463 122 593 -965
1152 -965 -445 946 -139 -786 69 582 420 -838 -113 1172 -245 -470 504 317 78 -393 13 729
1170 729 -141 -273 280 -441 140 94 -310 225 28 -198 4 -507 297 88 -805 41 262 -277 -227 -114 668
1191 668 26 -878 444 779 -340 -70 409 683 -126 -824 713 518 -632 -59 258 143 -343 -603 671
1210 671 143 -885 122 336 -292 -156 -357 378 52 -652 248 84 -210 261 -300 95 310 -120 366
1229 366 -145 139 536 -342 -169 684 -177 -321 -49 351 263 -651 -309 675 -283 -744 -33 285 221 -804
1249 -804 -219 826 -386 -385 386 423 42 -364 174 759 -345 -236 468 2 164 -49 29 345 -226 -159 323
1270 323 -273 171 -161 -316 125 -204 -199 -63 -236 231 71 -573 211 264 -493 -23 101 480 -121 -447 658
1291 658 376 -453 5 431 217 -362 -577 632 215 -686 128 311 -146 -265 -250 385 -40 -530 143 131
1311 131 -222 57 -149 192 210 -402 230 122 -23 279 -165 100 552 -339 -8 189 149 196 -278 48 580
1332 580 -522 -258 179 5 -31 -553 -55 583 -515 -396 287 -60 -174 -491 405 496 -487 -143 395 -9
1352 -9 -82 156 270 303 -173 -228 417 -100 105 -65 -25 405 -197 -223 122 -105 -120 -33 -350 292 -175 -314 162
1375 162 56 -20 -74 -100 377 30 -327 341 198 96 50 2 541 97 -500 181 255 -16 -167 -147 309 56
1397 56 -470 223 13 -68 -38 -157 79 9 -304 101 199 -73 53 -253 218 419 -343 111 398 72 186 -24
1419 -24 118 185 -176 171 267 124 -43 -65 98 127 -402 -41 261 -116 -163 -174 -38 289 -225 -19 261 -152
1441 -152 -47 57 38 360 -111 -62 425 10 67 -68 127 253 -102 -149 241 -86 -51 -169 -281 110 -198 -481
1463 -481 230 101 -264 -126 -230 222 90 -316 232 63 11 106 -127 450 140 -217 204 153 -53 53 -69
1484 -69 304 150 -465 -12 93 -124 -203 -244 159 90 -662 49 124 -68 -214 -173 273 154 -429 98 482 10
1506 10 59 39 359 107 -421 255 468 -149 79 -13 385 290 -365 -66 315 -225 -210 -144 105 102 -368 1 273
1529 273 -291 -173 -129 62 212 -441 -58 373 -174 -167 -86 326 189 -183 6 496 45 -131 -50 134 244 -306
1551 -306 36 285 -184 -258 29 215 27 -235 -174 296 -107 -367 94 73 16 -71 -114 447 -6 -166 58 -25
1573 -25 -12 48 -89 250 -43 -241 -5 54 84 1 -250 151 37 -215 29 -95 145 7 -328 206 81 -323
1595 -323 105 -37 52 -9 -203 182 -74 -148 313 193 233 -7 -178 140 194 -172 109 38 -64 55 -269 -39
1617 -39 -17 -194 15 -94 28 38 -120 -104 -24 7 -39 28 -29 194 -186 7 283 -96 -41 45 155 124 -185 -109
1641 -109 385 -212 -102 11 35 96 -207 -160 157 -145 -207 165 11 116 -179 -182 69 -5 -102 164 -111 17 -5
1664 -5 49 311 27 -250 180 -66 78 45 -33 150 15 -130 -92 -147 6 43 -180 192 -86 -218 30 0 0 -27
1688 -27 -252 113 86 -280 69 150 249 -198 -39 190 162 -125 81 39 77 -94 -237 101 58 -174 31 178 -20
1711 -20 -140 -105 214 -81 -70 81 -54 11 32 -167 39 292 -137 34 99 72 -3 -35 176 268 -85 -3 111 -3
1735 -3 100 -84 14 86 -292 -125 216 -152 -201 -157 -111 212 -332 -89 69 -59 40 -92 -23 47 -83 -206 280
1758 280 -213 -23 -23 -41 263 -125 -110 183 -8 151 165 10 95 -4 -70 64 55 -69 -171 -101 189 -33 -174 -38
1782 -38 -7 -70 168 3 72 65 -201 71 209 43 7 57 63 82 -52 13 139 -44 -79 -65 64 74 -244 102 44
1807 44 -49 -55 -64 78 61 -162 55 4 -11 1 -173 246 39 -148 175 56 -124 3 35 131 130 -139 64 188 -104
1832 -104 -158 38 77 57 -194 -64 -25 -45 -26 -82 -9 -77 -295 -35 136 -79 97 -41 56 113 -85 70 338 96
1856 96 109 45 -133 34 -20 -106 104 -59 -65 86 65 -68 -44 -199 31 -117 -57 2 -23 31 -82 -80 -112 -133 40 -115
1882 -115 67 95 -45 -82 259 78 -180 60 -106 160 122 -201 -49 62 47 -128 3 -38 -50 -103 224 21
1904 21 -40 57 -57 -10 50 -141 -18 89 -135 0 -49 -91 60 -152 40 76 41 177 13 -40 105 -235 -182 131
1928 131 -3 -78 -76 -86 124 -18 -199 45 -19 -87 -92 -14 108 -155 -64 191 -83 -38 5 -45 69 -138 0 165
1952 165 -107 -58 -90 31 161 -62 -69 240 -135 -113 60 -72 -35 -14 -67 156 -50 15 -58 -26 224 -52 -123 129
1976 129 -34 -34 -26 30 179 -1 -20 129 104 -31 73 -50 53 85 -97 153 19 -91 42 -58 165 -146 -297
1999 -297 118 -38 -229 -36 -35 77 0 -128 124 -97 -175 112 -9 -18 -4 84 103 -20 -113 89 32 3 -114 -142
2023 -142 98 150 -26 -22 98 -110 58 -163 12 141 -298 -14 -55 44 224 -56 -97 94 -63 18 189 57
2045 57 163 -18 -158 60 -64 -70 104 -74 18 -58 -26 4 75 68 -44 -165 -85 107 -16 131 -126 63 134 -113
2069 -113 25 -36 -94 146 43 19 42 62 -168 -74 -106 126 -9 -116 106 -135 130 41 -43 -10 37 -193 25 -68
2093 -68 -12 -19 -7 169 -27 -66 61 -18 29 26 -53 83 10 -131 56 89 25 35 -70 42 -45 -85 98 -52 -317 -6
2119 -6 -41 -111 -107 -106 40 -117 -154 64 -27 -157 -66 -73 -30 43 -179 64 -78 -38 149 -37 56 102 -45 53 -72 21 232
2146 232 -243 -3 22 -130 -143 -18 50 5 -50 -145 102 33 -70 40 42 145 25 -33 173 9 -110 138 37
2169 37 186 17 249 2 -127 -35 -44 -54 111 86 -89 208 44 46 -8 31 178 43 -79 73 26 -87 -4 2 76
2194 76 -71 -58 -18 -24 73 164 105 137 54 -19 83 -33 66 120 81 -14 -68 -101 208 61 -34 53 -134 -133 -36 12 -43 -117
2222 -117 -67 -31 -112 -35 -21 -119 -17 -122 26 -33 21 96 123 -35 -53 165 -136 -168 43 -89 24 -106 31 90
2246 90 -95 -18 -124 79 -40 -6 -60 43 -140 118 -6 -16 -50 93 -151 -29 139 50 100 5 217 -5 -13 72
2270 72 -62 -18 4 15 113 -24 -106 89 -129 13 -75 34 81 -150 68 63 -8 44 -71 -87 122 -20 -54 -14 -9 -80
2296 -80 149 126 98 -76 -184 53 42 -113 178 -162 -22 150 -74 27 149 -30 -31 42 -20 15 12 -190 45 -95
2320 -95 -79 -67 -140 99 -31 11 97 -13 49 0 33 144 -99 24 -22 -35 6 41 -76 134 30 35 -35 -51 -47 -170
2346 -170 10 -17 -72 71 -24 -79 44 91 96 -17 61 -57 51 30 -24 33 -68 185 -28 -47 -14 -127 -29 -90 6
2371 6 23 28 135 -99 -191 -5 -42 81 116 -105 -45 30 -81 61 70 -66 157 74 -55 -18 35 -88 3 119 4
2396 4 90 61 103 78 -138 59 -93 114 2 -45 145 -91 -122 -91 -36 150 63 -94 41 -149 -8 111 54 -84
2420 -84 113 82 -2 -8 -8 -60 -19 230 43 40 169 12 -156 -227 -8 10 -122 67 44 -58 -155 96 -104 22 39
2445 39 -59 -56 -27 -103 -13 120 -31 -5 -9 20 38 35 30 -211 -48 70 -229 3 1 -39 -105 7 -104 22 -132 -9 -65
2472 -65 -31 27 52 -3 -16 -9 -121 181 67 -29 31 -111 -34 -26 54 176 -6 97 108 71 34 58 -56 81 -47 -162
2498 -162 -2 83 -187 -82 -134 207 117 -92 126 3 190 120 -27 32 -10 -76 67 12 -6 124 -17 -38 -64 -80
2522 -80 -10 70 -109 15 -39 63 -50 -154 154 69 -2 -1 18 -31 19 -77 -42 57 -11 50 -81 -48 -27 23 -59 -20 -42
2549 -42 88 -67 80 -47 21 -14 3 -103 -66 -142 97 62 -32 33 97 -21 -4 8 -77 175 69 74 47 13 -94 42
2575 42 40 50 -189 -118 -55 47 -124 -71 -1 -21 137 -46 85 69 36 -107 137 239 -230 -82 8 -6 105 71 64
2600 64 33 4 46 21 -75 -2 155 -91 26 56 -20 206 -38 7 -60 -80 -58 71 -28 -17 -36 77 -35 -24 47 -105
2626 -105 -119 33 18 -21 -48 -2 66 -84 -116 185 0 83 -93 120 215 78 39 38 131 -170 149 84 -73 65 58
2651 58 135 -138 -129 57 60 -161 9 -96 -105 133 -77 -110 2 10 103 -163 -136 201 -130 -13 193 101 130 80 60 12
2677 12 11 -39 90 56 8 61 -217 -122 -83 -26 195 -89 -138 -58 18 23 -44 39 4 -144 -73 -54 -30 80 -161 -193 -56
2704 -56 186 -34 90 123 -46 55 7 -61 -88 14 -132 -37 77 38 -23 -45 -34 80 9 -120 -87 -70 28 105 -18
2729 -18 49 110 -31 28 326 -124 74 15 32 84 -43 -118 125 -78 25 32 122 86 -87 50 -125 -1 38 -131
2753 -131 74 -83 68 -67 142 79 -111 -86 11 152 -76 -36 28 51 70 24 27 69 112 17 -34 30 -111 106 -147
2778 -147 -128 -119 -23 139 -205 0 -12 -37 59 -129 138 -10 3 -115 149 -274 -24 109 59 103 -100 123 15
2801 15 -5 81 -22 -111 -2 -1 -91 86 -102 36 78 -33 93 -21 -9 -202 -46 131 61 -93 -80 -13 -224 -111
2825 -111 -18 -48 -31 -47 99 130 19 258 50 -30 -15 21 105 -99 64 17 127 106 -97 -54 -81 -89 26 75 -16 -128
2851 -128 -70 -25 -14 -120 -61 173 78 47 -68 -226 97 -81 3 12 -164 -33 -102 -26 48 132 50 -52 55 -17 -101
2876 -101 -148 141 26 -2 0 176 -119 -66 85 -72 32 -172 1 33 79 116 -59 -232 32 -168 121 -22 -56
2899 -56 -83 -117 33 -54 159 3 -56 74 -160 -29 -165 -88 -46 -59 63 -143 119 -144 -57 30 119 -96 72 128
2923 128 0 -8 -91 157 52 60 -14 62 -77 22 -103 -62 20 19 -105 129 162 -53 -2 29 102 15 -90 -119 -171 -33
2949 -33 -155 -33 52 -161 -147 6 -16 59 126 -29 -107 -22 10 -3 94 90 49 -41 137 -72 56 97 89 41 -118 58
2975 58 -73 -153 -129 26 1 -12 61 -36 101 -31 -1 93 39 180 -59 182 134 -32 -109 -58 -154 -42 135 -140 -16
3000 -16 80 -103 94 -2 -29 91 -21 -11 82 -39 41 -17 90 32 35 -77 43 -121 -22 -30 89 63 -27 45 36 26 64
3027 64 -100 -82 37 -53 2 -110 42 109 -24 -83 -9 71 -56 62 -51 55 29 19 -55 -54 87 38 -54 1 40 -14
3053 -14 -65 -120 -26 33 -167 18 156 61 0 189 -40 -2 -4 15 -28 -5 -86 -70 -129 -70 -5 -5 35 -2 198 61 -8 -61
3081 -61 51 -22 200 92 104 49 -72 -50 -42 -74 115 -123 -108 -143 32 -39 -27 22 24 56 144 60 -7 -70 -147 -43 -73
3108 -73 -20 25 26 -131 56 -20 77 -37 53 33 29 10 57 -28 -63 -18 52 -56 72 -87 -66 129 -70 106 -28 11
3134 11 -5 -38 -99 37 18 20 71 -192 23 -74 -123 97 -63 -73 -49 -110 66 26 100 -10 28 -50 -119 -41 -83 -129 -35
3161 -35 135 95 -88 -79 -91 -9 -72 117 -26 -52 118 73 46 149 8 -37 132 116 38 144 -64 -73 -46 -70 87 10
3187 10 58 101 110 -34 291 -135 81 52 -7 -31 -229 109 122 10 103 142 38 106 -86 -52 -69 8 -87 -65 72 133
3213 133 126 -102 86 106 -21 -40 41 39 137 -100 18 62 -67 -66 36 32 -83 -79 76 -34 -55 -87 -67 -45 -80 24 141
3240 141 12 71 10 -8 -156 -86 -114 46 26 -76 72 77 28 35 -27 16 196 -29 135 -168 -93 -24 -55 16 91 57
3266 57 64 -202 221 60 -101 60 156 62 -15 73 100 7 -9 51 123 77 116 97 155 -49 -9 73 -59 -192 -42 -70
3292 -70 -1 166 -40 -7 196 70 -103 54 -20 123 -4 122 103 100 -48 102 -78 66 157 48 87 -16 59
3315 59 115 -2 27 -42 20 162 20 -52 70 86 27 -58 -68 39 65 122 155 -149 -85 -3 64 -39 168 -29 211
3340 211 39 -22 68 34 -23 -11 164 -19 -6 -37 39 70 -83 -110 -50 -35 -60 -58 7 -18 42 -111 68 53 6 123 -16
3367 -16 14 4 17 62 -46 -103 -9 117 52 -147 -44 -213 -67 -89 -163 -32 -10 8 82 -60 64 -51 -155 90
3391 90 50 -10 48 54 -12 45 12 -17 100 118 75 -34 36 -69 36 119 61 -140 53 -53 54 128 108 5 -49 -146
3417 -146 17 4 -157 -1 161 -30 201 -127 125 56 -12 82 -16 -39 -102 -83 104 -36 -25 -66 -78 -115 37 -159
3441 -159 45 103 4 -145 11 -26 -94 -45 84 23 -20 -58 -140 -96 -116 -177 -34 6 -90 -1 -68 -43 -6 -22 119 51 82
3468 82 -27 -1 28 -267 -92 -228 183 -61 -51 -116 -216 78 -19 104 132 -68 13 139 81 32 120 -104 13 -127
3492 -127 -119 -54 46 -74 -62 97 147 -67 -149 -39 7 54 223 -85 23 -22 -52 65 -85 -25 108 110 90 -34 26
3517 26 102 128 20 11 111 69 147 57 145 -37 127 -108 5 69 -35 -89 -82 -168 23 3 -43 66 -97 -85 -1 32
3543 32 -100 113 40 -121 68 -70 -40 128 -60 -17 96 250 193 28 14 2 -86 8 -108 -63 -79 -95 127 -106
3567 -106 -64 -46 -43 -82 -42 14 3 12 -85 51 -210 69 -5 -11 -36 18 -65 125 88 -6 188 -48 -16 -5 -97 -5 39 -88
3595 -88 -94 -84 -34 -111 100 -10 -150 -55 54 3 -107 64 -126 78 21 50 37 -109 91 70 -195 -43 22 -52 139
3620 139 -7 25 -37 63 -25 43 -57 -48 49 78 -39 10 -37 86 16 -191 55 6 119 -55 -49 -142 20 -58 64
3645 64 -67 -19 -42 -124 51 -15 -9 77 -156 0 -61 -93 60 -48 18 25 -16 -30 -171 -124 -59 26 -104 -34 -47 78 -19
3672 -19 26 73 62 78 233 -39 95 153 -11 -20 -15 45 -28 36 91 72 -130 123 -128 -30 91 45 -59 -127 15 -3
3698 -3 216 -45 -132 -101 -148 -146 -46 223 -39 -146 119 -87 126 -91 30 -45 25 39 132 109 -147 51 42 -121 3
3723 3 -47 89 -195 4 157 -18 35 -43 -29 32 5 6 -58 -23 -103 51 76 39 -54 -45 -11 -31 -44 -5 -47 -201 88 -41
3751 -41 48 -87 -52 -49 77 80 176 22 113 87 -86 43 14 -2 -8 -113 -63 65 19 88 65 -90 53 28 103 79 -77
3778 -77 62 -18 10 52 115 119 86 -127 109 54 170 -7 -6 -27 28 163 -54 3 73 -12 -86 -46 -26 63 -53 187 24
3805 24 37 54 26 92 -154 -65 -64 -115 101 34 0 132 -170 -11 -4 99 69 65 20 71 92 96 150 -39 74 -127 -185 35
3833 35 117 -43 -159 37 -57 135 42 -54 11 -56 31 51 36 57 -38 22 31 121 -26 -77 -126 22 70 110 82 81 18 54
3861 54 -147 73 -13 15 109 15 -120 -38 92 -166 -173 110 45 -85 -5 34 105 128 -108 -24 39 -4 22 -83 107 -112
3887 -112 72 102 79 -167 -91 -26 77 152 -45 -75 69 20 -18 -60 10 174 -112 -31 -42 53 -54 -100 61 -19 99
3912 99 -147 156 34 16 34 104 -66 -30 -56 202 9 -231 117 84 -72 -54 -5 44 -94 -72 134 5 -75 78
3936 78 224 198 -58 -78 -9 -85 20 -25 -24 -76 25 55 -54 -3 -54 -18 10 -60 75 -95 -112 -54 -54 47 125 96 -6
3963 -6 -43 143 60 28 -19 -166 84 -195 94 -6 -7 16 13 -255 0 4 -88 60 -103 -134 12 -50 65 29 -69 -82
3989 -82 -47 48 123 16 -47 48 82 64 16 -86 57 -83 -20 4 -102 -89 -23 -39 -215 9 -79 -99 204 -47 -55 -54 -66
4016 -66 45 21 2 130 2 82 66 139 -32 15 61 2 -8 -77 99 141 -147 -144 102 92 -31 -113 -39 -62 43 47 -36
4043 -36 -57 -22 47 130 71 48 76 1 -75 41 -68 57 39 40 70 -168 -23 -79 56 38 -29 16 11 -96 50 11 -129
4070 -129 174 -76 87 -95 -128 -50 -103 -47 95 43 73 76 100 114 -55 2 103 6 113 -45 -150 41 103 -146
4094 -146 -144 -27 145 -36 -38 -23 -1 -39 -162 136 169 -88 -123 24 -11 138 139 -33 72 -33 -139 29 61 -44
4118 -44 89 -34 48 149 120 -19 73 -41 -93 -49 -70 72 19 16 -13 -42 26 23 -155 -11 44 -54 68 18 51 122 -96
4145 -96 68 -69 25 60 110 18 -136 -14 -120 -119 41 52 -74 29 54 29 -25 71 53 207 -114 -9 74 -105 99
4170 99 51 -6 -83 70 83 32 75 69 -124 72 101 68 72 49 -48 -9 22 122 125 -122 -110 -88 -140 -20 -68 -169 77 -217
4198 -217 -129 100 62 -103 -13 -201 -38 -160 -186 54 40 -1 -52 65 53 20 75 78 -96 -31 2 -119 77 62 109
4223 109 -70 35 3 213 -123 1 10 -51 48 -73 -73 89 -16 -147 84 92 63 26 -93 -98 -19 -61 -13 -47 71 72
4249 72 -108 -30 18 -55 22 -27 -77 -56 -5 -6 -27 79 -72 -114 145 143 -70 141 -87 -25 -39 22 21 23 -16 25 -64 20 85
4278 85 -62 25 -63 -67 -125 43 -244 19 103 -4 40 72 35 -105 -27 -6 -176 -11 98 23 75 147 117 53 44 23 127
4305 127 -9 -180 103 21 -148 44 40 41 -60 90 102 -75 29 -58 -165 -20 36 -139 1 -127 1 107 -37
4328 -37 -11 35 -25 15 127 1 74 33 122 305 -17 -76 -71 -146 -44 -29 -24 152 -17 153 -82 -62 -16 -106 109 26
4354 26 10 -77 25 -38 61 -31 3 -55 -36 89 -84 15 -74 44 89 -17 -94 17 175 -99 83 124 13 44 88
4379 88 5 -133 51 -3 -50 -160 -44 58 -33 1 117 150 -25 26 77 -236 -53 132 114 -23 -180 -74 63
4402 63 15 26 135 13 -46 55 16 9 -23 -32 38 77 132 35 -196 -54 -37 -91 39 -63 203 123 -40 72 97 -31
4428 -31 125 -3 73 73 -140 -9 119 34 13 3 -116 4 -50 -43 60 90 86 19 -138 -8 4 74 -11 -74 66 20
4454 20 -83 103 -32 -24 -65 166 172 54 156 164 -49 7 -61 -89 34 3 29 49 42 -56 -71 -193 -24 198 -104 -66
4480 -66 87 -82 67 -23 89 -156 51 101 56 -91 36 -63 195 -39 122 168 94 106 152 -93 7 77 7 84
4504 84 -53 111 65 2 -71 70 0 -100 -94 31 117 -63 27 -109 -168 -109 -70 89 -65 43 -55 61 13 -22 -97
4529 -97 -32 -128 22 -121 -20 -27 -46 74 -86 51 20 1 17 2 -119 -164 97 102 -72 -76 -81 56 -115 44 -32 -63
4555 -63 -47 -27 71 -44 -91 -47 -4 -97 28 -186 -8 -64 18 -47 -13 -53 -70 -35 -166 165 -31 105 -68 -41 -25 67
4581 67 -110 -32 -8 98 104 9 17 -113 128 144 -71 -68 52 78 62 -46 -73 60 93 -22 27 -110 -165 13 -114 10
4607 10 -121 89 -28 0 -23 85 -38 93 47 -82 48 -27 -57 -109 -129 138 24 -7 -26 37 -27 5 -74 18 -48
4632 -48 39 62 -31 -12 -26 127 14 34 49 -38 -174 145 -27 87 13 -21 31 -72 -174 44 186 46 -18 132
4656 132 2 110 -221 53 -101 -170 122 -95 -6 -49 24 -198 -26 -91 -2 0 -15 -31 9 101 137 153 -60 -9 -96
4681 -96 -13 -111 -51 63 51 65 -16 60 -60 -150 46 15 -129 41 -18 -65 -172 44 7 78 46 5 66 -42 40 -48
4707 -48 -27 58 93 161 25 -30 10 19 5 -8 44 -34 115 18 -217 -143 -101 59 21 -79 50 -2 -62 -17 7 -21 -19 -42
4735 -42 40 -151 -123 26 -3 123 12 29 47 -66 -86 60 37 70 -93 12 -111 87 -122 13 157 88 111 -49
4759 -49 -63 -117 118 70 -61 78 -16 -55 -26 -57 -60 155 136 -18 -31 -152 -58 49 135 24 113 76 38 39 162 -14
4785 -14 3 -190 128 -94 -5 -14 39 99 -13 -44 150 -45 -97 20 109 11 46 152 10 125 83 -278 -40 -13 -172
4810 -172 -45 9 -29 -19 78 -106 -70 20 -112 -45 -163 -176 86 -127 -67 -62 7 -2 -109 -4 -79 85 -12 6 -36 -23
4836 -23 74 123 64 -29 24 77 113 -25 73 119 -75 160 57 87 -10 4 -16 -122 20 -36 5 91 -105 16 -27 -39
4862 -39 59 -12 58 38 -3 61 -44 -99 71 49 106 36 79 48 -78 20 -60 -97 8 39 124 144 93 90 6 5 -28 -35 -83 18
4892 18 7 3 -38 43 -2 66 60 -28 110 -46 -48 54 72 22 56 -25 1 -56 47 48 -31 -43 77 93 137 63 -6 96 -121
4921 -121 142 74 -63 17 31 -142 67 0 138 121 -62 3 -41 113 170 -198 -85 90 43 34 30 44 21 38 100 -19
4947 -19 10 68 11 -13 83 51 -10 -53 -56 -54 132 -90 47 -89 -9 36 -110 -193 47 -124 -43 -33 -66 125 -169 -37
4973 -37 89 -53 -97 95 -116 -84 -108 36 204 -52 -62 22 -15 -27 -1 -38 84 -132 41 -42 -64 138 22 -179
4997 -179 52 -1 -21 5 -86 -8 -46 -20 61 -162 19 20 -32 76 -76 -42 11 -43 -176 -107 -77 -18 -105 52 33 150
5023 150 27 -22 -18 -175 18 -67 114 80 -66 35 -45 -13 100 -222 -47 -10 -39 99 -18 -22 33 51 44 55 -58
5048 -58 -10 -2 36 -13 -31 -3 59 -160 -33 -34 19 3 -127 -57 6 74 186 -243 -93 -56 70 -69 -25 85 53 3 -196
5075 -196 -118 38 -18 -38 -14 13 -105 32 71 30 75 80 76 -119 115 92 33 -97 -10 -16 -68 25 59 -18 -66 92 -31
5102 -31 -95 -32 -23 49 8 -183 57 77 46 -95 -129 -99 57 126 -8 0 94 128 -42 -20 -24 96 11 -49 73 54 -48
5129 -48 6 -89 -29 84 -137 -7 -184 -11 -7 20 51 33 -27 120 -155 11 -76 0 -87 101 48 49 -16 71 71 -29 15
5156 15 -24 45 -256 46 109 -52 -25 73 54 -52 -161 186 -86 -61 56 -15 -132 13 -8 51 -91 106 -85 8
5180 8 43 -83 -10 -22 66 -57 50 152 -18 12 -223 -8 -33 -20 10 125 -13 63 -68 -59 -3 -38 91 -183 -78
5205 -78 -14 45 27 -45 -72 -68 15 -41 109 -67 60 -30 -67 26 -82 103 56 108 101 -182 -14 -122 141 -187 -127 107
5231 107 118 5 12 -26 203 18 112 -87 22 18 -18 48 -37 -21 35 -300 56 45 -16 83 64 -5 59 29 -62 -51 99
5258 99 -49 188 37 -54 -137 -95 97 -40 75 112 -116 -7 -49 -75 26 4 94 -18 115 142 53 -7 135 -48
5282 -48 -32 -56 64 42 -79 -200 204 -72 -143 103 87 -79 125 168 -9 19 122 -78 -112 -9 -42 -77 19 17 55
5307 55 -26 -38 -82 55 -54 61 -124 22 -57 -90 -1 -59 0 83 82 -9 -32 -18 57 -14 14 -97 126 -89 35 51
5333 51 -82 112 -40 78 -31 13 -28 -37 -13 9 -42 66 -100 -14 -141 126 -66 -125 -3 148 134 -48 248 14
5357 14 10 43 64 -72 22 -116 40 -7 155 -40 149 83 -62 -13 -6 58 24 -9 19 -162 23 70 92 -23 99 58
5383 58 -63 -32 156 110 -4 150 104 162 -39 70 69 -5 16 -113 51 28 -188 -16 153 120 54 33 -121 -116 -59
5408 -59 -9 -51 -66 -48 96 -74 -194 20 -75 -54 122 -25 84 15 40 -47 -128 -136 114 13 -8 62 47 -51 89 -22
5434 -22 51 -207 20 150 -30 71 25 8 9 -29 -111 -5 30 -8 23 -64 14 34 98 29 11 94 94 -87 -108 -32 -62 -148
5462 -148 -108 31 -251 -3 -33 -130 146 -18 -121 59 -137 90 59 37 -139 76 -63 52 133 47 -72 16 -118
5485 -118 63 -19 14 -55 -56 27 -12 -54 -80 53 -94 58 -17 -214 8 172 99 122 -15 -31 -11 69 34 9 25 -42
5511 -42 32 -65 34 22 -45 -138 27 -63 -38 179 142 -33 -127 15 40 30 32 180 -55 101 48 55 97 -9 15 46 1
5538 1 111 57 -31 -14 -111 -160 127 67 51 -62 -218 -76 94 -5 67 32 20 -63 -139 -109 189 13 139 34 -25 -21
5564 -21 -115 -127 28 -71 -150 -86 62 91 16 73 -15 -28 -260 49 48 56 -172 65 119 -121 68 3 -25 -18 -86 -78 52 186
5592 186 4 53 -63 -145 2 -39 -173 37 -147 214 57 -4 58 0 -68 20 -55 -11 -8 -35 -75 15 78 125 61 -70
5618 -70 -31 215 68 -83 24 145 145 -172 -11 80 93 142 -51 5 -20 -10 -7 -82 -129 -103 60 57 -56 -87 1 -26 55
5645 55 12 48 67 -52 -18 9 -110 56 69 -63 127 180 80 -55 -176 -23 73 39 220 -7 97 -92 -45 89
5669 89 -84 -136 -74 14 24 93 -127 -17 89 -14 15 166 52 40 -44 87 12 -49 -112 -109 -50 -81 -30 -105 -173 131
5695 131 -126 -49 -64 -28 61 47 -141 -11 70 132 -21 -137 106 22 5 106 88 -24 97 94 97 -25 132 -100 12
5720 12 104 70 93 -26 49 -64 6 50 62 10 94 -112 -40 -72 -131 -6 34 17 -92 -94 -3 112 31 -87 17 5 63
5747 63 75 -49 61 -198 -158 6 -32 0 -15 -133 -102 -52 -175 0 -5 -194 42 47 28 -64 8 69 84 74 15 -63 2
5774 2 -31 31 -28 11 30 49 -12 -51 -160 -97 17 -70 61 161 11 -175 -91 -4 75 -144 95 194 123 75 163 215 20
5801 20 93 88 139 -25 -84 -91 -25 -20 -26 74 9 -85 -28 -90 -10 64 54 4 52 14 -3 6 -71 -56 141 -52 86 -46 48 31
5831 31 4 -30 -110 10 79 -14 60 91 25 -101 -120 -19 -118 129 -43 -80 -160 29 -30 -53 157 147 -17 -84 -43 18
5857 18 -170 80 37 88 -33 0 4 25 -96 32 -59 115 22 -98 140 -64 87 67 46 1 32 96 -44 -39 -71 -14
5883 -14 24 -55 -95 -18 30 -50 -28 60 -108 -75 24 20 -75 -114 67 -51 -93 -186 27 38 99 265 65 153 74 20 -177
5910 -177 -14 46 -11 8 1 76 32 -115 5 -86 30 2 -169 25 120 -15 21 37 -68 -88 31 115 -6 -4 -53 -128
5936 -128 146 14 74 -132 -165 -59 -12 9 119 189 -59 -62 -43 -142 -58 -111 98 -105 -79 -72 -66 44 -31 -36 164 -15
5962 -15 34 -21 -14 16 48 70 -70 -128 139 134 122 -36 72 -99 -103 -107 -54 104 -21 96 -125 -95 -12 -59 29 -99 -38
5989 -38 -27 -101 -98 77 -78 73 -50 22 47 105 82 -66 105 -128 97 -159 112 22 82 115 -74 -38 -149 2
6013 2 48 89 101 -16 81 138 44 -34 185 -45 -10 -15 29 -37 34 -1 -49 68 14 -48 -88 100 110 89 166 17 -106 0
6041 0 -76 -60 26 -4 54 -40 -30 17 -12 25 11 -57 -61 -36 4 -22 -7 -67 -44 -66 15 29 -40 22 -51 -77 -160 -51 41 -84
6071 -84 -76 -69 -12 -106 72 77 -81 -70 73 9 186 46 14 35 -81 93 -205 84 6 -16 -58 -52 -36 -55 50 -94 -37
6098 -37 11 -218 106 17 113 -21 17 -58 -44 -16 87 9 12 58 38 -51 201 55 27 -25 -51 -192 91 8 133 -22
6124 -22 -101 -35 -1 34 -74 -104 -76 -71 192 37 129 150 30 -65 -40 -32 -109 -14 99 -38 15 106 -41 7 19 58 64 -75
6152 -75 -11 -25 30 -46 41 58 86 134 -58 -35 38 -159 -79 -18 -62 -3 51 148 9 -84 -42 -25 5 188 51 63 0 69
6180 69 47 -44 -53 51 -106 76 -101 -101 41 -43 172 -51 -81 77 -93 171 71 -67 -14 -98 -74 80 -19 127
6204 127 116 -19 -91 68 -80 141 98 -43 59 157 -8 -126 45 -11 35 47 30 -67 -105 41 -33 -160 -86 -78 122
6229 122 -157 27 -16 -73 -32 62 -113 68 -39 25 -1 139 -38 6 -66 -21 -3 -9 55 -25 -30 -10 -52 39 46 -4 86 -183
6257 -183 33 27 -45 49 102 14 -144 116 37 8 -97 -31 68 33 4 -50 36 157 -32 20 34 -84 115 -33 -34 64
6283 64 -44 126 51 -102 -160 -15 34 -50 102 -179 -94 36 108 15 157 7 94 -137 -86 4 99 238 37 16
6307 16 6 -89 -20 -116 -6 80 20 -174 41 15 -34 53 175 17 39 189 90 -37 -108 -87 -12 32 -57 -249 -63 -58
6333 -58 -116 177 45 139 173 -34 -133 -149 -92 -65 -146 30 60 -61 -84 104 4 44 -28 -77 120 -75 -17 -147 37
6358 37 -1 -52 -6 -74 -137 -49 -20 45 44 -136 109 -24 -39 52 -40 -40 93 -133 -2 -101 -64 17 51 136 2 135 -17
6385 -17 24 28 -39 70 74 -138 -9 -96 -84 -88 -149 33 110 -86 -56 -33 -57 102 -107 -65 -6 110 119 16 -50 -219 -43
6412 -43 -15 -48 48 -72 47 -22 62 23 12 177 4 -31 118 89 -115 162 44 24 29 -12 -98 -22 -102 168 -11 -86
6438 -86 -13 -151 -28 -124 82 83 43 19 126 -38 -34 32 -65 -214 133 13 -88 21 57 -51 -99 -45 78 17 47
6463 47 140 -107 78 -92 -22 126 130 -80 -130 -6 -76 94 19 114 77 -14 -44 5 7 110 85 49 81 7 162 130 1
6490 1 -88 58 146 -8 -45 -24 -34 -42 -46 -57 51 -117 -5 -49 77 -33 28 78 159 2 92 83 57 191 -36 -1 -120
6517 -120 25 69 -82 98 -3 -89 -4 -54 128 -38 95 26 78 51 28 -139 -15 15 38 98 123 81 -31 94
6541 94 53 51 22 9 41 65 14 73 -67 -217 16 23 86 27 11 24 -93 10 87 -42 28 -1 128 -9 -29 -86 -136
6568 -136 153 132 -7 -37 -20 -37 14 90 8 -21 55 30 -3 -104 64 37 30 82 -20 62 -47 -98 -11 154 20 -132
6594 -132 92 76 85 -82 86 -79 33 21 42 -30 -36 -65 -104 116 14 84 -160 -65 -37 -23 10 66 51 86 -71 2
6620 2 26 -141 79 19 -87 -32 -61 53 -29 67 -13 -20 -115 -16 81 -24 50 20 116 -119 -1 -58 -114 -31 53 -14 -15 -8 -61
6649 -61 49 -111 -52 11 -42 208 11 -84 13 -104 119 -15 50 -67 71 126 -102 -117 -65 26 -150 -2 -115 89
6673 89 -135 65 26 -118 74 148 102 56 22 -94 34 -37 8 -27 -26 26 -25 -1 115 -25 -70 61 -81 90 2
6698 2 -68 -101 -29 -3 100 133 -35 -62 -78 61 117 75 17 -49 -34 88 33 -153 -64 69 -87 41 -65 25 133 -18
6724 -18 -65 -28 -2 121 39 23 42 9 -73 81 -5 -40 219 4 43 -39 -65 52 -32 39 -32 -5 6 79 78 55 1 -101
6752 -101 11 -67 -23 -22 -62 63 39 54 89 67 -19 -78 24 -77 114 -100 -79 106 49 -149 209 -120 -29 105 67
6777 67 -34 55 6 -31 -130 54 18 124 -114 29 73 -42 -48 -45 89 -66 -128 -38 -3 90 107 38 14 -15 71 29 58
6804 58 -51 -123 -69 -96 43 -121 60 86 78 145 4 -36 105 -111 42 -81 17 133 108 95 45 37 -7 235 51
6829 51 21 106 110 49 100 36 16 -31 104 70 -25 94 -9 -5 83 -78 -2 -90 -54 -23 34 115 -53 12 63 87 -108 4
6857 4 -12 -19 59 -62 -82 188 62 97 -93 -27 24 1 -70 -123 -35 92 142 18 -84 169 84 -55 178 12 -1 -73
6883 -73 25 -13 81 50 5 76 -136 82 -16 23 207 61 -17 -63 -31 -6 -130 65 14 -12 -40 19 89 -57 46 87
6909 87 8 -75 -11 -9 -198 176 129 -23 -45 -98 -45 28 -112 -31 47 86 -30 -2 46 17 -14 -5 -56 35 81 -106 39 26
6937 26 -78 -91 -11 -89 -182 -48 72 19 -110 13 -173 -12 4 -43 126 -48 -2 26 -121 44 -67 -85 154 -95
6961 -95 190 42 -33 -168 -5 -7 -90 4 107 -41 10 -53 115 79 -216 -48 -21 16 -44 -103 17 -47 -10 67 26 85
6987 85 -38 140 -85 -14 -179 44 20 -10 2 94 -5 45 -39 41 -23 149 79 0 -5 146 -57 16 89 3 0 -83 11
7014 11 -35 26 -39 91 118 -61 102 56 -67 85 -71 171 15 -70 -92 -120 -54 -43 75 -91 71 -126 37 -3
7038 -3 44 80 -119 -1 -14 -117 22 13 -101 49 -139 79 -59 -78 26 56 50 -114 6 19 77 150 -123 -84 -79 65
7064 65 -126 -70 -32 3 20 8 46 -40 53 -76 91 -104 109 -86 -103 -50 171 -10 53 -18 68 -137 27 87 32
7089 32 -11 -51 -10 108 -102 110 179 -152 -19 -9 -75 -41 -1 -46 -49 -37 66 20 -40 110 115 -59 6 -19 7 68 6
7116 6 51 -63 27 64 -39 22 6 -183 -16 75 24 -17 96 20 -3 72 124 106 -106 47 72 51 -9 36 -48 -81 -132
7143 -132 -59 -75 74 -58 119 35 -31 6 -71 101 -27 101 -40 100 -126 -16 -2 -46 -95 167 -45 -29 -16 -81
7167 -81 -3 -122 -55 -109 -28 170 48 19 182 63 87 62 -13 192 -13 -194 -41 50 -48 118 108 -59 -33 -17 259
7192 259 39 115 120 48 -79 92 69 1 -32 39 -64 2 78 -62 -51 69 14 -133 -80 47 -1 41 -61 134 7
7217 7 -9 39 -108 -6 2 -214 156 -98 -54 60 -82 81 -12 22 23 90 70 35 126 24 40 13 70 -208 -22 -59
7243 -59 -25 -80 50 -86 118 -54 172 53 -48 -29 -99 155 -89 19 -92 13 -4 -64 -136 -19 -139 -72 1
7266 1 75 -227 23 136 -40 -114 -5 -39 16 68 76 75 42 -118 -9 53 11 101 159 -22 69 -26 -71 -85 -27 168 -44
7293 -44 -42 22 -171 132 16 -10 27 13 158 -57 -82 4 -79 -225 81 93 110 -9 23 -56 28 150 -69 57 15
7318 15 60 -129 -105 134 101 98 209 -22 -78 37 86 59 62 229 -41 -82 -26 72 56 12 -47 -41 -53 24 -62 -70 -32 -175
7346 -175 -33 47 -42 23 -120 66 41 57 6 -63 -85 117 112 80 -41 -63 -200 -46 30 4 -34 -44 -35 91 -110 19
7372 19 -245 -49 59 40 -5 39 -64 -57 47 -64 67 60 99 48 -7 -21 124 86 16 44 -57 95 51 50 190 -110
7398 -110 57 146 -135 -142 150 12 53 13 -6 19 -188 -42 137 87 4 -151 9 -88 18 73 -7 -75 -73 -31 -13 -28
7424 -28 49 86 -19 45 -3 -101 16 -34 -103 -218 65 74 -112 -49 63 70 -164 71 -168 17 -91 106 139 -40 -31
7449 -31 70 -87 -35 160 64 7 65 -10 27 49 -44 -43 -107 20 -34 -79 -26 132 -105 87 -8 -46 14 146 -137 -18
7475 -18 -65 -98 21 -78 17 91 -42 -73 80 -51 -145 33 -15 1 110 -75 -175 -35 -140 -62 -26 30 41 -7 199
7500 199 -14 1 171 107 -32 -129 26 25 119 -72 13 75 2 -4 18 -119 -76 -38 77 46 15 -90 20 85 70 9
7526 9 93 120 -44 -1 56 41 141 76 82 12 -35 246 11 -78 131 46 192 -14 11 33 -48 -45 112 33 -9 52 100 -57
7554 -57 -48 217 -25 250 -4 35 -79 46 167 -175 23 99 125 -73 -82 -139 14 108 114 11 117 124 138 36 121
7579 121 30 -89 -17 70 -156 56 -67 81 81 53 -104 -3 -98 -34 38 -8 -182 -35 153 -5 -2 -54 -158 22
7603 22 -7 30 -40 40 22 78 -162 -44 -152 13 -1 -50 68 116 63 -48 5 -9 123 69 -43 141 126 -66 -105
7628 -105 -64 84 -92 -190 28 125 7 74 15 144 110 -23 -2 -31 -58 -13 -86 -61 70 15 -24 57 55 -107 89 -24
7654 -24 79 50 -45 -64 102 -31 73 36 120 78 -52 86 -213 -53 32 73 34 -21 63 77 -7 22 63 -58 18 -3
7680 -3 -5 -30 23 -31 34 28 -59 78 77 -22 -110 -121 60 -89 -63 29 -90 -103 -45 -207 164 110 26 -113 104 6 -65 -109
7708 -109 -141 -98 -3 96 32 117 -21 118 -77 88 5 -34 90 107 47 61 22 28 -81 -24 -106 75 -149 -48 14 112
7734 112 -15 61 -15 -54 25 96 -72 11 32 29 -5 -85 24 -2 -149 230 -58 -80 202 -32 -119 -93 -64 17 -83 -65
7760 -65 -114 38 -27 -45 -50 180 177 -107 14 -160 73 79 -48 -38 -209 54 -83 64 -86 87 100 -161 40 -115
7784 -115 158 -28 -138 -28 14 -81 -175 -24 -29 55 -97 1 -29 81 102 173 30 -21 -72 71 -48 199 17 120
7808 120 120 -1 83 -48 24 70 77 -126 89 98 20 15 -34 -87 32 67 -90 10 51 -64 11 32 85 51 -128 119 49
7835 49 -66 -23 33 205 -19 -9 -30 83 -27 4 -45 -50 12 55 67 -7 -128 31 -4 75 116 -127 38 31 40 29 67
7862 67 33 114 80 53 44 -72 -11 -83 38 -27 -264 13 -2 -14 -31 51 86 42 -91 -51 -1 83 44 -26 -20 115 -80 161
7890 161 -32 86 -17 -122 -43 -74 -45 68 -30 -142 141 24 -12 -28 -48 -54 -1 -52 -136 55 -71 36 96 131 58
7915 58 21 -10 -9 -67 171 -98 219 24 -31 1 78 119 73 124 -56 88 -43 -1 -36 -11 -174 85 -63 66 -38
7940 -38 -8 30 -15 165 -26 -82 -46 57 -30 101 26 -176 -47 -74 -45 28 25 -115 66 83 -55 -136 67 41 -124
7965 -124 -161 100 -77 -32 -29 52 8 24 27 45 -152 -110 11 -11 28 -72 98 -67 -24 -155 -51 -101 132 127 80 -68
7991 -68 -46 -198 59 90 -28 187 55 3 -111 -56 -11 -6 -67 35 15 -163 82 63 55 -96 53 56 14 86 -38 -10
8017 -10 5 -3 123 -110 36 64 56 -22 -47 -21 -20 -123 -94 -81 58 102 -69 16 -53 -16 61 81 42 54 -12 -34 17 23 -187
8046 -187 34 177 48 -9 -88 92 -79 -72 -109 -117 -76 -64 -64 -227 163 44 -12 -28 -70 58 13 53 -36 -33 -115 12 -191
8073 -191 -84 -10 -48 50 -23 89 69 -66 -129 36 -34 65 57 91 98 185 -79 63 50 6 189 -29 4 -106 36 -104
8099 -104 12 103 84 -43 70 33 64 -20 50 -11 -85 9 34 71 -67 40 146 -111 18 -102 95 -31 36 85
8123 85 -3 -30 86 -149 -82 -18 -15 -228 -47 68 -48 44 -50 -79 -98 -63 -91 167 -90 -29 150 104 7 -79 -173 -39
8149 -39 -41 -53 -15 -14 -14 -123 60 -146 29 -82 -43 -68 -74 11 -87 91 26 -40 -84 -86 0 -42 -32 -115 -122 82 -33 -76 65
8178 65 -64 -139 -80 98 9 63 65 -106 -31 116 69 23 43
8191D3
$$ Imaginary data points
##PAGE= N=2
##DATA TABLE= (X++(I..I)), XYDATA
0 0 0 0 0 0 0 0 0 0 0 0 0 0 0 0 0 0 0 0 8 -8 8 -8 8 -8 13 -16 16 -16 24 -24 29 -32 37 -40 47 -52 57 -65 72 -81
40 -81 91 -100 109 -122 134 -149 162 -180 199 -218 241 -265 294 -322 358 -397 442 -496 557 -630
60 -630 720 -833 978 -1174 1453 -1878 2595 -4047 8059 -40870 -130410 17556 99568 6368
74 6368 -71226 -1845 60054 -3047 -46614 6325 25915 10644 5465 -4808 -22880 -19155 26756
87 26756 43368 -19002 -40118 4526 18348 29 -12032 -2736 11620 -336 -8873 -14517 -14574
100 -14574 25132 33285 -22031 -38963 4277 34930 6246 -24550 7337 20244 -16122 -11369
112 -11369 15072 9655 -3588 1030 9504 -14000 -24209 24501 30621 -22316 -26738 11682 16120
125 16120 -17688 -15469 28606 10271 -37437 -9693 26838 4783 -20596 -353 26284 -4743
137 -4743 -32776 7039 29879 3545 -12920 -7792 5328 6856 967 2959 -4407 -308 12559
150 12559 -8517 -19956 9397 23606 -1771 -28517 -6489 24529 -1686 -21058 8232 15152
162 15152 -10853 -18924 6656 19989 -7418 -12124 13163 3963 -13555 -1309 14910 9677 -11023
175 -11023 -7411 9923 791 -4357 5048 2912 -1042 -4820 -4628 2104 2036 3814 -1122 -12602 352
190 352 9455 -5782 -7811 5447 10600 -6509 -18809 7431 19750 -5347 -11451 3513 7977
203 7977 -1226 -6023 6722 6508 -6517 1652 4549 -7224 -2456 10260 7916 -11780 -15293 11797
217 11797 13355 -12432 -10350 7494 8244 -7972 -12928 6674 10558 -4991 -4943 -458 559 3060
231 3060 975 2198 615 -3070 2288 1808 -53 3694 -1000 -522 3561 -2001 -3957 -162 6661 4878
247 4878 -11916 -8453 11128 5317 -9550 -7166 7047 7792 -11373 -9089 11740 6371 -7656 -4956
261 -4956 4501 5300 -5181 -1732 9161 71 -6142 1341 4364 2272 -3044 -907 5559 -1742 -4925
276 -4925 1113 1981 1939 -2375 -5331 904 1479 -904 -1239 -2675 2561 1074 -5949 380 4254 602
292 602 -1599 -1851 3243 1232 -3704 4005 4697 -3704 -2224 2790 3770 -1696 -4780 5648 4045 -7676
308 -7676 -3507 4661 3932 -3540 -6613 3565 3966 -6088 -2421 3153 1634 -2165 -4408 2085 3875
323 3875 -2536 -346 1858 727 313 -2350 1895 4772 -1675 -1803 883 2095 1502 -3513 -100 5127
339 5127 -1899 -4710 -322 3117 1540 -5483 -2411 5051 -1179 -5003 423 3266 1333 -5060 -1467
354 -1467 5894 -72 -3519 1679 2778 877 -3023 -252 5519 -182 -3094 1524 1666 124 -2266
369 -2266 -829 4096 -775 -4494 210 1547 614 -2461 -2783 2985 686 -3900 -787 1576 1945 -995
385 -995 -3206 2320 2093 -2021 880 1797 811 -853 -1034 3873 1444 -3968 930 3520 -71 -3590
401 -3590 -2331 4930 2291 -6159 -2532 3169 2180 -2557 -4512 2007 3457 -3130 -2283 1157 1509 425
417 425 -2048 833 1975 -1894 586 2721 8 -1049 -1038 2779 2913 -3446 -1367 3372 1234 -1872
433 -1872 -3233 1166 3550 -2637 -3043 1010 596 -430 -1774 63 2106 -2278 -1610 2604 556 -1271
449 -1271 -1132 1533 3267 -2035 -2504 2701 2678 334 -2317 -1076 3474 1252 -1703 -449 -597 1447
465 1447 866 -2160 -899 -360 751 1631 -2669 -2486 1179 1678 958 -3059 -2715 3368 2730 -1374 -2776
482 -2776 -390 4939 1926 -4446 -1344 3202 3671 -543 -4573 961 4100 -324 -2054 -1420 980 1762
498 1762 -1824 -1173 148 -1190 774 478 -1679 -1198 -659 2306 1377 -3827 -1031 2986 1754 -1096
514 -1096 -2959 1922 4186 -1876 -2554 1866 2728 -70 -3055 861 3648 -2202 -3034 2140 2509 -1751
530 -1751 -4495 935 4905 -2624 -5266 1435 3696 -435 -4431 -790 4555 -124 -2709 956 1098
545 1098 40 -104 1041 1450 -2648 -674 4558 483 -3967 -1336 3811 3383 -4648 -4415 4023 3702
561 3702 -2847 -4592 45 4557 -391 -4622 -70 2282 497 -1190 -1317 1199 237 -975 1991 128
577 128 -2239 658 2593 1541 -2645 -2212 4167 2381 -3490 -2109 2577 3027 -2132 -4162 2334 2659
593 2659 -2745 -2100 937 1693 -1505 -2760 2074 1645 -2647 -967 1611 1734 -644 -2212 1658 2565
609 2565 -755 -805 -28 1324 1584 -1270 -446 1062 195 794 -702 -1039 605 -411 283 179 -1952 -411
627 -411 928 404 -657 -2442 417 2982 -783 -2533 -230 2185 1921 -2229 -1616 2472 1800 -401
643 -401 -1376 -280 2197 757 -1305 -86 -238 680 676 -1420 -583 -19 108 525 -1421 -1218 752 111
661 111 -68 -1320 -1226 1820 848 -1496 -806 496 1997 -283 -2026 1547 1637 -615 -708 270 1653 16
679 16 -1803 1175 1110 -1445 -578 519 857 -758 -2141 1263 1138 -1893 -890 687 693 -456 -1991 925
697 925 1608 -1153 -498 497 1174 535 -1532 737 1801 -647 -486 281 960 573 -1567 -14 1663 -889
715 -889 -1231 6 707 443 -1894 -426 1672 -603 -1341 -261 1037 630 -1807 -484 2016 -230 -823
732 -823 346 765 714 -982 -116 1672 -183 -575 580 197 428 -698 -363 1228 -698 -1156 391 115
750 115 -15 -990 -816 1477 -520 -1327 110 514 588 -728 -912 1591 495 -1191 296 858 854 -481
768 -481 -705 1706 521 -1400 169 904 469 -759 -956 1177 449 -1866 -283 451 226 -847 -1270
785 -1270 1132 626 -1275 -302 529 534 -131 -1004 852 1048 -1061 57 888 458 29 -886 861 1268 -1216
804 -1216 -295 797 527 -118 -1364 337 1337 -1244 -1228 270 380 -64 -1369 -145 1345 -725 -863
821 -863 595 347 195 -749 392 1305 -457 -385 998 312 -33 -373 257 1240 -802 -598 912 200 -419
840 -419 -773 -69 1197 -909 -1387 400 104 -43 -880 -834 1294 -55 -1165 451 437 418 -162 -303 1248
859 1248 148 -932 643 601 178 -344 -146 1461 47 -1675 572 671 -235 -751 -664 1034 138 -1626
877 -1626 144 569 -264 -424 -505 751 236 -1236 535 672 -263 -225 19 868 525 -1083 379 970 109
896 109 -213 -570 767 1094 -1105 -722 234 265 -150 -974 75 702 -1013 -555 445 -304 -256 -405 645
915 645 649 -1303 -249 1623 89 -613 -139 861 1060 -962 -336 1226 -18 -348 -113 333 478 -769
933 -769 -203 657 -634 -463 -17 -203 74 -790 -566 583 -6 -176 -161 -363 792 128 -962 521 561
952 561 468 -65 -513 1071 465 -396 409 57 -53 214 -88 450 -604 -1027 995 351 -1079 -677 -10
971 -10 775 -665 -1598 339 639 -231 -211 -532 366 988 -381 -116 127 414 881 -579 -181 848 40
990 40 2 -30 -124 349 -557 80 583 -1046 -553 937 115 -703 -1296 557 1244 -1574 -1035 1152 459 -651
1010 -651 -747 793 1151 -1011 -327 1545 57 -539 182 815 594 -1070 -212 1400 -30 -890 -300 237
1028 237 693 -638 -767 326 -136 -262 -212 -274 470 -407 -660 488 69 -482 15 265 1042 -742 -927
1047 -927 1455 825 -844 -723 824 1705 -973 -1693 1344 912 -979 -784 475 833 -839 -921 988
1064 988 -82 -1329 175 806 -195 -945 -300 1257 -195 -1369 663 879 -88 -413 -156 1047 276
1081 276 -556 295 107 109 177 -310 126 395 -372 90 -227 217 302 -775 -132 709 -548 -433 49 170 97
1102 97 -940 214 800 -615 -269 427 454 105 -415 703 731 -892 -88 796 -115 -296 -272 606 375 -985
1122 -985 -12 458 -345 -150 -317 -255 267 -179 -8 -221 -174 610 68 -637 355 667 53 -156 -79 1013 88
1143 88 -550 815 547 -440 -147 287 503 -555 -674 1002 202 -1200 54 559 46 -793 -518 796
1161 796 -206 -1033 420 189 -105 -157 -41 673 20 -366 616 88 103 199 -293 58 136 -78 250 -139 109
1182 109 259 -549 -5 408 -393 -410 -190 276 46 -1092 110 797 -652 -556 489 252 41 -768 650
1201 650 934 -708 -228 681 280 -291 -208 714 413 -635 -129 623 -199 -310 54 225 198 -640 -136 134
1221 134 -406 -2 -80 -263 335 -104 -83 -11 -99 336 -141 -254 651 230 -408 193 454 312 -255 -351 735
1242 735 45 -626 310 464 41 -592 -311 581 -232 -698 474 251 -249 -401 -79 584 -219 -484 571
1261 571 66 17 199 -64 205 20 -180 477 55 107 143 -367 76 286 -301 54 59 4 37 -709 -26 479
1283 479 -589 -201 253 97 -163 -454 213 409 -629 -36 610 194 -267 -398 732 451 -692 104 727
1302 727 -78 -150 -50 287 195 -410 134 219 -483 -152 -144 -64 153 -445 -289 122 -350 -131 -175 -110 404 -195 -209
1325 -209 320 136 239 -61 89 557 92 -508 433 282 -105 -255 -56 719 -188 -509 374 80 -202 -331
1345 -331 -91 426 -465 -624 480 102 -319 63 148 262 -161 -241 594 102 -143 215 -86 345 121 -431
1365 -431 261 155 17 219 -162 98 123 -422 133 169 -117 -67 -319 57 189 -434 196 224 -207 -238 -130 211
1387 211 117 -298 103 462 -276 -9 -53 386 185 -401 95 284 -224 -35 -37 106 33 -385 -24 355 -365 -127
1409 -127 -74 66 26 -317 89 328 -201 78 38 34 293 -174 -146 403 -70 67 91 49 410 24 -108 365 90
1432 90 -205 39 -310 204 -209 -103 181 10 -42 -87 -166 207 9 -368 427 40 -113 304 -159 195 -100
1453 -100 -191 442 139 -85 238 -39 201 32 -356 300 337 -239 -67 -181 138 -77 -499 -9 145 -216 -154
1474 -154 -111 131 3 -296 99 238 -214 44 74 198 205 -319 30 347 -119 -28 -159 208 167 -243 -1 498
1496 498 -308 -155 -105 112 136 -512 -98 302 -109 -109 -123 49 156 -319 -79 445 -88 -114 149 214 53 -236
1518 -236 -58 502 -196 -79 154 229 113 -174 -134 410 -159 -446 -14 -17 109 -222 -58 375 -272 -379 -16
1539 -16 127 -1 -89 -209 526 -63 -216 144 76 65 -212 -219 325 -20 -326 224 365 -43 -323 -181 277 -51
1561 -51 -526 241 -17 -280 -212 -194 81 105 -285 88 63 -135 71 -160 65 52 -255 100 100 -54 135 5 200
1584 200 42 -237 37 138 -101 40 -185 77 180 -308 0 -13 -66 46 -432 -183 110 -365 -28 258 -31
1605 -31 -1 85 170 348 -216 -20 250 100 123 -225 -76 302 -193 -107 87 13 90 -172 65 52 -100 -99 203 119
1629 119 -3 -106 -52 346 -73 -137 -2 5 187 -71 -75 286 52 -295 113 72 85 84 -229 409 -36 -146 -4
1652 -4 47 -22 -174 -56 108 194 -373 276 56 -182 -48 -173 184 17 -81 88 139 90 249 -91 225 77 -94
1675 -94 301 340 300 68 -108 124 116 -234 29 -8 -67 8 -261 205 230 -300 -120 273 109 -58 -74 158 235 -127
1699 -127 21 141 75 -80 8 112 335 -114 -58 147 126 156 -209 -70 99 -51 -251 180 -302 -7 77 -219
1721 -219 96 -189 -169 57 -156 -80 -70 -8 153 -127 -137 133 -46 -66 56 46 322 -134 -149 233 133 -58 -190
1744 -190 114 226 -55 -163 175 -106 -151 -17 -104 206 -296 -152 278 -35 -182 -32 -135 -150 92 -260 97
1765 97 106 47 159 -35 25 91 -100 215 162 167 -2 -148 147 -3 -306 138 -2 -322 -104 87 -81 -101 -317
1788 -317 93 17 -157 76 22 88 36 -198 48 116 -132 -57 100 270 198 45 18 179 -149 93 -43 28 36 -152
1812 -152 -79 94 -87 -114 20 -79 70 -223 36 35 -89 -186 206 40 60 -143 -87 168 -217 69 269 -43 138
1835 138 17 -102 193 -48 72 96 -67 81 -4 -37 232 -16 -207 101 56 117 25 -144 137 -91 -23 55 -46
1858 -46 -156 9 -137 165 -42 58 194 38 -145 -87 -129 118 52 -139 25 -82 14 68 -269 182 22 -149
1880 -149 -96 -82 42 105 -231 57 76 -2 146 -17 -10 -127 -3 42 159 -148 -93 99 -3 141 -141 64 256
1903 256 -215 -152 31 46 -118 -49 -238 1 6 -231 -33 -17 -43 -48 -65 52 -158 -143 106 -44 141 -32 -104 205
1927 205 -35 -17 91 -103 2 -26 107 159 -53 -85 73 -179 -37 44 15 108 31 -96 -138 -43 81 97 45 138
1951 138 -41 6 -74 -10 71 -56 -74 315 262 8 -2 -106 106 -19 -92 99 106 -128 80 167 -6 -134 -191 27
1975 27 10 -101 -20 88 -124 -3 -70 71 90 -47 -45 208 49 -20 65 173 77 -137 167 137 36 -47 -58 94
1999 94 125 -181 -221 63 -12 -2 17 140 99 -264 75 72 -97 -55 -91 147 -40 -221 145 294 21 148 -179 296
2023 296 131 -219 -27 92 -59 43 -162 -4 53 -174 74 -34 -62 -19 -88 -149 -43 -78 -70 121 82 27 -131
2046 -131 137 138 2 10 24 74 32 -103 22 15 -154 -134 246 21 121 48 -105 -25 -124 -54 170 -78 -111 -41 -106 114
2072 114 -139 -56 96 -14 36 138 92 -131 -10 -94 37 -45 -70 -6 -39 119 -5 -177 5 50 -66 -62 -103 44
2096 44 14 -174 1 -60 -222 -20 -148 83 89 -119 69 199 20 -54 2 -21 118 -32 20 130 -246 -4 -44
2119 -44 -78 -19 -310 -127 77 40 24 78 38 155 2 -152 40 148 -87 -8 -12 -18 -175 -24 158 30 -40 123
2143 123 82 51 -105 -156 256 -101 16 136 -29 148 -64 -136 139 -7 -9 72 14 74 88 39 128 4 -125 165
2167 165 -99 193 67 -59 -80 50 27 113 -25 268 114 26 201 155 23 13 59 79 74 -340 -103 73 -43
2190 -43 -52 -22 11 -79 -127 -11 -5 -84 37 95 61 -143 -123 159 185 -48 -80 85 92 53 -40 129 209 -122 64 73 -29
2217 -29 -31 -57 -51 -43 23 155 -21 145 -51 -77 -133 -11 70 -27 110 88 140 -145 179 104 -20 -68 44 1 -45 48 -118
2244 -118 108 -43 57 68 71 -17 18 49 71 -63 -83 15 48 -47 144 -47 111 -121 44 -83 -76 82 55 -82 31
2269 31 -34 47 5 62 63 -74 -191 31 -138 -52 -5 206 163 -46 31 8 -75 -6 57 29 64 -36 -59 202 -48 -184
2295 -184 93 42 40 -6 -8 10 74 -113 87 99 69 17 -9 -68 4 15 35 55 82 192 41 72 -130 -17 20 25 -81
2322 -81 -74 -146 179 35 44 -4 -12 -42 16 18 -57 84 58 -92 99 -4 -55 -87 -112 -71 -10 12 126 -72 -27 150 -36
2349 -36 27 -91 -67 -149 -83 -91 5 -111 -72 -19 -60 -111 7 103 68 7 -19 103 -49 205 -9 109 69 52 232 -97
2375 -97 92 15 -26 -53 -120 -54 -63 72 -185 -25 94 172 35 69 174 -22 84 -10 74 108 90 -72 137 51 -71
2400 -71 -47 117 161 9 -107 -89 105 -107 -78 155 -123 -136 -83 42 -8 -79 -200 -199 -17 9 -97 75 65 -126
2424 -126 -79 86 48 10 80 189 77 62 202 -48 88 -110 -159 -24 143 -136 -217 143 33 24 -40 -134 86 236
2448 236 -82 51 161 71 -63 148 119 -110 -11 95 102 -6 38 -22 337 -153 -99 43 161 3 -124 -34 5
2471 5 34 -122 59 -195 -63 -87 113 -64 -50 -150 1 121 -76 23 -25 -36 -25 -94 44 54 -63 117 -38 108
2495 108 97 87 -103 32 -29 137 124 -111 3 -125 -13 -76 9 -60 -148 30 167 -18 78 63 23 40 -63 167
2519 167 -1 -203 14 -26 -59 -42 -156 -94 14 78 111 71 27 58 -132 -114 -79 6 207 105 -51 49 -72 63
2543 63 -93 -16 -30 53 -100 111 -33 14 64 76 25 -106 3 59 58 25 -148 34 11 139 -13 5 99 33 -127
2568 -127 -86 -65 26 -209 57 -40 -52 -44 -224 103 -53 25 -129 109 -29 64 -129 -3 41 28 49 29 -145 -114 -29
2593 -29 -138 81 147 -47 -21 -138 -45 69 -139 -20 -2 89 -110 -32 -254 74 -118 -55 142 -141 27 -42 91
2616 91 -55 -43 -91 121 84 -169 40 144 -22 -20 -11 -38 -134 14 19 -100 -76 -127 55 -86 -165 42 -64 -13 6 10
2642 10 -267 26 65 17 13 38 -95 -89 -164 -30 -44 -45 23 81 63 -68 -75 -85 -25 13 96 -79 -43 14 -70 -56 141 33
2670 33 77 -28 -55 46 -106 -126 76 -7 -36 14 8 -159 -57 -6 1 21 -39 95 117 -101 5 15 17 -79 -17 -118 -9
2697 -9 -28 -158 148 59 -51 43 -147 -14 102 -171 -30 19 -44 28 46 -103 77 -111 88 142 -162 46 -59
2720 -59 -12 -46 -215 -74 53 -28 -35 75 41 73 -87 12 -26 -85 -2 26 -70 -16 -122 206 20 -94 -105 105 -108
2745 -108 100 296 47 52 15 85 117 -128 46 -77 -106 115 -83 -156 -3 -26 177 -83 -22 -83 -80 -42 -19 30 -23
2770 -23 -69 -11 -26 96 171 65 -14 -62 -4 -24 81 -35 -111 -75 -11 -34 33 -138 -52 -88 -78 -35 -56 43 -88 -15 25
2797 25 -4 -101 43 2 -85 94 -160 -25 -43 -94 -83 57 15 204 66 106 12 121 102 54 2 70 48 148 163 -28
2823 -28 -211 -95 91 -31 38 113 -116 -72 -49 -131 21 51 57 -76 84 3 12 56 103 66 93 -25 83 -171 -6
2848 -6 -53 -98 110 46 -251 93 -12 -43 118 -90 158 86 -234 151 0 15 164 -24 26 -27 -57 160 -34 -29
2872 -29 -19 -103 57 -9 -150 -33 107 -40 -6 66 -39 -24 -125 -105 24 -79 78 13 55 26 -329 130 -32 -44
2896 -44 166 -109 32 131 50 -32 118 -29 -16 239 -145 59 -78 -35 98 -105 -42 -65 152 -43 0 73 -75
2919 -75 12 -110 20 8 -80 19 -99 6 107 14 -68 -28 -243 102 35 63 -162 -17 99 77 -113 -94 -142 168
2943 168 -116 150 -60 -185 -18 -97 -75 116 37 84 35 -82 -192 69 122 -74 -32 44 44 -54 2 70 -48 -129 35
2968 35 69 183 -17 127 113 -67 34 -60 -107 35 -35 -11 111 -108 -98 -56 -129 161 -21 31 -56 -17 23 -65 -57 46
2994 46 9 -57 -30 -105 14 96 38 61 -51 -76 -1 79 113 1 -35 -75 -71 -79 -82 -1 -198 91 -194 233 128 -15 67
3021 67 -97 16 126 176 -63 93 -76 37 34 -17 12 -122 16 27 -122 32 -64 -59 43 12 -108 -85 33 -192
3045 -192 30 98 -3 -4 -149 -91 -85 -34 34 14 -22 -217 10 28 83 -8 -110 23 -54 -9 -8 11 97 0 30 50 4 -197
3073 -197 -18 -57 46 12 159 4 47 -22 -171 -2 -75 21 -90 9 139 111 110 75 26 -21 42 -36 -59 -60 -11 -249
3099 -249 -58 26 91 -110 -16 -72 -146 -94 -81 -166 166 -95 -116 127 -111 -79 58 -43 -66 116 11 54 -69 216
3123 216 80 -63 32 16 -22 -112 -38 29 55 -2 -63 86 -10 -19 -82 -59 -35 71 -70 69 -52 59 40 40 -127 73
3149 73 70 30 -3 91 -21 -25 -84 -61 15 25 18 -138 6 -147 -44 -103 88 80 -55 100 -9 89 -65 -27 -40 71 -12
3176 -12 -33 66 -146 -47 -131 10 96 61 82 -111 -161 71 -35 -13 102 30 -85 -26 -200 -19 -112 80 222 -43
3200 -43 -24 -97 -58 46 118 -67 -47 -95 33 -99 -20 34 173 -39 -15 -13 53 -81 -165 -69 -28 -59 50 18 66 -112
3226 -112 7 44 190 -101 5 19 -69 -193 -147 -56 90 33 -25 119 8 16 -29 54 46 -33 -6 128 58 -56 -31 74
3252 74 34 17 -8 141 -21 12 106 25 -38 -8 -81 186 -23 163 61 11 109 -6 4 208 -29 -54 37 -77 67
3277 67 165 -38 83 -33 -7 9 57 153 -10 -22 114 -84 -163 -25 -88 -2 -82 -97 44 88 -81 44 -114 -27 106
3302 106 -2 76 -59 -11 72 49 101 217 -8 -154 88 -109 -62 -30 -22 -6 14 53 46 -40 -169 -46 -11 99 65 87
3328 87 153 -35 1 45 151 -22 -133 88 -30 -202 -59 135 -115 102 -79 -11 39 -134 136 26 -105 -73
3350 -73 -58 66 -23 -178 131 -25 45 13 -137 -99 156 -18 101 101 81 45 -42 54 -16 6 -82 -4 57 -61 -97 -111
3376 -111 116 -40 31 124 -176 19 -59 149 27 54 -20 -15 50 -8 67 -64 32 60 65 -25 -39 -92 27 -35 -58 32 -3
3403 -3 100 -1 85 45 -45 -19 -60 52 14 8 151 -129 -72 186 41 28 17 -104 -50 22 -58 93 233 -165 19
3428 19 72 145 31 -76 70 60 -144 -148 -35 -155 -42 -71 -96 100 14 -115 -97 127 90 -121 -49 -30 -60 74 189
3453 189 -90 -43 12 23 -16 28 -60 71 -53 24 -31 99 34 70 141 -43 -128 -8 -159 93 -64 -54 13 28 -67
3478 -67 -77 -63 -19 -51 -82 -36 -142 -117 -37 5 -16 18 67 109 113 -5 70 5 -63 -26 192 100 48 -90 5 68 -105 77
3506 77 -127 -138 -14 -35 75 -166 -36 133 -120 20 -5 -136 -17 63 -39 -33 -14 -65 -59 120 -53 26 -4 15 161
3531 161 82 86 100 -132 64 -18 5 85 -63 -46 -46 -79 104 -121 -59 47 -21 189 22 -11 -104 104 43 61 27 1
3557 1 30 -45 -39 -95 -70 -77 49 106 -69 20 141 -61 -145 -16 -23 -1 -76 12 141 30 -1 163 42 -3 -19 3 -53 1
3585 1 -77 22 110 -97 12 91 -114 -2 18 -73 -126 82 159 66 30 -65 15 31 30 -180 107 -10 25 -102 -83 -68 -34
3612 -34 36 127 -50 -151 15 14 16 23 83 -50 67 46 -3 -186 -9 -37 3 109 111 -45 97 40 -55 -76 23 37 26
3639 26 -91 -22 -9 -79 85 -41 -14 -142 18 -31 -74 75 111 212 263 40 -104 22 82 8 -21 91 -84 23
3663 23 10 3 47 -94 -15 -58 -263 -61 13 8 -133 -107 102 -54 -96 55 66 84 -116 -188 44 -40 -118 -11 46 -36
3689 -36 18 94 83 162 -74 -15 78 98 -19 123 -18 38 -43 -14 119 23 -49 -59 -48 116 49 15 -2 -26 89 3 23
3716 23 40 -79 -126 76 -49 88 -26 5 4 22 -19 91 69 65 2 -195 56 -126 -197 -151 77 -7 -100 -41 -72 -76 -22
3743 -22 157 56 152 104 -107 -6 -54 97 95 175 73 -15 19 -89 -12 -50 56 56 -31 45 -162 -91 -69 11 -2 -84 -65
3770 -65 -42 -10 -10 83 -94 -49 -141 -104 -43 -6 -66 -41 -64 16 -3 -138 133 4 -167 -131 -9 124 -62 -196 -70 -86
3796 -86 -97 128 12 68 -67 94 -63 -98 147 -19 -17 68 -37 -86 57 99 -115 11 -42 101 65 -28 95 46
3820 46 121 43 3 89 176 98 15 84 -98 71 -154 178 125 -75 43 -21 15 -1 -87 98 137 105 26 -28 -19 38 -149
3847 -149 -97 22 -12 22 -102 12 112 46 -229 101 -158 35 -75 82 -54 -148 -83 -51 138 25 124 -60 -48
3870 -48 -58 -72 -63 -114 44 117 67 36 0 -141 87 -15 -56 30 -36 -22 42 16 -31 183 -77 -42 -95 -42 -34 -58 47 -33
3898 -33 -3 34 14 -31 -13 56 -68 48 -73 80 76 32 -58 40 32 70 -63 108 89 -25 -54 1 135 -112 -32 -58 -84
3925 -84 21 28 -29 6 -109 -118 67 47 72 103 -35 -8 -63 -3 13 93 23 5 43 -61 58 -47 -6 -37 96 31 183
3952 183 -11 22 83 6 57 -65 88 37 -137 33 -110 -111 135 -18 45 94 -20 -33 13 102 110 62 69 -41 -74 -98
3978 -98 -5 -82 44 145 -109 143 -128 52 38 -125 -52 -62 -3 14 -20 -18 -5 -16 54 77 -53 20 -103 186 -33
4003 -33 -38 11 -16 97 -69 -54 -160 21 9 119 76 -169 -130 -22 23 -31 -35 43 -32 -39 107 -7 37 -21 -164 35
4029 35 77 -132 66 -21 -41 -153 -156 19 -28 75 119 -111 81 -114 -156 -10 45 -72 -170 -35 -229 15 30 -44
4053 -44 188 -47 -1 25 31 29 -174 -41 0 35 72 13 -83 128 -12 22 -136 -78 5 -4 -13 -32 147 2 39 112 31 94
4081 94 100 130 156 -57 -96 -27 35 36 82 -41 -6 -104 85 168 -59 -76 -70 72 -108 93 -79 -52 -17 -83 101 -63 77
4108 77 95 36 80 -128 82 44 77 -76 -38 30 49 8 32 -176 -70 -12 42 87 34 78 -70 -111 -73 -83 83 -4 -82
4135 -82 -104 74 100 -73 39 48 8 73 116 106 -28 -22 24 -194 123 -60 -21 156 58 -170 76 56 10 -49 96 -50
4161 -50 133 -183 1 196 -14 93 -103 -33 198 -74 88 -4 -139 -68 -20 -39 -90 -7 -86 45 47 -54 -19 -23 -3
4186 -3 109 22 8 40 -21 25 178 41 212 5 91 -37 37 -56 16 181 -41 63 -23 -31 -1 10 11 16 -1 14 103 17
4214 17 122 -85 -118 92 12 79 -54 -210 122 52 50 64 -19 98 95 105 -60 93 -141 -108 13 6 159 13 109
4239 109 161 77 8 72 39 23 188 54 25 -21 -10 113 149 -57 -77 -28 34 -129 49 52 -156 140 -1 -42 -31 -223
4265 -223 -25 68 -77 58 50 -94 -136 119 55 -76 -57 103 81 39 152 26 -40 -139 -18 107 173 17 17 -37 -68
4290 -68 9 -19 52 135 -14 92 -27 53 29 131 -62 -138 7 44 92 -61 135 75 -47 14 -103 123 41 31 66
4315 66 -13 -9 -72 21 201 -98 -11 -47 -62 79 -24 -86 13 77 -209 34 -9 47 122 -81 97 16 -70 60 -122 -59
4341 -59 -21 -46 -54 12 -39 -129 2 72 142 -101 125 6 1 -42 -65 -38 62 102 125 130 -34 170 25 -94 -53 9 -107
4368 -107 109 -75 -32 -10 -2 39 -30 -80 60 -177 -32 -1 112 14 24 233 131 183 -29 -58 -49 -64 -160 -41 -148
4393 -148 -157 -7 -50 66 106 27 91 45 119 -93 9 30 24 71 -151 161 -9 90 135 -59 -55 215 -42 64 134 -9
4419 -9 90 74 -48 -75 -38 61 33 -26 -175 -97 82 154 0 20 40 -121 50 62 -46 32 100 0 -63 0 27 27 120
4446 120 -138 -52 56 141 -32 -31 -15 -128 13 -27 -16 59 -22 -1 57 -19 66 -29 35 -74 -54 -83 -81 16 55 -30 66 -9
4474 -9 32 51 21 -52 -59 -115 -106 -32 74 -70 143 -144 62 51 83 -57 -113 90 148 51 23 35 -55 134 -21 -4 59
4501 59 173 -35 4 -109 -34 37 57 75 -103 -102 -44 -41 20 3 -83 -140 42 -51 -163 25 164 42 -43 86 -56 -58
4527 -58 15 -43 48 136 -125 77 95 -71 19 54 -80 96 -65 -98 -21 -87 -124 58 -90 -62 -29 4 -79 -82 69 -48
4553 -48 -58 -96 -16 -134 19 51 -41 -105 -53 4 26 -12 5 114 -57 -95 95 143 -152 -3 52 64 -105 151 127 75
4579 75 -66 -6 55 82 -74 62 -57 53 22 -49 -10 -190 51 205 8 -65 -18 -96 1 8 -62 -57 4 161 -136 -14
4605 -14 4 -102 6 70 -38 38 36 -31 4 111 -12 97 -12 -72 -42 -6 73 -102 36 102 118 -101 101 -74 -68
4630 -68 -23 73 66 35 49 50 -129 40 87 -6 -95 -4 -62 85 -154 4 -32 1 44 -27 -57 -74 -38 0 -215 -23 70 -29
4658 -29 5 -19 51 -128 132 -133 -102 38 -40 9 87 -101 -70 -142 -67 -33 -6 -13 16 -131 81 -56 -69 85 -150 19
4684 19 64 -84 -9 67 -93 35 -54 -116 -105 -82 4 -52 -45 124 27 -247 -140 -44 159 109 -193 220 -91 102 -46
4709 -46 -207 13 -37 -22 31 6 73 93 39 -73 -86 47 -142 -67 -38 12 -121 37 -4 -123 44 -37 -126 15 -123
4734 -123 38 -45 -33 50 -21 101 78 108 -118 3 23 -14 -3 -22 52 -201 131 -8 90 -147 15 54 132 -3 82
4759 82 55 37 33 20 100 5 91 -77 -4 -188 184 -129 -1 14 -28 -4 -27 -31 26 46 -73 -145 67 49 82 -17 19 85
4787 85 -188 -108 7 -97 -13 -8 81 175 -8 -104 -31 -10 -78 33 -87 -207 -4 35 -189 -93 -15 50 60 96 -99 -53
4813 -53 -27 -54 -54 -179 -15 -29 15 -75 53 -50 28 166 18 -31 -6 32 92 17 -9 -101 -113 -21 -61 2 95 64 -62
4840 -62 -56 -71 8 68 83 -47 91 -122 -67 4 -5 24 -212 -62 49 98 -225 -56 12 -23 14 -42 23 0 29 17 -18
4867 -18 24 -58 -53 -70 72 31 94 -63 188 -202 -79 97 -128 -23 -31 71 -166 54 62 -134 -103 166 -156 5
4891 5 67 47 -63 -22 49 125 -58 -23 74 -308 101 24 -91 -3 -70 119 74 33 -92 -161 39 104 -65 -39 -44 42 -51
4918 -51 -189 -4 -31 3 32 -61 69 -143 92 -70 -103 -148 42 104 -108 33 -34 -25 69 -23 72 -12 118 -80 58
4943 58 33 -20 72 108 97 -27 7 4 -12 19 145 -177 -117 -32 93 -18 -81 -80 -148 -10 4 83 -28 -22 -45 -129 70 -101
4971 -101 6 83 31 130 -159 -70 82 -172 -20 3 -6 124 -20 -10 176 -134 37 -177 67 74 -33 -248 0
4994 0 -5 2 -17 -67 -79 34 99 -77 -119 38 -78 -1 -102 -33 47 -14 37 76 1 63 105 42 -62 -110 -34 -20 11 89 -177
5023 -177 58 -24 -97 32 -21 45 -18 21 -75 -64 4 -25 -27 -92 12 -37 139 -3 -55 9 62 194 -156 -131 -35 148
5049 148 -137 -109 -16 -36 18 -87 -272 13 111 70 19 8 84 -70 81 -76 70 40 -75 48 63 -45 -31 -59
5073 -59 5 -129 102 -69 107 7 99 48 20 17 -180 36 23 -36 52 99 -220 -148 -47 1 -37 130 63 7 130
5098 130 85 -138 -85 39 -51 -89 -40 -179 2 7 -152 -25 72 -24 24 65 78 91 37 65 -73 90 -23 -66 -11 138
5124 138 -70 -26 -110 125 -38 -22 73 62 130 -42 122 -93 -37 -39 -134 -19 -293 74 67 -126 -69 70 24 13 20 -27
5150 -27 -134 27 41 -112 -61 -135 -75 -7 100 52 24 104 -85 -8 -53 150 17 -92 -49 -13 79 41 -215 7 -29
5175 -29 -102 -39 28 -155 -92 11 25 174 67 112 46 136 -54 42 107 -2 26 -1 -6 115 -29 64 -36 -66 92 -112
5201 -112 -45 51 102 257 65 145 -104 -105 -58 -176 60 -185 -17 -89 11 -82 -88 49 32 -70 -68 -108 86 16 -35 -29
5227 -29 28 87 -59 34 63 -60 -60 -5 34 -109 -52 -85 38 -74 -76 -151 21 204 -21 49 -79 -15 65 79 -63 12
5253 12 -26 -43 -89 6 -107 2 43 26 26 -31 -104 81 141 45 -126 55 -19 -79 81 121 67 -83 16 -68 0 63 7
5280 7 254 16 202 34 -60 -5 -154 -23 -18 -87 -169 -86 -153 -74 -51 14 -172 132 -9 36 231 50 -119 -112 -83 45
5306 45 113 -108 59 98 31 -25 9 22 78 -112 136 -95 -14 -96 23 -59 -107 17 -24 -52 -90 -32 13 -102 -18 82
5332 82 -59 89 -61 60 50 -19 40 88 -130 -98 6 -30 -34 68 -134 -62 -30 -101 145 -78 112 -84 86 72
5356 72 34 -31 -14 25 15 -74 -150 -121 -104 -15 130 -116 -64 -175 -22 44 -77 49 -80 -170 -91 20 -23 3 -11 -67
5382 -67 -24 14 62 99 4 -45 -33 -119 -144 -103 -16 -84 17 236 51 -168 74 89 5 12 -109 16 42 25 165 196 75
5409 75 -27 -3 57 -8 -5 39 -31 103 -202 9 -15 2 -63 -15 10 -197 -40 -186 6 135 110 -57 -17 -185 37
5434 37 159 -47 -40 11 -35 158 -70 46 -105 -157 -99 -19 54 5 -58 81 2 -70 -47 45 -13 231 -11 -36 1 -16
5460 -16 -151 -87 -12 3 58 -66 -19 -28 178 -12 -64 109 -27 -4 35 62 23 165 -70 61 -54 49 -17 -182 -28
5485 -28 -84 103 -67 1 -102 6 -11 -86 45 -197 -15 226 -185 47 -17 -129 -70 -22 153 -2 112 -39 -135
5508 -135 -25 19 -19 -3 200 -5 39 -20 -118 -80 -3 -25 112 78 -27 -108 -242 -45 83 11 -160 108 223 -77
5532 -77 12 -50 -13 -16 20 -16 76 -86 111 23 -22 -66 -3 74 174 30 0 181 106 -81 28 -58 34 49 -50 -14 18
5559 18 79 -110 48 39 -60 33 25 71 79 101 0 -175 -46 145 136 31 -15 -49 -52 -43 -138 14 -37 59 -77 164 49 -70
5587 -70 51 -12 -9 94 4 32 -85 -90 141 -149 21 -12 -139 53 18 -23 69 -91 5 18 -51 19 -84 21 -59 151
5613 151 -88 218 28 -124 -215 -141 -17 -45 116 -66 43 -148 50 8 29 -152 29 181 -7 115 -86 47
5635 47 -84 -42 -15 -36 -138 -41 38 6 39 -38 -147 44 111 -98 -203 18 87 26 14 -49 -42 -22 100 74 8 -134
5661 -134 63 -8 -90 -53 -32 55 22 -94 -12 -16 -2 -19 -7 -116 30 -13 -83 21 -184 -111 -94 45 -48 -60 0 -15 59
5688 59 107 -56 -42 9 -11 -24 -36 17 0 54 -92 86 46 0 56 -105 5 53 26 -39 -87 4 84 -67 -87 -23 -58
5715 -58 72 -24 142 161 -58 130 56 31 -30 -54 134 34 -183 89 48 -185 -123 113 -110 52 34 -11 -12 -9 77
5740 77 -177 -10 -37 -144 69 -119 11 142 295 -78 -120 63 59 -29 89 46 -120 17 9 -19 -6 176 136 87
5764 87 -7 -112 -53 -67 -57 -75 -106 -127 1 -120 -95 36 -73 6 47 70 74 28 -112 50 53 31 24 46 120 31 -27 -126
5792 -126 109 -66 17 21 -5 78 -142 77 -47 -206 -161 -65 -310 17 -72 34 -123 -1 53 -14 -166 109 -112
5815 -112 16 1 -53 113 115 -10 -67 17 -35 32 -162 183 -68 -76 -5 150 -31 10 -114 -84 73 -137 -94 111 -23
5840 -23 66 -9 60 53 119 -31 41 117 -9 -135 -33 -38 123 -12 -59 186 -6 -97 123 182 -62 99 96 55 25 56
5866 56 -25 49 -51 -156 -50 -6 18 23 -36 111 -137 -17 18 24 9 34 59 -50 120 53 2 -9 81 -208 13 32
5892 32 -59 -24 178 -77 81 -111 -133 -28 -27 -5 -18 -17 -104 -90 3 -159 176 -228 61 139 145 -88 -88 -102 22 43 -3
5919 -3 137 -69 -112 -242 -39 46 -155 146 41 -106 67 -87 102 97 79 67 32 -33 -8 -14 50 45 98 51 -132 33
5945 33 -109 65 -56 53 -116 -38 35 -123 -33 -115 19 1 -49 -45 47 92 -48 52 76 68 166 76 -90 76 -43
5970 -43 51 -52 -130 -235 127 -87 -51 53 -21 48 97 -55 47 -62 74 -98 23 -96 46 106 -61 -26 2
5993 2 -145 -65 124 20 -24 7 91 -131 -72 -17 -62 33 -66 28 73 149 -19 26 31 133 29 -134 -139 8 91 -57 -27
6020 -27 42 -136 -12 53 -87 -158 241 80 23 -24 47 -183 205 21 99 184 62 101 55 -100 52 -36 -24 -139
6044 -139 28 79 -28 -8 11 87 -28 -2 -14 -120 -7 -23 19 -6 -155 168 59 28 -19 -53 92 12 67 79 90
6069 90 17 62 87 -136 -109 -40 -78 0 -30 75 46 -7 0 99 31 -41 -43 16 46 3 31 -19 66 -14 -60 -10 53 61 72 3 -61
6100 -61 136 47 -40 -47 57 14 10 -106 -33 98 25 -42 43 -116 29 67 -79 -51 -35 -74 -65 36 0 -63 87 26 -15
6127 -15 171 -101 69 -4 1 4 -23 119 -72 -66 8 9 -53 139 0 130 57 52 -211 -107 -102 -52 -6 -45 138 -33 7
6154 7 54 -61 180 -4 22 -24 -87 72 2 77 -86 -105 73 -77 87 -98 -108 -95 -28 -55 49 -71 -160 72 -42
6179 -42 -77 -9 -68 -3 17 -36 -96 -101 -37 41 39 -40 69 -157 39 -185 57 -19 138 73 135 -8 66 2 43 -140 31
6206 31 -66 -36 -86 -70 42 -237 75 -68 90 57 -67 15 -155 111 47 -42 -3 136 -29 -60 -87 -56 51 -89
6230 -89 -161 -10 57 8 117 115 24 -66 100 13 26 -109 44 96 -130 61 42 -118 139 -16 -39 95 29 -21 -10
6255 -10 -59 -164 -24 -23 -39 109 62 125 24 -79 -56 101 26 -35 -5 -163 -159 38 2 -76 -87 22 153 -59 -36 57
6281 57 54 -69 69 21 56 -192 -182 -117 91 7 -123 10 88 -20 -28 -125 -16 -63 -28 20 60 -54 63 74 134 105
6307 105 183 -60 11 66 -51 14 167 -32 -70 -22 41 22 -49 8 214 -87 26 -40 53 31 101 22 -42 25 -92 8
6333 8 -4 -15 -121 153 -125 44 174 -132 20 -212 15 -36 -17 -67 36 72 34 93 125 189 28 -50 41 51 -91
6358 -91 -20 45 93 -22 63 16 116 43 -61 41 120 15 90 180 69 -38 -96 232 -87 148 -47 -14 29 -40 -156
6383 -156 -174 -73 94 -16 13 -61 136 5 168 59 26 -14 -46 -82 -48 44 53 53 -102 19 241 56 -15 30 -165
6408 -165 -38 -89 208 -31 -36 140 6 -113 -87 -120 -18 -17 115 -91 -53 9 33 43 -153 -174 76 -101 -207 56
6432 56 51 38 -58 -73 -92 46 -38 84 4 211 66 87 -1 -78 -20 -148 122 79 -8 -173 -31 8 79 62 16 -28 -10
6459 -10 28 45 -1 66 -68 60 107 -72 119 46 5 -85 37 121 -56 55 -5 87 -66 -84 -70 90 -132 76 24
6484 24 -172 65 105 -36 -2 -28 -26 22 -138 159 101 49 36 40 163 49 -8 132 106 26 68 -157 18 -14 -152 -119
6510 -119 55 2 -58 -142 -113 44 24 -36 -25 38 -46 -46 59 -53 -22 -277 -6 89 91 43 122 -122 16 -207 97 -5
6536 -5 -14 71 183 -22 -82 6 -146 69 132 -30 -77 53 5 -34 -56 79 -7 -56 16 84 81 -43 -80 18 93 160 58
6563 58 -71 26 164 -8 0 -46 -2 57 -19 -87 -56 2 -47 0 93 157 -21 -168 -76 -116 172 -82 -109 -24 -57 118 -22
6590 -22 2 -66 23 -103 -10 -20 107 56 91 -91 85 8 77 5 -77 -131 91 -82 -103 -20 -26 15 20 22 -76 74 57 -23
6618 -23 -104 207 -141 180 -33 -160 55 -65 -146 15 -27 21 -62 -28 4 -26 26 59 -139 -46 -36 -183 -29 8 -87
6643 -87 14 32 80 72 105 -170 -27 -8 -89 61 33 204 39 8 -35 250 50 3 51 -44 9 -90 18 110 84 190
6669 190 -11 -31 98 150 -95 11 -60 24 -185 -64 272 -49 -31 -53 -54 26 -176 103 150 -156 75 -90 -69 -24
6693 -24 20 100 35 158 -8 -36 -18 151 -20 90 -2 -102 -31 -84 45 -39 106 -131 -106 58 -23 4 -20 -196 -116
6718 -116 91 -79 35 -74 -24 227 16 29 15 87 -81 4 50 39 44 77 -78 136 80 49 -95 80 114 13
6742 13 82 98 143 -41 56 -85 15 20 -1 90 -102 20 46 130 43 -92 -125 84 -106 93 -152 114 -79 -29 -51
6767 -51 -13 60 21 1 57 -25 -72 -63 78 -103 -201 70 -13 111 -37 -48 -10 -91 109 -97 -11 62 45 26 -45 106 -16
6794 -16 35 16 -187 -51 -90 30 169 -55 -39 -52 -39 -82 -67 35 19 89 27 74 33 -57 -10 32 -2 -203 -1 89
6820 89 -188 -52 38 -88 -22 -87 22 98 -144 -88 37 -52 78 7 -161 23 -33 -53 45 -97 173 30 -26 -7
6844 -7 72 -4 79 -47 34 -34 74 -51 56 98 29 152 -29 -60 -16 71 25 -115 -5 201 -117 70 -144 -44
6868 -44 -54 181 11 -20 49 -22 9 -32 -34 -68 -162 61 -4 -42 61 -48 2 -46 -67 0 70 55 38 54 97 -172 15
6895 15 99 -64 46 71 36 -53 27 39 22 33 4 -121 47 -5 14 107 -2 156 -28 68 -4 30 -66 -99 22 126
6921 126 -37 19 -41 -33 -41 -87 -28 -58 -134 -99 -28 9 -121 -61 -91 21 60 -158 -57 116 -10 33 40 -90 77 -111
6947 -111 -50 24 -68 62 27 34 83 -12 -64 -27 -127 -8 8 16 84 -86 -65 36 -198 -90 41 39 -40 3 6 -135 175
6974 175 56 151 16 58 60 -21 -42 -55 -29 -139 99 -100 -79 16 -86 49 -54 -100 -75 17 -90 -153 84 4 -116
6999 -116 -151 -165 -197 -20 53 172 73 -63 65 171 -4 69 15 -7 -9 -29 -102 -142 24 58 -51 -70 -44 74 9 121
7025 121 147 206 22 -78 -73 109 -49 8 -2 69 -22 -72 17 -41 26 -53 -119 -22 -160 -120 21 52 122 -66 -99 -35 -17
7052 -17 -12 36 -17 -97 -15 133 -15 -32 82 -32 -10 64 84 -29 -92 16 -23 9 47 119 -28 117 79 102 6 91 9
7079 9 -92 88 -91 -35 124 -82 57 30 50 28 -76 -35 30 -69 -18 67 46 -85 -58 218 -73 26 54 -102 115
7104 115 -38 -1 63 64 88 -53 5 18 -5 -47 -86 94 -134 22 -79 -41 -126 54 140 -20 -81 -7 76 -161 6
7129 6 -53 -71 63 15 110 1 -141 -116 85 106 -115 29 72 -138 -115 90 -79 78 184 -1 31 17 -6 159
7153 159 12 36 -73 108 2 -154 -49 -118 171 -10 -54 -19 -41 -133 -20 7 -12 -64 104 -76 37 19 33 103
7177 103 -98 -231 -82 -95 8 -56 -7 -88 -14 17 -134 104 -69 39 122 46 -39 50 25 58 -16 18 -71 91 40
7202 40 9 -83 27 79 -102 -9 30 54 46 -76 -6 -164 31 -115 80 -47 -64 25 -87 -83 -70 2 -43 58 -215 208
7228 208 111 189 111 90 25 32 56 51 86 -15 -6 -88 -198 -176 -3 45 6 109 -86 47 -171 -117 -63 -119 -10 -38 -20
7255 -20 -57 103 37 50 -9 -9 18 -162 79 4 -93 15 17 -96 -24 202 122 15 -37 18 156 63 35 -108 -84 85
7281 85 44 106 60 -85 -38 -112 30 146 13 60 81 48 96 -83 -112 70 -29 66 -15 -44 -119 84 75 111 -39 151
7307 151 155 29 101 -9 77 15 42 -36 28 6 -78 29 11 137 22 -233 -140 53 1 -20 -135 -120 16 38 -45 -12
7333 -12 52 37 -30 -66 -70 26 3 75 19 4 85 117 64 -14 -7 35 -29 129 -36 135 -66 -51 -101 -68 10 -3 178 61
7361 61 42 -111 -59 -107 -3 -7 -33 45 21 0 -58 62 -34 -34 111 25 70 -48 4 -19 11 26 -49 39 -144 -29 1 -124
7389 -124 -95 -3 -108 88 -57 2 48 -128 14 -15 -86 -31 -44 7 -27 -127 49 72 -75 -116 -1 -130 -31 58 120
7414 120 21 127 -120 84 -28 32 -28 -39 -13 -79 -109 131 28 88 118 -84 67 -74 25 -11 -57 130 -54 66
7438 66 -115 -90 247 -138 -81 39 49 58 -95 92 105 50 -113 111 -24 -96 -99 -51 37 -76 -104 99 12 -27 -39 -196
7464 -196 -115 125 -48 0 -90 -41 -63 18 -5 10 -8 122 179 0 147 -47 -10 -28 147 -16 -108 -12 -40 -111 31
7489 31 61 -190 53 -102 -160 46 -109 145 -22 90 13 -176 -119 -128 -14 9 100 28 -189 -45 50 -80 45 36
7513 36 148 133 -41 53 59 40 24 35 -163 -31 196 -57 13 -239 -15 -16 -101 9 28 148 74 -31 90 -7 -34
7538 -34 4 -22 99 83 11 -24 142 -65 91 63 -142 -81 -52 -82 -158 33 -59 151 -25 92 39 25 85 78 -49 -155
7564 -155 2 39 -94 24 157 -203 -157 48 -42 14 30 46 -199 -46 4 21 113 -60 4 -43 -37 -127 -64 -105 34
7589 34 -96 14 -6 1 -2 -98 -43 68 8 158 -210 114 -22 -66 -52 -165 102 90 -18 -64 80 -93 167 82 -147
7614 -147 -2 36 -8 -10 113 25 -4 -14 -21 -51 -66 -82 -215 -18 -178 -38 87 116 -32 41 -112 -79 106 31 -166
7639 -166 -45 85 -20 10 91 -136 -10 55 9 -22 -14 17 26 38 -50 -39 -36 87 106 -76 -6 143 2 42 -80 -45
7665 -45 -2 11 -112 -86 -161 62 -119 -56 86 -2 -30 80 79 63 2 22 -2 -74 53 73 19 -73 25 -60 74 15 11 90
7693 90 -40 31 -17 -63 99 29 104 50 -56 -27 114 -91 -84 -183 76 -144 -39 -144 -83 76 10 16 -31 -25 35 -46 7
7720 7 34 23 -79 -30 76 -88 -24 59 202 -75 75 88 -13 122 -6 30 -134 -117 46 -46 10 -23 37 96 25
7745 25 48 18 74 78 -98 79 -35 -57 68 64 -210 -5 7 6 -33 -51 51 79 -45 80 7 4 38 -33 -136 19 28
7772 28 5 29 70 5 -16 62 -32 32 -84 -29 -95 60 -62 -175 65 -132 -79 82 -23 2 -6 -47 81 29 -8 16
7798 16 -15 21 188 341 22 -28 25 84 92 31 -82 29 4 132 43 -207 -26 88 9 -71 -13 -88 51 43 147 187
7824 187 -73 26 90 -6 -6 133 -104 21 116 -69 -56 -21 84 88 -94 -29 17 -19 5 117 -120 -159 20 -74 -7 -179
7850 -179 -121 -89 -80 -9 -97 -71 -105 -33 -71 164 71 30 172 34 138 40 106 -9 -125 84 68 40 85 47 -2 31 -191
7877 -191 52 -103 -101 -22 -45 92 -77 23 -22 -252 -46 -99 -100 -41 -14 -40 31 -19 -139 56 -12 24 61 -51 71
7902 71 13 -90 -196 -101 -18 3 170 -103 -156 -100 -91 -60 -2 -80 -48 -98 -119 -25 -48 171 76 -80 104 -46 156 91
7928 91 0 74 44 26 39 73 57 -29 -9 84 -110 -99 68 52 -42 88 90 -47 105 122 27 6 1 -128 -80 -136 -140 -10
7956 -10 -106 -38 -20 -118 -26 -70 -28 9 104 -4 -10 -228 -109 54 -60 73 55 164 113 2 -11 -129 67 67 104 -119
7982 -119 -105 199 153 -36 -34 69 100 132 -35 24 12 -82 -28 -175 -55 -28 99 163 -85 -171 -29 4 187 -97 164
8007 164 61 -13 44 -40 12 -98 -48 13 -43 111 -103 47 44 -119 -71 29 14 -74 141 34 -24 -40 32 30 75 87
8033 87 -123 42 43 100 77 74 6 -108 149 -38 0 51 46 66 -31 -94 94 -1 10 71 -11 90 86 69 32 2 143 160
8061 160 11 57 -128 68 -4 82 56 64 -158 -32 44 -70 -4 -54 67 22 156 -41 -70 -46 -23 -151 30 6 73
8086 73 -9 -93 44 2 40 -73 113 41 80 -142 8 -97 168 -67 42 5 45 38 -13 -93 61 60 -48 -161 -105
8111 -105 236 54 35 -77 -47 -32 35 43 -62 -6 -114 71 -50 -84 -26 18 -71 -207 118 25 -27 -14 -60 -43 -101 -173
8137 -173 -28 -14 -84 -90 84 19 56 108 303 50 1 -120 -69 29 -3 -64 -193 114 12 -63 8 20 -112 -10 71
8162 71 -41 -35 35 103 -63 -36 20 -59 67 -30 112 -6 25 151 -40 -155 -62 10 46 10 188 -24 -104 97 98 -86
8188 -86 -20 -2 -30
8191c0
##END NTUPLES=NMR FID
##END=
