##TITLE=1H_Pr T-Am-CF2
 CDCl3
 8 sc, 
 16.12.2021
##JCAMPDX= 6.0         $$ Bruker NMR JCAMP-DX V2.0
##DATA TYPE= NMR FID
##DATA CLASS= NTUPLES
##ORIGIN= UXNMR, Bruker Analytische Messtechnik GmbH
##OWNER= root
$$ XWIN-NMR		Version 3.5
$$ Thu Dec 16 12:40:07 2021 Russian Standard Time (UT+4h)  she@DPX200
##.OBSERVE FREQUENCY= 200.131346
##.OBSERVE NUCLEUS= ^1H
##.DELAY= (6, 6)
##.ACQUISITION MODE= SIMULTANEOUS
##.ACQUISITION SCHEME= undefined
##.AVERAGES= 8
##.DIGITISER RES= 18
##SPECTROMETER/DATA SYSTEM= spect
##.PULSE SEQUENCE= zg30
##.SOLVENT NAME= CDCl3
##.SHIFT REFERENCE= (INTERNAL, CDCl3, 0, 15.7039)
##AUDIT TRAIL= $$ (NUMBER, WHEN, WHO, WHERE, WHAT)
$$ ##TITLE= Audit trail, XWIN-NMR		Version 3.5
$$ ##JCAMPDX= 5.01
$$ ##ORIGIN= Bruker BioSpin GmbH
$$ ##OWNER= she
$$ F:/spectra/data/she/nmr/H-F/1/audita.txt
$$ ##AUDIT TRAIL=  $$ (NUMBER, WHEN, WHO, WHERE, WHAT)
(   1,<2021-12-16 12:38:54.07 +0400>,<she>,<DPX200>,
      <created by zg, POWCHK disabled, PULCHK disabled
       configuration hash MD5:
       00 E9 B6 7A A2 85 ED C7 34 08 36 98 17 FE 4E 26
       data hash MD5: 16K
       91 28 7A 2A 0F 44 F5 85 6E 48 21 9D 99 B5 4A 65>)
$$ ##END=
$$ 
$$ hash MD5
$$ 28 DB F5 B4 77 DA 95 09 E1 25 DB AB B8 DA 2B BF
##$RELAX= 
##$RELAX= 
##$RELAX= 
##$RELAX= 
##$RELAX= 
##$RELAX= 
$$ Bruker specific parameters
$$ --------------------------
##$DU= <F:/spectra>
##$EXPNO= 1
##$NAME= <H-F>
##$PROCNO= 1
##$TYPE= <nmr>
##$USER= <she>
##$AMP= (0..31)
100 100 100 100 100 100 100 100 100 100 100 100 100 100 100 100 100 100 
100 100 100 100 100 100 100 100 100 100 100 100 100 100 
##$AQSEQ= 0
##$AQ_mod= 1
##$AUNM= <au_zg>
##$AUTOPOS= <>
##$BF1= 200.13
##$BF2= 200.13
##$BF3= 200.13
##$BF4= 200.13
##$BF5= 200.13
##$BF6= 200.13
##$BF7= 200.13
##$BF8= 200.13
##$BYTORDA= 1
##$CFDGTYP= 0
##$CFRGTYP= 5
##$CHEMSTR= <none>
##$CNST= (0..31)
1 1 145 1 1 1 1 1 1 1 1 1 1 1 1 1 1 1 1 1 1 1 1 1 1 1 1 1 1 1 1 1 
##$CPDPRG= <>
##$CPDPRG1= <>
##$CPDPRG2= <>
##$CPDPRG3= <>
##$CPDPRG4= <mlev>
##$CPDPRG5= <mlev>
##$CPDPRG6= <mlev>
##$CPDPRG7= <mlev>
##$CPDPRG8= <mlev>
##$CPDPRGB= <>
##$CPDPRGT= <>
##$D= (0..31)
0 1.2 0 0 0 0 0 0 0 0.06 0 0.03 0 0 0 0 0.0002 0 0 0 0 0 0 0 0 0 0 0 0 
0 0 0 
##$DATE= 1639643933
##$DBL= (0..7)
120 120 120 120 120 120 120 120 
##$DBP= (0..7)
150 150 150 150 150 150 150 150 
##$DBP07= 0
##$DBPNAM0= <>
##$DBPNAM1= <>
##$DBPNAM2= <>
##$DBPNAM3= <>
##$DBPNAM4= <>
##$DBPNAM5= <>
##$DBPNAM6= <>
##$DBPNAM7= <>
##$DBPOAL= (0..7)
0.5 0.5 0.5 0.5 0.5 0.5 0.5 0.5 
##$DBPOFFS= (0..7)
0 0 0 0 0 0 0 0 
##$DE= 6
##$DECBNUC= <off>
##$DECIM= 32
##$DECNUC= <off>
##$DECSTAT= 4
##$DIGMOD= 1
##$DIGTYP= 9
##$DL= (0..7)
0 120 120 120 120 120 120 120 
##$DP= (0..7)
150 150 150 150 150 150 150 150 
##$DP07= 0
##$DPNAME0= <>
##$DPNAME1= <>
##$DPNAME2= <>
##$DPNAME3= <>
##$DPNAME4= <>
##$DPNAME5= <>
##$DPNAME6= <>
##$DPNAME7= <>
##$DPOAL= (0..7)
0.5 0.5 0.5 0.5 0.5 0.5 0.5 0.5 
##$DPOFFS= (0..7)
0 0 0 0 0 0 0 0 
##$DQDMODE= 0
##$DR= 18
##$DS= 0
##$DSLIST= <SSSSSSSSSSSSSSS>
$$ [...]
##$SUBNAM2= <"">
##$SUBNAM3= <"">
##$SUBNAM4= <"">
##$SUBNAM5= <"">
##$SUBNAM6= <"">
##$SUBNAM7= <"">
##$SUBNAM8= <"">
##$SUBNAM9= <"">
##$SW= 18.0517287032376
##$SWIBOX= (0..15)
0 0 2 0 0 0 0 0 0 0 0 0 0 0 0 0 
##$SW_h= 3612.71676300578
##$TD= 16384
##$TD0= 1
##$TE= 0
##$TE2= 300
##$TE3= 300
##$TEG= 300
##$TL= (0..7)
0 120 120 120 120 120 120 120 
##$TP= (0..7)
150 150 150 150 150 150 150 150 
##$TP07= 0
##$TPNAME0= <>
##$TPNAME1= <>
##$TPNAME2= <>
##$TPNAME3= <>
##$TPNAME4= <>
##$TPNAME5= <>
##$TPNAME6= <>
##$TPNAME7= <>
##$TPOAL= (0..7)
0.5 0.5 0.5 0.5 0.5 0.5 0.5 0.5 
##$TPOFFS= (0..7)
0 0 0 0 0 0 0 0 
##$TUNHIN= 0
##$TUNHOUT= 0
##$TUNXOUT= 0
##$USERA1= <user>
##$USERA2= <user>
##$USERA3= <user>
##$USERA4= <user>
##$USERA5= <user>
##$V9= 5
##$VALIST= <valist>
##$VCLIST= <CCCCCCCCCCCCCCC>
##$VD= 0
##$VDLIST= <DDDDDDDDDDDDDDD>
##$VPLIST= <PPPPPPPPPPPPPPP>
##$VTLIST= <TTTTTTTTTTTTTTT>
##$WBST= 1024
##$WBSW= 4
##$XGAIN= (0..3)
0 0 0 0 
##$XL= 0
##$YL= 0
##$YMAX_a= 238947
##$YMIN_a= -241499
##$ZGOPTNS= <>
##$ZL1= 120
##$ZL2= 120
##$ZL3= 120
##$ZL4= 120
##$ABSF1= 10
##$ABSF2= 0
##$ABSG= 5
##$ABSL= 3
##$ALPHA= 0
##$AQORDER= 0
##$ASSFAC= 0
##$ASSFACI= 0
##$ASSFACX= 0
##$ASSWID= 0
##$AUNMP= <proc_1d>
##$AZFE= 0.1
##$AZFW= 0.1
##$BCFW= 1
##$BC_mod= 2
##$BYTORDP= 1
##$COROFFS= 0
##$CY= 11.3945322036743
##$DATMOD= 1
##$DC= 2
##$DFILT= <>
##$DTYPP= 0
##$F1P= 2.36226072786647
##$F2P= -0.459571619588291
##$FCOR= 0.5
##$FTSIZE= 0
##$FT_mod= 4
##$GAMMA= 1
##$GB= 0.15
##$INTBC= 1
##$INTSCL= 1
##$ISEN= 128
##$LB= 0.24
##$LEV0= 0
##$LPBIN= 0
##$MAXI= 10000
##$MC2= 0
##$MEAN= 0
##$ME_mod= 0
##$MI= 1.114404
##$NCOEF= 0
##$NC_proc= 0
##$NLEV= 6
##$NOISF1= 3.799351
##$NOISF2= 2.8
##$NSP= 1
##$NTH_PI= 0
##$NZP= 0
##$OFFSET= 15.70392
##$PC= 1
##$PHC0= -15869.67
##$PHC1= 10.80079
##$PH_mod= 1
##$PKNL= yes
##$PPARMOD= 0
##$PSCAL= 0
##$PSIGN= 0
##$REVERSE= no
##$SF= 200.130013532006
##$SI= 16384
##$SIGF1= 3
##$SIGF2= 2
##$SINO= 400
##$SIOLD= 16384
##$SREGLST= <1H.CDCl3>
##$SSB= 0
##$STSI= 0
##$STSR= 0
##$SW_p= 3612.71676300578
##$SYMM= 0
##$S_DEV= 0
##$TDeff= 0
##$TDoff= 0
##$TI= <>
##$TILT= no
##$TM1= 0
##$TM2= 0
##$TOPLEV= 0
##$USERP1= <user>
##$USERP2= <user>
##$USERP3= <user>
##$USERP4= <user>
##$USERP5= <user>
##$WDW= 1
##$XDIM= 8192
##$YMAX_p= 0
##$YMIN_p= 0
$$ End of Bruker specific parameters
$$ ---------------------------------
##NTUPLES= NMR FID
##VAR_NAME=  TIME,          FID/REAL,        FID/IMAG
##SYMBOL=    X,             R,               I
##VAR_TYPE=  INDEPENDENT,   DEPENDENT,       DEPENDENT
##VAR_FORM=  AFFN,          ASDF,            ASDF
##VAR_DIM=   8192,          8192,            8192
##UNITS=     SECONDS,       ARBITRARY UNITS, ARBITRARY UNITS
##FACTOR=    0.0002768,     1,               1
##FIRST=     0,             0,               0
##LAST=      2.2672688,     0,               0
##MIN=       0,             -241499,         0
##MAX=       2.2672688,     238947,          0
$$ Real data points
##PAGE= N=1
##DATA TABLE= (X++(R..R)), XYDATA
$$ [...]
2234C21R9n02N2O84r44K39M43l65m2o96N04N88n92j81M85M51m75J56j20j83r6
2255a74j95O64l80J36k39K02O17m58p10M89O4n19K93J56N44n48n69L46K6N67l68
2276e6k77J453r38o33O12j78J17j109K73J200k47p95N91Q4l90J04K66L79p12k2
2296b78P23j1o40r3L20K21k10m79P17k32l84L29N1J31l83j82L76L24n39L3K80
2317G4J25Kn39L03L35o46J70K15k74N49o93K80j32l97L16N00o55M13q1M45M1j514
2339a163N07R78o65q55Q94M94l8p16M08J375j645L7K3J028K72j586K7Q98J52n74
2359a49M24k13N73k103P85O79n02L01J84m67M17o71M80P15o08K60n43L0R59r90
2379d39l1P63J49n81k30O77R8n22n57R93M12r26L9K76N47r80j50P82p73q55J227
$$ plain form
2234 321 420 -82 -30 654 -290 -51 392 27 -15 -711 -207 381 -211 -392 93 544 69 225 105 -78 -174
2255 -174 -369 295 -85 51 -188 14 631 173 -537 -48 16 -503 -210 -54 490 -58 -627 -281 -255 312 -56
2276 -56 -333 1120 182 -451 161 -17 100 -1009 -736 464 217 -578 13 97 -293 -189 77 456 -256 -278
2296 -278 445 434 -206 -299 21 242 32 -447 270 38 -346 -17 34 165 -218 -400 -24 300 -239 -206 74
2317 74 199 201 -338 -35 300 -346 -176 39 -235 314 -379 -99 -231 -628 -312 188 -467 -54 -135 310 351 -1163
2339 -1163 -656 322 -343 -1198 -304 190 152 -564 -156 1219 -426 -389 -366 662 934 -652 -625 273 425 -149
2359 -149 275 62 635 -1468 -683 -4 -506 -205 -21 -488 -71 -742 -262 453 -155 105 -438 -408 551 -439
2379 -439 -470 293 442 -139 -369 308 406 -116 -673 320 732 -194 -155 121 668 -312 -462 320 -453 -1308 -81
2400h1r8J55K03k27J33O8n82L67K40k08l62Q9P00p12QN18O73n26l36m15J12Q09
2422E28o96M30K32l61J12p81Q9M00m00P81j53L7p43pO13kn19L53J80J02k82k15
2444c02M97J93p40L91N02m08l3j81M40k77l38J37N39l70k34j06L14L69q79M43
2464d3J38l06K46N61m2o6m75j85N29n85Q4j28L9O25o44J86K60j81J22l68M68j36
2486I9r9rJ11P5k94n3p7N35o44k16P61l85J0Q6j42N92o91L9N14k56j50N9Q3K67
2510B15l21p6O24l63k44J79o7M63n15Q5K20m01R7j41K54N1k24k57N62j05l61N17
2532A92m84K09j39j27O31N0p76O60n8J40l17j34O52k38m77M37K7j0L8n96M53j81
2554d8l24N11k16Q3n5j7j5L28r55M93O36m26k00N6L22rk47L57k4m15K26j60L50
$$ plain form
2400 -81 -179 -24 179 -48 85 153 -429 -62 178 -30 -392 -303 397 -315 -307 211 884 358 22 -393 -281 528
2422 528 -168 262 494 133 245 -536 -447 -47 -447 334 181 218 -525 -532 81 79 -440 -87 93 195 -87 -302
2444 -302 195 388 -352 39 541 133 100 -81 359 82 -256 -119 420 50 -184 -290 24 393 -486 -43
2464 -43 95 -211 35 596 554 488 13 -172 357 -228 -144 -272 -233 392 -252 -66 194 13 135 -233 235 99
2486 99 0 -9 102 177 -117 -170 -247 288 -356 -572 189 -196 -186 -100 -242 350 -341 -302 212 -44 -194 -135 -52 215
2510 215 -106 -182 442 79 -165 14 -53 410 -105 -20 200 -201 -104 -245 9 60 -164 -421 141 36 -325 192
2532 192 -292 -83 -222 -349 282 332 -444 216 158 298 -19 -153 499 261 -216 221 248 238 276 -320 133 -48
2554 -48 -372 139 -77 6 -49 -66 -81 247 -708 -215 421 -5 -205 -149 173 164 -83 274 250 -165 61 -99 251
2577B51J38o72K70L54l51N5k14N01j42p36L83K44l66J7L40J70K10o78J49M68o85
2598b94J40K02q5M22r31M43N95o05J82K5J32K27m85k2L60m21O4m9K12J27o75J48
2620b88P75n47l52M17j20J73n65L06N86o57Q3K44k37K67m26N19J87J22p79N69
2640B77m28O62n50J20P23l51o85K66M56o60J98P3K11k24l0K94j47j12r9p90R19
2661A23q2P0L5K8O32j025K65R3L63p04K0R57j283Q13j055J37P09l51Q86j212N02
2682g9N72q50M16L67j165J739j184K45k62k30N75j28m61N02P61j140K18N58j15
2701C39j55j18j86L81j87k35K46m20P37n23O45O1k15j232K23N80m46Q95P25p99
2721C16L04n62k09O73J69j317J3J465j395M24L62O26P6j463N04L96n89j40K01
$$ plain form
2577 251 389 -283 -13 341 -10 45 -169 332 190 -546 -163 81 -285 -268 72 242 452 -226 -77 391 -294
2598 -294 -154 48 -37 385 -546 -103 492 -113 69 94 226 453 -32 -54 306 -115 -51 -100 112 239 -436 -288
2620 -288 487 -60 -412 5 -115 58 -507 -201 385 -272 -189 55 -182 85 -341 178 365 487 -292 277
2640 277 -151 511 -39 81 804 453 -232 34 490 -170 28 101 312 88 58 352 205 93 -6 -796 123
2661 123 41 111 146 174 806 -219 46 139 502 -202 -182 775 -508 305 -750 -613 96 -255 631 -581 -79
2682 -79 493 -357 59 426 -739 1000 -184 61 -201 -431 144 16 -445 57 818 -322 -104 454 339
2701 339 184 66 -120 261 74 -161 85 -335 402 -121 524 585 370 -862 -639 -59 -505 390 1115 316
2721 316 620 58 -151 522 691 -626 -613 852 -543 -119 243 869 945 -518 -14 382 -207 -347 -146
2740a46N53j73k79P3L57j023J43M45m89M09m56M56P15r34J42M9o9M42k66k09j24
2761c84M07j207P06M15K37K06m80R6j54k15N78j34n2Ol43Q82o36j10J69q2K89
2782A94r85P04P85p28o06Q87J81o89kJ68L23m3o91O89o4k48J26L5K24n45K55K81
2804B51o1l52K38k81M70j22n99N18j59o1J91K09J04j410N99M12O75l53j27J47
2824B89M11j21j349Q36K85l57k30K92m09M81q92J149o09J43m29N96o40j1K06J93
2844a66P60r20J47J00K02l80J55Q3K36l70q3N72po31K64K94q7k65j96M92n1k13
2866f4j15K99J81m49R5M8n6m4j69P4N39l82l36O10k92O1k69L47M05n26k55N06
2888B08j38k07N9J40J01q6p5k8Q8j45j00L64m4m19k52P78k57k35J37J0M03k77
$$ plain form
2740 -146 407 234 -45 28 385 -638 -495 -50 -539 -130 -586 -130 585 -349 -207 -158 -227 215 -51 -260 -384
2761 -384 23 -1184 -478 -63 174 380 -100 -4 -158 -373 205 71 19 25 -318 564 -72 -182 -13 -95 194
2782 194 -791 -87 698 -30 -636 251 432 -257 -259 -91 232 189 -502 187 123 -125 1 36 260 -285 -30 251
2804 251 190 -162 76 -205 265 143 -456 62 -97 -158 33 242 346 -1064 -465 -53 622 269 142 289
2824 289 700 579 -770 66 351 -6 -236 56 -353 128 -764 385 -224 -81 -510 86 -554 -565 -359 -166
2844 -166 594 -326 -179 -79 123 -257 -102 -19 217 -153 -236 336 329 -302 -38 256 169 -96 -292 200 149 -64
2866 -64 -179 120 301 -148 -53 -5 -61 -105 -274 -200 339 -43 -379 231 -61 0 -269 78 483 -43 -298 208
2888 208 70 -137 -78 62 163 77 2 -26 62 -83 -183 181 137 -282 -534 244 -13 -248 -111 -101 302 25
2910B5j15K91j4l77L29oR7m06J36L62j44l67K33k29K96j24r7O6j12r3L74r6Pl36
2934c00j47R90n16r2m19M54Q4J7n14O45j26j30J17J00j09k5j76M39r7n51P6O11
2956C31j49k82J95M1j70m62K14L58j74Q0j8lK0J52j37Q8k34J5j38K59L27k90m9
2979b6M4j44J11j40K20J45n86K96L48l29P3j33K65k17j9j83L84k43N20l78j55
3000a47L30k48k02M16R5p09M46P6K08m84J00M74j68k99J42O1M2k19j01N54m73
3021a06j8L80j47r3j13n11O94J43m63m7L30M96n32j30M9L05l6k0j49L26n30n38
3043g10J307l76l73M30j63J47l95j6J14N8k60L51j31J5K0k95M68k30r5O6K67l27
3065a28r0k40N72J26o59K68K67L6j70O5P8P2m79L45N13k21n35K49L31J28L05o21
$$ plain form
2910 25 -90 201 187 -190 139 133 230 -176 -40 322 178 -189 44 -185 111 -13 -110 -44 -156 -249 125 29 36 -300
2934 -300 -447 543 27 -65 -484 -30 54 71 -443 202 76 -54 63 163 54 29 -147 292 195 -356 -280 331
2956 331 182 -100 95 136 -34 -496 -282 76 -98 -18 -36 -39 -19 133 -4 84 -150 -135 -273 -14 313 23 -26
2979 -26 18 -126 -15 -155 65 210 -376 -80 268 -61 12 -121 144 -73 -92 -275 109 -134 386 8 -147
3000 -147 183 -65 -267 149 244 -465 -19 57 265 -219 -119 355 187 -112 30 91 133 -86 -187 367 -106
3021 -106 -124 256 109 16 -97 -608 86 229 -234 -281 49 545 13 -117 -68 237 201 181 32 358 -172 -710
3043 -710 597 221 -152 278 115 262 -133 -149 -35 23 -237 114 -17 -2 18 -277 191 -39 -134 -68 199 -128
3065 -128 -218 -458 114 240 -419 -151 116 152 -18 47 125 197 -282 63 576 355 -180 69 400 528 833 212
3087B12M84p66Q7K0m52j94J229p62P0O56q0l0n91O26j455J141M05p28J90L4M25
3108E21N3p05j54N42k86L80n72P56J15j284m4Q92j44O79r05L08K71p75P66k02
3128B12q15M54K11k56K86p3J99M25l91j53p3K12J15l72J06K49n74K8L15J13j42
3149G6j50J1Oj21j73L62j76P3q1l3N93n91k68O28k1j59n3J31L32l70j32K58l24
3172a82L16k30m08K15m2j83J710m50o9q67K49N59r73J27N24j47n54L26m84L43
3192b20J89Pp1jN4j74k50Q83l66K1K9K02l34J47k29K96k72k32M37k30J16j50J8
3215a30J50J72o42L41K24k17K39j37j28O11r81P40J08o45J46M84l33J81n09K58
3235f8N06o05J57O9k01L18q69M97P63j274O17L7J40K95M30p74P03p88j36O51m54
$$ plain form
3087 212 696 -70 17 37 -415 -609 620 -142 -72 584 504 474 -117 509 -946 195 600 -128 62 96 521
3108 521 574 -131 -285 257 -29 351 -221 535 650 -634 -678 214 70 749 -156 152 423 -352 414 212
3128 212 -603 -149 62 -194 92 19 218 643 252 99 26 238 353 -19 87 336 -238 -210 105 218 76
3149 76 -74 -63 -57 -178 -351 11 -165 -92 -173 -206 387 -204 -472 156 135 -24 -77 54 386 16 -116 142 -182
3172 -182 134 -96 -504 -289 -331 -514 1196 746 677 -190 59 618 -355 -228 296 149 -405 -79 -563 -220
3192 -220 -31 -24 -95 -96 -42 -216 -466 417 51 72 101 303 -31 116 -113 183 -89 -321 116 -114 2 -148 -130
3215 -130 20 192 -450 -109 115 -102 137 0 -128 483 -498 242 350 -295 -149 335 2 183 -326 -68
3235 -68 438 -167 -10 59 -142 176 -693 -196 567 -707 -90 -53 87 382 812 38 741 -47 -183 468 14
3256A4j02k03L13O03j09n31K34l80M48o5M02o49J87J94O07p34o98N57l87J086
3276G87n29k94K71M69p3k140J602Q42k62p66n02P93k60l53M22n85R16r73J95M72
3296C2J02J65m86Q03m63l28%N91n44L09Ok67L14j31J18j05p53N23p02J947r23
3317B08l07L40p30P3J49K6N58M48j168P86M0o42J63K03N31r3j191O26Q39o66m48
3338b55O06k63l5M8O3M35j017K15j50L71K46p47M81K56n59K89M47j77k63RJ30
3359A30M5j83l84N10O4j11m91O66J18n53J58L79k26l21j85L08J22l57K78N1J85
3380B03l42om2O09p01L91L51l80m3l07K55O29n85k31M16j89k17L6r0O49p28k42
3402e64J041q21L21l21J64K55m27M0N56l15J5L63l41K93p9l60N63l40mL8J08Q
$$ plain form
3256 14 -88 -291 22 625 516 -15 219 -161 287 222 624 -25 162 356 963 229 -469 88 -299 787
3276 787 258 -36 235 704 631 -1509 93 935 673 -93 -595 198 -62 -415 7 -578 338 -635 -440 32
3296 32 134 299 -187 616 153 -175 -175 416 -128 181 187 -80 234 103 221 116 -637 -114 -816 1131 208
3317 208 -99 241 -489 -416 -267 -241 317 765 -403 383 423 -219 -56 147 678 585 -606 20 859 193 -255
3338 -255 351 88 53 101 164 599 -418 -203 -353 18 264 -483 -2 254 -305 -16 431 254 -9 0 130
3359 130 175 -8 -392 118 182 71 -420 246 364 -189 -31 348 122 -199 -384 -76 46 -311 -33 18 203
3380 203 -139 -145 -187 422 -279 112 463 83 40 -267 -12 617 32 -199 217 28 -189 -153 -243 406 -322 -564
3402 -564 477 -344 -23 -344 -180 75 -352 -312 244 -71 -56 307 -34 259 180 -180 383 43 39 77 185 193
3424A93M7n13N72j0m44l6J40M13p62J58k15M60n26J94M40J18l23k59P40l04n53
3445d70O83O9k56Q7k76K76P3m53K62J49j24J53k92N1R3l71K72j00K55j90j59K79
3467A1J7m21K90L4p6L26m70N94j0m30O1K10J6m1j29J49M09o31J82%j45n2k31K32
3491a05K54m61j54L49L95l76k09K51K65j33k19N15k14k56J19O2K3q03N45N29l63
3512A4l32J4K84Q4k29k95N92j07j87K2O42j12p22J30M00k63j65L61l48p9K83r59
3534i72R75k46l12P29K71j23p58Q14L72j615J45K33M42k4j15m9J327j558L94J39
3554F9j033J433l24k10l7p48J070p2j389Q39Q69o15L20m38n42R64o19K36L20k20
3574a27m26P20j13P71n03q25Q87m03M98K88l99k29R9J01q57K49j04N77m47o3p3
$$ plain form
3424 193 240 -273 299 289 -155 -191 -51 362 -400 -242 -457 3 -523 -329 111 229 -94 -353 387 83 -470
3445 -470 213 282 26 113 -163 113 186 -267 -5 144 20 173 -119 -68 25 -346 -74 -174 81 -109 -268 11
3467 11 28 -393 -103 -69 -145 181 -289 305 295 -135 -74 136 152 111 -18 131 540 -91 91 91 -54 -106 -337 -105
3491 -105 149 -312 -466 -117 278 -98 -307 -56 209 76 -143 372 158 -98 21 83 106 -697 -152 377 14
3512 14 -318 -304 -20 64 -165 -460 132 25 -162 -140 502 390 -332 -202 198 -65 -230 131 -217 -296 -13 -972
3534 -972 3 -243 -555 174 445 322 -436 378 750 -865 -720 -487 -45 -69 -184 -233 1094 -464 -70 69
3554 69 -964 469 145 -65 -102 -850 220 148 -1241 -402 467 -148 172 -266 -808 156 -463 -227 93 -127
3574 -127 -553 167 54 825 322 -503 384 -19 479 767 368 139 238 339 -518 -269 -373 204 -243 -306 -379
3595c79L66K0k55M54k47o2j28O02m69j17O41k83L74o56K19K85k9j78k01J47j60
3616e6j88m47J127n33R5m37L80J06m70L89M53n77l15P29n46P71m20k00m4N1L35
3637B03J06m69O64o24J31m0L24l8k52M16n56l17J61L36k94l84L1J91K14k27L48
3658g6K75j75l14L61K83j05J2k32K63j61j02k5j7L06j05m66M81k24k19J0R7q6
3680b19l8NN71m16k28L96J37n89M26l99L40J77m48N34q8k7k02K45M22n87p6P39
3702F75o99L27m45J14N9j68k79J03L38p7k28K27L7j46j22K60J79k6k32J00K48
3723B45r9j18n7J52j08J22j71K17lm26M81J8l34J39k97K08K8p05O76K08k82j18
3745b24L85LK19p51J03N34k28j89M11r9k1p6k12N54o7m50J22R7J1j38r4J97Q2
$$ plain form
3595 -379 -13 7 -248 206 -41 -103 -231 371 -98 -215 426 143 517 -139 80 365 336 158 -43 104 -56
3616 -56 -244 -691 436 -97 -2 -439 -59 47 -423 -34 419 -158 -473 256 -290 481 61 -139 -183 -132 203
3637 203 309 -160 504 -120 11 -29 295 257 5 421 -135 -452 -291 45 -249 -633 -602 -411 -197 -424 -76
3658 -76 199 24 -290 71 354 249 261 29 292 131 29 4 -13 293 188 -278 203 -21 -240 -230 -133 -219
3680 -219 -257 -252 319 -97 -325 71 208 -381 45 -354 -14 163 -285 249 161 134 -68 177 599 12 -64 675
3702 675 -24 303 -142 -28 31 -137 -416 -313 25 -52 -280 -53 -16 -162 -284 -24 155 129 -103 -3 245
3723 245 146 28 -29 123 15 137 -34 183 180 -246 235 253 -81 58 -239 -31 -3 -708 -32 176 -106 -224
3745 -224 161 164 383 -368 -265 269 41 -148 263 164 143 67 -145 409 342 -108 14 111 122 -16 -110 87 169
3768A69n22L84j42J28k53M9J83J22l14J83J38j41j8J21Q1j19k53J86M7j3o7j14
3790a65L01k71J77l7J9J05l32K98K84m54J0J03J32j45R2k81K69j7l51M59j11k30
3812a45j29J97J19K81n98J74L20k44j13R6L02k12l2J48L0j51Q7l67L71j17k59
3833b42M51%l8k11K12j56K19l87K41O6k82N1j35L16q3k60K40J08l78Q1J29K74
3855B16k89q2L14J35m83K16nj95J23j75J66O5j23NK07o6J12m42L06M55l75q3P8
3878H0m1L79n80J55O4q9j74J85N7Q1j00k8L39n78J28K94N5j11j48N3K89o22k5
3901c37K48L14k05k03j3N51l26j94K49k21j1Q9m4K18Q5m89N59m53jM23k90L42
3923B91l37Q1M9j74Q6L0k40K59L4j63L19j7j52rK20k76K46n10M51J89p22J71J7
$$ plain form
3768 169 -353 31 -111 17 -236 -187 -4 118 -196 -13 125 -16 -34 87 168 49 -204 -18 29 16 -51 -165
3790 -165 136 -135 42 5 24 129 -203 95 379 -75 -65 38 170 25 117 -164 105 88 -263 196 85 -145
3812 -145 -274 -77 42 323 -275 -101 219 -25 -138 -42 260 48 16 164 194 43 130 -237 134 17 -242
3833 -242 209 209 171 -40 172 16 235 -152 89 155 -127 -76 -211 105 22 -238 2 110 -268 -187 -58 216
3855 216 -73 -155 159 294 -189 27 22 -173 -50 -225 -59 6 -117 -112 95 29 141 -301 5 460 85 2 80
3878 80 39 418 -162 -7 57 -32 -206 -21 36 117 17 -11 328 -250 -122 172 227 116 -32 21 310 -312 -337
3901 -337 -89 225 20 -183 -196 355 29 -165 84 -137 -148 -59 -103 115 200 -289 270 -183 -184 239 -51 291
3923 291 -46 35 84 -90 -4 26 -214 45 79 -84 235 218 66 57 277 1 247 -263 188 377 -345 -174 -157
3946a57K39k7l33K04M51l04N7l9K54j08m30M34M4n88n6L20K37o9l85K73L18n43
3968b08L34k32M3Q6j37N2J85k42n1J11K37O3k66J28K02p09mM48N5M4m37K46K45
3991A93p5j56L4O0j2l10N98j30j71k27J08JQ2j35K18N02n97k07N21l65P4l21L64
4014D9P3k18M0J76j12R4j58N8K69l78J97K5j76K12k21MM31l23l19L24j34J20k54
4037b21J20M68m25j5K4K29k86J99k1R2l87P6M25j16l76J41R0J82r2k76L95j60
4059F6n4j31k18M58k69o8M22N0l43n3K54k91K67l22M83l24k60L26p1L19l49k61
4081c69K64J79K82k11p0j31Q9j80J98L3k38l1J23o3k4L5R7J07l14K78l20L82p6
4104D0o9l0L6j51N6J41K80j91l85M25J77m10N5nJ50r6j58J05J22k81J62J17o9
$$ plain form
3946 -157 82 55 -278 -74 377 73 130 91 345 237 -193 241 285 -303 -359 -39 198 129 -256 17 335 -208
3968 -208 126 -106 -63 23 -114 -62 123 -119 -170 -59 178 241 -25 103 305 -404 -408 40 95 139 -298 -52 193
3991 193 118 -38 -4 56 44 -266 332 202 31 -196 -88 -87 -5 -140 78 580 -17 -224 297 -68 6 -315 49
4014 49 122 -96 -56 120 8 102 -56 2 271 -107 90 115 -61 151 -70 -66 365 42 -277 47 -87 33 -221
4037 -221 -101 367 -58 -73 -49 180 -106 93 72 164 -223 -147 278 162 -214 -73 17 199 107 -169 226 66
4059 66 12 -119 -337 121 -148 -216 206 256 -87 -140 114 -177 90 -232 251 -73 -333 -7 -78 241 -108 -369
4081 -369 -105 74 356 145 75 -56 33 -147 51 84 -154 -185 -62 -125 -149 -114 -17 90 -224 54 -266 116 40
4104 40 -29 -59 -23 -174 -118 23 303 112 -273 152 329 -81 -26 -31 119 23 -135 -30 92 -189 -27 90 21
4127B1l9l60L04M66n54K39K65k74N1k19j42M11j80Q8N6q3N5j01M4L42m00N8J4
4150F2k0J09l92J72K53m48q3O40m38j06L76q3Pk63j15L81M35n87R8N9L26k17k86
4173a20L51m4k01J02j19K49m14r0L10N7k13j1J96k94K58k21M93l72J17l7J71K6
4195A94j62l44L90l5q7j39J31O3J22R1j36K22o73L75K77l32P8j51J15j22K8M5
4217e0J00j74J25k24QL68l96M40r7L4j03l21M13J30k59n9J53n2j35j19J88K31
4239B01j94j71K49M7j32L6m0K48l54N7K07k81P4NJ48j00k72J56M7J49K73p7j81
4262I5K1k77j8L85j62j17Q6K1L32n77J49N44m29k39J46r8qNp1J01k6j10K22N5
4286C0p1j6j44N97l66k5LJ06j45j6N1J25m0m13N98l75P6J58k68M56p34N40j74
$$ plain form
4127 21 -18 -378 -74 392 -162 77 342 68 119 -100 -242 169 -11 77 133 50 105 4 48 390 -10 48 62
4150 62 42 151 -241 -69 184 -264 -347 293 -145 -251 125 42 49 -214 -329 52 487 -100 -2 57 383 166 -120
4173 -120 231 187 -14 88 -31 218 -196 -286 24 81 -132 -143 53 -241 17 -204 289 -83 34 -3 168 194
4195 194 32 -312 78 43 -44 -183 -52 11 133 224 88 310 -363 12 289 -43 35 -116 -1 -123 -95 -50
4217 -50 50 -124 1 -223 -215 153 -243 197 100 134 31 -290 123 253 -6 -65 88 36 -99 -218 -30 201
4239 201 7 -164 85 132 0 36 -4 244 -110 -53 154 -127 -53 -48 100 0 -272 -116 -69 80 353 276 95
4262 95 116 -161 -179 206 44 -73 13 34 366 -211 -62 482 53 -186 -40 -138 -146 -141 -212 -111 -137 -247 -25 30
4286 30 -41 -57 -201 396 30 5 8 114 -31 -47 4 129 89 -324 274 -101 -25 133 -135 321 -413 127 -47
4309d7O7M0k3L1J35l79LK25o9j91L2nL10q5j96K04l4J8J02k06K26J76k07j4k7
4334H6j90L20k04j29J17n07L71K96m19J49Q7j0Q0k76J22L03l58J60j00K62j74
4355a4j87J18K93j51R1p7n3J38j93L40j22l5l7j37mK93l94K40K8k71l9j04K42
4378c5J98k70K0L28k26j61K71j19j4j5JJ87k70Q8J79K6Q9l98n6J23q2J17J3L7
4402C1j48k33l4N60k13%l1K64n6k25J47K41L19p55K33J41j13j8o9o6J54l92L54
4425I1nJ62j93k3J2j44O3k4K6j25O0j63K71k06j77L45r5JJ86L5K00L1j90K23l45
4450A6J92J33l82L00l33k28M88J74m71j08J39Q4R8k82J53J44M5j90k70J86L15
4471B03l68K64k02K7q6M98l64n5r2M09N2n22K03J77q0K37o96K24J73j49K32k02
$$ plain form
4309 -47 20 60 37 68 203 -176 -173 52 -17 -208 -176 -181 129 44 -152 52 18 36 138 -68 158 334 127 113 86
4334 86 -104 216 12 -117 0 -507 -136 160 -259 -110 -23 -33 47 -229 -107 196 -162 -2 -102 160 -14
4355 -14 -201 -83 210 59 150 73 20 158 -35 305 183 148 111 -26 -30 263 -131 109 137 -134 -173 -277 -35
4378 -35 163 -107 -87 241 15 -146 125 6 -8 -23 -22 165 -105 -17 162 188 277 -121 -177 -54 -136 -19 -6 31
4402 31 -117 -350 -384 176 -37 -37 -68 196 140 -85 62 303 622 -133 100 241 128 110 41 -25 129 -263 91
4425 91 86 248 55 32 44 -100 -37 -61 -35 -160 -100 -263 8 -198 -375 -30 -125 -124 62 97 297 328 138 361 16
4450 16 208 341 -41 259 -74 -302 186 360 -111 -219 -80 4 102 -180 -27 117 162 -28 -298 -112 203
4471 203 -165 99 -103 -76 -162 336 -28 -83 -175 234 286 -236 -33 144 64 301 -395 -171 2 -147 85 -117
4493a17P6p5j45O8K51j31j5k71M14K17j51j20K45k29k13M04M2j81j78J15M14n49
4515a29J0L99j60j44l17O1O69n72J18km7K54j85k59K77J01n81P42j28k13j14J08
4537a12L43j39l72M38J69k26O4l44J91p5o5J85j80jp6m5O65n37j40K50J27k51
4559a31K19k05K83r5l10L34P2j41j51J46n3K59l89K40K9j44P0j88L2L15k40J62
4581A14N2m1j78rR5J32l22M13l10l4M3j25K96j96j59L68Q3j27P0k16K38n9r4m3
4605iL56n64J98j68L42j16o4J46J18l26k67L91m1p6k84L79N7Q1k42J36r5K8L6
4628A6j5K32l44J36k6N0J40l48QN61m44j18L15j38j3N4M6j24j04j32K55K16k83
4651f0J42k16J47q2j09K52r9J6q1k12M27Ll32M16pk97L75m26N02l92k12K28k1
$$ plain form
4493 -117 -41 -116 -261 -193 58 -73 -88 -359 55 272 121 1 246 17 -196 208 250 69 -109 6 420 -129
4515 -129 -119 280 120 -24 -341 -280 389 -183 -65 -67 -114 140 -45 -304 -27 74 -507 235 107 -106 -220 -112
4537 -112 231 92 -280 158 327 101 165 -179 12 -63 -128 57 -123 -124 -200 -245 420 -117 -257 -7 120 -131
4559 -131 88 -117 166 71 -239 95 167 26 -125 21 -32 227 -162 78 107 -37 33 -155 -123 192 -48 114
4581 114 166 125 -53 -62 33 165 -157 256 -54 -88 -45 -170 126 -70 -229 139 222 95 165 -51 187 128 34 -9
4605 -9 347 -217 -19 -187 155 39 -25 121 239 -87 -354 37 -4 -80 -364 15 72 153 -89 47 -48 -20 16
4628 16 1 233 -111 25 -1 49 189 -159 -151 410 -34 -152 163 25 12 66 112 -12 -116 -248 7 223 -60
4651 -60 82 -134 13 -69 -178 74 -25 -9 -90 -302 125 128 -204 212 205 -92 283 -143 359 -33 -245 -17 -38
4674c8P4J14J13l7m24J06J79j51k59L98O8K56m52n9M02j71l61L70j54M21o08K98
4696H5j35j55O07l16j83R5j44m5K94p6j4j35K56K13l37j30q0K94q58J397q27O23
4718D29k57K77o49l70Q63q88J149n54K22r72O58M42l35R5r4L20o51k2PM39n90
4739d81P8N72m60L42k09O52j92m25K8L38n9l8n2J00J5k74k36Q30p08L42n01Q7
4761b51K94J16l58J89m0j04M03k47L66J59m55j34J19n9q5R2n50N88k81L01K3K86
4783C72o33qL61l86K52M88m2m31K56n81L66n97L80o1m58L24j14M72n1J04p03M28
4805b62M27j71k40R56q73k76P97j40j38L94m40m14J258j011K4k4j52k68L85N39
4825C71l21K4L75L03o15j84j82M3q77P72m60n10R70M38K68J5k40k59R08k57K24
$$ plain form
4674 -38 36 150 263 226 -198 -92 87 -64 -323 75 143 399 -53 -112 290 119 -242 128 -26 395 -213 85
4696 85 -50 -205 402 86 -97 -2 -146 -191 103 27 13 -122 134 347 10 -120 -200 94 -764 633 -194 429
4718 429 172 449 -200 -570 293 -595 554 0 222 -750 -92 350 15 110 16 336 -315 -337 -330 109 -481
4739 -481 -403 169 -291 51 -158 494 302 -123 -95 243 184 146 94 194 209 -65 -301 529 -179 163 -338 -251
4761 -251 43 159 -199 -10 -50 -154 249 2 368 527 72 -62 57 -2 -87 5 -545 43 -238 63 86 372
4783 372 -261 -269 92 -294 -42 446 404 -27 229 -352 14 -583 -203 -264 -722 -398 -512 -40 -91 13 -690 -262
4805 -262 165 -6 -246 710 -163 -439 358 218 80 474 34 -380 878 -133 -109 -133 -285 -553 -168 371
4825 371 50 74 449 752 137 -47 -229 -186 -1063 -291 -751 -1261 -291 147 415 430 190 -69 839 582 806
4846H06p50ol54Q49n53Q36n46J47j551P48Q80l20n9J81m50J22J058k87o47o29
4866e25J427p07N78k60k60j073O12m56J101J07m50k94r7N6O3k5O89j040J85R34
4886E65k82J55l0j30n28J21J516j590O7N95j58n76P53r03O09K4lO07p16j84N27
4907D39O9j101j85M02O6N6N7n1O21J42q72M48k58j24J110j368O84J11l89O21J60
4928F38q05O92q34p33K1k62R29m45J871j600j21J362j022O82n20j128N50J170
4946D45q01N67rj72R01N24j96k240J396j112N16l41J68K00L54N74j09j180R82
4965D67j033k96R40q81P85Kj010J246p56O33k84J103j020o71M57o57M72P24K35
4984D56K3q64Q64j186P32J7j702K349j206P38L53j674Q18M27K40L16k51j175J390
$$ plain form
4846 806 56 50 -304 545 -8 828 282 429 -1122 -374 506 186 127 308 -142 -20 1038 751 104 -525
4866 -525 902 195 773 513 253 -820 -208 -664 437 544 94 -200 -297 -241 -178 -203 486 -554 -369 565
4886 565 283 438 408 278 -250 -129 1387 -203 -136 459 301 -275 478 -425 184 208 205 812 96 -88 439
4907 439 508 -593 -778 -376 -310 -254 -197 -248 373 515 -357 91 -167 -291 819 -549 135 246 -143 478 638
4928 638 -167 525 -309 -1042 -1021 -1283 -354 -799 1072 -528 -649 713 -309 373 -147 -1275 -725 445
4946 445 -356 211 202 30 931 1455 1259 -981 415 -697 -181 -522 -354 -154 200 774 665 -515 467
4965 467 -566 -862 78 -803 -18 -16 -1026 220 -536 97 -187 916 -104 -775 -318 -975 -503 221 456
4984 456 479 -385 479 -707 25 42 -1660 689 -517 221 574 -1100 -282 145 385 701 450 -725 665
5003F65q34M7n32P12O20j425J355r64JJ476r79m93N05M74p72r37O17J562j389
5022b91l92R65J26M71j900P57M38P72r05r20l13J990k87q10O66o93P53l53L03
5041C77m5k93J38K41m10q45Q20j8L75o03O55p84k20J38J435m22r64K38m40J174
5061E47J14q95N17J70Kj097K41Q01O48o66J81j33L68o49J74n32M53N53q56P51
5081F92p47k57K90O85n36l99p73J906j843J009l60l80M60M01l03J40N7o67l64
5100i89J826j316L29r96J494j233J598k187J033l23P87R91q94n10J193j329N19
5117gJ352k100k06O94K05p12R07o48J1O99k13m20R37M25n44N81j671j99L56J092
5137E39jk09n65k07L81M31m86R50j408M9R11p51N0M88l97N20l82n67P64k8j755
$$ plain form
5003 665 -169 -122 -654 58 678 -747 608 -356 -355 1121 142 -351 154 628 -144 -1081 -464 1098 -291
5022 -291 -683 282 408 879 -1021 -264 174 946 41 -879 -1192 798 511 -299 367 -326 427 74 377
5041 377 332 39 177 418 8 -837 -17 -35 340 -263 392 -392 -612 -474 961 539 -425 -187 -627 547
5061 547 661 -234 283 453 455 -642 -401 400 1048 382 563 430 798 149 323 -209 244 797 -59 692
5081 692 -55 -312 -22 663 127 -272 -1045 861 -982 27 -333 -713 -253 148 -155 -15 42 -625 -989
5100 -989 837 -479 -150 -1146 348 -885 713 -1474 -441 -764 23 1014 120 -390 803 -526 -7
5117 -7 1345 -755 -961 -267 -62 -774 133 -515 -504 195 -18 -438 499 924 380 961 -710 -909 -553 539
5137 539 538 329 -236 -443 -62 369 -117 833 -575 -526 385 -366 -316 172 -225 295 -87 -654 110 82 -1673
5158a673O26J413k86k89L87J08r72O08J7m49M91K49o64k77J078o89O29l72O4m57
5178d58p1Q6M03l2j05L00L78m13m03L61J059j432Q20l0m17m48K9J35p14J050o93
5199e95O83p2l80N52m34J69L43j37m82R40p06K06L08j236J293m90O84j839R23
5218b70J853j310l10m04R15L3Ql56M4o83K94R2O43p89Q8k54m61P77J11m9k15k98
5240e41P49k02p15O72K94n1q75J56R22k85J64o10N14J07l94L29n47m3J69q60J366
5261C19j0q50Q03k47K86k7j51n0o50M19j84M02k3o68M92K01o96Q18l33j39L69
5282H1m40K86N07k42N46K50j06p48J90R7m74j83J78k23N49j94%oM66o49J53K35
5304B73J39J1l49l70N09m41J10qj90N64l00p8O2l88j31J044m83K45o9j74K08l67
$$ plain form
5158 -1673 -1047 366 80 -209 178 286 -686 -78 -61 -510 -19 230 -434 -711 367 -322 307 -65 -1 -458
5178 -458 -529 -443 -40 -72 -177 123 501 88 -315 46 1105 -327 493 463 46 -402 -373 -238 -952 98 -595
5199 -595 88 16 -364 188 -246 -77 266 129 -353 587 -119 87 395 -841 452 -38 646 -1193 -270
5218 -270 1583 273 -37 -441 474 507 515 159 203 -480 -186 -94 549 -240 -152 -406 -867 -90 21 -28 -243 -541
5240 -541 208 6 -709 -37 257 206 -669 -513 409 124 288 -322 192 299 -95 234 -313 -356 -187 -1047 319
5261 319 309 -541 262 15 301 274 123 73 -577 -158 -342 60 37 -631 -139 62 -634 184 -149 -288 81
5282 81 -359 -73 434 192 738 988 882 134 324 421 -53 -236 -58 -281 268 74 74 68 534 -115 38 273
5304 273 412 423 74 -296 213 -228 -118 -126 -316 248 -52 -130 -68 -456 -587 457 -26 219 150 -24 184 -183
5326a83J09O85n58pJ66j34k70K35k03L43J6N69o27m1n6J40k03m6M52j036P62R36
5348A049j785R11p70O60k38n09O89l79J1Q69r98QO52m79j21M54J65k94j22J35
5368i2M09j52K51j120j77J284j99J0m37L58l7l15Q15j0k68p42N94l97L40L52k07
5389B60p8r19L48L97oM50j198k1K64O93J43l06J96L44j80o22N66k01k0k58L50
5410B02K41n13k07L24j46J50j53l75O96J34q32p1J069n87j29K4r6Nj2M31l16L05
5432A44q1K03r48R59K48q66R49k32o19P7M8k00J89N4K8K57l96L5K16n53P99j89
5454A22j06j04k06O96l66j56K3j26j64J74K60k08K87m9l01j8rK63n4k84M34K31
5476C39L7m13J71j9k15k15M13L21l48k02r5O01m45M06k22kO7l66p8Q25o30k79
$$ plain form
5326 -183 -74 611 53 46 212 78 -192 43 -160 183 199 768 141 100 44 184 -19 -65 387 -649 113 1049
5348 1049 -736 175 -595 65 -173 -682 7 -372 -361 508 -490 -482 170 -309 -430 24 189 -105 -227 -92
5368 -92 317 165 416 -704 -881 403 204 214 -223 135 98 -217 598 588 320 -422 172 -225 115 467 260
5389 260 182 -737 -389 8 2 452 -746 -767 -503 190 333 27 223 567 387 -235 331 130 110 -148 202
5410 202 443 -70 -277 47 -99 51 -102 -477 219 353 -479 -550 519 -68 -197 -173 -269 -264 -276 155 -161 144
5432 144 63 266 -682 277 525 -341 608 376 -243 -166 -118 -318 -129 -75 -47 210 -186 -151 65 -488 311 122
5454 122 16 -88 -294 402 36 -120 -97 -223 -387 -213 47 -161 126 77 -224 -242 -251 12 -42 -326 108 339
5476 339 376 -37 134 115 -100 -315 98 419 71 -131 -226 375 -70 336 114 112 179 -187 -265 560 -70 -349
5498c49N23J21o9q48O52L13n81p0N35m18K05j65l3k5L26J17N25l39m79J53Nj95
5520i6l9L1J62J96l62K31j72L9k07j16O37k67P2k63o6K64k42o28O92M14j61j84
5542f5P9J72l25L42P7j68q8p7k8O9j76J86j6J79j00n79L23N5Q8k26J74M3O9k3
5566a5J62k0k2j90K4m2N3M82n46J26o4j05J01J61m31K92m8J73j93L3R2j22L14
5589B15L9k47J05j49k18K02j78J70Q1N5Q4p0j27J93j38J35K54o61M99l32l6q1
5611b05L18q6J02k2J59j37k28J4K1j33K75J24n96P13n42M23P3l98L04m01K47K2
5633D7q7n3M02l27r2K69k01LNM17l6n85L43J22K2k16l2J21L3k60K88j83j66n0
5657b16L51p6p0k43K1n1L23j3N2j17L89l88J36m6j97K43l06J89O8m1k85L19K65
$$ plain form
5498 -349 174 295 226 -622 30 343 -238 -308 227 -191 14 -151 -184 -209 117 234 759 420 -59 94 99 -96
5520 -96 -135 -104 58 254 -108 123 -49 -10 -217 -333 304 37 109 -154 -220 44 -198 -826 -134 280 119 -65
5542 -65 14 186 -139 203 280 112 24 -53 -81 -12 -188 -2 -18 161 61 -518 -195 -140 -52 -278 -104 -61 8 -15
5566 -15 147 127 105 -85 -61 -103 -50 432 -114 12 -52 -157 -56 105 -326 -34 -82 91 -102 -69 23 -99 215
5589 215 254 7 112 -37 -255 -53 -231 -61 20 75 159 89 -38 155 17 152 406 -255 244 -88 -124 -205
5611 -205 113 27 129 107 266 129 -99 -85 -64 -197 78 202 -394 319 -223 200 273 -125 179 -222 25 47
5633 47 -40 -93 309 -18 -110 159 -42 -39 -34 383 347 -238 105 227 249 33 1 122 155 -105 183 0 -166 -216
5657 -216 135 59 -11 -254 -233 -284 39 26 78 -39 350 -38 98 52 -145 98 -208 -19 49 8 -277 42 307
5680C07k70l56M49q0k12J40J27n8n5p6K9J29j21j34J95j67J63j83j68M12p6l18
5702c23M51k51K43Kj73J91j3j32J18k1l20L04o8j13q1N7K2K08k99L17o41M85o2
5725i9M2L5J23M6J0kJ61m14J07m8J21L1J0K19k01l24K8J29l0j75L28l40K02K04
5749A63k83M9q6p0L45j18j12L11o82L09P4J56q0K28k90J5J99k72K64k34Q1L01
5771B68k3k16j04m2K59m41K74K55k38j21J86l93L15R1m58M11m27K40J29r5M14
5792B84k93Rj36L42k99p8J17J17j1k6M4j63L11j05J44j91k06lj4N5J76K32j84
5815A22q1j64m7K01l3j83M42o20J85K80J49K97m73J9J19j42j17N7o7R8Q4l51N02
5838B77k79J76j02n84M80J26L84m59j16R8j58L39j98K82k44kJ41p4k09J38jJ38
$$ plain form
5680 307 37 -319 130 50 -162 -22 105 47 -8 -84 -55 74 -47 -181 14 -153 10 -173 -341 71 -5 -323
5702 -323 128 -123 120 122 -51 140 127 -5 113 92 -228 76 8 -105 -186 -129 -107 101 -198 119 -522 -37 -99
5725 -99 -57 -22 101 147 157 155 316 -98 9 -39 82 113 123 342 141 -183 -155 -26 -56 -231 97 -243 -41 163
5749 163 -120 -71 -157 -227 118 0 -112 199 -483 -174 -100 56 -24 204 -86 -71 128 -144 120 -114 -33 268
5771 268 245 29 -75 -117 142 -299 -25 230 -8 -129 57 -336 -21 70 -388 23 -404 -164 -35 -130 284
5792 284 -9 0 -136 206 -93 -171 -54 63 52 26 70 -93 218 113 257 66 -140 -143 -157 -102 74 306 122
5815 122 41 -123 -170 31 -2 -185 257 -363 -178 102 251 548 75 94 213 71 -46 11 -56 42 126 -225 277
5838 277 -2 174 72 -512 -32 94 478 19 -97 1 -157 182 -16 266 22 20 161 87 -122 16 15 153
5860A53j83l48J99K29l23L92j17M01m59R6N19r56J40J51L42K8k94j07k18O04M22
5881F71n71Jl74P7J53P6J82m06M43n20P57k90l57M35j30l47MJ49km53o38J855
5903G15r51O1j85N56mk0k69J10o5K30j20j86M6N0PK38n17L28J72p7M5j01k39K34
5927E8k15n1J51J93N4l18P6j1R8m9J59l08L4O6j16j05K42J6J68l0J02j16r4K08
5951B12j91k2q3N2L1k3j05L61l93K10J59k15p1K96n15J93J92r9j59N05k61l7P92
5974H29n35J50p71N33k15K10pJk98N6m5K73j72k45J44K34k6j19p4K16m11M88q4
5997A32j1L3q8k30L49l62K16J47j46M19n75J50L24p5n06j36K1J25j27K22L76j68
6019I0j31j35M38k26n5k22L66L32n38J25J14k80M08j32m18K65rj47N3MJ74k7k19
$$ plain form
5860 153 -30 -378 -179 50 -273 119 2 403 -56 40 559 -397 -257 -106 236 264 -30 -137 -355 249 671
5881 671 100 101 -273 -196 -43 33 215 -191 252 -268 489 199 -158 277 147 -200 -196 -47 -49 -502 -1140 715
5903 715 -236 -175 -360 196 192 172 -97 13 -52 178 58 -128 -82 -32 -25 213 -304 24 196 119 164 63 -176 58
5927 58 -157 -208 -57 136 190 -128 -52 -63 35 -14 145 -163 -129 -63 -179 -284 -42 -26 142 112 214 98 4 212
5951 212 21 -1 -84 -32 -1 -24 -129 232 -161 49 208 -7 -78 218 -297 -104 88 -11 -170 335 74 37 829
5974 829 294 444 -327 206 -9 201 194 195 -103 -47 -92 181 9 -236 -92 142 116 -3 -77 139 -272 216 132
5997 132 121 154 66 -164 185 -177 39 186 40 459 -116 34 358 283 -223 -359 -338 -213 -340 -118 258 90
6019 90 -41 -176 262 36 -19 -241 125 457 -81 44 158 -122 286 154 -264 1 -8 -155 -102 -98 76 49 -170
6042a70R4j88j27K68K02J86l53k7N7R7m4n18J092k88p2m51K96l7j03J82Q7m90
6064c07J84J39K09k45k02K79j18K0k31N5M33K5k40j25K48k43M34l48P9q9n2K15
6086A20n1r6K3oJ96j90j04K62l22K30j51P9l44K34j9P9P7k00M8j5L8j8J07J64
6110A41o6L2L21l25j1k8m75K37J45r7L02j59j69P1k6N3M19l85q5J64J93m88J06
6133a30K85l98K34N7j63LM6k58L86p2k31N42r1l38P9nm8K67q4J11n9K1j31j19
6157i6J28K2Q9p8K8k51L32j45m0k21J43j1j5j46K33L6J41j46j56J6K14j6O1j43
6181b1m4K03k61K53q1p5Rp9Q2J67k81lK64j40O1k25Q3J15k66L4L90k38l0J09K16
6206B42m4l14K2Q9J02j58p8M2P5J30k57L6P3J44k32O0J83k46Q4J89o9k8k40K83
$$ plain form
6042 -170 -76 -264 -391 -123 79 265 -88 -115 -58 39 -5 -523 569 281 209 -242 54 17 -86 96 183 -307
6064 -307 -123 16 225 -20 -222 57 -61 -41 -272 -217 216 241 1 -124 124 -119 315 -33 46 -43 -95 120
6086 120 69 -27 -4 -10 186 -4 -108 154 -168 62 -89 -10 -354 -120 -139 -60 17 -183 -135 -150 -112 -130 -23 141
6110 141 75 107 428 103 92 64 -411 -174 -29 -126 176 17 -152 -81 -107 -54 365 -20 -105 59 252 -236 -130
6133 -130 155 -243 -9 48 -115 -112 -66 -324 62 -10 -241 301 210 -128 -49 -54 -102 165 81 192 133 154 23 -96
6157 -96 32 54 143 65 93 -158 174 29 -11 -232 -89 -100 -115 -261 -28 8 149 3 -153 -137 77 61 122 -21
6181 -21 -65 138 -123 130 49 -26 -17 -96 -14 153 -128 -131 133 -7 54 -171 -88 27 -239 -205 185 -53 -83 26 242
6206 242 198 -116 -94 -5 97 -61 -139 -97 -22 108 -149 -113 -40 104 -128 -68 115 -131 -47 142 73 45 -195 88
6230H8k08K22mN6K28n11J09k79J85K27p3K1J01k96p8K81p7o1Kn2J92j52R5l05
6254b89K00q4J01J37k5j03NJ12l73M41j61K45j21j45K04j51R2N8l24J13J95k06
6276g9j90J66K27Q4o15M71K69n99k69P53l71k32N10Q74o84k49K16m30N25m11J87
6297A53L31m66l3jN17l27l69L19k55j6J58l00K22J26l15N19p91L93n1R0K59K10
6319C73o52Q05j131J04n0P78q7l99Q19m00m18J021q35O72j247L68K87m53P90k25
6339A20J31m61M31m66mk12N91P82j565J667q20K02j20r86P42j34P83p48P7n0k78
6360c18N04l13P03j98q51N84J27k35l48M71m19k49N74o1M40r30Q68n84o8N70J14
6381C81j03K29p06Q34n49Q6m50O81K69l41j083Q82Q6J56M83j088L48P36j361P33
$$ plain form
6230 88 -120 102 98 154 382 -129 -20 -299 -114 113 40 61 162 -134 -212 69 -8 -69 -67 -119 73 -79 16 -289
6254 -289 -89 -173 -72 65 40 -63 -58 54 -319 122 -39 206 85 -60 144 -7 85 143 -181 -68 127 -79
6276 -79 -269 -103 124 208 -407 64 333 -266 -535 218 -153 -385 125 999 315 66 282 -148 377 -34 153
6297 153 484 18 -15 -16 501 174 -195 124 -131 -147 11 -289 -67 59 -256 263 -528 -135 -186 -96 163 373
6319 373 -279 526 -605 -501 -551 227 140 -259 560 160 -258 763 -72 600 -647 -279 8 -445 345 120
6339 120 251 -210 221 -245 -249 -461 130 912 -653 1014 194 396 276 -710 32 -102 681 -67 10 -40 -318
6360 -318 186 -127 576 378 -473 111 238 3 -345 126 -293 -542 32 -29 411 -519 349 -235 -303 267 381
6381 381 278 507 -199 635 86 172 -278 403 672 331 -752 130 216 372 855 -233 115 851 -510 223
6401B23j96m0J91l83J36L96o67L65q0J94R4k86K06k33p7L30q8Nj14Q0q2rk09O75
6425D31k12j19j16P3J1kj18K80k52L90m83K17m55P32k27N9n4O8m67L54m03P02
6447D09M5o92O21l2J85q09L44n58J476j239Q4N21m12j22O38O2o78j06n30Q63k62
6468a92l02N95j00Q07r29m12R43j86N1K05q58Q22p86K12J27j06J38m92P27n63
6488b99k96J049n12J09M2M1l40K7l93O79M69j208J83J33R5l40K37L30o4q7J04
6509d1M43q00M38k72j91N88m57L13K36Q7k80P81q99N07r80Q12k00k04j39L48n91
6530e01K31O13m21O04m76L44p80n6M06n81P15j164J518r8n92l09N72J96k39K99
6550B81j713J507n63R19j858J150J179j277P96K51j543J18L56J87J492k087N73
$$ plain form
6401 223 27 -13 178 -205 -69 327 -340 25 -55 139 233 -53 153 -80 -157 173 85 90 -24 56 -26 -35 -244 431
6425 431 219 100 -16 57 68 66 -52 228 -24 366 -117 100 -355 377 150 209 155 223 -244 110 -293 409
6447 409 454 -238 383 351 536 -273 71 -487 989 -250 -166 355 -57 -179 459 521 -157 -263 -793 70 -192
6468 -192 -494 101 1 808 -121 -533 410 224 275 480 -378 444 -342 -130 -3 -109 29 -463 264 -299
6488 -299 -595 454 -58 51 93 134 -206 -179 -572 107 576 -632 -449 -316 -221 -561 -324 6 -58 -145 -41
6509 -41 402 -398 40 -232 -423 165 -292 21 257 344 64 845 -54 453 -527 285 85 -119 -258 90 -501
6530 -501 -270 343 -78 526 50 394 -386 -442 -36 -617 98 -1066 452 354 -238 -547 25 221 -18 281
6550 281 -1432 75 -488 431 -1427 -277 902 -375 421 672 -871 -753 -397 -210 1282 -805 -232
6567b32j140Q14J086p45N87L5mj252J155j012J92L60L26k00N24M6l70j26J636
6586A680j817J411j330K1l79n68J311j683L82M53R18j073P80K14K26J70q91J08
6604f7l24J116n53l59j624J856K02L20O1m17n85L23J91Q16p77M1j822J673r4p67
6624g90J264j078J97M3o1P09n78Q86k14j190J649n40j386N47L54l91o20Q65L50
6643A6p4n44R54o38K72P03q36O11j136Q18l47M74p25K56K35r9j64q70J530m19
6663A7P63n46n97P17o35N0J70O83o25k8R5m48K54j80n2Q99r38P06l80L10q30P45
6685A50j26m76j31P65p57L82R5p15J147n80N80j96K84k30k95N65l81Oj55l67L23
6706a12K37n70L50k78k90R20o67N12K20q8o89r2L36J15K8k25Q5n22R73Q0L1q61
$$ plain form
6567 -232 -1372 -558 528 -217 370 405 401 -851 304 -708 -516 -156 170 -30 494 540 170 44 1680
6586 1680 -137 1274 -56 -35 -414 -982 329 -1354 -972 -519 399 -674 106 320 546 716 -175 -67
6604 -67 -391 725 172 -187 -1811 45 247 567 628 211 -374 -51 140 956 179 220 -1602 71 -23 -790
6624 -790 474 -604 -407 -364 -425 284 -294 592 378 -812 837 297 -1089 -542 -188 -579 -1199 -334 16
6643 16 -58 -602 352 -286 -14 689 -147 464 -672 146 -201 273 -452 -196 39 -60 -224 -1094 436 17
6663 17 780 234 -363 354 -281 -231 -61 622 -3 -31 64 -384 -130 -310 -362 537 -401 305 -75 235 -595 150
6685 150 24 -452 -583 182 -575 -193 -98 -813 334 -246 334 138 422 192 -103 462 81 87 -68 -435 -112
6706 -112 125 -445 -95 -373 -663 257 -410 102 322 234 -455 -547 -211 -96 -68 -293 -208 -730 243 323 354 -507
6728e07M42p6L54j084P37N44L1m39L24p4J97n46j2j30O14r09L74Q05n03n3K65
6749C54j51m88L27L47p82R52j387R28j92j194J079j71J168j333J061r23L79P1
6767D5r25J310l76K66m37l76R33j64o04P24o07L20j84J93k1n6j89J82l24N14m10
6788a86M06j83J15l89K1o0N68L10r51k64O88l25p2M45m71L4J97k57O13K00j24
6809C15l73N77k14j32j74j92O11p41O58l31L7k62M57q3k54J32L25n38l8N87M24
6830G91j162L11J17j74l40q8K26l00R60p55L21o4n21O22M38q5j2j76m47J29K84
6851G5l74Q70l28N6r75K96R2O05M01l23m25k20m8o7P53j214J102J35n48N04m59
6872i2M33m61J039l74j065k20P33j78j93M94J07j145J140K3j29p5Mj39j66L93
$$ plain form
6728 -507 -65 -141 213 -871 -134 410 441 2 326 252 449 -97 -109 -239 375 -534 -160 645 142 89 354
6749 354 203 -285 42 389 -393 559 -828 100 -92 -1286 -207 -378 790 -543 518 -405 -26 45
6767 45 -880 430 54 320 -117 -493 440 276 -328 396 -211 109 -75 118 97 41 -148 34 -290 224 -186
6788 -186 220 37 152 -237 -216 -276 292 602 -349 -613 75 -250 -322 123 -348 -314 -117 -374 239 439 315
6809 315 -58 519 305 173 -1 -193 418 -323 335 4 41 -221 236 153 -101 31 356 -182 -220 367 791
6830 791 -371 -60 57 -117 -457 -545 -319 -619 341 -414 -93 -157 -678 -56 382 297 285 109 -338 -209 75
6851 75 -299 571 243 299 -676 -380 -288 317 718 395 -30 -250 -298 -365 388 -826 276 411 -137 367 -92
6872 -92 341 -120 919 545 -520 -740 -7 -185 -378 116 223 -922 218 241 112 37 41 -98 -264 129
6892A29Qp4q8Q1J24R6m58k19L10J04L94o24J75R7P5n54L29L26o63N03o0N99j289
6915f79m12Q74l31P60j17j56r7l0N81J22L55j369L15LL44n57k92J224n65n4L12
6936B31j57M0k71L38l41k5K20m19N00m75R42j390J201p14K8M3L40m7K35K54l37
6957A96J10l75K93N7p07L53J16K18n17j2R4J21j57J98l88L88L9k31J63P4J05l12
6979a74R8Q7K7o0j5L7K51o1m43K42L4K3J89P5k24l56K34m05pJ50J34K27j00KK3
7004a2J04k23n8K10M8k80L27L3KJ6m66J92L40k62J46N3k58L44n25O70q44M76j82
7027a49P4Q3N75o45J52q33N50R3J88K00N7k15j83j68R9j57N19j07n43N07l68R58
7049F87p85L8M19J31l08L49m34j58n35J68O86J42q33j71P3R58k38m43N75j35M55
$$ plain form
6892 129 137 63 -25 56 180 276 -182 -401 -91 13 407 -217 -42 55 130 -424 -95 231 -432 71 11 610 -679
6915 -679 -1091 -217 -548 212 95 -61 -158 -188 393 515 870 -499 -184 -181 163 -394 -686 538 -27 -81 231
6936 231 74 114 -157 181 -160 -185 35 -384 116 -359 583 -807 394 -320 -292 -249 91 44 279 533 196
6957 196 306 -69 224 281 -426 -73 43 261 -256 -268 -174 -53 -210 -12 -400 -12 27 -204 -41 33 138 -174
6979 -174 -76 11 38 -22 -37 0 251 190 -253 -11 23 46 235 310 86 -270 -36 -441 -448 -298 -164 63 -37 -35 -12
7004 -12 92 -131 -189 21 69 -211 116 149 151 167 -299 -107 233 -29 117 170 -88 256 -269 401 -443 33 -149
7027 -149 -75 8 583 -62 90 -743 -193 -100 88 288 345 130 -53 -221 -122 -279 240 133 -410 97 -271 687
7049 687 -98 -60 359 490 182 531 97 -61 -596 -428 258 400 -433 -604 -531 427 189 -254 321 186 641
7070F41m81M04m50j85L6M94k54J66j31o67L53m86O82j29l78L30P7l7J34n93L53
7091a21J93O6j88j24K60L4J34k6m47J51M03p66M73k48P34p56k6N11K8n08N21o8
7113B30m69J80K9j82M17n81O87k34l17n1J14J78n57j44J255p12P16o19J86j05
7133B1N10j78k51m51L55m86M02k3n49K46k25N19L21j31M89Q0q56K50J66K52n43
7154h2k2n84Q11K5l20q5K29K50q9J57l96j7m51N50m41L71j31j58Q91l05k64K62
7176B01J5q58L61J10J013l43l20o16L06L11r11N93J92L5r3M18p70K12J54N44m96
7197E8m15R8M81m72M11m81L85M01o72k54L84N7m71Q46m15m5K98l88L00m95P72
7218C83J99l14j93l33kJ75j63M15j19j072R17J89j04J70k43j71M06J02k26o56
$$ plain form
7070 641 160 564 114 -71 -35 459 205 371 240 -427 -74 -560 122 -7 -385 -55 22 -15 119 -474 -121
7091 -121 72 138 -50 -174 86 120 254 228 -219 -68 335 -431 42 -206 528 -228 -254 257 285 -223 298 230
7113 230 -239 -59 -30 -212 205 -376 311 77 -240 -291 -177 1 -556 -700 555 -157 559 -60 126 21
7133 21 531 353 102 -349 6 -480 -78 -101 -650 -404 -629 -110 211 80 569 649 -207 43 209 461 -82
7154 -82 -104 -688 123 148 -172 -257 -28 222 133 290 -106 -123 -574 -24 -465 -94 -225 -383 508 203 -61 201
7176 201 216 -642 -281 -171 842 499 179 -437 -131 180 -731 -138 54 89 -4 414 -356 -144 10 554 58
7197 58 -357 -259 222 -250 161 -320 65 466 -206 -460 -76 -19 -490 356 -59 -104 194 -194 106 -389 383
7218 383 582 268 75 -258 -260 -85 -248 167 48 -1024 -107 82 -22 148 -95 -266 140 242 16 -640
7238f40O74M79k71l23M72j99J64p37j85Q14k64p20L29K63L01j47K14k78p6J49
7258A9l0K85%o77L25M83K54r80KK25M89J34j33j72m04k91P04j68j46J63q7k3j38
7281a66k57M54Q2l11j8lM10J05n21m22N63K98k72n50M47j88M65J4J22l01J37p47
7303f59M81N16m33L72k49o40N31K08k40M36n67Q11o30K53n53K87L67M14o06L13
7323D12o21O04r44P54o9m72N33k84N6j35k85L48Q06j158N93l28J10L16m9l29j1
7344a53k01L7P28Q9j187L25Q20o71J181q95k46K7M05k50k24L39m50L67N0o15R32
7365D08r26O83j315J139q1q4O9Q4k6K0j52L07O74L6j220L13J64o11M37l77K96
7386a62N14o21Q20K5p47j9j62k71Q1J8N49m57q1O12J39q92K92K60PJ6lK6N82Q7
$$ plain form
7238 -640 34 513 242 -81 391 192 356 -381 -566 248 -16 -736 -407 -144 157 10 224 -54 -130 19
7258 19 -11 274 274 -403 -78 405 659 -321 -319 -94 395 529 396 224 -180 -471 233 65 -81 82 -5 -28 -166
7281 -166 -423 31 113 -198 -216 -219 191 296 -225 -647 -84 214 -58 -608 -161 -349 116 130 252 -49 88 -659
7303 -659 -178 338 -95 277 28 -612 -81 127 -113 323 -244 567 -63 190 -363 -76 291 705 99 412
7323 412 -209 395 -549 205 136 -336 197 -87 -31 -166 -451 -103 703 -455 138 -190 -80 236 187 -142 -153
7344 -153 -354 -317 411 500 -687 -362 458 -213 968 73 -173 -146 259 9 -215 124 -326 41 91 -524 408
7365 408 -518 165 -1150 -11 -92 -176 -107 -23 -49 -29 -181 126 800 836 -384 -71 93 -518 -81 -458 -162
7386 -162 352 -269 551 576 -171 -190 -352 -623 -542 -524 25 -432 -513 99 238 -654 -362 -102 -95 -79 -82 -56 526 613
7410F13q31o7M59n98O97J2l60L3k6j31p0m41J165q6m45M16l00n2p0P71j139J32
7432c18M80K76m47L44r2o03L34N51r67l53O37K59o08J61j93J372j005n7N1J08
7452g0M5L05j81L18l05k05N23l67j47M50Kl20K14K50j87L40j661J15Q51k49L71
7473I2n72J92L2j01k16Q18o01K53R43j215J53lN33K44j486J419k10k36J08j63
7493a6L26n40j12Q28r86J200k65m24N3J82l77K10K35m58J358j388J095j136q48
7512a063K146j343Q15p92L20o58j003J821R7p03j31K93n57J508r81o4M12l62J82
7531f3m80M56K42m56P36q10l30N14N36p16L86k97P99q20o85P94L3L0o33P25m0
7552g9q14O32J041p16o18L55L03q19K66Q6N38K4k06o85P2K19K03J21k52M50Q52
$$ plain form
7410 613 -218 -285 174 -424 273 285 -75 -42 -68 -199 -269 -710 455 369 -76 340 40 -12 -82 689 -450 -318
7432 -318 162 438 -9 335 243 -360 -26 525 -442 -795 -158 101 -507 -346 -539 833 -172 -229 -178 -70
7452 -70 -25 280 99 417 112 -93 430 63 -84 366 368 48 262 512 325 665 -996 -881 -30 -279 92
7473 92 -480 -288 -256 -357 -573 245 -356 -103 840 -375 -222 -225 308 552 -934 485 275 39 147 -16
7493 -16 310 -230 -342 486 -500 700 435 11 64 246 -131 79 314 -144 1214 -174 921 -215 -1063
7512 -1063 1083 -260 555 -237 83 -575 -1578 243 340 -363 -494 -201 -758 750 -231 -295 117 -245 -63
7531 -63 -543 -87 155 -301 435 -375 -705 -191 345 -371 15 -282 517 -303 -988 -194 -161 -131 -764 -39 -79
7552 -79 -893 -261 780 64 -554 -199 104 -715 -449 -363 175 199 -7 -692 -620 -401 -198 -77 -329 121 973
7573I73j125j63k58l35R32q38O79k8J80J54l74L82L08m54q16P24L89j042M25K12
7593g5K78p16Q80L77j308O01L06K24m42o23M67m2L75q48J80P48k90M85K14j399
7613f08k16J306L31j491J015N63m96q82kP57j80j99j1l08o1L31L74k12p33N70
7633a52j27L46L42j68n76N58j288K56N92L28N6n42O69o42l29mQ23j7j021Q25K62
7654A91m61N12Kk9j030k63J067j40j52m26J257q39L28q59Q17N29n86J27j24l68
7674d47O13M88j363Q28M8q3J121n81j2j472P88L60p84L10J35O81o50m38O79k49
7694b8n31m00R92j84R13r59K95k98L38P10j146J262j492j0J410p63j01Q8k42L92
7714B46J42p84m0N90k15N40K94o16m50N43k68j1M47J21m83r7k50j03J56k50N04
$$ plain form
7573 973 -152 -315 -573 -908 24 -814 -135 -163 17 171 -203 179 487 33 -783 -59 330 -712 -287 -75
7593 -75 203 -513 367 744 -564 37 343 567 125 -498 -31 -73 302 -546 -366 382 92 577 791 -608
7613 -608 -824 482 813 -678 337 900 404 -478 -480 277 97 -102 -113 -421 -482 -151 223 11 -722 -152
7633 -152 -279 67 409 241 -335 223 -1065 -809 -217 111 167 -375 294 -348 -677 -681 142 125 -896 -71 191
7654 191 -270 242 244 215 -815 -1078 -11 -151 -303 -729 528 -311 17 -842 -25 504 -82 45 -79 -447
7674 -447 166 654 -709 119 167 84 1205 624 612 -860 -72 288 -496 -186 -51 630 -20 -458 221 -28
7694 -28 -559 -959 33 -151 762 -197 98 -200 138 848 -298 964 -528 -538 872 109 8 96 -146 246
7714 246 388 -396 -436 154 -61 479 773 157 -293 250 -18 -29 418 539 56 -41 -291 -394 -238 -488 16
7735A6J28J28p27L16Q34l25p05k80Q03r0o71K33l9M91n58O68j51j88K50j72O9
7756C0qo5l09K77k62K23l0M16l92j33l6K50j9J95l04m8J68j94K11Q8N5p5JK7l20
7781b54J15K49k01J56p1j48L67J1m70J73K20rk4j09K6J18l73L21k18K62l16p0
7803b45L87k48J44k99K07P3m5J20Lk87K7J40j90O0M3Q5N2k2j34K11o2l9Mj02L04
7828A87j2l38J41Q9j96J59j18J70j18J02K1J89l06J52k32K13K9K2Ok89J6L47m65
7851b31M29m49Q8P4O0K84k22L49k18j90k24J79K31j59L0p4Q4j34J01Pj10P4%J30
7875A09j12p9J37j08J20l2L5j23n6J94j91K63K3o1j47J70j82L55k00j32J19p6
7897B6l0o8j7K02M7m9k11j14J99L5J29j40K5p6J72j35q1Q4o8k7N5q8J04L5M1J54
$$ plain form
7735 16 144 272 -455 -139 695 370 -335 -615 188 98 -573 -340 -379 112 -446 222 71 -117 133 -39 30
7756 30 22 -43 -352 -75 -337 -114 -144 272 -120 -253 -289 -39 -58 137 -167 -215 -47 -241 -30 58 113 38 39 66 -254
7781 -254 -139 110 -91 65 -6 -154 213 224 -246 -73 147 138 114 5 31 149 -224 97 -121 141 -175 -245
7803 -245 142 -106 38 -261 -54 19 -26 94 97 -190 -163 -23 -213 -153 -110 -25 27 5 -129 82 20 -19 -15 -117 187
7828 187 175 -163 -22 67 -129 30 -88 82 -36 66 87 276 -30 122 -110 103 132 154 160 -129 -113 234 -231
7851 -231 198 -251 -163 -89 -29 255 33 382 164 -26 -250 -71 160 1 31 -43 41 -93 8 15 -95 -21 -21 109
7875 109 -3 -82 55 -53 67 35 70 -53 -109 85 -106 157 180 119 -28 142 -40 315 115 -17 102 26
7897 26 -4 -72 -89 113 160 111 -100 -214 -15 20 149 9 34 -42 130 -5 -86 -2 -70 -97 -42 -130 -26 9 50 204
7923B04j7j9o2M8J67k71%J66m12Q8M8nR3k60L91j27J00l50J74l8K91j59j82K14
7947H2q2J28m03K40K15j66p6L22k76J38n16L85J75j12k2L17j93m45J33K74j09
7968IN4%LM4p8J05l28J67k14M04j74nj43L0K74J05k87J02rnK43k42j81L97k08
7993F3K5j74Q4M1j7K53k42M6nj73K75j93j92L66J05k11j14P2L9p5R5l3k10K8J69
8018B2j03R7J44k22J92k7k3k49L17k08K2k1Q0J26k77K72J77l67n2R4%j97M4J00
8042e9p5L89j30K2j13l8O0n6j91Q6R9j63L17j80q2R4J3P0k4k60L49m3p5k61M52
8067B01m3k94j42J91R8j48k4J48J42k35J14j02L78l72J35Q4j62j06L1N6p1o1J87
8090EJ18j58n7J46q5K18l01K39l23L13j39o4J25Q6l37Q7K00k21K61O5Mj94J71
$$ plain form
7923 204 187 168 106 154 321 50 50 216 -196 -108 -60 -65 28 -232 159 32 132 -218 -44 -82 209 50 -132 82
7947 82 0 128 -275 -35 180 14 -62 260 -16 122 -394 -9 166 54 32 349 156 -289 -156 118 9
7968 9 63 63 66 110 32 137 -191 -24 -238 166 -8 -13 -156 -126 148 253 -34 68 59 54 297 55 -126 271 63
7993 63 88 -86 -2 39 22 275 33 79 74 -99 176 -17 -209 157 262 51 -63 9 48 -27 68 35 -175 -147 22
8018 22 -81 16 160 -62 130 103 80 -169 148 -60 -38 -59 21 147 -130 142 319 -48 -100 -6 -6 -203 -159 -59
8042 -59 -134 255 125 147 34 -4 56 0 -191 -105 -6 -169 148 -32 -114 -20 -7 63 39 -221 128 85 10 -251 201
8067 201 158 -136 -278 -87 11 -137 -161 -13 129 -106 8 -94 284 -88 47 131 -31 -137 -106 -50 -121 -182 5
8090 5 123 -35 -92 54 -31 187 -114 125 -198 115 -24 -88 37 123 -214 -127 73 -148 113 178 182 -12 159
8113A59p5k43L50l01O5J18j04n7K24j40J32k16J89J51j49j91K13l60M38L4l41
8134a04K14R6k55j8q3L12r3j95J45j24J48o2L8K09k91J57k03J53j52j31N15m90
8156b14L82J92j28k17j58J13q3K02n5j68K82M8m20M16k30J41k70M4L90l46K75
8177A96k04N3j63K34m1j45r5K30n7k5m2J61K62m65
$$ plain form
8113 159 84 -159 191 -110 -45 73 -31 -88 136 -4 128 -88 101 252 103 -88 125 -235 203 237 -104
8134 -104 110 206 -49 -67 -150 162 69 -126 19 -105 43 -19 19 228 -63 94 -109 44 -108 -239 276 -214
8156 -214 168 360 232 15 -143 -30 -113 89 34 -134 148 196 -224 192 -38 103 -167 -123 267 -79 196
8177 196 -8 45 -118 116 75 -70 -165 65 8 -17 -59 102 364 -101
8191a01
$$ Imaginary data points
##PAGE= N=2
##DATA TABLE= (X++(I..I)), XYDATA
0@%%%%%%%%%%%%%oJ4j6J6j6J6k4L2l2M0m8N6o4P2q7J00j14J30j47J66j89K12k36
36a25K66k98L34l74M16m62N12n68O30o96P66q43R28j023J128j241J368j510J670
55H78j853K057k289K564k889L280l763M371n168O264p869J0450j5252K7082j08451
70i0588j50911K90858J73117j18081j14032J23183J11067r3891r4009M5367Q605
81I0685k7778l5840o8756o0786J4693P4916K713j09749j860J00036J4373l7355
93d4708J3853N1416J6377l9896m281O252j6933L9683K0491p1477l8093M7918N6996
106C7598j6411l3727M9540L0277l4257J6233K8303j3079p155K781k2281p0078
118c2256k6434O3212j9622j02719k388N6648j2014m8732M1027R9499k3669n6968
$$ plain form
0 0 0 0 0 0 0 0 0 0 0 0 0 0 0 -6 8 -8 8 -8 8 -16 16 -16 24 -24 32 -32 40 -47 53 -61 69 -78 88 -101 111 -125
36 -125 141 -157 177 -197 219 -243 269 -299 331 -365 401 -442 486 -537 591 -650 718 -792 878
55 878 -975 1082 -1207 1357 -1532 1748 -2015 2356 -2812 3452 -4417 6033 -9219 17863 -90588
70 -90588 -241499 49359 222476 104395 -9637 113546 224613 130722 36713 82080 90685
81 90685 62907 27067 -41689 -102475 -87782 -12866 -10153 -119902 -121762 -21726 -7353 -44708
93 -44708 -30855 20561 36938 -2958 -7239 -987 -17920 21763 42254 -29223 -67316 -19398 37598
106 37598 21187 -12540 37000 67277 33020 49253 77556 64477 57322 60103 37822 -32256
118 -32256 -58690 4522 -15100 -117819 -120207 -63559 -75573 -124305 -83278 16221 -7448 -64416
130f4416Q7051P8966m1942k5869O8732M6043q6588o6901O9552K4633q0943m6372
142c8054J0709O691l2091k0273K6428L275k986K2638j1198n019M2846L1107j4331
155A9742l3640J6050L6717l2461k3232L5136P88l2187p017K5282J3435k1436J6947
168A4124L3501k9786j5510L3745J0952k2753k2026R723k575m5761l552K4671k2351
181c7598k1683P208J1058j21j377L7005K1555k2680J9216L9415q001j3235J7449
194D8211K6002k5885n2054J7178K6556l8077l2071K065J0916p647k4298Q770K0326
207b0008M166R776r597p900L3455K0721j4642k1155Q429L2256j9249l7939K2907
220A220K3295k0338k2115O268K3167q440j1398K4823k622k2823J2298J7152o518
$$ plain form
130 -64416 22635 101601 59659 33790 102522 148565 61977 -4924 64628 89261 8318 -38054
142 -38054 -27345 -20654 -52745 -73018 -46590 -43315 -46301 -23663 -34861 -39880 2966 34073 19742
155 19742 -13898 2152 38869 6408 -16824 18312 19100 -13087 -20104 5178 18613 -2823 14124
168 14124 47625 17839 2329 36074 47026 24273 2247 11970 9395 -36366 -39918 -15247 -37598
181 -37598 -59281 -52073 -41015 -41136 -42513 -5508 16047 -6633 12583 51998 43997 30762 48211
194 48211 74213 48328 -3726 13452 40008 1931 -30140 -28075 -17159 -24806 -49104 -40334 -20008
207 -20008 -15842 -6066 -15663 -23563 9892 30613 15971 -5184 3245 35501 16252 -21687 1220
220 1220 24515 4177 -17938 -11670 11497 3057 -8341 16482 13860 -8963 3335 20487 13969
233A3969k1725n15K3397j6916k9325J4600J3089n255j0588m971J5138M776J305
246c021J2462o440J453J7532m014p714R30Q238M417k3485q989J4248p256p156
260h795L91o400J822j351L888N649q581J0964J2342j3952N55J3440N467m216j1071
275A52R466O021k0159L477J3145j0902j0729k22J2060l434k0272J4038J7264j7351
289g446r392J0810J4412j155j6086R997J4255j0903k258M212K942L727j0878k545
303c08M084n166L151l887p957O147l169l846M751p62M648j109l490J0774l447
318D14l316J2336j072o242j682K836Q698j0952o857J4151l354r967L189M636M763
333G581p537l132J2460o586p895P764K21m224q223j678R298r583p511J1224J135
$$ plain form
233 13969 -7756 -8271 15126 -1790 -31115 -16515 -3426 -8681 -19269 -24240 -9102 -4326 -3021
246 -3021 9441 3001 4454 21986 17972 10258 11188 19426 23843 358 -8631 5617 -1639 -8795
260 -8795 -8404 -14804 -12982 -14333 -10445 -4796 -13377 -2413 9929 -4023 -3468 9972 15439 11223 152
275 152 9618 15639 -4520 -1043 12102 1200 -9529 -9751 2309 -1125 -21397 -7359 9905 -7446
289 -7446 -16838 -6028 8384 7229 -8857 1140 15395 4492 2234 6446 9388 13115 2237 -308
303 -308 3776 -1390 1761 -2126 -10083 -3936 -7105 -10951 -6200 -6962 -2314 -3423 -6913 3861 414
318 414 -2902 9434 8362 2120 438 3274 11972 1020 -5837 8314 4960 -5007 -1818 2818 7581
333 7581 44 -3088 9372 2786 -5109 2655 2876 -1348 -9571 -11249 -1951 -11534 -19045 -7821 -6686
348f686l265K31N300J3540j124k528J2076J786o15k9m010N441n076j3645r11m694
364d209m920m691r650M631J35p697P481N885M021N071M61J2643N355p157Q172
379A5531O464m473o063n618P414k279j6171J318N543n319l489l524O149O576p165
394e106L850L201n171M457m5j910l020p518P001P23j1572O11P960L635P31n182
410g355J1016J5058l057O6J757M939M804j0900n016J108r131o881o477r269j317
425b0655n937k1M709o010N454J1538N745P171J072Q400J3651l584k088L108j323
440B1230n37r729o992Q98q855l866J007o240m64K23K935Q120m857J9Q477K531
456C900J307o084m020R513j165r655k997j405R279J035r486L744Q938P821L597
$$ plain form
348 -6686 -9951 -9720 -4420 9120 7996 5468 17544 19330 18715 18686 14676 20117 15041 1396 485 -4209
364 -4209 -9129 -13820 -23470 -18839 -18704 -26401 -18920 -13035 -9014 -3943 -3482 9161 14516 7359 15531
379 15531 21995 17522 11459 5841 13255 10976 -5195 -3877 1666 -3653 -7142 -10666 -4517 2059 -5106
394 -5106 -1256 1945 -3226 1231 1186 -724 -3744 -11262 -4261 -3538 -15110 -14499 -6539 -2904 -2173 -7355
410 -7355 3661 18719 15662 15728 17485 22424 27228 16328 11312 12420 3289 -3592 -10069 -19338 -20655
425 -20655 -26592 -26613 -21904 -27914 -22460 -10922 -5177 1994 3066 11466 25117 21533 19445 22553 21230
440 21230 20693 10964 3972 4870 -3985 -7851 -6844 -13084 -13548 -13325 -10390 -2270 -7127 -7108 1369 3900
456 3900 5207 -877 -4897 4616 3451 -6204 -9201 -10606 -1327 -292 -9778 -6034 2904 10725 14322
471A4322q051O014J2165k378l917q690l874N863q295j4154q632k986P917n326
485b0022j3612N627J2280Q578n99m237J6239J6720j802j564J228O794M235j1605
499A8260o925j309o611q19q111r100N17o58L316n26p005Q436J0580k08j962j575
515c700R167O064j1516k237N977r84m852n613N579O274r793R76J2851J717m743
530E167j728J1112Q267j5118o393J0337o14j0978j1210j27M352j0239n329M901
544a7600k673K575P271L989K441m5J3109J4395r609n265J1696Q069o165j8151
558D037q94J3000r484j6461l634M263M120q500o045Q312K737J460L952j115K747
573a505K944L816M239r076l917J1454R72r631p316O469J2859r863j1164J1541
$$ plain form
471 14322 6271 12285 24450 22072 18155 9465 5591 11454 3159 -10995 -19627 -22613 -14696 -20022
485 -20022 -33634 -28007 -15727 -7149 -7748 -11985 4254 20974 19172 17608 18836 25630 29865 18260
499 18260 11335 10026 3415 2596 -5515 -14615 -14098 -14756 -11440 -11966 -18971 -10535 45 -163 -2125 -3700
515 -3700 5467 11531 15 -2222 3755 2771 -2081 -7694 -2115 4159 -5634 -4658 8193 9910 5167
530 5167 3439 14551 22818 7700 1307 11644 11030 52 -11158 -11285 -6933 -17172 -22501 -17600
544 -17600 -20273 -17698 -10427 -6438 -3997 -4042 9067 23462 13853 8588 20284 28353 22188 4037
558 4037 3143 16143 6659 -9802 -13436 -9173 -5053 -13553 -19598 -11286 -8549 -7089 -3137 -4252 -1505
573 -1505 1439 5255 9494 418 -3499 7955 8927 -704 -8020 -1551 11308 1445 -9719 1822
587A822R588l730q042L078J2377o767j1450O835K455r013p002J287N810r400r056
602b1208J0733N019n489J07O271R824k74k601R543K239l088L008l04k061n881
617E838l141N281p205j1272K217L920p84p020m024J1007N217o597o12M495P680
632E000J177p915K913N143k064n08l147p17K225j556K528k080n814O961N023m247
648B922m810K57J0410l89j3517R50P855o75p705o225O966M094q421l45M523J046
664c064J758j303L221M033k796L727K726k891M88r08L48J029o876o42K963l249
680a436j633l031P67M436m348j054M066O97J066j539N68N520k977j837M168r32
696B501q34j339M72L111m759j729N341j886k209P06J66L162l620j551N330k159
$$ plain form
587 1822 11410 7680 -362 2716 15093 8326 -3124 3711 6166 -2847 -9849 -8562 -2752 -12152 -21208
602 -21208 -10475 -5456 -10945 -10838 -4567 5257 4983 2382 11925 14164 11076 14084 13780 11719 5838
617 5838 2697 7978 773 -10499 -8282 -4362 -5146 -12166 -16190 -5183 34 -6563 -7175 -2680 5000
632 5000 6177 -1738 1175 6318 4254 3746 599 -118 2107 551 3079 999 -4815 2146 7169 2922
648 2922 -1888 -1631 8779 8390 -5127 -4177 3678 3003 -4702 -10927 -3961 133 -8288 -8633 -4110 -3064
664 -3064 -1306 -2609 612 4645 1849 5576 8302 5411 5899 4991 5339 6368 -508 -1150 1813 -1436
680 -1436 -3069 -6100 -5333 -897 -5245 -6299 -2233 -1536 -470 -2009 -1441 4079 1102 -735 3433 2501
696 2501 1667 328 800 3911 -848 -2577 2764 878 -1331 -625 -459 2703 -917 -2468 2862 703
712G03k001J228k14J956k954j391M901k694k232K445L6P32j807j158N003k142
728D11k580K360M67J460k200k502N683l98m270J326J277K090k389m395N357J177
744B874m629M18O82J700r17m103M677J466m482J720J407M28n44l379M360R29n663
761c056J872J687m93r57k905L433J675m314K261J949l52J149j869K718K181m062
777I17J696J373k348o3k638J285O90n378L28K174j955k60j055J984L598l569J235
794a986M451m19O76r25J853K202m101J73K726l073j374p47M91J210n019P31M326
811A195k339j710P51K461J728m671q1N432k342k651j51J161J914l551j155M644
827F35j094l94J222N52K984j079o00M199j615j487J271j544J36l308k582K911
$$ plain form
712 703 -1298 -70 -284 1672 -1282 -2673 2228 -466 -2698 -253 -217 515 -1292 -2450 2553 411
728 411 -2169 191 658 2118 -82 -2584 3099 2701 -1569 -243 1034 3124 735 -3660 1697 2874
744 2874 -1755 -1337 -655 1045 128 -3975 702 2168 -2314 -594 813 1241 697 -2682 1678 2607 -3056
761 -3056 -1184 503 10 -947 -3852 -419 1256 -3058 -797 1152 800 1949 80 2798 4979 917
777 917 2613 3986 1638 1575 -1063 222 912 -4466 -4138 -1964 -3919 -4179 -5234 -3250 348 -3221 -1986
794 -1986 2465 2046 2722 1797 3650 5852 1751 1924 4650 1577 203 -544 -53 1157 -3862 -3131 1195
811 1195 -1144 -2854 -2103 358 2086 -2585 -2666 2766 424 -2227 -2378 -1217 697 -2854 -4009 635
827 635 -459 -853 369 921 3905 2826 2226 6425 4810 3323 4594 3050 3186 -122 -2704 207
843B07l419l307P82J91J253k018r06N759R67j879L125K045K489p19k016M592r20
860F226l967J423o60j497k158j786K863j708m100L164J412r97l49m55L974j21
876A264l659K692M49j327j32j899K086l75k654K964L31q15J654Q5K753J234l016
893A635K624K121j814j340k625K021J92o003q71J255j613r08k485J977K985k970
909e819K620L564o76J271J873K423R07m038K794K815m882j989N21M33q99m766
925c848J183K635l260p6J762q1J157j189J715K064l409J095J750j561L4j881K57
942a653K543k587M8M92L71L123j509m98L088k2Kj65j023J298j590j751J369l723
960b187j798J977r74j033k091J275M989k279k643M774K501N40j524l89M383q75
$$ plain form
843 207 -3212 -6519 -5737 -5546 -4293 -6311 -7217 -1458 -491 -2370 755 2800 5289 4570 2554 7146 6226
860 6226 2259 3682 3022 1525 -633 -2419 444 -1264 -5364 -2200 -788 -1785 -2134 -2589 1385 1264
876 1264 -2395 297 746 -581 -713 -2612 -526 -901 -3555 -591 -260 -1075 579 664 3417 4651 1635
893 1635 4259 6380 4566 3226 601 2622 2814 -3189 -4060 -2805 -4418 -5326 -7811 -5834 -2849 -5819
909 -5819 -3199 365 -311 960 2833 5256 6163 2125 4919 7734 2852 863 1384 1817 918 -3848
925 -3848 -2665 -30 -3290 -3366 -1604 -1685 -528 -1717 -2 2062 -1347 -252 1498 -63 -29 -1910 -1653
942 -1653 890 -1697 -1649 -1157 -786 2337 828 330 3418 3396 3398 3233 2210 3508 1918 167 1536 -2187
960 -2187 -3985 -2008 -2982 -4015 -6106 -4831 158 -2121 -4764 10 2511 3051 1527 1138 5521 4646
976D646k223J230k367k23P86j999j116j555Q17K729l866r32L589k06Q28q49j1
993g22K531j169n3J024l085J835J566k879n61N0J619R89l507J228K501j611N73
1010C29J078J075n37k057J989J317m933P76J508j414j024q15J473J749m019K032
1026a473R01l00J248P67J062K72k100K667R37l701J054o21o17k61j946P46J745
1043C80p92p50j749J123M771l043k470L005J559Q9k902K52L501j802k508K137
1059H01Q71l517Q75R77J353m187N46N311k556l290J648L646k73m999J291M995
1075C492k460l820K603J260m77k201O01K798k534j270L754j430o5n88J98K584
1091B445k277r38K615j437o47L3j110K020j072j982K087O1L21j182j011K533O75
$$ plain form
976 4646 2423 3653 1286 1063 1849 -150 -1266 -2821 -2004 725 -3141 -4073 -484 -690 138 -711 -722
993 -722 1809 640 587 1611 -1474 361 1927 -952 -1513 -1463 156 1145 -2362 -1134 1367 -244 329
1010 329 1407 2482 1945 -112 1877 3194 -1739 -963 545 -869 -1893 -2708 -1235 514 -3505 -1473
1026 -1473 -572 -872 376 1143 2205 2477 377 3044 3981 280 1334 713 96 -165 -2111 -1365 380
1043 380 -412 -1162 -2911 -1788 2983 -60 -2530 475 2034 2123 -779 -527 2974 1172 -1336 801
1059 801 1672 -1845 -970 7 1360 -2827 -2281 3030 474 -2816 -1168 2478 2205 -2794 -1503 3492
1075 3492 1032 -2788 -185 1075 598 -1603 -1002 1796 -738 -2008 1746 316 251 -337 -139 2445
1091 2445 168 -770 1845 408 -239 -206 -1316 704 -368 -2350 -263 -202 119 -1063 -2074 459 1134
1108A134k945J811J902r64j329m97M525j643m496K099K844j839j842J77K686j362
1124B61m031L218J691l205R2J423J493k014j666M536J36l670J370K242J05j706
1140B75j354L205l29k893J524N01j020Q8j019Q91J36j557J824r53j68J562j519
1157h06M58J064j001L03l61Q43R24k883N89K623k131q31J304J109j44k963K255
1174C52K913l417j167K575M26j253k466K205K036m162n19K992r52j203k64J793
1190a11Q36k751J386K844j916L48P29K16j02j333Q38R17j806m6j03j411J138p12
1208a039q89P80n25J438n86q70K977n19j386J648R17o28j277p3K274j737k878
1225b373K699M14j980n88Q69K496k270j471L614k2j821M92R10O06j980o42K212
$$ plain form
1108 1134 -1811 0 1902 938 -391 -888 3637 1994 -2502 -403 2441 602 -1240 -1063 1623 261
1124 261 -3770 -552 1139 -2066 -1974 -551 942 -1072 -2738 1798 1934 -1736 -366 1876 1981 275
1140 275 -1079 2126 1797 -1096 428 929 -91 -3 -1022 -131 5 -1552 272 -681 -849 713 -806
1157 -806 -348 716 -285 18 -343 500 1424 -1459 -870 1753 -378 -1209 95 1204 1060 -1903 352
1174 352 3265 -152 -1319 1256 1682 429 -2037 168 2204 -1958 -2477 515 -437 -1640 -1904 -111
1190 -111 725 -2026 -640 2204 288 636 1365 1581 1479 146 984 1901 95 49 -54 -1465 -327 -1039
1208 -1039 -1928 -1148 -1673 -235 -821 -1691 1286 767 -619 1029 1946 1318 41 -32 2242 505 -2373
1225 -2373 326 740 -1240 -1828 -959 1537 -733 -2204 1410 1388 -433 59 969 1575 -405 -1047 1165
1242A165p10l398K007O54l43J94j805L754j875k20J860K06l46K67o78Q36K05j115
1260F58n3r15k85M98k217O52J218j818J63J99J393R06j692J901K156k085R7R39
1278A715P41o34k643J923J022l499j50J374l20r97r68K437P07k986J638K081r97
1295D44k62j10J306J63k670J152R40j201l37m28M62Q26j472P79Q57j76M35K4k2
1314G10J322j474j84J174r24k31j346l33J329j657p15J666p80K40o91J407J988
1331A501j776j73L031l84q20K80O87k03k405q49K586j459k010R57M51M2j359k41
1349b144K521j021m67J120N69J6n70n1J380o06j170O73k88L07p69n46J378j10
1367B22p39P35J50M49J29j205J997l31j862Q79m10Q8p15j327J487j59j755P47
$$ plain form
1242 1165 455 -2943 -936 -282 -625 -431 -2236 1518 -357 -577 1283 1489 1143 1410 732 1568 1773 658
1260 658 605 -310 -595 -97 -2314 -1662 -444 -2262 -2099 -1900 -507 399 -1293 608 2764 679 776 1715
1278 1715 2456 1822 -821 1102 2124 -1375 -1525 -151 -471 -1468 -2436 1 708 -2278 -640 1441 444
1295 444 182 72 1378 1541 -1129 23 963 -238 -575 -1003 -541 285 -1187 -408 449 273 708 732 710
1314 710 2032 558 374 1548 624 393 -953 -1286 43 -1614 -2329 -663 -1443 -1203 -1894 -487 1501
1331 1501 -275 -448 2583 2199 1379 1659 2346 2143 -262 -1111 1475 16 -1994 -1037 -586 -544 -1903 -2144
1349 -2144 377 -644 -1111 9 578 594 24 -27 1353 747 -423 250 -38 269 -500 -1046 332 222
1367 222 -517 218 368 817 946 -259 1738 1407 -455 424 14 102 -613 -1940 -453 -612 -2367 -1620
1385a620Q41K79J8q71K503J88j889J597J134n99m73o18J083k42j949P00L36j069
1403f51l87l42R17P1j442J150Q45q41L60M4N81K74j173J154L03n31o10M55J89
1422C66Q68j336q42K374j173J82RM84J89j394M67J064j120j51l77J71O74j925
1440a470L89J134j370J47P49J0P98j378M22J815j034J5O49j72N58p94l67J657
1458A758j517n98L60k15N01r97m49J586r41m55R42k66K75k74K9J126j142l47R87
1477C63k76J50n44j66J329q15o97R90k30L94r44RJ217m47p20J097m13l51K74o50
1497d30N70j26p93J041k79j89Mo37J036J57j265Q94J06j95L39n95J001M84j481
1516c58N44K89j18J5p22Q64J39j306N57O05q67K74n22N77N86j471N25O22m09O6
$$ plain form
1385 -1620 -779 -500 -482 -1353 1150 1338 -551 1046 2180 1581 1108 490 1573 1331 -618 82 418 -651
1403 -651 -1038 -1380 -463 -392 -1834 -684 161 -680 -320 -276 305 579 -594 560 863 332 -278 177 366
1422 366 1234 -102 -944 1430 257 439 448 932 1121 -273 194 1258 138 -13 -390 -219 455 -1470
1440 -1470 -1081 53 -1317 -1170 -421 -411 387 -991 -569 1246 212 227 876 704 1262 468 101 1758
1458 1758 241 -357 3 -212 289 -708 -1157 429 -512 -967 -25 -291 -16 -290 -261 865 -277 -624 363
1477 363 87 237 -307 -473 856 41 -656 334 104 498 -446 -437 780 333 -387 710 297 -54 220 -430
1497 -430 140 14 -779 262 -17 -206 -202 -839 197 354 -911 -17 89 -106 233 -362 639 1123 -358
1516 -358 186 475 357 372 -350 514 653 -653 -96 509 -358 -84 -606 -29 557 -914 -389 233 -176 -110
1536a10m72Q83N29j628L74J327j004J80m51L86L56j078K45J053l95k61l31P30
1554C33O55j105j69J416p04n97P0J82N20j422r4J331m75r41L64L55O29j284J02
1573h34J502l66r50P37O26P5r42J05J438j520m28J007K2N9r21k54J433j206k51
1592f68Q69l09N78j344R4K164n35j880J576q46J17k49l46J224j19j412J088l72
1610c70l4R29j177J362j93p28Q70J9N67j311K19J029j355q72P64J199j605m38
1628a125l52J303l7j550J639K03n55Q86o16J505q29p01J456L00o92o60n57O41
1646B59K31j682J093K53p55N3O36M97j73q27P33K70n49k51k30N22K01j312P85
1665b46Q87j306k16N64J001k51j326L25J905j160rO10J91j02j609Q33R82j749
$$ plain form
1536 -110 -582 301 830 -798 -424 903 -101 79 -372 14 370 -708 -463 590 195 -66 -397 333
1554 333 988 -117 -286 1130 426 -171 -101 81 601 -821 -915 416 -59 -1000 -636 -281 348 -936 -834
1573 -834 668 302 -648 89 715 790 -152 -47 1391 -129 -557 450 472 531 -390 -644 789 -417 -668
1592 -668 201 -108 470 -874 -780 1384 849 -1031 545 -301 -184 -433 -779 445 326 -1086 2 -370
1610 -370 -404 525 -652 710 517 -211 659 678 1245 -66 153 1182 -173 -1045 -281 918 -687 -1125
1628 -1125 -1477 -174 -211 -1761 -122 81 -474 412 -204 1301 472 -229 1227 1527 835 175 -382 259
1646 259 490 -1192 -99 154 -601 -548 88 585 412 -415 318 588 39 -212 -442 80 281 -1031 -246
1665 -246 641 -665 -881 -317 684 433 -893 -568 1337 177 168 778 969 867 -742 91 1073 -676
1683f76l23J021J04p50p81Q61J038j567j54J349M5l46R9N36R51j490M03J052r50
1702D22r9q12P19N78j024k24J057p88J37j55k8R67r07l50Q43j35J57q80L26R53
1722G57j355m88R23J14k77m05L83R63o36o39J431R1n17j5J02O55j016j48N95K30
1742G48j223r4J40Q41q43o04J145J13r34P26K23J26p7m55J000L13j124j86L74
1761B09l8k91m22Q56q21j3L05j45P5L01J27N03j0j008K88J72j94P8p5j26J89j79
1783b19l65K07K6On83M61R78j515J045j6M23p64Q6J006l78q72m4P90q53K01q48
1804a228J328L93q25m77J339k62n01m9J07J092j485O76O99q45r0K81o07J145j252
1823e61P37K22q5m91J27o2L09o09m3R80l87k39r8J90P32j140rP17l23k64j07O66
$$ plain form
1683 -676 -999 22 126 -624 -1405 -544 494 -1073 -1227 122 167 -179 -80 456 1407 -83 320 1372 422
1702 422 323 -489 230 808 -216 -440 617 -171 -34 -189 -217 750 -157 -507 336 201 358 -522 -196 757
1722 757 -598 -1086 -163 -49 -326 -731 -348 615 -21 -660 771 862 345 330 432 1087 71 -77 518 748
1742 748 -475 -569 -429 412 -431 -1035 110 223 -711 15 238 364 287 -168 832 1145 21 -165 209
1761 209 171 -120 -542 314 -507 -520 -215 -360 -285 16 143 646 636 -372 -84 88 -106 -28 -103 -229 -40 -219
1783 -219 -584 -377 -351 -345 -928 -467 511 -1004 41 25 448 -316 -230 776 398 -474 -518 272 -581 -380 -1228
1804 -1228 100 493 -332 -809 530 268 -233 -282 -175 917 -568 108 807 -38 -128 153 -454 691 -561
1823 -561 176 398 313 -178 -51 -113 196 -413 -456 524 137 -102 -200 -10 722 -418 -427 290 -33 -297 -404 262
1845B62K80p86j015J250j19j36K7M83R32j588l36K619j283q53P50L16k33j160
1863e90L78J212p56n58M31J5J49m39k40R33j62o85M36j21Q2l61k63N83M9l31n5
1884b93K95p6O6o06J135R1j079O45m7K1k90l69J204k74q82M75L08j74j36o33J049
1905D30m9j431Q44M39o41O55o31O42N41j451N01O42n45O6l63P49j01p20N36M56
1925E69p29L9K68P6J10j055R92K83m53j39n4J23N22r93R3N52m35m3p0K80L58q78
1947e84K18R43p12n7J45p1Q13r11J93J76k3M00m36l7J56o06J56R00q11j12J66
1968i4m01R85r17L2P27n48L20j22J92j8p40q0R72k17n36P15k68L88r61L79J210
1989A018m65m19O94j116N69O4j26j74R0p53M79J65j39J62J02j36L18j772J247
$$ plain form
1845 262 542 -244 -1259 -9 -128 -264 -237 246 1178 -410 -746 1873 590 -263 487 803 570 -590
1863 -590 -212 1000 244 -314 117 132 281 -158 -398 535 373 -312 124 3 85 -276 -539 44 93 -238 -293
1884 -293 2 -74 -8 -614 521 612 -467 178 131 152 -138 -507 697 423 -459 16 324 150 14 -619 430
1905 430 381 -1050 -206 233 -408 247 -384 258 799 -652 -151 491 -54 12 -351 398 297 -423 113 569
1925 569 -160 -121 147 223 333 -722 270 553 100 -39 -93 30 552 -441 -348 204 -231 -274 -344 -64 294 -584
1947 -584 -366 577 -135 -192 -47 -118 695 -216 -23 153 130 530 94 57 213 -393 -237 663 -148 -260 -94
1968 -94 -495 490 -427 -395 332 -216 104 -18 174 156 -584 -664 308 91 -445 270 2 390 -571 -192 1018
1989 1018 553 134 828 -288 281 345 219 45 135 -618 -139 26 -113 49 151 15 333 -1439 -192
2008a92J037r2r60K20N13K01j330J016L37p55N71q54Q03n01k88K18j34k37L73
2027e4o0R0M4j919J226M12o31P06p78P15P97j054P50j83q12J153o30P9J066k141
2047a224L43R23l73J30J6P36K59n70K95k02o83P69p84o0O05m45Q7R48j67j089
2067d86n10J811J91m11j281J439o37o0q69Q16J241j762K2Q11k5k30K21J90q5n42
2087a56o26J841q35l38M16j3J27j160P50K79p9k66M21o36K80k35p33J970n67r01
2107d61O49j75k5r3k83O72j58m79M48r3O26j226L24R96m79o34K19M76j09m56j65
2128d26P01k05r38Q51mj67p9j25Q41m18o96J158p6j39J58m18M85q1j190J028K97
2149E57p96L61k46M15P5q39O18J69k65q2j00K42jm72M54J05l22l6Q6L18J20p95
$$ plain form
2008 -192 845 753 -207 13 526 727 -603 413 750 -5 566 -288 515 14 -274 -56 -190 -427 -54
2027 -54 -114 -24 20 -1899 -673 -261 -892 -186 -964 -249 548 -506 244 61 -751 402 -228 -149 917 -1224
2047 -1224 -881 42 -331 -201 -185 551 810 240 535 333 -350 419 -365 -425 180 -265 -178 770 603 -486
2067 -486 -996 815 1006 595 -686 753 116 56 -813 3 1244 -518 -496 315 290 60 281 471 386 -156
2087 -156 -782 1059 224 -114 302 289 416 -744 6 285 206 -60 361 -275 5 -230 -963 1007 440 -461
2107 -461 188 13 -12 -105 -388 284 126 -353 95 2 628 -598 -274 722 243 -391 -172 304 195 -261 -426
2128 -426 275 70 -868 -17 -21 -188 -267 -392 449 31 -665 493 417 278 436 18 503 422 -768 260 557
2149 557 -239 122 -124 291 366 -473 145 314 49 -33 -133 109 108 -364 90 195 -127 -163 -77 241 361 -434
2171d34L99O40n03r0j6K36J48j058P82Q72j084k20M38J71k76p70N44R78j123k17
2191e83O15q2j54k41L31O23r74K67M90m01l5j26J97M81j92j29M8k0J83m86K23
2212C5O73o75k97K13J37J31n09m0P97m90n66P65k05K35m65LQ47q55k85N42J25
2233A16K52p67K60R33r58k78R03k36m99L05p3M17l71o51J366p38J96m86N78j48
2253A21m32M6K21j58m35L65M30L23n37k40M41K40l6o33P15k05j75Mj51J88m71
2274c79N20n5O33j501M64M92O25j175M54k16O7Q2q30R3J245j119j69J094m72L77
2294B30o26O62M59r84L34K95m56M28o79N07M16r80K93L72k28O6m48M97Mm32Q4
2315a86K55k02K83p93N95K24N3q09R88l80M84l97L00K58j682Q06m67P17J53o51
$$ plain form
2171 -434 -35 605 102 12 -4 232 380 -678 104 976 -108 -328 110 281 5 -765 -221 757 -366 -583
2191 -583 32 -50 -204 -445 -114 509 -465 -198 292 -109 -144 -270 -73 408 216 87 135 115 298 -188 35
2212 35 708 33 -264 -51 86 217 -292 -332 465 -25 -591 174 -31 204 -261 -258 589 -266 -551 -9 116
2233 116 368 -399 -139 794 -164 -442 461 225 -274 31 -42 375 4 -647 719 -19 177 -309 269 121
2253 121 -311 -265 -44 -202 -637 -272 158 481 -56 -296 145 385 349 -284 431 226 51 55 -96 92 -379
2274 -379 141 86 719 -782 -318 174 799 -376 78 -138 -71 11 -819 -726 519 -600 -769 325 -147 230
2294 230 -396 266 725 -259 75 370 -86 342 -337 170 586 -394 -101 271 43 109 -339 158 162 -270 -186
2315 -186 69 -133 150 -643 -48 176 229 -580 408 28 512 115 415 673 -1009 -203 -670 47 200 -451
2335d51O89M36l29p25J6R45j429N52P47K67q29p76K258j423n42R74k66P10j097
2354b73M14J336j695n97J148j55m1l94l51O80P9J54M25l50l04J56j39Q1l11r7
2374b34L55l0L92p68k58N48J88q32J31O76L81r49rN96J36o20P5J92O47n48m02
2395c33Q20n51k53Q62N19R5p59j029J178o63l3j49P15o82M07j63N02m16j26j28
2415a87O61o03L15l01K35P27j150M64m02J77k1p63J093l62o2L55J41n68M68m70
2435b53M08J24q11L69K62j03m05R5M05K33o46J38L77l72J11k63M16L13q06N22
2455A14L44l95q8r2m7L16o49N27K11j67n89P94l30P84o76m69J225j272M20k07
2475b46L71K30n91J99M36m32l35L75k57M35l01K46L53p03K04O9P4mj51k52Q24
$$ plain form
2335 -451 238 674 345 -380 -364 581 -848 -296 451 718 -111 -887 1371 -52 -594 380 114 824 -273
2354 -273 141 1477 -218 -815 333 178 137 -257 -608 72 151 305 730 380 76 232 93 174 -137 -234
2374 -234 121 91 483 -285 -543 5 193 -639 -508 168 549 -400 -409 187 323 -297 -222 -30 617 69 -333
2395 -333 487 -64 -317 545 1064 1159 400 -629 549 -114 -147 -296 419 -263 144 -19 483 67 -59 -187
2415 -187 474 -129 186 -115 120 847 -303 161 -241 -64 -85 -848 245 -117 -179 176 317 -251 217 -253
2435 -253 155 279 -532 -163 99 -4 -409 -314 91 324 -322 -184 193 -179 -68 -331 85 398 -408 114
2455 114 458 63 -25 -117 -164 152 -497 30 241 74 -515 279 -51 733 57 -412 813 -459 -39 -246
2475 -246 125 355 -236 -37 399 -33 -368 7 -250 185 -116 130 483 -220 -16 53 127 123 -28 -280 544
2496E44l22k67Q0J68j97R5n40M64o8k67M23j99L20m52J26M23l68l91O03R0m1l25
2518a01m1M29K9o41N21J16k43j3j32K77L7n46L99J39j34l67k50P98q6p38M81M60
2540C94l99k9k41O49j00o65J66K35m0J05o2K75o2p08M63K34m01J3L06l0K46r47
2562e98M87K69r9Q4l31L93o6n82K07O45m58P3j61M30K35p28L4M83k24j42j53J24
2584g8M67n07k25N94k16l90K65K78L15p95K83M61m33k31L32k86L15n50K42N27
2604C68o97J47K98KO9l30n1O36k78m26M51M2l0l1n27Q49o04j71K91L6l7j56q7
2627b36O70m74n46M85J14J49l59j06N54j45p22M67M07k97K37N2j9q24P81J60m60
2648a12r8N44k95J67k53j13L36q7k55J67O7j13R1o15J73P78m5r12N38r3M13p50
$$ plain form
2496 544 222 -45 35 203 6 101 -439 25 -43 -310 113 -86 234 -218 -92 331 -37 -428 175 265 224 -101
2518 -101 -142 287 316 -325 196 312 69 56 -76 201 238 -308 91 230 96 -271 -521 277 191 -547 -66 394
2540 394 -5 -34 -275 374 274 -391 -225 10 -30 75 13 288 226 -482 -19 215 -186 -173 133 103 349 -598
2562 -598 -111 158 59 143 -188 205 139 -443 -236 409 -49 24 -137 293 528 -200 -166 317 93 -49 -202 -78
2584 -78 389 -118 -343 251 35 -355 -90 188 503 -292 -9 452 19 -212 120 -166 149 -401 -159 368
2604 368 -329 -182 116 118 187 -143 -194 442 164 -262 189 231 201 170 -357 492 -112 -283 8 44 7 -149 -236
2627 -236 434 -40 -586 -101 13 162 -197 -303 251 106 -616 -149 258 -39 198 250 231 -593 188 348 -112
2648 -112 -210 334 39 206 -47 -160 176 89 -166 1 68 -45 46 -569 -396 382 337 -575 -37 -130 283 -467
2670d67q0N91M37k00p25R36l3n41R3P85n99m67J79k14L76j000J905r13N22r03
2690c18L88l7l31k99K56K68n17K23M86o48O49j277Q63J356j316j12J125n06KO42
2710H97j646J619n71j01j14J20R48j185j47J11K41o57P71k14L19n98J22j14l28
2729e27K13l79O75n99K38J70m8L9L84q63J369n00M4m10J363j454N39k9j34m8q50
2750h07K51Q60l42k98m0n5P31o86M76n09O46r21J65M88K6k28K03J48N03j198K50
2771c37L03J42j44j82R07o79o32J72Q07p10K56M9K63j75n73O26K0m25O7L08J49
2792B12k68j93L16M2p9j75M5N70l06o88O51K60n82L04K08o7N4k35L20n24J6j34
2814b53M15n45M54n04L23J79m30L3K06M66k33n67K55N65p38L84l15J005p91jK61
$$ plain form
2670 -467 -547 44 481 281 -444 492 459 -82 11 796 197 -270 -91 -305 71 -929 976 63 585 -318
2690 -318 70 33 -298 -597 -341 -73 -590 -367 119 -529 120 -1157 -294 1062 -254 -366 759 253 255 897
2710 897 -749 870 299 198 84 204 1152 -33 -180 -69 172 -485 286 72 391 -207 -85 -199 -527
2729 -527 -314 -693 -18 -617 -379 -209 -257 -218 166 -697 672 172 216 -194 1169 -285 254 225 91 43 -807
2750 -807 -556 304 -38 -336 -376 -431 300 -386 90 -419 227 -694 -529 -41 -15 -243 -40 108 611 -587 -337
2771 -337 -34 108 -36 -218 689 10 -622 -450 357 -353 -97 -48 215 40 -533 93 113 -312 -245 63 212
2792 212 -56 -249 67 109 30 -145 -100 470 164 -524 127 387 -195 109 317 250 304 69 389 -135 -119 -253
2814 -253 162 -383 71 -433 -110 69 -361 -328 -122 344 111 -456 -201 364 -374 10 -305 700 -91 -92 169
2835A69M77j321J8J40N83j87k38J91L55m39j79P35q6n60J9L11M49o01j25N57r4
2856A74m61J64K63k1J10l63N35l26k39K41J32K16o69J42L49k20j3j26M6K89k82
2877e9k71K82ml15L9L76J54l23k46N79k5j75j4K56j07k39j09M76j82m44L0M90
2899A69m0q2m38P03o1o58J98J79l0n0l42N80o9k43K86j97j06M03o12L71J30l65
2921b74J99L41k37K61l56K98K08n39J01K39j71n3m37L61L30n59L2M23q5j61k66
2942c45J48J78l71O0O09k45j09J4k6K18m65L61L5L3l03Q9L88N3m51q0N90m57k25
2965c01K86J68j66M1j59M22m39Pj79L39K22j55k37N29j80m20L22j50K90l33j88
2986b81M43K03l40Ql7L27l58k20K69J67l52N13j47m6k70k88P38j67p01M50J44
$$ plain form
2835 169 646 -675 -657 -517 66 -121 -359 -168 187 -252 -431 304 218 -342 -323 -12 437 -164 -289 268 174
2856 174 -287 -123 140 119 229 -134 401 75 -164 77 209 425 -244 -102 247 27 14 -112 -66 223 -59
2877 -59 -330 -48 -52 -367 -328 48 202 -121 -367 212 187 12 -2 254 147 -92 -201 275 93 -351 -321 169
2899 169 129 47 -391 312 251 -407 -209 -30 -60 -110 -452 128 59 -184 102 -95 -201 202 -410 -39 91 -274
2921 -274 -75 266 29 290 -66 232 440 -99 2 241 70 17 -420 -59 271 -288 -256 167 82 -79 -345
2942 -345 -197 -19 -390 -330 279 34 -75 -61 -87 131 -334 27 62 95 -208 -119 269 322 -129 -209 381 -76 -301
2965 -301 -15 153 -13 28 -131 291 -148 -141 -320 19 241 86 -151 378 198 -222 100 -50 240 -93 -281
2986 -281 162 365 25 33 -4 323 -35 -255 14 181 -171 342 195 149 -121 -409 329 162 -539 -89 55
3007E5J78n32J96L40l27r7r7j39N56j96J6L58k30l66J61L34j43Jl34O37j11m61
3029b01J59N78M4p52k05O84j44l41Q02n40L91j92n89L33L30m36j53N32j77j90
3049f7j14M21M5o10L15L54l84q8P6K75J41o16K67L04k02k69l7M43l26m19K48J78
3071f5p6J90l21M25j01q3j07N19r34O26j65l57O35p65P14k9p81N9J380m51k57
3092E6p52J89M85L19p3k94o6o7Q7J98O05p70r56P35N02j74J7k10J33J93l29O71
3114D99m56o9j35k11O29P5K68q80J72J81m27p2L19q4l9K53m9J01m36M5N63p1p12
3137e36N42m5J03J37l32N45l57l21N41J7k88J98l47M55j72l69J56J22l68K24J3
3158h2J39jj74K35o6K0j21m06M55J41m55L82K25l65j52J9K34J023k452J816r01
$$ plain form
3007 55 233 -299 -103 237 -90 -187 -284 -423 133 -63 -47 311 81 -285 -124 210 67 68 -266 371 260 -201
3029 -201 -42 536 580 -172 -377 307 163 -178 624 84 475 283 -306 27 357 -79 -232 300 123 -67
3049 -67 -181 240 285 -325 -10 344 -40 -128 -52 223 364 -252 15 319 117 -152 -189 254 -72 -491 -243 -65
3071 -65 -141 49 -272 153 52 -31 -138 381 -553 73 -92 -449 186 -579 135 106 -675 -616 764 313 56
3092 56 -696 -507 -22 297 224 -70 -136 -203 -116 82 687 -83 -1039 -304 198 24 41 -169 -36 157 -172 499
3114 499 43 -26 -161 -372 257 332 600 -280 -108 73 -354 -426 -107 -191 -230 23 -26 75 -361 -316 247 176 -536
3137 -536 6 -39 64 201 -131 414 57 -264 277 294 6 204 -143 312 140 -229 -73 49 -319 -95 -82
3158 -82 57 56 -118 117 51 71 -50 -456 -1 140 -315 67 292 -73 -225 -206 28 1051 -1401 415 -486
3179d86R58q84L39P07r98L46J63J56n60M33j7K92k93q60J132oq88O64l89N20l69
3200d0M8J12N9oK16l32O5J51j50k31M04n16K22J8N6J17m07K55R2l63K19j0j19
3223a40M53r26J26R50p32L46O28k20m98R0m32J028r26J54L34K77m37k08j26L67
3243A08k50N7N13m38K75l48K61j6l21O11j10l14L24j167O28Q93n60k55L10j11
3263I0J83J58k15m41R21j677R77M42Q8n25O66M20j171q95L82J101q27R6M71L29
3283E73j256J053J04K01p65O28k51L05k41m55N58p91K11L46n10N88m86m04J335
3302G43p03j48k95P73j52J43Jl41J3k2k08N73m73P1p1N82m61P3j44J27j77l93
3324d89N59j29O84l42l28J37m5P50j062K03K28k14J60L35nl96M21K65j62p32K58
$$ plain form
3179 -486 472 -412 -73 634 -364 -18 145 301 -259 174 157 449 156 -704 428 422 -466 198 -191 329 -40
3200 -40 8 120 179 173 389 57 122 273 123 -108 296 -220 2 20 76 193 -214 41 133 -230 -11 -21 -140
3223 -140 313 -613 -487 463 -269 77 705 485 -13 77 -355 673 -253 -99 235 512 75 -133 -259 108
3243 108 -142 -85 428 -10 265 -83 178 162 -159 452 342 28 352 -815 -187 706 146 -109 201 90
3263 90 273 431 216 -225 696 -981 -4 438 526 1 667 1087 -84 -979 -597 504 -323 -227 244 573
3283 573 -683 370 474 675 -90 538 287 592 351 -104 454 -337 -126 220 -290 298 -188 -592 743
3302 743 40 -108 -403 370 218 361 362 21 34 12 -196 377 -96 -25 -96 486 25 98 -46 81 -96 -489
3324 -489 70 -59 625 283 -45 92 47 797 -265 -62 166 -48 112 447 442 46 467 732 570 -162 96
3345I6J00J12j89k01l80P60o41j73R42k91k81L85l37K57k40K04P4m62L43k40P23
3366E61J64k98o96N26j00j54J64k71M07k83l89J27J65j64o0k03M51r0k17M44P
3387I1o9O8k85K50l35P5N09J12n22j29JO97n58j44J53L61m05K26J80o7m10l4M63
3410B28j76k24q4L90j74lo71Q49j02k87L4J39L34l29LO80n63j0j15M5L15j48j56
3433b5N7J99o01M6J63J0M33o60M90L28p10N8K09nK1j5oJ24m75J52M79l32J02j63
3457a21O79k41m53k0L94k20l3j28L09k36k48K28K28j30j05j97j14O04n53J56K96
3478I5j45j64J7J37L95o21M60J39j06k91R5o9L53n18K54L72l00k4m37M68K32o21
3500b79r9K67K83j70m4o2j4J71o0L56l71m77Q03m20K93N01j144O08j52j99J89
$$ plain form
3345 96 196 308 119 -82 -462 298 -343 -516 426 135 -146 239 -98 159 -81 123 197 -265 78 -162 561
3366 561 725 427 -269 257 157 3 167 -104 303 20 -369 -242 -77 -241 -301 -504 -53 -143 -360 84 91
3387 91 22 90 -195 55 -280 -205 304 416 -106 -235 -234 463 -95 -239 -86 275 -130 96 276 209 -201 -235 228
3410 228 52 -172 -256 134 -40 -43 -714 135 33 -254 -220 -81 253 -76 -73 607 44 34 -81 -36 279 131 -25
3433 -25 32 231 -370 -324 -161 -151 282 -378 112 440 -270 -212 -3 -8 13 -2 -8 116 -359 -207 272 -60 42 -121
3457 -121 558 317 -136 -156 238 18 -15 -143 166 -70 -318 -90 138 8 -97 -294 -408 196 -357 -201 95
3478 95 -50 -214 -197 -60 335 -286 174 313 207 -84 11 -58 295 -223 31 403 103 79 -358 110 342 -279
3500 -279 -378 -111 172 2 -42 -104 -118 53 -7 349 -22 -499 304 -116 177 678 -466 142 -10 -209 -20
3521b0M21j423P16K57P96n50o13Q62l79n4k5l41L91j81m66J189k70j91j20k35
3541b36J024l0j750R20l65K20J33M0P97o60L99K6j32l09m84K68P02L60j400q3
3561e60J254j571J148o06L58N28q21K0K86M19l46m22N88j54N5k42J7n1L11l17
3581a06M74K69j377J251n06M19q20K81n2J235r86m68Q11n10k04K03j07K73N3l76
3601b43L29k64K5o6o4K41P2m8K67m1j15k9K36K53l72k99N02q6q24N27j08J014
3623I07j110j60O59L48o53L86r82O70k77l24Q59l50j46j71P99o47q2M02q9L94
3643D33o84M31L3l2j35NL30j68k76q4J54J07l33K3L84k35n61M47o7L6n6m1N41
3666B52j82l99L83L43m80K35k68J37K00o03P25r1n3M8l43L44j84k97J21L55m56
$$ plain form
3521 -20 401 -1022 -306 -49 747 197 -416 446 67 13 -12 -353 38 -143 -609 580 310 119 -1 -236
3541 -236 788 758 -992 -72 -437 -217 -84 -44 753 93 492 518 386 77 -407 -139 563 923 -477 -560
3561 -560 694 -877 271 -335 23 551 -270 -250 36 455 109 -313 275 121 176 -66 -49 -100 211 -106
3581 -106 368 637 -740 511 5 424 -396 -115 -167 1068 82 -386 425 -85 -289 -86 -193 80 133 -243
3601 -243 86 -178 -153 -219 -283 -42 30 -18 249 208 93 64 300 553 181 -118 384 298 -526 1 -107 907
3623 907 -203 -363 296 644 -9 377 -605 65 -212 -536 323 -27 -173 -344 455 -192 -274 128 39 433
3643 433 -251 180 213 181 46 51 381 213 -63 -147 7 114 -219 -196 188 -47 -608 -161 -228 -192 -248 -289 252
3666 252 70 -329 54 397 -83 152 -116 21 221 -382 343 252 199 247 -96 248 64 -233 -112 243 -213
3687b13P5R6L4K9o10N94j74l1K94J40k90J47o11P62J11n60J36J1L23J51l26J25
3709B13k14l9j2K64k61J02J89n95M51l47J6J20O7j24p5J80J13k62P4N64q9k63
3731G2j65J83L38m77J63k03L6K42l99J01K43j07k20K44P5J73m68j20N33j68k97
3752b21M77k12n4r7O5K41k74L1J58l22M78l61K70J72j79j89J87jl03J69l2k5j0
3775c2L5m3k9K78k67j15M45L8n26M73j92L12l59j1L40k60j53o5J50k96r2N39j1
3798A59L8m96K87K37k48J21k64K30K67m71L20l43M2K89j10p6J08l13L15k7k40
3819a75P9m4R1K43m48L28M84n98K55j24j2j60k86L50J86l08mn8K10M6j15m0M57
3842C57k22j13r7R7O6l93L91K60l38j11K99K9m09j06M37O3k48N3m2M0R0j04m4
$$ plain form
3687 -213 -138 -42 -8 21 -589 5 -169 -200 94 234 -56 91 -520 242 353 -207 -71 -60 263 414 88 213
3709 213 -1 -40 -52 212 -49 53 242 -353 98 -249 -233 -113 -46 -170 -245 -65 48 -214 -140 424 335 72
3731 72 -93 90 428 -49 114 -89 -53 189 -210 -109 134 27 -193 51 126 299 -169 -289 244 76 -221
3752 -221 256 44 -10 -107 -42 199 -75 -44 114 -208 270 -91 179 351 172 -17 170 169 -134 35 3 -22 -32
3775 -32 3 -40 -69 209 -58 -173 272 310 -216 257 65 377 18 7 347 87 -66 -131 19 -277 -369 170 159
3798 159 197 -299 -12 225 -23 98 -166 64 331 -140 180 -163 -121 168 58 -18 90 -223 92 65 -175
3819 -175 -96 -140 -49 194 -254 74 558 -40 215 91 79 -81 -367 -17 169 -139 -143 -201 9 55 -60 -100 357
3842 357 135 22 -75 22 88 -305 86 346 8 -103 196 225 -184 -290 147 210 -38 15 -27 13 103 -1 -45
3865d5K57m16P4J91M9j13j39J95R0k16k30M69j60on5p5M27l35J17J27k46Pkk00
3889b35L76j72m98M17K39K09l53k6O7l51N3L05m8j0j36L76j96J26l09oK43j88
3911a17J04j52K53k44q6M69m4m87L30l63L99j55r8L18k8k29j99N83m3m3l73L87
3933A82J07l56j32Q0N08k67k96L12j8k61J73j79L92j55l75J99R5j88K45P6j68
3954b6p1k55N03k4k72K8L04l79J10j07J73K12j78j64J43o1L1M1J10J8k79m4L03
3977A16m05L23k13j29M22k79k0M21l70K69l16L7M22k83l89M95K95l97L9J2K40
3998B90k98p3j21L63k47Q5k0L90m47K9K11k11m4K52K6L13n70j68M14o5l51L82
4020A40k95J7Q3k68O94q2k41M1Q5n0J25n64N47l63j28M27l26K4L20k39J72R8n04
$$ plain form
3865 -45 212 -204 -130 61 110 -3 -142 53 143 -73 -303 166 6 0 -55 -130 297 -38 79 206 -40 -33 -35 -235
3889 -235 141 -31 -529 -112 127 336 -17 -43 24 -327 -274 31 -17 -27 -163 213 17 143 -166 -172 71 -117
3911 -117 -13 -165 88 -156 -242 227 183 -304 26 -337 62 -93 -191 127 99 -130 -329 254 211 168 -205 182
3933 182 289 -67 -199 -119 389 122 -174 138 120 -141 32 -147 245 90 -285 -86 9 -179 66 142 -26
3954 -26 -97 -352 151 127 -145 -117 187 -192 -82 -189 -16 196 18 -146 -3 -64 -33 8 118 136 -143 -187 116
3977 116 -289 34 -179 -308 114 -165 -185 236 -134 135 -181 -144 278 -5 -394 101 396 -1 38 50 290
3998 290 -8 -81 -202 161 -86 -1 -21 369 -78 -49 162 -49 -93 159 185 498 -72 -240 174 109 -242 140
4020 140 -155 -138 -55 -323 371 289 48 89 174 124 249 -315 232 -131 -259 168 -158 -134 186 -53 119 217 -287
4043b87L04M7O5j64j08J78J01k78L52L1l24J39l3O9O6k73r4K90J72L0n28J93L29
4066B77m84J21M23l35j00N4l1J56k60J05K32j70R7j59K93k02l16K29L80k96j65
4087a51K71J47j62j29m9J30J96l26O5k5L37m31o5J79Q4J98n86M20p9l9j78K72
4109G9o2k12n0K30J17l89l8L59k7K28l86P0M51l59o1L11q1k45N1J44J6j32N4q7
4133a9J76l81K06N5K90m90j93N04N2m07l0L05K61m27o5K46n9j5j25L03m9k6n3
4156E9K06p2r1r0ql6J81l61M38j62m56N62k43L70j31k82L10j54k4J53M2n44K30
4179a03JK06L7o25N89P7l5k54J51J86j48m43J44K49l6j2k51K61L5n79L63K58r1
4202b0k16J06L96p5N4k39J07K3p8Q6N1N7m39K80K64m08j6J39k22J42k17q2O51
$$ plain form
4043 -287 17 64 129 -35 -143 35 136 -142 210 241 -83 56 23 92 158 -115 -209 81 253 283 -245 -52 277
4066 277 -207 -86 337 2 -98 -44 -75 81 -179 -74 158 -12 85 -74 219 17 -299 -70 310 14 -151
4087 -151 120 267 105 -24 -73 57 253 -73 -8 -33 304 -127 -192 -13 71 269 -317 103 24 -15 -193 79
4109 79 17 -195 -245 -15 102 -287 -325 34 7 235 -151 -81 370 11 -50 261 180 -65 -14 130 146 14 68 -19
4133 -19 157 -224 -18 37 327 -163 -356 148 200 -207 -237 68 329 -98 -163 83 24 9 -116 187 138 112 59
4156 59 265 193 102 12 4 -32 149 -212 226 64 -392 170 -73 297 166 -116 194 40 16 169 211 -333 -103
4179 -103 -102 104 141 -484 105 182 147 -107 44 230 82 -361 -217 32 -4 -16 -267 -6 29 -550 -187 71 -20
4202 -20 -236 -130 266 191 245 6 113 136 58 144 195 252 -187 93 357 -51 -67 72 -150 -8 -225 -307 344
4225C44m01j30J95j03J29j64j2K83l58L21jK6J59k82J06O6J3k16k4J50J18j08
4247A11k60K31P4k27K57l79K89l29J17M06l53k33N00j71l32L80j38K77m03KL31
4268A50j4k13q6o9K98J61l49K16N9o6%n2K02j94l44L87j46j46N4R2K31j59m33
4291d21L62K58m20L07MJ56j59j21J10J32j43j47kL28l63j14K35J38N1j87l6K58
4313B26j28k07J24j8P9l54M92k9o5l26J1K50m05K42K17k06K05m25L33K37l28K66
4335A91Q8k02q4J04J03o1j79m8P9k05M96n44J39K40j76j80L18Q6J15k03m5J32
4357A64j66k19K83k37K02j96R3J42j34m4K67k41J53Q3O4J80n59J11j8JPN9k67
4380b72L21k7j71J5nj20Q8l3L32n1l29J31K39J00k17K3M10o17oM27j03P6l05L6
$$ plain form
4225 344 -57 -187 8 -95 34 -130 -142 141 -217 104 103 129 288 6 112 178 191 -25 -49 101 219 111
4247 111 -149 82 156 -71 186 -193 96 -233 -116 290 -63 -296 204 33 -299 81 -57 220 -183 -181 150
4268 150 136 -77 -163 -232 66 227 -122 94 153 87 87 35 237 43 -301 86 -60 -206 -152 -60 171 12 -421
4291 -421 -59 199 -221 86 90 246 87 -34 76 208 65 -82 -84 244 -119 -233 2 140 191 4 -32 226
4313 226 98 -109 15 -3 76 -278 214 185 120 -206 -195 55 -350 -108 109 -97 108 -317 16 253 -75 191
4335 191 279 77 -7 97 200 139 -40 -88 -9 -214 282 -262 -123 117 -59 -239 79 165 280 77 32 164
4357 164 -2 -221 62 -175 27 -169 -76 66 -68 -112 155 -86 67 150 214 394 -165 -54 -72 -71 -64 -5 -272
4380 -272 49 22 -149 -134 -139 -259 -171 -204 128 77 -252 -121 118 218 1 24 434 -183 -189 238 135 211 -94 -58
4404e8N3M1j19L3J72j85k5%J71k98p5M10l8l69nN22j90r1Q3lJ61pKj50K53j23
4430A65p8J54J03n02K53j45R1J73m28R3K68m87J90JK87l46P2K20P9k71k4J13K83
4453B64j36k59J29L11M7m39M5J36k06J74l03K13l50K25k6R4L07n73N06L12l19
4474A52k95K56j25Kj96M9L90l16k77K49J23L57l46p2J94M9j91J50J15j55j28q0
4496i5J61j66j81j1M65k45j22J43O9j14p3L57k57j00M77l13R9O3l45j1K57j15
4518e7J0q6K12j42q5J01L51l37r0J26k0J73k64K11J8j07r1J19k00K65m41K16L11
4541A93j21j8J53j07J16k77M13k46j35j3K64j45o1k30J10J08k0q0P2J81l18L7
4563a24L39l3l79K67MM6K6l88L94N0m04J52k4j2j6L42k02Pl14Q8M11l2J85j30
$$ plain form
4404 -58 -5 36 -83 -50 122 -63 -88 -88 83 -215 -290 120 82 -287 -292 230 40 -51 32 29 190 183 185 35 288 165
4430 165 87 241 344 -158 95 -50 41 214 -214 -121 147 -340 -150 -149 138 -208 -136 84 163 -108 -132 -19 264
4453 264 128 -131 -2 309 356 -83 -38 98 -108 66 -237 -24 -374 -149 -175 -81 226 -347 159 471 152
4474 152 -143 113 -12 -10 -206 -157 233 -83 -360 -111 12 369 23 -49 145 194 3 153 268 113 -15 -95
4496 -95 66 -100 -281 -292 173 -72 -194 -51 18 -96 -169 188 -69 -169 308 -5 94 157 -188 -199 58 -57
4518 -57 -47 -133 79 -63 -148 -47 304 -33 -123 3 -17 156 -108 103 121 14 -77 42 -158 107 -334 -118 193
4541 193 72 54 207 100 216 -61 352 106 -29 -42 222 77 16 -214 -104 4 -16 -96 -24 157 -161 -124
4563 -124 215 182 -197 70 74 120 146 -242 152 202 -202 -50 -74 -86 -102 240 38 45 -269 -181 230 198 383 253
4587B53k8j44r9NLJ25Q3m47J83K26k82O4R9r7J99k72J39j59j14K39J27j37J72
4610A38l49K62L02k60j85J66q1J98j98j60N02m47l2K87O3k21j27k11M96k83Q3
4631e7J59p1k29P7J87J37j69q4J53j10R4r3Q8k30M3j83L74l6j16j82L58K30k58
4654H2k56L25k21n7pj2K45j88k2K51j45j44J67J16q5j79n7L37J01j40m92N36J14
4677B69l95k2J11J17k53M58p5j59k70L33Rk0j00j4O0p9J2l33K0M26J4j86K72m5
4701A50j4k23k4M38m60J22J23j95K68n46M40J61O70j251K85k5j67M23Q45q24l81
4722a85n75J073k30l83k29J05P16m8r49J277j14l86j03n12O16k15n9M15k53M3
4742Dj84K54m38Q6l46Q13L74j048P07l81k81M4P07l34M93n49R9k29J181o91K8
$$ plain form
4587 253 225 81 -18 -13 -10 115 198 -249 -66 160 -122 -58 41 -56 143 -129 10 -149 -263 -24 103 -34 138
4610 138 -211 51 353 93 -92 74 -7 191 -7 -167 335 -112 -144 143 206 -15 -142 -353 143 -140 -57
4631 -57 102 31 -198 -121 66 203 34 -50 103 -7 87 -6 82 -148 -105 -288 86 50 -66 -248 110 340 82
4654 82 -174 151 -70 -127 -134 -146 99 -89 -111 140 -5 -149 18 134 49 -130 -187 150 251 111 -381 155 269
4677 269 -126 -148 -37 80 -173 285 210 51 -219 114 123 103 3 -11 49 -30 -18 -351 -331 95 109 -77 195 150
4701 150 136 -87 -111 327 -133 -11 112 -83 185 -361 79 240 910 -341 -56 -81 -248 175 1020 196 -185
4722 -185 -760 313 83 -300 -529 -424 292 244 -705 572 458 72 -31 -543 73 -142 -201 214 -39 4
4742 4 -180 74 -364 -278 -624 189 563 -485 222 -159 -440 -396 311 -23 470 -79 20 -209 972 281 309
4763C09l34j03K93m0K51Q0p89N53k91P93p93L07q11J135l85p12N69r6n3j76K10
4784h3N92p97M14m6J35j18k31n7P45j9o25N38m09j81O9OK30l03k53L85l4O8k24
4807a98M51o75L09M19n24n0j9P73K78j046L26J0m43J52l20Q55n77m1J91o5k36
4828d30O84Q6j22L05p33Q21j23o81L58k01K46L41m07m83l00M5N93Q4N29j223q0
4849f91J193l32M3O24n56r4Q9j24m04j96O45L06j165J417j147N07r62P88k05n96
4869h60R21J62j11K15kk05N15o97l91K00j00l77p7J197q49L33M67j437J554n85
4889a27J11k57O10p60k77RR28k11M39n62J6q50Q48K73n72K53m73J009J38p22P14
4910E37M53n20m09p32R6J025J8j189n68J404n41P1J70J438j875q5P34J64j58O07
$$ plain form
4763 309 -25 -128 165 125 376 456 -333 220 -71 722 -71 236 -575 560 175 -537 32 -64 -117 -293 -83
4784 -83 509 -288 126 80 215 97 -134 -191 554 535 -90 448 39 -142 -73 -67 163 -140 -393 -8 -42 26 -198
4807 -198 253 -422 -113 306 -218 -268 -287 486 764 -282 44 54 -389 -237 -557 298 -279 -320 -129 -194 -430
4828 -430 254 340 218 523 -210 611 488 -193 165 -36 210 551 144 -339 -639 -594 -1 83 612 -611 -691
4849 -691 502 170 213 837 281 187 276 152 -252 -448 197 503 -662 755 -392 115 -847 -59 -264 -860
4869 -860 61 223 112 327 325 120 635 -62 -453 -253 -353 -730 -807 390 -459 -126 341 -1096 458 -127
4889 -127 -16 -273 337 -423 -700 -691 237 26 465 -97 -81 -931 -83 190 -382 -129 -602 407 545 -177 537
4910 537 990 470 61 -671 -575 450 468 -721 -1289 115 -426 -355 -185 1253 -622 -707 27 191 33 640
4930F40j158j41P34n92J350M87j637m8p01J240j385J941j752J591M23j834J302
4947D60M7q0N36j00k284P93J8O45P3o46Q24j513J717q87P64r37Q09L05n8Q44r13
4968D17n66J83l61P28j008P3n66J729r90j175J768q13j33M75J101j252K85j431
4986a536N35K027J59r44N90J90q98P67k66m40k06j133N50r04K018j131N29L93
5004C00n79o37R42R63K82k172j90K197r26j348K036K53l76M58M32j082p07L27
5022A73j59O83r10L53J37j1j388J333q14j01L87M5L05J120r48j936J768Q54j191
5041c00m75O94J030j336n15M69J321q08P61n43O31r97q49J774j229J568j275J157
5059A078p20n81j24m93M49N28p10Q98J72q85L37k74N71O81j34p8j540R22M96j125
$$ plain form
4930 640 -518 -659 75 -517 833 1320 -317 -365 -1066 174 -1211 730 -1022 569 992 -842 460
4947 460 507 427 963 863 -1421 -628 -610 35 108 -538 286 -1227 490 -397 367 -570 239 544 486 1330 417
4968 417 -149 34 -327 401 -607 -534 -1100 629 -361 -1536 232 -581 -714 -239 862 -390 -105 -1536
4986 -1536 -1001 1026 1185 241 831 1021 123 890 624 184 -22 -1155 -605 -1509 509 -622 -93 300
5004 300 -279 -916 26 989 1271 -901 -1091 1106 180 -1168 868 1121 745 1203 1635 553 -154 173
5022 173 14 697 -213 140 277 266 -1122 211 -603 -704 -317 -272 33 1153 205 -1731 37 891 -300
5041 -300 -775 -81 949 -387 -902 -433 888 80 841 298 929 -68 -917 857 -372 1196 -79 1078
5059 1078 358 -223 -347 -840 -391 137 -573 325 497 -388 -51 -325 246 927 793 715 -825 97 593 -532
5079e32J93n21J723j196O51%m89k61L20J193j224l73P7K77P37l42R81j925J79
5098e32J50J129n80L57j19j2q12J14P36j8r51O93M90j366N69j111J634k53M5j272
5118a109J560r13N53n74J76N62L35p69J056o33l30J080j274l95L00m47J413p82
5136a91q10N71J593j333o74N63P6N69m08j168J226j16k98J269j196P67r88P68
5154B20J3p6n00Pl21J349n43J50m64n06P10o52L64Q13r26O85o29o25L42P95n9
5175A47J22l43J53L92q24Q32k0j352J429K74j305K34o68J426j019N43M55j185
5193g09n41L79J521n98j66M81m3j168P65l0L57n49Q05m6l44J81l92J90M31q12
5213b88j69M78Q6l07j52K15mL80o09Q59J41q29l11L46L34j017O59m06P65K09k33
$$ plain form
5079 -532 -339 -860 863 -333 318 318 -171 -432 -112 1081 -143 -516 -439 -162 575 233 1214 -711 -532
5098 -532 -382 747 167 524 405 393 -419 -305 431 413 -538 155 645 -721 -152 -1263 371 118 163 -1109
5118 -1109 451 -462 91 -483 -307 255 590 -179 877 244 -86 994 -280 -675 -375 -822 591 -191
5136 -191 -1001 -430 1163 -170 -844 -281 -205 364 -44 -1212 14 -102 -400 869 -327 440 -548 220
5154 220 233 157 -343 -336 -657 692 149 299 -165 -671 39 -613 -249 564 -362 323 -306 -931 -589 206 147
5175 147 269 -74 79 471 -353 479 459 -893 536 810 -495 -261 -929 497 -522 21 476 -709
5193 -709 -1250 -871 650 52 -114 367 324 -844 -79 -109 248 -301 504 458 114 295 -97 93 524 -288
5213 -288 -457 21 107 -200 -352 -137 -141 239 -370 489 630 -199 -510 -164 170 -847 -188 -594 171 380 147
5234A47k09m3L70k24J63n6r9j06LK85q84J050n41M7O4L04k42K71m63K5K35j2l29
5257b44r2K73L24l84j63M30p7K43K1m84K64M29p54P9L74p12N31l93Q50r4p37N04
5279A88J1K54n95n90L21K99m94Q90k86l13O57j033J672o06n56N78o30k30O62j08
5299I1L46r62K92O25m7m29k84L47k15o5N16l27J0P03m44K92m56o61k68J06P92
5320c8j014J014J46m22m87R04j92K82l64m1M08K70Q4K43k35r74L54l47M15o59
5340f53N96O91q16l56O0N39J14n48M72l7L27m19n77O04k45J70m73kL67J60j46
5361a72J00K85P4j137J262P22p01j05R6m27L45m83J44k1l00k91L34N39n57j61
5381d54K56R9p60N52L87k47K99k61n5K79l76lP56l41m02M18n3J30k43k60o04J148
$$ plain form
5234 147 -62 -105 265 41 204 148 49 -57 -54 231 -653 397 -144 -97 -33 271 29 300 -163 -138 97 85 -244
5257 -244 -336 -63 261 -123 -286 144 67 310 331 -153 111 540 -214 -135 239 -473 58 -335 515 421 -316 188
5279 188 199 453 -142 -732 -411 -112 -606 284 -2 -315 342 -691 981 375 -181 397 -233 -463 199 91
5299 91 437 -525 -233 392 345 -84 -368 -21 -236 -301 215 -112 -102 601 157 449 -7 -668 -936 -830 -38
5320 -38 -1052 -38 108 -314 -801 103 -89 193 -171 -212 196 466 550 793 558 -416 -62 -409 6 -653
5340 -653 -57 634 -182 -538 -478 61 175 -373 99 62 389 -30 -607 -3 -248 -78 -551 -553 -186 -26 -172
5361 -172 -72 213 287 -850 412 1134 433 328 424 -3 342 -141 3 -18 -318 -609 -275 264 -293 -454
5381 -454 -198 -99 -859 -307 80 -167 132 -129 -184 95 -281 -284 472 131 -271 147 94 224 -19 -279 -883 265
5403B65K73m65M91j175N18K11p5K97k10j30k56l48O98j27p57Q65J47o14L35P8
5423B1K83j34l55M35l80K60k1o7N43o90J24J63K68j082M67k12M6J83J2K82K1k70
5445a03M06N5r28J080n55JJ98k21L5j60o5R8J43j67M6J83J94l1p41O61k64J68
5467C3J68m70O1N37q27J23L73R3m39O00j47nl80K60j71M41n24K98O6K5m69r1N80
5490A35n19N70l56J2L22j30LJ67l57K27l92K68K49j74Qk56J89L14j81j58L43p53
5512d69K16N74r02O20k75K13R1Nl61L26q2j83M72k46J23K00m05J9M20n42K97n08
5534c97Q19j85l37j95J59o1J82K13n4p2n2j92K45l64M42j99LL1l06K77J76l83
5556b50J05J23N8j46J88l52L41q2q5m5K95q1k42K7L47k88P3J97k6j0l75K42m2
$$ plain form
5403 265 538 73 564 -611 -93 118 43 340 130 0 -256 -604 94 -33 -790 75 222 -392 -57 21
5423 21 304 170 -185 250 -130 130 109 42 585 -105 19 182 450 -632 -165 -377 -331 -148 -136 146 167 -103
5445 -103 303 358 -570 510 -45 -44 154 -67 -32 -192 -257 -159 -16 -183 -137 46 240 209 -532 129 -135 33
5467 33 201 -269 -208 329 -498 -375 -2 91 -348 252 105 100 -280 -20 -191 250 -274 24 90 115 -354 -445 135
5490 135 -384 186 -170 -158 164 34 37 204 -153 74 -318 -50 199 25 33 -223 -34 280 99 -59 284 -469
5512 -469 -253 321 -581 39 -236 -23 68 73 -288 38 -44 -227 245 -1 122 322 -83 -64 356 -186 111 -397
5534 -397 422 237 -100 -295 -136 -197 -15 198 144 72 20 -172 73 -291 151 -48 -45 -14 -320 -43 133 -250
5556 -250 -145 -22 36 -110 78 -274 67 -15 -100 -145 150 69 -173 -146 201 -87 -14 183 157 147 -228 14 -28
5579b8n2R7J08j77K1K6r8K48l75L7L81j86p4M9j13M14j51l0m2k50K52k89J22M02
5603B92m84R7J19Q9j65J6k06N26m46m2K15J2J92k50n3K37j9l18J84J2m9J64J90
$$ plain form
5579 -28 -80 17 125 -52 -31 -5 -103 145 -230 -193 188 2 -72 -23 -136 278 127 97 55 -195 57 -232 -110 292
5603 292 -192 -95 24 113 -52 -36 -242 284 -162 -204 11 23 215 -35 -88 149 130 -188 -4 8 -41 123 313
$$ [...]
8191A79
##END NTUPLES=NMR FID
##END=
