##TITLE=1H_Pr T-Am-CF
 CDCl3
 8 sc, 
 15.12.2021
##JCAMPDX= 6.0         $$ Bruker NMR JCAMP-DX V2.0
##DATA TYPE= NMR FID
##DATA CLASS= NTUPLES
##ORIGIN= UXNMR, Bruker Analytische Messtechnik GmbH
##OWNER= root
$$ XWIN-NMR		Version 3.5
$$ Wed Dec 15 13:52:42 2021 Russian Standard Time (UT+4h)  she@DPX200
##.OBSERVE FREQUENCY= 200.131346
##.OBSERVE NUCLEUS= ^1H
##.DELAY= (6, 6)
##.ACQUISITION MODE= SIMULTANEOUS
##.ACQUISITION SCHEME= undefined
##.AVERAGES= 8
##.DIGITISER RES= 18
##SPECTROMETER/DATA SYSTEM= spect
##.PULSE SEQUENCE= zg30
##.SOLVENT NAME= CDCl3
##.SHIFT REFERENCE= (INTERNAL, CDCl3, 0, 15.7039)
##AUDIT TRAIL= $$ (NUMBER, WHEN, WHO, WHERE, WHAT)
$$ ##TITLE= Audit trail, XWIN-NMR		Version 3.5
$$ ##JCAMPDX= 5.01
$$ ##ORIGIN= Bruker BioSpin GmbH
$$ ##OWNER= she
$$ F:/spectra/data/she/nmr/H-F/1/audita.txt
$$ ##AUDIT TRAIL=  $$ (NUMBER, WHEN, WHO, WHERE, WHAT)
(   1,<2021-12-15 13:51:37.40 +0400>,<she>,<DPX200>,
      <created by zg, POWCHK disabled, PULCHK disabled
       configuration hash MD5:
       00 E9 B6 7A A2 85 ED C7 34 08 36 98 17 FE 4E 26
       data hash MD5: 16K
       58 BA 0E 08 F8 6D 83 DD 9D 3A E4 E3 5E 7E A8 7A>)
$$ ##END=
$$ 
$$ hash MD5
$$ DA 0D DA A3 2B E7 6C F3 9C B2 14 B0 B3 2D F6 F5
##$RELAX= 
##$RELAX= 
##$RELAX= 
##$RELAX= 
##$RELAX= 
##$RELAX= 
$$ Bruker specific parameters
$$ --------------------------
##$DU= <F:/spectra>
##$EXPNO= 1
##$NAME= <H-F>
##$PROCNO= 1
##$TYPE= <nmr>
##$USER= <she>
##$AMP= (0..31)
100 100 100 100 100 100 100 100 100 100 100 100 100 100 100 100 100 100 
100 100 100 100 100 100 100 100 100 100 100 100 100 100 
##$AQSEQ= 0
##$AQ_mod= 1
##$AUNM= <au_zg>
##$AUTOPOS= <>
##$BF1= 200.13
##$BF2= 200.13
##$BF3= 200.13
##$BF4= 200.13
##$BF5= 200.13
##$BF6= 200.13
##$BF7= 200.13
##$BF8= 200.13
##$BYTORDA= 1
##$CFDGTYP= 0
##$CFRGTYP= 5
##$CHEMSTR= <none>
##$CNST= (0..31)
1 1 145 1 1 1 1 1 1 1 1 1 1 1 1 1 1 1 1 1 1 1 1 1 1 1 1 1 1 1 1 1 
##$CPDPRG= <>
##$CPDPRG1= <>
##$CPDPRG2= <>
##$CPDPRG3= <>
##$CPDPRG4= <mlev>
##$CPDPRG5= <mlev>
##$CPDPRG6= <mlev>
##$CPDPRG7= <mlev>
##$CPDPRG8= <mlev>
##$CPDPRGB= <>
##$CPDPRGT= <>
##$D= (0..31)
0 1.2 0 0 0 0 0 0 0 0.06 0 0.03 0 0 0 0 0.0002 0 0 0 0 0 0 0 0 0 0 0 0 
0 0 0 
##$DATE= 1639561897
##$DBL= (0..7)
120 120 120 120 120 120 120 120 
##$DBP= (0..7)
150 150 150 150 150 150 150 150 
##$DBP07= 0
##$DBPNAM0= <>
##$DBPNAM1= <>
##$DBPNAM2= <>
##$DBPNAM3= <>
##$DBPNAM4= <>
##$DBPNAM5= <>
##$DBPNAM6= <>
##$DBPNAM7= <>
##$DBPOAL= (0..7)
0.5 0.5 0.5 0.5 0.5 0.5 0.5 0.5 
##$DBPOFFS= (0..7)
0 0 0 0 0 0 0 0 
##$DE= 6
##$DECBNUC= <off>
##$DECIM= 32
##$DECNUC= <off>
##$DECSTAT= 4
##$DIGMOD= 1
##$DIGTYP= 9
##$DL= (0..7)
0 120 120 120 120 120 120 120 
##$DP= (0..7)
150 150 150 150 150 150 150 150 
##$DP07= 0
##$DPNAME0= <>
##$DPNAME1= <>
##$DPNAME2= <>
##$DPNAME3= <>
##$DPNAME4= <>
##$DPNAME5= <>
##$DPNAME6= <>
##$DPNAME7= <>
##$DPOAL= (0..7)
0.5 0.5 0.5 0.5 0.5 0.5 0.5 0.5 
##$DPOFFS= (0..7)
0 0 0 0 0 0 0 0 
##$DQDMODE= 0
##$DR= 18
##$DS= 0
##$DSLIST= <SSSSSSSSSSSSSSS>
$$ [...]
##$SUBNAM2= <"">
##$SUBNAM3= <"">
##$SUBNAM4= <"">
##$SUBNAM5= <"">
##$SUBNAM6= <"">
##$SUBNAM7= <"">
##$SUBNAM8= <"">
##$SUBNAM9= <"">
##$SW= 18.0517287032376
##$SWIBOX= (0..15)
0 0 2 0 0 0 0 0 0 0 0 0 0 0 0 0 
##$SW_h= 3612.71676300578
##$TD= 16384
##$TD0= 1
##$TE= 0
##$TE2= 300
##$TE3= 300
##$TEG= 300
##$TL= (0..7)
0 120 120 120 120 120 120 120 
##$TP= (0..7)
150 150 150 150 150 150 150 150 
##$TP07= 0
##$TPNAME0= <>
##$TPNAME1= <>
##$TPNAME2= <>
##$TPNAME3= <>
##$TPNAME4= <>
##$TPNAME5= <>
##$TPNAME6= <>
##$TPNAME7= <>
##$TPOAL= (0..7)
0.5 0.5 0.5 0.5 0.5 0.5 0.5 0.5 
##$TPOFFS= (0..7)
0 0 0 0 0 0 0 0 
##$TUNHIN= 0
##$TUNHOUT= 0
##$TUNXOUT= 0
##$USERA1= <user>
##$USERA2= <user>
##$USERA3= <user>
##$USERA4= <user>
##$USERA5= <user>
##$V9= 5
##$VALIST= <valist>
##$VCLIST= <CCCCCCCCCCCCCCC>
##$VD= 0
##$VDLIST= <DDDDDDDDDDDDDDD>
##$VPLIST= <PPPPPPPPPPPPPPP>
##$VTLIST= <TTTTTTTTTTTTTTT>
##$WBST= 1024
##$WBSW= 4
##$XGAIN= (0..3)
0 0 0 0 
##$XL= 0
##$YL= 0
##$YMAX_a= 201014
##$YMIN_a= -204846
##$ZGOPTNS= <>
##$ZL1= 120
##$ZL2= 120
##$ZL3= 120
##$ZL4= 120
##$ABSF1= 10
##$ABSF2= 0
##$ABSG= 5
##$ABSL= 3
##$ALPHA= 0
##$AQORDER= 0
##$ASSFAC= 0
##$ASSFACI= 0
##$ASSFACX= 0
##$ASSWID= 0
##$AUNMP= <proc_1d>
##$AZFE= 0.1
##$AZFW= 0.1
##$BCFW= 1
##$BC_mod= 2
##$BYTORDP= 1
##$COROFFS= 0
##$CY= 11.3945322036743
##$DATMOD= 1
##$DC= 2
##$DFILT= <>
##$DTYPP= 0
##$F1P= 2.36226072786647
##$F2P= -0.459571619588291
##$FCOR= 0.5
##$FTSIZE= 0
##$FT_mod= 4
##$GAMMA= 1
##$GB= 0.15
##$INTBC= 1
##$INTSCL= 1
##$ISEN= 128
##$LB= 0.24
##$LEV0= 0
##$LPBIN= 0
##$MAXI= 10000
##$MC2= 0
##$MEAN= 0
##$ME_mod= 0
##$MI= 1.114404
##$NCOEF= 0
##$NC_proc= 0
##$NLEV= 6
##$NOISF1= 3.799351
##$NOISF2= 2.8
##$NSP= 1
##$NTH_PI= 0
##$NZP= 0
##$OFFSET= 15.70392
##$PC= 1
##$PHC0= -15870.18
##$PHC1= 8.60079
##$PH_mod= 1
##$PKNL= yes
##$PPARMOD= 0
##$PSCAL= 0
##$PSIGN= 0
##$REVERSE= no
##$SF= 200.130013532006
##$SI= 16384
##$SIGF1= 3
##$SIGF2= 2
##$SINO= 400
##$SIOLD= 16384
##$SREGLST= <1H.CDCl3>
##$SSB= 0
##$STSI= 0
##$STSR= 0
##$SW_p= 3612.71676300578
##$SYMM= 0
##$S_DEV= 0
##$TDeff= 0
##$TDoff= 0
##$TI= <>
##$TILT= no
##$TM1= 0
##$TM2= 0
##$TOPLEV= 0
##$USERP1= <user>
##$USERP2= <user>
##$USERP3= <user>
##$USERP4= <user>
##$USERP5= <user>
##$WDW= 1
##$XDIM= 8192
##$YMAX_p= 0
##$YMIN_p= 0
$$ End of Bruker specific parameters
$$ ---------------------------------
##NTUPLES= NMR FID
##VAR_NAME=  TIME,          FID/REAL,        FID/IMAG
##SYMBOL=    X,             R,               I
##VAR_TYPE=  INDEPENDENT,   DEPENDENT,       DEPENDENT
##VAR_FORM=  AFFN,          ASDF,            ASDF
##VAR_DIM=   8192,          8192,            8192
##UNITS=     SECONDS,       ARBITRARY UNITS, ARBITRARY UNITS
##FACTOR=    0.0002768,     1,               1
##FIRST=     0,             0,               0
##LAST=      2.2672688,     0,               0
##MIN=       0,             -204846,         0
##MAX=       2.2672688,     201014,          0
$$ Real data points
##PAGE= N=1
##DATA TABLE= (X++(R..R)), XYDATA
$$ plain form
0 0 0 0 0 0 0 0 0 0 0 0 0 8 -8 8 -8 9 -16 16 -23 24 -32 36 -41 49 -58 71 -81 92 -106 122 -140 161 -183 208
34 208 -234 264 -297 331 -373 414 -461 511 -568 629 -697 768 -848 936 -1030 1135 -1251 1378
52 1378 -1520 1676 -1852 2052 -2274 2533 -2834 3187 -3612 4132 -4784 5636 -6794 8473 -11147
67 -11147 16061 -28174 126472 108864 -59731 127938 201014 87233 -46963 18616 48237
78 48237 -47090 -112463 -83655 -85176 -66562 -52253 -69282 -111441 -81121 26535 57884 -20207
90 -20207 -15525 41955 48963 22964 18971 34766 27907 4985 12201 -17963 -38127 31698 68878
103 68878 4202 -40617 12552 82877 48103 -972 35228 43522 -5397 -23126 -20621 -27695 -46402
116 -46402 -54005 -61087 -102187 -93554 -20925 -15790 -51145 -23213 32685 40206 19450 67415 126583
$$ packed form
0@%%%%%%%%%%%Qj6J6j6J7k5L2l9M7n6O8p7R0j07J29j52J73j98K28k62L01l44L91
34B08m42M98n61O28p04P87q75R72j079J197j326J465j616J784j966K165k386K629
52A378k898L196l528L904m326M807n367O021o799P744q916J0420j2430J5267j9620
67a1147K7208m4235J54646j7608j68595J87669P3076j13781j34196O5579K9621
78D8237r5327o5373K8808j521J8614J4309j7029m2159L0320J07656L1349p8091
90b0207M682N7480P008k5999l993J5795o859k2922P216l0164k0164O9825L7180
103F8878o4676m4819N3169P0325l4774m9075L6200Q294m8919j7729K505p074j8707
116d6402p603p082m1100Q633P2629N135l5355K7932N5898P521k0756M7965N9168
$$ plain form
129 126583 72483 24505 74950 90844 24195 -15424 22360 27161 -64105 -97923 -33968 -22329
141 -22329 -64291 -70756 -42714 -26681 -31708 -6577 22067 5502 13549 43754 24484 -573 20571
154 20571 52343 27965 -28757 -13728 27947 3446 -18623 4386 19929 3857 -10705 13339
166 13339 30263 8702 8617 14721 -8215 -17825 -10247 -10155 -24089 -39583 -30067 -31379 -43624 -19350
180 -19350 432 -8697 -4101 15183 28584 24190 29899 60058 47698 10655 23704 41925 15411
193 15411 -17265 -10111 10540 -24433 -64682 -33415 -2984 -24027 -43630 -29196 189 1387
205 1387 -9138 7449 18374 18201 22695 10874 3951 17203 25317 13008 -14500 -13016 14516
218 14516 4304 -17734 -6589 6939 2076 -10826 -4621 12509 3243 -2442 8896 -1813 -13585
$$ packed form
129A26583n4100m7978N0445J5894o6649l9619L7784M801r1266l3818O3955J1639
141b2329m1962o465K8042J6033n027K5131K8644j6565Q047L0205j9270k5057K1144
154B0571L1772k4378n6722J5029M1675k4501k2069K3009J5543j6072j4562K4044
166A3339J6924k1561q5O104k2936r610P578R2j3934j5494R516j312j2245K4274
180a9350J9782r129M596J9284J3401m394N709L0159j2360l7043J3049J8221k6514
193A5411l2676P154K0651l4973m0249L1267L0431k1043j9603J4434K9385J198
205A387j0525J6587J0925j73M494j1821o923J3252Q114j2309k7508J484K7532
218A4516j0212k2038J1145J3528m863j2902O205J7130r266n685J1338j0709j1772
$$ plain form
231 -13585 -4932 5162 -117 -20834 -17825 2042 -5494 -13071 -1977 4569 6869 3759 4264 11977
245 11977 11515 17801 19169 -24 -1154 10978 8060 -5007 -13486 -3856 -1067 -19680 -17618 -2362
259 -2362 -4759 -8181 -6980 -1829 1706 -766 9373 13351 939 4508 11136 6754 3513 1911 6138
274 6138 2426 -9324 -3269 218 -7292 -4408 -2490 -5706 -8033 -6480 5025 3086 -7268 1714
288 1714 7989 1533 690 3648 11046 7137 -2569 2618 4067 437 3047 -1373 -5255 -3553 -4382 -2973
304 -2973 -6989 -7196 1806 -2904 -9418 -1764 3169 4671 363 -343 8094 3991 -190 7133 5564 1956
320 1956 646 -122 2335 -2178 -3169 3590 -1429 -4917 -860 -913 1644 345 -1752 1515 -2919 -2759
336 -2759 524 -4746 -3976 -2192 -5277 -5353 -6014 -1640 3624 -1706 986 7807 6459 8098 9645 11437
$$ packed form
231a3585Q653J0094n279k0717L009J9867p536p577J1094O546K300l110N05P713
245A1977m62O286J368j9193j130J2132k918j3067q479R630K789j8613K062J5256
259b362k397l422J201N151L535k472J0139L978j2412L569O628m382l241j602M227
274F138l712j1750O055L487p510K884J918l216k327J553J1505j939j0354Q982
288A714O275o456q43K958P398l909r706N187J449l630K610m420l882J702q29J409
304b973m016k07R002m710o514P654M933J502m308p06Q437m103m181P323j569l608
320A956j310p68K457m513r91O759n019l488M057n3K557j299k097L267m434J60
336b759L283n270P70J784l085p6o61M374N264n330K692O821j348J639J547J792
$$ plain form
352 11437 12619 5534 5064 6706 -309 -2159 -4608 -9649 -11193 -14707 -13758 -11358 -14191 -9486 -5758
367 -5758 -5320 732 3879 8039 12381 10451 12537 13735 10217 12231 8612 2459 1752 -2035 -3540 -6061
383 -6061 -10278 -5612 -5418 -9128 -6551 -5045 -1033 1970 -1419 -90 1597 817 3215 -1339 -3855 128
399 128 -1296 -2807 -5005 -4073 3915 3934 359 4405 7452 11971 11680 7424 9384 8658 5229 2946 -3752
416 -3752 -6785 -6280 -11909 -14680 -17498 -17350 -11055 -11016 -10566 -4984 -1063 5903 9587 9845 15157 16087 15083
433 15083 15997 11305 8986 6779 1702 23 -6223 -10618 -8778 -9741 -10238 -10840 -11778 -5170 -1621 -3017
449 -3017 -430 1100 4113 6078 2369 2450 2163 1305 3892 -761 -5406 -2059 2110 4192 -439 -3682
465 -3682 6753 12194 6446 2421 4477 11900 8929 -3366 -4671 -1567 -3722 -8301 -15486 -14810 -10871
$$ packed form
352A1437J182p085m70J642p015j850k449n041j544l514R49K400k833M705L728
367e758M38O052L147M160M342j930K086J198l518K014l619o153p07l787j505k521
383f061m217M666J94l710K577J506M012L003l389J329J687p80K398m554k516L983
399A28j424j511k198R32P988J9l575M046L047M519k91m256J960p26l429k283o698
416c752l033N05n629k771k818J48O295L9M50N582L921O966L684K58N312R30j004
433A5083R14m692k319k207n077j679o246m395J840r63m97o02r38O608L549j396
449c017K587J530L013J965l709Q1k87q58K587m653m645L347M169K082m631l243
465c682J0435N441n748m025K056P423k971j2295j305L104k155m579p185O76L939
$$ plain form
480 -10871 -10852 -9427 -9820 -8086 2056 7201 6073 6799 10743 19510 18534 8777 8453 12236 10425 2763
496 2763 -6510 -4987 -3273 -9680 -12901 -12864 -10952 -7132 -8297 -6113 -2456 -1688 3222 5704 3320 3557
512 3557 4390 6721 5577 -762 597 3233 -391 -2029 -1557 1481 1879 -1317 2912 7033 2450 986
528 986 4830 6827 1925 -6413 -2952 2216 -5798 -12471 -10888 -6272 -5314 -10662 -9092 -1340 495 2308
544 2308 4551 5035 9315 12152 13358 10639 5161 7829 10900 3157 -4552 -5970 -1961 -2979 -12362
559 -12362 -13869 -6888 -5011 -6442 -8259 -5139 2108 2650 1560 2692 3385 6215 6485 3263 2344 1256
575 1256 2729 3680 -1902 -3520 304 2381 1246 -2983 -728 5480 2903 -1298 355 2422 1896 -3201
591 -3201 -4396 -90 -3446 -7633 -5500 -3457 -3723 -6411 -3983 2658 1333 -254 4012 6545 7667
$$ packed form
480a0871J9J425l93J734J0142N145j128P26L944Q767r76r757l24L783j811p662
496B763r273J523J714o407l221L7J912L820j165K184L657P68M910K482k384K37
512C557Q33K331j144o339J359K636l624j638M72L038L98l196M229M121m583j464
528I86L844J997m902q338L461N168q014o673J583M616R58n348J570P752J835J813
544B308K243M84M280K837J206k719n478K668L071p743p709j418M009j018r383
559a2362j507O981J877j431j817L120P247N42j090J132O93K830K70l222r19j088
575A256J473R51n582j618L824K077j135m229K255O208k577m201J653K067n26n097
591c201j195M306l356m187K133K043k66k688K428O641j325j587M266K533J122
$$ plain form
606 7667 6490 5473 7084 5208 3924 3895 -1072 -2970 -1879 -2587 -5075 -8602 -6961 -1787 -4119 -6562
622 -6562 -3869 -412 2544 627 -333 3414 4673 4173 3035 50 2553 4111 1161 -342 -1993 -255
638 -255 1986 -553 -2221 -1162 647 2663 -197 -2552 405 2033 741 -2523 -3769 560 591 -3826
654 -3826 -3648 -1885 -211 -872 -2600 26 1981 900 2696 2586 2281 3518 3002 3177 1726 3 1528
671 1528 592 -1925 -1522 -2437 -2278 -2399 -3624 -1641 -1935 -2101 26 -200 -608 619 1110 2232 1185 280
689 280 2175 1297 323 908 83 321 291 -861 -85 -679 -850 222 -939 -551 235 -551 275 139 -576
708 -576 602 -338 48 673 -836 -87 546 -439 -41 -939 -168 1170 -1038 -521 924 113 475 -441 37
727 37 1347 -163 -185 703 -155 571 42 -604 688 -170 52 123 -1233 218 410 -1297 -179 -290 -191
$$ packed form
606G667j177j017J611j876j284k9m967j898J091p08k488l527J641N174k332k443
622f562K693L457K956j917r60L747J259n00j138k985K503J558k950j503j651J738
638b55K241k539j668J059J809K016k860k355K957J628j292l264j246M329L1m417
654c826J78J763J674o61j728K626J955j081J796j10l05J237n16J75j451j723J525
671A528r36k517M03r15J59j21j225J983k94j66K127k26m08J227M91J122j047r05
689B80J895q78r74N85q25K38l0j152P76n94j71J072j161L88P86p86Q26j36p15
708e76J178r40L86O25j509P49O33r85L98q98P71J338k208N17J445q11L62r16M78
727C7J310j510k2Q88q58P26n29o46J292q58K22P1j356J451J92j707J118j11R9
$$ plain form
746 -191 488 -1064 -43 566 -479 528 84 -261 501 -667 381 75 -1012 70 26 -664 187 -447
764 -447 44 886 17 671 941 549 1511 450 429 1110 173 430 -497 -1452 -248 -1346 -1926 -1281 -1754 -1071
784 -1071 -783 -1413 82 -210 452 1706 1091 1090 1994 1629 1837 1330 423 1426 101 -551 -340 -1098 -720
803 -720 -907 -1653 -1058 -1237 -945 -139 -897 -95 806 73 408 -359 -67 877 -297 -403 459 -323 279 -131
823 -131 -253 981 549 728 1178 533 1602 1484 573 577 24 93 -318 -2143 -1703 -1503 -2489 -2120 -2123 -1803 -918
844 -918 -1240 -218 862 455 1853 2115 1532 2573 2162 2214 1672 483 849 180 -937 -529 -1319 -1816 -1164
863 -1164 -1634 -1171 -1026 -1069 143 -176 -431 460 334 508 651 -19 440 233 -293 551 -355 -440 165 243 837
884 837 328 235 1620 980 708 1288 498 733 -39 -922 -594 -1344 -1571 -1148 -2375 -2137 -1297 -1225 -724 -701 -92
$$ packed form
746a91O79j552J021O09j045J007m44l45P62j168J048l06j087J082m4o90Q51o34
764d47M91Q42q69O54K70l92R62j061k1O81r37K57r27r55J204j098n80O45m73O83
784a071K88o30J495k92O62J254o15jR04l65K08n07r07J003j325o52K11p58L78
803g20j87p46N95j79K92Q06p58Q02R01p33L35p67K92R44j174j06Q62p82O02m10
823a31j22J234m32J79M50o45J069j18r11Mn53O9m11j825M40K00r86L69lL20Q85
844i18l22J022J080m07J398K62n83J041m11N2n42j189L66o69j117M08p90m97O52
863a164m70M63J45m3J212l19k55Q91j26J74J43o70M59k07n26Q44r06q5O05P8N94
884H37n09r3J385o40k72N80p90K35p72q83L28p50k27M23j227K38Q40P2N01K3O09
$$ plain form
905 -92 1277 854 1366 2003 1748 2152 1889 1343 1120 270 359 249 -1296 -1201 -905 -1812 -1281 -1621 -1154 -533 -988
926 -988 -142 445 -279 507 1205 631 140 -244 919 656 -748 -210 220 -386 184 25 94 171 -16 1297
946 1297 1142 -19 774 1057 325 -577 -1366 -82 -298 -1929 -1395 -735 -1028 -426 -1141 -547 228 295 1357
965 1357 736 514 1943 1744 1346 1082 388 1001 475 -639 -513 -1196 -763 -448 -1565 -1555 -609 -232 -86
984 -86 -909 86 1847 209 -232 993 617 268 0 278 720 -824 -598 544 -226 -677 -304 741 499
1003 499 -802 0 1192 254 -355 558 736 198 -623 -31 265 -1400 -858 153 -286 -987 -717 289
1021 289 886 -292 195 1080 458 676 432 268 468 361 286 138 -738 -28 -211 -928 -550 -787 -333 67
1041 67 -372 -337 -58 173 1037 139 -539 650 1239 331 -558 54 912 -11 -810 25 89 -406 -316 -386 -50
$$ packed form
905i2J369m23N12O37k55M04k63n46k23q50Q9j10j545R5K96r07N31l40M67O21m55
926i88Q46N87p24P86O98n74m91l84J163k63j404N38M30o06N70j59O9P7j87J313
946A297j55j161P93K83p32r02p89J284k16j631N34O60k93O02p15N94P75O7J062
965A357o21k22J429j99l98k64o94O13n26j114J26o83M33L15j117J0R46L77J46
984h6q23R95J761j638m41J225l76l49k68K78M42j544K26J142p70m51L73J045k42
1003D99j301Q02J192r38o09R13J78n38q21N92K96j665N42J011m39p01K70J006
1021B89N97j178M87Q85o22K18k44j64K00j07p5j48q76P10j83p17L78k37M54M00
1041F7m39L5K79K31Q64q98o78J189N89r08q89O12Q58r23p99Q35O4m95R0p0L36
$$ plain form
1062 -50 -433 -415 1048 -69 -718 307 758 62 -564 64 1314 -167 -1032 464 209 -337 -96 288 709
1081 709 -453 -111 950 26 -354 320 330 -44 -536 -354 27 -538 -296 305 -164 -336 41 -52 179 -602
1101 -602 197 628 -12 216 692 238 237 579 167 153 -32 556 339 -917 -43 163 -448 -500 -439 223 -203
1122 -203 -871 -36 215 -492 90 395 179 -258 204 676 78 -345 320 606 -268 -356 -140 409 -474 -1036
1142 -1036 72 -25 -829 -122 250 -162 2 -154 283 51 -402 710 158 -481 96 108 277 -437 -422 414
1162 414 -161 -621 218 -40 -162 79 35 297 -192 -54 647 -242 -355 -81 158 -203 -381 -157 400 -515
1182 -515 -502 389 -112 -71 120 402 168 -44 556 905 33 197 451 180 -195 -68 -235 -94 -888 -382 120
1203 120 -575 -64 131 101 77 43 462 554 -148 511 775 -56 -126 211 58 -86 -472 51 26 -495 -86 125
$$ packed form
1062e0l83J8J463j117o49J025M51o96o26O28J250j481q65J496k55n46K41L84M21
1081G09j162L42J061r24l80O74J0l74m92J82L81n65K42O01m69j72L77r3K31p81
1101f02P99M31o40K28M76m54jL42m12j4j85N88k17j256Q74K06o11n2O1O62m26
1122b03o68Q35K51p07N82L05k16m37M62M72n98m23O65K86q74q8K16N49q83n62
1142a036J108r7q04P07L72m12J64j56M37k32m53J112n52o39N77J2J69p14J5Q36
1162D14n75m60Q39k58j22K41m4K62m89J38P01q89j13K74K39l61j78K24N57r15
1182e15J3Q91n01M1J91K82k34k12O00L49q72J64K54k71l75J27j67J41p94N06N02
1203A20o95N11J95l0k4l4M19R2p02O59K64q31p0L37j53j44l86N23k5n21M09K11
$$ plain form
1225 125 -416 -94 33 220 169 -304 362 270 -93 134 55 -64 -235 -232 153 -257 -513 296 -46 -266 48 162
1247 162 503 217 18 556 124 -312 140 148 -370 -288 -175 -17 -685 -979 77 -224 -234 138 278 124 57
1268 57 354 679 231 140 660 196 -147 277 -111 -85 -544 -417 16 -302 -504 -109 -403 -146 15 237 325
1289 325 -262 268 568 -10 -36 262 -50 -40 -266 -263 161 -456 -150 39 -132 339 66 125 377 41 214 284
1311 284 -10 -72 -152 -215 -577 -449 -181 -323 -383 -364 118 -102 113 367 303 391 216 647 673 164 265 309 -93
1334 -93 87 -292 -155 -107 -484 -335 81 -540 -319 -75 -30 127 -73 482 16 -74 466 10 237 -103 26
1355 26 93 -216 -83 245 -95 -24 65 50 -101 -54 125 327 -32 124 360 -272 -167 -27 -436 -83 -172 -223 -427
1378 -427 -260 -453 73 154 277 334 189 238 19 296 370 245 287 64 -143 11 -69 -393 -14 -405 -381 49
$$ packed form
1225A25n41L22J27J87n1m73O66r2l63K27p9j19j71LL85m10k56Q09l42k20L14J14
1247A62L41k86j99N38m32m36M52Qn18Q2J13J58o68k94J056l01j0L72J40j54o7
1268E7K97L25m48r1N20m64l43M24l88K6m59J27M33l18k02L95k94K57J61K22Q8
1289C25n87N30L00n78k6K98l12J0k26LM24o17L06J89j71M71k73N9K52l36J73P0
1311B84k94o2q0o3l62J28K68j42o0J9M82k20K15K54o4Q8j75M31K6n09J01M4m02
1334i3J80l79J37M8l77J49M16o21K21K44M5J57k00N55m66r0N40m56K27l40J29
1355B6O7l09J33L28l40P1Q9j5j51M7J79K02l59J56K36o32J05J40m09L53q9n1k04
1378d27J67j93N26Q1J23N7j45M9k19K77P4j25M2k23k07J54q0l24L79l91K4M30
$$ plain form
1400 49 -137 -79 -186 -38 -56 22 24 158 42 287 154 146 246 215 -145 131 -85 134 84 -237 114 112 -13 28
1424 28 149 116 231 -244 173 -81 -271 -60 23 -96 -71 -467 137 5 -35 -26 184 71 501 109 242 296 -50
1447 -50 304 9 36 158 -143 -118 -18 -313 -109 -121 -57 63 -320 -54 49 -161 166 -23 -50 251 -132 29
1469 29 272 -189 186 42 -136 159 -202 -28 118 28 77 -23 -159 95 157 -60 257 -230 -194 39 48 8 97
1492 97 -292 -29 -77 -269 5 -90 -168 253 46 52 -259 162 -35 357 123 139 -74 219 204 94 155 -10 -59
1515 -59 -82 -218 4 -104 -186 130 173 -158 51 43 -123 28 -97 38 -115 -323 41 194 -25 70 -185 155
1537 155 67 -327 253 46 48 96 -148 142 71 67 166 251 -94 -92 -215 -192 -22 -7 387 154 -90 -133 -99 160 -39
1562 -39 -261 126 191 -111 149 -67 56 73 27 191 387 -209 56 98 -39 -20 21 -7 69 -249 -81 -66 -192
$$ packed form
1400D9j86N8j07J48j8P8KJ34j16K45j33qJ00l1l60K76k16K19n0l21L51kj25M1
1424B8J21l3J15m75M17k54j90K11Q3j19K5l96O04j32m0RK10j13M30l92J33N4l46
1447e0L54k95K7J22l01K5J00k95K04j2O4J20l83K66J03k10L27j89k7L01l83J61
1469B9K43m61L75j44j78K95l61J74J46r0M9j00j36K54O2k17L17m87L6K33Rm0Q9
1492I7l89K63m8j92K74r5p8M21k07Ol11M21j97L92k34J6k13K93j5j10O1j65m9
1515e9k3j36K22j08q2L16M3l31K09qj66J51j25J35j53k08L64J53k19R5k55L40
1537A55q8l94N80k07KM8k44K90p1mR9Q5l45Kj23K3J70J5L94k33k44m3L4K59j99
1562c9k22L87O5l02K60k16J23J7m6J64J96n96K65M2j37J9M1k8P6l18J68J5j26
$$ plain form
1585 -192 61 40 -113 75 -80 28 37 -128 263 -186 107 246 -127 55 20 -118 154 -73 -69 -19 -7 244 31
1608 31 27 106 -132 -74 14 -27 -26 -130 -107 -128 -264 -106 -52 -426 -54 159 -16 132 251 233 363 83 56 -199 24
1633 24 49 -61 3 122 -88 -10 -96 -235 -106 14 -235 -42 45 87 0 -76 94 39 -103 -112 -48 -170 -40 -323
1657 -323 144 -36 37 41 96 -25 15 241 -217 173 18 65 -26 -36 126 -74 -85 93 -227 -158 -176 -143 -293 -292 -34
1682 -34 151 -148 -64 181 -6 140 54 169 79 183 20 82 57 228 -145 -141 -143 -81 -289 23 -131 7 -138 43
1706 43 248 89 -67 164 82 185 58 -226 -47 -62 -288 70 -143 -68 321 -238 -248 -5 78 -15 -71 83 159
1729 159 29 219 190 143 -45 25 -208 -264 -23 -125 -316 -290 123 150 -127 187 152 152 -205 59 -48 311 28
1752 28 -15 31 108 103 -95 282 -134 -330 -289 83 235 -121 195 126 32 -110 19 162 118 52 85 149 254 -151
$$ packed form
1585a92K53k1j53J88j55J08Rj65L91m49K93J39l73J82l5j38K72k27MN0J2K51k13
1608C1mP9k38N8Q8m1Jj04K3k1j36J58N4l74L72K13j75J48J19j8J30k80k7k55K23
1633B4K5j10O4J19k10P8q6j39J29J20k49J93Q7M2q7p6J70n5j42rO4j22J30k83
1657c23M67j80P3MN5j21M0K26m58L90j55M7r1j0J62k00j1J78l20O9j8L3j50JK58
1682c4J85k99Q4K45j87J46q6J15r0J04j63O2k5J71l73MkO2k08L12j54J38j45J81
1706D3K05j59j56K31q2J03j27k84J79j5k26L58k13P5L89n59j0K43Q3r3n6J54P6
1729A59j30J90k9m7j88P0k33n6K41j02j91K6M13K7k77L14l5%l57K64j07L59k83
1752B8m3M6P7nj98L77m16j96M1L72J52l56L16o9r4j42J29J43m4o6L3O4J05m05
$$ plain form
1776 -151 -187 -49 -152 138 -86 -91 71 -142 62 164 -150 269 -152 -50 145 31 -12 187 94 -211 -9 -166
1798 -166 140 -11 62 53 53 161 -54 -66 87 -76 -21 -45 -44 25 -149 -115 -21 -87 -81 -205 -257 -47 -231 -170 210 154
1824 154 -14 209 161 -48 134 -57 211 -255 -247 110 23 48 -39 -7 152 30 -81 84 8 -27 11 -51 168 41
1848 41 214 324 -99 -65 89 -53 62 352 -9 194 25 -119 15 104 -13 -216 -64 52 10 -305 -53
1869 -53 -89 87 47 91 9 163 -161 32 75 -134 75 -7 -16 -43 -85 27 -100 75 -33 -154 161 45 65 -134
1893 -134 169 -93 47 145 65 -241 -163 134 118 -55 48 107 -40 87 119 -155 121 -42 -97 -48 -71 137 -131
1916 -131 92 -33 -80 -127 104 -45 26 -11 78 153 -46 5 49 -92 -45 -78 -169 -291 -73 46 134 20 49 -91
1940 -91 155 55 -91 5 55 49 266 55 226 306 -198 67 83 108 55 95 -44 111 17 110 93 -63 -33 14 154
$$ packed form
1776a51l6J38j03K90k24nJ62k13K04J02l14M19m21J02J95j14m3J99r3l05K02j57
1798a66L06j51P3r%J08k15j2J53j63N5k4JO9j74L4R4o6Oj24n2K10j84O1L80n6
1824A54j68K23m8k09J82j91K68m66QL57q7K5q7L2J59j22j11J65p6l5L8o2K19j27
1848D1J73J10m23L4J54j42J15K90l61K03j69j44J34Q9j17k03J52J16m2l15K52
1869e3l6J76m0M4q2J54l24J93M3k09K09q2rk7m2J12j27J75j08j21L15j16K0j99
1893a34L03k62J40R8q0l06P8K97j6j73J03N9j47J27L2k74K76j63n5M9k3K08k68
1916a31K23j25m7m7K31j49P1l7Q9P5j99N1M4j41M7l3r1j22K18J19Q8j14K9j40
1940i1K46j00j46R6N0oK17k11J71Q0n04K65J6K5n3M0j39J55r4R3j7j56L0M7J40
$$ plain form
1965 154 133 -197 8 -14 -150 -218 114 49 19 208 179 5 45 -21 61 53 -65 18 -304 -17 117 -144 -173 -238 -74
1990 -74 -83 -71 42 162 3 -258 59 22 -26 170 125 55 19 -110 91 236 -54 109 62 50 -75 108 0 -132
2014 -132 139 155 105 272 -12 112 86 -117 -41 153 188 -125 83 159 -36 -40 -62 -34 221 251 -213 -5 166 -93
2038 -93 141 -22 11 65 -58 11 424 17 -23 -295 -96 5 -318 -119 -44 137 72 -88 196 -87 -22 -64 138
2061 138 -113 128 -19 31 100 -13 46 -33 217 -89 22 63 184 -208 -125 87 127 -138 220 15 -146 -14
2083 -14 -149 190 52 48 48 -105 -234 122 55 164 102 -20 -168 -118 203 279 65 249 -74 107 30 -76 -87 -154
2107 -154 101 173 -142 -186 -149 -3 -279 -110 -77 -19 -58 -335 48 -46 -20 62 -84 225 -132 -26 153 83 -182
2130 -182 -131 45 163 -158 243 -3 -188 -231 -20 188 120 198 80 92 -113 75 284 -259 -79 -158 122 -195
$$ packed form
1965A54k1l30K05k2j36o8L32o5l0J89k9j74M0o6Q2qj18Q3l22K87J34k61k9o5J64
1990g4rJ2J13J20j59k61L17l7m8J96m5p0l6j29K01J45k90J63m7j2j25J83j08j32
2014a32K71J6n0J67k84J24k6k03P6J94L5l13K08P6j95mk2K8K55L0m64K08J71k59
2038i3K34j63L3N4j23O9M13m07m0k72J99J01l23J99P5J81o5j60K84k83O5m2K02
2061A38k51K41j47N0O9j13N9p9K50l06J11M1J21l92Q3K12M0k65L58k05j61J32
2083a4j35L39j38m%j53j29L56o7J09o2j22j48N0L21P6k14J84l23J81p7j06j1o7
2107a54K55P2l15m4L7J46k76J69L3N8l9k77L83r4K6Q2j46L09l57J06J79p0k65
2130a82N1J76J18l21M01k46j85m3K11K08o8P8j18J2k05J88K09n43J80p9K80l17
$$ plain form
2152 -195 -39 -30 -131 -129 -316 130 -44 -1 -24 -114 112 -93 -90 83 -107 232 170 45 -52 -74 -195 316 96 -224
2176 -224 15 -284 29 -33 -105 162 21 -15 3 27 102 -122 -52 -137 -11 -66 -29 247 -183 134 -96 235 94
2199 94 2 144 26 3 -156 -134 -1 16 50 159 -202 -439 150 133 -132 -47 -74 148 -43 -130 -261 47 -181
2222 -181 93 -271 199 -94 -90 337 220 131 163 161 -59 -203 70 114 -192 19 102 -108 -34 -183 0 1 -146 -5
2246 -5 -43 -185 -248 3 -215 -150 -164 -54 -3 -148 -154 -64 39 109 -23 -60 -306 -26 -35 123 -85 143 132 -235 8
2271 8 -72 51 75 94 -77 51 48 -30 58 -3 29 -123 224 129 -56 -52 128 173 77 165 -38 -23 -145 3 -40 -97 -10
2298 -10 -20 -55 326 -90 51 24 9 90 -53 -68 -115 7 30 -52 -81 -205 -98 138 51 47 38 99 62 71 92 -420 -41
2325 -41 -177 -142 -58 115 -105 -260 33 40 158 -33 -4 -100 208 -58 174 79 -7 -180 -3 -56 227 160 -26 187
$$ packed form
2152a95J56Rj01Kj87M46j74M3k3r0K26k05LJ73j90L39o2j25r7k2j21N11k20l20
2176b24K39k99L13o2p2K67j41l6J8K4P5k24P0q5J26n5L7K76m30L17k30L31j41
2199I4r2J42j18k3j59K2J33J7L4J09l61k37N89j7k65Q5k7K22j91q7j31L08k28
2222a81K74l64M70k93MM27j17q9L2kk20j44K73M4l06K11Q3k10P4j49J83Jj47J41
2246el8j42o3K51k18O5j4J10N1j45oR0J03P0j32l7k46K80rJ58k08K28j1l67K43
2271Hq0J23K4J9j71J28lp8Q8o1L2j52L47r5j85MJ80M5r6Q8k03J5j22J48m3n7Q7
2298a0j0l5L81m16J41k7j5Q1j43j5m7J22K3q2k9j24J07K36q7mrO1l7RK1n12L79
2325d1j36L5Q4J73k20j55K93PJ18j91K9r6L08k66K32r5q6j73J77n3K83o7j86K13
$$ plain form
2349 187 145 15 123 -177 163 35 -149 81 -80 -216 -11 80 -13 81 -174 34 14 41 2 41 -115 252 43
2372 43 -106 -14 -162 -192 158 118 -205 -106 -175 51 -38 254 158 7 -215 -99 -233 91 -172 167 19 25 -4 -42
2396 -42 -127 223 24 48 185 92 1 135 -1 123 87 -374 171 -203 -39 77 84 -37 5 5 218 -86 -23 -93
2420 -93 -55 -117 63 156 210 -70 -43 75 -200 51 -124 -9 -84 -154 -103 -142 -122 -115 92 -147 56 49 65 -210 -98
2445 -98 76 202 41 -105 -30 -123 79 67 18 -63 37 32 141 -27 -60 -84 -222 -137 -134 218 115 -32 -118 250 -211
2470 -211 -97 -16 169 156 -194 -26 59 124 -81 51 103 -162 -249 74 -19 24 -386 87 136 36 11 64 9 -189
2494 -189 -158 -8 77 -74 27 50 -182 59 -5 -187 3 6 88 -5 5 -11 -87 87 -86 -22 -89 -58 -6 -146 -142 257
2520 257 2 128 139 50 178 -172 -128 -32 67 -109 -43 181 13 148 77 144 30 -22 20 140 -71 3 -123 -94
$$ packed form
2349A87m2j30J08l00L40j28j84K30j61j36K05R1r3R4k55K08k0K7l9L9j56L67k09
2372D3j49R2j48l0L50m0l23R9o9K26q9K92r6j51k22J16j34L24k63L39j48Ok9l8
2396d2q5L50j99K4J37r3r1J34j36J24l6m61N45l74J64J16Pj21M2%K13l04O3p0
2420i3L8o2J80R3N4k80K7J18k75K51j75J15p5p0N1l9K0PK07k39K03pJ6k75J12
2445i8J74J26j61j46P5r3K02j2m9q1J00nJ09j68l3k4j38Q5LL52j03j47q6L68m61
2470b11J14Q1J85j3l50J68Q5O5k05J32N2k65q7L23r3M3m10M73M9j00k5N3n5j98
2494a89L1J50Q5j51J01K3k32K41o4j82J90LQ2r3J0j6p6J74j73O4o7L1N2j40ML99
2520B57k55J26J1q9J28l50M4R6R9j76O6K24j68J35p1O7j14n2M2J20k11P4j26K9
$$ plain form
2544 -94 -117 -217 -44 -2 -114 -132 16 -48 121 -26 -115 270 -126 -226 -1 118 -56 -87 107 33 -196 -244 148
2567 148 19 196 -36 86 -130 -120 6 222 -128 -131 -24 -9 24 110 -33 -204 -69 -179 -8 -43 -225 234
2589 234 -34 64 45 15 225 249 229 -161 -41 -33 132 132 -152 41 86 244 98 21 -150 104 239 82 82 -220
2613 -220 -166 -66 -16 2 -140 -198 -161 68 321 46 -231 -1 10 -68 -51 41 -3 -31 147 44 -113 -161 -49 -13
2637 -13 76 -164 51 -177 -212 105 -150 10 -68 32 144 -233 -71 -11 -46 91 95 107 -265 38 -235 -54 29
2660 29 -135 -103 -170 -96 -151 -54 -14 5 -217 28 23 -68 41 181 79 185 -2 140 -253 -276 -165 193 153 -237
2684 -237 32 -105 91 10 -60 11 192 -79 32 150 109 -180 128 -5 -89 -38 28 11 11 50 117 5 35 3 -79
2709 -79 27 -59 67 78 37 -20 -22 -43 140 32 170 78 279 -12 44 -98 180 25 -90 13 61 -53 55 -157
$$ packed form
2544i4k3j00J73M2j12j8J48o4J69j47q9L85l96j00K25J19j74l1J94p4k29m8L92
2567A48j29J77k32J22k16J0J26K16l50lJ07J5L3Q6j43j71J35j10J71l5j82M59
2589B34k68R8j9l0K10K4k0l90J20QJ65%k84J93M5J58j46p7j71K54J35j57%l02
2613b20N4J00N0J8j42n8L7K29K53k75k77K30J1p8J7R2m4k8J78j03j57m8J12L6
2637a3Q9k40K15k28l5L17k55J60p8J00J12l77J62O0l5J37MJ2l72L03k73J81Q3
2660B9j64L2o7P4n5R7M0J9k22K45nr1J09J40j02J06j87J42l93k3J11L58m0l90
2684b37K69j37J96q1p0P1J81k71J11J18m1k89L08j33q4N1O6j7%L9O7j12L0l2q2
2709g9J06q6J26J1m1n7kk1J83j08J38r2K01k91N6j42K78j55j15J03M8j14J08k12
$$ plain form
2733 -157 -193 -109 -179 -41 36 27 -81 -46 -214 11 -28 -138 185 105 -174 15 -81 62 -104 -52 46 36 -110 -183 -58
2758 -58 -64 97 -116 126 36 -254 -42 184 67 125 -126 23 -10 -151 96 -35 -222 122 76 -2 45 -20 -82 -69
2782 -69 153 81 -151 -25 75 5 285 46 156 -167 49 219 -121 -60 39 -65 163 145 -136 53 -67 -163
2804 -163 -5 101 53 40 -62 132 -137 -78 -203 -108 173 211 150 30 -116 86 182 101 -104 102 166 53 -24
2827 -24 -199 129 186 55 89 -167 -101 57 -180 -27 -30 -1 164 -1 76 71 -91 -77 -43 -22 72 -19 116 23 12 84
2853 84 174 -233 210 -27 -64 -12 130 -164 54 -43 -185 7 -83 -49 -89 47 -20 -216 -186 -66 143 -64 28 12
2877 12 -183 129 -114 -71 46 -170 78 -117 -28 70 32 -88 182 1 196 30 -92 -75 -41 -106 -33 34 12 7
2901 7 86 -79 -124 44 -65 -208 44 -181 -67 -102 78 -29 -69 -51 -110 -218 152 147 16 9 92 -80 -153 35 -18
$$ packed form
2733a57l6Q4p0J38P7rj08L5j68K25l9j10L23q0k79J89r6J43j66N2R8j0j46p3J25
2758e8oJ61k13K42r0k90K12K26j17N8k51J49l3j41K47j31j87L44m6p8M7o5o2J3
2782f9K22p2k32J26J00p0K80k39J10l23K16J70l40O1R9j04K28j8k81J89j20r6
2804a63J58J06m8j3j02J94k69N9j25R5K81L8o1j20j46K02R6q1k05K06O4j13p7
2827b4j75L28N7j31L4k56O6J58k37J53lK9J65j65P7nj62J4L4K1R4r1J35r3j1P2
2853H4R0m07M43k37l7N2J42k94K18r7j42J92r0L4m0J36o7j96L0J20K09k07R2j6
2877A2j95L12k43M3J17k16K48j95Q9R8l8j20K70j81J95j66j22J7L4o5P3O7k2n
2901GP9j65m5J68j09j43K52k25J14l5J80j07m0J8n9j08L70nj31pQ3j72p3J88n3
$$ plain form
2926 -18 -60 108 24 118 -133 -29 -37 -65 -87 -78 199 -55 -77 193 216 -56 -232 -152 63 -28 -144 -69 217 99 77
2951 77 66 -181 14 328 -49 115 75 104 -48 32 -170 190 -44 -159 -142 53 107 153 -100 108 29 -186 -117
2974 -117 -142 24 112 -285 23 179 -188 110 69 68 -138 62 -24 -135 9 -100 -39 -109 21 -17 -89 -39 52 -47
2998 -47 29 73 -132 -24 -53 -177 79 113 -109 45 19 67 100 102 -157 -135 -169 -144 -104 59 -197 48 165 -159 82
3023 82 -197 28 24 107 -64 83 43 -61 132 -222 201 -250 3 41 -212 -140 35 110 30 89 -5 -217 19 224
3047 224 -280 -18 -21 -5 -267 -166 -274 -86 -152 -211 9 127 55 -75 130 -21 -64 36 86 150 -133 90 176
3070 176 63 -36 -72 227 22 -112 120 20 37 -54 -92 -71 74 239 125 57 -207 -193 15 23 150 8 -121
3093 -121 -36 -9 -50 54 -21 24 -219 -55 259 52 -182 -85 -146 -179 69 1 76 72 13 60 108 -143 39 68 121 -44
$$ packed form
2926a8m2J68q4R4k51J04qk8k2RK77k54k2K70K3k72j76Q0K15r1j16P5K86j18k2
2951G7j1k47J95L14l77J64m0K9j52Q0k02L60k34j15J7J95N4M6k53K08p9k15O9
2974a17k5J66Q8l97L08J56l67K98m1jk06K00q6j11J44j09O1p0J30l8p2N0R1r9
2998d7P6M4k05J08k9j24K56L4k22J54k6M8L3Kk59K2l4K5M0J63k56K45J17l24K41
3023H2k79K25mQ3j71J47m0j04J93l54M23m51K53L8k53P2J75P5q0N9r4k12K36K05
3047B24n04K62lJ6k62J01j08J88o6n9K20J18p2j30K05j51m3J00N0O4k83K23Q6
3070A76j13r9l6K99k05j34K32j00J7r1l8K1J45J65j14o8k64J4K08QJ27j42j29
3093a21Q5K7m1J04p5M5k43J64L14k07k34R7o1l3K48o8P5mn9M7M8k51J82K9N3j65
$$ plain form
3119 -44 -76 -188 -93 22 44 -73 34 -146 15 19 66 250 56 -136 55 160 -2 51 -123 39 185 -146 -222
3142 -222 36 81 -64 -207 134 -132 97 84 6 -238 146 -37 26 47 -147 -106 -80 -6 321 -12 -244 44 65
3165 65 198 -292 83 -49 119 -76 -1 82 -134 123 21 25 -180 42 -194 89 -52 98 -117 -201 71 -144
3187 -144 -64 151 117 -25 -57 -58 74 -59 -45 236 -213 25 151 -58 136 31 -1 -29 120 51 -44 0 -106 55
3211 55 -24 146 9 -102 -150 -91 -95 10 -94 -285 97 39 -198 -95 2 -80 -4 24 -28 35 135 129 107 85 58 -73
3237 -73 -70 52 -159 -19 -292 69 65 -67 47 -17 -159 4 84 64 -130 -75 351 115 66 105 -34 125 -30 27
3261 27 406 9 -159 79 -45 55 32 60 63 281 128 -21 -8 27 -11 -41 -44 100 45 150 2 97 -1 155 36
3286 36 39 -25 33 -134 135 213 43 -89 -18 59 91 -211 -116 -8 20 106 -99 -63 7 97 7 53 -186 -6 113 -97
$$ packed form
3119d4l2j12R5J15K2j17J07j80J61MM7J84j94j92J91J05j62N3j74J62J46l31p6
3142b22K58M5j45j43L41k66K29j3p8k44L84j83O3K1j94M1K6P4L27l33k32K88K1
3165F5J33m90L75j32J68j95P5Q3k16K57j02Mk05K22k36K83j41J50k15q4K72k15
3187a44Q0K15l4j42l2jJ32j33J4K81m49K38J26k09J94j05l2k8J49o9r5M4j06J61
3211E5p9J70j37j11m8N9mJ05j04j91L82n8k37J03R7q2P6K8n2O3J00ok2k2k7j31
3237g3LJ22k11J40k73L61mj32J14o4j42J63Q0k0j94N5M26k36m9L9j39J59j55N7
3261B7L79l97j68K38j24J00k3K8LK18j53j49J3L5l8l0lJ44n5J05j48R5r8J56j19
3286C6Lo4N8j67K69P8j70j32P1P7L2l02R5J08K8Q6k05L6P0R0r0M6k39J80J19k10
$$ plain form
3312 -97 -80 -31 65 38 -28 253 -94 132 -192 78 -90 -170 -36 -55 103 74 -23 -171 -89 -11 -140 -98 155 -77
3336 -77 15 -146 30 121 -65 69 262 -210 -145 -75 -160 -59 -62 -6 54 -157 -42 -103 -52 94 -18 94 -194 84
3360 84 -1 -112 -24 -15 104 190 172 144 39 139 -91 53 11 115 46 130 -60 83 50 18 48 159 187 61 -1
3385 -1 -30 -114 -32 -240 -24 -164 6 170 -69 30 41 -244 -227 100 -11 164 -159 -14 -155 -152 -190 -52 -34 -127
3409 -127 215 -131 79 122 -67 1 40 -193 -60 84 -43 256 -253 -25 -90 -145 188 -35 9 -114 -3 -124
3431 -124 -81 43 75 -227 -39 -224 5 -137 248 25 72 -6 93 81 100 -122 -128 -137 -196 -52 24 132 -137 116
3455 116 -180 -46 -167 -134 -81 -68 305 -34 213 127 -103 -97 -380 -32 -59 -50 100 -76 11 -125 7 72 -153 8
3479 8 -92 103 -36 -316 41 9 -115 23 -160 65 115 -67 -49 156 257 -37 381 99 -141 -27 295 -59
$$ packed form
3312i7J7M9R6k7o6K81l47K26l24K70j68q0J34j9J58k9r7j48Q2P8j29M2K53k32
3336g7R2j61J76R1j86J34J93m72O5P0q5J01lN6O0k11J15o1N1J46j12J12k88K78
3360H4q5j11Q8RJ19Q6j8k8j05J00k30J44m2J04o9Q4j90J43l3l2L0J11K8j26o2
3385ak9q4Q2k08K16j40J70J64k39R9J1k85J7L27j11J75l23J45j41Ll8J38J8r3
3409a27L42l46K10M3j89O8L9k33J33J44j27K99n09K28o5n5L33k23M4j23J11j21
3431a24M3J24L2l02J88j85K29j42L85k23M7p8R9j2J9k22orn9J44P6J08k69K53
3455A16k96J34j21L3N3J3L73l39K47q6k30Ok83L48k7RJ50j76Q7j36J32O5k25J61
3479Hj00J95j39k80L57l2j24J38j83K25N0j82J8K05J01k94M18k82k40J14L22l54
$$ plain form
3501 -59 9 -66 46 105 -212 -9 53 36 109 39 -198 -150 136 -77 -22 -15 -31 4 12 -83 101 -131 13 -58 -274 -142
3527 -142 108 -25 227 95 -90 102 -151 -204 -40 139 29 -101 8 -15 222 122 -163 -69 50 -65 -8
3548 -8 -23 -129 -1 52 240 -101 59 45 151 -27 119 145 41 19 -65 -63 43 102 -181 37 222 82 213 43
3572 43 143 -243 -60 -20 -106 64 92 -12 40 -2 220 -73 -87 188 79 -135 40 19 0 316 -106 57 203
3595 203 108 127 -76 -133 334 84 -39 86 -176 0 55 48 46 225 -31 -268 82 47 10 -273 -22 162 178 145
3619 145 22 158 -25 47 35 -64 107 134 -44 -28 76 163 34 -178 22 -41 -26 -164 109 -178 109 23 145
3642 145 -145 -25 -164 -75 -137 37 1 -101 162 145 -75 159 -157 -285 183 45 262 243 33 -100 65 -8
3664 -8 -188 81 -321 55 298 -15 61 -12 15 103 42 -57 29 -38 182 133 36 -65 -95 -231 -85 136 -184 34
$$ packed form
3501e9O8p5J12N9l17K03O2j7P3p0k37M8K86k13N5Pj6L5Qr5J84k32J44p1k16J32
3527a42K50j33K52j32j85J92k53n3J64J79j10j30J09k3K37j00k85R4J19j15N7
3548hj5j06J28N3J88l41J60j4J06j78J46K6j04k2q4KJ06N9k83K18J85j40J31j70
3572D3J00l86J83M0q6J70K8j04N2m2K22k93j4K75j09k14J75k1j9L16m22J63J46
3595B03r5J9k03n7M67k50j23J25k62J76N5pkJ79k56k37L50l5l7k83K51J84J6l3
3619A45j23J36j83P2j2r9J71K7j78J6J04Q7j29k12K00o3J5j38K73k87K87q6J22
3642A45k90J20j39Q9o2J74l6j02K63j7k20K34l16j28M68j38K17j9k10j33J65p3
3664hj80K69m02L76K43l13P6p3K7Q8o1r9Q6o7K20m9r7j01l0j36J46K21l20K18
$$ plain form
3688 34 81 -76 -1 -63 -55 -44 47 -36 262 26 -105 58 16 31 9 60 348 -102 -163 99 161 -122 1 54 38 61
3714 61 -211 -42 9 -140 -70 -196 82 -77 87 26 -19 99 86 70 -57 -28 95 -149 -35 -82 42 255 10
3737 10 -5 95 -12 -84 -93 -24 51 103 127 -34 -196 -91 201 1 6 -143 68 193 -25 -164 -88 -118 -238 102
3761 102 46 141 -116 20 -28 120 127 -117 -176 2 -130 -211 28 -61 123 300 -166 -12 -25 -1 194 45 -28 -57
3785 -57 48 -27 -67 -49 -33 -172 -54 -108 49 -62 -4 97 26 -170 126 -101 -28 62 112 -186 -159 -60 -27 -97 -56
3810 -56 29 -185 162 -55 -27 -60 -60 140 57 42 114 38 -8 80 -41 185 -51 -155 188 -24 -50 -79 -47 -61 15 -145
3836 -145 -53 -168 107 -110 150 34 -147 64 212 8 -201 161 -71 201 276 -16 -39 3 -117 105 -97
3857 -97 146 -172 215 42 -6 244 -51 -67 123 -69 -71 142 -150 225 68 -10 100 -71 54 35 -33 90 -4
$$ packed form
3688C4M7j57P5o2QJ1R1q3K98k36j31J63m2J5k2N1K88m50o1K62O2k83J23N3j6K3
3714F1k72J69N1j49P0j26K78j59J64o1m5J18j3j6j27K9J23k44J14m7J24K13k45
3737A0j5J00j07p2rO9P5N2K4j61j62J05K92k00Nj49K11J25k18j39P6l0j20L40
3761A02n6R5k57J36m8J48Pk44n9J78j32q1K39q9J84J77m66J54j3K4J95j49p3k9
3785e7J05p5m0J8J6j39J18n4J57j11N8J01p1j96K96k27P3R0N0k98K7R9L3p0M1
3810e6Q5k14L47k17K8l3%K00q3j5P2p6m6Q8j21K26k36j04L43k12k6k9L2j4P6j60
3836a45R2j15K75k17K60j16j81K11J48k04k09L62k32K72P5k92k3M2j20K22k02
3857i7K43l18L87j73m8K50k95j6J90j92kK13k92L75j57p8J10j71J25j9o8J23r4
$$ plain form
3880 -4 138 81 -90 27 45 24 -102 -174 -27 -51 18 21 54 -121 -29 -184 228 30 -63 -53 -30 6 202 -75 41
3905 41 235 -82 14 234 -197 72 -199 -34 3 48 -22 176 88 -200 -202 79 1 -81 -49 46 356 -85 -76 58 -70
3930 -70 126 -74 -71 124 207 50 -2 144 78 104 21 -61 123 226 -44 -363 7 -11 -53 36 -24 -41 -55 86 -1
3955 -1 -8 -46 -18 -79 -137 -18 -76 19 -149 -4 -10 120 216 -261 115 133 -123 -135 -17 -215 -134 44 193 -205 69
3980 69 112 96 -230 163 -190 -78 -78 -30 4 22 -12 -52 -121 109 57 -127 -11 14 136 131 -16 10 -16 -96 -64 127
4006 127 182 21 73 163 -115 -91 -82 130 -86 -97 143 -176 -45 53 -45 -42 220 -130 5 140 -177 -22 -146 37
4030 37 43 -55 -196 69 -4 -49 62 -149 193 78 30 -148 42 303 63 -25 134 -61 -131 -202 10 -179 -59
4053 -59 75 68 -137 -75 273 145 119 21 -253 2 -21 28 139 167 74 -24 163 65 -145 159 -286 -97 82 127
$$ packed form
3880dJ42n7j71J17J8k1j26p2J47k4O9LL3j75R2j55M12j98r3J0K3L6J96k77J16
3905D1J94l17R6K20m31K69k71J65L7M5p0J98q8k88kK81p8q2L2R5L10m41RJ34j28
3930g0J96k00LJ95Q3j57n2J46o6K6q3q2J84J03k70l19L70j8m2Q9o0j7j4J41q7
3955apl8K8o1n8J19n8R5j68J45oJ30R6m77L76J8k56j2J18j98Q1J78J49l98K74
3980F9M3j6l26L93l53J12%M8L4J8l4m0o9K30n2j84J16K5J22nj47K6k6q0L2J91
4006A27N5j61N2R0k78K4RK12k16j1K40l19J31R8r8LK62l50J35J35l17J55j24J83
4030C7Or8j41K65p3m5J11k11L42j15m8j78J90K61k40q8J59j95p0p1K12j89J20
4053e9J34pk05O2L48j28k6r8k74K55k3M9J11K8r3r8J87r8k10L04m45J89J79M5
$$ plain form
4077 127 227 -253 25 47 146 -88 178 100 -66 5 -136 15 -87 104 -222 12 -223 348 82 24 -93 -50
4099 -50 82 0 -179 -68 -79 -145 75 183 36 189 195 128 27 -165 96 24 56 95 63 -75 -41 -134 -30 138
4123 138 -27 67 315 -118 -205 -22 -136 78 116 -76 101 5 -51 -99 98 -87 79 -27 22 166 -17 103
4145 103 -29 -69 -65 115 -87 -69 39 -78 39 -109 -184 53 59 6 110 19 82 39 -71 17 109 52 -304 -63 -80
4170 -80 -60 34 47 156 -297 -53 -178 -50 65 294 -144 167 -134 -112 -34 110 -65 -141 92 107 13 41 117 237
4194 237 93 27 29 165 60 -65 -68 -66 -143 -194 223 -120 -34 70 -193 -1 -73 108 -137 -97 -119 143 50 -84 -94
4219 -94 143 -157 -103 -135 -120 -28 -210 -23 83 37 -138 -169 -382 -27 80 86 77 -220 -311 82 54 174 -107 -95 -17
4244 -17 56 114 -1 72 24 76 67 -20 36 -196 33 142 -62 -118 -58 -118 -25 143 -60 -131 143 -400 -69 -141 59
$$ packed form
4077A27J00m80K78K2R9k34K66p8j66P1j41J51j02J91l26K34k35N71k66n8j17M3
4099e0J32q2j79J11j1o6K20J08j47J53Oo7j01j92K61p2L2L9l2j38L4r3J04J68
4123A38j65R4K48m33q7J83j14K14L8j92J77r6n6m8J97j85J66j06M9J44j83J20
4145A03j32m0MJ80k02J8J08j17J17j48p5K37On3J04r1O3m3j10Q8R2n7l56K41j7
4170h0K0R4J3J09m53K44j25J28J15K29m38L11l01K2P8J44j75p6K33J5r4K8P6J20
4194B37j44o6KJ36j05j25lKp7n1M17l43Q6J04k63J92p2J81k45M0k2K62r3j34j0
4219i4K37l00N4l2J5R2j82J87J06m6j75l1k13L55J07Ork97r1L93k8J20k81J2P8
4244a7P3N8j15P3m8N2rq7N6k32K29J09k04n6O0o0R3J68k03p1K74n43L31p2K00
$$ plain form
4269 59 -13 150 46 199 -68 100 81 178 -91 34 75 -51 57 -110 55 156 153 63 -50 -44 285 12 9 130
4293 130 -94 -159 -286 46 -41 -182 95 205 -29 -34 67 -22 -42 -100 94 -97 83 87 217 213 25 -50 216 -146
4317 -146 14 2 83 -58 112 -28 37 27 365 29 -71 70 -215 -166 -99 211 180 -18 -66 34 131 -69 -49
4340 -49 -122 -96 196 133 -271 -225 -26 -10 -72 -108 -15 95 139 -115 -23 -19 -110 -4 -1 -73 -58 -36 -22 -166 132 174 -94
4367 -94 24 -100 174 163 124 -103 -141 80 -149 7 -77 -173 -116 -137 182 21 -202 -178 7 -140 70 -88 183
4390 183 -13 190 -39 -61 195 118 -73 -20 -176 201 19 -37 -101 -81 18 -103 27 -178 -78 -76 7 -158 74
4413 74 -90 167 45 -69 -16 -38 236 -157 -103 185 -5 -46 61 -18 -188 109 -132 203 79 81 -127 106 -39
4436 -39 -52 345 40 116 165 78 34 45 92 -205 -16 226 40 106 47 -95 -225 29 64 113 220 76 -109 71
$$ packed form
4269E9p2J63j04J53k67J68j9R7k69J25M1j26J08j67J65J01lr0j13OL29k73lJ21
4293A30k24o5j27L32q7j41K77J10k34nJ01q9k0n8J94j91J80MJ30mj88p5K66l62
4317a46J60j2Q1j41J70j40O5j0L38l36j00J41k85M9O7L10l1j98m8J00R7k00K0
4340d9p3K6K92o3m04M6J99J6o2l6R3J10M4k54R2Mr1J06Lp2J5K2J4j44K98M2k68
4367i4J18j24K74j1l9k27l8K21k29J56q4r6N7k1L19j61k23K4J85j47K10j58K71
4390A83j96K03k29k2K56p7j91N3j56L77j82n6o4K0R9j21J30k05J00KQ3j65K32
4413G4j64K57j22j14N3k2K74l93N4K88j90m1J07p9j70K97k41L35j24Kk08K33j45
4436c9j3L97l05P6M9q7m4J1M7k97J89K42j86O6n9j42j30K54L5M9J07j44j85J80
$$ plain form
4460 71 -16 203 170 19 -79 21 145 -77 -14 -215 151 18 -21 -123 -39 68 104 -57 -190 -281 14 84 -104
4483 -104 144 227 -115 -148 -6 11 212 -10 10 283 -94 109 5 -19 78 -134 50 92 65 -85 -38 -284 136
4506 136 178 3 -18 -157 -94 127 29 86 -87 -2 49 -1 283 -237 88 -136 -144 38 100 44 -66 8 -18 161 -12
4531 -12 53 -173 203 -190 78 123 6 65 -81 88 185 -30 -66 -46 -235 188 -93 158 148 232 211 161 -57 -174
4555 -174 -80 -85 -76 135 175 -113 33 -14 42 88 -68 10 194 -294 -259 -36 39 -214 -61 -40 28 -275 -81 -220 121
4580 121 232 -188 107 81 168 13 36 -152 97 17 42 -10 70 84 10 100 58 -155 192 -8 -195 0 -12 250
4604 250 182 -77 -101 -36 226 -36 -161 -132 -112 -73 315 35 52 -115 -101 49 32 -186 63 236 -29 84 68
4627 68 241 323 4 98 25 -49 -118 -117 41 -26 8 105 106 224 51 -265 295 15 -76 -19 -45 34 59 66 -110 87 69
$$ packed form
4460G1q7K19l3j51r8J00J24k22O3k01L66j33l9j02Q4J07L6j61j33r1K95P0j88
4483a04K48Q3l42l3J42J7K01k22K0K73l77K03j04k4R7k12J84M2k7j50M7k46M20
4506A36M2j75k1j39O3K21r8N7j73Q5N1n0K84n20L25k24qJ82O2n6j10P4k6J79j73
4531a2O5k26L76l93K68M5j17N9j46J69R7k15l6K0j89M23k81K51j0Q4k1n0k18j17
4555a74R4nRK11M0k88J46m7N6M6j56P8J84m88L5K23P5k53J53K1O8l03J94j39L41
4580A21J11m20K95k6Q7j55K3j88K49q0K5n2Q0J4p4R0m2k13L47k00j87J95j2K62
4604B50o8k59k4O5K62k62j25K9K0L9L88k80J7j67J4J50j7k18K49J73k65J13j6
4627F8J73Q2l19R4p3p4o9JJ58o7L4R7JJ18j73l16N60k80r1N7k6P9K5Pj76J97j8
$$ plain form
4654 69 1 -53 14 -48 144 -69 -52 -166 16 -234 -108 16 20 72 256 -234 -113 -1 -200 94 -191 196 -86
4677 -86 252 -31 -73 -24 -127 -110 9 -73 17 -11 -76 -178 33 -101 -158 -120 -17 134 -148 -32 78 18 -51 -40
4701 -40 88 10 -56 -92 270 106 384 -47 268 269 -148 88 -5 -55 -131 147 292 53 -91 40 22 -123 -120 83
4725 83 -193 142 -421 -74 95 -148 274 157 -64 -3 -10 307 113 41 -98 -10 -166 65 327 67 2 -28 -73
4748 -73 -86 -13 -29 -205 -97 -165 -40 48 90 -125 51 299 -79 -220 246 -66 141 -52 -33 9 162 78 -113
4771 -113 185 -320 184 42 66 -110 -107 55 -4 7 -49 -44 25 6 -185 -7 -92 -75 -111 39 6 -117 56 1 147
4796 147 -58 91 -85 142 7 345 28 -15 194 4 4 -27 282 -102 -104 43 83 -127 -67 -96 31 33 21 67
4820 67 50 -39 263 49 72 -271 -188 -39 -35 115 -261 -112 -223 103 -19 -149 126 57 103 72 -122 -122 -30 -206
$$ packed form
4654F9o8n4O7o2J92k13J7j14J82k50J26J24MN2J84m90J21J12j99K94k85L87k82
4677h6L38k83m2M9j03J7J19q2R0k8o5j02K11j34n7L8J03J51k82J16J10o0o9J1
4701d0J28p8o6l6L62j64K78m31L15Jm17K36r3n0p6K78J45k39j44J31j8j45LK03
4725H3k76L35n63L47J69k43M22j17k21O1pL17j94p2j39Q8j56K31K62k60o5l0m5
4748g3j3P3j6j76J08o8J25Q8M2k15J76K48l78j41M66l12K07j93J9M2J53q4j91
4771a13K98n05N04j42K4j76LJ62n9J1n6NO9j9j91J78q5J7l6J50l3j23J73n5J46
4796A47k05J49j76K27j35L38l17m3K09j90%l1L09l84kJ47M0k10O0k9J27Kj2M6
4820F7j7q9L02k14K3l43Q3J49MJ50l76J49j11L26j22j30K75o9M6l1j94%R2j76
$$ plain form
4844 -206 170 -46 21 108 -1 -153 75 -19 131 -64 212 -33 -182 -40 28 48 -76 144 66 -190 59 -27
4866 -27 -45 13 74 205 124 -38 -82 87 17 148 -190 -48 34 -129 -94 -189 -70 -119 16 -225 -64 -70 -9 -55 -226
4891 -226 -202 72 20 -44 389 44 74 140 114 86 65 36 48 -257 -78 224 -130 -88 167 -96 -7 133 -16 34
4915 34 32 -14 -48 -120 -48 97 -50 -176 -83 42 -55 -15 285 168 116 32 -238 122 -334 -3 174 270 -83 -40 221
4940 221 -209 -123 198 106 -90 -49 -56 56 -159 123 190 -25 10 137 44 30 189 125 432 -47 67 67 -82 -132
4964 -132 -85 -19 -151 15 -33 -124 -51 92 -46 -279 -50 -15 -148 176 -68 125 109 -144 -248 56 82 11 -13
4987 -13 -14 138 39 -99 -122 6 114 123 -8 92 -91 -132 137 170 70 169 106 14 296 143 32 59 -58 -16 78
5012 78 -129 -84 58 140 188 -155 -42 -17 -50 79 -48 22 -26 -3 82 -39 121 -24 89 -45 77 -49 149
$$ packed form
4844b06L76k16O7Q7j09j52K28r4J50j95K76k45j49J42O8K0j24K20p8k56K49q6
4866b7j8N8O1J31q1j62m4J69p0J31l38J42Q2j63L5r5J19m9J35k41J61oO1m6j71
4891b26K4K74n2o4M33l45L0O6k6k8k1k9J2l05J79L02l54M2K55k63Q9J40j49N0
4915C4km6l4p2P2J45j47j26R3J25r7M0L00j17n2q4k70L60m56L31J77R6l53M3K61
4940B21m30Q6L21r2j96M1pJ12k15K82O7k15L5J27r3j4J59o4L07m79J14%j49n0
4964a32M7O6j32J66m8r1P3J43j38k33K29L5j33L24k44J93j6k53j04L04K6p1k4
4987a3jJ52r9j38k3J28J08Rj31J00j83m1K69L3j00R9o3r2K82j53j11K7j17M2R4
5012G8k07M5J42Q2M8l43J13K5l3J29j27P0m8K3Q5j21J60j45J13j34J22j26J98
$$ plain form
5035 149 138 -86 36 -103 -120 -210 211 -75 -131 57 -103 162 153 113 79 -149 -18 135 -158 13 -19 49 -184
5058 -184 112 33 -66 -36 -85 -257 -18 25 78 -109 -102 124 -355 -40 -99 147 35 186 43 -57 -88 238 -21
5081 -21 13 16 -27 -90 -144 8 1 -19 -201 -149 236 -46 142 129 -81 -41 311 195 61 -12 -11 -222 -84 -73 -109 351
5107 351 -31 -156 -285 -144 88 -73 232 89 -120 -124 -114 77 -120 -92 38 47 -7 -6 -84 157 120 -7 286 -137
5131 -137 137 -57 -310 -11 -110 -170 -58 -6 71 2 72 -86 25 155 -69 -94 8 -11 -54 168 321 27 117
5154 117 -292 -133 134 -106 -167 51 80 188 -160 118 44 -43 130 -132 222 184 28 -172 -18 223 -2 -40
5176 -40 -47 156 7 -30 65 46 -46 203 -146 29 91 224 0 63 75 -83 128 60 68 -157 -84 -294 -114 -109 -189 250
5202 250 -16 194 89 -273 -283 -6 251 33 87 -211 72 132 -13 -198 -53 -58 -326 -96 238 -353 -49 -98
$$ packed form
5035A49j1k24J22j39j7r0M21k86n6J88j60K65rm0l4k28J31J53k93J71l2O8k33
5058a84K96p9r9L0m9j72K39M3N3j87PK26m79L15n9K46j12J51j43j00l1L26k59
5081b1L4Lm3o3n4J52pk0j82N2L85k82J88j3k10M0L52j16j34p3Jk11J38J1l6M60
5107C51l82j25j29J41K32j61L05j43k09mJ0J91j97K8J30Rn4Jp8K41l7j27K93m23
5131a37K74j94k53K99r9o0J12N2P7o9P0j58J11J30k24k5J02j9m3K22J53k94R0
5154A17m09J59K67k40o1K18K9J08l48K78p4q7J73k62L54l8j56k00J54K41k25l8
5176d0pK03j49l7R5j9r2K49l49J75O2J33k24O3J2j58K11o8Qk25P3k10J80Nq0M39
5202B50k66K10j05l62j0K77K57k18N4k98K83O0j45j85J45nk68K30L34n91L04m9
$$ plain form
5224 -98 -94 -150 -105 -37 184 23 -48 36 -50 280 -250 -71 -86 -58 -264 135 -163 108 100 19 20 -30 171 46 -52 74
5250 74 -87 -4 -213 106 18 186 20 14 12 -83 -76 -50 29 2 34 -161 -203 -134 75 13 11 -32 44 48 61 -84 -120 36
5278 36 158 101 -60 -218 -196 -167 22 42 -68 68 51 -31 164 -50 -48 90 -130 83 -246 -64 84 -103 61
5301 61 13 -65 -98 17 261 -55 180 17 48 110 12 -141 -162 115 -127 -47 -226 148 63 206 106 85 51 26
5325 26 12 76 164 -154 -47 -47 -20 -117 -67 164 42 -158 -54 56 234 -19 92 0 90 -26 100 61 -218 -109
5349 -109 184 99 -15 -201 -22 -245 98 -177 -36 188 -27 303 -9 63 42 177 -123 4 -81 12 156 199
5371 199 45 0 106 -42 223 137 127 136 93 58 69 56 146 51 -61 -46 -39 -175 51 406 -278 31 76 -27 -9
5396 -9 -143 4 -98 -229 74 81 89 30 -42 -4 63 -82 196 187 107 136 -6 181 -88 76 70 -125 -78 -52 -255 -56
$$ packed form
5224i8Mn6M5O8K21j61p1Q4q6L30n30J79j5K8k06L99k98K71qq1Jn0K01j25r8J26
5250G4j61Q3k09L19q8J68j66okr5PK6P9k7L2j95m2O9K09o2km3P6MJ3j45l6J56
5278C6J22n7j61j58K2K9J89K0j10J36j7q2J95k14KJ38k20K13l29J82J48j87J64
5301F1m8p8l3J15K44l16K35j63L1O2r8j53k1K77k42Q0j79L74q5J43j00k1l4k5
5325B6j4O4Q8l18J07%K7r7N0K31j22k00J04J10J78k53J11r2R0j16J26l9k79J09
5349a09K93q5j14j86J79k23L43k75J41K24k15L30l12P2k1J35l00J27q5R3J44M3
5371A99j54m5J06j48K65q6j0Rm3l5J1j3R0r5j12J5Pj36K26L55o84L09M5j03J8
5396ij34J47j02j31L03PQn9p2L8O7j45K78rq0K9j42J87k69J64oj95M7K6k03J99
$$ plain form
5422 -56 -27 20 -47 16 -120 -38 -17 -128 33 -154 33 76 -4 -66 -179 122 74 30 -65 49 -250 247 -8 -171
5446 -171 -135 21 -88 -247 -72 108 -170 94 209 -14 -147 27 -174 -195 269 231 132 -129 148 -71 149
5467 149 20 123 -52 100 152 272 -122 -218 37 70 -102 -24 32 54 -33 -211 -177 -283 103 -4 -63 -162 148
5490 148 210 -287 68 -144 -153 -79 27 -110 -140 30 0 167 193 0 -2 -152 53 27 31 305 28 153 72 -57
5514 -57 -148 -63 67 173 -70 -236 -111 -186 -97 83 -85 29 59 60 15 -131 -59 47 -54 202 -339 65 199
5537 199 145 -223 -142 -25 201 -33 -199 278 -20 95 15 -8 52 86 205 -9 -37 -95 -30 -79 -107 -81 -49 29 115
5562 115 -67 63 551 -86 31 -76 27 92 -49 -126 154 -57 117 124 117 102 -4 24 157 192 -362 130 130 -126
5586 -126 77 -163 39 68 -77 -45 -62 76 -183 31 -203 32 -132 162 211 -45 -144 -116 102 137 -203 -88
$$ packed form
5422e6K9M7o7O3j36Q2K1j11J61j87J87M3q0o2j13L01m8m4r5J14k99M97k55j63
5446a71L6J56j09j59J75J80k78K64J15k23j33J74k01k1M64l8r9k61K77k19K20
5467A49j29J03j75J52N2J20l94r6K55L3j72P8N6K2q7j78L4j06L86j07n9r9L10
5490A48O2m97L55k12rP4J06j37l0J70l0J67K6j93kj50K05k6MK74k77J25q1j29
5514e7r1Q5J30J06k43j66J25p5Q9J80j68J14L0Jm5j46P2J06j01K56n41M04J34
5537A99n4l68Q1J17K26k34j66M77k98J15q0k3O0L4J19k14k8n8O5m9k8K6L2P8Q6
5562A15j82J30M88o37J17j07J03O5j41p7K80k11J74Ppj5j06K8J33L5n54M92%k56
5586a26K03k40K02K9j45L2j7J38k59K14k34K35j64K94M9k56r9K8K18L5l40J15
$$ plain form
5608 -88 10 -10 1 219 211 12 226 155 159 80 -96 46 -5 173 -4 82 -123 125 -94 -136 114 -40 154 -131
5632 -131 -175 -231 19 -240 102 -52 -15 61 -87 111 78 -13 92 125 -36 2 -104 2 107 -97 -167 322 -9
5655 -9 132 35 -88 -49 -2 -104 22 -86 12 -246 -87 -81 -3 -114 -98 107 -110 -51 -136 57 7 2 230 -28 7
5680 7 -47 -32 -79 98 105 15 93 -182 155 -23 1 139 -94 -94 -182 -46 359 60 -130 22 55 -4 -53 71 79 -158
5706 -158 62 -5 147 153 58 10 118 126 -51 -70 20 -141 68 76 -11 -123 -64 183 -163 -6 -134 80 -114 97
5730 97 -18 71 -130 -168 36 38 186 46 67 -19 143 -118 126 305 84 100 -102 -98 178 109 -95 160 -261 68
5754 68 93 76 109 0 -93 -17 -17 -28 -196 98 219 92 73 -1 -41 -13 92 -87 47 -58 -40 69 50 -121 272
5779 272 149 98 87 62 280 -112 135 -78 142 11 -169 -225 -37 111 -43 55 15 -39 -150 -154 164 43 -71
$$ packed form
5608h8R8k0J1K18qj99K14p1Mp9j76J42n1J78j77Q6k05K48k19m2K50j54J94k85
5632a31m4n6K50k59L42j54L7P6j48J98l3r1J05L3j61L8j06J06J05k04p0M89l31
5655iJ41r7j23L9M7j02J26j08R8k58J59OP8j11J6K05k17N9q5J93n0nK28k58L5
5680Gn4J5m7J77Pr0P8k75L37j78K4J38k33%q8J36M05k99j90J52L3n9m9J24Qk37
5706a58K20o7J52Or5m8J08Qj77j9R0j61K09Qq7j12N9K47l46J57j28K14j94K11
5730I7j15Q9k01l8K04KJ48j40K1q6J62k61K44J79k21J6k02MK76o9k04K55m21L29
5754F8K5j7L3j09r3P6%j1j68K94J21j27j9p4m0K8J05j79J34j05J8J09j9j71L93
5779B72j23n1j1k5K18l92K47k13K20j31j80n6J88J48j54R8m0n4j11mL18j21j14
$$ plain form
5802 -71 110 160 0 34 152 -108 82 142 -40 80 -175 47 -445 15 206 -21 -52 1 55 -3 76 -32 -95
5825 -95 -78 42 -138 94 -76 -127 -27 217 -195 -8 23 -185 -182 48 -104 -96 -240 -70 385 -241 -120 -71 161
5848 161 -128 12 166 -58 -2 5 51 65 327 105 14 43 -92 120 -58 -209 61 -154 -83 205 -15 -95 -17
5871 -17 -177 3 141 -14 -304 -99 32 -118 196 -192 197 30 99 21 12 -2 223 50 -247 15 -19 38 -115
5894 -115 -183 -138 -158 165 -185 75 181 99 -111 119 -113 19 129 74 -192 -131 33 -65 17 113 -99 37 -229
5917 -229 61 -32 86 -33 11 17 192 66 -218 40 12 -165 234 -72 162 111 37 -59 -173 39 258 183 -41
5940 -41 -11 -59 118 11 124 69 -5 -43 290 -208 -47 98 71 -240 -47 23 -227 -144 -7 -239 -106 -203 -256 62
5964 62 -70 114 -33 137 0 195 -177 168 -189 -49 -82 79 195 103 -130 11 -163 75 -53 26 195
$$ packed form
5802g1J81N0j60L4J18k60J90O0j82J20k55K22m92M60J91k27l1N3N4n8P9j08o3
5825i5J7J20j80K32j70n1J00K44m12J87L1k08LK30j52Qj44J70M55o26J21M9K32
5848A61k89J40J54k24N6PM6J4K62k22r1K9j35K12j78j51K70k15P1K88k20q0P8
5871a7j60J80J38j55k90K05J31j50L14l88L89j67O9p8rj4K25j73k97K62l4N7j53
5894a15o8M5k0L23l50K60J06q2k10K30k32J32J10n5k66O1J64r8Q2R6k12J36k66
5917b29K90r3J18j19M4OJ75j26k84K58k8j77L99l06K34n1p4r6j14K12K19p5k24
5940d1L0m8J77j07J13n5p4l8L33m98J61J45k7l11J93P0k50Q3J37k32J33r7n3L18
5964F2j32J84j47J70j37J95l72L45l57J40l3J61J16r2k33J41j74K38j28P9J69
$$ plain form
5985 195 -104 -176 -116 -13 31 72 112 38 -35 -217 -175 42 -12 103 -14 5 109 101 12 176 70 -140 100 124 36
6010 36 -40 71 -28 -179 93 107 -8 88 50 -61 44 5 96 -38 -175 158 -31 112 -79 -215 -26 -143 139
6033 139 -120 68 -299 -213 12 -59 78 -77 166 -1 19 -104 35 -61 -38 -26 110 -212 32 -54 372 96
6055 96 120 -185 -120 -84 -243 -65 -210 -83 -55 40 147 -105 -181 15 151 48 13 -146 -105 127 -80 62 194
6078 194 -186 -114 -225 54 11 -309 68 116 -43 288 54 141 71 -103 38 161 -41 24 136 -131 -198 187
6100 187 126 -94 52 -99 -20 -83 -204 -37 71 45 -56 127 64 0 9 111 -106 52 -95 -239 148 -189 38
6123 38 103 -204 98 -119 -111 -10 192 8 -24 124 -93 125 -9 -104 -23 -57 -159 -29 22 128 -75 2 256
6146 256 57 -111 -92 -97 169 -8 145 -100 -16 23 -20 -181 33 20 -109 -128 72 -5 -259 301 -22 -46 9 -112
$$ packed form
5985A95k99p2O0J03M4M1M0p4p3j82M2K17n4J15j17J9J04qq9J64j06k10K40K4q8
6010C6p6J11r9j51K72J4j15R6l8j11J05l9R1j34j37L33j89J43j91j36J89j17K82
6033A39k59J88l67Q6K25p1J37j55K43j67K0j23J39r6K3J2J36l22K44q6M26k76
6055I6K4l05O5L6j59J78j45J27K8R5J07k52p6J96J36j03l5j59M1K32k07J42J32
6078A94l80P2j11K79m3l20L77M8j59L31k34Q7p0j74J41J23k02O5J12k67o7L85
6100A87o1k20J46j51P9o3j21J67J08k6j01J83o3o4RJ02k17J58j47j44L87l37K27
6123C8O5l07L02k17QJ01K02j84l2J48k17K18j34r5Q1l4j02J30N1J06k03P7K54
6146B56j99j68J9nK66j77J53k45Q4L9m3j61K14j3j29j9K00p7k54N60l23k4N5j21
$$ plain form
6170 -112 -350 82 -152 -138 49 -108 169 197 136 46 14 179 5 -136 28 108 14 104 80 -204 32 -56 56
6193 56 -148 1 -38 107 80 -155 -20 -121 88 -15 144 -20 110 197 218 -239 -139 -31 -92 55 -3 91 197
6216 197 -65 56 20 -48 59 -144 -23 -20 159 -29 -52 101 -132 -181 242 47 47 -20 -71 -49 -53 82 40 60 187
6241 187 20 -86 49 -14 11 5 -255 111 -159 -170 -212 -103 -7 13 -117 -44 -19 163 -24 150 92 -83 176 16
6265 16 44 24 11 -88 -34 -62 35 -89 91 56 -36 -210 67 -126 -71 27 46 -17 87 178 -4 -152 -91 -117 -47 -237
6291 -237 -113 94 34 35 17 -56 138 126 -84 64 69 185 93 174 104 161 25 116 -52 -165 -122 34 49 -152 31
6316 31 21 -219 54 -91 -65 242 110 -53 42 146 31 67 103 98 -86 -53 29 97 -49 140 -95 15 18 -37 181
6341 181 -106 87 -60 -15 183 -36 -133 2 14 -157 32 -192 -17 -51 -169 83 79 29 99 -99 52 -24 33
$$ packed form
6170a12k38M32k34J4J87j57K77K8o1r0l2J65j74j41J64Q0r4R0k4k84K36q8J12
6193E6k04J49l9J45k7k35J35j01K09j03J59j64J30Q7K1m57J00J08o1J47n8R4J06
6216A97k62J21l6o8J07k03J21LJ79j88k3J53k33m9M23j95%o7n1K2mJ35m2K0J27
6241A87j67j06J35o3K5ok60L66k70j1m2J09R6K0j30P3K5J82j87J74n8j75K59j60
6265A6K8k0j3r9N4k8R7j24J80l5r2j74K77j93N5R8J9o3J04R1j82j48O1k6P0j90
6291b37J24K07o0Jj8p3J94j2k10J48NJ16r2Q1p0N7j36R1j68j13M3J56J5k01J83
6316C1j0k40K73j45K6L07j32j63R5J04j15L6L6nj84L3Q2O8j46J89k35J10Ln5K18
6341A81k87J93j47M5J98k19r7J35J2j71J89k24J75l4j18K52mn0P0j98J51p6N7
$$ plain form
6364 33 79 -47 113 -94 5 -236 173 99 -88 70 123 -82 27 36 -83 -88 55 36 345 174 -19 -56 109 -22
6388 -22 91 -75 -144 -7 -100 -46 -150 69 38 27 -107 -197 -20 -195 -88 -77 -60 12 90 111 -310 -139 -92 -81 -48
6413 -48 -65 -105 -15 -53 -78 -20 -101 -161 -28 -53 170 -84 -183 34 284 169 -148 -89 49 -94 -94 -9 2 296 -83
6438 -83 36 -291 -34 124 -14 143 60 -5 -108 -25 -149 6 181 -125 -16 -244 -7 20 -170 -20 -29 85
6460 85 -93 168 -219 115 -32 -133 178 -199 -247 -53 11 166 208 -130 -24 175 -4 -103 -9 -115 -269 45
6482 45 -67 189 -337 -125 -175 -161 42 245 53 -1 185 79 -100 -108 125 -118 123 63 118 60 104 -52 -20 145
6506 145 -4 120 128 -70 -401 -6 82 -96 -47 -93 -27 -5 -61 -128 -231 62 12 112 140 100 -109 -18 -161 65
6530 65 224 126 123 -39 -166 181 -5 208 -61 28 -50 -133 13 -17 -105 -39 201 73 97 126 -110 -247 -24 247
$$ packed form
6364C3M6j26J60k07R9k41M09p4j87J58N3k05J09Rj19nJ43j9L09j71j93l7J65j31
6388b2J13j66o9J37r3N4j04K19l1j1j34r0J77j75J07J1J7P2P8K1m21J71M7J1L3
6413d8j7m0R0l8k5N8q1o0J33k5K23k54r9K17K50j15l17N9J38j43%Q5J1K94l79
6438h3J19l27K57J58j38J57q3o5j03Q3j24J55J75l06J09k28K37K7j90J50rJ14
6460H5j78K61l87L34j47j01L11l77m8J94O4J55M2l38J06J99j79r9R4j06j54L14
6482D5j12K56n26K12n0J4K03K03j92n4J86j06j79qK33k43K41o0N5n8M4j56L2J65
6506A45j49J24Qj98l31L95Q8j78M9m6O6K2n6o7j03K93n0J00K8m0k09R1j43K26
6530F5J59r8lj62j27L47j86K13k69Q9p8q3J46l0q8O6K40j28K4K9k36j37K23K71
$$ plain form
6554 247 178 -36 -15 177 -3 -203 -174 57 38 44 144 -9 337 -13 -102 -167 28 -57 103 -81 10 74 190 -61
6578 -61 -16 -201 -153 32 -128 10 -79 -20 129 52 -54 142 92 -72 -134 -149 -221 193 54 -249 -197 -52 -103 111
6602 111 -109 -118 -181 -172 256 -43 101 65 137 -197 -77 9 -46 130 7 81 258 -97 -59 -154 -15 324 109 -60
6626 -60 241 114 -19 -207 27 152 -229 152 -68 -49 -29 -108 -192 -99 -17 -191 147 -228 -46 42 -36 -123 26
6649 26 314 26 24 100 -55 45 288 166 92 -188 -43 -2 -29 -76 33 -32 -92 -49 -89 31 -17 -186 208 280 136
6674 136 -46 115 0 216 30 15 60 82 -17 -53 43 -200 -66 -136 32 -35 -19 -234 54 458 28 2 -97 42
6698 42 -16 319 120 -259 89 138 11 -154 -224 37 99 81 -20 -198 -124 43 16 -95 -6 -116 24 64 -148
6721 -148 240 183 40 62 -120 -80 85 -148 -55 173 -91 -44 -185 205 120 -48 30 -63 44 -134 63 36 -277
$$ packed form
6554B47o9k14K1J92j80k00K9K31j9OJ00j53L46l50q9o5J95q5J60j84R1O4J16k51
6578f1M5j85M8J85j60J38q9N9J49p7j06J96n0j64o2j5p2M14j39l03N2J45n1K14
6602A11k20ro3RM28k99J44l6P2l34J20Q6n5J76j23P4J77l55L8r5J39L39k15j69
6626f0L01j27j33j88K34J25l81L81k20J9K0p9q4R3Q2j74L38l75J82Q8p8q7J49
6649B6K88k88kP6j55J00K43j22p4k80J45M1k7m7J09o5o0M3m0J20m8j69L94P2j44
6674A36j82J61j15K16j86j5M5K2r9l6R6k43J34p0J68o7J6k15K88M04m30k6r9J39
6698D2n8L35j99l79L48M9j27j65p0K61O2j8j01j78P4J67k7j11Q9j10J40M0k12
6721a48L88n7j43K2j82M0J65k33R3K28k64M7j41L90q5j68P8r3J07j78J97k7l13
$$ plain form
6744 -277 282 6 -93 8 -191 77 199 30 128 89 31 -151 -26 137 -31 172 -177 -83 -226 -138 178 -36
6766 -36 -23 213 -90 43 21 -116 -176 94 62 -60 97 -51 -271 88 163 -32 -51 -252 -144 177 35 186
6788 186 -74 107 18 27 99 17 -50 -139 -107 159 36 64 -49 -103 10 42 30 9 125 17 2 -113 85 -85 -109
6813 -109 95 85 179 -249 -53 -24 324 93 105 -38 116 131 164 15 -181 48 -44 -2 -94 4 -39 -199 -37 -108
6837 -108 -185 86 -254 -7 -81 -157 192 -94 -104 -38 194 -36 -78 -222 160 -55 -34 -78 75 -16 -203 54 164
6860 164 66 -25 13 4 66 -147 104 -87 -182 -264 -58 118 -174 -116 -50 -17 288 -152 288 -57 -94 -125 -136 -200 -61
6885 -61 43 -70 42 -134 -154 -4 215 -142 106 -249 -106 9 -199 42 -5 -31 50 89 -63 -100 80 -67
6907 -67 99 91 249 101 -103 177 -99 5 -223 -65 -157 -184 -229 -23 42 291 146 84 36 166 52 -102 -3
$$ packed form
6744b77N59k76r9J01j99K68J22j69R8l9n8j82J25J63j68K03l49R4j43Q8L16k14
6766c6J3K36l03J33k2j37o0K70l2j22J57j48k20L59P5j95j9k01J08L21j42J51
6788A86k60J81q9RP2q2o7q9L2K66j23K8j13n4J13L2j2k1J16j08j5j15J98j70k4
6813a09K04j0R4m28J96K9L48k31J2j43J54J5L3j49j96K29r2M2r2R8m3j60J62p1
6837a08p7K71l40K47p4p6L49k86j0O6K32k30m2j44L82k15K1m4J53r1j87K57J10
6860A64r8r1L8rO2k13K51j91r5q2K06J76k92N8O6L3L05m40M40l45l7l1j1o4J39
6885f1J04j13J12j76k0J50K19l57K48l55J43J15k08K41m7k6Q1L9j52l7J80j47
6907f7J66qJ58j48k04K80k76J04k28J58r2k7m5K06O5K49j45o2m8J30j14j54R9
$$ plain form
6930 -3 -22 176 27 169 288 58 -59 35 -37 -213 -47 -64 -40 70 27 9 -95 -149 -82 -90 40 -85 -185 7
6954 7 155 116 45 -27 153 136 173 -108 205 -66 74 -24 131 195 -26 -85 -164 -77 13 33 -86 150 146 -23 128
6979 128 -16 236 -81 -116 -318 -29 19 -47 -29 94 -57 262 -30 83 175 11 171 15 83 -111 4 54
7001 54 97 49 17 -99 -147 79 42 -30 129 -47 -152 65 76 125 29 -264 -9 -87 16 -60 -38 11 -129 29 -165
7026 -165 91 -210 -75 -9 3 -300 44 -169 176 -13 -185 -153 -76 -127 -58 -3 -17 34 -17 104 -101 27 -369
7049 -369 66 18 192 22 74 28 90 70 -130 -34 205 144 45 -38 57 54 -32 15 43 -200 15 -56 -130 113 -137 -168
7075 -168 -8 69 -20 -56 8 -291 61 56 177 69 -108 -130 2 -60 -143 149 -259 -254 -73 -62 9 146 75 -82 -29
7100 -29 -57 42 88 -318 -30 -46 26 -146 -161 -90 -155 154 -272 -52 176 31 -81 -10 72 61 13 -85 46 122 72
$$ packed form
6930cj9J98j49J42J19k30j17R4p2j76J66j7K4J10m3j8j04n4O7qJ30j25j00J92
6954GJ48l9p1p2J80j7L7k81L13k71J40r8J55O4k21n9p9Q7R0K0j19K36mj69J51
6979A28j44K52l17l5k02K89M8o6J8J23j51L19k92J13R2j64J60j56O8j94J15N0
7001E4M3m8l2j16m8K26l7p2J59j76j05K17J1M9r6k93K55p8J03p6K2M9j40J58j94
7026a65K56l01J35O6J2l03L44k13L45j89j72L2P7n1O9N5j4N1n1J21k05J28l96
7049c69M35m8J74j70N2m6O2k0k00R6K39o1r9q3R5lq6M7K8k43K15p1p4K43k50l1
7075a68J60P7q9l6O4k99L52nJ21j08j77k2J32o2q3K92m08NJ81J1P1J37p1j57N3
7100b9k8R9M6m06K88j6P2j72j5P1o5L09m26K20K28j45j12P1Q2j1m8r8J31P6n0
$$ plain form
7125 72 93 -23 159 217 -114 -57 -142 -44 117 -102 10 -154 126 -132 -168 -84 -317 20 -98 -83 18 -80 222
7148 222 101 234 -97 -209 169 233 68 35 -136 251 -132 99 308 79 191 -44 212 -117 274 103 -137
7169 -137 243 85 121 206 291 -167 87 14 63 -17 61 -91 -249 -80 20 -66 83 -1 -157 66 -176 40 16
7192 16 -51 -330 -111 249 64 -16 -91 133 133 122 76 -158 -110 147 -79 -6 133 -15 -85 138 20 48 246 -188
7216 -188 45 115 21 80 -96 -1 4 1 219 98 -65 108 -114 -145 -118 -31 73 46 -142 85 -1 205 172 223 -55
7241 -55 -86 259 62 75 34 49 52 -19 68 56 62 69 -88 248 86 -93 -250 115 65 51 161 -187 -135 -161 155 201
7267 201 -4 46 -42 76 198 32 -33 45 -67 -17 -8 21 86 -43 -289 -101 90 97 108 -115 128 -7 132 -19
7291 -19 -120 -62 40 42 -42 -55 -167 85 34 117 119 -29 65 120 57 -47 89 -163 39 -105 -44 142 -213 -123 -167
$$ packed form
7125G2K1j16J82N8l31N7q5R8J61k19J12j64K80k58l6Q4k33L37j18J5J01r8L02
7148B22j21J33l31j12L78O4j65l3j71L87l83K31K09k29J12k35K56l29L91j71k40
7169a37L80j58L6Q5Q5m58K54p3M9q0P8j52j58J69J00q6J49q4j56K23k42K16k4
7192A6o7k79K19L60j85q0p5K24%j1m6k34M8K57k26P3J39j48p0K23j18K8J98m34
7216a88K33P0r4N9j76R5NlK18j21j63J73k22l1K7Q7J04k7j88K27q6K06l3N1k78
7241e5l1L45j97J3m1J5Lp1Q7j2OPj57L36j62j79j57L65n0j4J10l48N2k6L16M6
7267B01k05N0q8J18J22j66o5P8j12N0RK9O5j29k46J88J91PJ1k23K43j35J39j51
7291a9j01N8J02Kq4j3j12K52n1Q3Kj48R4N5o3j04J36k52K02j44O1J86l55R0m4
$$ plain form
7316 -167 -232 -37 -123 -41 19 -83 -103 -304 67 -74 45 -25 -20 80 100 68 6 57 -120 -57 95 -46 3 -125 70
7341 70 -164 -110 63 -58 132 129 -48 17 63 77 64 43 -97 -218 -133 22 -123 87 68 -243 28 75 -153 -26
7365 -26 -181 -27 -158 -57 92 316 -153 -183 -278 -53 57 -47 -24 -72 102 -11 -114 -173 40 -33 -62 -131 -38
7388 -38 -138 -20 46 -68 -18 -35 -168 151 -43 -71 122 62 25 7 -154 207 -367 -267 -188 165 -97 -47 -183
7411 -183 12 103 29 -21 71 -14 -26 -62 122 -87 110 -88 14 18 -158 91 193 -219 63 126 128 140 -123 -14
7435 -14 -37 -219 89 -84 181 138 -117 -15 -135 54 178 78 10 372 20 -49 -110 24 188 186 -51 -270 -5
7458 -5 57 -159 -128 -184 -83 113 54 -123 -51 27 -45 143 -62 -22 113 -89 -103 -94 -97 -40 -61 -103 28 -195 -128 31
7484 31 -192 66 -45 3 5 -60 198 -202 -161 55 -22 -24 33 -187 -200 -198 -278 203 149 -170 -68 -73 -168 107 82 -154
$$ packed form
7316a67o5J95q6Q2O0j02k0k01L71j41J19p0NJ00K0l2o2N1j77O3J52j41M9j28J95
7341G0k34N4J73j21J90lj77O5M6J4j3k1j40j21Q5J55j45K10j9l11K71M7k28J27
7365b6j55J54j31J01J49K24m69l0r5K25J10j04K3m8J74j13j03n9K13p3k9o9R3
7388c8j00J18O6j14N0j7j33L19j94k8J93o0l7j8j61L61n74J00P9L53k62N0j36
7411a83J95R1p4n0R2q5j2l6J84k09J97j98J02Mj76K49J02m12K82O3KJ2k63J09
7435a4k3j82L08j73K65m3k55J02j20J89J24j00o8L62l52o9o1J34J64kk37k19K65
7458eO2k16L1n6J01J96n9j77P2P8p2J88k05M0J35k02j4RlN7k1m2J31k23O7J59
7484C1k23K58j11M8Ko5K58m00M1K16p7kN7k20j3Kq0M81n4l19J02nr5K75k5k36
$$ plain form
7510 -154 -227 -189 -54 -140 -108 -170 57 52 18 -95 -163 50 64 186 234 -36 111 38 -42 173 -53 137 190 -109 14
7535 14 199 183 206 -34 202 -66 -24 -78 -71 -202 48 54 -185 -259 54 -42 40 184 201 -179 -31 -117 -39 171 -165
7560 -165 268 134 -83 191 255 176 -94 -149 56 155 183 -149 140 79 -42 -123 -13 50 -99 20 83 3 -1 13
7584 13 -68 -220 -95 -32 -163 11 -133 -27 -25 62 159 -97 -129 -191 32 -32 65 115 3 -103 -15 11 6 124 -159
7609 -159 186 -154 -45 -95 -155 7 -293 25 104 274 -148 176 -151 119 130 -49 -61 -148 180 66 -120 225
7631 225 -232 -100 75 -89 -59 -196 -191 -22 -37 21 -138 -57 -65 57 65 21 -50 148 128 -26 113 74 -41 -51 -14
7656 -14 128 -29 -216 85 -67 228 -261 -117 11 -238 -15 105 22 -3 -38 -103 43 -126 -132 -187 127 -209 -203
7679 -203 194 -9 91 -79 -24 -170 -30 120 42 -75 13 -16 16 102 3 -48 107 -73 -36 40 187 101 -118 160
$$ packed form
7510a54p3L8J35q6L2o2K27nl4j13o8K13J4J22M8k70J47p3q0K15k26J90N3k99J23
7535A4J85j6K3k40K36k68M2n4Pj31K50Ok39p4L13r6Q2J44J7l80J48q6P8K10l36
7560a65M33j34k17K74O4p9k70n5K05R9K8l32K89o1j21q1J10O3j49J19O3q0mJ4
7584A3q1j52J25O3j31J74j44J06KQ7R7k56l2o2K23o4R7N0j12j06Q8K6nJ18k83
7609a59L45l40J09n0o0J62l00L18P9J70m22L24l27K70J1j79j2q7L28j14j86L45
7631B25m57J32J75j64L0j37NJ69j5N8j59Q1qJ22Qm4p1J98k0j54J39l9j15j0L7
7656a4J42j57j87L01j52K95m89J44J28k49K23J20q3k5l5o5J46j69on5L14l36O
7679b03L97k03J00j70N5j46J40J50p8j17Q8k9L2Q6r9n1J55j80L7P6J47q6k19K78
$$ plain form
7703 160 -30 67 81 42 -105 182 -217 -42 44 1 -11 128 151 55 -19 97 81 -25 21 88 -20 67 22 -4 115
7728 115 79 124 -88 116 -73 -137 137 263 95 -35 -112 201 -153 -95 -187 -66 101 -78 -169 -51 47 -81 -160
7751 -160 153 137 -258 214 -68 54 377 278 -151 95 -118 -7 -101 -11 79 136 197 -61 -107 45 -395 129 -19
7774 -19 55 -219 -71 -60 11 48 -84 -26 -138 -89 -130 -115 227 -42 -84 190 -98 221 126 -199 164 179 128 -61
7798 -61 -237 145 70 182 87 73 152 116 114 -99 93 -99 44 73 82 20 235 -50 5 147 -56 92 -47 63
7822 63 -50 -26 -29 8 104 -63 -53 -89 157 -317 180 112 188 202 -46 70 -49 -234 -191 -28 -28 -19 34 140 -154 142
7848 142 186 188 -88 -334 -54 -22 115 8 -14 -122 48 -112 160 137 22 -106 85 -26 -144 -55 192 38
7870 38 -83 -18 -186 138 -56 45 -150 -40 -114 -4 85 -251 82 86 -99 219 258 -31 -57 -81 -27 -70 -236 -170
$$ packed form
7703A60j90R7J4l9j47K87l99J75Q6m3j2J39K3r6p4J16j6j06M6O7j08Q7m5k6J19
7728A15l6M5k12K04j89o4K74J26j68j30p7L13l54N8r2J21J67j79r1J18R8j28p9
7751a60L13j6l95M72k82J22L23r9m29K46k13J11r4R0R0N7O1k58m6J52m40N24j48
7774a9P4k74J48J1P1L7j32N8j12M9m1J5L42k69m2K74k88L19r5l25L63J5n1j89
7798f1j76L82p5J12r5j4P9l6kk13J92j92J43K9Ro2K15k85N5J42k03J48j39J10
7822F3j13K4lL7R6j67J0l6K46m74M97o8P6J4k48J16j19j85M3J63%RN3J06k94K96
7848A42M4Kk76k46K80L2J37j07k2j08J70j60K72k3j15j28J91j11j18Q9K47j54
7870C8j21O5j68L24j94J01j95J10p4J10Q9l36L33Mj85L18L9k89k6k4N4m3j66O6
$$ plain form
7894 -170 -19 -72 3 137 123 -291 37 36 -91 51 69 -70 66 -15 -147 47 82 2 155 -148 46 46 14 -71
7918 -71 245 -76 -192 62 -154 -59 110 195 138 -11 -179 -53 -98 -59 -142 -207 -67 95 366 -110 91 16 -10
7941 -10 -222 -51 89 268 120 3 19 -42 -130 26 127 13 -260 -82 114 -115 12 65 132 66 147 -82 23
7964 23 -11 39 -141 -215 139 72 -86 -64 51 -151 60 -181 229 -8 -43 56 -107 45 199 3 -179 -157 113
7987 113 7 -89 30 61 157 295 -199 126 120 1 -160 254 -247 -191 -72 -163 130 -191 78 -231 182 187 -36
8010 -36 70 17 0 52 -62 66 -37 -180 -46 -3 -120 -216 -150 -54 164 -66 -222 -80 -195 229 71 182 6
8033 6 -37 -19 -175 199 -48 4 -20 122 -46 -136 4 -12 -98 -92 28 -40 -88 169 209 -132 -98 -61 -148 132 -79 -76
8059 -76 16 187 -345 -191 -67 -13 89 62 0 60 40 58 68 290 190 73 -134 72 -99 -26 80 -91 -117 29
$$ packed form
7894a70J51n3P5J34j4m14L28jj27J42J8j39J36q1j32J94L5q0J53l03J94%l2q5
7918g1L16l21j16K54k16R5J69Q5n7j49j68J26m5L9q3o5J40J62K71m76K01p5k6
7941a0k12J71J40J79j48j17J6o1q8J56J01j14k73J78J96k29J27N3O7o6Q1k29J05
7964B3l4N0j80p4L54o7j58K2J15k02K11k41M10k37l5R9j63J52J54j96j82K2K70
7987A13j06r6J19L1R6J38m94L25oj19j61M14n01N6J19r1K93l21K69l09M13Nk23
8010c6J06n3j7N2j14J28j03j43J34M3j17r6O6R6K18k30j56J42j15M24j58J11j76
8033Fm3J8j56L74k47N2k4J42j68r0J40j6q6OJ20o8m8K57M0l41L4L7q7K80k11L
8059g6R2J71n32J54J24N4J02k7o2O0k0J8J0K22j00j17k07K06j71P3J06j71k6J46
$$ plain form
8083 29 40 14 -116 -69 -76 -89 114 1 -80 77 61 -104 -323 -12 109 176 30 -2 92 -42 276 0 -122 85
8107 85 22 119 -100 -163 99 -54 171 26 -124 -145 8 74 74 -69 -224 16 175 -198 42 -51 -114 69 21 3
8131 3 -68 26 -94 -87 201 -113 147 -30 -71 -6 83 178 51 -40 108 -211 112 -37 -68 30 87 -17 91 114 106 116
8157 116 -57 23 102 67 9 -230 16 51 116 -123 -175 83 131 61 81 125 15 285 -34 -98 -52 114 2 83 -116
8182 -116 -90 -34 71 -79 -17 203 -87 83 146
$$ packed form
8083B9J1k6j30M7pj3K03j13q1J57j6j65k19L11J21O7j46l2R4j34L18k76j22K07
8107H5o3R7k19o3K62j53K25j45j50k1J53O6%j43j55K40J59l73K40r3o3J83m8j8
8131Cp1R4j20PK88l14K60j77m1O5Q9R5j27r1J48l19L23j49l1R8N7j04J08K3qJ0
8157A16j73Q0P9l5n8k39K46L5O5k39n2K58M8p0K0M4j10K70l19o4M6J66j12Q1j99
8182a16K6N6J05j50O2K20k90J70O3
8191A46
$$ Imaginary data points
##PAGE= N=2
##DATA TABLE= (X++(I..I)), XYDATA
$$ plain form
0 0 0 0 0 0 0 0 0 0 0 0 0 0 0 0 4 -8 8 -8 8 -8 16 -16 16 -24 24 -32 35 -40 48 -52 60 -68 76 -90 100 -112
36 -112 126 -142 159 -175 196 -215 240 -266 293 -324 356 -393 433 -477 526 -578 638 -704 780
55 780 -864 962 -1074 1206 -1360 1551 -1786 2089 -2491 3055 -3905 5319 -8105 15628 -78163
70 -78163 -204846 42698 181835 81542 -6424 101477 184596 101635 35357 82608 82100 50071
82 50071 22866 -28482 -81433 -71468 -5856 -4973 -101532 -106898 -24721 -7679 -30085 -20153 9451
95 9451 17481 -2414 3712 -1306 -21494 23833 45244 -33363 -75418 -14445 51677 20363 -30135
108 -30135 19874 63294 31500 32455 64500 69731 54034 37528 24950 -11910 -29008 7442 -17715
121 -17715 -94512 -96136 -58453 -66524 -94226 -60558 535 -27184 -56815 24367 80113 42238
$$ packed form
0@%%%%%%%%%%%%%%Mj2J6j6J6j6K4l2L2m0M8n6O7p5Q8j00J12j28J44j66J90k12
36a12K38k68L01l34L71m11M55n06N59o17O80p49Q26r10J003j104J216j342J484
55G80j644J826k036K280k566K911l337L875m580N546o960R224j3424K3733r3791
70g8163j26683K47544J39137j00293q7966J07901Q3119q2961o6278M7251n08l2029
82E0071k7205n1348n2951R965O5612Q83r6559n366Q2177J7042k2406R932K9604
95I451Q030j9895O126n018k0188M5327K1411p8607m2055O0973O6122l1314n0498
108c0135N0009M3420l1794R55L2045N231j5697j6506j2578l6860j7098L6450k5157
121a7715p6797j624L7683q071k7702L3668O1093k7719k9631Q1182N5746l7875
$$ plain form
133 42238 30659 87900 110455 39071 6924 72043 75106 -573 -30133 -16263 -19122 -43771
145 -43771 -45419 -27698 -45946 -50902 -15215 -18782 -33090 -392 34610 17598 -25439 -7123 42935
158 42935 18745 -18204 1366 13648 -7138 -21438 412 23091 5047 2012 23291 15594
170 15594 13935 32353 34849 20280 4448 5487 2975 -20135 -17860 -11225 -38364 -50290 -37424
183 -37424 -30810 -33775 -29144 -465 4220 -17596 9245 48868 36678 18267 34994 58730 32940
196 32940 -7316 17169 42027 2834 -32480 -24815 -7028 -15575 -37686 -27816 -12958 -17481 -12871
209 -12871 -11912 -11039 9714 20906 9920 -6271 -879 27147 18849 -10385 -1369 12326 2336 -11384
223 -11384 -6860 10287 4445 -6577 6750 5485 -4791 7337 17588 8911 -8514 -8608 9490
$$ packed form
133D2238j1579N7241K2555p1384l2147O5119L063p5679k9560J3870k859k4649
145d3771j648J7721j8248m956L5687l567j4308L2698L5002j7012m3037J8316N0058
158D2935k4190l6949J9570J2282k0786j4300K1850K2679j8044l035K1279p697
170A5594j659J8418K496j4569j5832J039k512k3110K275O635k7139j1926J2866
183c7424O614k965M631K8679M685k1816K6841L9623j2190j8411J6727K3736k5790
196C2940m0256K4485K4858l9193l5314P665J7787q547k2111R870J4858m523M610
209a2871R59Q73K0753J1192j0986j6191N392K8026q298k9234R016J3695r990j3720
223a1384M524J7147n842j1022J3327j265j0276J2128J0251q677j7425r4J8098
$$ plain form
236 9490 631 -16934 -9251 -5516 -10424 -14850 -15147 -5318 -2168 319 6385 -3551 -1135 19200 19265
251 19265 7786 4592 12755 17053 -1227 -5588 8983 1763 -10130 -10736 -9288 -7111 -10706 -6793
265 -6793 -808 -10718 -8213 5071 3029 1128 4134 8183 8608 -270 4222 11904 2643 1168 3901
280 3901 -2072 -4851 -4205 1632 -216 -12795 -6868 2191 -5672 -7153 -1262 3663 2481 -5581 661
295 661 8385 3921 6172 5248 1242 4801 4418 3341 1199 -2680 2860 -1021 -11107 -4548 189 -2975
311 -2975 -6898 -8443 -261 -290 -6019 2265 4384 -469 1305 2582 4626 3168 152 5772 2632 -3651
327 -3651 1069 2039 1278 1517 -1523 1779 1194 -217 4768 1614 -415 2760 -1232 -3417 -3831 -4094 -2268
344 -2268 -9066 -11320 -4479 -6503 -7079 -2848 -468 3579 2293 4758 12726 11392 11037 14243 10414 9353
$$ packed form
236I490q859j7565P683L735m908m426k97R829L150K487O066r936K416K0335O5
251A9265j1479l194Q163M298j8280m361J4571p220j1893o06J448K177l595L913
265f793N985r910K505J3284k042j901L006M049M25q878M492P682r261j475K733
280C901n973k779O46N837j848j2579N927R059p863j481N891M925j182q062O242
295F61P724m464K251r24m006L559l83j077k142l879N540l881j0086O559M737l164
311b975l923j545Q182k9n729Q284K119m853J774J277K044j458l016N620l140o283
327c651M720R70p61K39l040L302n85j411M985l154k029L175l992k185m14k63J826
344b268o798k254O841k024n76M231K380M047j286K465P968j334l55L206l829j061
$$ plain form
360 9353 6815 3430 2933 -4674 -8323 -8065 -14124 -14372 -12923 -13666 -10019 -10209 -8093 -886 322 5516
376 5516 9104 6834 10643 12170 10534 9754 5232 6155 5392 -2474 -3260 -2562 -3401 -1841 -5897 -5464 -1250
393 -1250 -1120 1237 -101 -2390 2795 1704 -2274 -3636 -5061 -1474 -3400 -10959 -8483 -4055 -2192
408 -2192 -661 -2231 2694 9075 9171 11820 12288 11987 16001 11937 7164 4349 248 -255 -5973 -14284
424 -14284 -14458 -15805 -15664 -14696 -16270 -11425 -5995 -4439 1664 4600 7645 13226 13165 14247 13540 9517
440 9517 11039 9164 3401 -5 -4414 -3668 -3379 -9403 -9069 -6819 -5898 -2888 -4388 -3001 629 993
456 993 3247 1157 -3788 -340 2221 -341 -5351 -9379 -1696 3373 -4007 -5571 1181 9333 10434
471 10434 2786 5647 14952 13825 9191 3596 2631 4991 -473 -6461 -10614 -14494 -11387 -10721 -16417
$$ packed form
360I353k538l385m97p607l649K58o059k48J449p43L647j90K116P207J208N194
376E516L588k270L809J527j636p80m522R23p63p866p86O98q39J560m056M33M214
393a250J30K357j338k289N185j091l978j362j425L587j926p559K476M428J863
408b192J531j570M925O381R6K649M68l01M014m064m773k815m101n03n718q311
424a4284j74j347J41R68j574M845N430J556O103K936L045N581o1J082p07m023
440I517J522j875n763l406m409P46K89o024L34K250R21L010j500J387L630L64
456I93K254k090m945L448K561k562n010m028P683N069p380j564O752Q152J101
471A0434p648K861R305j127m634n595r65K360n464n988m153l880L107O66n696
$$ plain form
486 -16417 -16418 -11366 -2873 -378 -4941 231 11986 14352 11848 8884 12812 17608 10480 4733 4343 1907
502 1907 530 -4813 -8479 -7290 -8976 -8142 -5381 -8083 -6436 -1992 455 1967 -1355 416 5628
517 5628 2062 -588 493 577 132 -3422 -1925 2410 -1590 -2574 3761 7164 4838 962 5915 13740
533 13740 6936 -442 2623 5239 1791 -6723 -9799 -5492 -7814 -11406 -11138 -11549 -8191 -4079 -2378
548 -2378 -1130 -721 5406 13436 9591 5658 9454 13926 12340 2887 -616 5019 3209 -3889 -8302
563 -8302 -8047 -3685 -5280 -9342 -6939 -4919 -2094 49 -1592 -370 1560 3022 4715 505 -1497
578 -1497 2679 3581 448 -3128 -2196 3747 1957 -2624 619 4441 4711 1793 1409 6098 4445 -989
594 -989 988 1791 -1652 -5345 -5743 -2697 -5006 -10074 -6280 -3312 -3685 -2919 -2200 1716 3885 3743 6653
$$ packed form
486a6417jN052Q493K495m563N172J1755K366k504k964L928M796p128n747l90k436
502A907j377n343l666J189j686Q34K761k702J647M444K447J512l322J771N212
517E628l566k650J081Q4m45l554J497M335m000r84O335L403k326l876M953P825
533A3740o804p378L065K616l448q514l076M307k322l592K68m11L358M112J701
548b378J248M09O127Q030l845l933L796M472j586r453l503N635j810p098m413
563h302K55M362j595m062K403K020K825K143j641J222J930J462J693m210k002
578a497M176R02l133l576R32N943j790m581L243L822K70k918l84M689j653n434
594i89J977Q03l443l693l98L046k309n068L794K968l73P66P19L916K169j42K910
$$ plain form
611 6653 5916 5181 8207 7445 4094 1307 1022 3506 -273 -6369 -4612 -2827 -3169 -5234 -7215 -3192
627 -3192 -553 -1842 -1507 -1523 1119 3841 1679 566 772 1786 3608 684 -2193 56 1203 1777
643 1777 -279 -2791 919 3500 1400 -612 -595 3148 3658 -1575 -1905 260 184 -1415 -4185 -3000 -1208
660 -1208 -3239 -2737 -1886 -1979 -305 471 897 1693 950 3220 4248 1824 2294 2645 1898 1516 -261 -78
678 -78 -315 -2148 -1430 -1579 -3115 -1982 -1751 -1102 -1210 -1708 302 820 -556 794 1219 610 1364 257
696 257 774 853 -418 1006 -140 -936 508 -169 -202 388 -441 221 87 -219 717 -518 -251 832 -276
715 -276 -181 -172 -391 914 -821 -1144 657 -336 -424 -455 -592 1058 -214 -808 741 -108 262 640 -571 539
735 539 618 32 378 47 410 696 -843 -227 456 -80 139 -803 -449 813 -584 -171 132 -309 438 -56
$$ packed form
611F653p37p35L026p62l351k787k85K484l779o096J757J785l42k065j981M023
627c192K639j289L35j6K642K722k162j113K06J014J822k924k877K249J147N74
643A777k056k512L710K581k100k012J7L743N10n233l30K165p6j599k770J185J792
660a208k031N02Q51r3J674P76M26P96p43K270J028k424M70L51p47l82j777J83
678g8k37j833P18j49j536J133K31O49j08m98K010N18j376J350M25o09P54j107
696B57N17P9j271J424j146p96J444o77l3N90q29O62j34l06R36j235K67J083j108
715b76R5Rk19J305j735l23J801r93q8l1j37J650j272n94J549q49L70L78j211J110
735E39P9n86L46l31L63K86j539O16O83n36K19r42L54J262j397M13L03m41P47m94
$$ plain form
755 -56 -119 766 -739 -61 342 -729 -369 -734 -837 125 -935 -874 22 -410 379 124 -202 1190 1355 1172
775 1172 1532 889 1517 1558 -252 268 129 -663 -426 -1251 -1578 -1265 -2362 -1283 -1512 -1774 -149 -423 34
794 34 859 294 1839 1721 1059 1695 1294 860 1307 -135 173 242 -636 -252 -1043 -987 149 -759 -806 -343 -466
815 -466 613 -272 -763 540 -289 -492 -507 -1189 -256 -729 -1072 -138 -508 270 1332 397 1225 1619 1498 1976
835 1976 1450 1214 2155 530 348 -432 -1125 -1001 -1925 -2520 -1808 -2450 -2111 -1176 -1779 -719 75 368 1338
854 1338 1002 1683 2413 1415 1924 1554 778 1318 481 31 -235 -1279 -645 -862 -1426 -533 -612 -518 -273 -501
874 -501 91 431 -475 669 -191 -831 66 -643 -477 -629 -887 163 125 -446 819 1035 1301 1752 1370 1824
894 1824 1789 1130 1324 237 -401 74 -1099 -1745 -2077 -2470 -1301 -1941 -2420 -955 -834 -361 748 349 1528
$$ packed form
755e6o3Q85j505O78M03j071L60l65j03R62j060O1Q96m32P89k55l26J392J65j83
775A172L60o43O28M1j810N20j39p92K37q25l27L13j097J079k29k62J625k74M57
794C4Q25n65J545j18o62O36m01m34M47j442L08O9q78L84p91N6J136r08m7M63j23
815d66J079q85m91J303q29k03j5o82R33m73l43R34l70P78J062r35Q28L94j21M78
835A976n26k36R41j625j82p80o93J24r24n95P12o42L39R35o03J060P94K93R70
854A338l36O81P30r98N09l70p76N40q37m50k66j044O34k17n64Q93p9R4K45k28
874e01N92L40r06J144q60o40Q97p09J66j52k58J050l8n71J265K16K66M51l82M54
894A824l5o59J94j087o38M75j173o46l32l93J169o40m79J465J21M73J109l99J179
$$ plain form
913 1528 1664 1776 2486 1096 1283 1785 786 177 -53 -673 -482 -1287 -754 -354 -1527 -969 234 -538 -361
932 -361 -251 504 918 -428 -298 961 11 -163 -559 -504 -389 -640 237 590 -638 195 1533 827 392
951 392 508 1542 1992 -57 -229 748 -339 -479 -1217 -1579 -806 -1320 -1259 -1005 -1194 -91 423 -326 318
970 318 733 1444 1807 719 1187 1246 1194 1285 -188 -858 378 46 -1038 -1438 -859 193 -679 -1343 113
989 113 406 7 -254 181 780 -121 -494 1188 152 -597 54 257 -9 -901 -613 1153 18 -757 505
1008 505 674 350 269 691 1248 -93 -635 1022 4 -947 -715 -224 -55 -1128 -1194 93 -131 -171 -115 49
1028 49 660 783 471 776 342 704 1242 209 67 61 -290 14 -586 -784 -663 -597 134 -373 -1276 476 919
1049 919 -315 -325 12 1170 362 -706 686 793 -480 -149 139 47 -491 -505 383 -140 -774 328 766
$$ packed form
913A528J36J12P10j390J87N02r99o09k30o20J91q05N33M00j173N58J203p72J77
932c61J10P55M14j346J30J259r50j74l96N5J15k51Q77L53j228Q33J338p06m35
951C92J16J034M50k049j72R77j087j40p38l62P73n14O1K54j89J103N14p49O44
970C18M15P11L63j088M68N9n2R1j473o70J236l32j084m00N79J052q72o64J456
989A13K93l99k61M35N99r01l73J682j036p49O51K03k66q92K88J766j135p75J262
1008E05J69l24q1M22N57j341n42J657j018r51K32M91J69j073o6J287k24m0N6J64
1028D9O11J23l12L05m34L62N38j033j42ol51L04o00j98J21O6P31n07r03J752M43
1049I19j234j0L37J158q08j068J392J07j273L31K88r2n38j4Q88n23o34J102M38
$$ plain form
1068 766 -210 -690 197 928 8 -915 244 546 -372 -432 -80 522 -457 -486 530 100 -777 355 547 95
1088 95 37 -45 546 223 -288 502 119 -269 210 -410 -197 -359 -361 97 -214 -325 250 -437 -109 297 -8 63
1110 63 238 507 554 -539 1 814 -137 -231 -129 306 224 -895 -398 452 -773 -363 192 -266 -566 -509 297
1131 297 337 -592 216 873 -176 -276 533 503 142 -245 407 616 -293 -74 312 -168 -368 -497 150 -202
1151 -202 -650 74 179 -668 58 379 220 -53 42 465 362 -480 202 -43 -360 -108 -59 161 102 -481 508
1172 508 228 -219 350 318 -34 48 202 337 -318 -494 249 -194 -654 -212 75 -202 -137 -331 470 -186 -260
1193 -260 687 196 152 398 259 489 -17 128 530 -429 -242 -71 -289 -355 -250 -40 -101 -493 -31 484 255
1214 255 -53 393 200 435 107 387 431 -262 -51 516 -244 -126 -27 51 -402 -463 -1 294 -371 64 591
$$ packed form
1068G66r76m80Q87P31r20r23J159L02r18o0L52O02r79k9J016m30q77J132J92m52
1088I5n8q2N91l23n11P90l83l88M79o20K13j62kM58l11j11N75o87L28M06l05P1
1110F3J75K69M7j093N40Q13r51r4J02M35q2j119M97Q50j225M10N55m58l00N7Q06
1131B97M0r29Q08O57j049j00Q09l0l61l87O52K09r09K19L86m80k00j29O47l52
1151b02m48P24J05q47P26L21j59k73R5M23j03q42O82k45l17K52M9K20n9n83R89
1172E08k80m47N69l2l52Q2J54J35o55j76P43m43m60M42K87k77O5j94Q01o56p4
1193b60R47m91m4K46j39K30n06J45M02r59J87J71k18o6J05K10o1l92M62N15k29
1214B55l08M46j93K35l28K80M4o93K11N67p60J18R9P8m53o1M62K95o65M35N27
$$ plain form
1235 591 222 26 -86 72 178 -470 -213 262 -556 -154 -29 -13 1 -429 279 231 39 628 583 248 284 63
1257 63 405 30 -421 -51 -112 -582 -417 -344 -532 -547 -422 46 -212 -151 380 317 285 528 494 621 280 332 408
1280 408 26 -629 234 -200 -86 -550 -307 -63 -570 3 438 -130 -265 304 217 136 267 130 163 -320 -407
1301 -407 133 120 -369 85 26 211 70 -7 400 164 160 518 248 81 201 102 182 -441 -110 -157 -541 -630 -208
1324 -208 -467 -185 -353 -247 208 -128 270 568 101 519 562 285 282 -14 380 -12 -297 -17 -283 -282 -354 -288
1346 -288 -192 6 -353 -30 -15 -3 160 216 175 243 -81 396 -59 -175 -26 34 -164 12 -136 201 71 -156
1368 -156 360 142 -150 209 127 24 49 -148 44 -287 -323 -200 -401 -449 -304 -315 11 -157 -115 326 254 -140
1390 -140 380 244 340 435 296 316 -34 -161 -25 -156 -66 -34 -288 -24 -90 -368 279 -344 -260 229 -127 -78 -149
$$ packed form
1235E91l69j96j12J58J06o48K57M75q18M02J25J6J4m30P08m8j92N89m5l35L6k21
1257F3L42l75m51L70o1m70J65P3j88j5J25M68k58O1N31o3l2K43l4J27l41N2P6
1280D08l82o55Q63m34J14m64K43K44n07N73M35n68j35N69q7q1J31j37L3m83q7
1301d07N40j3m89M54n9J85j41p7M07k36mL58k70j67J20r9Q0o23L31m7l84q9M22
1324b08k59K82j68J06M55l36L98K98m67M18M3k77lk96L94l92k85K80k66Jp2O6
1346b88R6J98l59L23J5J2J63N6m1O8l24M77m55j16J49O0j98J76j48L37j30k27
1368a56N16k18k92L59q2j03K5j97J92l31l6J23k01m8J45j1L26j68M2M41p2l94
1390a40N20j36R6R5j39K0l50j27J36j31R0L2k54K64o6k78O47o23Q4M89l56M9p1
$$ plain form
1413 -149 164 170 266 -366 253 -208 -4 219 -182 25 -2 -54 393 118 -23 188 -46 429 132 63 132 -121
1435 -121 -227 -28 -281 -542 -382 -113 -86 -165 -171 323 -166 -19 125 -178 293 329 346 195 201 70 304 49 -32
1458 -32 -120 -112 110 -224 -76 -220 -129 -28 -70 -330 -106 34 -106 404 98 145 88 -72 196 -27 -68 134 278
1481 278 51 104 49 103 -186 -83 192 107 -86 -149 -164 174 23 -64 -74 -70 -248 69 -64 248 -16 -91 -217 -168
1505 -168 -94 -36 167 -12 -86 -257 206 -19 -329 115 116 -189 45 158 77 3 -236 136 -32 -164 33 -426
1527 -426 122 150 -336 100 55 -60 -120 -267 61 22 -246 -312 6 47 -171 22 118 136 -47 82 78 -120 3
1550 3 25 148 15 -80 118 158 87 -30 75 166 33 -207 19 52 7 -139 -245 12 149 -102 -107 231 -249 175
1574 175 -89 -205 215 -155 -50 219 4 -32 50 131 86 -25 -180 4 -60 -125 -300 -26 -99 67 -75 15 -63
$$ packed form
1413a49L13OR6o32O19m61K04K23m01K07k7n2M47k75j41K11k34M75k97o9O9k53
1435a21j06J99k53k61J60K69K7p9oM94m89J47J44l03M71L6J7j51Oj31K34k55q1
1458c2q8QK22l34J48j44R1J01m2k60K24J40j40N10l06M7n7j60K68k23m1K02J44
1481B78k27N3n5N4k89J03K75q5j93o3j5L38j51q7j0Mj78L17j33L12k64p5j26M9
1505a68P4N8K03j79p4j71M63k25l10M44Jl05K34J13q1p4k39L72j68j32J97m59
1527d26N48K8m86M36m5j15o0j47L28l9k68o6L18M1k18J93R6J8j83J29mj98J23
1550CK2J23j33r5J98M0p1j17J05R1j33k40K26L3m5j46j06K57J37k51nL38m80M24
1574A75k64j16M20l70J05K69k15l6Q2Q1m5j11j55J84o4o5j75K74p3J66j42R0p8
$$ plain form
1597 -63 -66 167 -75 -63 -33 -147 15 -36 49 232 -154 118 -127 20 295 51 -58 141 -57 13 183 -13 -45
1620 -45 271 -230 169 -316 -245 -233 -115 -96 -107 -155 265 -107 51 281 130 165 174 -21 -56 158 110 61 -104 3
1644 3 124 -58 -163 -101 -65 -28 -84 -21 -80 -189 295 13 -52 23 -109 -27 -84 -160 -24 177 -254 -49 -144 146 41
1669 41 -45 155 92 -55 367 56 29 -70 85 -198 210 -25 -245 -70 -301 -10 -112 164 -13 -154 20 -51
1691 -51 60 157 96 247 -191 -12 81 261 -174 177 116 -204 291 -166 -150 -44 -112 361 107 62 221 32 75
1714 75 126 174 209 42 13 19 -207 -28 187 -149 272 -11 97 249 162 84 74 3 51 177 -24 27 66 -30 153
1739 153 -168 -92 -120 -194 118 -159 -73 147 -165 -31 82 7 -176 -188 104 152 122 -104 136 -173 132 -28 -140
1762 -140 328 -169 -36 205 -185 17 -20 -127 -23 -31 -109 -91 48 -117 101 -92 -203 -35 -140 -189 -9 98
$$ packed form
1597f3lK33k42J2L0j14J62n1Q5J83l86K72k45J47K75k44j09J99j98P0J70j96l2
1620d5L16n01L99m85P1J2J18J9j1m8M20l72J58K30j51L5Rj95l5K14m8m9j65J07
1644CJ21j82j05O2L6L7n6O3n9j09M84k82o5P5j32Q2n7p6J36K01m31K05r5K90j05
1669D1q6K00o3j47M22l11k7r9J55k83M08k35k20J75k31K91j02K76j77j41J74p1
1691e1J11R7o1J51m38J79R3J80m35L51o1l20M95m57J6J06o8M73k54m5J59j89M3
1714G5N1M8L5j67k9Ok26J79K15l36M21k83J08J52q7p8j0p1M8J26k01N1L9r6J83
1739A53l21P6k8p4L12k77Q6K20l12J34J13p5j83j2K92M8l0k26K40l09L05j60j12
1762a40M68m97J33K41l90K02l7j07J04qp8J8J39j65K18j93j11J68j05m9J80J07
$$ plain form
1784 98 51 -87 40 -231 -152 -74 251 233 127 44 -82 -30 -17 -75 -65 7 93 -188 45 -24 -72 24 -122 93 64
1809 64 -1 32 61 -39 -111 17 -57 -41 -60 -65 -62 -110 -95 34 -106 283 325 -46 194 -71 86 109 -208 -22 36 155
1835 155 70 -261 14 172 -14 56 27 64 -123 51 222 -94 -197 128 147 -175 -149 -99 -90 -114 -87 203 8 -24
1859 -24 83 149 172 -267 -9 -23 259 -92 155 242 68 185 -336 -49 214 -173 -197 132 -28 -1 -49 142 -9
1882 -9 107 -107 135 176 -40 -5 206 86 -47 126 115 -182 16 216 -94 151 42 -204 104 -193 -66 56
1904 56 18 -98 -170 -23 -13 247 -215 68 -214 65 -31 139 104 -71 -65 -207 185 118 40 180 157 37 69 43
1928 43 56 -148 -58 -73 119 -183 112 -183 -125 -72 -41 153 42 -95 30 163 -337 218 -228 -98 151 83 -120
1951 -120 -266 -43 -20 19 -171 -142 -204 -59 24 65 -98 -68 -199 44 95 -37 106 192 -110 137 98 -82 185
$$ packed form
1784I8m7j38J27k71P9P8L25j8j06q3j26N2J3n8J0P2Q6k81K33o9m8R6j46K15k9
1809F4o5L3K9j00p2J28p4J6j9nLm8J5J29j40L89M2l71K40k65J57K3l17J86N8J19
1835A55q5l31K75J58j86P0k9L7j87J74J71l16j03L25J9l22K6N0Rk4K7K90j95l2
1859b4J07O6K3m39K58j4K82l51K47Q7j74J17n21K87K63l87k4L29j60K7m8J91j51
1882iJ16k14K42M1k16L5K11j20j33J73j1k97J98K00l10K45j09k46L08k97J27J22
1904E6l8j16p2J47J0K60m62K83k82K79r6J70l5j75Oj42L92o7p8J40k3j20L2k6
1928D3J3k04R0j5J92l02K95k95N8N3L1J94j11j37J25J33n00N55m46J30K49o8k03
1951a20j46K23K3L9j90K9o2J45Q3M1j63L0j31K43N1j32J43Q6l02K47l9j80K67
$$ plain form
1974 185 -124 215 -34 -18 -2 -8 234 233 -193 251 149 -203 198 -120 -45 -115 -216 96 -263 182 -12 95 61
1997 61 -194 -85 -42 83 -26 153 -38 167 54 153 -8 313 48 -42 -67 -48 176 -72 -56 74 73 -37 315
2020 315 -158 120 -77 -35 66 -95 130 -79 152 -82 42 66 56 -235 26 83 2 -155 100 -34 122 -64
2042 -64 -200 -135 -164 -66 -22 77 89 -41 53 259 -35 105 -206 112 108 -203 180 128 -112 -183 -64 -25 67 -206 -111
2067 -111 66 -101 106 55 -131 -134 74 106 38 -301 40 11 212 -182 -76 -96 426 61 211 149 223 110 -274
2090 -274 -198 -52 60 -199 94 -217 24 -122 -53 60 33 181 188 -95 35 -93 -134 99 159 -220 94 -70
2112 -70 -119 163 170 88 117 -231 77 193 -3 27 -49 244 -286 -37 -102 3 -138 165 155 -167 69 112 10 154
2136 154 -116 14 100 -331 -132 -64 136 -137 82 135 56 -151 -94 -14 -259 59 -6 -97 15 -170 -130 -19 -82
$$ packed form
1974A85l09L39k49J6J6oK42jm26M44j02l52M01l18P5p0j01L12l59M45j94J07l4
1997F1k55J09M3J25j09J79j91K05j13R9j61L21k65r0k5J9K24k48J6J30jj10L52
2020C15m73K78j97M2J01j61K25k09K31k34J24K4j0k91K61N7q1j57K55j34J56j86
2042f4j36O5k9R8M4R9J2j30R4K06k94J40l11L18ml11L83n2k40p1J19L9R2k73R5
2067a11J77j67K07n1j86lK08L2o8l39L41k9K01l94J06k0N22l65J50o2P4j13l84
2090b74P6J46J12k59K93l11K41j46O9J13k7J48Pk83J30j28m1K33O0l79L14j64
2112g0m9K82Pq2K9l48L08J16j96L0p6K93n30K49o5J05j41L03j0l22K36M3j02J44
2136A54k70J30Q6m31J99O8K00k73K19N3p9k07N7Q0k45L18o5r1J12j85M0J11o3
$$ plain form
2159 -82 76 -163 98 -106 176 -133 -80 -127 64 116 49 -186 -196 219 196 162 12 -11 -303 17 51 -49 -145 -76
2183 -76 95 -262 -81 49 -27 233 -66 185 -174 -73 -68 -169 -63 -211 80 -176 -147 -97 -23 176 -252 12
2205 12 38 81 -3 -301 170 319 -81 -225 -1 -15 -159 111 -87 45 66 -5 238 -388 211 64 -6 -28 26
2228 26 91 122 -67 -80 -19 72 311 -78 18 93 271 -292 -119 -76 86 -84 -155 -12 190 26 31 286 -48 32
2252 32 -228 -84 -99 -42 -26 -81 -123 -87 -192 70 193 146 294 24 -3 -91 -86 20 -15 175 81 -8 -289 7 -59
2277 -59 16 -68 -78 23 -111 -26 142 -98 0 40 206 -2 -177 -87 38 -156 162 105 -60 69 -31 -126 31
2300 31 -131 18 -70 -79 52 59 -248 -36 -96 -132 -33 -102 36 -145 40 -52 122 -156 -161 -118 -104 -42 7 -6 61 49 -175
2327 -175 -184 -114 46 2 -3 14 -38 -48 -182 127 193 -225 -125 65 63 -142 -82 -287 -16 28 27 173 128 -227 -185 -104
$$ packed form
2159h2J58k39K61k04K82l09N3m7J91N2o7k35j0M15k3l4j50k3k92L20L4j00r6O9
2183g6J71l57J81J30p6K60k99K51l59J01Nj01J06j48K91k56K9N0P4J99m28K64
2205A2K6M3q4k98M71J49m00j44K24j4j44K70j98J32K1p1K43o26N99j47p0k2N4
2228B6O5L1j89j3O1R1K39l89R6P5J78n63J73M3J62j70p1J43K02j64NK55l34Q0
2252C2k60J44j5N7J6n5m2L6j05K62J23m7J48k70k7q8NJ06l5J90r4q9k81K96o6
2277e9P5q4j0J01j34Q5J68k40R8M0J66k08j75R0J25j94L18n7j65J29j00r5J57
2300C1j62J49q8rJ31Pl07K12o0l6R9o9J38j81J85r2J74k78nM3J4O2M9j3O7j2k24
2327a75rP0J60m4nJ7n2j0j34L09O6m18J00J90kk05O0k05K71M4jJ46m5l55M2Q1
$$ plain form
2353 -104 -140 25 -174 -136 32 145 -1 -79 -124 -25 31 236 -48 -88 6 -47 -79 -136 37 62 -287 -68 -200 125
2377 125 -63 -152 24 85 -131 -41 246 158 -55 -219 90 323 -39 -106 92 -158 24 0 -3 218 -36 -72 1
2400 1 -304 -116 29 -50 142 -144 -295 82 -47 -134 -195 -226 -83 -15 -149 92 -43 -11 -84 -83 153 -41 -150 -82
2424 -82 68 51 59 77 -217 100 116 239 49 -88 20 -101 -89 147 36 102 -10 150 -18 -36 -73 -109 -34 113
2448 113 -102 101 116 11 159 49 -183 -133 182 121 -2 14 -102 -48 80 -139 99 -149 -178 32 -108 -136
2470 -136 -43 -92 -114 -122 -118 -149 56 202 -72 -5 164 97 73 -209 -175 40 108 71 -10 151 -98 -175 -37 6 46 -161
2496 -161 -34 7 -271 199 -245 85 179 94 -72 -180 3 65 -48 47 -133 -66 97 -1 55 53 -36 -178 -52 29
2520 29 -163 177 -102 -103 -135 -64 163 117 23 26 -86 126 -3 -54 -100 -32 61 -46 37 -37 75 90 36 -50 -132 -70 -85
$$ packed form
2353a04l6J65j99L8J68J13j46p8m5R9N6K05k84m0R4n3l2n7J73K5l49K19j32L25
2377A25j88q9J76O1k16R0K87q8k13j64L09K33l62o7J98k50J82k4lK21k54l6P3
2400Al05J88J45p9J92k86j51L77j29q7o1l1J43O8j34K41j35L2p3JK36j94j09O8
2424h2J50j7QJ8k94L17J6J23j90j37J08j21J2K36j11O6j12J60j68j8l7l6P5J47
2448A13k15K03J5j05J48j10k32N0L15o1j23J6j16N4J28k19K38k48k9K10j40k8
2470a36R3m9k2qMl1K05J46k74O7J69o7k4k82L4K15O8l7q1J61k49p7J38M3M0k07
2496a61J27M1k78M70m44L30R4q5j66j08J83O2j13R5j80O7J63r8N6kq9j42J26Q1
2520B9j92L40k79jl2P1K27m6r4Lj12K12j29n1m6O8R3j07Q3p4J12J5n4q6q2O2j5
$$ plain form
2547 -85 51 -191 48 -55 -227 29 -66 -263 -45 -213 -327 -184 -179 -144 252 110 99 -169 -47 77 -89 48
2569 48 12 1 -23 436 -172 40 -79 -109 -174 -115 -117 -81 101 -24 -9 -33 22 117 74 166 -126 6 -109 -233 -58
2594 -58 -115 -58 121 -53 -133 -145 166 31 -248 -196 105 338 162 -64 -71 -108 -228 -219 90 186 -17 -195 16 -229
2618 -229 -2 116 244 106 53 -28 -73 24 122 91 -20 -49 -5 -66 -48 167 -156 280 137 96 173 173 179 -269 72
2643 72 223 6 83 -136 116 88 80 48 35 44 -140 -13 -145 -165 130 -66 -109 -100 203 -120 -125 -8 51 117 0 53
2669 53 -48 -120 9 211 -175 82 -46 28 -66 85 -75 83 19 -229 -73 -30 126 136 215 6 138 102 59
2692 59 42 -55 119 75 175 258 130 52 -181 -253 -78 -37 136 116 -88 161 -57 -1 -125 -261 282 -110 -60 49
2716 49 -182 -277 -149 27 197 2 0 31 -116 -201 -2 -58 74 -206 159 -177 57 -116 -34 63 170 -68 -161
$$ packed form
2547h5J36k42K39j03j72K56r5j97K18j68j14J43NL5L96j42j1k68J22J24j66J37
2569D8l6j1k4M59o08K12j19l0o5N9kL6J82j25J5k4N5R5m3R2k92J32j15j24J75
2594e8n7N7J79j74q0j2L11j35k79N2L01K33j76k26pl7j20RL09R6k03j78K11k45
2618b29K27J18J28j38n3q1m5R7R8l1j11k9M4o1J8K15l23M36j43m1P7%Om48L41
2643G2J51k17P7k19K52k8ql2j3Rj84J27j32k0K95j96m3RL03l23nJ17N9O6j17N3
2669E3j01p2J29K02l86K57j28P4r4J51j60J58o4k48J56M3J56J0P9k09J32l6m3
2692E9j7r7J74m4J00Q3j28p8k33p2J75M1J73k0k04K49k18N6j24j36N43l92N0J09
2716D9k31r5J28J76J70j95kL1j47q5J99n6J32k80L65l36K34j73Q2R7J07k38r3
$$ plain form
2739 -161 -41 -78 -226 10 -1 -44 34 -208 24 -1 -48 123 38 -6 125 -11 20 -42 168 181 -65 189 126 -209
2763 -209 12 -109 -44 30 84 26 145 -77 87 205 -94 -17 17 68 -54 48 85 -107 -284 154 163 -109 86
2786 86 -289 15 -148 120 410 6 -119 -50 82 -169 54 81 66 5 201 -98 -155 -17 221 38 6 62 -121
2809 -121 -86 -49 -133 16 164 -296 120 217 305 -152 78 -20 109 -135 -21 6 120 152 -400 -16 -44 239 -52
2832 -52 -84 -187 -50 -62 -116 27 -116 212 -160 74 -4 233 67 -113 -21 -50 -178 -31 59 -30 -104 50 36 32
2856 32 -207 53 -43 -12 -3 -10 37 40 -11 -28 115 43 -48 -54 63 -5 -99 -49 134 -320 225 -70 162 -3 -5 25 145
2883 145 132 31 130 -168 -46 -23 -83 146 -182 48 -118 45 -66 45 37 173 -53 -165 -139 11 -24 -229 -33
2906 -33 -59 -21 -44 49 146 103 -57 -104 -40 -86 -5 1 -37 257 84 21 -114 -27 -110 -313 -71 -48 -106 -12 5 131 161
$$ packed form
2739a61J20l7j48K36j1m3P8k42K32k5m7J71q5m4J31j36L1o2K10J3k46K54o3l35
2763b09K21j21O5P4N4n8J19k22J64J18k99P7L4N1j22J02L7j92j77M38Rk72J95
2786H6l75L04j63K68K90m04j25O9J32k51K23K7j5o1J96k99n7J38K38j83l2N6j83
2809a21L5L7q4J49J48m60M16R7Q8m57K30r8J29k44J14K7J14L2n52L84k8K83k91
2832e2l2j03J37j2n4J43j43L28l72K34p8K37j66j80R2k9j28J47R0q9p4J54j4m
2856C2k39K60r6L1RpM7Ln1j7J43p2r1oJ17o8r4N0J83m54N45k95K32j65kL0J20
2883A45j3j01R9k98J22K3o0K29l28K30j66J63j11J11qJ36k26j12K6J50l5k05J96
2906c3k6L8k3R3R7m3j60m7O4m6Q1Ol8K94j73o3j35Q7q3k03K42K3n8R4J7J26L0
$$ plain form
2933 161 72 196 -96 90 164 67 76 -198 82 -15 77 86 -84 -139 136 81 1 122 123 -38 28 24 -48 135 -130 -224
2959 -224 -177 -135 156 -167 41 -101 -157 127 -116 28 -13 55 -93 89 3 -129 112 -3 73 -147 -5 -217
2981 -217 76 345 57 10 -60 71 136 -37 -173 -138 -59 149 225 63 -29 60 -2 91 -101 217 47 28 181 72
3005 72 -12 46 -16 -2 -48 49 80 -199 -69 18 -54 -161 134 90 -4 -161 -93 240 211 -146 -34 -132 -156 -53 -260
3030 -260 -40 128 -63 -288 -42 54 360 -12 -89 77 -39 101 54 37 41 75 35 -161 -193 -51 -61 -70 1 86 10
3055 10 -32 43 54 129 113 -90 20 67 25 -203 -189 -103 -202 260 -179 69 -163 -211 136 -429 -93 346 -55 -210
3079 -210 90 -20 48 33 -215 13 -83 175 -173 -260 95 159 -121 113 3 33 20 163 148 -47 18 5 -62 142
3103 142 198 -129 -45 -181 114 217 132 -57 27 -158 90 50 -70 41 -120 200 185 8 122 37 187 331
$$ packed form
2933A61q9J24k92J86P4r7Rk74K80r7R2Rj70n5K75n5q0J21Jj61O6mp2J83k65r4
2959b24M7M2K91l23K08j42n6K84k43J44m1O8j48J82q6j32K41j15P6k20J42k12
2981b17K93K69k88m7p0J31O5j73j36L5P9K08P6j62r2Q9o2R3j92L18j70j9J53j09
3005G2q4N8o2J4m6R7L1k79J30Q7p2j07K95m4r4j57O8L33k9l57J12r8k4J03k07
3030b60K20J68j91k25K46R6L06l72p7J66j16J40m7j7ML4m0j96l2J42j0rP1Q5p6
3055A0m2P5J1P5j6k03J10M7m2k28J4Q6r9M62m39K48k32m8L47n65L36M39m01j55
3079b10L00j10O8j5k48K28r6K58l48q7L55O4k80K34j10L0j3J43j5j95O5j3o7K04
3103A42N6l27Q4j36K95J03q5j89Q4j85K48m0j20J11j61L20j5j77J14q5J50J44
$$ plain form
3125 331 158 -4 -105 -21 -112 -63 53 217 269 -132 26 67 39 -52 -194 -56 -35 15 -157 -22 112 -43 36
3148 36 -138 179 120 11 23 199 104 231 -20 73 -359 -19 42 -194 211 -89 -129 -82 -117 14 -13 -56 -82 -102
3172 -102 -101 96 -52 177 20 230 106 -29 -131 -17 291 131 -149 90 138 137 -84 41 148 188 44 92
3194 92 -167 -64 -310 -55 93 -215 90 -5 -243 135 -26 138 -59 -53 -55 -78 -185 -178 134 -185 -12 -105 -147 -9
3218 -9 6 95 48 -65 15 -138 234 102 -52 -16 -161 -49 45 -207 155 64 -65 13 33 121 -40 6 334 -71
3242 -71 -55 227 12 50 58 107 -165 103 -154 -31 246 16 -166 76 -41 94 -193 56 -167 -60 83 126
3264 126 87 -81 -42 -42 -12 -112 -4 109 109 52 -14 2 14 291 -5 -86 -211 -14 35 -334 -115 18 97 -162 -99
3289 -99 101 -37 -57 241 -58 104 81 28 -75 -26 -125 -74 -187 -148 22 25 -57 -124 -131 -33 -37 -121 176 -133 226 10
$$ packed form
3125C31j73j62j01Q4r1M9J16J64N2m01J58M1k8r1j42J38K1N0j72J35J34j55P9
3148C6j74L17n9j09J2J76r5J27k51R3m32L40O1k36M05l00m0M7l5J31k7m3k6k0
3172a02JJ97j48K29j57K10j24j35j02J14L08j60k80K39M8jk21J25J07M0j44M8
3194I2k59J03k46K55J48l08L05r5k38L78j61J64j97Okk3j07PL12l19J73r3m2J38
3218iJ5Q9m7j13Q0j53L72j32j54L6j45J12R4k52L62r1j29P8K0Q8j61M6L28m05
3242g1J6K82k15L8QM9k72K68k57J23K77k30j82K42j17J35k87K49k23J07J43M3
3264A26l9j68L9%L0j00J08J13%n7o6J6J2K77k96q1j25J97M9l69K19J33P9k59O3
3289i9K00j38k0K98k99J62k3n3j03M9r9N1j13L9J70Lq2o7pR8mq4K97l09L59k16
$$ plain form
3315 10 -176 -34 35 -190 39 -63 -287 101 55 102 -138 64 22 52 25 -8 -28 -66 121 32 26 -122 56 267
3339 267 -151 111 -137 -51 124 150 -244 -11 -6 -15 43 -250 178 2 131 270 -41 -81 -19 143 -87 1 -76 1
3363 1 119 -145 -100 -81 84 -50 -249 47 296 80 147 -21 5 -10 -155 -45 16 -217 -208 -178 55 -114 12 -29
3387 -29 -32 -220 345 67 190 17 -139 96 75 75 -167 -66 10 -58 -186 26 79 8 -71 46 80 77 -39 -78 61
3412 61 131 -29 27 -26 -131 162 -72 -220 -69 -81 -334 143 -4 -185 125 -41 -106 129 2 154 -301 52
3434 52 132 -178 218 92 134 -143 132 26 87 275 -250 220 58 -134 -22 238 90 -164 167 -96 164
3455 164 337 294 62 -145 3 -15 -11 370 -43 12 183 -31 -54 27 113 -42 310 126 39 154 59 79 -113 -26
3479 -26 -92 -27 -57 172 15 93 -124 -122 30 62 -46 152 -23 -16 -63 181 3 -184 -263 52 -70 -120 -78 -22 -156
$$ packed form
3315A0j86J42O9k25K29j02k24L88m6M7k40K02m2L0k7l3k0l8J87q9oj48J78K11
3339B67m18K62k48Q6J75K6l94K33NrN8k93M28j76J29J39l11m0O2J62k30Q8p7P7
3363AJ18k64M5J9J65j34j99K96K49k16O7j68K6j5j45J10O1k33RL0K33j69J26m1
3387b9lj88N65k78J23j73j56K35k1%k42J01P6o8j28K12N3p1p9J17L4lj16l9J39
3412F1P0j60N6n3j05K93k34j48J51j2k53M77j47j81L10j66o5K35j27J52m55L53
3434E2Q0l10L96j26M2k77K75j06O1J88n25M70j62j92J12K60j48k54L31k63K60
3455A64J73m3k32k07J48j8ML81m13N5J71k14k3Q1Q6j55L52j84q7J15r5K0j92Q7
3479b6o6O5l0K29j57P8k17KJ52L2j08J98j75Pm7K44j78j87p9L15j22n0M2N6j34
$$ plain form
3504 -156 176 25 93 16 -125 -56 82 -13 -18 -202 -36 187 -239 134 37 30 20 94 -46 -170 -319 -176 136 159
3528 159 -122 -205 45 -155 192 -22 -208 -283 64 -256 -81 -139 -201 67 55 62 31 -225 -36 81 124 131 21 120
3552 120 -109 -82 121 -112 205 -49 59 27 -55 -15 -80 -24 52 -188 -272 28 -115 -81 -130 109 -25 -227 -191 -50
3576 -50 -6 165 -104 107 39 -131 77 125 160 -51 36 -216 53 41 67 -304 -142 156 134 -172 -9 60 18 15
3600 15 -53 -290 66 -1 -272 -195 313 37 -13 5 -179 178 -48 -50 10 10 -140 14 -96 -7 -70 -34 10 -142 181
3625 181 179 -87 -143 -85 1 -81 135 -190 292 -35 85 164 36 -89 -113 137 13 -78 191 199 -84 109 9 -106
3649 -106 -163 25 -192 41 -48 -169 -78 148 -6 120 -27 -81 -55 35 41 133 -32 -57 -57 80 -40 82 5 161
3673 161 -9 0 117 -20 -31 -124 -81 -115 0 -221 -152 -70 123 168 -49 293 106 197 314 81 -47 129 81 109
$$ packed form
3504a56L32j51O8p7j41O9J38r5nj84J66K23m26L73r7pj0P4j40j24j49J43L12K3
3528A59k81q3K50k00L47k14j86p5L47l20J75n8o2K68j2Pl1k56J89J17M3Pj10R9
3552A20k29K7K03k33L17k54J08l2q2M0o5N6P6k40q4L00j43L4m9K39j34k02L6J41
3576e0M4J71k69K11o8j70K08M8L5k11Q7k52K69j2K6l71J62K98k2l06J63O9m2l
3600A5o8k37L56o7k71P7N08k76n0J8j84L57k26kO0%j50J54j10Q9o3L6M4j52L23
3625A81kk66n6N8Q6q2K16l25M82l27J20P9j28j25k4K50j24r1K69Qk83J93j00j15
3649a06n7J88k17K33q9j21R1K26j54J26j47n4K6R0OR2j65k5%J37j20J22p7J56
3673A61j70RJ17j37j1r3M3l4J15k21O9Q2J93M5k17L42j87R1J17k33j28J76m8K8
$$ plain form
3697 109 92 216 -102 160 104 -56 -97 17 -12 -93 85 -49 142 201 195 52 -240 -76 243 52 -114 -124 -188
3720 -188 54 -120 44 -25 247 195 86 34 -155 238 75 -111 -14 -44 85 -322 -73 35 173 196 -24 12
3742 12 193 100 315 -86 18 67 -102 42 -48 -96 88 134 -76 27 95 84 62 10 -134 165 47 -185 -19
3765 -19 -89 167 123 -29 -101 168 40 110 78 46 83 129 -209 22 -91 -15 101 -215 328 -253 -42 47 149 -97
3789 -97 -200 -86 0 -118 -173 -146 115 -44 33 103 -21 -161 -177 46 -37 -125 260 19 103 -146 68 4 -87 241
3813 241 23 133 -108 119 -243 -20 -115 -36 44 129 -59 75 -49 89 -153 -327 -99 -147 -81 70 -128 -45
3835 -45 -45 -213 143 0 57 -227 -244 118 -12 -74 -70 -97 154 39 -207 -177 -108 -163 -160 307 62 -103 -245 -121 -63
3860 -63 -75 3 6 -32 207 26 120 140 -113 -27 -87 362 -16 210 -69 -68 -50 95 123 19 -150 -125 105 38 124 242
$$ packed form
3697A09j7J24l18K62n6j60m1J14k9q1J78j34J91N9oj43k92J64L19j91j66j0o4
3720a88K42j74J64o9K72n2j09n2j89L93j63j86R7l0J29m07K49J08J38K3k20L6
3742A2J81r3K15m01J04M9j69J44r0m8J84M6k10J03O8j1k2n2j44K99j18k32J66
3765a9p0K56m4j52p2K69j28P0l2l2L7M6l38K31j13P6J16l16N43n81K11Q9J02k46
3789i7j03J14Q6j18n5K7K61j59P7P0j24j40j6K23q3q8L85k41Q4k49K14o4r1L28
3813B41k18J10k41K27l62K23r5P9Q0Q5j88J34j24J38k42j74K28m8O6J51j98Q3
3835d5%j68L56j43N7k84j7L62j30o2Mk7K51j15k46L0O9n5LM67k45j65j42J24N8
3860f3j2P8Ll8K39j81R4K0k53Q6o0M49l78K26k79JJ8J45K8j04j69K5K30o7Q6J18
$$ plain form
3886 242 -127 -37 -38 108 32 -51 -46 31 -64 -98 148 33 66 -15 -202 111 -44 54 40 228 -11 55 317 -104 215
3911 215 182 -123 -8 181 181 -204 257 -309 9 -107 29 -110 -126 274 -95 45 128 32 -122 -128 125 -107 -137
3934 -137 167 189 -130 228 -130 3 -104 143 -22 167 -61 106 -214 71 -153 213 -80 34 143 -104
3954 -104 90 77 129 -67 128 -195 -5 -83 86 305 -193 -205 -103 82 -52 -302 0 -157 71 -14 160 21
3976 21 204 76 -1 -38 63 -69 0 -161 -28 4 113 31 68 177 148 15 95 141 -8 83 -8 125 195 -124
4000 -124 23 121 -5 0 95 57 107 8 -40 101 73 196 152 253 -36 -114 38 291 190 252 -126 198 74 -188
4024 -188 -170 211 27 59 86 66 113 -144 -11 37 207 65 70 115 -28 37 -154 132 73 -174 -104 260 309 78
4048 78 130 -256 -223 -13 31 -275 -19 -50 -74 28 102 -5 24 53 -60 90 -113 -213 -51 54 57 126 -195 -145
$$ packed form
3886B42l69R0jJ46p6q3NP7r5l4K46j15L3q1j87L13j55R8j4J88k39O6K62m21L19
3911B15l3l05J15J89%l85M61n66L18j16J36j39j6M00l69J40Q3r6j54oK53k32l0
3934a37L04K2l19L58l58J33j07K47j65J89k28J67l20K85k24L66k93J14J09k47
3954a04J94j3N2j96J95l23J90p8J69K19m98j2J02J85j34k50L02j57K28q5J74j39
3976B1J83j28p7l7J01j32O9j61J33L2J09q2L7J09k9j33Q0M6j49R1r1J33P0l19
4000a24J47R8j26NR5l8N0r9m8J41k8J23m4J01k89p8J52K53j01O2l78L24j24k62
4024a88J8L81j84L2K7k0M7k57J33M8J70j42NM5j43O5j91K86n9k47P0L64M9k31
4048G8N2l86L3K10M4l06K56l1k4J02P4j07K9K9j13J50k03j00J62J05LO9l21N0
$$ plain form
4072 -145 -92 248 7 -127 -83 -82 -69 -203 149 -2 -138 -29 92 186 63 6 -24 -50 -258 -110 -251 -137 60
4095 60 -169 -7 -114 135 -68 214 -35 -189 -214 265 190 -123 -81 186 223 64 -118 39 270 -107 -55 -203
$$ packed form
4072a45N3L40k41j34M4JJ3j34L52j51j36J09J21R4j23n7l0k6k08J48j41J14J97
4095F0k29J62j07K49k03K82k49j54k5M79p5l13M2K67L7j59j82J57K31l77N2j48
$$ [...]
8191a4
##END NTUPLES=NMR FID
##END=
