##TITLE=1H_Pr T-800-2
 D2O,8 sc, 
 19.12.2019
##JCAMPDX= 6.0         $$ Bruker NMR JCAMP-DX V2.0
##DATA TYPE= NMR FID
##DATA CLASS= NTUPLES
##ORIGIN= UXNMR, Bruker Analytische Messtechnik GmbH
##OWNER= root
$$ XWIN-NMR		Version 3.5
$$ Thu Dec 19 14:41:05 2019 Russian Standard Time (UT+4h)  she@DPX200
##.OBSERVE FREQUENCY= 200.1315
##.OBSERVE NUCLEUS= ^1H
##.DELAY= (6, 6)
##.ACQUISITION MODE= SIMULTANEOUS
##.ACQUISITION SCHEME= undefined
##.AVERAGES= 8
##.DIGITISER RES= 18
##SPECTROMETER/DATA SYSTEM= spect
##.PULSE SEQUENCE= zg30
##.SOLVENT NAME= D2O
##.SHIFT REFERENCE= (INTERNAL, D2O, 0, 15.7039)
##AUDIT TRAIL= $$ (NUMBER, WHEN, WHO, WHERE, WHAT)
$$ ##TITLE= Audit trail, XWIN-NMR		Version 3.5
$$ ##JCAMPDX= 5.01
$$ ##ORIGIN= Bruker BioSpin GmbH
$$ ##OWNER= she
$$ F:/spectra/data/she/nmr/H-F/1/audita.txt
$$ ##AUDIT TRAIL=  $$ (NUMBER, WHEN, WHO, WHERE, WHAT)
(   1,<2019-12-19 14:39:26.98 +0400>,<she>,<DPX200>,
      <created by zg, POWCHK disabled, PULCHK disabled
       configuration hash MD5:
       00 E9 B6 7A A2 85 ED C7 34 08 36 98 17 FE 4E 26
       data hash MD5: 16K
       6A 05 DC F6 F6 C4 EB 50 50 4D 5C 89 F8 ED 3F 56>)
$$ ##END=
$$ 
$$ hash MD5
$$ DD 14 2D 6E 06 57 B2 17 6C 03 4B 6B 28 FD 8E F7
##$RELAX= 
##$RELAX= 
##$RELAX= 
##$RELAX= 
##$RELAX= 
##$RELAX= 
$$ Bruker specific parameters
$$ --------------------------
##$DU= <F:/spectra>
##$EXPNO= 1
##$NAME= <H-F>
##$PROCNO= 1
##$TYPE= <nmr>
##$USER= <she>
##$AMP= (0..31)
100 100 100 100 100 100 100 100 100 100 100 100 100 100 100 100 100 100 
100 100 100 100 100 100 100 100 100 100 100 100 100 100 
##$AQSEQ= 0
##$AQ_mod= 1
##$AUNM= <au_zg>
##$AUTOPOS= <>
##$BF1= 200.13
##$BF2= 200.13
##$BF3= 200.13
##$BF4= 200.13
##$BF5= 200.13
##$BF6= 200.13
##$BF7= 200.13
##$BF8= 200.13
##$BYTORDA= 1
##$CFDGTYP= 0
##$CFRGTYP= 5
##$CHEMSTR= <none>
##$CNST= (0..31)
1 1 145 1 1 1 1 1 1 1 1 1 1 1 1 1 1 1 1 1 1 1 1 1 1 1 1 1 1 1 1 1 
##$CPDPRG= <>
##$CPDPRG1= <>
##$CPDPRG2= <>
##$CPDPRG3= <>
##$CPDPRG4= <mlev>
##$CPDPRG5= <mlev>
##$CPDPRG6= <mlev>
##$CPDPRG7= <mlev>
##$CPDPRG8= <mlev>
##$CPDPRGB= <>
##$CPDPRGT= <>
##$D= (0..31)
0 1.2 0 0 0 0 0 0 0 0.06 0 0.03 0 0 0 0 0.0002 0 0 0 0 0 0 0 0 0 0 0 0 
0 0 0 
##$DATE= 1576751966
##$DBL= (0..7)
120 120 120 120 120 120 120 120 
##$DBP= (0..7)
150 150 150 150 150 150 150 150 
##$DBP07= 0
##$DBPNAM0= <>
##$DBPNAM1= <>
##$DBPNAM2= <>
##$DBPNAM3= <>
##$DBPNAM4= <>
##$DBPNAM5= <>
##$DBPNAM6= <>
##$DBPNAM7= <>
##$DBPOAL= (0..7)
0.5 0.5 0.5 0.5 0.5 0.5 0.5 0.5 
##$DBPOFFS= (0..7)
0 0 0 0 0 0 0 0 
##$DE= 6
##$DECBNUC= <off>
##$DECIM= 24
##$DECNUC= <off>
##$DECSTAT= 4
##$DIGMOD= 1
##$DIGTYP= 9
##$DL= (0..7)
0 120 120 120 120 120 120 120 
##$DP= (0..7)
150 150 150 150 150 150 150 150 
##$DP07= 0
##$DPNAME0= <>
##$DPNAME1= <>
##$DPNAME2= <>
##$DPNAME3= <>
##$DPNAME4= <>
##$DPNAME5= <>
##$DPNAME6= <>
##$DPNAME7= <>
##$DPOAL= (0..7)
0.5 0.5 0.5 0.5 0.5 0.5 0.5 0.5 
##$DPOFFS= (0..7)
0 0 0 0 0 0 0 0 
##$DQDMODE= 0
##$DR= 18
##$DS= 0
##$DSLIST= <SSSSSSSSSSSSSSS>
##$DSPFIRM= 0
$$ [...]
##$SUBNAM2= <"">
##$SUBNAM3= <"">
##$SUBNAM4= <"">
##$SUBNAM5= <"">
##$SUBNAM6= <"">
##$SUBNAM7= <"">
##$SUBNAM8= <"">
##$SUBNAM9= <"">
##$SW= 24.9337058887773
##$SWIBOX= (0..15)
0 0 2 0 0 0 0 0 0 0 0 0 0 0 0 0 
##$SW_h= 4990.01996007984
##$TD= 16384
##$TD0= 1
##$TE= 0
##$TE2= 300
##$TE3= 300
##$TEG= 300
##$TL= (0..7)
0 120 120 120 120 120 120 120 
##$TP= (0..7)
150 150 150 150 150 150 150 150 
##$TP07= 0
##$TPNAME0= <>
##$TPNAME1= <>
##$TPNAME2= <>
##$TPNAME3= <>
##$TPNAME4= <>
##$TPNAME5= <>
##$TPNAME6= <>
##$TPNAME7= <>
##$TPOAL= (0..7)
0.5 0.5 0.5 0.5 0.5 0.5 0.5 0.5 
##$TPOFFS= (0..7)
0 0 0 0 0 0 0 0 
##$TUNHIN= 0
##$TUNHOUT= 0
##$TUNXOUT= 0
##$USERA1= <user>
##$USERA2= <user>
##$USERA3= <user>
##$USERA4= <user>
##$USERA5= <user>
##$V9= 5
##$VALIST= <valist>
##$VCLIST= <CCCCCCCCCCCCCCC>
##$VD= 0
##$VDLIST= <DDDDDDDDDDDDDDD>
##$VPLIST= <PPPPPPPPPPPPPPP>
##$VTLIST= <TTTTTTTTTTTTTTT>
##$WBST= 1024
##$WBSW= 4
##$XGAIN= (0..3)
0 0 0 0 
##$XL= 0
##$YL= 0
##$YMAX_a= 522332
##$YMIN_a= -329933
##$ZGOPTNS= <>
##$ZL1= 120
##$ZL2= 120
##$ZL3= 120
##$ZL4= 120
##$ABSF1= 10
##$ABSF2= 0
##$ABSG= 5
##$ABSL= 3
##$ALPHA= 0
##$AQORDER= 0
##$ASSFAC= 0
##$ASSFACI= 0
##$ASSFACX= 0
##$ASSWID= 0
##$AUNMP= <proc_1d>
##$AZFE= 0.1
##$AZFW= 0.1
##$BCFW= 1
##$BC_mod= 2
##$BYTORDP= 1
##$COROFFS= 0
##$CY= 11.3945322036743
##$DATMOD= 1
##$DC= 2
##$DFILT= <>
##$DTYPP= 0
##$F1P= 16.9975609425685
##$F2P= -3.02152046262296
##$FCOR= 0.5
##$FTSIZE= 0
##$FT_mod= 4
##$GAMMA= 1
##$GB= 0.15
##$INTBC= 1
##$INTSCL= 1
##$ISEN= 128
##$LB= 0.24
##$LEV0= 0
##$LPBIN= 0
##$MAXI= 10000
##$MC2= 0
##$MEAN= 0
##$ME_mod= 0
##$MI= 1.114404
##$NCOEF= 0
##$NC_proc= 0
##$NLEV= 6
##$NOISF1= 3.799351
##$NOISF2= 2.8
##$NSP= 1
##$NTH_PI= 0
##$NZP= 0
##$OFFSET= 15.70392
##$PC= 1
##$PHC0= -10138.63
##$PHC1= -2.199196
##$PH_mod= 1
##$PKNL= yes
##$PPARMOD= 0
##$PSCAL= 0
##$PSIGN= 0
##$REVERSE= no
##$SF= 200.130013532006
##$SI= 16384
##$SIGF1= 3
##$SIGF2= 2
##$SINO= 400
##$SIOLD= 16384
##$SREGLST= <1H.CDCl3>
##$SSB= 0
##$STSI= 0
##$STSR= 0
##$SW_p= 3612.71676300578
##$SYMM= 0
##$S_DEV= 0
##$TDeff= 0
##$TDoff= 0
##$TI= <>
##$TILT= no
##$TM1= 0
##$TM2= 0
##$TOPLEV= 0
##$USERP1= <user>
##$USERP2= <user>
##$USERP3= <user>
##$USERP4= <user>
##$USERP5= <user>
##$WDW= 1
##$XDIM= 8192
##$YMAX_p= 0
##$YMIN_p= 0
$$ End of Bruker specific parameters
$$ ---------------------------------
##NTUPLES= NMR FID
##VAR_NAME=  TIME,          FID/REAL,        FID/IMAG
##SYMBOL=    X,             R,               I
##VAR_TYPE=  INDEPENDENT,   DEPENDENT,       DEPENDENT
##VAR_FORM=  AFFN,          ASDF,            ASDF
##VAR_DIM=   8192,          8192,            8192
##UNITS=     SECONDS,       ARBITRARY UNITS, ARBITRARY UNITS
##FACTOR=    0.0002004,     1,               1
##FIRST=     0,             0,               0
##LAST=      1.6414764,     0,               0
##MIN=       0,             -329933,         0
##MAX=       1.6414764,     522332,          0
$$ Real data points
##PAGE= N=1
##DATA TABLE= (X++(R..R)), XYDATA
$$ [...]
$$ plain form
2378 -6987 -4654 -116 4927 7483 5793 2007 -2590 -6369 -6636 -4538 307 4645 6511 5683 2035
2393 2035 -2483 -6316 -7006 -4665 369 4533 6782 5704 1686 -2943 -6239 -6493 -3980 36 4458
2408 4458 6799 5890 2100 -2824 -6222 -6516 -3886 491 4649 6783 5824 1540 -2937 -5921 -6281 -4068
2424 -4068 314 4767 6381 5428 1486 -2866 -5912 -6259 -4024 429 4490 6511 5265 1524 -2928
2439 -2928 -5781 -6271 -3717 746 4816 6742 5308 1925 -2767 -5578 -6103 -3034 810 4400 6325
2454 6325 5080 1917 -2973 -5834 -5872 -3321 628 4267 6389 5474 1411 -3182 -5832 -5820 -3415 744
2470 744 4371 6314 5101 1388 -3034 -5722 -5848 -3548 734 4428 6391 4920 1009 -2794 -5574
2485 -5574 -5654 -3377 948 4395 5862 4746 1184 -2980 -5863 -6162 -3286 1056 4454 5917 4634 1219
$$ packed form
2378f987K333M538N043K556j690l786m597l779k67K098M845M338J866q28l648
2393B035m518l833o90K341N034M164K249j078m018m629l296k54K513M016M422
2408D458K341r09l790m924l398k94K630M377M158K134r59m284m477k984l60K213
2424d068M382M453J614r53l942m352l046l47K235M453M061K021j246l741m452
2439b928k853m90K554M463M070J926j434l383m692k811n25L069L844L590J925
2454F325j245l163m890k861l8K551L949L639K122r15m063m593k650J2K405M159
2470G44L627J943j213l713m422k688j26K300M282L694J963j471l911l803k780
2485e574q0K277M325L447J467j116l562m164k883k99K876M342L398J463j283l415
$$ plain form
2501 1219 -3179 -6003 -5301 -2544 876 4176 5817 4688 959 -3113 -5478 -5685 -2797 930 4677
2516 4677 6054 4479 1013 -2869 -5410 -5283 -2844 1354 4504 5436 4515 1039 -2928 -5335 -5288 -2828
2532 -2828 1434 4355 5775 4097 800 -2758 -5438 -5187 -2829 1313 4613 5310 4280 1062 -2931
2547 -2931 -5391 -5099 -2480 1183 4799 5256 3677 522 -2962 -5217 -5057 -2473 1292 4224 5272 3648
2563 3648 405 -2887 -5034 -4964 -2311 1429 4190 5476 4309 331 -2896 -5007 -5076 -2123 1306 4460
2579 4460 5192 3583 559 -2932 -5095 -4786 -2228 1594 4583 4866 3862 272 -2962 -5272 -4990 -2097
2595 -2097 1457 4355 5070 3404 396 -3068 -4753 -4403 -2061 1534 4113 4874 3751 406 -2991 -4709
2611 -4709 -4546 -2138 1561 4468 4891 3604 145 -2767 -4985 -4386 -1730 1528 4336 5140 2986 41
$$ packed form
2501A219m398k824P02K757L420L300J641j129l729m072k365k07K888L727L747
2516D677J377j575l466l882k541J27K439M198L150R32r21l476l967k407M7K460
2532b828M262K921J420j678l297l558k680K51K358M142L300O97j030l218l993
2547b931k460K92K619L663L616M57j579l155l484k255J60K584L765K932J048j624
2563C648l243l292k147P0K653L740K761J286j167l978l227k111o9K953L429L154
2579D460P32j609l024l491k163L09K558L822K989K83j004l590l234k310K82K893
2595b097L554K898P15j666l008l464j685L50K342L595K579P61j123l345l397j718
2611d709J63K408L699K907M23j287l459k912k218N99K656L258K808Q04k154k945
$$ plain form
2627 41 -2966 -4875 -4184 -1829 1676 4316 4785 3276 57 -3108 -4503 -4324 -1871 1484 4306 4942
2643 4942 2896 86 -2991 -4625 -4237 -1275 1766 4254 4716 2963 169 -3095 -4610 -4198 -1554 1652
2659 1652 4101 4635 3165 1 -2933 -4912 -3659 -1452 1646 4375 4597 3185 -116 -2926 -4772
2674 -4772 -4025 -1359 1374 4054 4579 2995 -428 -3315 -4491 -3483 -1261 1690 3848 4330 2756 43
2690 43 -2996 -4349 -3812 -1597 1841 4239 4509 2386 -362 -2993 -4330 -3665 -1193 1776 4150 4319
2706 4319 2491 -431 -3260 -4453 -3759 -1023 1733 3909 4318 2648 -531 -2923 -4099 -3656 -1096 1822
2722 1822 3385 4185 2654 -288 -2914 -4192 -3423 -1006 1702 3591 4234 2240 -542 -3196 -3908 -3242
2738 -3242 -984 1589 3713 3988 2402 -623 -2919 -3834 -3323 -1242 1883 3963 3646 2273 -281 -2966
$$ packed form
2627D1l007j909O91K355L505K640M69j509l219l165j395J79K453L355K822O36
2643D942k046k810l077j634L88K962L041K488M62j753k794l264j515M12K644L206
2659A652K449N34j470l164k934j979J253K207L098K729K22j412l301k810j846
2674d772P47K666K733K680N25j584l423k887j176J008K222K951K158M82j574k713
2690D3l039j353N37K215L438K398K70k123k748k631j337O65K472K969K374J69
2706D319j828k922k829j193O94K736K756K176M09j670l179k392j176M43K560K918
2722A822J563Q00j531k942k626j278P69K417K708J889O43j994k782k654p12O66
2738c242K258K573K124K75j586l025k296r15N11K081L125K080l17j373k554k685
$$ plain form
2754 -2966 -3886 -2984 -692 1964 3365 3935 2361 -275 -3384 -4280 -2847 -606 1721 3592 4124 2214
2770 2214 -696 -3171 -4032 -3140 -915 1723 3670 3811 2128 -480 -2799 -4076 -3351 -837 1776 3558
2786 3558 3301 1898 -707 -2652 -4124 -2971 -791 1717 3517 3775 1760 -649 -2928 -4061 -2751
2801 -2751 -396 2343 3767 3423 1649 -457 -2635 -3807 -2696 -709 2024 3220 3521 2144 -775
2816 -775 -3258 -3743 -2793 -480 1871 3451 3555 1893 -931 -2898 -3513 -2458 -740 1675 3616 3146
2832 3146 1638 -541 -2785 -3388 -2437 -577 1959 3279 3333 1386 -845 -3015 -3543 -2818 -291 1802
2848 1802 3243 3292 1666 -742 -2704 -3619 -2674 -530 2039 3532 2889 1202 -474 -2935 -3724 -2892 -78
2865 -78 2114 3153 3193 1587 -819 -2948 -3342 -2455 -444 1611 3218 3258 1680 -1071 -2890 -3484 -2808
$$ packed form
2754b966r20R02K292K656J401N70j574k636l109q96J433K241K327J871N32j910
2770B214k910k475q61Q92K225K638J947J41j683k608k319j277P25K514K613J782
2786C558k57j403k605j945j472J153K180K508J800K58k015k409k279j133J310
2801b751K355K739J424l44j774k106k178j172J111J987K733J196L01j377k919
2816g75k483m85R50K313K351J580J04j662k824j967o15J055J718K415J941m70
2832C146j508k179k244o03R51J860K536J320N4j947k231k170n28P25K527K093
2848A802J441M9j626k408j962r15R45K144K569J493o43j687j676k461p89Q32K814
2865g8K192J039M0j606k406k129l94Q87K011K055J607M0j578k751j819n94O76
$$ plain form
2882 -2808 -265 2599 3390 2618 1224 -867 -2806 -3213 -2340 -52 2170 3097 2633 1446 -642 -2835
2898 -2835 -3536 -2096 72 2106 3148 3126 989 -1001 -2634 -3048 -2224 -148 1857 3083 2657 1282
2914 1282 -1040 -2981 -3452 -2311 -188 2109 2966 2993 1200 -1111 -2964 -2841 -1810 -61 2202 3162
2930 3162 2796 1196 -1041 -2582 -3072 -1970 -527 1559 3257 2660 930 -1006 -2696 -3161 -2147 305
2946 305 2128 2839 2226 920 -878 -2593 -3124 -1432 106 1901 2865 2781 991 -1397 -2740 -3125 -1993
2963 -1993 38 2033 3136 2383 801 -1408 -2536 -3042 -1775 182 1947 2959 2167 1050 -1057 -2758
2979 -2758 -3040 -1788 205 2013 3047 2435 427 -1368 -3013 -2631 -1870 160 1904 2991 2204 668
2995 668 -984 -2494 -2762 -1869 325 2119 2956 2131 1058 -1157 -2527 -2917 -1376 328 1760 3131
$$ packed form
2882b808K543K864P91p72j394k091j939m07Q73K288K222R27m64j187k088k193
2898b835p01J440K168K034J042k2k137j990j633m14Q24K076K005J226m26j375
2914A282k322j941m71J141K123K297Q57K7j793k311j853J23J031J749K263R60
2930C162l66j600k237j541m90J102J443K086J698n97j730j936j690m65J014K452
2946C05J823P11o13j306j798j715n31J692J538J795R64q4j790k388j343l85J132
2963a993K031J995J103p53j582k209j128n06J267J957J765J012p92j117k107j701
2979b758k82J252J993J808J034o12k008j795j645L82P61K030J744J087p87j536
2995F68j652j510k68Q93K194J794Q37q25j073k215j370l90J541J704J432J371
$$ plain form
3011 3131 2282 831 -1476 -2571 -2531 -1270 91 1981 2839 2393 499 -997 -2507 -2787 -1650 269
3027 269 1923 2365 2094 841 -1191 -2823 -2977 -1484 496 2236 2656 2184 799 -1161 -2514 -2732 -1652
3044 -1652 302 1854 2440 2027 489 -1286 -2559 -2384 -996 470 1736 2617 2044 620 -1203 -2508
3060 -2508 -2467 -1287 375 1702 2513 2216 676 -1328 -2200 -2228 -1255 596 2205 2256 1997 524 -1129 -2540
3078 -2540 -2686 -1586 287 1745 2410 2064 534 -1295 -2214 -2279 -1442 451 1861 2688 1942 421 -1299
3095 -1299 -2169 -2579 -1093 481 2073 2402 1744 245 -1356 -2518 -2265 -966 514 1758 2452 1923 219
3112 219 -1163 -2394 -2303 -793 841 1999 2688 1988 358 -1442 -2522 -2175 -1062 417 1906 2567 1850
3129 1850 -26 -1325 -1955 -2064 -974 422 2103 2552 1716 267 -1088 -1921 -2087 -1025 587 1904
$$ packed form
3011C131q49j451k307j095M0J261J361J890Q58m46j894j496j510k80J137J919
3027B69J654M42k71j253k032j632j54J493J980J740M20m72j385j960j353k18J080
3044a652J954J552N86m13j538j775j273J75J388J466J266Q81n73j424j823j305
3060b508M1J180J662J327Q11k97j540k004q72k8R73J851J609N1k59j473j653j411
3078b540j46J100J873J458O65l46j530j829r19o5Q37J893J410Q27p46j521j720
3095a299q70m10J486J574J592L29o58j499j601j162K53J299J480J244O94n29j704
3112B19j382j231R1J510J634J158O89p00j630j800j080L47J113J479J489O61p17
3129A850j876j299o30j09J090J396J681M49q36j449j355q33j66J062J612J317
$$ plain form
3145 1904 2520 1867 290 -1593 -2468 -2115 -497 845 1925 2480 1540 297 -1389 -2423 -2338 -910 758
3162 758 1847 2535 1613 157 -1105 -2494 -2029 -763 638 2156 2197 1137 301 -1357 -2262 -2039 -1065
3179 -1065 715 2028 2493 1401 -121 -1192 -2146 -1816 -716 758 2103 2275 1672 188 -1328 -2133
3195 -2133 -1691 -939 509 2234 2268 1348 330 -1429 -2108 -1939 -926 696 1637 2048 1469 3 -1442
3212 -1442 -2160 -1719 -749 972 1955 2289 1369 93 -1364 -2214 -1434 -763 605 1622 2055 915 148 -1373
3230 -1373 -1883 -1772 -819 530 1696 2046 1558 -17 -1299 -1956 -1765 -681 603 1674 1994 1176 -91
3247 -91 -1161 -1879 -1704 -552 572 2135 2164 1076 -237 -1428 -1611 -1833 -778 629 1608 2224 1014
3264 1014 -266 -1367 -1934 -1713 -464 639 1734 2106 1028 -259 -1319 -2100 -1535 -459 670 1715
$$ packed form
3145A904O16o53j577j883q75L53J618J342J080N55r40j243j686j034Q5J428J668
3162G58J089O88r22j456j262j389M65J266J401J518M1j060q36j658r05K23R74
3179a065J780J313M65j092j522j071r54L30J100J474J345J72o03j484j516q05
3195b133M42P52J448J725L4r20j018j759o79J69J013J622R41M11n79j466j445
3212a442p18M41R70J721R83L34r20j276j457q50P80O71J368J017M33j140p67j521
3230a373n10J11R53J349J166L50m88j575j282o57J91J084J284J071L20q18j267
3247i1j070p18J75J152J124J563K9j088j313j191j83k22J055J407R79O16j210
3264A014j280j101n67K21J249J103J095L72j078j287j060p81N65J076J129J045
$$ plain form
3280 1715 1700 1105 -233 -1489 -2045 -1726 12 859 1570 1991 1172 -451 -1355 -1669 -1580 -309 637 1583 1688
3299 1688 1058 -283 -1312 -1575 -1596 -573 967 1607 1837 939 -24 -1238 -1803 -1191 -637 768 1594 1789
3317 1789 804 -414 -944 -1804 -1545 -575 659 1894 1714 733 -195 -1200 -1784 -1507 -322 769 1447 1500
3335 1500 1211 -281 -1468 -1655 -1399 -284 824 1626 1994 835 -466 -1146 -1749 -1286 -362 692 1571
3352 1571 1559 668 -418 -1358 -1743 -1231 2 875 1497 1324 1015 -532 -1148 -1656 -1098 -183 862 1587 1282
3371 1282 643 -402 -1399 -1734 -1034 -287 842 1887 1448 755 -308 -1570 -1876 -1389 -216 1079 1551
3388 1551 1727 797 -435 -1407 -1575 -1084 -85 884 1435 1339 802 -645 -1328 -1424 -1234 -271 1036 1814 1270
3407 1270 1015 -549 -1271 -1668 -1237 -313 870 1585 1408 626 -265 -1144 -1449 -985 -329 767 1655 1337 486
$$ packed form
3280A715j5n95j338j256n56L19J738Q47P11M21q19j623r04l14Q9J271R46R46J05
3299A688o30j341j029k63k1J023J540O40K30q98r63j214n65O12N54J405Q26J95
3317A789r85j218n30q60K59R70J234J235j80r81r28j005n84K77J185J091O78N3
3335A500k89j492j187j87K56J115J108Q02L68j159j301o80o03M63R24J054Q79
3352A571j2q91j086r40l85N12J233Q73O22j73l09j547o16n08N58R15J045P25l05
3371A282o39j045r97l35P00P47J129J045m39o93j063j262l06M87J173J295M72
3388A551J76r30j232r72j68M91R99R69N51r6n37j447o83r6J90R63J307P78n44
3407A270k55j564p22l97M31R24J183P15j77p82q91q79l05M64O56J096Q88l18q51
$$ plain form
3426 486 -334 -1489 -1743 -1215 -136 917 1578 1298 431 -523 -1097 -1358 -1136 19 691 1266 1374 653 -505
3445 -505 -1190 -1595 -974 90 1053 1313 1338 253 -775 -1326 -1207 -997 -275 950 1574 1264 471 -203 -1058
3464 -1058 -1219 -1123 -206 1057 1597 1281 555 -615 -1073 -1470 -957 58 960 1265 1344 324 -248 -1089 -1428
3483 -1428 -1054 -232 1130 1182 1144 539 -466 -1140 -1332 -801 -24 862 1339 1008 365 -340 -1106 -1313 -839 -107
3503 -107 889 1430 903 334 -650 -1204 -1270 -527 194 840 1503 1224 367 -630 -1105 -1560 -1044 -57 942 1397
3523 1397 1071 829 -412 -1289 -1330 -258 -1 1032 1344 1045 297 -697 -1311 -990 -641 -74 775 1354 899
3542 899 466 -430 -1071 -1352 -1038 -13 1103 1216 1060 33 -577 -1456 -1270 -495 -153 989 1217 1049 468
3561 468 -809 -987 -966 -763 17 1061 1360 1050 119 -646 -1260 -1210 -622 -68 1059 1480 890 135 -472 -1208
$$ packed form
3426D86q20j155k54N28J079J053O61k80q67r54n74k61K22J155O72N75J08p21j158
3445e05o85m05O21J064R63K60K5j085j028n51J19K10P22J225O24l10p93o74q55
3464a058j61R6R17J263N40l16p26j170m58l97N13J015R02L05P9j020n72q41l39
3483a428L74Q22J362N2l8o05j005o74j92N31P77Q86M77l31o43p05p66k07M74P32
3503a07R96N41n27n69r84n54o6P43P21O46O63k79q57r97m75m55N16R87R99M55
3523A397l26k42j241q77m1J072K57J033L12k99p48r94o14L21L49N67Q49N79m55
3542H99m33q96o41k81L14J025J116J13j56j027o10q79J86P75L42J142K28j68n81
3561D68j277j78K1K03P80J044K99l10r31p65o14N0N88N54J127M21n90p55o07p36
$$ plain form
3581 -1208 -1510 -612 299 912 971 851 418 -571 -1178 -921 -736 -72 1112 1304 1304 129 -665 -1168 -762 -271
3601 -271 299 765 1281 739 117 -545 -1189 -1026 -517 209 1012 1200 1175 139 -866 -1003 -981 -490 246 867
3621 867 1122 814 -47 -513 -1206 -962 -279 326 919 1034 770 45 -610 -1045 -956 -463 454 929 1022 721 214
3642 214 -676 -1196 -950 -577 -292 868 1131 781 -65 -500 -996 -950 -860 118 942 1386 507 90 -794 -1124
3662 -1124 -1289 -633 488 810 1102 747 222 -551 -672 -1011 -534 271 742 1401 887 125 -492 -1264 -855
3681 -855 -537 188 1226 1123 822 190 -960 -1133 -1145 -385 342 754 1075 623 -213 -861 -1433 -785 -215 546
3701 546 1161 903 748 -184 -722 -910 -639 -355 275 1058 932 745 308 -407 -1124 -822 -151 217 969 957
3721 957 730 16 -961 -780 -784 -404 48 854 1025 542 -267 -568 -831 -851 -418 404 760 974 712 2 -579
$$ packed form
3581a208l02Q98R11O13N9j20m33r89o07K57J85O64J184J92%j175p94n03M06M91
3601b71N70M66N16n42o22o62o44J63N09P26Q03J88k5j036j005j37K2M91P36O21
3621H67K55l08q61m66o93K44O83O05N93J15k64p25o55m35Q9M93R17M75R3l01n07
3642B14q90n20K46L73K85J160K63l50q46m35m96M6R0R78Q24M44q79m17q84l30
3662a124j65O56J121L22K92l55n25p73j21l39M77Q05M71O59n14p62o17p72M09
3681h55L18P25J038j03l01o32j150j73j2P60P27M12L21m52q36o48n72O48N70P61
3701E46O15k58j55r32n38j88K71K84O30P83j26j87m37p15p17L02O71L68P52j2
3721I57k27p14r77J81mL80M52Q06J71m83q09l01k63k0M33Q22L56K14k62p10n81
$$ plain form
3742 -579 -882 -636 -397 540 980 1059 587 -1 -529 -1062 -701 -125 356 927 697 483 -67 -556 -944 -819
3762 -819 -301 202 691 954 497 -18 -833 -518 -767 -318 278 772 784 609 111 -617 -896 -867 -142 434 610
3783 610 746 443 66 -501 -948 -736 -225 374 738 809 513 165 -665 -903 -876 -84 365 888 832 455 -158
3804 -158 -942 -890 -525 -155 416 920 895 564 20 -780 -748 -585 -366 763 744 1004 430 -166 -805 -683 -808
3825 -808 -261 466 1140 874 770 -86 -771 -814 -865 -193 418 555 960 487 -184 -839 -1110 -687 -125 210 967
3846 967 840 451 -275 -473 -1006 -684 193 396 791 652 491 106 -450 -766 -829 -484 78 721 791 446 -76
3867 -76 -653 -922 -863 -154 160 518 706 350 -37 -782 -518 -741 -117 586 735 719 475 -353 -213 -799 -736
3888 -736 3 475 866 789 331 -119 -536 -874 -677 24 315 707 539 274 -209 -414 -476 -711 -189 382 895
$$ packed form
3742e79l03K46K39R37M40P9m72n88n28n33L61N76M81N71k30k14n50m89l88J25
3762h19N18N03M89K63m57n15q15L15k49M49N96M94J2j75m98p28k79K9P25N76J76
3783F10J36l03l77n67m47K12N11N99L64P1k96l48q30k38K7P92M49N23n6l77o13
3804a58p84N2L65L70N71N04k5l31n44q00L2J63K19J129j9K60n74n96o39J22j25
3825h08N47P27O74k66j04q56o85m3n1O72O11J37M05m73o71o55k71M23N62L35P57
3846I67j27l89p26j98n33L22Q77K03L95j39j61l85n56l16o3L45N62O43P0l45n22
3867g6n77k69N9P09L14L58J88l56l87p45K64k23O24P03J49j6k44q28J40n86O3
3888g36P39M72L91p7m58m50m17l38J97P01K91L92j68k65m83k05o2k35N22N71N13
$$ plain form
3909 895 684 234 -80 -736 -885 -657 -281 91 669 456 413 51 -403 -521 -654 72 620 628 579 534 31 -805
3931 -805 -802 -510 -179 447 602 420 277 94 -885 -719 -535 -166 198 836 570 222 -201 -347 -588 -459 10
3952 10 399 1087 583 316 -92 -631 -1081 -353 -183 562 903 594 -15 -264 -746 -619 -315 82 577 623 481
3973 481 342 -144 -561 -839 -437 7 724 623 377 340 -118 -689 -713 -325 115 393 636 543 155 -406 -605
3994 -605 -700 -632 -44 438 611 896 239 69 -678 -631 -400 -143 365 621 783 214 -244 -510 -648 -652 -183 590
4016 590 681 419 4 -264 -631 -831 -301 -52 349 852 506 220 -119 -269 -752 -506 146 335 409 693 126
4037 126 -200 -579 -560 -139 95 287 763 772 11 -392 -686 -933 -540 172 400 770 804 192 -55 -770 -859 -251
4059 -251 -65 271 531 459 334 -348 -417 -761 -411 15 443 635 511 377 -193 -431 -454 -443 -169 659 663 723
$$ packed form
3909H95k11m50l14o56j49K28L76L72N78k13m3l62m54j18j33P26N48Qm9m5n03q36
3931h05LK92L31O26J55j82j43j83r79J66J84L69L64O38k66l48m23j46k41J29M69
3952A0L89O88n04k67m08n39m50P28J70P45L41l09o09k49m82J27L04L97M95M6j42
3973D81j39m86m17k78M02M44P17j01k46l7m58n71k4L88M40K78K43r3l88n61j99
3994f05r5O8N88M82J73K85o57j70p47M7K31K57N08K56J62n69m58k66j38mM69P73
4016E90R1k62m15k68l67k00N30K49M01N03l46k86l39j50m83K46O52J89P4K84n67
4037A26l26l79J9M21K34J92M76Rp61m03k94k47L93P12K28L70L4o12k47p15q9O08
4059b51J86L36K60p2j25o82o9l44L50M26M28J92j24j34n70k38k3J1K74Q28MO0
$$ plain form
4081 723 81 114 -832 -596 -225 90 373 554 618 290 -63 -342 -568 -161 -10 537 722 374 59 -250 -444
4102 -444 -575 -181 174 140 591 414 284 -346 -799 -784 -86 -28 535 784 462 199 -395 -775 -539 -481 210
4123 210 526 797 273 95 -172 -525 -707 -396 189 467 507 457 166 -617 -817 -211 -345 -60 594 595 350
4144 350 38 -262 -527 -614 -371 323 454 297 172 -7 -209 -804 -714 -451 285 631 434 588 57 -175 -675
4165 -675 -708 -205 171 582 422 361 163 -507 -752 -334 -453 280 451 705 477 -39 -263 -576 -409 -200 365
4186 365 397 285 118 156 -546 -545 -404 -278 155 735 568 327 181 -311 -801 -352 -64 198 407 288 507
4207 507 10 -336 -231 -483 -96 30 352 704 537 -104 -267 -572 -336 8 -67 416 514 468 -37 -382 -415
4228 -415 -339 -184 -16 508 435 219 -115 -313 -773 -660 -181 135 444 656 433 203 -204 -418 -588 -319 114
$$ packed form
4081G23o42L3r46K36L71L15K83J81O4l28l53k79k26M07J51N47J85l48l15l09j94
4102d44j31L94L55l4M51j77j30o30m53J5O98N8N63K49l22k63n94l80K36N8O91
4123B10L16K71n24j78k67l53j82L11N85K78M0n0k91p83k00O06j34K85O54Jk45
4144C50l12l00k65q7K43O94J31j57j25j79k02n95R0K63P36L46j97J54n31k32n00
4165f75l3N03L76M11j60o1j98o70k45M18j19P33J71K54k28n16k24l13J67K09N65
4186C65L2j12j67L8p02JJ41J26M33N80j67k41j46m92m90M49K88K62K09j19K19
4207E07m97l46J05k52L87J26L22L52j67o41j63l05K36L44p5M83R8m6n05l45l3
4228d15P6J55J68N24p3k16l34j98m60J13M79L16L09K12k23k30m07k14j70K69M33
$$ plain form
4249 114 364 356 515 -161 -93 -425 -281 -159 120 654 465 521 -129 -636 -398 -674 -457 150 407 713 147
4270 147 -41 -189 -677 -350 53 178 561 394 88 -234 -438 -614 -499 256 201 731 374 351 -97 -134 -568
4291 -568 -584 -223 370 382 534 271 92 -292 -431 -728 -260 180 101 229 221 -48 -253 -270 -487 -52 152 567
4313 567 523 384 -62 -96 -546 -528 -110 170 343 554 -183 12 -303 -388 -255 108 378 289 287 564 -169 -408
4335 -408 -494 -248 60 150 647 370 584 -89 -316 -470 -485 71 -29 524 335 226 61 -327 -549 -320 -240
4356 -240 258 503 711 510 116 -552 -724 -312 -17 313 338 380 157 -153 -336 -416 -605 -344 -104 458 383
4377 383 368 -110 -388 -344 -387 -24 161 612 404 316 -297 -394 -339 -49 62 284 488 349 255 -112 -330 -526
4399 -526 -389 -15 302 304 384 168 2 -208 -634 -135 63 299 513 481 254 -106 -543 -325 -319 -320 559 339 67
$$ packed form
4249A14K50qJ59o76O8l32J44J22K79N34j89N6o50n07K38k76K17O07K57L06n66
4270A47j88j48m88L27M03J25L83j67l06l22k04j76J15P55n5N30l57k3m48l7m34
4291e68j6L61N93J2J52k63j79l84j39k97M68M40p9J28qk69k05j7k17M35K04M15
4313E67m4j39m46l4m50J8M18K80J73K11p37J95l15q5J33L63K70q9kK77p33k39
4335d08q6K46L08R0M97k77K14o73k27j54j5N56j00N53j89j09j65l88k22K29Q0
4356b40M98K45K08k01l94o68j72M12K95L30K5M2k23l10j83q0j89K61K40N62p5
4377C83j5m78k78M4m3L63J85M51k08q8o13r7N5K90J11K22K04j39r4l67k18j96
4399e26J37L74L17KQ0k16j66k10m26M99J98K36K14l2k27l60m37K18OjQ79k20k72
$$ plain form
4422 67 128 -232 -523 -380 -156 7 347 520 343 64 -129 -581 -894 -240 -101 78 525 259 150 60 -115
4443 -115 -290 -123 -78 365 526 598 410 -14 -235 -343 -290 52 31 284 650 222 -171 -210 -348 -423 -31 517
4465 517 75 408 213 -87 -454 -240 -109 19 82 254 197 66 -216 -278 -316 -303 126 202 141 538 114 -232
4487 -232 -608 -657 -371 -213 104 200 292 19 -102 -254 2 -285 176 444 670 173 546 -105 -141 -332 -458
4508 -458 -23 64 491 266 210 -74 -383 -380 -356 -104 -52 373 406 261 -67 -411 -212 -302 -2 114 164 185 29
4531 29 -74 -60 -53 -381 0 285 268 486 301 -122 -187 -255 -238 21 359 610 522 251 11 -162 -143 -195 292 303
4555 303 372 488 114 96 -95 -276 -259 240 441 421 309 -211 -500 -447 -238 -324 52 145 399 333 -91 -179 -345
4578 -345 -168 52 -197 161 635 289 -36 -261 -391 -373 -406 6 239 397 362 183 -148 -454 -273 -62 -204
$$ packed form
4422F7O1l60k91J43K24J63L40J73j77k79j93m52l13O54J39J79M47k66j09r0j75
4443a15j75J67M5M43J61P2j88m24k21j08N3L42k1K53L66m28l93l9j38p5L92N48
4465E17m42L33j95l00l67K14J31J28O3J72n7j31k82o2l8J3M29P6o1L97m24l46
4487b32l76m9K86J58L17R6R2k73j21j52K56k87M61K68K26m97L73o51l6j91j26
4508d58M35Q7M27k25n6k84l09LK4K52N2M25L3j45l28l44J99r0L00J16N0K1j56
4531B9j03J4Pl28L81K85j7K18j85m23o5o8J7K59L38K51q8k71k40j73J9n2M87J1
4555C03O9J16l74j8j91j81J7M99K01k0j12n20k89N3K09q6L76R3K54o6m24q8j66
4578c45J77K20k49L58M74l46l25k25j30J8l3M12K33J58l5j79l31l06J81K11j42
$$ plain form
4599 -204 163 489 429 349 -222 -219 -236 -226 -6 146 383 22 -61 -151 -300 -117 -98 115 296 501 35 261 -263
4622 -263 -322 -39 -194 66 289 310 250 -7 -338 -299 -529 35 113 327 173 417 -214 55 -271 -280 -6 206
4644 206 448 413 -14 257 -334 -235 -293 -16 -313 396 286 233 73 -374 -361 -586 -277 -10 336 466 356 -32
4666 -32 -73 -758 -319 -230 145 226 332 217 -52 -28 -357 -292 -397 130 132 462 241 -234 -239 -291 -181 138 32 298
4690 298 677 -90 36 -169 -148 -412 1 -145 409 345 460 146 -247 -163 -396 -178 148 293 259 180 177 -165
4712 -165 -725 -637 -94 359 361 478 192 -72 -487 -254 -297 117 -87 302 442 121 -261 -256 -683 -395 -40 186
4734 186 253 110 13 -26 13 -366 -112 39 72 360 297 253 -87 -289 -304 -362 -266 242 246 466 160 -246 -237 -220 -300
4759 -300 246 190 373 636 198 74 -173 -404 -343 -112 295 179 366 489 27 45 -31 -179 -807 186 106 307
$$ packed form
4599b04L67L26o0q0n71Lj7J0K20J52K37l61q3r0j49J83J9K13J81K05m66K26n24
4622b63n9K83j55K60K23K1o0k57l31L9k30N64P8K14j54K44o31K69l26rK74K12
4644B06K42l5m27K71n91R9n8K77k97P09j10n3j60m47J3k25L09K67L46J30j10l88
4666c2m1o85M39Q9L75Q1J06j15k69K4l29O5j05N27KL30k21m75nn2J10L19j06K66
4690B98L79p67J26k05K1k64M13j46N54o4J15l14l93Q4k33K18L26J45l4p9ll42
4712a65n60Q8N43M53KJ17k86k64m15K33m3M14k04L89J40l21l82Nm27K88L55K26
4734A86O7j43r7l9L9l79K54J51L3K88o3m4l40k02j5n8R6N08MK20l06m06RJ7q0
4759c00N46n6J83K63m38j24k47k31O1K31M07j16J87J23m62J8p6j48o28R93q0K01
$$ plain form
4781 307 -8 -196 -391 -548 -245 25 107 581 349 157 117 -410 -205 -317 189 96 337 325 108 -193 -222 -194
4803 -194 -13 -56 145 76 297 180 34 -176 -218 -352 -173 -37 343 117 -108 161 -534 -282 -162 153 37
4824 37 235 355 222 277 -153 -273 -374 -182 -151 314 198 89 64 -269 -433 -145 28 81 264 547 145 -377
4846 -377 -90 -280 49 138 181 375 397 127 -114 67 -180 -155 -38 -2 201 406 172 -357 -178 -245 -151 -55 -25
4869 -25 146 213 30 178 -266 -419 151 42 324 285 324 199 -164 -233 -117 -551 -30 15 223 10 67 214
4891 214 -374 -699 -263 129 257 474 46 152 6 -139 -246 -242 450 159 221 347 164 -86 -276 60 -159
4912 -159 -22 228 331 62 -119 133 -171 -151 -373 -164 169 203 51 176 367 -226 -293 -194 -92 260 390
4933 390 655 239 -373 -115 -108 33 5 384 350 20 243 -277 -128 -453 -190 -85 322 179 139 343 -314 -297
$$ packed form
4781C07l15j88j95j57L03K70Q2M74k32j92m0n27K05j12N06r3K41j2k17l01k9K8
4803a94J81m3K01o9K21j17j46k10m2j34J79J36L80k26k25K69o95K52J20L15j16
4824C7J98J20j33N5m30j20j01J92L1M65j16j09k5l33j64K88J73N3J83K83m02n22
4846c77K87j90L29Q9M3J94K2k70k41J81k47K5J17L6K03K05k34n29J79o7R4R6L0
4869b5J71O7j83J48m44j53N70j09K82l9L9j25l63o9J16m34N21M5K08k13N7J47
4891B14n88l25M36L92J28K17m28J06j46j45j07MO92k91O2J26j83k50j90L36k19
4912a59J37K50J03k69j81K52l04K0k22K09L33L4j52J25J91n93o7R9J02L52J30
4933C90K65m16o12K58PJ41k8L79l4l30K23n20J49l25K63J05M07j43m0K04o57J7
$$ plain form
4955 -297 -335 -88 72 163 83 234 169 -108 -393 -508 -154 32 155 167 272 207 59 -24 -394 -202 -205 185 -52
4978 -52 405 208 -32 -82 126 -198 300 256 252 77 84 -324 27 93 -103 -148 23 422 156 -95 -40 -106 -254 -184
5002 -184 -63 316 180 89 86 -70 -316 -161 -130 -152 -60 363 89 220 -105 -103 -302 -30 432 -68 297 456 42
5025 42 -89 -337 -131 -45 331 76 -121 416 370 -421 -93 -50 -57 -108 337 129 223 8 -22 -279 -233 -280 118 -99
5049 -99 455 102 -229 -10 6 -83 102 168 113 214 259 66 -264 -337 -344 -200 176 132 266 390 -52 -40 -418 -222
5073 -222 -123 247 307 97 354 281 -339 -220 -29 -191 36 185 240 185 59 -221 -215 -122 -106 96 21 586 311
5096 311 253 -127 -382 -325 -6 -14 288 397 104 -122 -85 -56 -439 14 -5 370 77 163 -123 -128 -344 -406 -174 -166
5120 -166 259 225 88 -146 -61 21 -234 -27 103 53 254 -7 66 -116 -172 -202 -385 29 -21 69 187 26 -33
$$ packed form
4955b97l8K47J60R1q0J51o5k77k85j15L54J86J23J2J05o5j48q3l70J92lL90k37
4978e2M57j97k40n0K08l24M98m4mj75Pm08L51O6j96m5J71L99k66k51N5o6j48P0
5002a84J21L79j36r1lj56k46J55L1k2R2M23k74J31l25Kj99K72M62n00L65J59m14
5025D2j31k48K06Q6L76k55j97N37m6p91L28M3pn1M45k08R4k15l0k57M6m7L98k17
5049i9N54l53l31K19J6q9J85O6n5J01M5j93l30p3pJ44L76m4J34J24m42J2l78J96
5073b22R9L70O0k10K57p3o20J19J91j62K27J49N5n5j26k80OR3J6K02p5N65k75
5096C11n8l80k55N7L19qL02J09k93k26L7K9l83M53j9L75k93Q6k86nk16o2K32Q
5120a66M25l4j37k34Q5Q2k55K07J30n0K01k61P3j82n6l0j83M14n0R0J18j61n9
$$ plain form
5143 -33 -189 -44 -181 -137 -142 83 87 -7 -84 -256 -192 -60 138 243 192 61 476 -124 -365 -70 -100 -168 419 189
5167 189 313 -99 -59 -82 -180 -121 -122 179 105 288 -52 -159 -55 -304 -83 -220 -56 164 340 248 -55 47 -484
5190 -484 59 350 28 351 126 -109 -60 -120 -390 -62 88 -8 176 46 -42 -227 -232 -183 -56 56 275 503
5212 503 27 -4 -344 -149 -221 -327 268 319 88 38 43 -88 -262 -142 47 -268 240 436 148 79 -710 -134
5234 -134 90 -158 -191 -25 164 204 -60 -16 71 60 -225 -202 -71 281 -60 -216 -252 -147 -138 -154 -26 170 105 2
5258 2 -371 -76 -303 -374 77 41 60 470 155 95 -289 -221 181 -8 -56 403 -38 242 -57 -361 -194 -290 153
5281 153 -144 188 -141 128 -5 14 -207 81 -51 305 277 176 194 191 -145 171 -166 -237 -56 276 21 89
5303 89 -120 -183 -294 -327 182 -97 278 228 249 106 -226 18 -111 -129 80 137 32 5 31 -84 -257 -124 -371
$$ packed form
5143c3j56J45j37M4nK25Mr4p7j72O4J32J98J05n1j31M15o00k41K95l0o8N87k30
5167A89J24m12M0k3r8N9jL01p4J83l40j07J04k49K21j37J64K20J76r2l03J02n31
5190d84N43K91l22L23k25k35M9o0k70L28J50r6J84j30q8j85nM9J27J12K19K28
5212E03m76l1l40J95p2j06N95N1k31n0Nj31j74J20J89l15N08J96k88o9p89N76
5234a34K24k48l3J66J89M0k64M4Q7j1k85K3J31L52l41j56l6J05Rj6J28J96o5j03
5258Bl73K95k27p1M51l6J9M10l15o0l84O8M02j89m8M59m41K80k99l04J67r6M43
5281A53k97L32l29K69j33J9k21K88j32L56k8j01J8ll36L16l37p1J81L32k55O8
5303H9k09o3j11l3N09k79L75n0K1j43l32K44j29j8K09N7j05k7K6j15j73J33k47
$$ plain form
5326 -371 213 -6 186 -8 76 -304 -126 -212 -74 35 98 166 -126 290 68 -31 149 -281 18 91 55 174
5348 174 -147 97 -150 -222 -124 -23 253 98 244 13 167 161 -57 -309 152 -41 -47 93 -60 97 -46 -137
5370 -137 -136 29 222 24 227 -23 -233 -361 -207 -197 95 147 298 -4 -16 -340 -286 80 104 30 259 -118 114
5393 114 -238 -142 -144 -77 57 -120 -223 44 366 -209 94 -75 -104 -37 198 184 230 215 176 64 -35 -563 -97 54
5417 54 264 160 -269 -251 -111 -128 -148 253 345 100 15 -209 -172 -133 -169 -251 189 124 183 -209 244 -315 -338 -459
5441 -459 -121 -11 20 86 41 -44 -144 -498 -238 -50 -22 93 27 31 196 -124 -133 -147 31 -85 -6 145 98 289
5465 289 157 -162 -261 66 -93 164 32 172 324 -53 -249 277 -160 47 -58 120 335 -223 -20 -159
5485 -159 -153 -6 -265 255 100 39 -10 -247 20 -293 240 -192 -145 226 27 12 -111 -99 55 -132 50 -79
$$ packed form
5326c71N84k19J92j94Q4l80J78q6J38J09O3O8k92M16k22r9J80m30K99P3l6J19
5348A74l21K44k47p2R8J01K76j55J46k31J54ok18k52M61j93oJ40j53J57j43r1
5370a37JJ65J93j98K03k50k10j28J54J0K92N2J51l02j2l24N4L66K4p4K29l77K32
5393A14l52R6kO7J34j77j03K67L22n75L03j69k9O7K35j4M6j5l9j12r9n28M66J51
5417E4K10j04m29J8J40j7k0M01R2k45q5k24L7L9l6q2M40o5N9l92M53n59k3j21
5441d59L38J10L1O6m5q5j00l54K60J88K8J15o6MJ65l20rj4J78j16P9J51m7J91
5465B89j32l19r9L27j59K57j32J40J52l77j96N26m37K07j05J78K15n58K03j39
5485a59OJ47k59N20j55o1m9k37K67l13N33m32M7L71j99j5j23J2J54j87J82j29
$$ plain form
5507 -79 43 341 303 -48 -117 16 -198 49 -344 97 190 8 -316 -38 97 -476 19 245 -165 -51 189
5528 189 75 -181 44 -100 252 178 165 76 -73 -159 64 -173 -30 357 62 0 171 -97 -58 -173 -232 -114
5550 -114 -268 143 47 -173 271 44 -145 -24 155 46 42 126 311 81 22 5 -118 -175 138 138 230 -84 131
5573 131 -289 -148 -123 -77 63 90 -20 38 -29 -100 -378 -30 70 64 -57 166 -151 155 -241 -216 -89 -33 64 287
5597 287 115 36 -157 122 -198 -35 137 157 423 203 264 -88 108 -318 -95 -48 47 344 65 88 82 -179 -92
5620 -92 -341 -25 -147 84 92 250 237 -43 -182 -112 -60 134 130 135 278 24 -160 -165 54 -208 -64 -20 -81 203 28
5645 28 -148 8 -544 0 -56 -39 13 140 21 -160 -205 -330 -46 -220 163 309 206 118 -412 11 -68 -319
5667 -319 398 361 178 236 65 -43 -156 122 120 -11 122 249 99 167 -96 -150 -383 -146 203 305 502 129
$$ packed form
5507g9J22K98l8l51o9J33k14K47l93M41R3j82l24K78J35n73M95K26m10J14K40
5528A89j14k56K25j44L52p4j3q9j49q6K23k37J43L87k95o2J71k68L9j15n9J18
5550a14j54M11r6k20M44k27j89J21J79j09mQ4J85k30n9j7j23n7L13%R2l14K15
5573A31m20J41K5M6J40K7j10N8o7p1k78L48J00oj21K23l17L06l96K5J27N6R7K23
5597B87j72p9j93K79l20J63J72K0K66k20O1l52J96m26K23M7R5K97k79K3ok61Q7
5620i2k49L16j22K31QJ58j3k80j39P0N2J94mNJ43k54j84nK19k62J44M4o1K84j75
5645B8j76J56n52N44n6J7N2J27j19j81m5j25K84j74L83J46j03q8n30M23p9k51
5667c19P17l7j83N8j71j08j13K78kj31J33J27j50O8k63n4k33K37L49J02J97l73
$$ plain form
5689 129 276 95 -22 -225 44 106 373 238 41 461 -23 -167 -186 -164 -73 169 -272 -3 51 21 -27 -87 -5
5712 -5 -227 2 261 164 103 112 -263 16 -53 213 387 43 77 240 -450 83 -86 -256 229 -102 -65 100 -120
5735 -120 -118 -202 -100 -64 239 79 117 -66 -294 -72 -3 50 268 -166 167 101 63 20 168 -229 -323 140 -7 -12
5759 -12 118 6 22 68 78 -177 -138 236 -103 174 -28 -45 -148 42 -174 365 143 -287 -68 235 -116 -69
5781 -69 -111 -98 10 3 -33 400 328 -47 -112 3 -200 140 -34 183 227 128 22 -221 -368 -21 -67 30 40 109 -90
5806 -90 -199 16 41 281 -254 133 14 92 146 45 60 175 -27 -142 -369 197 165 153 -120 -3 -612 -267
5828 -267 101 176 -190 115 66 76 -16 -55 -287 -69 -128 -1 -258 115 64 -34 -355 125 -186 19 254 73 219
5851 219 -350 15 -102 58 -181 145 410 214 -158 165 -27 -198 -189 16 153 9 112 35 -255 -163 -336
$$ packed form
5689A29J47j81j17k03K69O2K67j35j97M20m84j44j9K2R1K42m41K69N4l0m8o0Q2
5712ek22K29K59r7o1Rl75K79o9K66J74l44L4J63o90N33j69j70M85l31L7J65k20
5735a20Kq4J02L6L03j60L8j83k28K22O9N3K18m34L33o6l8m3J48l97r4M63j47n
5759a2J30j12J6M6J0k55L9L74l39K77k02j7j03J90k16N39k22m30K19L03l51M7
5781f9m2J3J08pl6M33p2l75o5J15k03L40j74K17M4r9j06k43j47L47m6R7J0O9j99
5806i0j09K15K5K40n35L87j19P8N4j01J5J15k02j15k27N66l2j2k73J17o09L45
5828b67L68P5l66L05m9J0r2l9k32K18n9J27k57L73n1r8l21M80l11K05K35j81J46
5851B19n69L65j17J60k39L26K65j96l72L23j92j71RK05J37j44J03p7k90R2j73
$$ plain form
5872 -336 -200 81 4 -128 97 122 31 338 -79 -251 -1 130 374 340 51 -281 -108 -26 -122 -22 -155 -47
5894 -47 25 6 -347 159 59 -7 -103 -26 -63 73 33 -74 -17 -131 -34 -81 179 135 224 56 -64 -75 141 43 49 105
5920 105 32 -76 -14 -182 -136 -185 -30 -97 187 359 80 261 47 -139 45 -284 -184 285 54 -27 -134 -22
5942 -22 98 -171 -416 95 -7 104 63 -44 -91 290 -160 -107 58 352 185 181 206 -43 -250 41 -68 -113 -116
5965 -116 19 -87 -93 63 55 -58 -87 -64 -30 9 364 150 -73 -70 34 30 -6 -199 -229 89 73 163 233 -322 72 -283
5991 -283 -27 110 11 -50 -358 -4 -28 -130 69 116 151 343 56 76 -210 -329 -24 21 504 151 223 64 -163
6014 -163 183 -323 -144 43 -125 7 -254 -83 180 -508 -268 -151 -78 173 135 292 1 28 -228 8 -354
6035 -354 -253 -133 74 166 60 -171 -26 -669 -289 41 117 126 116 129 122 -120 -159 -212 -22 178 -63 -160 117 -125
$$ packed form
5872c36J36K81p7j32K25K5r1L07m17j72K50J31K44l4k89l32J73Q2r6J00j33J08
5894d7P2j9l53N06j00o6r6P7l7J36m0j07N7j14R7m7K60m4Q9j68j20j1K16r8ON6
5920A05p3j08O2j68M6m9J55o7K84J72k79J81k14j86J84l29J00M69k31q1j07J12
5942b2J20k69k45N11j02J11m1j07m7L81m50N3J65K94j67mK5k49k07K91j09m5l
5965a16J35j06oJ56qj13k9K3L4L9L55k14k23LJ04ml6j93l0L18j6R0P0n55L94l55
5991b83K56J37r9o1l08L54k4j02J99M7L5J92k87K0k86j19L05M5M83l53P2j59k27
6014a63L46n06J79J87j68J32k61J71K63o88K40J17P3K51l8J57k91K7k56K36l62
6035c54J01J20K07R2j06k31J45o43L80L30P6Rj0J3pk42l9n3J90K00k41r7K77k42
$$ plain form
6059 -125 -106 -89 -92 -47 -185 101 180 29 -61 -132 -128 -166 228 -126 134 -141 102 -105 -153 -4 72 22 -128 159 109
6084 109 246 -60 -158 -177 126 169 306 184 91 -72 -134 -115 2 -82 -291 135 186 -148 25 -80 188 -218 180
6107 180 83 -15 150 14 -289 18 -117 -226 -283 -101 269 128 229 53 -152 80 -177 -217 -282 14 100 164
6129 164 -38 -230 -66 -220 -182 181 98 47 -56 281 -394 -98 42 -271 339 240 106 139 91 218 43 -79
6151 -79 -157 105 -107 -4 108 -114 23 128 -303 157 30 154 213 37 9 149 -34 -133 194 62 68 3 -80
6174 -80 -291 11 -162 263 -26 36 -86 3 149 -22 -38 -337 45 -286 -62 -44 231 78 101 295 -170 51
6196 51 -132 -163 -141 171 -146 -44 -18 -47 -17 -10 -24 142 -58 127 37 96 28 -48 179 123 272 -3 -9 107 -49
6221 -49 95 -115 -57 38 34 81 59 -99 -166 287 9 32 -194 306 68 98 -8 279 3 -7 -312 103 138 85
$$ packed form
6059a25J9J7lM5j38K86P9j51r0p1Ml8L94l54K60k75K43k07m8J49P6n0j50K87n0
6084A09J37l06r8j9L03M3J37j22r3j63o2J9J17q4k09M26N1l34J73j05K68m06L98
6107A80r7r8J65j36l03L07j35j09n7J82L70j41J01j76k05K32k57m0o5K96Q6O4
6129A64k02j92J64j54L8L63q3n1j03L37o75K96J40l13O10r9j34L3m8J27j75j22
6151g9p8K62k12J03J12k22J37J05m31M60j27J24N9j76k8J40j83r9L27j32Oo5q3
6174h0k11L02j73M25k89O2j22Q9J46j71j6k99L82l31K24J8K75j53K3J94m65K21
6196E1j83l1K2L12l17J02K6k9L0Pj4J66k00J85r0N9o8p6K27n6J49k75oJ16j56
6221d9J44k10N8R5mM7k2j58o7M53k78K3k26N00k38L0j06K87k76j0l05M15L5n3
$$ plain form
6245 85 58 -102 -277 58 65 74 82 119 53 -91 -64 -158 -218 -266 -147 -115 117 113 227 229 127 -418 30 -32 137 162 -127
6272 -127 -130 10 44 -69 -361 205 302 101 166 25 -18 -158 -10 58 -174 64 -32 107 -52 84 102 -185 -58
6295 -58 -13 227 -7 87 64 218 19 -135 -238 -2 249 -159 -44 97 -17 -368 -347 -224 -118 156 -4 -3
6317 -3 -38 -252 256 2 -2 19 73 149 125 156 145 -177 -80 27 61 107 119 -45 -75 83 137 72 -218 -153 -192 -110 -60
6344 -60 -83 81 -7 -443 88 -102 -237 -27 -67 173 -43 237 -382 -117 -39 130 117 -26 25 120 48 4 89 -47
6368 -47 -7 154 233 222 29 124 -162 -48 34 89 80 192 223 187 17 -120 -256 -95 89 276 144 47 308 -188
6392 -188 -342 -175 -43 150 -27 93 -60 -62 -67 -255 -222 172 -145 82 62 -241 -155 -40 -27 124 -341 -33 -149
6415 -149 42 -81 -337 49 63 201 61 4 -181 272 44 -4 6 -139 -184 -34 32 -35 345 -83 -101 -238 -158
$$ packed form
6245H5k7j60j75L35PRQL7o6j44K7r4o0m8J19L2K32mJ14Kj02n45M48o2J69K5k89
6272a27lJ40L4j13k92N66R7k01O5j41m3j40J48O8k32K38r6J39j59J36J8k87J27
6295e8M5K40k34R4k3J54j99j54j03K36K51m08J15J41j14l51K1J23J06K74j60J
6317cl5k14N08k54mK1N4P6k4L1j1l22R7J07L4M6J2j64l0J58N4o5k90O5l9Q2N0
6344f0k3J64q8m36N31j90j35K10m0K40k16K80o19K65P8J69j3j43N1R5p2m4Q5j36
6368d7M0J61P9j1j93R5k86J14Q2N5rJ12L1l6j70j37j36J61J84J87j32r7K61m96
6392a88j54J67J32J93j77J20j53knj88L3L94l17K27k0l03Q6J15J3J51m65L08j16
6415a49J91j23k56L86J4J38j40n7j85M53k28m8J0j45m5J50O6o7L80m28j8j37Q0
$$ plain form
6438 -158 108 -60 94 -26 -39 -45 -31 307 -75 125 -117 -101 221 -73 -175 158 142 -63 64 -142 84 -163
6460 -163 -52 -291 -275 -279 97 -66 -170 -56 80 -46 -213 -187 -302 -94 -113 23 110 375 -79 -271 67 157
6482 157 251 -47 -214 113 311 119 -77 66 0 -186 131 -98 -21 226 179 83 -418 -26 -64 81 226 208
6504 208 219 -204 -147 -147 72 -247 83 -298 74 129 108 46 126 135 -99 465 -178 65 3 156 90 203 291 -150
6528 -150 2 195 210 -2 197 -51 103 58 43 -171 -309 27 148 38 -143 -137 -97 64 -5 -147 151 227 256
6551 256 144 232 -6 -53 -2 -38 -86 437 36 158 250 -22 -131 131 -292 -363 81 -55 20 -255 -94 -329 166
6574 166 145 -44 -108 177 130 125 75 -204 30 -115 -14 -98 -17 138 -121 -81 -168 -115 15 258 104 -148 -296 -202
6598 -202 64 25 110 171 145 -131 -162 -174 -10 -89 -280 -13 -212 239 180 122 -183 79 -48 -184 5 121 305
$$ packed form
6438a58K66j68J54j20j3oJ4L38l82K00k42J6L22k94j02L33j6k05J27k06K26k47
6460a63J11k39J6mL76j63j04J14J36j26j67K6j15K08j9J36Q7K65m54j92L38R0
6482A57R4k98j67L27J98j92j96J43o6j86L17k29P7K47m7r6n01L92l8J45J45j8
6504B08J1m23N7%K19l19L30l81L72N5k1o2Q0Rk34N64o43K43o2J53o6J13Q8m41
6528a50J52J93J5k12J99k48J54m5j5k14j38L36J21j10j81OM0J61o9j42K98P6K9
6551B56j12Q8k38m7N1l6m8N23m01J22R2k72j09K62m23p1M44j36P5k75J61k35M95
6574A66k1j89o4K85m7nn0k79K34j45J01q4Q1J55k59M0q7N3J30K43j54k52j48R4
6598b02K66l9Q5O1k6k76l1j2J64p9j91K67j99M51n9n8l05K62j27j36J89J16J84
$$ plain form
6621 305 -48 380 -14 -228 -94 190 125 -117 0 231 254 -270 200 -155 145 79 -267 23 -41 65 186
6642 186 -65 120 -211 -258 -61 -19 96 30 149 38 -100 26 -103 159 89 134 33 -52 142 -15 -3 -49 -197
6665 -197 171 -4 308 -15 -243 -210 166 -78 14 80 -29 55 96 -192 -81 58 53 -74 95 -81 54 22 29
6688 29 -238 -356 -32 227 49 148 -121 -42 -147 111 92 -28 -175 -166 113 134 92 148 -90 -237 -28 24 86 342
6712 342 119 -35 210 104 -111 -198 -113 385 26 -66 79 -289 142 175 -103 95 -62 90 60 -100 -55 -110
6734 -110 -272 -110 -22 113 -120 124 157 -247 -71 -37 -114 -16 -157 -63 18 265 -33 -550 -175 57 165 45
6756 45 149 53 -90 113 -486 -124 4 56 147 45 97 43 34 -95 132 -104 -135 -54 281 44 167 19 28 -15
6780 -15 138 -199 212 -46 -15 113 -95 -40 111 -304 -158 -72 -35 -50 -126 221 -43 -148 -182 300 1 176 33
$$ packed form
6621C05l53M28l94k14J34K84o5k42J17K31K3n24M70l55L00o6l46K90o4J06J21
6642A86k51J85l31m7J97M2J15o6J19j11j38J26j29K62p0M5j01q5J94j57J2m6j48
6665a97L68j75L12l23k28L3L76k44R2O6j09Q4M1k88J11J39nj27J69j76J35l2P
6688B9k67j18L24K59j78R9k69P9j05K58j9j20j47RK79K1m2N6k38j47K09N2O2K56
6712C42k23j54K45j06k15q7Q5M98l59r2J45l68M31L3k78J98j57J52l0j60M5n5
6734a10j62J62Q8J35k33K44L3m04J76L4p7R8j41R4Q1K47k98n17L75K32J08j20
6756D5J04r6j43K03n99L62J28N2R1j02N2n4rj29K27k36l1Q1L35k37J23j48Rm3
6780a5J53l37M11k58L1J28k08N5J51m15J46Q6L7j5p6L47k64j05l4M82k99J75j43
$$ plain form
6803 33 -44 -36 110 106 26 -129 255 197 169 21 46 -38 -14 186 -232 -95 -175 29 25 70 118 51 -167 39 89 18 187
6830 187 154 55 64 137 -108 -8 98 51 300 -41 -74 -94 -150 -337 0 125 30 -137 232 69 2 -9 -112 -195
6854 -195 89 184 -119 -82 96 -64 -212 -134 234 -59 161 -238 -302 -318 -26 232 38 -51 46 -197 25 -152
6876 -152 -99 -147 22 -105 41 101 -242 -46 -1 -128 -164 9 -200 -163 -66 132 237 132 -265 -72 -36 259 204
6899 204 140 57 85 162 -80 -237 209 -114 372 261 -141 83 22 -80 -243 347 -160 173 72 338 45 -70
6921 -70 40 -87 -120 -19 3 -146 205 -87 62 -115 77 6 188 -101 112 132 149 -137 -157 -226 -8 -205 -42
6944 -42 226 -107 151 -363 52 -87 -69 -85 -87 -41 234 -276 -84 18 -57 -208 -259 -22 162 213 358 6 -108
6967 -108 71 -328 -12 106 459 175 -49 -367 -298 -282 -123 -66 94 -165 -169 -79 -108 206 -67 -265 -41 215
$$ packed form
6803C3p7QJ46mq0j55L84n8k8j48K5q4K4K00m18J37q0K04mM5M8o7k18K06N0p1J69
6830A87l3r9RP3k45J00J06m7K49l41l3k0n6j87L37J25r5j67L69j63o7j1j03q3
6854a95K84R5l03L7J78j60j48P8L68k93K20l99o4j6K92K58j94q9R7k43K22j77
6876a52N3m8J69j27J46O0l43J96M5j27l6J73k09L7R7J98J05j05l97J93L6K95n5
6899B04o4q3K8P7k42j57M46l23M86j11m02K24o1j02j63N90n07L33j01K66k93j15
6921g0J10j27l3J01K2j49L51k92J49j77J92p1J82k89K13K0J7k86k0o9K18j97J63
6944d2K68l33K58n14M15j39J8j6kM6K75n10J92J02p5j51n1K37J84N1J45l52j14
6967a08J79l99L16J18L53k84k24l18O9J6J59N7J60k59mR0k9L14k73j98K24K56
$$ plain form
6989 215 113 48 161 -19 -195 -458 -218 -189 -35 -11 104 -141 107 -205 153 62 -56 7 -3 -56 -10 122 83
7012 83 117 -379 106 -117 -15 34 134 277 29 -14 -79 65 21 6 116 131 -129 31 23 183 -58 85 -34
7035 -34 85 2 -152 106 -290 89 -56 -86 -1 12 -154 -129 -220 16 91 -87 51 37 262 85 -267 -192 -47
7058 -47 -107 -55 -15 124 -154 208 43 -109 -312 75 -162 -42 77 -229 220 -179 132 183 -92 -106 106 190
7080 190 -87 -98 31 94 42 -69 -348 134 -88 -106 82 48 -24 -108 -61 216 -94 -297 -148 -63 -213 -97 -48
7103 -48 -219 102 -185 -197 270 22 -98 -187 -110 -70 -100 302 -270 17 -17 -96 150 -102 -175 190 -52 249 60
7126 60 341 269 38 -151 -380 65 27 30 122 -258 -276 19 131 145 181 138 121 -38 445 277 -221 -22 -305 185
7150 185 -107 203 80 -36 33 -301 147 133 151 -106 198 208 298 -52 -125 -183 -264 -76 421 -76 7 -265 14
$$ packed form
6989B15j02o5J13j80j76k63K40K9J54K4J15k45K48l12L58r1j18O3j0n3M6J32l9
7012H3L4m96M85k23J02M9J00J43k48m3o5J44m4j5J10J5k60J60qJ60k41J43j19
7035c4J19q3j54K58l96L79j45l0Q5J3j66K5r1K36P5j78J38j4K25j77l52P5J45
7058d7o0N2M0J39k78L62j65j52k03L87k37J20J19l06M49l99L11N1k75j4K12Q4
7080A90k77j1J29O3n2j11k79M82k22j8J88l4p2q4M7K77l10k03J49Q5j50J16M9
7103d8j71L21k87j2M67k48j20q9P7M0l0M02n72K87l4p9K46k52p3L65k42L01j89
7126F0K81p2k31j89k29M45l8LR2l80j8K95J12J4L6m3j7j59M83j68m98J99k83M90
7150A85k92L10j23j16O9l34M48j4J8k57L04J0R0l50p3n8q1J88M97m97Q3k72K79
$$ plain form
7173 14 -235 50 -46 -72 73 -122 92 376 -133 -261 34 67 -108 96 102 -144 -120 58 -94 132 -83 -95 213
7196 213 84 -367 155 -115 125 -199 -187 227 -11 33 154 -11 172 70 -271 111 131 -125 -84 31 -150
7217 -150 149 -219 -101 247 155 24 -182 157 -108 -90 -239 -113 -3 -86 313 81 197 -145 -92 -28 233 -222
7239 -222 -217 303 -229 -15 -57 166 67 -285 -179 -151 170 -72 350 167 -31 -39 -26 -183 -276 290 67 -265 259
7262 259 -4 -51 290 134 -76 133 -28 142 138 -185 208 -263 -210 -130 60 -60 275 33 -69 -110 -106 -107 -225
7285 -225 -21 366 73 9 -91 77 -7 6 98 -20 -160 57 -29 -110 34 125 263 32 -92 47 252 3
7307 3 -114 -156 -153 -28 70 282 -29 175 308 -234 13 -42 230 -103 -16 -89 55 -50 130 4 10 -93 86 65
7331 65 138 -110 -208 -175 9 -180 -41 -90 -15 129 1 124 -6 -84 -6 277 -147 12 -9 -64 -193 -55 -9 -165
$$ packed form
7173A4k49K85r6k6J45j95K14K84n09j28K95L3j75K04Ok46K4J78j52K26k15j2L08
7196B13j29m51N22k70K40l24J2M14k38M4J21j65J83j02l41L82K0k56M1J15j81
7217a50K99l68J18L48r2j31k06L39k65J8j49J26J10q3L99k32J16l42N3O4K61m55
7239b22NN20n32K14m2K23r9l52J06K8L21k42M22j83j98qJ3j57r3N66k23l32N24
7262B59k63m7L41j56k10K09j61J70ml23L93m71N3Q0J90j20L35k42j02m1Mjj18
7285b25K04L87k93o4j00J68q4J3R2j18j40K17q6q1J44R1J38k31j24J39K05k49
7307Cj17m2LJ25R8K12l11K04J33n42K47n5K72l33Q7p3J44j05J80j26Oj03J79k1
7331F5P3k48r8L3J84j89J39m9P5J44j28J23j30p8P8K83m24J59k1n5j29J38M6j56
$$ plain form
7355 -165 -42 -110 55 13 28 283 -134 -33 40 -148 17 155 146 -206 -79 -135 71 -220 -128 -31 93 159 -237
7378 -237 2 -186 -77 85 46 87 151 270 15 59 -161 -21 -99 54 31 -77 -25 162 308 146 -291 -61
7400 -61 191 117 106 -90 144 301 -66 -65 191 -99 214 148 57 128 -22 27 -3 -150 -98 -89 7 319 -182 -154 93
7425 93 313 251 -155 241 -99 -106 -225 -169 -83 -27 -345 -88 50 130 26 -60 -125 -52 27 -9 -100 -220 171 166 -169
7450 -169 165 -232 -76 -88 -122 -249 259 -179 -202 -16 -102 -65 0 45 54 -69 72 -147 -104 -126 -164 -115 -22 69 -177
7475 -177 169 324 458 -240 -2 -208 -186 -135 45 -147 -185 -145 -167 232 -164 -116 166 -19 -33 -112 151 -37 -226
7498 -226 -119 -28 92 43 283 -19 178 325 -130 -76 77 92 -457 75 -23 -45 -218 75 1 -63 -94 -91 -221 414
7522 414 71 -124 -250 -189 -40 22 28 122 -42 328 83 2 -136 -4 55 418 324 -79 -58 23 -136 28 -37 63
$$ packed form
7355a65J23o8J65m2J5K55m17J01P3j88J65J38rl52J27n6K06k91R2R7J24O6l96
7378b37K39j88J09J62l9M1O4J19k55M4k20J40p8J53k3j08N2J87J46j62m37K30
7400f1K52p4j1j96K34J57l67JK56k90L13o6r1P1j50M9l0j47N2RR6L12n01K8K47
7425I3K20o2m06L96l40pj19N6Q6N6l18K57J38Q0j04q6o5P3P9l6r1j20L91nl35
7450a69L34l97J56j2l4j27N08m38k3J86q6L7O5M5Rj23J41k19M3k2l8M9R3R1k46
7475a77L46J55J34o98K38k06K2N1J80j92l8M0k2L99l96M8K82j85j4p9K63j88j89
7498b26J07R1J20m9K40l02J97J47m55N4J53J5n49N32r8k2j73K93p4o4l1Lj30O35
7522D14l43j95j26O1J49O2OR4j64L70k45q1j38J32N9L63r4m03K1Q1j59J64o5J00
$$ plain form
7546 63 188 102 -40 -55 160 -146 112 -534 8 -135 -81 -28 -84 -140 -54 128 -89 310 -9 -234 -71 4 85
7569 85 -212 -242 223 -15 -144 -29 -11 -9 9 96 -32 -24 36 -481 -197 26 -192 -202 -25 -315 -171 42 141 224
7593 224 112 -236 148 -27 85 86 -39 -22 95 -116 -6 -96 221 -76 12 -108 -107 59 74 169 -18 77 98 33
7617 33 168 195 70 -92 113 10 -44 -40 126 186 9 -28 205 -49 -157 -232 -100 -305 122 196 -99 157 13
7640 13 110 -106 -105 168 187 -206 128 -172 46 -89 22 123 33 -68 -208 2 105 27 -364 -127 120 87 119
7663 119 187 -75 231 -16 -78 -16 11 17 23 47 245 -13 155 -110 -185 32 93 6 -102 -173 -40 -108 -119 2 -5 -63
7689 -63 -140 -257 -33 -101 41 -372 -22 -98 5 180 -67 -82 -176 16 49 -131 -165 177 -195 185 -376 -101 23
7712 23 -49 33 -6 -279 -73 11 -37 241 85 -50 161 63 -349 254 119 380 46 244 241 -154 99 118 68 193
$$ packed form
7546F3J25q6j42j5K15l06K58o46N42j43N4N3n6n6Q6J82k17L99l19k25J63P5Q1
7569H5k97l0M65k38j29J15J8KJ8Q7j28QO0n17K84K23k18j0J77k90J44K13R9Q3
7593B24j12l48L84j75J12Jj25J7J17k11J10r0L17k97Q8j20JJ66J5R5j87R5K1o5
7617C3J35K7j25j62K05j03n4MJ66O0j77l7K33k54j08p5J32k05M27P4k95K56j44
7640A3R7k16JK73J9l93L34l00K18j35J11J01r0j01j40K10J03p8l91K37K47l3L2
7663A19O8k62L06k47o2O2K7OOK4J98k58J68k65p5K17O1q7j08p1J33o8j1J21pn8
7689f3p7j17K24o8J42m13L50p6J03J75k47j5r4J92L3j80l4L42l72L80n61K75J24
7712B3p2Q2l9k73K06Q4m8K78j56j35K11r8m12O03j35K61l34J98ll95K53J9n0J25
$$ plain form
7736 193 298 -177 139 114 174 29 -130 301 225 -14 -144 -76 -116 -35 200 318 102 -71 121 51 -162 84
7758 84 -198 -13 157 -24 -32 31 -92 -297 -50 -9 71 3 -137 131 -58 300 -86 -230 19 -44 -84 169 -213
7781 -213 163 76 235 -88 -28 -228 64 25 112 148 -118 -294 -140 -292 -162 -102 -179 164 126 344 63 -314 -144
7804 -144 74 163 42 157 53 72 -136 -178 -86 21 -111 -163 -23 -214 64 10 -33 -56 65 -359 65 -53 13
7827 13 -5 -145 143 -145 -70 40 283 -148 68 -233 -7 -297 207 -15 64 -233 278 -325 229 31 -110
7848 -110 72 -149 -237 235 140 101 -24 -96 24 230 165 -258 107 -44 -401 74 -279 -3 -166 -269 38 64
7870 64 359 121 31 92 -116 -76 105 8 -28 48 -31 0 -15 -135 -42 -202 -181 -91 -316 174 57 -255 -103 -92 69
7895 69 -25 73 -66 -123 2 106 -161 103 -56 -215 245 -184 -89 42 -11 -283 -31 50 102 418 -2 78 -69
$$ packed form
7736A93J05m75L16k5O0j45j59M31p6k39j30O8m0Q1K35J18k16j73J92p0k13K46
7758H4k82J85J70j81qO3j23k05K47M1Q0o8j40K68j89L58l86j44K49o3m0K53l82
7781b13L76q7J59l23O0k00K92l9Q7L6k66j76J54j52J30O0p7L43l8K18k81l77J70
7804a44K18Q9j21J15j04J9k08m2R2J07j32n2J40j91K78n4m3k3J21m24M24j18O6
7827A3j8j40K88k88P5J10K43m31K16l01K26k90N04k22P9k97N11o03N54j98j41
7848a10J82k21q8M72r5l9j25p2J20K06o5m23L65j51l57M75l53K76j63j03L07K6
7870F4K95k38r0O1k08M0J81r7l6P6p9L1j5j20R3j60K1R0k25M90j17l12J52J1J61
7895F9r4R8j39n7J25J04k67K64j59j59M60m29R5J31n3k72K52Q1N2L16m20Q0j47
$$ plain form
7918 -69 -136 -18 11 66 88 128 -102 114 -61 -11 190 -135 -42 -97 132 -373 213 -81 -185 -362 -151 -216 65
7941 65 72 -116 178 214 146 118 10 -272 65 225 145 -35 61 -5 -41 -362 256 63 41 -4 55 13 292 -42 43
7966 43 357 65 86 83 252 106 152 -12 70 90 -46 34 95 72 -224 -175 141 52 45 -1 -193 16 82 169 -250 79
7992 79 138 -148 -200 325 -179 -113 -158 -199 69 -73 -97 253 -308 108 -118 32 389 27 57 -74 41 -14 41
8015 41 213 -60 -27 203 93 391 5 304 101 21 238 -130 -187 -30 80 -81 -105 178 316 -12 50 -122
8037 -122 19 -27 34 -124 242 -235 85 34 42 -74 59 144 81 247 11 155 -78 181 -207 258 -77 122
8059 122 -182 51 77 69 -23 -141 79 -128 -228 17 110 -39 15 -104 -66 58 5 99 25 -206 117 72 211 259
8083 259 65 -39 307 -98 116 -28 169 -51 -254 -140 -50 -145 257 182 -57 -187 -88 -260 95 282 214 -148
$$ packed form
7918f9o7J18K9N5K2M0k30K16j75N0K01l25R3n5K29n05N86k94j04j77K11o5K81
7941F5Pj88K94L6o8k8j08k82L37J60q0j80R6o6l6l21O18j93k2m5N9m2K79l34Q5
7966D3L14k92K1lJ69j46M6j64Q2K0j36Q0O1k3k96M9L16q9pm6j92K09O6Q7m19L29
7992G9N9k86n2N25n04O6m5m1K68j42k4L50n61M16k26J50L57l62L0j31J15n5N5
8015D1J72k73L3K30j10K98l86K99k03q0K17l68n7J57J10j61k4K83J38l28O2j72
8037a22J41m6O1j58L66m77L20n1Qj16J33Q5o3J66k36J44k33K59l88M65l35J99
8059A22l04K33K6qr2j18K20k07j00K45R3j49N4j19L8J24n3R4p4k31L23m5J39M8
8083B59j94j04L46m05K14j44J97k20k03J14R0r5M02p5k39j30R9j72L55J87o8l62
$$ plain form
8105 -148 -165 -328 -4 24 133 -6 57 -33 -143 -73 81 33 196 29 32 17 -22 -59 344 94 -111 60 -13 -197
8129 -197 -6 21 141 -222 178 127 77 -271 -126 72 -24 107 329 243 -224 5 110 -130 -83 241 -131 -72
8151 -72 -1 -133 -347 -173 271 107 85 232 387 -18 -197 -227 -198 33 190 44 76 -145 -25 -147 -141 98 -233
8174 -233 -28 127 83 -87 40 15 -302 173 -282 88 -85 -16 -58 60 -2 -58 115
$$ packed form
8105a48j7j63L24K8J09j39O3r0j10P0J54m8J63j67Lj5l9l7M03k50k05J71p3j84
8129a97J91K7J20l63M00n1n0l48J45J98r6J31K22q6m67K29J05k40M7L24l72N9
8151g2P1j32k14J74M44j64k2J47J55m05j79l0K9K31J57j46L2k21J20j22OK39l31
8174b33K05J55m4j70J27k5l17M75m55L70j73O9m2J18o2n6J73
8191A15
$$ Imaginary data points
##PAGE= N=2
##DATA TABLE= (X++(I..I)), XYDATA
$$ plain form
0 0 0 0 0 -8 8 0 8 -8 16 -16 24 -32 36 -40 56 -64 80 -91 107 -129 150 -175 202 -232 269 -305 347 -398 448
29 448 -507 569 -640 719 -802 895 -998 1110 -1232 1365 -1514 1678 -1855 2055 -2276 2522
45 2522 -2799 3108 -3468 3876 -4353 4917 -5595 6436 -7496 8890 -10817 13656 -18284 27131
59 27131 -50184 235369 522332 42109 -137810 -77837 -79900 -271050 -168747 169971 343949
70 343949 191462 85291 78798 -42669 -284620 -297490 -60904 150687 196418 219030 189589
81 189589 -10 -236728 -260326 -127121 -52490 -18666 143675 304455 199635 -93499 -231583
92 -231583 -161638 -119512 -150393 -34069 227355 329883 143420 -83357 -149693 -156439 -203937
103 -203937 -156295 74482 290561 272529 94049 -48674 -122453 -190787 -208017 -92151 98316
$$ packed form
0@%%%qJ6qQj6K4l2M0n6O8p6R6j20J44j71J98k36K79l25L77m34N01n74O52p45Q46
29D48r55J076j209J359j521J697j893K108k342K597k879L192l533L910m331M798
45B522n321N907o576P344q229R270j0512J2031j3932J6386j9707K4473l1940M5415
59B7131p7315K85553K86963m80223j79919N9973k063j91150J02303L38718J73978
70C43949j52487j06171o493j21467k41951j2870K36586K11591M5731K2612k9441
81A89589j89599k36718k3598J33205P4631L3824J62341J60780j04820k93134j38084
92b31583O9945M2126l0881J16324K61424J02528j86463k26777o6336o746m7498
103b03937M7642K30777K16079j8032j78480j42723p3779o8334j7230J15866J90467
$$ plain form
114 98316 220412 222341 138628 -5610 -171394 -256442 -195074 -46400 91882 185875 218213
125 218213 135958 -52753 -213490 -226580 -133810 -41895 42623 157238 228201 140372 -60290
136 -60290 -194429 -187449 -129270 -73269 39715 200001 255115 122674 -67008 -159877 -163363
147 -163363 -142149 -68205 86306 221370 218893 102090 -26764 -124002 -181676 -157847 -40996
158 -40996 98752 185926 203946 143333 -6345 -172616 -225638 -136564 -5882 92729 168143
169 168143 201195 121629 -48315 -173895 -178440 -116175 -43004 57960 173171 210053 114040
180 114040 -47325 -165958 -194353 -139105 -26937 95957 173165 170839 92570 -32342 -148740
191 -148740 -188646 -132192 -23828 80952 156061 176874 109046 -32586 -159824 -192194 -129936
$$ packed form
114I8316J22096J929q3713j44238j65784q5048O1368J48674J38282R3993L2338
125B18213q2255j88711j60737j3090R2770R1915Q4518J14615P0963q7829k00662
136f0290j34139O980N8179N6001J12984J60286N5114j32441j89682r2869l486
147a63363K1214P3944J54511J35064k477j16803j28854r7238n7674K3829J16851
158d0996J39748Q7174J8020o0613j49678j66271n3022Q9074J30682R8611P5414
169A68143L3052p9566j69944j25580m545O2265P3171J00964J15211L6882r6013
180A14040j61365j18633k8395N5248J12168J22894P7208k326p8269j24912j16398
191a48740l9906N6454J08364J04780P5109K0813o7828j41632j27238l2370O2258
$$ plain form
202 -129936 -25651 81617 161365 173231 94484 -39481 -154223 -190600 -134617 -20328 93189
213 93189 156463 153438 87408 -27729 -144860 -190795 -132676 -16871 87633 152076 163507
224 163507 97311 -35582 -156058 -184334 -117606 -11189 91491 158870 156274 76254 -36393
235 -36393 -126224 -164395 -132082 -26460 100359 167388 148100 76216 -19952 -127442 -186995
246 -186995 -132434 4100 113928 145853 133642 87626 -16929 -137781 -176700 -106825 -1164
257 -1164 84273 147925 163902 89058 -44144 -137045 -149177 -107718 -26213 91936 178995 155734
269 155734 49470 -46942 -105645 -146678 -132976 -22501 115477 164079 116936 52857 -14112
280 -14112 -111474 -182898 -134577 3144 109087 134377 120616 72618 -32994 -145270 -169587
$$ packed form
202a29936J04285J07268P9748J1866p8747j33965j14742l6377N5983J14289J13517
213I3189O3274l025o6030j15137j17131m5935N8119J15805J04504O4443J1431
224A63507o6196j32893j20476k8276O6728J06417J02680O7379k596q0020j12647
235c6393q9831l8171L2313J05622J26819O7029j9288p1884r6168j07490n9553
246a86995N4561J36534J09828L1925j2211m6016j04555j20852l8919O9875J05661
257a164Q5437O3652J5977p4844j33202r2901j2132M1459Q1505J18149Q7059k3261
269A55734j06264r6412n8703m1033J3702J10475J37978M8602m7143o4079o6969
280a4112r7362p1424M8321J37721J05943K5290j3761m7998j05612j12276k4317
$$ plain form
291 -169587 -99051 -6447 72485 136747 146443 63225 -61258 -134611 -139388 -107022 -32760 82789
303 82789 164573 138319 38073 -51078 -108262 -145373 -125018 -17059 110660 156817 114209
314 114209 42560 -30818 -109597 -154389 -111888 -2228 98623 141638 125378 59103 -40216
325 -40216 -125217 -145469 -95278 -4791 88013 146109 133210 50628 -50927 -117510 -131158 -95374
337 -95374 -12469 90450 152792 128861 42593 -48228 -107737 -128360 -99527 -11814 97571 155993
349 155993 125336 39485 -47193 -107318 -128910 -93658 -2308 97112 143502 118401 45696 -42357
361 -42357 -114162 -134518 -87228 2395 88346 134961 122198 47059 -55537 -124284 -124766 -76949
373 -76949 -7118 74934 138389 127438 34531 -69274 -117225 -113835 -84198 -17664 81619 145105
$$ packed form
291a69587P0536R2604P8932O4262R696q3218j24483p3353m777L2366P4262J15549
303H2789Q1784k6254j00246q9151n7184l7111K0355J07959J27719M6157m2608
314A14209p1649p3378p8779m4792M2501J09660J00851M3015j6260o6275r9319
325d0216q5001k0252N0191R0487R2804N8096j2899q2582j01555o6583j3648L5784
337i5374Q2905J02919O2342k3931q6268r0821n9509k0623K8833Q7713J09385N8422
349A55993l0657q5851q6678o0125k1592L5252R1350R9420M6390k5101p2705q8053
361d2357p1805k0356M7290Q9623Q5951M6615j2763p5139j02596o8747m82M7817
373g6949O9831Q2052O3455j0951r2907j03805m7951L390K9637O6534R9283O3486
$$ plain form
385 145105 113483 22242 -58174 -105164 -125469 -95355 -1995 96539 130803 96917 32838 -43403
397 -43403 -116266 -135821 -76174 16081 81303 112097 111222 51494 -55856 -132504 -120359 -56417
409 -56417 5140 67266 126509 124932 34284 -72676 -114532 -99289 -67668 -9753 80614 140331
421 140331 108784 19351 -56925 -99140 -112898 -79806 7978 96007 123745 91951 31897 -42874
433 -42874 -110786 -122798 -62053 23101 82545 109231 103009 44787 -51624 -119437 -110529 -50280
445 -50280 16715 75726 117517 108624 34675 -57930 -109263 -101374 -54675 11660 79540 118628
457 118628 100691 30662 -54305 -109632 -108224 -56481 17135 79534 108782 92006 28425 -55425
469 -55425 -111015 -108832 -58136 12171 75066 107090 88325 22097 -57616 -109077 -109223 -59863 15138
$$ packed form
385A45105l1622r1241q0416m6990k0305L0114R3360R8534L4264l3886o4079p6241
397d3403p2863j9555N9647R2255O5222L0794q75n9728j07350p6648J2145O3942
409e6417O1557O2126N9243j577r0648j06960m1856J5243L1621N7915R0367N9717
421A40331l1547q9433p6276m2215j3758L3092Q7784Q8029K7738l1794o0054p4771
433d2874o7912j2012O0745Q5154N9444K6686o222n8222r6411o7813Q908O0249
445e0280O6995N9011M1791q893p3949r2605n1333P889M6699O6335O7880L9088
457A18628j7937p0029q4967n5327J408N1743P3616O2399K9248j6776o3581q3850
469e5425n5590K183N0696P0307O2895L2024j8765o6228p9713n1461j46M9360P5001
$$ plain form
482 15138 79341 103323 80069 23098 -48975 -106194 -112115 -56309 23960 80593 98253 82016
494 82016 30471 -48008 -109338 -106454 -46153 25300 76554 100091 86650 27226 -52970 -103791
506 -103791 -98016 -47949 18539 77201 104388 81503 18300 -52461 -98543 -99475 -53281 19999
518 19999 81784 99979 72617 16619 -47480 -96151 -101526 -52610 23902 82493 98354 72100
530 72100 18534 -45830 -94245 -97043 -46542 27655 83596 98205 73521 21499 -42440 -91660
542 -91660 -94140 -42988 30028 82974 97203 73677 19525 -46690 -92619 -90436 -42050 23652
554 23652 76708 95774 70881 10660 -53361 -92149 -90303 -49346 16884 76569 94212 61574
566 61574 2479 -52989 -89982 -93436 -52097 20220 78117 88177 57503 8069 -47549 -91135
$$ packed form
482A5138O4203K3982k3254n6971p2073n7219n921N5806Q0269N6633J7660j6237
494H2016n1545p8479o1330K884O0301P1453N1254K3537j3441n9424q0196n0821
506a03791N775N0067O6488N8662K7187k2885o3203p0761m6082r32M6194P3280
518A9999O1785J8195k7362n5998o4099m8671n375M8916P6512N8591J5861k6254
530G2100n3566o4364m8415k798N0501P4197N5941J4609k4684n2022o3939m9220
542i1660k480N1152P3016N2946J4229k3526n4152o6215m5929K183M8386O5702
554B3652N3056J9066k4893o0221o4021l8788J846M0957O6230N9685J7643l2638
566F1574n9095n5468l6993l454M1339P2317N7897J0060l0674m9434n5618m3586
$$ plain form
578 -91135 -93218 -43641 26374 76668 88883 64713 11700 -49929 -87569 -80795 -36987 22668
590 22668 75468 96672 68446 6255 -51468 -80567 -77541 -41894 21890 81091 93597 56743
602 56743 2457 -44637 -79361 -86649 -45431 27018 79653 84659 54086 6098 -48983 -88544
614 -88544 -82968 -33565 25719 68580 84330 63384 6330 -55894 -84112 -70438 -32576 18749
626 18749 72849 95894 62787 -2849 -52983 -71936 -68662 -38171 22958 82124 92580 52677
638 52677 -746 -43841 -73620 -76545 -35902 29604 76784 81973 53333 4110 -50723 -84225
650 -84225 -74255 -28811 24988 65778 80481 56132 -1330 -58465 -82669 -68576 -30928 19394
662 19394 65893 82043 52844 -4561 -55995 -79147 -69344 -30953 23278 68534 80852 51567
$$ packed form
578i1135k083M9577P0015N0294J2215k4170n3013o1629l7640O774M3808N9655
590B2668N2800K1204k8226o2191n7723k9099L026L5647O3784N9201J2506l6854
602E6743n4286m7094l4724p288M1218P2449N2635N006l0573m7988n5081l9561
614h8544N576M9403N9284M2861J5750k0946n7054o2224k8218J3674L7862N1325
626A8749N4100K3045l3107o5636n0134j8953L274L0491O1129N9166J0456l9903
638E2677n3423m3095k9779k925M0643O5506M7180N189k8640m9223n4833l3502
650h4225R970M5444N3799M0790J4703k4349n7462n7135k4204J4093L7648N0322
662A9394M6499J6150k9199n7405n1434k3152R803L8391N4231M5256J2318k9285
$$ plain form
674 51567 -3199 -55067 -77725 -64681 -25783 22724 65573 81687 54360 -3350 -54865 -74420
686 -74420 -62337 -27728 23383 70402 81333 48738 -4954 -50302 -73389 -66736 -26744 29984
698 29984 70391 74163 46359 -171 -49597 -77911 -65089 -19042 29475 61910 72967 53814
710 53814 1899 -56628 -80861 -59029 -14953 27544 61808 75563 51060 -5440 -56300 -72009
722 -72009 -53820 -19432 22680 62593 77569 49613 -6197 -54702 -71690 -57187 -20149 27787
734 27787 67024 73267 42070 -7249 -48937 -68951 -59546 -21011 30286 65930 67497 41139 -900
747 -900 -47001 -76287 -63701 -14609 35060 59475 61557 44878 1750 -54771 -81365 -56261 -8077
760 -8077 29041 52460 64960 47046 -7181 -60107 -72211 -49554 -17267 19833 59252 72921
$$ packed form
674E1567n4766n1868k2658J3044L8898M8507M2849J6114k7327n7710n1515j9555
686g4420J2083L4609N1111M7019J0931l2595n3692m5348k3087O653L9992N6728
698B9984M0407L772k7804m6530m9426k8314J2822M6047M8517L2435J1057j9153
710E3814n1915n8527k4233K1832M4076M2497L4264J3755k4503n6500n0860j5709
722g2009J8189L4388M2112L9913J4976k7956n5810m8505j6988J4503L7038M7936
734B7787L9237O243l1197m9319m1688k0014R405L8535N1297L5644J567k6358m2039
747i00m6101k9286J2586M9092M9669K4415K082j6679m3128n6521k6594K5104M8184
760h077L7118K3419J2500j7914n4227n2926j2104K2657L2287L7100L9419J3669
$$ plain form
772 72921 40573 -14984 -54277 -66111 -55524 -19903 31812 67087 61918 29810 -6389 -40962
784 -40962 -67570 -61344 -14778 38139 62232 58402 38901 1049 -48503 -74778 -52756 -3875
796 -3875 35095 55585 60438 42205 -3514 -51679 -68050 -47906 -10421 29073 59924 64719 36054
809 36054 -10565 -48898 -63738 -51688 -14883 32526 62590 59855 30499 -9166 -46476 -66420
821 -66420 -53323 -10252 35355 58045 54466 31415 -5446 -45525 -66093 -50989 -9848 33501
833 33501 59246 59264 33018 -10280 -49063 -62383 -45868 -9041 31932 58512 57424 29319 -10317
846 -10317 -44163 -61104 -50972 -12709 34330 61691 54577 24756 -11520 -44865 -62338 -49842
858 -49842 -9512 33765 55458 51281 27544 -9444 -47688 -65210 -47157 -6679 32420 54408
$$ packed form
772G2921l2348n5557l9293j1834J0587L5621N1715L5275n169l2108l6199l4573
784d0962k6608O226M6566N2917K4093l830j9501l7852m9552k6275K2022M8881
796c875L8970K0490M853j8233m5719m8165j6371K0144L7485L9494L0851M795k8665
809C6054m6619l8333j4840J2050L6805M7409L0064k735k9356l9665l7310j9944
821f6420J3097M3071M5607K2690l579k3051l6861m0079k0568J5104M1141M3349
833C3501K5745J8k6246m3298l8783j3320J6515L6827M0973K6580j088k8105l9636
846a0317l3846j6941J0132L8263M7039K7361p114k9821l6276l3345j7473J2496
858d9842M0330M3277K1693m177k3737l6988l8244j7522J8053M0478L9099K1988
$$ plain form
870 54408 52798 27230 -12922 -47417 -58090 -42851 -9941 29928 58125 57166 26386 -15744 -45434
883 -45434 -54662 -42089 -9267 32174 59029 53746 23390 -12514 -40868 -55450 -45476 -9338 35158
896 35158 59612 51492 21862 -13057 -42601 -56412 -43369 -6662 33691 55227 50297 23876
908 23876 -12545 -45652 -57906 -40795 -4301 31623 52932 51183 25302 -14880 -47450 -54381
920 -54381 -36938 -5691 28791 54722 54122 23190 -18971 -45600 -49261 -36004 -8142 28959 56244
933 56244 52267 19698 -17655 -42101 -50459 -39672 -7456 32832 55322 47828 18194 -16096 -42573
946 -42573 -53089 -38255 -4261 30959 50184 46258 21991 -14593 -45811 -54588 -36354 -2610
958 -2610 30250 49455 47216 21726 -17015 -46796 -51373 -32456 -2277 28157 49408 48796 21775
$$ packed form
870E4408j610k5568m0152l4495j0673J5239L2910L9869K8197r59l0780m2130k9690
883d5434r228J2573L2822M1441K6855n283l0356l5904k8354j4582R974L6138M4496
896C5158K4454q120k9630l4919k9544j3811J3043L6707M0353K1536m930k6421
908B3876l6421l3107j2254J7111L6494L5924K1309j749k5881m0182l2570o931
920e4381J7443L1247L4482K5931o00l0932m2161k6629l661J3257K7862L7101K7285
933E6244l977l2569l7353k4446q358J0787L2216M0288K2490p494k9634l4290k6477
946d2573j0516J4834L3994L5220J9225l926k4267l6584l1218q777J8234L3744
958b610L2860J9205k239k5490l8741k9781m577J8917L0179L0434K1251o12k7021
$$ plain form
971 21775 -17661 -45389 -48575 -31244 -3820 28409 51879 49736 19445 -19080 -43141 -46437 -32462
984 -32462 -3733 31522 52203 44895 16028 -15977 -39976 -49349 -35161 -1250 33228 48513
996 48513 41432 18637 -14038 -44084 -52331 -30941 2718 29871 44466 43753 20888 -17225 -46996
1009 -46996 -48150 -26826 356 26878 47007 45994 17870 -19891 -43098 -44394 -29302 -2177
1021 -2177 30286 50107 42623 14356 -17595 -40403 -46853 -31362 2052 32579 45215 38247 16711
1034 16711 -14109 -42789 -49422 -28962 3344 29579 42879 40251 17829 -18470 -45585 -47004
1046 -47004 -26174 2524 28036 44398 40263 14110 -19231 -41427 -43892 -28119 473 31062
1058 31062 46628 38330 13118 -16924 -39839 -45637 -27689 4903 33291 43541 35263 14565
$$ packed form
971B1775l9436k7728l186J7331K7424L2229K3470k143l0291l8525k4061l296J3975
984c2462K8729L5255K0681p308k8867l2005k3999r373J4188L3911L4478J5285
996D8513p081k2795l2675l0046q247K1390L3659K7153J4595p13k2865l8113k9771
1009d6996j154K1324K7182K6522K0129j013k8124l7761k3207j296J5092K7125
1021b177L2463J9821p484k8267l1951k2808o450J5491L3414L0527J2636o968k1536
1034A6711l0820k8680o633K0460L2306K6235J3300k628k2422l6299k7115j419
1046d7004K0830K8698K5512J6362m135k6153l3341k2196k465J5773K8592L0589
1058C1062J5566q298k5212l0042k2915n798J7948L2592K8388J0250q278k0698
$$ plain form
1070 14565 -14470 -40452 -45683 -25361 6403 31658 41772 37035 15525 -16765 -42168 -44249
1082 -44249 -23734 5176 29675 42336 37034 12748 -19210 -40943 -42054 -24670 3070 29984
1094 29984 43390 35501 9898 -18807 -38858 -41904 -26288 3651 32635 43608 32374 9003
1106 9003 -16129 -37024 -42933 -25789 6680 33786 41240 31470 11228 -15298 -38431 -42781 -22332
1119 -22332 8329 31031 39464 33383 12199 -17670 -39937 -40830 -21137 6103 29608 41149 33388
1132 33388 8218 -20653 -37808 -37552 -22916 2903 29941 42666 31321 5555 -19316 -35744
1144 -35744 -39028 -24345 5199 32794 40481 28304 5962 -16767 -35730 -39545 -22550 7030
1156 7030 31724 39150 29285 7785 -17784 -36690 -37842 -19717 7332 30716 39466 30228 6701
$$ packed form
1070A4565k9035k5982n231K0322L1764K5255J0114m737k1510l2290k5403k081
1082d4249K0515K8910K4499J2661n302k4286l1958k1733j111J7384K7740K6914
1094B9984J3406p889k5603k8705k0051l046J5616K9939K8984J0973j1234k3371
1106I003k5132k0895n909J7144L2469K7106P454r770k0242k6526k3133m350K0449
1119b2332L0661K2702Q433o081k1184k9869k2267q93J9693K7240K3505J1541p761
1132C3388k5170k8871j7155K56J4636K5819K7038J2725j1345k5766k4871j6428
1144c5744l284J4683K9544K7595P687j2177k2342k2729j8963l815J6995K9580
1156G030K4694P426r865k1500k5569j8906j152J8125K7049K3384Q750r238k3527
$$ plain form
1169 6701 -18846 -35261 -35897 -19828 6647 30501 40032 29710 5862 -19105 -35223 -35921 -19680
1182 -19680 6716 30356 38723 28352 5077 -19968 -35137 -35129 -19366 5626 29537 38606 27776
1195 27776 3755 -20683 -34308 -33837 -19046 5857 29704 38652 27047 3556 -19496 -33253
1207 -33253 -33584 -18577 7146 30578 38280 26999 4089 -18725 -33576 -33016 -16691 8681 29508
1220 29508 36797 27065 4876 -19677 -34331 -32050 -15474 7453 28080 36391 27250 3297 -21364
1233 -21364 -34364 -30893 -14740 6911 27273 35809 26207 2709 -21249 -33687 -31162 -15444 7163
1246 7163 27870 35954 24835 1699 -20874 -32865 -30075 -14681 7540 27946 35371 24687 2124
1259 2124 -20295 -32480 -30206 -14333 9106 28783 33835 23233 2625 -19220 -32609 -29950 -12696
$$ packed form
1169F701k5547j6415o36J6069K6475K3854R531j0322k3848k4967j6118o98J6241
1182a9680K6396K3640Q367j0371k3275k5045j5169QJ5763K4992K3911R069j0830
1195B7776k4021k4438j3625M71J4791K4903K3847Q948j1605k3491k3052j3757
1207c3253l31J5007K5723K3432P702j1281k2910k2814j4851N60J6325K5372K0827
1220B9508P289r732k2189k4553j4654K281J6576K2927K0627Q311r141k3953k4661
1233b1364j3000L471J6153K1651K0362Q536r602k3498k3958j2438K525J5718K2607
1246G163K0707Q084j1119k3136k2573j1991K790J5394K2221K0406P425j0684k2563
1259B124k2419j2185K274J5873K3439J9677N052j0602k0608k1845j3389K659J7254
$$ plain form
1272 -12696 9912 27147 32199 23920 3394 -20608 -34542 -29222 -11208 9363 25307 32214 24176
1285 24176 1802 -21981 -32499 -27201 -12186 7110 25567 33782 23050 81 -21909 -31452
1297 -31452 -27593 -12735 9268 27314 32174 20913 377 -19108 -30639 -28370 -11940 10388
1309 10388 27741 31454 21277 1555 -19102 -31904 -27898 -10202 11827 26692 29721 20846 1934
1322 1934 -18962 -31787 -27344 -8789 11354 25075 29184 21193 1911 -21090 -32141 -25674 -8345
1335 -8345 9931 24186 30339 21210 -580 -21590 -30077 -24621 -10360 9203 26868 30877 18262
1348 18262 -2060 -19066 -27909 -26396 -11238 11763 27796 27767 16846 730 -17443 -30611 -27919
1361 -27919 -8122 13826 25506 26216 18146 1378 -19862 -30985 -24508 -6553 11139 23661 28125
$$ packed form
1272a2696K2608J7235N052q279k0526k4002j3934N320J8014K0571J5944O907q038
1285B4176k2374k3783j0518N298J5015J9296J8457Q215j0732k2969k1990r543
1297c1452L859J4858K2003J8046M860j1261k0536j9485j1531K269J6430K2328
1309A0388J7353L713j0177j9722k0657j2802M006J7696K2029J4865L029q875j8912
1322A934k0896j2825M443J8555K0143J3721M109p991j9282k3001j1051O467J7329
1335h345J8276J4255O153r129k1790k1010q487N456J4261J9563J7665M009j2615
1348A8262k0322j7006q843J513J5158K3001J6033k9j0921j6116j8173j3168K692
1361b7919J9797K1948J1680P10q070j6768k1240j1123O477J7955J7692J2522M464
$$ plain form
1374 28125 19460 -821 -20738 -29110 -23848 -8853 11108 25690 28486 16207 -2964 -18935 -27298
1387 -27298 -23992 -9002 11727 25814 26737 16155 -1224 -18624 -28499 -24685 -7622 12535 25626
1400 25626 26381 15208 -2192 -19077 -27416 -23039 -6979 12043 25187 25993 15530 -1590 -18660
1413 -18660 -27632 -22985 -6599 12466 25441 26281 15271 -2733 -18775 -26549 -21636 -6552 12271
1426 12271 25106 25890 14700 -3020 -18473 -25937 -21802 -6832 12407 24934 25030 14049 -2760
1439 -2760 -18948 -26879 -22104 -5768 12041 24119 24509 13642 -3629 -19646 -26175 -20153 -6204
1452 -6204 11084 23770 25176 13503 -4273 -18762 -24719 -20875 -6794 12660 25594 24374 11503
1465 11503 -4432 -17913 -24566 -20633 -5170 13186 23894 22892 12761 -3461 -18528 -25475 -19846
$$ packed form
1374B8125q665k0281j9917q372N262J4995J9961J4582K796j2279j9171j5971q363
1387b7298L306J4990K0729J4087R23j0582j7379j7400r875L814J7063K0157J3091
1400B5626P55j1173j7400j6885q339M377J6060J9022J3144Q06j0463j7120j7070
1413a8660q972M647J6386J9065J2975Q40j1010j8004j6042p774M913J5084J8823
1426A2271J2835P84j1190j7720j5453p464M135J4970J9239J2527R6j0981j6809
1439b760j6188p931M775J6336J7809J2078L90j0867j7271j6017o529O022J3949
1452f204J7288J2686J406j1673j7776j4489n957L844J4081J9454J2934j220j2871
1465A1503j5935j3481o653L933J5463J8356J0708j002j0131j6222j5067o947N629
$$ plain form
1478 -19846 -4655 12473 23619 24057 12383 -5430 -19495 -23904 -18059 -4694 12002 23292 23503
1491 23503 11581 -4942 -18366 -23833 -18735 -4959 12039 23659 23470 11697 -5469 -19353 -23253
1504 -23253 -17284 -3658 12169 23037 23146 11170 -5691 -18171 -22383 -17014 -4306 12157 23283
1517 23283 22702 10795 -5294 -18441 -23297 -17422 -3264 12687 22201 21458 10497 -5181 -18802
1530 -18802 -23496 -16662 -2374 11974 21186 21038 10668 -5375 -18957 -23253 -16232 -2558 11597
1543 11597 21409 21437 10406 -6431 -19548 -22608 -15218 -1970 11516 21063 20670 9768 -6402 -18410
1557 -18410 -21372 -15640 -3184 11971 22445 20868 8820 -6754 -17963 -21321 -15555 -1547 13316
1570 13316 20966 18470 8714 -4434 -17671 -22692 -15741 -639 13044 19655 19261 10112 -5672 -19488
$$ packed form
1478a9846J5191J7128J1146M38j1674j7813j4065m409N845J3365J6696J1290K11
1491B3503j1922j6523j3424n467N098J3776J6998J1620j89j1773j7166j3884l900
1504b3253N969J3626J5827J0868J09j1976j6861j2480m212N369J2708J6463J1126
1517B3283n81j1907j6089j3147m856N875J4158J5951R514p43j0961j5678j3621
1530a8802m694O834J4288J4348R212j48j0370j6043j3582m296P021J3674J4155
1543A1597R812K8j1031j6837j3117l060P390J3248J3486R547l93j0902j6170j2008
1557a8410k962N732J2456J5155J0474j577j2048j5574j1209l358N766J4008J4863
1570A3316P650k496r756j3148j3237n021O951J5102J3683O611l94r149j5784j3816
$$ plain form
1584 -19488 -21948 -13204 -233 11230 19799 20143 9858 -6496 -18453 -20112 -13442 -1654 12119
1597 12119 21298 19265 7962 -6518 -16706 -20336 -14205 -716 13121 20506 18458 7961 -5448
1610 -5448 -17521 -21161 -13945 279 12886 19214 17491 8188 -5799 -17521 -20754 -13541 -229
1623 -229 12193 19175 17586 7602 -6385 -17601 -20939 -13544 227 12760 18690 16924 7191 -6216
1637 -6216 -17810 -20127 -12418 166 12106 19080 17216 7322 -6577 -17487 -19432 -12654 -18
1650 -18 12619 19514 16706 6283 -6809 -16670 -19175 -12807 349 13211 19242 16065 6013 -6601
1664 -6601 -16554 -19218 -12732 1065 12835 18344 15347 6106 -6571 -16687 -18998 -12298 1006 13124
1678 13124 18006 15219 5594 -6474 -16433 -18826 -11711 1166 12923 18341 15815 6091 -6815 -16286
$$ packed form
1584a9488k460Q744J2971J1463Q569L44j0285j6354j1957j659O670J1788J3773
1597A2119R179k033j1303j4480j0188l630O131J3489J3837P385k048j0497j3409
1610e448j2073l640P216J4224J2607O328j723r303j3987j1722l233P213J3312
1623b29J2422O982j589r984j3987j1216l338P395J3771J2533N930j766r733j3407
1637f216j1594k317P709J2584J1940O974j864r894j3899j0910j945O778J2636
1650a8J2637O895k808j0423j3092r861k505O368J3156J2862O031l177j0052j2614
1664f601r953k664O486J3797J1770N509k997r241j2677j0116k311O700J3304J2118
1678A3124M882k787r625j2068r959k393P115J2877J1757N418k526r724j2906r471
$$ plain form
1692 -16286 -18021 -10770 1233 12954 18674 15694 5194 -7494 -15700 -16906 -10695 884 12880
1705 12880 18811 15304 4628 -6933 -15402 -17492 -11611 1499 13241 17685 13850 4460 -6969
1718 -6969 -15725 -17791 -10883 1337 12326 16769 14019 4244 -7671 -16238 -17522 -10434 1370 12685
1732 12685 17429 14030 3816 -7555 -15317 -16675 -9943 1534 12646 17775 13480 4045 -7415
1745 -7415 -15184 -16555 -10004 2235 12826 17238 13754 3966 -7542 -15349 -16048 -9528 1751 12211
1759 12211 16989 13878 3327 -8433 -15575 -15707 -9349 1326 12383 17452 12968 2708 -8038
1772 -8038 -14630 -15379 -9287 2427 12980 17020 12702 2790 -7672 -14881 -15368 -8669 2787 12817
1786 12817 16468 12727 3280 -7555 -15071 -14654 -7920 2854 12351 16550 13184 2860 -8500 -15382
$$ packed form
1692a6286j735P251J2003J1721N720k980j0500j2688q206j206O211J1579J1996
1705A2880N931l507j0676j1561q469k090N881J3110J1742M444l835r390j1429
1718f969q756k066O908J2220J0989M443k750r775j1915q567j284P088J1804J1315
1732A2685M744l399j0214j1371p762j358O732J1477J1112N129m295r435j1460
1745g415p769j371O551J2239J0591M412l484r788j1508p807o99O520J1279J0460
1759A2211M778l111j0551j1760p142j32O358J0675J1057N069m484j0260j0746
1772h038o592p49O092J1714J0553M040m318r912j0462p209m87O699J1456J0030
1786A2817L651l741r447j0835p516M17O734J0774R497M199l366j0324j1360o882
$$ plain form
1800 -15382 -13966 -7203 2247 11772 16211 12878 2211 -8447 -14819 -14357 -8006 1831 12077 16011
1814 16011 11852 1736 -8547 -14602 -14374 -7769 2807 11785 15340 11250 2374 -7788 -14644 -14639 -7389
1829 -7389 3257 11593 15325 11398 2052 -8549 -14792 -13975 -6707 2944 11260 14917 11481 1924 -8637
1844 -8637 -14971 -13797 -6667 3195 11208 15235 11434 1686 -8574 -14263 -13169 -6297 3100 11865 14999
1859 14999 10902 1569 -8208 -14032 -12969 -6370 3784 11854 14599 10341 1538 -7949 -13948 -12809
1873 -12809 -5833 3965 11759 13981 10236 1604 -8341 -14120 -12713 -5293 4116 11498 14146 10221 1227
1888 1227 -8504 -13780 -12614 -5547 3968 11851 13934 9640 1216 -8322 -13873 -12331 -5091 4158 11505
1903 11505 13212 9230 1004 -8717 -13601 -12195 -4956 4210 11176 13219 9516 579 -8597 -13653 -12227
$$ packed form
1800a5382J416O763R450R525M439l333j0667j0658o372M62O351R837J0246L934
1814A6011m159j0116j0283o055K28O605J0576Q978L555m090q876j0162o856NP250
1829g389J0646Q336L732l927r346j0601o243Q17P268R651Q316L657l436r557j0561
1844h637o334J174P130R862Q013M027l801r748j0260n689J094O872R397Q765L134
1859A4999m097r333r777n824J063O599J0154Q070K745m258q803r487n999J139
1873a2809O976R798P794K222l745q632r945n779J407P420R409P382K648l925q994
1888A227r731n276J166P067R515P883K083m294q424r538n551J542P240R249P347
1903A1505J707l982q226r721m884J406P239R166O966K043l703q937r176n056J426
$$ plain form
1918 -12227 -4917 3653 11241 13287 8956 585 -8209 -13375 -12293 -5193 4155 11434 12794 8269 540
1933 540 -8024 -13457 -11962 -5004 4779 11166 12274 8452 463 -8019 -13218 -11766 -3947 4727 11353
1948 11353 12583 8596 451 -7909 -12550 -11094 -4403 4528 11171 12523 8162 496 -7947 -12615 -11086
1963 -11086 -4032 4575 11141 12741 7945 -15 -8148 -12414 -10803 -4204 4406 11023 12327 7450 -400
1978 -400 -7801 -12159 -11117 -4293 4851 11541 11838 6781 -462 -7528 -12079 -10790 -3530 5154 11107
1993 11107 11344 7194 -244 -7910 -12424 -10415 -3102 5039 10410 11824 7343 -719 -8377 -12211 -9770
2008 -9770 -3900 4380 11003 11678 6302 -1416 -7872 -11744 -10351 -3849 4501 10523 11137 6421 -1461
2023 -1461 -8292 -11462 -9980 -3472 5129 11189 11164 6208 -1788 -8182 -11337 -9113 -2952 5133 10991
$$ packed form
1918a2227P310Q570P588K046m331q371q794n166J082P100R348P279J360m525p729
1933E40q564n433J495O958R783O387J108l822p989q482n199J452P819Q674O626
1948A1353J230l987q145q360m641J456O691Q931O643J352m361p666q443m668J529
1963a1086P054Q607O566J600m796p960q133m266J611O599Q610O617J304m877p850
1978d00p401m358J042O824R144O690K97n057p243p066m551J289P260Q684N953
1993A1107K37m150p438p666m514K009P313Q141N371J414m481q062p658l834K441
2008i770N870Q280O623O75n376p718o456l872J393O502Q350O022O14m716p882
2023a461o831l170J482O508Q601O060k5m956p996o394l155K224O161Q085N858
$$ plain form
2038 10991 10823 6315 -911 -7275 -11392 -9650 -2564 5295 10718 10906 6441 -1015 -8588 -11434 -8182
2053 -8182 -2219 4582 9797 10921 6335 -1805 -8209 -10869 -8635 -2728 4793 11001 11182 5307 -1889
2068 -1889 -8024 -10523 -8597 -2280 5063 10453 10609 5419 -1534 -8037 -10533 -8462 -1933 5169 10034
2083 10034 10308 5960 -1817 -8415 -10701 -8125 -1940 4935 9786 10215 5175 -1984 -8165 -10365 -8347
2098 -8347 -2146 5117 9743 9682 5031 -1705 -8259 -10844 -8195 -1775 5095 9703 9988 4945 -2439 -8638
2114 -8638 -10032 -7560 -1874 5140 9733 9516 4763 -2633 -7933 -9930 -7734 -1402 5425 10069 9827
2129 9827 4859 -2487 -8322 -10191 -7252 -836 5736 9598 9219 4475 -2383 -7746 -9742 -7438 -1364
2144 -1364 5546 10114 9198 4209 -2156 -8106 -10274 -7220 -417 5869 9088 8872 4698 -2292 -8379
$$ packed form
2038A0991j68m508p226o364m117J742P086P859N423J88m465p456p573k846L252
2053h182N963O801N215J124m586q140o404k660K234N907P521O208J81n875p196
2068a889o135k499J926O317P343N390J56n190o953o503k496K071O529P102M865
2083A0034K74m348p777o598k286K576O185O875M851M29n040p159o181k200K018
2098h347O201P263M626o1m651o736o554k585K649O420O870M608K85n043p384o199
2114h638j394K472N686P014M593k17m753p396n300j997K196O332O827M644k42
2129I827m968p346n835j869K939O416O572L862l79m744o858n363j996K304O074
2144a364O910M568r16m989o365n950k168L054O803O286L219k16m174o990o087
$$ plain form
2159 -8379 -9634 -6185 -538 5149 9093 9148 4718 -2890 -8322 -9169 -6485 -910 5411 10024 9155 3540
2175 3540 -3118 -7853 -8980 -6900 -457 5958 9077 7863 3600 -2100 -7945 -10145 -6665 -119 5781
2190 5781 8610 8239 3982 -3019 -8410 -9431 -5825 -117 5829 8598 7674 3311 -2799 -7506 -9308
2205 -9308 -6047 -435 5583 9123 7999 3604 -2744 -8147 -9327 -5805 364 5732 8757 7893 2819
2220 2819 -3034 -7619 -8795 -5787 -120 5911 9250 7910 2740 -3100 -7350 -8806 -5659 473 6261
2235 6261 8556 7204 2768 -3035 -7773 -8785 -5471 716 5752 7995 7323 3022 -2930 -7620 -8280
2250 -8280 -5056 199 5719 8730 7322 2417 -3256 -7260 -8164 -4970 576 6178 8341 6826 2279
2265 2279 -3181 -7141 -8425 -5127 639 5582 8548 6858 2494 -3334 -7451 -7950 -5038 632 5864
$$ packed form
2159h379j255L449N647N687L944N5m430p608n432q47K684N575O321M613q69n615
2175C540o658m735j127K080O443O415L119j214m263n700n845k200L480O546N900
2190E781K829l71m257p001n391j021L606N708N946K769r24m363o110m707j802
2205i308L261N612O018L540j124m395o348n403j180L522O169N368L025q64n074
2220B819n853m585j176L008N667O031L339j340n170n840m250j456L147O132N788
2235F261K295j352m436n803m738j012L314O187N036K243o72m301n952m690o60
2250h280L224N255N520L011j408m905n673m004r04L194N546N602K163j515m547
2265B279n460l960j284L298N766M943K966j690m364n828m117m99K912N670N232
$$ plain form
2280 5864 8483 6646 1878 -3354 -6979 -7654 -4998 656 5737 8062 6265 2188 -3100 -7647 -8380
2295 -8380 -4854 840 5856 8078 6341 2126 -3889 -7345 -7555 -4533 425 5441 8135 6674 1646
2310 1646 -3480 -7104 -7615 -4763 864 6137 7964 6081 1713 -3467 -6990 -7400 -3901 1067 5890
2325 5890 7557 6037 2064 -3351 -7247 -7395 -3890 1055 5361 7888 6234 1419 -4013 -6788 -6896
2340 -6896 -4238 874 5758 7997 5637 1231 -3665 -6662 -7099 -4016 1091 5787 7831 5584 1354
2355 1354 -3538 -6746 -6979 -3739 1424 5601 7510 5319 1259 -3624 -6841 -6507 -3247 1347 5482
2370 5482 7151 5506 1209 -3911 -6699 -6529 -3662 1222 5334 7183 5322 878 -4164 -6912 -5954
2385 -5954 -3520 1127 5650 7211 5136 989 -3787 -6679 -6398 -3522 1476 5826 7072 4987 597
$$ packed form
2280E864K619j837m768n232l625o75K656N654N081K325j797m077n288m547p33
2295h380L526N694N016K222j737m215o015l456k10L022M958N016K694j461n028
2310A646n126l624n11K852N627N273J827j883m368n180l523m10L499M968M823
2325E890J667j520l973n415l896j48L505M945M306K527j654m815n432k775j08
2340f896K658N112M884K239k360m406m896k997m37L083N107M696K044k247m230
2355A354m892l208k33L240N163M177J909k191m060m883l217L34L260M594M135
2370E482J669j645m297n120k788J70K867M884M112J849j861m444n042k748R58
2385e954K434M647M523J561k075m147m776k892K81K876M998M350J246k085m390
$$ plain form
2400 597 -3535 -6464 -6194 -3031 1609 5093 6577 4867 1144 -3883 -6958 -6156 -2897 1655 5374 6569
2416 6569 4929 778 -3792 -6211 -5751 -2697 1426 5314 6577 5184 679 -3929 -6458 -5917 -2751
2431 -2751 1840 5383 6807 4639 528 -3849 -5998 -5954 -2524 1842 5417 6484 4762 759 -3698
2446 -3698 -6337 -6156 -2477 1924 5359 6288 4263 478 -3813 -6280 -5809 -2481 1844 5134 6296 4467
2462 4467 552 -4211 -6082 -5736 -2339 2086 4795 6196 4314 433 -3693 -6331 -5275 -2346 1972
2477 1972 5125 6087 4506 8 -4049 -5940 -5466 -2303 2031 5044 5702 3681 -197 -3840 -5925 -5473
2493 -5473 -2482 1924 5336 5735 3713 96 -3813 -6104 -5161 -1735 2204 4772 5474 3875 316 -3774
2509 -3774 -5872 -5350 -1656 2520 5036 5835 3762 45 -3865 -5693 -4659 -1713 2140 5274 5717 3776
$$ packed form
2400E97m132k929K70L163M640L484J484j710l723n027l075Q02L259M552L719J195
2416F569j640m151m570k419M60L054M123L888J263j393m505m608k529N41L166
2431b751M591L543J424k168m111m377k149M4L430M366L575J067j722m003m457
2446c698k639J81L679M401L435R29k025l785m291k467M71L328M325L290J162j829
2462D467l915m763j871L46L397M425K709J401j882l881m126k638J056K929M318
2477A972L153R62j581m498m057j891M74L163M334L013O58k021l878l643k085M52
2493e473K991M406L412L99k022l617l909k291R43L426L939K568P02j599l559m090
2509c774k098N22L694M176K516P99k073l717l910j828J034K946L853L134M43j941
$$ plain form
2525 3776 226 -3622 -5731 -4788 -2136 2094 5187 5539 3766 -115 -3459 -5699 -4535 -2000 1874
2540 1874 5237 5398 3223 -209 -3805 -5639 -4830 -1737 2429 5148 5569 3382 -315 -3921 -5580 -4669
2556 -4669 -1753 1970 4952 5294 3413 -481 -3985 -5291 -4625 -1650 2264 4847 5115 2981 -780 -3604
2572 -3604 -5312 -4525 -1436 2362 4922 5334 3072 -535 -3583 -5113 -4368 -1491 2162 4827 4772 2688
2588 2688 -469 -3621 -5300 -4123 -1803 1896 4948 4933 2913 -664 -3545 -5073 -3978 -1019 2347
2603 2347 4549 4593 2540 -396 -3713 -5021 -3962 -950 2235 4896 5131 2762 -975 -3732 -4933 -3617
2619 -3617 -900 2549 4667 4687 2578 -632 -3578 -4827 -3699 -1167 2197 4600 4722 2568 -837 -3677
2635 -3677 -4408 -3537 -1188 2150 4296 4471 2515 -703 -3673 -4898 -3738 -944 2383 4394 4456 2351
$$ packed form
2525C776l550l848k109R43K652M230L093L52j773l881l344k240J164K535L874
2540A874L363J61k175l432l596j834Q09L093M166K719M21k187l697l606j659R11
2556d669K916L723K982L42j881l894l504j306O66K975L914K583K68k134l761k824
2572c604j708P87L089L798K560M12k262l607l048j530P45K877L653K665n5k084
2588B688l157l152j679J177K320L699L052j5k020l577k881j528J095K959L366
2603B347K202M4k053k936l317j308J059L012L185K661K35k369l737k757j201J316
2619c617K717L449K118K0k109l210k946j249J128K532L364K403J22k154l405k840
2635c677p31Q71K349L338K146J75j956l218k970j225J160K794L327K011O2k105
$$ plain form
2651 2351 -1030 -3509 -4570 -3719 -951 2380 4423 4402 2228 -708 -3610 -4916 -3645 -728 2249 4319
2667 4319 4434 1902 -803 -3655 -4489 -3396 -635 2344 4001 4159 2434 -1089 -3947 -4653 -3540 -123
2683 -123 2283 4150 4127 2101 -1030 -3366 -4521 -3396 -680 1987 4251 4299 2036 -1054 -3765 -4493
2699 -4493 -2990 -307 2575 4315 4208 2117 -836 -3197 -4432 -3046 -745 2624 4082 3892 1882
2714 1882 -1055 -3664 -3941 -2958 -257 2822 3815 4156 1825 -1220 -3362 -4295 -2991 -619 2375 4125
2730 4125 3498 1645 -1065 -3667 -4749 -3300 -110 2512 3913 3651 1887 -1006 -3537 -4068 -2608 -258
2746 -258 2124 4004 3865 1357 -1557 -3344 -4049 -2765 -50 2486 3886 3272 1518 -1057 -3236 -4390
2762 -4390 -3004 -141 2923 3591 3403 1870 -1215 -3573 -4231 -2643 3 2309 3803 3556 1577 -1389
$$ packed form
2651B351l381k479j061Q51K768L331K043k1k174k936k902j306J271K917K977K070
2667D319J15k532k705k852q34J093K761K979J657J58j725l523k858p06J113L417
2683a23K406J867k3k026l131k336j155J125K716K667K264M8k263l090k711p28
2699d493J503K683K882J740j07k091k953k361j235J386K301L369J458j90k010
2714A882k937k609k77R83K701L079R93L41k331l045k142r33J304K372K994J750
2730D125o27j853k710k602j082J449L190K622J401k62j764k893k531n31J460K350
2746b58K382J880j39k508k914j787p05J284K715K536J400o14j754k575k179j154
2762d390J386K863L064O68j88j533l085k358o58J588K646K306J494k47j979k966
$$ plain form
2778 -1389 -3465 -3981 -2611 -394 2394 3740 3163 1335 -1365 -3034 -4097 -2449 212 2279 3792
2793 3792 3440 1473 -1445 -3452 -3725 -2620 -58 2591 3983 3307 1284 -1250 -3124 -3214 -2505 69
2809 69 2622 3647 3209 1072 -891 -3163 -4181 -2268 268 2427 3667 3115 1307 -1469 -3449 -3656
2825 -3656 -2272 83 2279 3312 3207 1042 -1741 -3172 -3582 -2196 152 2569 3543 2871 975 -1515
2841 -1515 -3155 -3582 -2062 -37 2311 3683 2948 1106 -1536 -3304 -3218 -2118 88 2185 3662 2790
2857 2790 1019 -1300 -2926 -3709 -2229 102 2723 3548 2548 975 -1396 -3248 -3565 -2150 501 2502
2873 2502 2924 2755 1350 -1123 -3585 -3179 -2031 146 2045 3603 2786 745 -1824 -3176 -2790 -1959
2889 -1959 381 2319 3616 2553 899 -1592 -2889 -3358 -2086 192 2525 3272 2563 656 -1681 -2906
$$ packed form
2778a389k076n16J370K217K788J346n77j828k700j669j063J648K661K067J513
2793C792l52j967k918k007k73J105K562K649J392o76k023k534j874r0P09K574
2809F9K553J025m38k137j963k272j018J913K536K159J240n52j808k776j980k07
2825c656J384K355K196J033j05k165k783j431m10J386K348K417R74o72j896k490
2841a515j640m27J520K025K348J372p35j842k642j768Q6J100K206K097J477q72
2857B790j771k319j626p83J480K331K621Q25j000j573k371j852l17J415K651K001
2873B502M22j69j405k473k462M06J148K177J899J558q17k041k569j352L86Q31
2889a959K340J938J297j063j654k491j297m69J272K278K333P47p09j907k337j225
$$ plain form
2905 -2906 -3144 -1813 379 2178 3100 2387 533 -1780 -2740 -3122 -1771 438 2396 3551 2568 516
2921 516 -1461 -3275 -2964 -1555 706 2460 3254 2731 527 -1549 -2683 -2479 -1319 416 2320 3153
2937 3153 2543 719 -1415 -2969 -2885 -1476 344 2425 3316 2419 582 -1870 -2932 -2927 -1620 487 2330
2954 2330 3168 2193 459 -1870 -3225 -2997 -1178 415 2242 3245 2312 604 -1667 -2838 -2791 -1309
2970 -1309 757 2530 2713 2245 274 -1569 -2740 -2650 -1616 812 2654 2880 2054 304 -1728 -3156
2986 -3156 -2457 -1200 601 2156 2677 2127 117 -1461 -2755 -2603 -1164 722 2210 3057 1768 140
3002 140 -1753 -2784 -2564 -942 1107 2239 2773 1876 428 -1294 -2768 -2333 -1081 899 2472 2999
3018 2999 2122 -8 -1911 -2848 -2340 -1026 843 2126 2739 1866 -86 -1800 -2597 -2594 -1156 841 2313
$$ packed form
2905b906k38J331K192J799R22p13j854k313r60l82J351K209J958J155r83k052
2921E16j977j814L11J409K261J754P94n23k204k076j134K04J160J735J904Q33
2937C153o10j824k134j554Q4J409J820K081Q91q97j837k452j062NJ307K107J843
2954B330Q38r75j734k329j355K28J819J593J827J003r33j708k271j171M7J482
2970a309K066J773J83m68j971j843j171R0J034K428J842K26q26j750k032j428
2986c156O99J257J801J555N21n50k010j578j294J52J439J886J488Q47j289j628
3002A40j893j031K20J622K049J132N34q97j448j722j474M35J252J980J573N27
3018B999q77k130j903r37N08J314J869J283O13q73j952j714p97LJ438J997J472
$$ plain form
3035 2313 2591 1638 268 -1561 -2769 -2502 -1049 901 2221 2833 1947 6 -1972 -2597 -2024 -1065 864
3052 864 2296 2581 1869 257 -1443 -2805 -2477 -965 611 2373 2977 1783 140 -1835 -2556 -2321 -1035
3069 -1035 1115 2350 2650 1783 -276 -1576 -2853 -2125 -1123 815 2539 2739 1770 -82 -1330 -2435
3085 -2435 -2161 -722 950 2076 2407 1462 59 -1656 -2729 -1889 -532 943 2196 2582 1686 -309
3101 -309 -1661 -2434 -2113 -902 887 1828 2365 1257 -233 -1567 -2412 -2045 -831 1050 1890 2291 1232
3118 1232 120 -1609 -2232 -2109 -649 1078 1935 2419 1455 -214 -1631 -2274 -2107 -464 945 2056 2460
3135 2460 1239 -332 -1627 -2367 -2000 -808 936 2184 2314 1292 -278 -1315 -2208 -1918 -541 1043
3151 1043 2117 1973 1205 -171 -1663 -2326 -2054 -557 779 2201 2152 1479 -284 -1604 -2011 -1790 -428
$$ packed form
3035B313K78r53j370j829j208K67J453J950J320O12q86j941j978o25N73R59J929
3052H64J432K85p12j612j700j362L28J512J576J762O04j194j643j975p21K35J286
3069a035K150J235L00q67k059j300j277P28J002J938J724K00r69j852j248j105
3085b435K74J439J672J126L31r45j403j715j073Q40J357J475J253L86q96j995
3101c09j352p73L21J211J789R41N37j108j490j334q45L67J214J881Q40M01j059
3118A232j112j729o23J23J460J727Q57M84r64j669j417o43J67J643J409J111M04
3135B460j221j571j295p40L67J192J744J248J30j022j570j037q93K90J377J584
3151A043J074j44p68j376j492o63K72J497J336J422m9o73j763j320m07K21J362
$$ plain form
3168 -428 1056 2360 2002 1169 -377 -1604 -2237 -1825 -396 1113 1849 2303 950 -279 -1564 -2234 -1432
3185 -1432 -284 860 2077 2167 1152 -280 -1669 -2331 -1448 -459 814 2059 1999 992 -159 -1606 -2101
3202 -2101 -1131 -319 966 1997 1767 961 -402 -1386 -1924 -1372 -441 1094 1939 1959 1028 -157 -1649 -1852
3220 -1852 -1644 -181 909 2063 2228 1077 -205 -1873 -1845 -1334 -245 1136 1661 1769 980 -289 -1635
3237 -1635 -2057 -1833 -438 942 1722 2086 901 -398 -1522 -2198 -1444 -112 1086 2080 1872 928 -483
3254 -483 -1474 -1589 -1374 30 961 1974 1756 915 -506 -1456 -2127 -1481 -364 1179 2175 1884 953 -397
3272 -397 -1361 -2072 -1407 -301 1114 1602 1787 629 -466 -1652 -1967 -1024 188 913 1615 1697 778 -598
3290 -598 -1861 -1868 -1207 -156 1075 1794 1617 687 -541 -1626 -2104 -1276 41 1067 1769 1325 595 -371
$$ packed form
3168d28J484J304l58q33j546j227o33M12J429J509P36M54j353j229j285o70Q02
3185a432J148J144J217R0j015j432j389o62Q83R89J273J245o0j007j151j447m95
3202b101R70Q12J285J031k30q06j363r84n38N52R31J535Q45K0r31j185j492k03
3220a852K08J463J090J154J65j151j282j668K8N11J089J381N25J08p89j269j346
3237a635m22K24J395J380P80L64j185j299j124o76P54J332J198R94k08r44j411
3254d83r91j15K15J404R31J013k18q41j421r50o71O46J117J543R96k91r31j350
3272c97r64p11O65J106J415M88J85j158j095j186l15R43J212P25P02Q2r19j376
3290e98j263pO61J051J231P19j77r30j228j085m78Q28J317J026P02m44p30r66
$$ plain form
3308 -371 -1474 -1860 -1191 114 1163 1958 1614 832 -464 -1678 -1774 -1321 35 1464 1556 1500 1064 -388
3326 -388 -1650 -1785 -1321 64 975 1912 1424 383 -603 -1672 -1791 -1400 -214 1491 1792 1547 614 -495
3344 -495 -1536 -1720 -1086 -271 1469 1622 1661 431 -775 -1666 -1511 -941 -10 1137 1931 1434 242 -806
3362 -806 -1512 -1700 -1050 26 1214 1971 1281 451 -700 -1247 -1492 -860 53 1016 1587 1292 219 -821
3380 -821 -1801 -1609 -1084 -89 1164 1818 1452 369 -592 -1103 -1591 -697 293 1040 1387 1368 629 -784 -1807
3399 -1807 -1595 -903 230 1141 1630 1393 189 -779 -1305 -1491 -685 149 1006 1281 1258 88 -566 -1161 -1538
3418 -1538 -828 155 1113 1450 1364 384 -535 -1536 -1320 -1022 212 1057 1451 1456 257 -748 -1253 -1187 -1022 191
3438 191 1115 1582 1143 204 -762 -1142 -1516 -894 160 1285 1768 1339 292 -885 -1323 -1587 -787 21 774
$$ packed form
3308c71j103l86O69J305J049P95l44p82j296j214r6M53J356J429R2n6m36j452
3326c88j262j35M64J385R11R37m88j041r86j069j19L91J186J705L01k45r33j109
3344d95j041j84O34Q15J740J53L9j230j206q91J55N70R31J147P94m97j192j048
3362h06p06j88O50J076J188P57o90q30j151n47k45O32R13R63N71k95j073j040
3380h21r80J92N25R95J253O54l66j083r61n11m88Q94R90P47L47j9p39j413j023
3399a807K12O92J133R11M89k37j204r68n26j86Q06Q34Q57K75k3j170o54n95l77
3418a538P10R83R58L37q6r80r19j001K16K98J234Q45L94Nj199j005n05O6J65J213
3438A91R24M67m39r39r66l80l74O22J054J125M83m29j047j177m38k64Q00Q08P53
$$ plain form
3457 774 1520 1407 251 -518 -1215 -1219 -593 156 995 1535 1067 136 -647 -1462 -1447 -484 468 1194 1189 1010 395
3478 395 -835 -1422 -1126 -516 317 1086 1590 967 263 -735 -1433 -1294 -616 304 1120 1227 928 129 -853 -1309
3498 -1309 -1117 -839 152 1314 1577 923 358 -750 -1275 -1031 -652 337 1253 1356 757 203 -647 -1086 -1234
3517 -1234 -544 178 1174 1256 1011 11 -840 -1055 -1468 -436 223 1169 1342 945 204 -797 -1285 -1142 -623
3536 -623 176 921 984 992 87 -845 -995 -1053 -795 483 1236 1555 1084 53 -893 -965 -1184 -297 319 1046 956
3557 956 844 -117 -611 -876 -969 -376 313 1181 1142 968 404 -965 -1108 -1021 -452 538 924 1603 807 75 -860
3578 -860 -1071 -1413 -389 425 1100 1199 704 -125 -582 -1045 -1042 -638 46 971 1291 865 50 -770 -1035 -711 -639
3599 -639 640 651 1353 804 -36 -714 -914 -1156 -570 705 1019 1385 885 -63 -943 -1364 -1243 -303 510 1139
$$ packed form
3457G74P46j13j156p69o97mO26P49Q39N40m68r31p83q15J5R63R52P26nj79o15
3478C95j230n87K96O10Q33P69N04o23p04r98o98J39O78R20Q16J07k99p99r82m56
3498a309J92K78R91J162K63o54n65j108n25K44L79R89R16J03n99n54q50m39j48
3517a234O90P22R96Q2k45j000q51k15m13J032O59R46J73l97p41j001m88J43N19
3536f23P99P45O3Qr05r32j50n8K58J278P53L19m71j031r46p2k19Q87O16P27r0
3557I56j12r61m94k65r3N93O89Q68l9j74n64j369j43Q7N69R90L86O79p96p32r35
3578h60k11l42J024Q14O75R9m95q29m57m63LM04O84R25L20m26q15q20k65L24P2
3599f39J279J1P02n49q40o78k00k42N86J275L14L66n00r48q80m21J21R40Q13O29
$$ plain form
3619 1139 1308 689 -160 -714 -960 -994 -377 216 807 1206 684 -124 -922 -1307 -878 -323 383 724 1177 922
3639 922 -98 -959 -1190 -1139 -231 757 922 1104 570 -67 -616 -814 -782 -162 371 829 1031 845 -110 -793
3659 -793 -1082 -952 -466 322 1010 1177 808 -218 -717 -915 -1061 -333 709 1080 970 366 -337 -665 -1138
3678 -1138 -501 -49 351 776 1189 378 -244 -910 -821 -714 -442 412 909 933 581 -35 -509 -1074 -814 -471
3698 -471 342 836 885 629 -37 -680 -1117 -594 -156 317 736 1114 520 49 -753 -1000 -916 -549 253 910 1074
3719 1074 269 -128 -640 -982 -678 -113 395 918 915 673 -445 -720 -996 -623 -145 683 905 785 62 -287
3739 -287 -692 -1136 -945 -183 507 921 1140 544 -396 -546 -1324 -691 -267 624 1007 738 790 -225 -822 -900
3759 -900 -730 -154 320 1122 937 549 -281 -573 -1034 -805 -108 723 1189 654 652 -277 -707 -1180 -933 -294 618
$$ packed form
3619A139J69o19q49n54k46l4O17N93N91L99n22q08p98l85M29N55P06L41M53k55
3639I22j020q61k31N1R08R88J65J82n34o37n49j98L2O20N33M58K02j86r55o83
3659g93k89J30M86P88O88J67l69j026m99j98j46P28J042L71j10o04p03l28m73
3678a138O37M52M00M25M13q11o22o66Q9J07K72Q54M97K4l52o16m74n65K60L43
3698d71Q13M94M9k56o66o43m37N23M38M73M19L78n94m71q02k47Q4L67Q02O57J64
3719A074q05l97n12l42L04N65N08N23lk42j118k75k76L73M78Q28K22j20p23l49
3739b87m05m44J91P62O90M14K19n96r40j50p78O33M24Q91L83k69N2j015n97p8
3759i00J70N76M74Q02j85l88q30k92m61K29O97Q31M66n35kr29m30m73K47O39R12
$$ plain form
3780 618 918 971 654 -172 -713 -923 -536 -317 603 855 571 483 -258 -726 -610 -775 -9 629 1055 594 437
3801 437 -77 -635 -798 -567 -83 494 669 823 412 -33 -726 -834 -540 54 572 813 701 262 -118 -829
3821 -829 -866 -375 -129 297 1124 651 413 -538 -661 -1077 -665 198 733 599 729 294 -366 -572 -643 -643 -200
3842 -200 403 806 791 376 -320 -878 -1066 -367 -64 349 916 910 193 -371 -623 -918 -416 -42 494 870 790
3863 790 344 -201 -579 -893 -457 58 845 572 715 673 -606 -832 -905 -679 130 450 882 799 341 -190 -591
3884 -591 -854 -610 226 605 749 545 149 -198 -701 -810 -601 -135 288 874 669 123 -466 -716 -835 -377
3904 -377 88 452 643 630 54 -219 -375 -727 -713 49 310 744 724 -110 -92 -706 -559 -426 224 634 825
3925 825 560 284 -185 -593 -724 -884 -202 500 887 670 325 -395 -1222 -738 -317 56 470 760 748 140
$$ packed form
3780F18L00N3l17q26n41k10L87K19R20K52k84q8p41m68J16j65P66O38M26m61j57
3801D37n14n58j63K31M84N77J75J54m11m45o93j08K94N94N18K41j12m39l80p11
3821h29l7M91K46M26Q27m73k38r51j23m16M12Q63N35j34J30m35o60k06p1%M43
3842b00O03M03j5m15o96n58j88O99L03M13N67op17n64k52k95N02L74N36L76q0
3863G90m46n45l78l14M36N15P87k73J43m2j279k26p3K26Q09L20M32q3m58n31m01
3884e91k63K44Q36L79J44k04l96l47n03j09K09M66M23N86k05n46n89k50j19M58
3904c77M65L64J91j3n76k73j56l52J4P62K61M34k0q34J8o14J47J33O50M10J91
3925H25k65k76m69m08j31j60O82P02L87k17l45p20q27M84M21L73M14K90j2o08
$$ plain form
3945 140 -223 -693 -698 -346 -95 369 709 947 320 -394 -791 -731 -573 47 441 669 607 501 -512 -699 -743
3966 -743 -518 -18 639 547 366 129 -149 -673 -608 -330 207 384 920 791 -124 -432 -645 -478 -566 543 617
3987 617 686 305 -6 42 -611 -520 -498 -44 753 714 755 159 -395 -592 -780 -305 -74 443 858 294 -3 -144
4009 -144 -468 -315 -339 282 478 656 397 -61 -383 -879 -501 -288 441 335 546 477 280 -96 -343 -640 -438
4030 -438 86 584 479 628 84 -447 -658 -629 -339 250 435 536 517 145 -547 -459 -1057 -306 144 225 621
4051 621 734 -66 -385 -441 -831 -139 -44 597 685 771 90 -510 -277 -528 -188 -107 507 900 468 114 -380 -617
4073 -617 -627 -480 409 556 855 263 274 -206 -830 -449 -386 323 495 694 618 96 -60 -490 -576 -81 90 448
4095 448 769 182 77 -191 -601 -274 -121 202 435 719 122 -117 -392 -703 -525 -225 63 456 566 536
$$ packed form
3945A40l63m70nL52K51M64L40K38o27p14l97O0J58O20L94K28o2j06j013j87m4
3966g43K25N00O57r2j81k37k78n24O5K78N37J77N36j29r15l08k13J67q8J109P4
3987F17O9l81l11M8o53R1K2M54P97l9M1n96n54j97j88M75K31N17M15n64k97j41
4009a44l24J53k4O21J96J78k59m58l22m96L78K13P29j06K11o9j97l76k47k97K02
4030d38N24M98j05J49n44n31k11K9K90N89J85J01j9l72o92Q8n98P51M50Q1L96
4051F21J13q00l19n6l90O92R5O41Q8Q6o81o00K33k51L40Q1O14L93m32l54m94k37
4073f17j0J47Q89J47K99n92J1m80o24L81O3P09J72J99p6n22j56m30q6M95J71L58
4095D48L21n87j05k68m10L27J53L23K33K84n97k39k75l11J78L00K88L93J10l0
$$ plain form
4115 536 80 -314 -577 -534 -367 -168 552 712 112 38 -463 -287 -695 -342 66 559 746 325 59 -506 -669
4136 -669 -771 -324 247 454 729 494 -1 -682 -473 -503 -283 127 789 705 286 36 -406 -477 -719 -256 163
4157 163 544 408 392 24 -277 -435 -680 -191 192 538 495 441 -62 -394 -777 -580 -40 335 615 413 387
4178 387 -325 -490 -737 -188 -160 291 578 741 167 151 -290 -773 -540 -164 -5 637 796 573 -68 -349 -111
4199 -111 -612 -126 76 836 697 69 -202 -588 -666 -406 -80 125 850 377 77 -91 -618 -533 -799 -127 406
4220 406 792 287 258 71 -455 -595 -303 -176 559 879 706 453 -327 -730 -451 -723 -192 322 599 493
4240 493 -23 46 -268 -745 -677 10 319 354 317 189 75 -542 -739 -275 -218 210 336 562 239 -118 -473 -516
4262 -516 -589 -65 432 524 199 177 -306 -297 -453 -358 151 651 270 213 106 -93 -301 -712 -419 -264 428 567
$$ packed form
4115E36m56l94k63M3J67J99P20J60o00p4n01J76m08L53M08M93J87m21k66n65j63
4136f69j02M47N71K07K75k35m95o81K09l0K20M10O62q4m19k50m42p1k42M63M19
4157A63L81j36j6l68l01j58k45M89L83L46m3n4n03l32l83J97N40L75K80k02k6
4178C87p12j65k47N49K8M51K87J63n74j6m41m83K33L76J59O42J59k23o41k81K38
4199a11n01M86K02P60j39o28k71l86p8K60L26K05P25m73l00j68n27Q5k66O72N33
4220D06L86n05k9j87n26j40K92J27P35L20j73k53p80m03K79k72N31N14K77j06
4240D93n16O9l14m77O8O87L09L5l7j28j14o17j97M64N7M28J26K26l23l57l55m3
4262e16p3N24M97R2l25k2m83Rj56R5N09N00l81n7j07j99k08m11K93J55O92J39
$$ plain form
4284 567 586 302 -321 -280 -310 -411 -257 193 505 243 339 -253 -344 -710 -659 -133 362 568 404 213 -79 -300
4306 -300 -482 -455 25 413 422 419 298 -417 -157 -438 -478 45 333 476 296 159 -145 -640 -532 -368 86 508
$$ packed form
4284E67J9k84o23M1l0j01J54M50L12k62R6n92r1l66N1N26M95K06j64j91k92k21
4306c00j82K7M80L88Rlj21p15K60k81m0N23K88J43j80j37l04m95J08J64M54M22
$$ [...]
8191G9
##END NTUPLES=NMR FID
##END=
