##TITLE=1H_Pr T-800-1
 D2O, 8 sc, 
 18.12.2019
##JCAMPDX= 6.0         $$ Bruker NMR JCAMP-DX V2.0
##DATA TYPE= NMR FID
##DATA CLASS= NTUPLES
##ORIGIN= UXNMR, Bruker Analytische Messtechnik GmbH
##OWNER= root
$$ XWIN-NMR		Version 3.5
$$ Wed Dec 18 14:26:19 2019 Russian Standard Time (UT+4h)  she@DPX200
##.OBSERVE FREQUENCY= 200.1315
##.OBSERVE NUCLEUS= ^1H
##.DELAY= (6, 6)
##.ACQUISITION MODE= SIMULTANEOUS
##.ACQUISITION SCHEME= undefined
##.AVERAGES= 8
##.DIGITISER RES= 18
##SPECTROMETER/DATA SYSTEM= spect
##.PULSE SEQUENCE= zg30
##.SOLVENT NAME= D2O
##.SHIFT REFERENCE= (INTERNAL, D2O, 0, 15.7039)
##AUDIT TRAIL= $$ (NUMBER, WHEN, WHO, WHERE, WHAT)
$$ ##TITLE= Audit trail, XWIN-NMR		Version 3.5
$$ ##JCAMPDX= 5.01
$$ ##ORIGIN= Bruker BioSpin GmbH
$$ ##OWNER= she
$$ F:/spectra/data/she/nmr/H-F/1/audita.txt
$$ ##AUDIT TRAIL=  $$ (NUMBER, WHEN, WHO, WHERE, WHAT)
(   1,<2019-12-18 14:25:21.59 +0400>,<she>,<DPX200>,
      <created by zg, POWCHK disabled, PULCHK disabled
       configuration hash MD5:
       00 E9 B6 7A A2 85 ED C7 34 08 36 98 17 FE 4E 26
       data hash MD5: 16K
       14 15 9F 7F 6E A8 54 E4 DA 32 2C 81 D6 E8 01 C5>)
$$ ##END=
$$ 
$$ hash MD5
$$ 70 D8 C3 92 82 DC 89 51 2B C6 43 0B 5A 03 8F C3
##$RELAX= 
##$RELAX= 
##$RELAX= 
##$RELAX= 
##$RELAX= 
##$RELAX= 
$$ Bruker specific parameters
$$ --------------------------
##$DU= <F:/spectra>
##$EXPNO= 1
##$NAME= <H-F>
##$PROCNO= 1
##$TYPE= <nmr>
##$USER= <she>
##$AMP= (0..31)
100 100 100 100 100 100 100 100 100 100 100 100 100 100 100 100 100 100 
100 100 100 100 100 100 100 100 100 100 100 100 100 100 
##$AQSEQ= 0
##$AQ_mod= 1
##$AUNM= <au_zg>
##$AUTOPOS= <>
##$BF1= 200.13
##$BF2= 200.13
##$BF3= 200.13
##$BF4= 200.13
##$BF5= 200.13
##$BF6= 200.13
##$BF7= 200.13
##$BF8= 200.13
##$BYTORDA= 1
##$CFDGTYP= 0
##$CFRGTYP= 5
##$CHEMSTR= <none>
##$CNST= (0..31)
1 1 145 1 1 1 1 1 1 1 1 1 1 1 1 1 1 1 1 1 1 1 1 1 1 1 1 1 1 1 1 1 
##$CPDPRG= <>
##$CPDPRG1= <>
##$CPDPRG2= <>
##$CPDPRG3= <>
##$CPDPRG4= <mlev>
##$CPDPRG5= <mlev>
##$CPDPRG6= <mlev>
##$CPDPRG7= <mlev>
##$CPDPRG8= <mlev>
##$CPDPRGB= <>
##$CPDPRGT= <>
##$D= (0..31)
0 1.2 0 0 0 0 0 0 0 0.06 0 0.03 0 0 0 0 0.0002 0 0 0 0 0 0 0 0 0 0 0 0 
0 0 0 
##$DATE= 1576664721
##$DBL= (0..7)
120 120 120 120 120 120 120 120 
##$DBP= (0..7)
150 150 150 150 150 150 150 150 
##$DBP07= 0
##$DBPNAM0= <>
##$DBPNAM1= <>
##$DBPNAM2= <>
##$DBPNAM3= <>
##$DBPNAM4= <>
##$DBPNAM5= <>
##$DBPNAM6= <>
##$DBPNAM7= <>
##$DBPOAL= (0..7)
0.5 0.5 0.5 0.5 0.5 0.5 0.5 0.5 
##$DBPOFFS= (0..7)
0 0 0 0 0 0 0 0 
##$DE= 6
##$DECBNUC= <off>
##$DECIM= 24
##$DECNUC= <off>
##$DECSTAT= 4
##$DIGMOD= 1
##$DIGTYP= 9
##$DL= (0..7)
0 120 120 120 120 120 120 120 
##$DP= (0..7)
150 150 150 150 150 150 150 150 
##$DP07= 0
##$DPNAME0= <>
##$DPNAME1= <>
##$DPNAME2= <>
##$DPNAME3= <>
##$DPNAME4= <>
##$DPNAME5= <>
##$DPNAME6= <>
##$DPNAME7= <>
##$DPOAL= (0..7)
0.5 0.5 0.5 0.5 0.5 0.5 0.5 0.5 
##$DPOFFS= (0..7)
0 0 0 0 0 0 0 0 
##$DQDMODE= 0
##$DR= 18
##$DS= 0
##$DSLIST= <SSSSSSSSSSSSSSS>
$$ [...]
##$SUBNAM2= <"">
##$SUBNAM3= <"">
##$SUBNAM4= <"">
##$SUBNAM5= <"">
##$SUBNAM6= <"">
##$SUBNAM7= <"">
##$SUBNAM8= <"">
##$SUBNAM9= <"">
##$SW= 24.9337058887773
##$SWIBOX= (0..15)
0 0 2 0 0 0 0 0 0 0 0 0 0 0 0 0 
##$SW_h= 4990.01996007984
##$TD= 16384
##$TD0= 1
##$TE= 0
##$TE2= 300
##$TE3= 300
##$TEG= 300
##$TL= (0..7)
0 120 120 120 120 120 120 120 
##$TP= (0..7)
150 150 150 150 150 150 150 150 
##$TP07= 0
##$TPNAME0= <>
##$TPNAME1= <>
##$TPNAME2= <>
##$TPNAME3= <>
##$TPNAME4= <>
##$TPNAME5= <>
##$TPNAME6= <>
##$TPNAME7= <>
##$TPOAL= (0..7)
0.5 0.5 0.5 0.5 0.5 0.5 0.5 0.5 
##$TPOFFS= (0..7)
0 0 0 0 0 0 0 0 
##$TUNHIN= 0
##$TUNHOUT= 0
##$TUNXOUT= 0
##$USERA1= <user>
##$USERA2= <user>
##$USERA3= <user>
##$USERA4= <user>
##$USERA5= <user>
##$V9= 5
##$VALIST= <valist>
##$VCLIST= <CCCCCCCCCCCCCCC>
##$VD= 0
##$VDLIST= <DDDDDDDDDDDDDDD>
##$VPLIST= <PPPPPPPPPPPPPPP>
##$VTLIST= <TTTTTTTTTTTTTTT>
##$WBST= 1024
##$WBSW= 4
##$XGAIN= (0..3)
0 0 0 0 
##$XL= 0
##$YL= 0
##$YMAX_a= 315356
##$YMIN_a= -226146
##$ZGOPTNS= <>
##$ZL1= 120
##$ZL2= 120
##$ZL3= 120
##$ZL4= 120
##$ABSF1= 10
##$ABSF2= 0
##$ABSG= 5
##$ABSL= 3
##$ALPHA= 0
##$AQORDER= 0
##$ASSFAC= 0
##$ASSFACI= 0
##$ASSFACX= 0
##$ASSWID= 0
##$AUNMP= <proc_1d>
##$AZFE= 0.1
##$AZFW= 0.1
##$BCFW= 1
##$BC_mod= 2
##$BYTORDP= 1
##$COROFFS= 0
##$CY= 11.3945322036743
##$DATMOD= 1
##$DC= 2
##$DFILT= <>
##$DTYPP= 0
##$F1P= 16.9975609425685
##$F2P= -3.02152046262296
##$FCOR= 0.5
##$FTSIZE= 0
##$FT_mod= 4
##$GAMMA= 1
##$GB= 0.15
##$INTBC= 1
##$INTSCL= 1
##$ISEN= 128
##$LB= 0.24
##$LEV0= 0
##$LPBIN= 0
##$MAXI= 10000
##$MC2= 0
##$MEAN= 0
##$ME_mod= 0
##$MI= 1.114404
##$NCOEF= 0
##$NC_proc= 0
##$NLEV= 6
##$NOISF1= 3.799351
##$NOISF2= 2.8
##$NSP= 1
##$NTH_PI= 0
##$NZP= 0
##$OFFSET= 15.70392
##$PC= 1
##$PHC0= -9789.698
##$PHC1= 15.00081
##$PH_mod= 1
##$PKNL= yes
##$PPARMOD= 0
##$PSCAL= 0
##$PSIGN= 0
##$REVERSE= no
##$SF= 200.130013532006
##$SI= 16384
##$SIGF1= 3
##$SIGF2= 2
##$SINO= 400
##$SIOLD= 16384
##$SREGLST= <1H.CDCl3>
##$SSB= 0
##$STSI= 0
##$STSR= 0
##$SW_p= 3612.71676300578
##$SYMM= 0
##$S_DEV= 0
##$TDeff= 0
##$TDoff= 0
##$TI= <>
##$TILT= no
##$TM1= 0
##$TM2= 0
##$TOPLEV= 0
##$USERP1= <user>
##$USERP2= <user>
##$USERP3= <user>
##$USERP4= <user>
##$USERP5= <user>
##$WDW= 1
##$XDIM= 8192
##$YMAX_p= 0
##$YMIN_p= 0
$$ End of Bruker specific parameters
$$ ---------------------------------
##NTUPLES= NMR FID
##VAR_NAME=  TIME,          FID/REAL,        FID/IMAG
##SYMBOL=    X,             R,               I
##VAR_TYPE=  INDEPENDENT,   DEPENDENT,       DEPENDENT
##VAR_FORM=  AFFN,          ASDF,            ASDF
##VAR_DIM=   8192,          8192,            8192
##UNITS=     SECONDS,       ARBITRARY UNITS, ARBITRARY UNITS
##FACTOR=    0.0002004,     1,               1
##FIRST=     0,             0,               0
##LAST=      1.6414764,     0,               0
##MIN=       0,             -226146,         0
##MAX=       1.6414764,     315356,          0
$$ Real data points
##PAGE= N=1
##DATA TABLE= (X++(R..R)), XYDATA
0@%%%%%%%Pj3J4j6J6k4L2l3M1m9N8p3Q7j03J17j35J56j79K09k37K69l07L47l92
31b08M41m97N59o24O95p73Q60r55J057j173J302j439J591j763J955k169K411k689
49a419L006l376L817m347N005n840O942q482J0795j4710K3049p3481J25526J68162
63B34647p7579n6070m0324j03470j67911j5439J44565J49683N4809M3369J4590
74A80870r7483j85885j02105L2082R1519J01352J27456P8984o3462j59358j08478
85a04508l0009j3173K0183J29573J72453N1514j03359j24348o8789n9480n4695
96a84638M6395J64766J48743J7892p5645q9877r7576j02008k9153R8241J56011
107E3151J01868J5910m2060r2666j28025r0809J2201R5060J10920R4091N6032
$$ plain form
0 0 0 0 0 0 0 0 0 7 -6 8 -8 8 -16 16 -17 24 -25 33 -40 47 -56 61 -74 82 -97 112 -125 144 -163 184 -208
31 -208 233 -264 295 -329 366 -407 453 -502 555 -618 684 -755 836 -927 1028 -1141 1270 -1419
49 -1419 1587 -1789 2028 -2319 2686 -3154 3788 -4694 6101 -8609 14440 -59041 66485 234647
63 234647 157068 100998 60674 -42796 -210707 -226146 -81581 68102 122911 166280 180870
74 180870 83387 -102498 -204603 -172521 -81002 20350 147806 226790 163328 3970 -104508
85 -104508 -134517 -147690 -127507 2066 174519 226033 122674 -1674 -70463 -129943 -184638
96 -184638 -138243 26523 175266 193158 117513 27636 -69940 -171948 -201101 -102860 53151
107 53151 155019 170929 128869 36203 -91822 -182631 -170430 -75370 35550 129641 185673
118A85673k9201j28317j45087o2867L2767P9274J00356J07799N4771n7492j35035
129B641j13058m0891J4515N8713J08522J14305L9718o3104j11684r9584o3682
140a53589l852P8823J29642R7262J3422n1884q7290j07076q2587O157R9863J18925
152E7816P3146K0163l0722r3316j23335p2433K4469Q7630R9488Q4239L8328m2236
164A23237j10795j12666n6943J1954P8746J18864R4410J0237o4820q7600q4766
175h0142o6851o239Q3884J25105Q0731P331m2929q4439j09452p4165J8879R6241
187e2046J05274P0660J9989m5378r9566r7464m5630J3178O1608J01677J00643
198A32945K6365o7825j02948p7740m5259m652O6061J22115R3624L259o4120q1462
$$ plain form
118 185673 156472 28155 -116932 -179799 -147032 -67758 32598 140397 195168 137676 2641
129 2641 -110417 -151308 -136793 -78080 30442 144747 184465 121361 9677 -89907 -153589
140 -153589 -157441 -78618 51024 148286 161708 109824 22534 -84542 -167129 -160972 -61109 57816
152 57816 130962 151125 120403 27087 -96248 -168681 -144212 -56582 42906 127145 165473 123237
164 123237 12442 -100224 -157167 -145213 -66467 52397 146807 157044 92224 4624 -80142
175 -80142 -146993 -153232 -69348 55757 136488 143819 100890 16451 -93001 -167166 -148287 -52046
187 -52046 53228 123888 143877 98499 -1067 -98531 -144161 -130983 -69375 32302 132945
198 132945 159310 91485 -11463 -89203 -134462 -139114 -73053 49062 142686 145945 81825 363
210C63q0427o1349J962Q2632J12946P4194R689m6452q8117r5512n1956J8874P2791
223e0362R2556Q0286K8703n0880j05626r5457l7497K1394O5282R2880Q2596K0699
235A44574n6880r6513q3601m0432J2084O3710R5246Q2422K3442n2463r9432r2024
247i9867m0092K2958P0527Q9989P3390J9195m9628r2654q5931m1881J6254O9897
259d7843R4468P3074J5366m7472q7788r0299m8036K2784P9232R0294O0645J4779
271A29204l8010q8264r6218m4976L0003P6678Q1726O1353J9289m1567r0505q9449
283i0736m1354K1741P1456R0380O7847R225m9655q2546q1830m5959J6927P8495
295c6009R4058N8019L406m2895p6458q4405m8121K0637P7276Q8670O0773R894
$$ plain form
210 363 -80064 -141413 -139451 -56819 56127 130321 140010 93558 5441 -90071 -142027 -123153 -50362
223 -50362 42194 122480 151183 100303 -5323 -100780 -138277 -116883 -51601 41279 123875 144574
235 144574 87694 -8819 -92420 -132852 -120768 -57058 38188 120610 144052 91589 -7843 -99867
247 -99867 -139959 -117001 -46474 43515 116905 136100 86472 -6182 -92113 -133994 -117740 -47843
259 -47843 46625 119699 135065 87593 -195 -90494 -138530 -115746 -36514 53780 114425 129204
271 129204 91194 2930 -93288 -138264 -108261 -31583 50143 111496 130785 89218 -1287 -90736
283 -90736 -132090 -110349 -38893 51487 119334 128559 78904 -3642 -85472 -131431 -114504 -36009
295 -36009 58049 116068 119474 76579 121 -84284 -132405 -111768 -34492 54178 114951 124845
307A24845m6769q4823q0912l8532J9493O9897R1903O5971K469n6084p6829o8286
319g7657m2114Q416P2118R9116O2634l642n1435p2208p5534m5880J9446P7876
331b8864Q7568N4314N635m4732q3251q0563l1530K6852O3785P8043O6058J3345
343A26660n6456r0267o7596k4336J4961N7555Q9422P1707J621o3388q0420o2769
355h3306l1390J5115O7401Q7571N6704R44m8011p7216p5850l4384K7317P0721
367b4384P7087N4586Q511m8841q6182p3678k3019K8976O1498P3635N8259R675
379A16123n0719q4805p1882k5808K8144O7222P5420N1638M544m7239q0172p2691
391i0225k7243L0082O7398P2815N1028N835m8290q1252p1019k5014K9332O7008
$$ plain form
307 124845 78076 -6747 -87659 -126191 -106698 -36801 55102 121073 123542 67458 -9371 -77657
319 -77657 -119771 -111355 -39237 59879 122513 118871 67436 -4772 -80306 -126186 -106740 -28864
331 -28864 58704 113018 118653 73921 -9330 -89893 -121423 -94571 -30786 47257 113315 126660
343 126660 70204 -20063 -87659 -111995 -97034 -39479 49943 121650 123271 59883 -20537 -83306
355 -83306 -114696 -99581 -32180 55391 112095 113039 65028 -12188 -88038 -122422 -95105 -24384
367 -24384 52703 107289 115800 66959 -19223 -92901 -115920 -86944 -25446 48189 106448 116123
379 116123 65404 -19401 -91283 -117091 -88947 -21725 53695 105333 109877 62638 -17534 -90225
391 -90225 -117468 -87386 -19988 52827 103855 109690 61400 -19852 -90871 -115885 -86553 -19545
403a9545P4518M8714N02m7714p4640o8999k9769K7348P2219P6525M3462l691m4173
416E4757p1306p0436l0434L0903P1600P3446M2997j801m6603p3850o6218k4637
428a11582K7774O6200P4829M7017m343n1580p0137o0949k7307K3657P0307P8390
440F2276M1897j0478m7924o5499o1794k8436K6695P0182P2575M1355l877m8182
452D8790p3252o1567j8701K9473O0885O9339M9001k874n6649p4580n1581j5238
464i6954K0663N8230P7104M9256j1963n7185o5653n0802k2421K1760O6349P4560
476F2944L9832j0445m9465o7472n8149j8416L1807O2267O3333M0320j023m9437
488D6096p5461n8083j0813L2776N6504O3029M3967l531n3529p3120n2590j0748
$$ plain form
403 -19545 54973 103687 104189 56475 -18165 -87164 -116933 -89585 -17366 59159 102621 98930 54757
416 54757 -16549 -86985 -117419 -86516 -14916 58530 101527 99726 53123 -20727 -86945 -111582
428 -111582 -83808 -17608 57221 104238 99895 48315 -21822 -82771 -110078 -86421 -16114 62276
440 62276 104173 93695 45771 -19728 -81522 -109958 -83263 -13081 59494 100849 96972 48790
452 48790 -24462 -86029 -104730 -75257 -14372 54967 103968 101094 44445 -30135 -81716 -96954
464 -96954 -76291 -18061 59043 108299 96336 39151 -26502 -77304 -99725 -77965 -11616 62944
476 62944 102776 92331 42866 -24606 -82755 -101171 -69364 -7097 56236 96556 95533 46096
488 46096 -29365 -87448 -98261 -65485 -8981 54048 98015 94484 40955 -32165 -84755 -95503
500i5503K9399N7841O3618M0774m596n0580p1794n4354j1407L3342N8564O0666
512E5970L8664l842n0021p1092n2761j0995L1489N9331O3026L6383r339m9054
524C7759o4015n2963j6671L1718O6171O1743K8475j0714m1675o3319n8672j6692
536i8855L9117O5682N3762K6975m169m2015o9614n7080q531L8165N6687N5024
548E5148L4843o483n1759o6900m5250r240K7545N7033O4660L4316j7155n1773
560B4985n6525m3664j6942K6926O4999O4977K5224j8108m3709n5304m9675j6969
572i3785L3599O4786N7654K5226j2783m3830o1118m9132r529L4256N8056N5479
584E8879K9768j1150m9411o2667m3447o259L0282N3973N6885L2704j2173n2533
$$ plain form
500 -95503 -66104 -8263 55355 96129 91533 40953 -30841 -85195 -96602 -63260 -4696 55970
512 55970 94634 90792 40771 -30321 -83082 -94077 -62588 -3257 59769 96152 86813 37759
524 37759 -26256 -79219 -95890 -64172 1999 63742 92217 81503 39828 -23491 -82163 -98855
536 -98855 -59738 5944 59706 86681 82512 40497 -29117 -86197 -94728 -56563 124 55148
548 55148 89991 83508 31749 -35151 -80401 -89641 -62096 -5063 59597 93913 76758 24985
560 24985 -31540 -75204 -92146 -65220 -221 64756 89980 71872 28163 -27141 -76816 -93785
572 -93785 -60186 4600 62254 87480 74697 30867 -30251 -79383 -88912 -54656 3400 58879
584 58879 88647 77497 28086 -34581 -78028 -84287 -54005 -32 56853 89557 77384 24851
596B4851o2171l9631n378K7909N3501N8492L2099j5530n3197n7402l8309q070
608h2836K6766N6409N9428K8158j7567m8727n5928m1993r372L3430N8581N2212
620E8561K2997j1313m3608o0967m6733k852L8305N2625M6393K7793o671m8487
632B6043o5861m0450K263L3164M8028N0810L1263j3041n2408n8065l6069m910
644g9233K9737N5473N4867K2256j8361m4420n2240m2128r194L5558N9627M8080
656F0022J7820j2022m0420n8055m6362k301M0253N4431M3397K1606j0601m4789
668B2979n8704l8887r08L2820N1078N0231K4735j7237m8621n2921l5702n386L0811
681d5712N5873N1491J8613k0123m3674m9816l8059o922L3134N6792M7972J7625
$$ plain form
596 24851 -37320 -76951 -82329 -54420 -919 57573 89672 74142 20945 -36457 -74766 -82836
608 -82836 -56070 339 59767 87925 70358 21631 -34297 -76290 -85662 -52232 6349 58561
620 58561 81558 70245 26637 -34330 -81063 -83915 -45610 7015 53408 81201 74530 26043
632 26043 -39818 -80268 -78005 -44841 3187 53997 85260 72219 19811 -38254 -74323 -79233
644 -79233 -49496 5977 60844 83100 64739 20319 -31921 -74049 -83243 -47685 11942 60022
656 60022 77842 65820 25400 -32655 -79017 -81318 -41065 13366 56763 78369 67768 22979
668 22979 -35725 -74612 -75520 -42700 8378 58609 83344 66107 17486 -35435 -71137 -76523 -45712
681 -45712 10161 61652 80265 60142 16468 -33348 -71407 -78329 -45195 11597 59569 77194
693G7194j7116m2916n2233l8492l772L4328N4202M7643J8987j7108m5376n2455
705c7114l5047j281L2797N1501M7076K0893j7042m6591n2726l2953j83L0476N0348
718A0154M9495K2206k0247m9681n0534k9350m17K9244N0626M8782J8630k0735
730E8173m5586m8287l2654l131L2158N3013M5955J5716j7880m3613n2511l4426
742g3073L289L5740M7541M0023J9500j3057m6617n5947l0670O893L2272M3942
754I836M4301K1958j7297n0278n0812k7011K304K9899M9856M6194J5862k1753
766E3059m4063m6636l2157n1L6134N1670L8555J2455j5201l9812n2027l5846M779
779f9141L9835M7894L6362J4900j4487m4764n2706k8797P121L3949M4856L9957
$$ plain form
693 77194 60078 17162 -35071 -73563 -77335 -43007 11195 58838 77825 60717 15341 -37114
705 -37114 -72161 -73442 -40645 10856 57932 78825 61783 15192 -37534 -70487 -70670 -40194 10154
718 10154 59649 81855 61608 11927 -38607 -67957 -68374 -39130 11496 60278 78908 58173
730 58173 12587 -35700 -68354 -71485 -39327 13686 59641 75357 57477 13864 -38647 -73073
742 -73073 -69784 -34044 13497 53520 73020 59963 13346 -42601 -73271 -66378 -34106 9836
754 9836 54137 76095 58798 8520 -42292 -69303 -66999 -37100 12756 58950 74812 53059
766 53059 8996 -37640 -69797 -69848 -33714 17956 56511 68966 53765 13953 -38074 -73920 -69141
779 -69141 -29306 18588 54950 69850 55363 10599 -42107 -70904 -63783 -29834 15022 54979
791E4979J6933j9107m5030m6851k8266J485L2168N1074M1983J1050k2093m0888
803G437m4216l1392N35L6457N1142L8153Q634j8780l8760m6729l1991L763L6472
816b9275M8105L7350J1777j8576m2440m7307k7562M727L3946M6795L9091J2625
828F9256k1401m4290m4292k4900M332L1735M6591M0042J1547k2317m3210m2366
840c9273k4819K016L2134M8672M0269R303k3442m2223m1647k5531L545L4637M7032
853B0673L6238Q106j9145m0607m4555k6664O154L5268M4146L5058J2351j8996
865D8027m4336m6807k2224R557L2744M1479L5984J2808k1689m4577m1996k0954
877f1984N557L0508M4527L7948R231k2698m1413m1469k4543N956L5211M6246L1827
$$ plain form
791 54979 71912 52805 7775 -39076 -67342 -65857 -33689 17385 59368 70418 48325 7437
803 7437 -36779 -68171 -67636 -31179 19963 58116 66750 47970 9210 -37519 -69510 -65747 -29275
816 -29275 18830 56180 67957 49381 6941 -40366 -67928 -63201 -29255 17540 56631 69256
828 69256 47855 3565 -40727 -65627 -61295 -29560 17031 57073 68620 46303 3093 -39273
840 -39273 -64092 -62076 -29942 18730 58999 68302 44860 2637 -39010 -64541 -60996 -26359 20673
853 20673 56911 65017 45872 5265 -39290 -65954 -59800 -24532 19614 54672 67023 48027
865 48027 3691 -43116 -65340 -55783 -23039 18440 54424 67232 45543 966 -41030 -61984
877 -61984 -56427 -25919 18608 56556 65787 43089 1676 -39793 -64336 -58380 -23169 23077 54904
890E4904O789j9960l9085m2616k5019Q126L5668M2294L1976R298j8852m1650m3448
903d1575k2309Q254L4010M3471L3418P448k2314m0618l9563k2373O974L4207M4151
916B3181L1767N231k0125l8207m0765k4541Q122L5693M3598L0448O555k1290m0759
929a092m0328j9934R042L2356M2334L2393O465k3736m0443l6258j9335M655L1432
942b2449M5648L3828L166k5201l7622l5691k1574N887L4534M5046K9527J776k1603
955C5272l6341l8166k1431Q748L4023M1115K9988N710k1208m0865l9251j7206
967e9612J0687L1595L9362L1624O483k4540m1625l5624j4702Q516K8680M0671
979B1515L2906M906k5039l9866l4614j6588P495L1004M2581L0447K224k4981l7761
$$ plain form
890 54904 61693 41733 2648 -39968 -64987 -56861 -21193 21101 53077 62375 43523 1873 -41575
903 -41575 -63884 -55630 -21620 21851 55269 62717 40403 -215 -39778 -62151 -55177 -20970 23181
916 23181 54948 60179 40054 1847 -38918 -63459 -55337 -19644 23954 54402 60957 39667 -1092
929 -1092 -41420 -61354 -52312 -19956 22378 54771 61236 37500 -2943 -39201 -58536 -53881 -22449
942 -22449 23199 57027 60193 34992 -2630 -38321 -59895 -54008 -19474 25572 55099 56875 35272
955 35272 -1069 -39235 -60666 -51918 -17895 23220 53208 58918 37710 -3155 -42406 -59612
967 -59612 -48925 -17330 22032 53656 60139 35599 -6026 -41650 -56352 -47836 -19156 21515
979 21515 54421 59327 34288 -5578 -40192 -56780 -49285 -18281 24300 54747 56971 31990 -5771
992e771l3668j7739Q378L2881L9996K7586M100k1738l7448l8199j7889J2073L4216
1005a3222L7486K5782N500k0543m0203l8923j4310J4138L1313L5240K8330O163
1017E6751k3283m1010l4559j3174J0738K9358L8673K9802K468k4843l7795l3212
1029d0086j6051R452L3958M0265K4568n71k1672l4327l4911j8183J2116L4653
1041a0789L7383K3182K345j9813l7653l6889j4725J3748L2878L5872K5249K072
1053E2860k3320l7804l3001j2406J0452L0699L8340K6188l1k4403l4934l1936
1065c9296j5452R947L3327L9351K4277k151k3337l4298l2364j4885J2334L2805
1077i742L6254K3617O43k3039l6725l1881j2688J2632L0855L5797K5103N70k4525
$$ plain form
992 -5771 -39439 -57178 -48800 -15919 24077 51663 55763 34025 -3423 -41622 -59511 -47438 -13222
1005 -13222 24264 50046 55546 35003 -5200 -44123 -58433 -44295 -12982 22258 50588 56751
1017 56751 33468 -7542 -42101 -55275 -44537 -15179 23494 53296 55764 30921 -6874 -40086
1029 -40086 -56137 -46685 -12727 27538 52106 51535 29863 -4464 -39375 -57558 -45442 -10789
1041 -10789 26594 49776 52121 32308 -5345 -42234 -56959 -43211 -10333 25539 50788 52860
1053 52860 29540 -8264 -41265 -53671 -43219 -12520 25820 52008 51977 27574 -7360 -39296
1065 -39296 -54748 -44801 -11474 27877 52154 50003 26666 -7632 -39996 -54881 -42547 -9742
1077 -9742 26512 50129 50772 27733 -8992 -40873 -53561 -40929 -10074 25723 50826 51396 26871
1090B6871l7493l0074j1306J1382L0784L6179K5124p85k5452l6015k9098j1241
1102e1124J1024L0293L6629K4153j198k4491l5427l0295j1833J2522L1695L5798
1114B7746K1770j309k3389l4784l0920j1725J4487L1209L3418K1179P77k2117
1126B6342l7397l1537r788J5895L0121L1905K2731R24k4725l7145k9473p824J3579
1139c6392K8810L3939K3192j945k5269l4612k7790j0004J1440L1944L5839J9869
1151D9021l881k3365l2339k9371j1893J4718L3563L3072J7149k239k0817l4334
1163a0716l0671j0234J7115L1739L0743J8947j194k3302l5137k8869p516J5129
1175c3966K9716L2266K0190l046k5048l3642k6116q812J3768L0256L3705J8774
$$ plain form
1090 26871 -10622 -40696 -52002 -40620 -9836 26343 51467 50682 25230 -10785 -39883 -51124
1102 -51124 -40100 -9807 26822 50975 49777 25286 -10141 -40436 -52269 -39747 -8052 27746
1114 27746 49516 48207 24818 -9966 -40886 -52611 -38124 -6915 26503 47682 48459 26342
1126 26342 -11055 -42592 -52380 -36485 -6364 25541 48272 49196 24471 -12674 -42147 -49971 -36392
1139 -36392 -7582 26357 49549 47604 22335 -12277 -40067 -50071 -38631 -6687 29152 49021
1151 49021 45140 21775 -10564 -39935 -51828 -37110 -3547 29525 46674 44435 23618 -10716
1163 -10716 -41387 -51621 -34506 -2767 27976 46923 45729 22427 -12710 -41579 -49095 -33966
1175 -33966 -4250 28016 48206 45160 20112 -13530 -39646 -48458 -34690 -4434 29271 48045
1187D8045m467k4537l2377k6133r182J3651L1471L3332J8356n472k4371l2205
1199a3889k6003q516J4145L1448L2390J7621n115k4138l1384k6268q632J5354
1211c2987L0799L1785J6836m244k3845l3131k6064o119J5867K9708K9823J7808
1223D6236l368k5163l3500k4755m923J4885K8034L1022J9212m974k6860l2064
1235a6218k3344n534J4283K9171L1476J7198o178k4790l1331k4203o190J5407
1247c0253K9936L0325J5448n365k3892l1782k4851n331J7013K9182K8679J5454
1259D4563m820k3802l2523k4310m346J6681K9349K8385J4934m842k4142l1976
1271a6849k3618m349J7107K8675K8264J4449n047k4309l1506k3286l802J6841
$$ plain form
1187 48045 43578 19041 -13336 -39469 -48651 -35000 -3529 29803 48159 42687 18316 -13889
1199 -13889 -39892 -48408 -34263 -2815 29575 47196 42081 17943 -13441 -39709 -48341 -32987
1211 -32987 -2188 29597 46433 42189 18344 -14787 -40851 -46970 -31103 -1395 28428 46236
1223 46236 42868 17705 -15795 -40550 -45473 -30588 -2554 28468 47680 42706 15846 -16218
1235 -16218 -39562 -45096 -30813 -1642 29834 47032 40854 16064 -15267 -39470 -45660 -30253
1247 -30253 -317 30008 45456 40091 16199 -15583 -40434 -45765 -28752 430 29109 44563
1259 44563 39743 15941 -16582 -40892 -45238 -28557 792 29177 44111 39269 15127 -16849
1271 -16849 -40467 -44816 -27709 966 29230 43679 38632 14323 -17183 -40469 -44271 -27430
1283b7430K8795K8380J4731o553k4606l0090k2727m093J5946K9468K8652J3570
1295D4043p149k3977k9245k2835m515J7161K9632K7706J2253o854k3263k9735
1307a6778k2294m025J6871K9505K7161J2802o928k4293k9816k1111l327J6198
1319b6035K9045K7392J2514p794k4245k8633k0508l816J6427K8802K7365J2454
1331D2968q242k3836k9283k0749k117J6846K8281K6216J2288p370k4679k9149
1343a8826j9698j561J6311K7282K6680J2918q531k5269k8513j8752j831J5914
1355b3876K7905K6602J1609q706k4044k7917j9652k281J7471K8428K5054J0605
1367D1198p985k3527k8213k0057j169J8141K7160K4170J1079p407k3853k9074
$$ plain form
1283 -27430 1365 29745 44476 37923 13317 -16773 -39500 -43593 -27647 1821 30473 44043
1295 44043 36894 12917 -16328 -39163 -43678 -26517 3115 30821 43074 36220 12957 -16778
1307 -16778 -39072 -43097 -26226 3279 30440 43242 36314 12021 -17795 -38906 -42233 -26035
1319 -26035 3010 30402 42916 35122 10877 -17756 -38264 -42080 -25653 3149 30514 42968
1331 42968 34726 10890 -18393 -39142 -41259 -24413 3868 30084 42372 35002 10323 -18826
1343 -18826 -38524 -40085 -23774 3508 30188 43106 34575 9306 -19207 -37959 -39790 -23876
1355 -23876 4029 30631 42240 33534 9490 -18427 -38079 -40360 -22889 5539 30593 41198
1367 41198 33213 9686 -18527 -38584 -39753 -21612 5548 29718 40797 33390 9537 -19537
1379a9537j9064j00J7850K6287K4266J1403p962k4202k8716j8300J0J6917K7146
1392E998K4140J0148q528k3539k7683j8191o82J7329K7576K3760R815r145k3758
1405G240k6851j7762m49J7353K7256K3690R027r394k2543k6541j8669r64J8809
1418a9798K7465K3209P919r254k2172k6456j8270o1J8564K6461K2378Q940q512
1431C0413k3588k7048j7128J244J7561K6074K3045Q943j0057k4013k5908j5608
1443c6070K91J6460K6817K3720Q409j1110k3807k4490j6126j70J7639K6740K2798
1456C1101P291j0740k2741k5201j6083L48J7545K6968K2192P529j0713k3074k5055
1469b0633j5996J987J7769K5234K1540P460r784k3364k5203j5829K333J7754K5572
$$ plain form
1379 -19537 -38601 -38701 -20851 5436 29702 41105 33143 8941 -19775 -38075 -38065 -21148 5998
1392 5998 30138 40286 31758 8219 -19464 -37655 -38337 -21008 6568 30328 40143 30998 7240
1405 7240 -19611 -37373 -37822 -20469 6787 30477 39504 30110 7567 -18974 -37643 -38607 -19798
1418 -19798 7667 30876 38795 29541 7369 -19087 -37357 -37418 -18854 7607 29985 38925 30413
1431 30413 6825 -20223 -37351 -36107 -18546 7528 30573 39516 29459 5446 -20462 -36070
1443 -36070 -35779 -19319 7498 31218 39627 28517 4710 -19780 -35906 -36076 -18437 8303 31101
1456 31101 38392 27652 4911 -20290 -36373 -36025 -18480 8488 30680 38209 27496 4422 -20633
1469 -20633 -36629 -34642 -16873 8361 29901 37361 27577 4213 -20990 -36819 -34486 -16732 8840
1482H840K1019P903j0123k4180k5433j4064L069J7039K4104K2114P796j0734k4544
1495B806k4260j3864J936J7000K5606K1539O374j1554k2950k3605j4353J428J8291
1508a5606K5986K0032N810j0806k2131k4391j4900K990J8408K4650J9308O507
1520C5857j0153k2622k5301j3832L870J8365K3990J9625N838j0496k2978k4254
1532b2091j2975K968J7896K4405J9868N704j1363k2815k3184j3255L273J8106
1544a3463K4321J8890N311j1314k2495k2691j2957K834J7990K4618J9470M543
1556C5057j1968k2064k2188j3025K950J7898K4862J8686M342j1955k1690k2435
1568b1530j2774L524J8514K4458J7780L700j1188k1815k2530j2207M162J7939
$$ plain form
1482 8840 29859 37762 27639 3459 -21974 -36038 -32969 -15930 8174 30288 38084 27350 2806
1495 2806 -21454 -35318 -33382 -16382 9224 30763 37137 25583 2633 -20972 -35325 -33897 -15606
1508 -15606 10380 30412 36222 25416 3285 -21106 -36006 -33016 -14608 10042 29350 35857
1520 35857 25704 3082 -22219 -36051 -32181 -13816 10174 29799 35637 25141 2163 -22091
1532 -22091 -35066 -32098 -14202 10203 30071 35775 24412 1597 -21587 -34842 -31569 -13463
1544 -13463 10858 29748 35059 23745 1250 -21441 -34398 -31564 -13574 11044 30514 35057
1556 35057 23089 1025 -21163 -34188 -31238 -13340 11522 30208 34550 22595 905 -21530
1568 -21530 -34304 -30780 -12266 12192 29972 33672 22484 669 -21861 -34068 -29906 -11967
1580a1967K3366J8439M547j1822k3159k2148j0802M457J7676K3250J8041M186
1592C4064j2355k2338k1537j0760L918J7454K3427J8219L753j2827k1979k1450
1604b2411j0982N067J7976K2712J7268L584j1919k2266k1403j0550M641J8015
1616a0268K2719J7432L135j2655k1996k1105j0407N495J8602K1905J6276K855
1628C1988j1694k1739k1709j0309O075J8632K1379J6103L280j2015k1874k1355
1640b3238r306O082J7364K1542J6643K932j2875k1811k0006r347N486J7512K2242
1653A3220J6313J807j3309k0414j9766j0210N061J8859K2495J5165Q38j2174k0362
1666b477j9804j0424O541J8718K1696J4202J716j2012k1278j9975q871O469J8235
$$ plain form
1580 -11967 11399 29838 34385 22563 -596 -22744 -33546 -29089 -11413 11837 29878 34064
1592 34064 21709 -629 -22166 -32926 -29008 -11554 11873 30092 33845 21018 -961 -22411
1604 -22411 -33393 -28326 -10350 12362 29630 33214 21295 -971 -22374 -32924 -28283 -10268
1616 -10268 12451 29883 33018 20363 -1633 -22738 -33145 -27650 -9048 12857 29133 31988
1628 31988 20294 -1445 -23154 -33463 -27388 -8756 12623 28726 32006 19991 -1883 -23238
1640 -23238 -32544 -26462 -9098 12444 29087 32019 19144 -2667 -22673 -32020 -26534 -9022 13220
1653 13220 29533 31340 18031 -2383 -22149 -32359 -27298 -8439 14056 29221 30059 17885 -2477
1666 -2477 -22281 -32705 -26164 -7446 14250 28452 30168 18156 -3122 -23097 -31968 -25499 -7264
1679g264K1046J4377K083j2811k1040j9326q311O424J7183K1477J4943J320j3340
1692A6761k1166j8005q488N686J7828K1766J4813L61j3339k0358j7934q830N921
1705b4984J8399K1151J3981J32j2511k0395j8574q335P020J8008K0599J3374R21
1718B8786j2783k0420j9116p494P756J7217K0064J4421O58j3555k1210j7510o576
1731b9762O931J7109K0277J3763J79j4028k0008j7021o898O399J7991K0384J2726
1744B8042m55j2762j9466j8277p173P838J7842J9776J2208J96j2840k0430j7693
1757b3194o245Q032J7372J8754J3041N6j3429k0417j6785o155P255J7219K0067
1770A5571J2505r53j3931j9195j6841o244P339J7723J9641J1753p81j3369j8821
$$ plain form
1679 -7264 13782 28159 30242 17431 -3609 -22935 -31246 -24822 -7639 13838 28781 30101 16761
1692 16761 -4405 -22410 -30898 -25212 -7384 14382 29195 29556 16217 -4141 -22075 -30905 -24984
1705 -24984 -6585 14566 28547 28679 16168 -4227 -22801 -31136 -24116 -6108 14491 27865 28786
1718 28786 16003 -4417 -23533 -31027 -23271 -6054 14010 28431 29089 15534 -5676 -23186 -29762
1731 -29762 -22831 -5722 14555 28318 28497 14469 -5539 -22560 -29458 -23059 -5068 15316 28042
1744 28042 27587 14825 -4641 -22918 -30091 -22253 -4411 15365 27573 27769 14929 -5501 -23194
1757 -23194 -29439 -21407 -4035 14719 27760 27816 14387 -6030 -22815 -28970 -21715 -4496 15571
1770 15571 28076 27123 13192 -6003 -22844 -29088 -21749 -4026 15615 27368 26587 13218 -5603
1783e603j7227o605Q210J8071J8923J1353j192j2755j9160j7296n321Q400J7591
1796b611J8240J1461p60j3235j9663j6123m972P597J7123J8910J1434j488j3614
1809A2299j9045j5520n470P228J7394J9277J1115j499j4152j8335j5494n384P745
1822a9841J7070J8612J1120j940j3462j8317j5823n475Q589J7392J8243J0449
1834B6617j853j3490j8546j5464m645Q412J6934J7814J0807j708j3606j8916j5103
1847b2747l998Q179J6302J8345J0838k270j4170j8528j4635m270Q190J7082J7571
1860A5889J0504k495j3884j8081j4566m446Q662J7125J7471R851k339j3700j8369
1873h378j4339l949R211J6698J6690R709k676j3176j8305j4044l600Q795J6810
$$ plain form
1783 -5603 -22830 -29435 -21225 -3154 15769 27122 25930 13175 -5985 -23281 -28602 -20202 -2611
1796 -2611 15629 27090 26330 13095 -6568 -22691 -27663 -20066 -2943 15967 27401 25913 12299
1809 12299 -6746 -22266 -27736 -20508 -3114 16163 27278 25779 11627 -6708 -22202 -27586 -19841
1822 -19841 -2771 15841 26961 25021 11559 -6758 -22581 -28056 -19467 -2075 16168 26617
1834 26617 24764 11274 -7272 -22736 -27381 -18969 -2035 15779 26586 24878 11272 -7644 -22747
1847 -22747 -26745 -18566 -2264 16081 26919 24649 10479 -8049 -22684 -26954 -18764 -1682 15889
1860 15889 26393 23898 10014 -8067 -22633 -27079 -18417 -1292 16179 26030 23691 9991 -8378
1873 -8378 -22717 -26666 -17455 -757 15933 25642 22966 9790 -8515 -22559 -26159 -17364 -554
1886e54J6870R305k407j3400j7931j4391l439Q599J7336J7063Q803l020j3604
1899I230j8143j3944k865Q947J6711J6699Q680l085j3275j8082j3518k987Q789
1912a6843J6659J6819Q986l705j3611j7615j3010l134Q943J6740J6562Q216l255
1925B1752j3425j7230j3391l104R071J7106J6397Q003l793j3322j7161j3252k093
1938b4442Q893J6460J6051Q143l478j3797j7199j2663k190R205J5857J6212Q368
1951B5420l944j3934j7113j2356k200Q934J6220J5865Q020m273j3319j7359j1827
1964b1866k390R493J6135J5497P789m333j3368j6669j2494j606R418J6221J5147
1977A6974P225m209j3420j6552j2368j224R669J6140J4742P377m061j3451j6715
$$ plain form
1886 -554 16316 25621 23214 9814 -8117 -22508 -25947 -17348 -12 17051 25854 22834 9230
1899 9230 -8913 -22857 -25722 -16775 -64 16635 25315 22230 8955 -9127 -22645 -25632 -16843
1912 -16843 -184 16635 25621 21916 8305 -9310 -22320 -25454 -16511 229 16791 25007 21752
1925 21752 8327 -8903 -22294 -25398 -16327 779 17176 25179 21386 8064 -9097 -22349 -24442
1938 -24442 -15549 911 16962 25105 21627 7830 -9369 -22032 -24222 -15017 840 17052 25420
1951 25420 21476 7542 -9571 -21927 -24127 -15193 1027 16892 24912 20639 7320 -10039 -21866
1964 -21866 -24256 -14763 1372 16869 24658 20325 6957 -9712 -22206 -23812 -14394 1827 16974
1977 16974 24199 19990 6570 -9982 -22350 -23574 -13905 2235 16977 24354 20293 6842 -9873
1990i873j2313r62R511J5587J4912P490m440j3902j6374j1323j521R858J5447
2003B097J4918P187m687j3750j5936j1611j133R564J5807J4661O521m536j3556
2016E546j6074j0973j513J0188J5464J4263O709m564j3413j6219j1066q15R749
2029a2718J5701J4222O367m848j3531j5664j1378j67R511J5791J4040N748n036
2042A8038j3424j5167j0765q98R895J5833J3588O017n049j3706j5409j0745J6
2055b1776R698J5356J3630N678n092j3223j5405j0286O8R412J5239J3746N653
2068B2698m949j3788j5411r532l60R526J5402J3915N160n405j3090j5118j0441
2081b1393N4R837J5556J3697M611n311j3391j5162r370l5J0054J4770J3169M990
$$ plain form
1990 -9873 -22186 -23148 -13637 1950 16862 24352 19912 6010 -10364 -21687 -23208 -13350 2097
2003 2097 17015 24202 19515 5765 -10171 -21782 -22915 -13351 2456 17117 23638 19102 5546
2016 5546 -10528 -21501 -23014 -12826 2638 16901 23610 19046 5633 -10586 -21652 -22467 -12718
2029 -12718 2983 17205 23572 18724 5193 -10471 -21849 -22016 -12505 3286 17326 23074 18038
2042 18038 4614 -10553 -21318 -22216 -12321 3512 17100 23117 18068 4362 -11047 -21792 -21776
2055 -21776 -12078 3278 16908 22586 17494 4271 -11134 -21420 -21352 -11940 3299 17045 22698
2068 22698 17749 3961 -11450 -20982 -21342 -11816 3586 17501 22661 17256 4166 -10952 -21393
2081 -21393 -21339 -11502 4054 17751 22362 17051 3660 -11502 -20872 -20907 -10853 3917 17086 22076
2095B2076n213j3406j5153r683P31R836J5164J2813M838n644j3344j4806q957
2108b0748O25R620J4648J3039M805n720j3205j4829q884K22J0177J5012J2615
2121A7377M332n718j3175j4477r440P51J0505J4857J2306M397n552j3304j4476
2134a1617r195J081J0582J4333J1722M415n647j3225j4487q533J018R956J4986
2147E389J2059L901n772j3417j3944q658J151J0208J4418J1837M172o464j2785
2160B095j4108q235J002J0057J4993J1606L787o481j2695j4259p909J176J0370
2173h601J4446J1682L303o297j3053j3604q180J193J0827J3889J1811L209o466
2186A4159j2657j3930p482J560J0201J4104J1208L511o540j2898j3613p382J334
$$ plain form
2095 22076 16863 3457 -11696 -21379 -20648 -10812 4352 17165 22003 16359 3015 -11791 -20748
2108 -20748 -20123 -10503 4145 17184 21989 16269 3064 -11765 -20649 -20427 -10250 4762 17377
2121 17377 21709 15991 2816 -11661 -21101 -20350 -9845 5012 17318 21715 16163 2859 -11617
2134 -11617 -20812 -19731 -9149 5184 16906 21321 15674 2449 -12038 -20571 -19553 -9597 5389
2147 5389 17448 21349 15577 2160 -11784 -20442 -19291 -9083 5335 17172 21344 14880 2095
2160 2095 -12013 -20248 -19246 -9189 5804 17410 21197 14716 2021 -12238 -20147 -18971 -8601
2173 -8601 5845 17527 20830 14533 1480 -12124 -20304 -19111 -8284 5605 17416 20625 14159
2186 14159 1502 -12428 -19910 -18350 -8149 5955 17163 20674 14134 1236 -12377 -19759 -18425
2199a8425R972J4176J1798K997o527j3222j2972p457J626J0269J3783J0966L127
2212B0111o648j2499j3180p787J732J0579J4298J0488K567o146j2750j3350p307
2225a9892K377J0018J3444J0862L163o792j2740j3268o583K170R911J3485J0964
2238A7119K665o767j2905j2835o611J971J0132J3982J0425K432o895j2536j2671
2251a2494o543J832J0508J3723R989K109o674j1890j3235o735K496J0669J3176
2264F931R899K072o775j2356j2781o674L066J0638J2943R987K189o951j2876j2395
2278a3083n950K625J0185J3379J0022J622p266j2538j1789o277K719J0542J2804
2291F995R978J564p319j2338j1496o815K943J0815J3282R076J954p260j2148j2244
$$ plain form
2199 -18425 -8453 5723 17521 20518 13991 769 -12203 -19660 -18034 -7765 6018 16984 20111
2212 20111 13463 964 -12216 -20003 -18271 -7692 6606 17094 19661 13515 765 -12585 -19892
2225 -19892 -17515 -7497 5947 16809 19972 13180 440 -12828 -19411 -17241 -7330 6155 17119
2238 17119 19784 13017 112 -12723 -19334 -17363 -7231 6751 17176 19608 12713 177 -12494
2251 -12494 -19037 -17205 -6697 7026 17015 19124 12450 560 -12675 -19410 -16914 -6245 6931
2264 6931 16830 18902 12127 -229 -13010 -19684 -16618 -5980 6963 16950 19139 12188 -688 -13083
2278 -13083 -19033 -16408 -6223 7156 17178 18800 11534 -1004 -12793 -19070 -16351 -5809 6995
2291 6995 16973 18537 11218 -1120 -12616 -19431 -16488 -5673 7609 16685 18639 11379 -769 -13013
2305a3013n893L092J0655J2792R246J534p226j2269j2007n527K971J0807J2451
2318G613R264J340p365j2211j1831n186L074R936J3036R294J537p532j2510j1163
2332a2704n532K827J0569J2683R059R66p470j1835j1487n500L367J0522J2508
2345G973Q671J255p533j2036j1442n379L791J0670J1867Q932Q81p333j2226j1192
2359a3101m949L583J0373J1925R139O67p673j2122j1395m755M130J0026J2087
2372G935Q439P07p378j2229j0564m755L857R878J2485Q223O04p746j2156j0540
2386a3240m571M237R907J2349P868K30p590j1893j0548m202L874R963J2302P815
2400A6501R0p472j1606j1096m068M401J0334J1749P631j1p652j1771j0422m101
$$ plain form
2305 -13013 -18906 -15814 -5159 7633 16879 18413 11187 -1082 -13089 -18616 -15645 -4838 7613
2318 7613 16877 18217 10852 -1359 -13190 -18376 -15302 -5366 7670 16964 18501 10969 -1541 -12704
2332 -12704 -18236 -15409 -4840 7843 16902 17868 10398 -1437 -12924 -18424 -15057 -4535 7973
2345 7973 16644 17899 10366 -1670 -13112 -18491 -14700 -4030 7837 16769 17650 10317 -1909 -13101
2359 -13101 -18050 -14467 -4094 7831 16970 17637 9964 -2158 -13553 -18308 -14178 -4152 7935
2372 7935 16374 17081 9703 -2526 -13090 -17845 -13988 -4110 8375 16598 17202 9456 -2700 -13240
2386 -13240 -17811 -13574 -3667 8682 16550 16780 9190 -2703 -13251 -17453 -13579 -3616 8686 16501
2400 16501 16591 9119 -2487 -13583 -17651 -13250 -2916 8833 16464 16453 8801 -2970 -13392 -17493
2414a7493M264J0185J1626P551J29p616j1926j0154l886M034J0254J1816P525
2427A6309k66p794j1902r781l721M308J0299J1741P226l24p996j1352j0148l774
2441a7175M456J0408J1279P407l24q399j0850j0324l636M556J0454J1235P042
2454A6129n60p627j1555j0058l025M469J0281J0845O981k91p906j1733r732l250
2468a7032M797J0002J1471O800o31q159j1358r457l132N052R387J1213O911n63
2482A5301q345j1179r084l341M751J0495J0975O338j033p854j1161r247l185M749
2496a1820J0525J0897O368j115q000j1003r408k491M705J0269J0635N932p54q313
2510F427j0946q991k614M981R936J0697O294j641p942j0904q829k299N053R991
$$ plain form
2414 -17493 -13229 -3044 8582 16133 16262 8646 -3280 -13434 -17320 -13286 -3032 8784 16309
2427 16309 16043 8249 -3653 -13434 -17155 -12847 -2548 9193 16419 16095 8099 -3253 -13401 -17175
2441 -17175 -12719 -2311 8968 16375 16051 7652 -3198 -13522 -17158 -12602 -2148 9087 16129
2454 16129 15569 7942 -3613 -13671 -16696 -12227 -1946 8899 15880 15589 7683 -4050 -13782 -17032
2468 -17032 -12235 -2233 9238 16038 15407 7248 -4110 -13567 -16699 -11647 -2260 8953 15864 15301
2482 15301 6956 -4223 -13307 -16648 -11897 -1402 9573 15911 14878 7024 -4137 -13384 -16569 -11820
2496 -11820 -1295 9602 15970 14855 6855 -4148 -13556 -16047 -11342 -1073 9562 15494 14740 6427
2510 6427 -4519 -13510 -16124 -11143 -1207 9490 15784 14143 6201 -4703 -13532 -15831 -10778 -787
2524g87J0782N801j663q215j0524q643k485M938J0279J0396N717j534q161j0680
2538d779q660k394N314J0184J0173N751j749q318j0550q287k047M760J0321J0429
2552A0148N276j761q377j0355q202k125N056J0200J0041N505k007q305j0139q252
2566a3297k196N497J0082R826N479k038q187j0757q046j640N407J0157R719N238
2580A5244j900q264j0546q012j381N504R817R785M972k113q350j0177p835j747
2594a5003N825R514R822M688k072p964j0296q100j446N961R478R671M804k169
2608A2713p956j0842p170j554N764R736R360M568j887q296j0423p378j269N549
2622i085R912R246M909k652q259r883p582j240O141R402R320M393k027q379j0408
$$ plain form
2524 -787 9995 15796 14133 5918 -4606 -13249 -15734 -10796 -517 9879 15596 14062 5901 -4779
2538 -4779 -13439 -15833 -10519 -335 9838 15589 13840 5522 -5028 -13315 -15362 -10602 -281 10148
2552 10148 15424 13663 5286 -5069 -13271 -15396 -10340 -140 9901 15406 13399 5094 -5045 -13297
2566 -13297 -15493 -9996 86 9912 15391 13353 5166 -5591 -13637 -15277 -9870 287 10006 15244
2580 15244 13344 5080 -5466 -13478 -14859 -9355 462 10247 15219 13106 4756 -5421 -13256 -15003
2594 -15003 -9178 336 10158 14846 12774 4810 -5486 -13586 -15032 -9071 407 10078 14882 12713
2608 12713 4757 -6085 -13255 -14809 -9045 691 10051 14619 12732 4436 -5987 -13365 -14634 -9085
2622 -9085 827 10073 14982 12330 4071 -5812 -13394 -14634 -8493 909 10229 14622 12595 4216 -6192
2637f192p009j185N932R727Q635M592k477q205r936p383o60N648J0048Q752M364
2652A4651k646q199j0034p082q25N838R585R092M182k703q208r737p013q09N703
2667h205R604Q858L956k368q479r800o969k86N913R522Q941L777l094q219r642
2682f491p021K47N776R453Q587L816k917q554r407o715l06O030R579Q432L922
2697A4431l198q524r432o484k29N858R654Q356L795l256q180r528o410k07O263
2712g091R253Q417L455l161q540r093o256k73O515R224Q156L313l156q232r264
2727f733o316l9O506R058Q107L226l324q266r235o015L1O358R187Q256L304l500
2743A0605q482r240n490k99O476R077Q110K825l386q253r181n834J06O744R356
$$ plain form
2637 -6192 -13201 -14386 -8454 1273 9908 14500 12023 3818 -6118 -13501 -14161 -8513 1535 10287 14651
2652 14651 12005 3806 -6228 -13310 -14135 -8297 1288 10380 14562 11859 3651 -6086 -13099 -13908 -8205
2667 -8205 1399 10257 14213 11845 3366 -6434 -13403 -13689 -7776 1746 10687 14464 11370 3151 -6491
2682 -6491 -13512 -13265 -7489 1964 10551 14367 11450 2896 -6511 -13226 -13532 -7502 2077 10509 14431
2697 14431 11233 2709 -6723 -13207 -13436 -7578 2076 10432 14227 10971 2791 -6737 -13147 -13354 -7091
2712 -7091 2162 10579 14034 10873 2333 -6760 -13016 -13289 -6774 2450 10606 13919 10763 2531 -6733
2727 -6733 -13049 -13088 -6582 2476 10583 13809 10485 2219 -7016 -13031 -13000 -6642 2545 10801 14105 10605
2743 10605 2123 -7117 -12607 -12906 -6430 2647 10757 13582 10196 1943 -7238 -13072 -12966 -6222 3134
2758C134P920K637l957p719r204n559M3O339R309P702K876l393q385q966n599
2773a2822N51O073R192P803K579l559p905r180n487O48N952R241P744K456l711
2788I575q348q823n248Q52O235R119P570K180l672q210q609n215M97O408Q858
2803C169P862K185m041q346q031n490Q27O411R112O940K479l965q085q426n265
2818a2664J031O201R070P283J938m174p878q583m733Q74O619Q656P085J997l835
2833H887q118q235n168J260O407Q615P347J748m273p830q354m916J066O538Q660
2848C634O939J791l835p957q539m705J363O489Q937O680J654l913q159q194m304
2863a2119J282O243Q776O348J871l908q098q204m528J282O639Q686O476J478m130
$$ plain form
2758 3134 11054 13691 9734 2015 -7189 -12748 -12705 -6366 2943 10645 13521 10128 1743 -7223 -12822
2773 -12822 -12271 -6198 2994 10797 13376 9817 1912 -7268 -12755 -12107 -6155 3086 10830 13286 9575
2788 9575 1227 -7596 -12844 -11992 -5757 3362 10932 13112 9440 1230 -7379 -12594 -12097 -5689 3169
2803 3169 11031 13216 9175 829 -7202 -12692 -11865 -5454 3658 10598 13077 9112 1027 -7399 -12664
2818 -12664 -11633 -5432 3638 10921 12859 8685 807 -7776 -12509 -11635 -5016 3640 10725 12722 8887
2833 8887 769 -7466 -12634 -11374 -4967 3648 10995 12743 8470 640 -7714 -12630 -11564 -5026 3634
2848 3634 10573 12364 8529 572 -7967 -12672 -11309 -4820 4117 10797 12451 8538 379 -7815 -12119
2863 -12119 -10837 -4594 4182 10530 12401 8493 395 -7809 -12337 -11055 -4416 4270 10746 12224 8094
2878H094p896q305m155J372O649Q759O296J197l974q090p870m348J559O470Q418
2893D176O463J289m050q046p401m359J197O558Q352O854Q71m331p678p963l901
2908a1969J184O817Q319O251J231m250p834p847l939J933O184Q342O283J092m255
2923G542q219p200m018J675O763Q158N905J349m541q040p611l469J628O542Q201
2938D665N776J325m713p946p575l810K358O310Q283N670J099m664p410p273l850
2953a1755J992O944P575N968O31m585p573p721l226J899O535Q246N771O99m413
2968F987p870p018l847K098O495Q056N830Q10m650q000p358l366K423O637P923
2983E150N311R72n149p217p554k730J976O624P780N112J056n152p529o858k976
$$ plain form
2878 8094 198 -8107 -12262 -10890 -4241 4518 10814 12011 8037 -53 -7923 -12271 -10712 -4242 4176
2893 4176 10639 11928 7878 -168 -7569 -11928 -10731 -4173 4179 11033 11904 7573 -105 -8068 -11969
2908 -11969 -10785 -3968 4351 10602 11833 7583 -251 -8098 -12037 -10104 -3920 4422 10705 11797 7542
2923 7542 -677 -7877 -11895 -10220 -3457 4701 10606 11955 7414 -626 -8237 -11706 -10078 -3536 4665
2938 4665 10441 11766 7053 -893 -8468 -12278 -9920 -3610 4673 10343 11442 6778 -632 -7905 -11755
2953 -11755 -9763 -2819 4756 10724 11355 6770 -803 -8524 -11750 -9851 -3316 4930 10701 11400 6987
2968 6987 -883 -7901 -11748 -9650 -3155 4901 10731 11541 6891 -1109 -8467 -11833 -9410 -2773 5150
2983 5150 10461 11433 6284 -933 -8487 -11217 -9241 -2617 5163 10275 11331 6179 -1350 -8208 -11184
2998a1184J897O350P946N815L23m781p645o859l346K113O958P589N281m4m457
3013E956p398o918l221K306O714P681N249L64m608p244p226l162L039O106P572
3028E210N155Om833p081o838k604K105O537P632N229j05m481p770o461k801K774
3044h326O343P687M555Jm555p509o432k669K350O670P437M913k2m752p702o514
3060h525k726K930O286P501M671N4m629p470o565k218K289O760P036M825L9m966
3076E292p235o449k372K647O494P093M781l56m667p613n876k703K703O638P374
3091E751M350K8n141p303o239k103K866O462P177L880J99m977p150o047k489K842
3107g894O849O775M442j12n214p313o168k112L063O462P271M023l63n127o879
$$ plain form
2998 -11184 -9287 -2937 5009 10824 11147 6366 -1279 -8138 -11484 -9371 -2413 5176 10457 10413 5956
3013 5956 -1442 -8360 -11581 -9275 -2561 5120 10369 10733 6125 -1119 -8345 -11507 -8468 -2362 5210
3028 5210 10365 10371 5538 -1543 -8381 -10985 -8880 -2343 5289 10518 10413 5932 -1838 -8299 -11100 -8326
3044 -8326 -1983 5704 10259 10260 5705 -1804 -8236 -10905 -8555 -1885 5552 10465 10443 5691 -2011 -8525
3060 -8525 -11251 -8321 -2035 5466 10137 10191 5562 -1908 -8473 -10691 -8402 -1642 5394 10219 10258 5292
3076 5292 -1943 -8392 -10764 -8117 -1623 5470 10251 9895 5228 -2385 -8261 -10964 -8261 -1623 5751
3091 5751 10101 10129 4988 -2315 -8554 -10657 -7791 -1329 5848 9728 9927 4950 -2200 -8247 -10736 -7894
3107 -7894 -1045 5730 10172 10060 4846 -2467 -8635 -10747 -7684 -1222 6049 10072 9709 4582 -2297
3122b297o380j651K796O516O946M126m50n160o899o140k009L494N929P022M234
3137A0077m47n295o920n992j654K925O727O713L862l59n583o795n704j702K881
3152g266O435P022M098j213n049o648n881j794L190O440P072L373m36n326p126
3167c109n197j498L052O016O905L687o62n303o876n401j655L101O702O310L779
3182I851r51n396o625n560j098K902O901O405L293p84n157o777n425j478L127
3197f772O398O765L721j499n177o665n260j246L355O448O005M010j467n159o640
3212c183n134j284L219O259O546L090r09n337o762m898j467L641O201O324L522
3227I828j300n462o555m586j441L182O556N756L671j313n145o962m826j117L610
$$ plain form
3122 -2297 -8677 -10328 -7532 -1016 5930 10056 9606 4446 -2453 -8593 -10602 -7108 -1179 5843 10077
3137 10077 9630 4335 -2585 -8577 -10231 -7306 -579 6134 9996 9637 4054 -2741 -8445 -10147 -7266
3152 -7266 -831 6191 10289 9076 4027 -2621 -8502 -10296 -7106 -666 6406 9779 9343 4017 -3109
3167 -3109 -8306 -9804 -6752 -736 6169 9856 9194 3891 -2985 -8386 -10041 -6940 -238 6072 9851
3182 9851 8900 3504 -3121 -8681 -9779 -6877 24 6429 9722 8938 3781 -2996 -8421 -9899 -6772
3197 -6772 -374 6391 10112 8613 3436 -3229 -8489 -9735 -6380 68 6073 10083 8616 3457 -3183
3212 -3183 -8317 -9601 -6382 -123 6423 9513 8604 3267 -3495 -8393 -9860 -6219 -18 6306 9828
3227 9828 8528 3066 -3489 -8075 -9516 -6334 222 5978 9649 8336 3191 -3771 -8597 -9714 -6104
3242f104O570N786L267j272n228o630n103o90L325O354O473K811j292n366o587
3257c686m879q31L477O240N778L348j649m878o692m630p32L524N935O057L617
3272I999j853n370o358m670r44L251O367O123K692j299n169o541m983l04L744
3287e315N710O060L142j832n073o549m748m85L604O297N731K701j259n454o101
3302c571m707q71L676O038O289K436j605n559o167l980r23L483O344N472K792
3317I147j465n200o328m549m78L937N704N848K612j922n019o579m286m5L394O149
3333I20N905K466j852n493n938m223n45L943N880N572K560k148n303n786m401
3348h443jL678N958N559K182j883n172o119m260m4L816N935N551K225j918n046
$$ plain form
3242 -6104 466 6252 9519 8247 3019 -3611 -8714 -9404 -6079 275 6748 9559 8267 2901 -3686
3257 -3686 -8565 -9396 -5919 321 6099 9447 7798 2920 -3772 -8402 -9134 -5610 325 6382 9999
3272 9999 8146 2776 -3582 -8252 -9196 -5945 422 6545 9237 7938 2769 -3772 -8755 -9059 -5315
3287 -5315 395 6455 9597 7765 2692 -3857 -8605 -9090 -5486 811 6542 9243 7984 2530 -3571
3302 -3571 -8278 -9149 -5473 565 6854 9290 7685 2126 -4041 -8021 -8944 -5461 883 6355 9147
3317 9147 7682 2482 -3846 -8395 -8873 -4936 768 6616 9228 7306 2287 -4292 -8578 -8623 -5229 920
3333 920 6825 9291 7439 1946 -3992 -8215 -8760 -4817 1063 6635 9195 7047 1744 -4042 -8443
3348 -8443 -8444 -4766 1192 6751 8933 7050 1878 -4241 -8501 -8545 -4729 1206 6757 8982 7064 2018
3364B018o393l700n36L962N884N432K489k116n365o154m025k4M216N218N612K492
3380I010k406m915n994l973l90M373N567N146K463j906n461n919m006L02L905
3395d204N797N065K018k058n128n710m145K42L725O170N069J876k140n320n568
3410d311l683J89L671N720N197J806j983n266n998l435K99L553N795N163J631
3425H348j993n091n474m024K71L788N901M924J959k357n185n580l352k33L936
3440d162O073M975J487j958n309n795l325K62M018N649M917J422k117n081n864
3455d808l407M55L856N795M958J428k092n544n443k948M5L981N684M487K020k341
3471F126n566n249l433N05M189N338M952J610k683n019n447l498L21M500N558
$$ plain form
3364 2018 -4375 -8075 -8611 -4649 1235 6667 9156 7040 1675 -4479 -8504 -8528 -4312 906 6518 9010
3380 9010 6604 1689 -4305 -8278 -8668 -4295 1272 6418 8881 6975 1514 -4405 -8411 -8109 -4204
3395 -4204 1593 6658 8676 6618 1490 -4220 -8365 -8123 -4398 1772 6841 8717 6577 1257 -4311
3410 -4311 -7994 -7805 -4134 1586 6783 8589 6606 1340 -4658 -8093 -7794 -4241 1554 6717 8348
3425 8348 6355 1264 -4210 -8234 -7963 -4175 1726 6650 8609 6252 1067 -4513 -7865 -8098 -4162
3440 -4162 1911 6886 8373 6415 1106 -4689 -8014 -7752 -3734 1915 6832 8254 6137 1056 -4808
3455 -4808 -8215 -7760 -3904 1891 6849 8277 6185 641 -4802 -7750 -7705 -3724 1960 6447 8467 6126
3471 6126 560 -4689 -8122 -7617 -3428 1910 6862 8472 5789 770 -4677 -8175 -7854 -3354 2204
3486B204M527J342k124n208n330l613Q08L797N738M742J469k556n021n666k994
3501g885Q03L923N442M650J400k486n240n325l128P78M020N402M389J187k269
3516E661n024n646k950J045L824N515M684Q03k645n111n365k677J037L661N525
3531B337M636J067k924m989n263k583M98M280N427M324J007k555n189m989k984
3546g900J039M264N205M241J161k756n239m924k753J019L884N236M439J018k972
3561D962m934m888l039R67L980N634L867J143k553n344m786k695R00M255N206
3576B675M009R51k730n091m904k787J185M166N619L936N26k828m750n133k539
3591g695J075M422N007L988P56k721m875n166k416J352L977N194L897N05k819
$$ plain form
3486 2204 6731 8073 5949 741 -4589 -8202 -7394 -3597 2141 6883 8352 5796 775 -4891 -7885
3501 -7885 -7082 -3159 2283 6933 8333 5847 607 -4718 -7846 -7068 -3048 2354 6743 7930 5661
3516 5661 637 -5009 -7959 -6914 -3090 2425 7109 7912 5267 156 -5209 -7886 -6849 -3188 2337
3531 2337 6973 8040 5116 127 -5136 -7719 -7221 -2941 2486 6810 7817 5262 73 -4916 -7900
3546 -7900 -6861 -2597 2608 6849 8010 5254 15 -4909 -7662 -6643 -2759 2477 6916 7934 4962
3561 4962 28 -4860 -7899 -6932 -2952 2682 6549 7692 5139 -205 -4991 -7686 -6786 -2531 2675
3576 2675 6684 7635 4905 -186 -5090 -7877 -6692 -2526 3093 7029 7555 4727 -23 -5156 -7695
3591 -7695 -6620 -2198 2809 6797 7553 4832 -43 -5209 -7625 -6273 -2296 2898 6795 7300 4481
3606D481m860m849k539J212M451N135L809O84k748m762n222k252J028L909N557
3621C034L786P27k948n092m903k173J475M081N278L360Q41k817n156m669k318
3636g494J144M178N284L630O65k890n020m657k217J124M152N089M195R2k652n279
3652f56m514k332J569L795N265L838L88l184m675m694k259J507L886N367L426
3667F727J04k905m433m806k060J496M297M888L622J53k659n325m446j977J357
3682e967M304M956L307K35k845m731m441k005J382M052N037L529P4l096m579m617
3698e405j966J940L970M260L893L72l379m897m143j781J514M181M877L229J70
3713F835l064m682m640j637J576M308M653L245k2k892m837m442j513J533M339
$$ plain form
3606 4481 -379 -5228 -7767 -6555 -2104 3031 6840 7524 4776 14 -5208 -7460 -6432 -2523 3034
3621 3034 6820 7547 4599 -493 -5396 -7569 -6094 -2013 3265 6625 7466 4649 -507 -5176 -7494
3636 -7494 -6350 -2172 3112 6742 7407 4517 -503 -5160 -7377 -6253 -2101 2988 7183 7275 4623 -656
3652 -656 -5170 -7502 -5933 -2138 3127 6965 7353 4169 -506 -5200 -7459 -5952 -2066 3301 6727
3667 6727 6831 3926 -507 -5313 -7373 -5877 -1580 3308 6930 7083 4424 -901 -5347 -7324 -5967
3682 -5967 -1663 3293 6600 6835 3990 -741 -5182 -7187 -5805 -1753 3284 6813 6887 3791 -788 -5405
3698 -5405 -7371 -5431 -1461 2799 6692 7064 3685 -1212 -5355 -7136 -5622 -1441 3436 6665 6835
3713 6835 3771 -911 -5551 -7188 -5612 -1304 3349 6594 6572 3680 -1157 -5599 -7112 -5579 -1240
3728a240M772L227j94l052m664m551j310J599M197N015K725j39k843m943l936
3743e337j754J417M556M535L297k50k990m826m318j519J876M149M831K946K5l391
3759C247m826m096j270J589M712M679K433j97k956m879l954j352J595M468M642
3774C835K692l16l421m402l581j839J988M286M463K807J0l547m441m023j175J764
3790d900M253M762K307m01l134m540l774j548J984M088M273L018j71l544m352
3805a679l916j116J939M379M551K153k12l417m227l897j074J836L958M324K904
3820F506m91l350m573l666j199J824M411M527K401k38l110n038l539j100J836
3835d799M486M332K469m99l425m519l838o46J820M260M424K531o33l633m458l416
$$ plain form
3728 -1240 3532 6759 6565 3513 -1151 -5702 -7012 -5413 -1216 3799 6524 6385 3542 -1401 -5337
3743 -5337 -7091 -5674 -1118 3417 6714 6464 3474 -1352 -5670 -7189 -5313 -1164 3667 6613 6638 3247
3759 3247 -1579 -5675 -6945 -5356 -644 4035 6468 6271 3315 -1564 -5518 -6870 -5275 -807 3835
3774 3835 6527 6211 2790 -1612 -5193 -7032 -5044 -758 3705 6512 6522 2975 -1466 -5489 -6664 -4900
3790 -4900 -647 4115 6422 6021 2887 -1653 -5427 -6975 -4991 -903 3370 6388 6217 2673 -1679
3805 -1679 -5595 -6711 -4772 -393 4158 6311 6099 2682 -1545 -5442 -6516 -4680 -722 3602 6506
3820 6506 6015 2665 -1908 -5574 -6773 -4949 -538 3989 6390 6152 3042 -1996 -5535 -6635 -4799
3835 -4799 -313 4019 6488 5989 2564 -1955 -5793 -6439 -4619 -359 4065 6596 5963 2330 -2128 -5544
3851e544q19J925M207M435J918n78l061m640l172j326K539L915M296K295n42l480
3867B368m468l379r81K109M265M562J974l87l842m345l363r69K122M437M168K227
3883F498r93l377m338l567r16K482L927M256K477q52l563m245l287q00K192M202
3899I6L809K588j282k999m593k871r46K267M070M104K197j164l549m011l686n21
3915f491K712L751M307J904p44l451m609k701p42K402M035L974J986j109l436
3930A788m294l004n36K148L969M296J924j158l324m246l182m10K261L927M090
3945D249K145j241l638l821l305n74K440L898M242J672q67l729l965l009l42K101
3961c744M306M004J688j139l541m022k968m88K277M227L852J918j310l448m305
$$ plain form
3851 -5544 -6363 -4438 -231 4204 6122 5544 2483 -2157 -5329 -6655 -4116 -201 4095 6390 5848 2368
3867 2368 -2100 -5479 -6460 -4351 -86 4476 6450 6063 2221 -2124 -5487 -6456 -4334 103 4271 6498
3883 6498 5505 2128 -2210 -5777 -6693 -4211 -284 3972 6449 5597 2034 -2211 -5498 -6298 -4106 96
3899 96 3905 6493 5211 2212 -2381 -5252 -6198 -3931 139 4243 6440 5276 1727 -2284 -5970 -6491
3915 -6491 -3779 -28 4279 6183 5439 1988 -2621 -5322 -6064 -3662 373 4347 6333 5224 1788
3930 1788 -2506 -5510 -6046 -3898 71 4367 6291 5133 1809 -2437 -5619 -6029 -3768 159 4249
3945 4249 6394 5153 1515 -2306 -5611 -6185 -3745 153 4395 6067 5200 1471 -2494 -5503 -5845 -3744
3961 -3744 562 4566 6254 5115 1574 -2448 -5416 -5904 -3627 600 4452 6370 5060 1612 -2693
3976b693k946k83K391M275L594J689j239l311m221k777l15K431M093L699J760
3991F147j085l602m348k635j64K186M040L978J221q68l766l886k691k94K903L761
4007H97L509K060j802l467m055k460m59K708M118L244J916j447l138m172l136
4022e684r9L045L647L349J600j278l489l961k882K17K447L964L477J704j677l258
4038A122m026k647j44K718L921L578J081r82l394m382k318j4K762L767L523J198
4054E763j362l301l890k553j44K676L983L171J462j302l549l745k687J94K582
4069b702L796L554J208j605l728l330k767J93K585M255K924J289j400l464l777
4084b969k362j08K805L936L248J344j431l686l998k051K61K443L606L535J324
$$ plain form
3976 -2693 -5639 -5922 -3531 744 4338 6027 4788 1477 -2744 -5521 -5836 -3405 688 4387 6147
3991 6147 5062 1460 -2888 -5523 -5687 -3501 539 4517 5738 4870 1104 -2782 -5473 -5767 -2864 897
4007 897 4406 6466 4664 1197 -2858 -5318 -5777 -3069 1049 4293 6209 4762 1624 -2548 -5684
4022 -5684 -5783 -2738 909 4258 5858 4580 1091 -2870 -5752 -5535 -3088 876 4353 6057 4380 1122
4038 1122 -2904 -5551 -5695 -2977 944 4522 5603 4621 1227 -3155 -5473 -5487 -2725 1042 4565 5763
4054 5763 4401 1100 -2790 -5343 -5487 -2811 1172 4343 5805 4503 954 -2791 -5478 -5284 -2702
4069 -2702 1094 4648 5856 4251 523 -2807 -5574 -5381 -2796 1459 4383 5672 4272 808 -2969
4084 -2969 -5331 -5439 -2634 1302 4550 5894 4463 777 -3221 -5272 -5011 -2568 1038 4573 5897
4099E897j998l388l713k311J95K817L678L343J116j819l172l807k315K88K476
4114b713M018L175J043j553l093m367j883K78K730L798L079J371j790l482l965
4129c354k094K04K844L771L274P07j745l209l449k486N89K518L741L200R24j569
4145C866l560l244k395L03L139L450L191P12j585l056l998k209L00K927L707L021
4161D569Q96j634l755l309k279O63L056L346L120O22j569l194m137j978O07K847
4177b129L932K814P29j862l505l157j926L45K714L640K764O96j413l593l239k066
4193e256L38K996L780L075L89j861l335l735j784R79K503L575K974N87j688l441
4209I6l640j693N85K721L596K913P10k005l229l657j839Q50K938L601K656O43
$$ plain form
4099 5897 3899 511 -3202 -5513 -5318 -2501 1177 4520 5636 3817 645 -3162 -5477 -5189 -2713
4114 -2713 1305 4480 5523 3970 877 -3490 -5373 -5095 -2365 1433 4512 5883 4093 611 -3354
4129 -3354 -5448 -5244 -2400 1371 4645 5352 3607 398 -3051 -5537 -4948 -2430 1311 4511 5435 3866
4145 3866 306 -2938 -5333 -5030 -1891 1559 4750 5462 3877 821 -3177 -5386 -5086 -2159 1548 4569
4161 4569 5465 3831 76 -3233 -5512 -4849 -1793 1553 4673 5295 3726 532 -3605 -5583 -4976 -2129
4177 -2129 1803 4617 5346 3484 -21 -3178 -5104 -4759 -2045 1595 4359 5055 3642 49 -3190 -5256
4193 -5256 -4918 -1922 1858 4933 5322 3461 126 -3609 -5393 -4414 -1911 1664 4638 5225 3537 96
4209 96 -3544 -5237 -4652 -1931 1665 4578 5288 3283 54 -3603 -5442 -4592 -1654 1947 4603 5246
4225E246j840l567l125k096O17K894L819K645O36j755l478l648j316M78L069L315
4241A894K697J86j414l433l402j525L44L054L419K779M63k017k998l706j423N92
4257d490K971L325K731O61j923l630l149j692P96L078L586K111P34j994l365l039
4273c289k073J105K886L439K543L66j978l423l176j541R23K844L445K635N43k458
4289B791l113l307j542Q94K926L666K405K42j850l685l034j428P41K953L467K492
4305D618K50j572l918k837j569J012K514L665K433P8j641l727k759j495J134K613
4321a201L156K452K04j783l635k934j463J093L106L062K506L41k185k984l444
4336c709j435J388K732L342K227L02j930l492k906j648R91K937L591K031L85k228
$$ plain form
4225 5246 3406 -161 -3286 -5382 -4765 -1871 1948 4593 5229 3474 -4 -3652 -4968 -4490 -1421 1894
4241 1894 4591 4777 3363 -70 -3472 -4997 -4653 -1599 1820 4599 5062 3045 47 -3659 -5082 -4490
4257 -4490 -1519 1806 4537 5198 3275 -355 -3504 -5196 -4400 -1322 2264 4375 5109 3115 -250 -3289
4273 -3289 -5362 -4257 -1371 2068 4611 4977 2999 -424 -3600 -5141 -4218 -1374 2071 4706 5249 2791
4289 2791 -322 -3629 -5171 -4277 -1351 2315 4720 4962 3112 -573 -3607 -5035 -4294 -1341 2126 4618
4305 4618 4868 3296 -622 -3459 -5028 -4016 -1502 2163 4596 4674 3033 -694 -3453 -4948 -3814 -1201
4321 -1201 1955 4407 4611 2828 -807 -3741 -5204 -4111 -1005 2057 4563 4904 2719 -265 -3709
4336 -3709 -5144 -3756 -1024 2318 4545 4847 2917 -575 -3481 -5129 -4138 -1201 2390 4421 4806 2578
4352B578l441k770j282R61K940L216K270M04k251l258k982j488Q31L370L076K158
4368D332L83k051l183l329j139J180K846L513J906K01k069l464l063p62Q94K929
4384h76L164J934J85j876l330l028q68J026K706L622J935j89j840l268l342q99
4400d944J540K638L201K149K09k293l017k833j245P79L472K667K156L96k528l069
4416g22l135r27J234K721L419J872n5k022l515k697p58J306K799K950K280l53
4432D397k314l097k600j224J109L089L407J941l50k472k643l029q60J247K597
4447h02L482J456K06k312l132k683p49J296K759L014J799nk281l312k690p29J536
4464c147K844K840J898k21j970l430k815o35J052L197L171J577J48k214l518k803
$$ plain form
4352 2578 -863 -3633 -4915 -3954 -1014 2202 4472 4876 2625 -633 -3615 -5103 -4272 -902 2174 4332
4368 4332 4715 2664 -519 -3848 -4987 -3807 -961 2552 4458 4659 2590 -874 -3937 -4699 -3805 -876
4384 -876 2288 4222 4407 2531 -799 -3827 -4695 -3669 -963 2659 4594 4405 2565 -703 -4045 -4944
4400 -4944 -3404 -766 2435 4584 4793 2500 -517 -3350 -4595 -3816 -344 2323 4479 4875 2347 -722
4416 -722 -3857 -4784 -3550 -829 2590 4462 4407 2385 -1130 -3827 -4585 -3279 -480 2470 4750 4397
4432 4397 2083 -1014 -3614 -4838 -3729 -640 2767 4708 4358 1886 -757 -3786 -4646 -3399 -802
4447 -802 2680 4136 4342 2030 -1102 -3785 -4534 -3238 -479 2535 4334 4329 2048 -1264 -3954 -4683 -3147
4464 -3147 -303 2537 4435 4214 2244 -1186 -4001 -4636 -3584 -387 2784 4361 4509 2295 -1223 -4026
4480d026n58J473K683K941K091n67k129l248k428m66J010L193K800J471j53k162
4496A925l081k437o42J014K651L289J745p18k037k657k820q55J333L037L058J715
4512D520l33k416l092k384n84R95K956L237J480l20k368l042k232j018J773K418
4528d10K962J819l33k394l219k108n45J297K613K996J569j23k262l175k538o77
4544d528J461L000K741J727o05k330k894k274p67J585K432L126J529k95k109l446
4560a647k262n67J593K836K934J388m17k104l368k197q54J644K753L340J111o00
4576C583k091l067k406k96J565K740K887J205j10k465l012k493N0J187K897K421
4592B595J669n67k350k892k373n6J217K746K773J288l16k461k635k479n33J378
$$ plain form
4480 -4026 -4584 -3111 -428 2513 4604 4037 1908 -1340 -3768 -4234 -3224 -31 2769 4240 4087 1925
4496 1925 -1156 -3593 -4235 -3221 -570 2719 4464 3746 1709 -948 -3768 -4623 -3290 -253 2805 4520
4512 4520 4187 1771 -1321 -3705 -4289 -3294 -338 2899 4379 4059 1691 -1351 -3583 -4601 -2828 -410
4528 -410 2552 4371 4038 1644 -1575 -3683 -4228 -2931 -318 2678 4247 4124 1862 -1313 -3851 -4528
4544 -4528 -3067 -67 2674 4401 3796 1466 -1428 -3702 -4469 -2884 -452 2674 4203 3908 1799 -1647
4560 -1647 -3909 -4476 -2883 -47 2887 4275 3858 1754 -1614 -3811 -4665 -3021 -268 3072 4183 3583
4576 3583 1492 -1575 -3981 -4277 -2712 28 2915 4120 4010 1545 -1467 -3960 -3910 -2723 174 2595
4592 2595 4264 3697 1347 -1545 -3918 -3974 -2757 -11 2762 4050 3734 1273 -1362 -3841 -4374 -2996
4608b996L243K764J383j026j775l162k476o8J792K707K691J043p81j851k970k241
4624c723p81J927K781K826J005l32k348l184j923m92J597K822K779J299p55k121
4640A377l084k323r4J751K574L025R06k96k386l355j772k77J539K694K845Q43
4656C967k53k474l121j818m5J242K745K710J021n04k212k964k340j94J719K681
4672A60L155P63o66k619k625j941j14J498K641K851J126j015k271k488k203l4
4688c782J479K341L004J034o68k333l049j556n41J830K707K733P14o81k203l167
4704b138j867R3J943K612K171J419r43k445k720j806k17J377L457K207R50r87
4720C106k579k471j992K6J975K490K503Q98o73k340l070j695o6J838K763K262
$$ plain form
4608 -2996 247 3011 4394 3368 1593 -1569 -4045 -4113 -2321 386 3077 4120 3339 1488 -1482 -3723
4624 -3723 -4504 -2577 204 3030 4035 3703 1355 -1829 -3752 -4244 -2647 175 2954 4253 3498 1377
4640 1377 -1707 -4030 -4124 -2373 201 3226 4132 3836 1450 -1905 -3677 -3954 -2415 279 3124 3967
4656 3967 3714 1240 -1881 -3699 -3744 -2502 243 2953 3974 3470 1258 -1706 -4046 -4240 -2521 160
4672 160 3315 4078 3412 793 -1832 -3773 -3887 -2389 252 3103 4229 3214 943 -1545 -3748 -3782
4688 -3782 -2303 38 3042 4076 3408 1075 -1974 -3530 -4071 -2241 466 3199 3913 3232 1029 -2138
4704 -2138 -4005 -3912 -1969 643 2814 4233 3290 845 -1875 -3681 -3898 -2521 936 3143 4093 3106
4720 3106 527 -1944 -3936 -3910 -1935 555 3058 3956 3283 943 -2127 -3822 -3888 -2050 713 2975
4736B975J173q85k435k727k073N3J828K579K722O72q80k506k742j728K75J557
4752b142K867K253J078r86k344k829j441Q3J416K725K357J091r53k486k583j919
4768c813j06J888K932K424P02r03k335l052j585P9J835K810K228J119j124k356
4784G43k894j503NJ697L175J891P82o92k617k795j518K95J791K584K148R44j101
4801B935k421k368j803K91J618K701K045P47r38k395k511j757N07J575K436K699
4817C361P5m72k620k471j154k66J849K412K384P46j288k030k815j417K64J891
4833a551K443K233N71r14k033l046j404J71J836K674K411M21r40k558k543j320
4849c549K79J683K682K191L03j001k563k495j073J27J966K688K075M34j280k650
$$ plain form
4736 2975 4148 3263 828 -1899 -3972 -3919 -2091 488 3210 3882 3002 496 -2246 -3974 -3699 -2142
4752 -2142 725 2978 4056 3070 726 -2103 -3544 -3461 -2045 680 3037 4128 3175 689 -1894 -3813
4768 -3813 -3919 -2031 901 3325 4027 3124 789 -2263 -3848 -3769 -1934 876 3104 4223 3099 743
4784 743 -2151 -3654 -3649 -1952 1223 3114 3896 3204 587 -2208 -3726 -3431 -1640 944 3092 4036 2935
4801 2935 514 -1854 -3657 -3366 -1748 953 2998 3745 2807 412 -2099 -3856 -3349 -1774 662 3361
4817 3361 3436 2964 344 -2127 -3281 -3547 -1698 714 3098 3844 2556 526 -2289 -3706 -3442 -1551
4833 -1551 892 3125 3696 2782 749 -2297 -3701 -3530 -1694 980 3391 3812 2872 314 -2229 -3549
4849 -3549 -3270 -1587 1095 3286 3589 2588 25 -2470 -3543 -3416 -1450 1238 3313 3747 2467 -183
4865a83k187j390L90J700K839K004O68j478k047k415j782M78K254K162K364P73
4881D150j844j920k795j096n6K280K330J916P80j190k578k205j462M22J881K341
4897I54K462K54j321k179k712j007K17K004K412K044N12j207k343k642j075K92
4913c335J632K972J913L21j038k466k507j280N62J998K495J954K13r67k482k465
4929b480j411R46J882K251J811K30p92k767k194j072M19J997K730J449O15j234
4945B380k359k635j256R36J919K617J570J40j033k378k542p77L59K060K481J712
4961C194P13j805k168k631j012N29K281K429J637M73j562k149k366r80M33J719
4977a265K730J912K2j475j814k622j141Q72J691K503J816L89j738k262j946j403
$$ plain form
4865 -183 -2370 -3760 -3370 -1670 1169 3173 3841 2363 316 -2099 -3881 -3403 -1149 1013 3377 4150
4881 4150 2306 386 -2409 -3505 -3561 -1281 1049 2965 3745 2555 -23 -2228 -3690 -3268 -1387 954
4897 954 3416 3670 2349 170 -2542 -3549 -3332 -1328 1084 3128 3640 2433 90 -2552 -3627 -3335
4913 -3335 -1703 1269 3182 3503 2465 -1 -2508 -3788 -3226 -1228 1267 3221 3434 2467 -15 -2480
4929 -2480 -3891 -2945 -1063 1188 2999 3229 2437 -330 -2524 -3596 -3177 -1180 1550 2999 3614 2380
4945 2380 21 -2614 -3870 -2934 -1015 1602 3172 3312 2279 -99 -2641 -3418 -3059 -999 1482 3194
4961 3194 3907 2102 -66 -2697 -3709 -3180 -899 1530 3167 3640 2078 -71 -2437 -3417 -2984 -1265
4977 -1265 1465 3377 3399 1924 110 -2512 -3653 -2781 -1090 1413 3229 3618 1880 -382 -2328 -3731
4993c731Q15J884K381J849j19j017k253k252j243O14K016K530J726N30j595k273
5009a38k316j104P34J714K613J526J21j488k145j865j285O72K229K393J534L2
5025C227j198k429k379o78N31K148K571J508Q2j660k090k184n96K30J930K780
5041A793J366M2j437k251j846j098O97K096K101K172j95j800j966k078j028P15
5057b717K068K444J183K43j260k535j850j402R05K418K136J500J76j698k174j782
5073b345q94N61K247K279J406O6j362k681j725q83P27J826K497J196L46j543k415
5090f97j798q87R40J801K202J650J14j755k212k220o70M97K625K249J313k03j414
5107A535k293j775q71O88K394K335J284j74j473k573j980o72J067K230K158J436
$$ plain form
4993 -3731 -2916 -1032 1349 3198 3079 2062 -191 -2443 -3686 -3072 -1056 1474 3200 3730 2135 -138
5009 -138 -2454 -3558 -2824 -1110 1503 3029 3150 1662 -483 -2348 -3633 -2961 -732 1661 3195 3227
5025 3227 2029 -400 -2779 -3457 -2926 -778 1793 3301 3383 1723 -367 -2551 -3147 -2917 -987 1793
5041 1793 3159 3201 1764 -487 -2333 -3431 -2734 -638 1463 3635 3440 1640 -326 -2404 -3432 -2717
5057 -2717 -649 1795 2978 3221 1961 -574 -2424 -3826 -2921 -503 1633 3133 3309 1611 -563 -2345
5073 -2345 -3239 -2678 -431 1848 3254 3320 1958 -723 -2448 -3331 -2604 -778 1719 2915 3261 1718 -697
5090 -697 -2495 -3382 -2442 -641 1561 3211 3325 1570 -642 -2862 -3532 -3035 -410 1839 3152 2949 1535
5107 1535 -758 -2533 -3404 -2716 -322 2013 3297 3123 1650 -923 -2903 -3575 -2508 -278 1880 3316
5123C316q2j487k316k227o13R19J857K406J604k83j396k512j790q26Q64J937K236
5140A607J555k12j522k029k017o47Q12K153K237J243k3j599k212j914p57R88J856
5157d81K431J218l70j757j477k336o13J010K244K086J275j08j693k537j505n88
5173c201R19K118K036J354m66j483k292j632m82Q97J741K216J540l64j980k045
5189a124j499n73J091J680K287J378l11j535k487j667k43Q62K080K038J366l76
5205B967j721j961j721q21J230J861J910J582o06j448k472j351n23R69K100J881
5221A876R34J02j483k500j247o61J171J482K414P72m9j716k156j353p29J193J697
5238b53K207J117j77j868k065k115J12Q24K104K008J269n94j599j924j750k63
$$ plain form
5123 3316 3234 1747 -569 -2796 -3409 -2490 -633 1773 3377 3094 1698 -814 -2604 -3430 -2566 -629 1607
5140 1607 3162 2950 1428 -601 -2618 -3265 -2453 -300 1937 3180 3157 1558 -654 -2568 -3325 -2337 -481
5157 -481 1950 3168 2798 1041 -436 -2772 -3385 -2375 -131 1955 3230 3122 1429 -1108 -2613 -3201
5173 -3201 -2282 -164 1872 3226 2760 1277 -1015 -2647 -3129 -2232 -491 1725 3265 2901 921 -1124
5189 -1124 -2623 -3196 -2105 -425 1862 3240 2929 1394 -1093 -2760 -3003 -2141 -61 1977 3343 2967
5205 2967 1246 -715 -2436 -3257 -2027 -166 1744 3326 2720 1272 -1200 -2551 -3074 -2105 -5 1876
5221 1876 2810 2912 1429 -1071 -2318 -2979 -1808 -326 2088 2860 2811 1095 -1061 -2414 -3143 -1950 -253
5238 -253 1954 3071 2894 1026 -1039 -3154 -3042 -2218 -114 1894 3163 2569 970 -954 -2704 -2967
5254b967J236J711J820J384m68j784j885j390p32J051K298J990Q14n25j514k132
5270a093j403n16J118K082J753Q18j28j544k300j517n94J612J626K012J056j39
5286B843j772k075j693l88J131K003K124P28l38j582j919j690o26J465J967J787
5302A965R46l53j624j950j436o02J356K238J640N40n0j967k114j510J95P58K145
5319A77J540J391r19j668j758j612K9R56J747K280R20o24j286k634j401K81Q07
5336a774K144J690Q19p40j079k373j495j93J355J834K054Q16o00j909j924j392
5352b767J60J042J913J581O27k55j640j775j849K45J257J368K106P98k26j792
5368G93k268j446K06J304J685K049M87n55j827j877j244J24R21K089J850O82q13
$$ plain form
5254 -2967 -1731 -20 1800 3184 2716 932 -953 -2343 -3075 -2024 274 2264 3078 2553 1039 -1093
5270 -1093 -2496 -3012 -1894 188 1941 2759 2631 1087 -1213 -2730 -3324 -1712 -86 1926 2982 2843
5286 2843 1071 -1004 -2697 -3085 -1954 49 2173 2901 2563 981 -938 -2628 -3254 -1789 178 1965
5302 1965 2911 2558 934 -1016 -2452 -3054 -1698 540 2180 2720 2670 703 -1411 -2921 -2726 -1968 177
5319 177 1717 3108 2189 521 -1237 -2849 -2820 -1864 -117 2163 3083 2459 1173 -1461 -2862 -2581 -1774
5336 -1774 370 2060 2879 2139 1060 -1313 -2808 -3001 -1646 188 2242 3058 2458 549 -1375 -2767
5352 -2767 -2607 -1565 348 1929 2556 2301 661 -1114 -2963 -2718 -1461 -93 2013 2811 2585 793
5368 793 -1475 -2921 -2715 -1411 274 2323 2810 2255 428 -1449 -2693 -2569 -1648 441 2291 2973 2160
5385B160j394k083j140l86J109K425J345O81m57j605j847j557J03J282J548J770
5401A954J168r52j672j964j368L21J216J610J769N78m03j832j971j044j40J610
5417a120J910J447L45j69j785j788j642J07J371J673J667Q21o97j627j896j333
5433b716M1J046K139J821O08p97j828k023q39R2J226J800J708N18q44j549j847
5450a444j122n4J115J815J905L44p30j350k007j184M3J360J985J404P48j127j328
5467C73k004q64k27J473J931J383O76m52j918j784j532O31J043K080J571N56q26
5484B110k052j585j266J86J372J683J562R31r40j490j953j241M5J551J804J416
5500B133O65j087j174k121j031K89Q92K224J620K34p15j719j867j072K31J445
$$ plain form
5385 2160 766 -1317 -2457 -2843 -1734 691 2036 2717 2260 655 -1192 -2749 -2646 -1364 184 1954
5401 1954 3122 2170 498 -1466 -2834 -2513 -1297 313 2082 2660 2257 425 -1546 -2590 -2730 -1120
5417 -1120 790 2237 2582 2413 628 -1160 -2802 -2695 -1324 349 2016 2837 2140 513 -1383 -2716
5433 -2716 -2675 -1629 510 2331 2939 2142 314 -1709 -2548 -2456 -1230 570 2278 2796 1952 403 -1444
5450 -1444 -2566 -2620 -1505 310 2215 2559 1829 479 -1528 -2712 -2669 -1309 676 2080 2828 1701 373
5467 373 -1631 -2495 -2722 -1249 682 2065 2741 2289 371 -1413 -2945 -2314 -1271 809 2380 2936 2110
5484 2110 58 -1527 -2793 -2607 -1235 448 2010 2941 2001 511 -1442 -2683 -2638 -1087 717 2133
5500 2133 2798 1711 537 -1584 -2615 -2326 -1434 790 2410 2644 1929 210 -1657 -2729 -2498 -1053
5516a053K083J172P21j063j579k249m93K78Q96J832J684N52j087j619j706j023
5532b654K03J366K085J179M89p71j822j858p15L23R68K157J101P67j193j514j908
5549a797r88K95J653J696J356N85q90j750j861q73L99J187J733J319L76p74j901
5566b35j504q50L39J217J993J137L44o13j810j639q82K46J358J799J573K00r76
5583A697j416j991p66P7J565J617J787k52r87j516j528q51M05J186K034J238M99
5600B798q47j733k094o07P24Q71J854J398L70j100j593j754r17K97J795J387J181
5617B030N40j003j702j813m64J50J769R38J550N46r24j612j536r59L52J521J482
5634H65J350J99j125j682j490q61P61J459J467J470L59j217j670j826o04M07J463
$$ plain form
5516 -1053 1030 2202 2923 1860 281 -1968 -2461 -2183 -1287 545 2229 2781 1694 75 -1631 -2654
5532 -2654 -2451 -1085 1000 2179 2668 1897 75 -1783 -2498 -2175 -1207 950 2051 2818 1625 111 -1797
5549 -1797 -2785 -2490 -837 859 2215 2800 1910 160 -1701 -2574 -2175 -988 745 2064 2440 1666 -235
5566 -235 -1739 -2589 -2250 -1033 960 2097 2441 1828 18 -1621 -2503 -2257 -899 900 2473 2673 1697
5583 1697 281 -1710 -2476 -2399 -834 783 2570 2318 1331 -185 -1713 -2564 -2159 -973 1061 2299 2798
5600 2798 1951 218 -1876 -2483 -1759 -888 966 2364 2734 1634 41 -1713 -2630 -2333 -538 849 2030
5617 2030 2570 1567 -135 -1948 -2412 -2262 -493 445 1995 2541 1617 5 -1531 -2490 -2138 -617 865
5634 865 2215 2414 1289 -393 -1883 -2744 -1983 -524 943 2413 2772 1555 -115 -1941 -2545 -2138 -675
5651f75J616J465J72j461j361j363o49L34J368J826J037K74p63k026j462p33N50
5668a851J126J639J228J96o67j786j605n41K80J145J738J088O03r45k059j329
5684a740m00R2J574J619J287Q2j189j765j591o45O38J549J545J373K0j211j162
5701G6k056l87M41J200J999P59J24o74j584j492q33N81J409J376J231K25j074
5718A321j731j340n25K44J667J544J125k10p81j728j735m65K57J831J534J000
5734B008K95j127j541j391m89L47J659J467J204k97p13j653j503o78N37J536J519
5751A180J110K0q57j646j455o17L04J710J628N81L46j141j489j778l01P39J321
5768c45J502J125m5j056j847j230o07P93J684J105J198j36j048j545j455k04L98
$$ plain form
5651 -675 941 2406 2578 1117 -244 -1607 -2256 -1922 -554 1272 2309 2583 1820 -206 -1668 -2401 -1851
5668 -1851 -725 914 2142 2338 1671 -115 -1720 -2261 -1981 -836 902 1990 2593 1648 -411 -1740
5684 -1740 -2140 -2048 -474 1145 2432 2514 1325 -440 -2031 -2676 -2038 -489 1056 2429 2449 1238 76
5701 76 -1980 -2367 -1926 -726 1273 2032 2156 1482 -102 -1594 -2427 -1846 -437 939 2170 2395 1321
5718 1321 -410 -1750 -2275 -2031 -364 1180 2305 2095 1314 -414 -2149 -2614 -2357 -526 1008 2008
5734 2008 2303 1176 -365 -1756 -2245 -1898 -239 1228 2432 2135 1422 -231 -1734 -2412 -1875 -339 1180
5751 1180 2290 2310 1453 -193 -1648 -2265 -1961 -251 1377 1958 2304 1163 -326 -2104 -2405 -1666 -345
5768 -345 1157 2282 2237 1181 -666 -1896 -2503 -1710 -26 1079 2277 2141 1093 -452 -1907 -2111 -1713
5785a713J641J054Q27M10j053j653j270r15N45J788J681J012k17r96j571j341
5801a771n73M04J506J659Q51K64j062j579j419m33N73J367J446R56j62j183j321
5818d77j319o71P04J369J554J185m04o49j670j401m20O77J300J559P21j84r24
5835I50j433j331l78M56J647J420P02j10j232j310j361k80P07J399J338R77j81
5852A980j015j485j329l92M99J576J164J220k87q75j482j365j03J55J667J333
5868A261J115m34r97j519j374l49Q60J192J559O72j50o85j676j145o18R15J447
5885G4J217R10r0j359j350j252l02O36J206J583R38m14q36j896r75k96R13J107
5903a86J287Q86K02j372j397r42m02L85J701J290P74l92p47j689j213k58M60J731
$$ plain form
5785 -1713 -72 982 1809 2219 1166 -487 -1757 -2672 -2127 -339 1342 2354 2137 1141 -430 -1771
5801 -1771 -2344 -1940 -434 1225 2076 2340 1278 -301 -1720 -2153 -1580 -213 1233 2189 2027 844 -477
5818 -477 -1796 -2467 -1763 -394 1160 2345 1941 1292 -378 -1779 -2199 -1522 -222 1337 2058 1874 950
5835 950 -483 -1814 -2192 -1736 -89 1331 2033 1923 691 -619 -1980 -2260 -1553 -154 1184 2161 1980
5852 1980 965 -520 -1849 -2241 -1742 -166 998 2218 1931 1056 -426 -1791 -1894 -1739 -72 1261
5868 1261 2376 1942 945 -574 -1948 -2297 -1437 -245 1314 1986 1836 1151 -525 -1670 -2288 -1373 74
5885 74 1291 2201 2111 752 -598 -1850 -2152 -1516 -310 1273 2211 1797 961 -935 -1910 -2206 -1293 -186
5903 -186 1101 1987 2189 817 -580 -1522 -1924 -1539 162 1452 2226 1834 1087 -602 -1815 -2073 -1613 118
5921A18J248Q91n04j284j175j202l73J383R79J585M95k44j208j465j123l50P99
5938a430J436J483P87k76j152j589j238k06Q23J428J151Q36k74j219j243j238
5954a921l72J069J337J304P60l87q97j706j017rO45J566J154N64m76r61j449j251
5972b047k14R28J198J501P13o6j571j141j134r1R40J038J380Q56n96j527n78j204
5990a615n52P64J325J504M75J0j167j548j124k21R23J586J279L87m06q30j727
6007i37p38m51J103J381R94N18k47j021j330j241q4O30J469J363O31l27j320j173
6025g80j188J06Q56J358J190N87l40j091j600j029R0P25J234J495O86o15j204
6042D80j566r14P2P21J255J528N03m33j490j061q19j43Q64J243R74R73o46j238
$$ plain form
5921 118 1366 2257 1753 469 -706 -1908 -2281 -898 81 1666 2161 1917 709 -756 -1879 -2229 -1430
5938 -1430 6 1489 2276 2000 848 -741 -1979 -2185 -1362 66 1217 2053 1779 560 -683 -1921
5954 -1921 -2293 -1224 113 1417 2177 1790 893 -813 -1830 -1839 -1194 372 1526 2090 1614 653 -796 -2047
5972 -2047 -2261 -1333 -135 1366 2079 2013 442 -699 -1833 -1924 -984 54 1434 2290 1694 167 -411 -1615
5990 -1615 -2167 -1403 -78 1426 1901 1911 744 -804 -1928 -2149 -1226 360 1639 2026 1620 790 -937
6007 -937 -1675 -2126 -1023 358 1352 1870 1623 602 -728 -1969 -2053 -1423 46 1409 2040 1713 393 -780
6025 -780 -1968 -1862 -1006 352 1542 2129 1789 698 -902 -1931 -1841 -1116 118 1613 2299 1684 480
6042 480 -1086 -2000 -1928 -1207 48 1576 2079 1646 156 -905 -1724 -1867 -1003 240 1214 2187 1541 303
6060C03j126r65LR79J127J296K98l92j040j497p33r6J082J432R75K22l45j111
6078D12j470q27J86O47J405J109L92l22j365r14j202m1J203J022J206O66p19j180
6096B08j201r13J67Q54R47J497L11l60j339j146p24r1R65J383J218ok12j540p53
6115g35r98K49N14J375Q02N07m01j106r60q62m82J074J526R92L55m68q57j582
6133a057r43L76N48J403Q09R44p67j350n71j092O9N71J536J098J47o48q39j242
6151a008j029K90R72J058J063K76k66j090j191q74N0J028J354N97P74p83r71j103
6169h53p77m0J233J121O60K39n6j376j190n87k55J287J376R52K17m77j538j043
6187a107n47L02L69J594R45Lk39j285j037r39N44Q83J189R35l0m22j113j129q69
$$ plain form
6060 303 -823 -1788 -1785 -806 321 1617 1915 1523 483 -1014 -1747 -1843 -761 671 1646 1868 1523 412
6078 412 -1058 -1885 -1699 -1052 353 1462 1854 1532 167 -747 -1949 -1990 -787 235 1441 2107 1388 208
6096 208 -993 -1906 -1739 -885 62 1559 1870 1510 171 -975 -1699 -1790 -825 558 1776 1770 1558 18 -735
6115 -735 -1733 -1484 -970 405 1207 1714 1313 207 -753 -1615 -2097 -1023 503 1495 1850 1382 525 -1057
6133 -1057 -2000 -1624 -1076 327 1136 2080 1313 -37 -608 -1700 -1631 -1060 476 1574 1721 1073 234 -1008
6151 -1008 -2037 -1747 -775 283 1346 1622 1356 266 -925 -1799 -1749 -721 633 1230 2004 1221 250 -853
6169 -853 -1630 -1670 -437 684 1344 1583 1527 151 -1039 -1626 -1881 -594 782 1734 1951 1474 -64 -1107
6187 -1107 -1654 -1352 -983 611 1556 1559 1320 35 -1002 -1941 -1397 -514 675 1610 1580 1158 45 -1084 -1953
6206a953K37Q76J256J006N88r33q07j146r41L80O33J402O36P94o54j408p95j024
6224a853M46N99J594R06Q3k78j300j339o38J20J198J138Q41J97n93j141r27p24
6242a671J31R85J098J022N3m37j186j182m38J02R32J302O48M19n68j106j558k09
6260a663K87P89J174Q74K57m00j316j071p89q3J403J073Q99K91o45j018j216o22
6278a776M7J414R76O30N98q14j075j019q64K19R86J636Q12N5n45j064j201m77
6296a462Q5J187N92Q17N29q57j165p77n51L93Q34J246Q75J19q09j119r38q61L20
6315a542R44J291J100l28k96j193j245l85J13R11J632M89L60j178j058q20p43
6332a948O07P44J566R17n6q51j242j021k92J0J290Q12Q31L38p66j021j271m84
$$ plain form
6206 -1953 -1716 -840 416 1422 2010 1077 270 -876 -1817 -1437 -804 598 1234 2028 1374 -34 -829 -1853
6224 -1853 -1407 -808 786 1692 1775 1497 197 -1142 -1780 -1660 -462 676 1517 1714 1121 -20 -947 -1671
6242 -1671 -1540 -555 543 1565 1618 1181 -5 -1187 -1625 -1523 -591 711 1359 1778 1210 104 -1454 -1663
6260 -1663 -1376 -587 587 1461 1718 1318 2 -1069 -1858 -1941 -538 535 1434 1725 1080 62 -1154 -1776
6278 -1776 -1729 -315 661 1291 1889 1075 0 -1019 -1883 -1664 -678 958 1770 1825 1280 216 -985 -1462
6296 -1462 -1377 -190 402 1219 1748 891 -274 -1051 -1602 -1209 -375 871 1746 1865 1056 -63 -1001 -1862 -1542
6315 -1542 -598 693 1793 1465 1169 -24 -1269 -1654 -1541 -630 1002 1491 1851 673 -385 -1205 -1948
6332 -1948 -1341 -597 969 1886 1830 979 -263 -1284 -1576 -1566 -276 536 1367 1705 939 -82 -1353 -1837
6350a837N18Q82J365N31L14q69j188j310k41L94R63J450O30M6n05j410n59j155
6368a981O89R44J039P12j2m04q62j389l68J86J030J468N13P0p02r72j400m67L05
6387a601J307R63Q15K8l58j632r45Q5J26J004Q09P30J98p61j095r67n22M83Q07
6406e26J432P19J95r49j136p81o57M40O83J315P98K1q00j233p32l75M97R78P57
6425F46J020N3r59r43j012k22O3J042J408L68jp08j204q92j94L43R02J035R25
6444A670m33n64j067n76m42J4J100J224N30m9o96j136q15k07L71P20J045J123
6462A812j16j156j052l48n76K42J137J099N09l80l76j091j022mM18O54R40P44
6480A434n1o33j156q83j48K95P23J553N40m45n37j059j016j14M79O07J130M81
$$ plain form
6350 -1837 -1319 -437 928 1459 1773 904 -284 -1594 -1835 -1441 -478 972 1602 1648 1143 -267 -826 -1981
6368 -1981 -1292 -348 691 1403 1391 987 125 -1264 -1632 -1446 -416 1052 1565 1635 933 -39 -1439 -1906 -1601
6387 -1601 -294 669 1484 1512 1154 -478 -1423 -1338 -1212 -208 601 1331 1529 768 -327 -1294 -1816 -1333 -526
6406 -526 906 1625 1820 871 -265 -1046 -1703 -1263 -580 735 1533 1554 754 -479 -1211 -1586 -1089 -111 646
6425 646 1666 1719 760 -183 -1195 -1417 -1354 -312 1096 1464 1463 755 -449 -1341 -1535 -1192 -290 745 1670
6444 1670 1237 673 -394 -970 -1412 -1398 -298 926 1456 1407 711 -425 -1240 -1447 -1076 -356 689 1812
6462 1812 1696 540 -512 -860 -1436 -1194 -57 1042 1551 1171 795 -296 -1318 -1322 -904 -250 690 1434
6480 1434 1383 750 -406 -1289 -1437 -1142 -419 1134 1674 1229 692 -367 -1383 -1497 -1018 -411 719 1200
6498A200P5q66q93p75m99P65J026R05N58o4q30j045o59p19O74R20J259K50J40
6517A422r42p01j073l23M94J155N43P72K5p32j239o95n56R39J248M39P74m00l90
6536G60j090n55o97M16R42J043P23N6j048j063n13l61L83Q91R61L81N9m90j344
6555e46r66k02P40Q03J055O98j00j054j033o96l66P06J126O90N53k28p32o48j019
6574a219N2K77R22Q81L51l60m49p46r83k23L82J178O50P20K2p20j395p03N1M25
6594h87R04R03O46k16o55j436p66J10K85R77Q13P91j03o98q70r04m55P53P05J125
6614A022L93l4q32r54o14l91N18P89J141L46o0j017o89r06j2M50Q55R51R2K95
6634A343j035p97q32j51M17J155R32N23n12o55n57j025l05P77O95J001K21j43
$$ plain form
6498 1200 1275 409 -484 -1259 -1758 -993 33 938 1496 1432 602 -443 -1102 -1821 -1147 -227 1032 1282 1422
6517 1422 480 -221 -1294 -1617 -1123 32 575 1347 1372 640 -599 -1294 -1850 -911 337 776 1550 1150 760
6536 760 -330 -885 -1582 -1166 -224 819 1542 1598 550 -513 -1026 -1387 -1004 -113 848 1229 1288 798 -546
6555 -546 -1512 -1714 -974 -171 884 1582 1482 428 -605 -1301 -1667 -961 165 855 1408 1180 448 -200 -1219
6574 -1219 -1167 -890 32 913 1264 904 455 -291 -1274 -1497 -1115 63 713 1433 1455 735 -660 -1363 -1312 -887
6594 -887 17 920 1566 1350 695 -741 -1507 -1397 -1112 -135 678 1469 1366 668 -202 -1106 -1561 -808 -103 1022
6614 1022 1415 1381 549 -405 -1019 -1410 -892 -103 1038 1384 1324 307 -382 -1288 -1300 -850 5 956 1048 1343
6634 1343 308 -489 -1321 -1472 -1055 100 1032 1555 1043 388 -169 -1194 -1499 -722 -27 974 1195 1052
6652A052n56j103q24N7Q15O38J231o9L9o94j248o06j75N67R70Q83L35l13n49q17
6672c67q42j39L70J197R40M17p94p16o30q01q2P21Q94J124J23j81q92r55o51k35
6692a499P16J204L93O42l63r84o79j019K71M71J321L74N29k51p43o82r84j98Q36
6711f45R05N39N45l78q07q17m37j42N49J042O45M26m37r36p00n78J07M71O78Q17
6731H47M84k82p24j038n98k6O72O47J097J30k31n74r98p14R1L75R84J076O2o6
6751A214j078p23r37N56K83O58J316M4k89p74q44o68Q0N62Q62P68P03o27q49r88
6771g31m14j38P17R77K91O16j63p93r18o32j30O24Q69J188j26k17p87q03o80l6
6791a286P55Q31J018P2k41p96r82o79J50P33P63N89J33J7j229o41l84k6P11P88
$$ plain form
6652 1052 496 -607 -1431 -1374 -559 79 1310 1241 1280 586 -662 -1268 -1443 -876 94 977 1312 999 450 -367
6672 -367 -1209 -1348 -978 219 1159 1576 782 66 -564 -1365 -1447 -726 168 1292 1415 1234 342 -613 -1264 -1499
6692 -1499 -783 421 814 1456 1093 109 -570 -1589 -1318 -847 474 848 1377 1126 383 -299 -1283 -1481 -645
6711 -645 260 799 1344 966 159 -658 -1095 -1237 -688 354 999 1425 988 52 -648 -1226 -1119 -648 30 847
6731 847 1331 1049 325 -713 -1311 -1337 -665 -18 1079 1209 978 404 -594 -1308 -1217 -842 142 1218 1280 1214
6751 1214 136 -587 -1524 -968 -685 -27 1289 1333 1044 270 -574 -1242 -1162 -600 262 1030 1733 1106 257 -731
6771 -731 -1145 -1283 -566 411 702 1318 1155 362 -556 -1188 -1318 -694 175 1363 1237 1020 233 -570 -1250 -1286
6791 -1286 -531 300 1318 1390 1149 353 -629 -1308 -1158 -425 338 927 1060 1077 -152 -793 -1177 -1203 -492 296
6811B96N72M39j84p91j134j87q3O52O56N77N81l58o59j220j71j25P66Q51L97L79
6831A254l42o52r55n33P3N44Q12P32O02o43r31n22n32n4M34J043O24N32o16o02
6851B68j028n50L39L88R83O26Q9l04p77n65l91k04P21P29Q94j16m25o64p16n70
6871a273O6N60J011N64K97k23p84q17n33J00O03K82J087K79l15q85p09m48J66
6890i72M90Q21P17J43l25r36m66l37r3N55P79O85J03n52n99o54n91M09N82M61
6910B20L84M92n1j094p48n24K83O40N15O40L58k55q84p84l16N15L20O73Q43j36
6930A091m99n98p13m93K60R43K57R21R8n34r41m25k62J42Q9J108O03L79l81j008
6950C7n75m18j23L69J223N55K53o97q95m75m27K55M43P39O76N4k53o74p59m34
$$ plain form
6811 296 868 1307 1123 332 -802 -989 -1072 -420 236 813 1394 1036 377 -843 -1014 -1139 -373 478 875 1254
6831 1254 912 260 -695 -1228 -1155 -611 201 933 1535 892 -39 -561 -1093 -1147 -713 330 954 1486 870 268
6851 268 -760 -1310 -971 -583 400 1026 1115 811 34 -531 -922 -1126 -405 324 1218 1102 677 13 -703 -1273
6871 -1273 -1207 -647 364 928 1225 1002 218 -599 -1132 -1032 -429 -147 940 1219 904 19 -690 -1138 -972
6890 -972 -482 339 1056 1199 874 -62 -528 -865 -958 -403 376 1061 1164 612 13 -641 -1232 -823 -241 220
6910 220 604 1096 1045 -49 -797 -1321 -1038 -398 117 757 1115 860 -24 -808 -1124 -609 -289 384 1227 1091
6930 1091 592 -6 -719 -1212 -952 -9 248 1169 1267 733 -208 -633 -895 -753 -664 444 1047 1426 1045 37
6950 37 -538 -956 -1079 -710 513 1068 1321 624 -271 -746 -1173 -918 -475 264 940 994 741 67 -692 -1126
6970a126L30N51R86L77j05j70j352%l84k84Q61O42O55J4k98q63n63l47r4Q18P52
6991D00P67O6n29o35p99l25J15P24R60l5N55m63n07q10n76M14N92M84Q24j11j80
7012I31r03o85n73L10N68P58P15J65m41o72q25l74k8P18R78K13M25o15o37j048
7032a020j91L82O06M37N92K84j49r64m78o21L3Q87L21P55j9k68k83r55m78j7O50
7053d96Q94N02k6n02l01p66l92O3Q55M81P48j02j94p81p06l21L74O00M80Q67M0
7074A317o65q88m72l45l9O26R40O53m17J05q81l23l78l24O64O96N65Q4m72o13
7094a67q78n0LP91Q58N78O2n34q04n53k80k61J106N38P05q4m10p02n75o13M47
7115h23N50P63M80J32o11m05p30l21L60K12Q69O15J4o22n32q79j42R5J058L05
$$ plain form
6970 -1126 -796 -245 741 1118 1013 843 -509 -509 -893 -1177 -316 326 981 995 697 -166 -729 -1076 -1170 -352 400
6991 400 1167 1233 704 69 -730 -1055 -940 -216 744 709 1264 801 294 -516 -1092 -678 -86 398 1222 1111 931
7012 931 28 -657 -1230 -920 -352 406 1121 1286 845 173 -652 -1026 -1054 -336 642 855 1280 665 28 -1020
7032 -1020 -1211 -829 -223 214 806 1090 941 -23 -501 -1122 -1089 -202 119 874 855 587 304 -651 -1129 -1146 -496
7053 -496 398 900 874 372 71 -695 -1087 -1024 -169 312 1060 958 764 -17 -723 -1044 -670 -70 410 1277 1317
7074 1317 652 -236 -708 -1053 -1092 -466 474 1127 710 815 -66 -389 -767 -1091 -427 269 834 918 446 -167
7094 -167 -1045 -1095 -1092 -301 557 1135 1197 663 -141 -694 -974 -1235 -129 409 1114 1030 620 -82 -657 -1270 -823
7115 -823 -273 490 970 1102 491 86 -644 -965 -605 -393 476 1091 1105 483 -49 -928 -1070 -975 83 388
7135C88K90L96o96m43o04l14J41N03P10O45j6n15m83q71j90K34O70P92K56M4l90
7156E47q91n34L3KQ32O29K77p8m46l64j146k7K39Q51O63N25k3n01q20l73k32j17
7178i54N99R11K98L32n73p58r09N7L09P60L41N80m5m51n81p24P8J35L92R76J40
7199I13j80k47n27o97l90K75P59N38N24k2o36p17k21l49K97M45Q64L19k4l36n59
7220B9q03n04L54R61N64N71k09l90n94q06n36O36M76M40Q77Pm44q33o38k26L57
7241g11Q01N48K47Q6m27o26m64l36K31N60N21P71l09n46n60n70j45J94M71N09
7261B45P48j24q03L2o82m88K56P57N89L5N17o98n14m53n64L66Q48M77M51j03p98
7282I4m04m37P6l07Q54P96J77m09po93m97k67J69R21K41Q58n57k65n01n14k74
$$ plain form
7135 388 678 1074 378 -65 -669 -983 -842 -339 371 1016 1000 485 2 -869 -1059 -825 -155 637 893 937 547
7156 547 -344 -878 -845 -843 -11 618 895 817 371 7 -1139 -1166 -927 -76 587 1112 1089 588 -232 -605 -837 -954
7178 -954 -355 556 854 1186 613 -145 -1054 -997 -688 72 413 993 948 497 -84 -808 -730 -595 -203 773 913
7199 913 733 486 -41 -738 -1128 -853 -94 444 968 946 310 -407 -628 -977 -680 -235 629 948 924 588 29
7220 29 -774 -1278 -924 37 601 1172 963 573 -21 -827 -1363 -727 -251 189 1066 1073 629 -204 -842 -1068 -711
7241 -711 90 638 885 971 544 -82 -546 -882 -651 -91 430 1201 892 346 -214 -784 -929 -735 -264 245
7261 245 993 869 66 98 -584 -1072 -816 -59 530 565 1082 384 -130 -583 -1147 -781 67 544 995 892 94
7282 94 -310 -747 -671 -978 -124 672 849 440 433 -260 -757 -1024 -855 66 307 1165 608 343 -158 -672 -946
7303i46J65Q28N65M84k11q64m48j50k82J99N98R29k21K35p56k95n16k42K84O65
7323B1P61J67m30J10r24n82j89K69N52P44O75l85m33m69n16j29J53K99J091n6
7343G29J03m26q94l33L0K53O23N20K25j75m31m62n88m0Q0P78Q43n3J17l72p86
7364b59o08j5K54L49R18M77l97k20p99p07J94L86K87Q66P6j31m68q02l29K21J42
7385e65P57M70N34n06m31p64l17j53M53N18Q69Q6l89m48l57n75j56M53P46L1M72
7406G28J85p13n20l90k28O56L20O71J29Q6n65q93n2k16L62M08R83r3j6p41k35
7427a34n85k92K55R96L15L42j71n91m86m81J1J02Q52J98N92l64k74o04l07l84
7447a010N05N92N20k7L36n81q85k64k10N92J25Q49M35k95m55n15n11n5L66K66
$$ plain form
7303 -946 -781 47 612 1096 885 21 -427 -577 -859 -660 -62 867 646 881 125 -170 -686 -928 -644 21
7323 21 782 949 519 629 -295 -877 -1066 -797 -245 499 1174 789 356 -113 -629 -758 -605 -306 785 729
7343 729 832 406 -488 -821 -791 -538 85 605 830 655 224 -238 -826 -866 -786 -8 835 782 899 527 -259
7364 -259 -867 -882 -628 -279 639 1116 719 499 -300 -1007 -813 -427 -140 726 802 671 203 -599 -928 -707 -565
7385 -565 192 662 1196 690 259 -505 -822 -975 -522 -4 865 951 562 114 -243 -818 -974 -521 225 256 728
7406 728 913 200 -320 -710 -938 -282 38 709 838 924 359 -534 -586 -802 -440 -32 951 858 842 101 -134
7427 -134 -719 -1011 -756 240 555 897 726 135 -351 -832 -821 -719 133 331 923 559 285 -319 -626 -1010
7447 -1010 -505 87 607 580 916 335 -550 -814 -1024 -432 -307 542 977 682 227 -288 -799 -854 -488 -222
7467b22Q86K27J91p91n97o36N4M81K65O25O33l42r61K3q87K68O12M62K87M77l17
7488G38m79o45n04OM62N47O93j81lp24k72l91j40K02Q54L49M05R3n31q12p36J26
7510i43O49N08L82O05k27q87n17k05l27N87M43O69K83l23n83m49m30N92%N80L73
7531G80k18m1l58n27j68l71K67O86N19L61n29k80l15p69M0L72N80R24r9l08j46
7552D00r02k57jM07O79N27j40K1m56o57n42J27J79O66O06M42l79m86p27q02P08
7573e87K7P38L70K92k16n46n01k69k63O00M28K87K89k12m22l81j16l51M55M83
7593A05L21O20l77m34q56M4l37N38P56M55J23l97k09r23l89K62N25J82Q33J06
7613I48o38R7j065J2P4N2O04M98L16k02n40n72l48M0P2J078J10J18M4n87p22k21
$$ plain form
7467 -222 664 891 1082 291 -306 -942 -888 -407 -142 483 1116 774 -187 -164 -1051 -783 -171 291 578 1055 738
7488 738 259 -386 -890 -884 -422 125 818 637 634 -90 -362 -753 -893 -691 163 512 917 1010 479 -333 -1069 -943
7510 -943 -294 214 596 1201 974 87 -430 -635 -962 -375 68 737 1020 697 114 -335 -765 -173 -173 407 780
7531 780 562 521 163 -364 -532 -903 -636 50 569 930 401 121 -194 -963 -923 -551 29 953 854 546 400
7552 400 -502 -759 -760 -353 326 853 713 734 278 -379 -921 -794 -615 51 657 1099 720 234 -493 -1295 -587
7573 -587 -560 178 548 840 624 78 -423 -692 -955 -355 73 360 649 437 15 -366 -482 -833 -378 105
7593 105 426 1046 669 235 -621 -577 -914 -376 380 835 958 561 352 -571 -960 -698 -173 9 842 948
7613 948 310 407 -658 -646 -572 -520 84 582 898 696 156 -416 -764 -724 -652 426 536 654 698 111 -611 -832
7635h32P9M43M02O93j8k39o18l95k42N6K63Q08L98L1k42o08j99q55K90L86M78
7656G9M93J00j56n89k63m60K25N02R5M52M79l99n56l56l69J63J42N93K64N79m83
7677E35m98m84l01J3K76Q09L80N1j75o83m17r1k69N36Q85J76J17m35k86m09l14
7698e84pK75O12R5L43o28K7m19l04j26Q42L59L63Kl87m12k42m58r8N38L76M63
7720F30m11K30n86l22l43K29L74K52O13K57k49q81o8n27J77K85P71J92J99l70
7740D52m66n00p5k41O78M54M41q5l14j49q27k40J53L11Q14K94p6k97l35m90k98
7761g96K65L14L77O81l07J20r02k45j56j73P14N43J12J19k79j32p21k07N3N02
7781a18M67K72k62J80p95j95l80L03K36N30N82j68k97k90n26l13K25K87L69O26
$$ plain form
7635 -832 -753 -310 92 785 767 528 -90 -485 -727 -671 -408 400 798 829 587 -21 -220 -1075 -785 -399 79
7656 79 572 672 516 -73 -336 -796 -571 -69 26 478 957 558 2 -354 -723 -560 -418 175 439 1018 535
7677 535 37 -447 -748 -735 -459 350 730 781 606 -77 -494 -585 -854 -318 567 743 860 425 139 -270 -584
7698 -584 -591 -316 296 391 734 106 133 -286 -590 -716 126 485 848 850 463 51 -191 -649 -747 -209 167 630
7720 630 219 449 -137 -459 -802 -573 -199 53 666 923 674 -207 -275 -802 -625 -340 431 623 822 452
7740 452 -14 -514 -589 -830 -152 302 743 658 344 195 -632 -872 -719 -408 406 700 624 327 -8 -498 -796
7761 -796 -531 -217 160 841 534 654 -248 -493 -649 -822 -108 435 547 666 387 255 -466 -673 -620 -118
7781 -118 349 621 359 539 -256 -451 -831 -528 -292 238 820 652 355 65 -461 -774 -549 -262 107 733
7801G33O1n45k38o60NL23o8O66N28k58Q5p28o90J3L65L47N15M7J69k41l35m69
7823c75m49K10L55N97L90Q3m71m16n63j75K21M69L60M50R1o27J69q71j50P2N87
7844d3J45N05ql61m86m30Q0L93J41N02J20J23j16m21p93k16M97K33M54K13K25
7865G57m13l82j46n47R2O12R8N23ql21k68l06l71J11J17Q62J75N1j72n17n47R8
7887e02j15O83m7N48M16o44o35k95Rk5L82L67N48K53l15o90n13k02L77K28N38
7908C66J12K47j8p67p88K59Q2M13K70N30k9n75j12n51k36L27J88O84M22k67k51
7929C06l14m93m39L29O18J41O73k25l45l54n00Q6J00L21L71O49k12o17l65k11
7949d81j00K87K07M00K86k7j16o37k80l66K15M53O83j15J08j48l60l98l28J57
$$ plain form
7801 733 794 249 11 -649 -644 -321 -389 277 805 547 632 -96 -786 -773 -408 -61 454 501 670 429 94 -375
7823 -375 -824 -614 -259 338 728 811 340 -76 -639 -814 -593 -124 236 686 777 150 319 -552 -702 -630 -43
7844 -43 102 607 599 238 -248 -678 -598 -205 -64 438 558 681 565 144 -649 -865 -368 -135 319 532 757
7865 757 344 -38 -184 -731 -639 -27 71 594 586 265 -3 -309 -680 -569 -452 410 585 636 464 -53 -600 -502
7887 -502 -617 66 19 567 983 339 -296 -591 -582 -607 -225 142 690 943 628 -62 -575 -777 -400 -172 366
7908 366 478 725 707 -60 -848 -589 -507 -94 176 706 677 102 -10 -561 -797 -470 -282 402 824 557 306
7929 306 -8 -501 -940 -611 7 148 821 596 251 -103 -603 -517 -417 -96 275 924 712 95 -270 -481
7949 -481 -581 -294 -87 313 599 572 456 -181 -461 -827 -612 -159 524 409 517 369 9 -389 -717 -560
7969e60M09M33K46K5m32m63m33p4P85Q4K85J33K76k30m86p20J44K99M1N40L97
7990F99j1j42p20l35k32N03L76L15M66k90j68p93k10n47P98K42K46N74j13j14
8010E44o76m57J54k2J51O22K54J16k28l28o82k18N58L30J21M93j44m95l36l17
8030e60k33M00k8N89M35nl79o50o2J22l07M46Q33J71m17l27k2n18k76J31Q35l5
8052A43R0M19o25l28j54r2m0Q23J10L15p5l69m33l8m53J27P12K03M85k98j10k82
8074A30o82K09M4L57J57M09j35k33n19n45K10L49K61O06J68r3m25l95n29P5L05
8095b76L13L08R2r8j05n87O6k61L46M03J66L21j55l64k68l52p2L31L34J58J27
8116D27Nk40l65l49k49M01N17N01k5R5l80o33k34j94J65N71N52j39J07n22j80
$$ plain form
7969 -560 -151 282 528 553 121 -342 -775 -849 -64 20 305 438 714 484 -2 -722 -578 -279 -238 302 699
7990 699 688 546 -174 -509 -741 -238 138 453 919 629 461 -332 -542 -1089 -291 -49 197 771 658 544
8010 544 -132 -589 -435 -457 -306 316 570 686 458 130 -552 -770 -212 118 239 732 588 93 -243 -560
8030 -560 -793 -393 -421 168 603 598 219 -431 -493 -371 -678 -232 601 772 355 28 6 -512 -788 -657 178 143
8052 143 233 652 27 -301 -455 -547 -587 236 346 661 586 217 -216 -254 -707 -580 132 335 820 522 412 130
8074 130 -552 -343 -299 58 215 624 489 256 -263 -808 -598 -249 12 618 786 693 268 -127 -656 -581 -276
8095 -276 37 345 437 339 234 -353 -287 -548 -202 201 367 688 533 169 -99 -451 -523 -192 142 300 427
8116 427 432 192 -173 -522 -771 -370 147 648 623 718 338 -295 -529 -723 -558 13 565 426 533 11 -169
8137a69m23j12N00M51N3L38p3l51k28m85N4K92j26N39M43k50n34n05mj59P69k23
8159b03O50K3r5l41j80l28j82N20K55J17M35j21m07l86l61l6K19O09j20O71j31
8180F08o18l9q30L51O2L26L80K99N7l27m19
$$ plain form
8137 -169 -592 -704 -204 247 300 638 565 214 -14 -499 -445 -153 -279 260 703 453 -81 -586 -590 -749 20 -203
8159 -203 447 470 375 34 -146 -474 -656 -136 119 236 671 550 143 -243 -604 -640 -421 188 68 739 608
8180 608 -10 -49 -879 -528 -466 -140 240 539 596 269 -150
8191a50
$$ Imaginary data points
##PAGE= N=2
##DATA TABLE= (X++(I..I)), XYDATA
0@%%%%%%Qj6J6j6J9k7L8m6N6o7Q1r8J15j36J59j86K16k48K87l30L74m27M85n50
30b93O20o95P81q73R76j091J214j348J495j657J837k032K249k493K763l064L399
47A788l783M225m734N333o047O919q009R415j1319J4050j8322K6030m4329J67266
61A38483J76873k31101j27305n1112l3087o8854R0786J95760J27506m1067p0207
72A06675o9571j12345j31595O653J40936J48433P0224K8832l8243j39295j65525
83a54821m4134P0425Q2620O9462J08466Q3937o0977j81485j30014p271L9198M0663
95h3931R9108J45547O0822r5434j54806r7738l3796J817O9722J46261J28315R381
107A95268r3434j14566r6553o4099J0412J05033J37252Q2675O512n0547j04482
$$ plain form
0 0 0 0 0 0 0 0 8 -8 8 -8 11 -16 22 -24 32 -35 46 -52 63 -73 86 -100 116 -132 155 -175 199 -228 257 -293
30 -293 327 -368 413 -460 516 -575 639 -709 786 -871 966 -1066 1183 -1310 1453 -1611 1788
47 1788 -1995 2230 -2504 2829 -3218 3701 -4308 5107 -6212 7838 -10484 15546 -28783 138483
61 138483 315356 84255 -43050 -94162 -127249 -196103 -105317 90443 217949 176882 106675
72 106675 37104 -75241 -206836 -200183 -59247 89186 159410 188242 149999 10704 -154821
83 -154821 -198955 -128530 -45910 23552 132018 215955 154978 -26507 -156521 -163792 -124594 -83931
95 -83931 15177 160724 221546 126112 -28694 -126432 -160228 -158411 -88689 57572 185887 195268
107 195268 101834 -12732 -109285 -173384 -162972 -57939 79313 161988 168500 117953 13471
118A3471j33671p9424M2447J25556J15070O5520J8341m7772j24942j33806m6538
129a85748N7912R8222R1411P6261L1971n7937j28874j13850l6922L4377Q1680
140e1497J12764R6193J2738q1657j13680q8018m4877J3044R0397J31593Q4343
151A61343r582p2900r1004r2493o2923K0617J06480J20002O5758J244n4008j01882
163i348j10894n1888L7791R5724J07700Q0306R781p8767j17694q3294k4434K1331
175a23686P1033J13666R1654N00q1340r9146q0355m7719J5956R7229J23515O8958
187A50265j1825o6317r4313r1878l9735L8724Q6632R0233O9959K1405o0332j20189
199b7371r7332j8409M0792O7796R1995Q7959J5222q2111j14863p4559k1120K1724
$$ plain form
118 13471 -120200 -199624 -157177 -31621 83449 148969 167310 119538 -5404 -139210 -185748
129 -185748 -127836 -29614 61797 138058 170029 112092 -16782 -130632 -167554 -133177 -51497
140 -51497 61267 157460 170198 88541 -25139 -113157 -158034 -144990 -54593 77000 161343
151 161343 151761 78861 -12143 -104636 -167559 -146942 -40462 79540 145298 146542 92534 -9348
163 -9348 -120242 -172130 -134339 -38615 69085 149391 159172 80405 -37289 -120583 -145017 -123686
175 -123686 -52653 61013 152667 153167 71827 -27319 -107674 -155393 -139437 -42208 81307 150265
187 150265 138440 72123 -22190 -114068 -153803 -115079 -28447 61786 131745 153150 92818 -27371
199 -27371 -124703 -143112 -102320 -34524 57471 145430 160652 78541 -36322 -110881 -132001 -110277
211a10277P1585J07577P9045l551p4196r5722q0609l7258K9711Q7120R7164O0188
223A30777M462n4548j00587r8577l4457M5852Q8594Q5876N8374Q615n8473j03851
235b7943q8403k4551L9549P7275Q5725O4212J0458n7507j01571r1659l0965M2150
247a03230Q7507Q9466N5160Q67n7430r4483q4793k8925L6561Q0996Q9193N9978
259A30867J219o1276r3309q0596l2299L2108Q5527R6447N3993j0542n9273q2446
271a9580p9444l9699L3457R1867R3051M5662q753n2939q3560q2622l4503L6490
283a00573Q4463Q8002N4098l236o2220r0685p3250k5733L0514P8251R3724N7998
295A31353j2377o7100q1780o6252l0037K6141Q0741R3980N3228r770o1747q4763
$$ plain form
211 -110277 -38692 68885 147930 144379 70183 -25539 -106148 -143406 -113695 -26575 70589 130777
223 130777 135239 80691 -19896 -118473 -152930 -107078 -18484 67392 125766 134381 75908 -27943
235 -27943 -116346 -140897 -101348 -24073 61652 125864 136322 78815 -22756 -114415 -145380 -103230
247 -103230 -15723 73743 128903 129770 72340 -22143 -106936 -135861 -99300 -18304 70889 130867
259 130867 132086 70810 -22499 -103095 -135394 -103286 -17759 78688 132681 122139 62866 -19580
271 -19580 -99024 -138723 -105266 -13399 79652 125314 116561 63622 -19938 -102560 -137063 -100573
283 -100573 -16110 71892 125990 122754 60534 -30151 -103401 -129134 -98620 -20369 73355 131353
295 131353 118976 51876 -29904 -96156 -126193 -100052 -19311 74669 127897 118127 56380 -28383
307b8383p3757k5919L5940P8496Q4302N4754m433o6613r1911o5020j4802L0231
319h7115O5718Q6682O3911p018p3265q7707n9992k0521K6390P4878R1574N1666
331A25201j4582o2639q0132o9070k5597L8729Q1099P6829M2810k131n3697r1173
343c4353p6675j2878M6424O8222O9630N4078M244o5541r7285o5246o008L7745
355g7643O5658P7503N2652q971o4202q1382o3199k0308L4739P8519Q0261M1067
367A14694j1593n5626q0969p0671j8378M5091P8237O9435L7695n417n3415q3146
379c4063o9664j6376M2623P6506P3491L8669j1423n7335p7498o4222j8639L9873
391g8058P7789P4096L5817j2942n4562p7266o5263j6901M2337P6425P1875L6803
$$ plain form
307 -28383 -102140 -128059 -92119 -13623 70679 125433 121000 54387 -37524 -102544 -117346 -87115
319 -87115 -21397 65285 129196 122178 48913 -38794 -98786 -119307 -92917 -18039 73535 125201
331 125201 110619 47980 -32152 -101222 -126819 -88090 -6991 69838 112648 110517 56820 -34353
343 -34353 -111028 -123906 -77482 -9260 60370 114448 118692 53151 -44134 -109380 -115388 -77643
355 -77643 -11985 65518 118170 109199 44997 -36385 -99584 -119892 -85153 -6634 73627 114694
367 114694 103101 47475 -33494 -104165 -122543 -77452 785 70220 107915 102498 49083 -34063
379 -34063 -103727 -120103 -77480 -974 72517 111186 99763 42428 -35070 -99292 -117931 -78058
391 -78058 -269 73827 109644 96702 42140 -35126 -100389 -117290 -74953 1472 73347 110150
403A10150j3911n7901p5938n9048j5153L5761P4410P7126L8118j9604o0713p0951
415c7654n5095j7131L4222P6419P6435L4752j9683n8311p2190n5879j4038L8748
427f9405P2149P0657L6420j5030o0825p5433n2964q991L5816O7291P3871M0034
439A13590k0014o5452p1500m6244j0297L1849O9373P3743L5065k0059n8916p1052
451c9914n3259j0532M1949P0487O3539L1603j1730n7001p8552n4672m5M3383O0914
464F170O0148L9391j0640o4923p8604m5815J152L5521O0864O6811L7229j9200
476H8104o3228o9997m6294o397L8596O9182O2892K6126j7581n2416p0060n4348
488i5421o039M6588O8863N5942K5639j3301n3557p3001n1764j134M5648O4807
$$ plain form
403 110150 96239 38338 -37600 -96648 -111801 -76040 -1630 75496 113614 94010 33297 -37654
415 -37654 -92749 -109880 -75658 761 77196 111948 92265 33954 -38236 -94115 -108153 -69405
427 -69405 2744 73401 109821 94791 33966 -41467 -94431 -103422 -67606 -315 73556 113590
439 113590 93576 28124 -43376 -89620 -99917 -68068 1305 75048 110113 90054 31138 -39914
451 -39914 -93173 -103705 -61756 8731 72270 103873 92143 35142 -43410 -98082 -98127 -54744 6170
464 6170 66318 105709 95069 30146 -48458 -94273 -93121 -57600 3264 70075 107304 88104
476 88104 24876 -45121 -91415 -97812 -59216 9966 72858 98984 81403 28987 -41073 -95421
488 -95421 -101460 -54872 13991 69933 95572 82271 28714 -44287 -96051 -97185 -51537 13270
500A3270N6065K7098j5396n4153o9824n0006l306M4741O7289N6719K2968j6968
512G8497n2527o7967m9839k421M4199O5703N5678K4736j8161n6516o6171m3673
524h8462k711L8225O4707O1992K4003k6291n6491n8198m1925r043L7370P1867
536A5043O1244J5264k6564m8837n6910m8198q140M5304P0381N2232J6877j8624
$$ plain form
500 13270 69335 96433 81037 26884 -42940 -92946 -96252 -51511 15778 72497 95465 78497
512 78497 25970 -41997 -91836 -94257 -50058 15645 71323 96059 77898 21382 -44789 -88462
524 -88462 -91173 -52948 11759 73751 97754 71463 14972 -43226 -85151 -94194 -56824 15043
536 15043 76287 91551 64987 16150 -40760 -88958 -97098 -51794 18587 70819 87696 69072
$$ [...]
8191g33
##END NTUPLES=NMR FID
##END=
