##TITLE=1H_Pr T-793
 DMSO, 8 sc, 
 20.11.2019
##JCAMPDX= 6.0         $$ Bruker NMR JCAMP-DX V2.0
##DATA TYPE= NMR FID
##DATA CLASS= NTUPLES
##ORIGIN= UXNMR, Bruker Analytische Messtechnik GmbH
##OWNER= root
$$ XWIN-NMR		Version 3.5
$$ Wed Nov 20 13:57:33 2019 Russian Standard Time (UT+4h)  she@DPX200
##.OBSERVE FREQUENCY= 200.1315
##.OBSERVE NUCLEUS= ^1H
##.DELAY= (6, 6)
##.ACQUISITION MODE= SIMULTANEOUS
##.ACQUISITION SCHEME= undefined
##.AVERAGES= 8
##.DIGITISER RES= 18
##SPECTROMETER/DATA SYSTEM= spect
##.PULSE SEQUENCE= zg30
##.SOLVENT NAME= CDCl3
##.SHIFT REFERENCE= (INTERNAL, CDCl3, 0, 15.7039)
##AUDIT TRAIL= $$ (NUMBER, WHEN, WHO, WHERE, WHAT)
$$ ##TITLE= Audit trail, XWIN-NMR		Version 3.5
$$ ##JCAMPDX= 5.01
$$ ##ORIGIN= Bruker BioSpin GmbH
$$ ##OWNER= she
$$ F:/spectra/data/she/nmr/H-F/1/audita.txt
$$ ##AUDIT TRAIL=  $$ (NUMBER, WHEN, WHO, WHERE, WHAT)
(   1,<2019-11-20 13:56:32.31 +0400>,<she>,<DPX200>,
      <created by zg, POWCHK disabled, PULCHK disabled
       configuration hash MD5:
       00 E9 B6 7A A2 85 ED C7 34 08 36 98 17 FE 4E 26
       data hash MD5: 16K
       40 6B B8 65 18 5B E0 02 EA 42 70 84 64 1D 0D EF>)
$$ ##END=
$$ 
$$ hash MD5
$$ 23 03 65 31 7D 1D DC AF 0E E1 EE F5 99 AC A2 FA
##$RELAX= 
##$RELAX= 
##$RELAX= 
##$RELAX= 
##$RELAX= 
##$RELAX= 
$$ Bruker specific parameters
$$ --------------------------
##$DU= <F:/spectra>
##$EXPNO= 1
##$NAME= <H-F>
##$PROCNO= 1
##$TYPE= <nmr>
##$USER= <she>
##$AMP= (0..31)
100 100 100 100 100 100 100 100 100 100 100 100 100 100 100 100 100 100 
100 100 100 100 100 100 100 100 100 100 100 100 100 100 
##$AQSEQ= 0
##$AQ_mod= 1
##$AUNM= <au_zg>
##$AUTOPOS= <>
##$BF1= 200.13
##$BF2= 200.13
##$BF3= 200.13
##$BF4= 200.13
##$BF5= 200.13
##$BF6= 200.13
##$BF7= 200.13
##$BF8= 200.13
##$BYTORDA= 1
##$CFDGTYP= 0
##$CFRGTYP= 5
##$CHEMSTR= <none>
##$CNST= (0..31)
1 1 145 1 1 1 1 1 1 1 1 1 1 1 1 1 1 1 1 1 1 1 1 1 1 1 1 1 1 1 1 1 
##$CPDPRG= <>
##$CPDPRG1= <>
##$CPDPRG2= <>
##$CPDPRG3= <>
##$CPDPRG4= <mlev>
##$CPDPRG5= <mlev>
##$CPDPRG6= <mlev>
##$CPDPRG7= <mlev>
##$CPDPRG8= <mlev>
##$CPDPRGB= <>
##$CPDPRGT= <>
##$D= (0..31)
0 1.2 0 0 0 0 0 0 0 0.06 0 0.03 0 0 0 0 0.0002 0 0 0 0 0 0 0 0 0 0 0 0 
0 0 0 
##$DATE= 1574243791
##$DBL= (0..7)
120 120 120 120 120 120 120 120 
##$DBP= (0..7)
150 150 150 150 150 150 150 150 
##$DBP07= 0
##$DBPNAM0= <>
##$DBPNAM1= <>
##$DBPNAM2= <>
##$DBPNAM3= <>
##$DBPNAM4= <>
##$DBPNAM5= <>
##$DBPNAM6= <>
##$DBPNAM7= <>
##$DBPOAL= (0..7)
0.5 0.5 0.5 0.5 0.5 0.5 0.5 0.5 
##$DBPOFFS= (0..7)
0 0 0 0 0 0 0 0 
##$DE= 6
##$DECBNUC= <off>
##$DECIM= 24
##$DECNUC= <off>
##$DECSTAT= 4
##$DIGMOD= 1
##$DIGTYP= 9
##$DL= (0..7)
0 120 120 120 120 120 120 120 
##$DP= (0..7)
150 150 150 150 150 150 150 150 
##$DP07= 0
##$DPNAME0= <>
##$DPNAME1= <>
##$DPNAME2= <>
##$DPNAME3= <>
##$DPNAME4= <>
##$DPNAME5= <>
##$DPNAME6= <>
##$DPNAME7= <>
##$DPOAL= (0..7)
0.5 0.5 0.5 0.5 0.5 0.5 0.5 0.5 
##$DPOFFS= (0..7)
0 0 0 0 0 0 0 0 
##$DQDMODE= 0
##$DR= 18
##$DS= 0
##$DSLIST= <SSSSSSSSSSSSSSS>
$$ [...]
##$SUBNAM2= <"">
##$SUBNAM3= <"">
##$SUBNAM4= <"">
##$SUBNAM5= <"">
##$SUBNAM6= <"">
##$SUBNAM7= <"">
##$SUBNAM8= <"">
##$SUBNAM9= <"">
##$SW= 24.9337058887773
##$SWIBOX= (0..15)
0 0 2 0 0 0 0 0 0 0 0 0 0 0 0 0 
##$SW_h= 4990.01996007984
##$TD= 16384
##$TD0= 1
##$TE= 0
##$TE2= 300
##$TE3= 300
##$TEG= 300
##$TL= (0..7)
0 120 120 120 120 120 120 120 
##$TP= (0..7)
150 150 150 150 150 150 150 150 
##$TP07= 0
##$TPNAME0= <>
##$TPNAME1= <>
##$TPNAME2= <>
##$TPNAME3= <>
##$TPNAME4= <>
##$TPNAME5= <>
##$TPNAME6= <>
##$TPNAME7= <>
##$TPOAL= (0..7)
0.5 0.5 0.5 0.5 0.5 0.5 0.5 0.5 
##$TPOFFS= (0..7)
0 0 0 0 0 0 0 0 
##$TUNHIN= 0
##$TUNHOUT= 0
##$TUNXOUT= 0
##$USERA1= <user>
##$USERA2= <user>
##$USERA3= <user>
##$USERA4= <user>
##$USERA5= <user>
##$V9= 5
##$VALIST= <valist>
##$VCLIST= <CCCCCCCCCCCCCCC>
##$VD= 0
##$VDLIST= <DDDDDDDDDDDDDDD>
##$VPLIST= <PPPPPPPPPPPPPPP>
##$VTLIST= <TTTTTTTTTTTTTTT>
##$WBST= 1024
##$WBSW= 4
##$XGAIN= (0..3)
0 0 0 0 
##$XL= 0
##$YL= 0
##$YMAX_a= 114439
##$YMIN_a= -83247
##$ZGOPTNS= <>
##$ZL1= 120
##$ZL2= 120
##$ZL3= 120
##$ZL4= 120
##$ABSF1= 10
##$ABSF2= 0
##$ABSG= 5
##$ABSL= 3
##$ALPHA= 0
##$AQORDER= 0
##$ASSFAC= 0
##$ASSFACI= 0
##$ASSFACX= 0
##$ASSWID= 0
##$AUNMP= <proc_1d>
##$AZFE= 0.1
##$AZFW= 0.1
##$BCFW= 1
##$BC_mod= 2
##$BYTORDP= 1
##$COROFFS= 0
##$CY= 11.3945322036743
##$DATMOD= 1
##$DC= 2
##$DFILT= <>
##$DTYPP= 0
##$F1P= 16.9975609425685
##$F2P= -3.02152046262296
##$FCOR= 0.5
##$FTSIZE= 0
##$FT_mod= 4
##$GAMMA= 1
##$GB= 0.15
##$INTBC= 1
##$INTSCL= 1
##$ISEN= 128
##$LB= 0.24
##$LEV0= 0
##$LPBIN= 0
##$MAXI= 10000
##$MC2= 0
##$MEAN= 0
##$ME_mod= 0
##$MI= 1.114404
##$NCOEF= 0
##$NC_proc= 0
##$NLEV= 6
##$NOISF1= 3.799351
##$NOISF2= 2.8
##$NSP= 1
##$NTH_PI= 0
##$NZP= 0
##$OFFSET= 15.70392
##$PC= 1
##$PHC0= -9793.658
##$PHC1= 18.20086
##$PH_mod= 1
##$PKNL= yes
##$PPARMOD= 0
##$PSCAL= 0
##$PSIGN= 0
##$REVERSE= no
##$SF= 200.130013532006
##$SI= 16384
##$SIGF1= 3
##$SIGF2= 2
##$SINO= 400
##$SIOLD= 16384
##$SREGLST= <1H.CDCl3>
##$SSB= 0
##$STSI= 0
##$STSR= 0
##$SW_p= 3612.71676300578
##$SYMM= 0
##$S_DEV= 0
##$TDeff= 0
##$TDoff= 0
##$TI= <>
##$TILT= no
##$TM1= 0
##$TM2= 0
##$TOPLEV= 0
##$USERP1= <user>
##$USERP2= <user>
##$USERP3= <user>
##$USERP4= <user>
##$USERP5= <user>
##$WDW= 1
##$XDIM= 8192
##$YMAX_p= 0
##$YMIN_p= 0
$$ End of Bruker specific parameters
$$ ---------------------------------
##NTUPLES= NMR FID
##VAR_NAME=  TIME,          FID/REAL,        FID/IMAG
##SYMBOL=    X,             R,               I
##VAR_TYPE=  INDEPENDENT,   DEPENDENT,       DEPENDENT
##VAR_FORM=  AFFN,          ASDF,            ASDF
##VAR_DIM=   8192,          8192,            8192
##UNITS=     SECONDS,       ARBITRARY UNITS, ARBITRARY UNITS
##FACTOR=    0.0002004,     1,               1
##FIRST=     0,             0,               0
##LAST=      1.6414764,     0,               0
##MIN=       0,             -83247,          0
##MAX=       1.6414764,     114439,          0
$$ Real data points
##PAGE= N=1
##DATA TABLE= (X++(R..R)), XYDATA
$$ [...]
1956a50J15J65K39M6k00m63K63n0L33r1j24q4m08M42K60j66J17k57k6j55L13J83
1978C02m40j33k39N63L46l31k16j96K13J49P5J24Q7m20k08M2N36J58l90k14l99
1999e91P72l8R8l31m65K71Q85J47m79j08j13M04k92j80J27K77k74o27Q3P35N17
2020H18n89j034J25Q65K87k37p65L6L19N84j53k09m48L52Q6j38m89N06N34k56
2040A94l87j16N55J91M5j086j86J017N29m28p58n1L88K00N3j07L25m29l26L38
2060c9K42k00k04o0l2K74j6K13M0n09k27K79N55j06Jk28j19K64Q1n4j39j31m70
2083e85P42L83k87m52j26K57O13k34k53kn1k64j7L32K52k58m51J02K77K33qo9
2105A34p92M32M44j54k57r8j91K58K39J48j45j93l33K91N0J81M32j86p35O4N19
$$ plain form
1956 -150 -35 130 369 415 215 -248 15 -35 298 207 83 -1 -409 33 293 127 244 -13 -39 -194 119 302
1978 302 -138 -271 -510 53 399 68 -148 -344 -131 18 93 217 304 -116 -324 -282 254 412 22 -192 -591
1999 -591 181 143 241 -90 -555 -284 601 748 269 161 48 452 160 -20 107 384 110 -517 -434 301 818
2020 818 229 -805 -680 185 472 235 -530 -494 -175 409 256 47 -401 -49 37 -101 -590 -84 450 194
2040 194 -193 -309 246 437 482 -604 -790 227 756 328 -430 -481 -93 107 160 53 378 -51 -377 -39
2060 -39 203 3 -201 -261 -293 -19 -35 178 218 -291 -518 -239 316 210 211 -17 -136 128 209 155 16 -115 -585
2083 -585 157 540 253 -199 -325 -68 545 311 58 56 5 -259 -276 56 308 50 -401 -299 -22 211 203 134
2105 134 -658 -226 218 64 -193 -291 -482 -224 15 163 18 -175 -508 -217 -167 14 446 260 -475 -411 108
2126A08L25l68j85j95L54J6Lj35M74l04j09k33M10J67k37k32k72M03L98j04j22
2147A62o75K46K63M02l95k57j71O78Q1o79j7M52L25q12J52n8M08J74n04j92M85
2168F8J89K20k60o95p0P76L15m05k65l90K86M07j59j7j57P6K02M5k65jM30m49
2190a19mJ64J19J60J5l13j32M0K05K43k37n40J68M41P31o49o14L5J55M90k88l78
2212c08M55NK47m11k7j76K66K76M6m92J5M40N9l85m76L31M52J48m96k81J57N20
2234C65P7m16k29P0L25j44L3J30m06J54j00K85Q3n49K58L96m85L41j15k1j08M0
2256a6J02m07K54Q2J5j50k4k73N61L32k29m91J3N52O05p28q80K28O46J76n02l57
2278d91N1M49M3j57k10K68M82k52k11m26L82M16N6p96n68P30Q08l07m47l02K60
$$ plain form
2126 108 433 65 -120 -315 39 55 58 -77 397 93 -16 -249 161 328 91 -141 -413 -10 388 284 162
2147 162 -513 -267 -4 398 3 -254 -425 253 334 -345 -362 90 415 -397 -245 -303 105 279 -225 -417 68
2168 68 257 477 217 -478 -548 228 543 138 -127 -517 -231 176 17 0 -157 -81 121 166 -99 -100 330 -119
2190 -119 -123 41 160 320 335 22 -110 -70 135 378 141 -399 -231 210 941 292 -322 -287 -132 358 70 -308
2212 -308 147 152 399 -12 -39 -215 51 327 373 -119 -104 336 395 10 -466 -135 317 465 -31 -312 -155 365
2234 365 442 26 -203 -133 192 48 81 211 -195 -41 -141 144 227 -322 -64 332 -153 188 73 52 -56 -16
2256 -16 86 -321 -67 15 30 -120 -144 -417 144 476 247 -244 -231 321 926 198 -682 -454 192 368 -134 -491
2278 -491 -440 9 52 -105 -315 -47 435 183 -28 -454 -72 344 400 -396 -964 -234 574 267 -180 -482 -222
2299b22R32m65n14k47J63N05k49K57n64J88K22K0k89j74J98J32L26k72r09P91
2319a71Q77k52q56l19Q36M98r0k74j012M32O22M36r71l22L52L50L63p37m22L85
2339b75L41M08n57m27N89K43O1q62j39N97P08n58n50J90M43N5l42L18o05J72O00
2360D10M9m84k84m21J067J53m30l08p3M70Nj57k66K03L07l46O8N1m1K03J77j96
2382A57l92o1N18K49k64n77r9Q61K85k03q61K31L13M84l93n48k96Q44K26l43j59
2403b8l29P01K43o29l00r6M91O89m06r05R8J106j7n48l36j50N71K73m75O6k37
2424b18J91L28N3l74m47L39N32j77n51j23N08L55m73j94J46N36K49m82o32j27
2444e61J236p0o44j55j93L61J018o01p44j97N96N88N9j014j26Q24L55n99p00L60
$$ plain form
2299 -222 710 245 -269 -516 -353 152 -97 160 -404 -216 6 26 -263 -437 -239 -107 219 -53 -962 -171
2319 -171 706 454 -402 -721 115 613 523 249 -763 -331 291 727 -244 -566 -214 136 499 -238 -660 -275
2339 -275 66 474 -83 -510 79 322 383 -479 -618 -21 687 129 -421 -231 212 267 -75 243 -362 -190 410
2360 410 459 -25 -309 -730 337 490 60 -248 -321 149 154 -3 -269 -66 241 -105 -37 14 -27 176 353 157
2382 157 -235 -296 222 471 207 -370 -469 392 677 474 -387 -156 157 641 248 -300 -596 248 474 131 -28
2403 -28 -357 344 587 -42 -342 -438 53 742 336 -569 -471 635 618 70 -266 -416 155 428 -47 19 -218
2424 -218 -27 301 354 -20 -467 -128 404 227 -324 -447 61 416 -57 -251 -105 431 680 198 -434 -561
2444 -561 675 605 -39 -194 -387 -26 992 391 -353 -550 46 634 693 -321 -447 377 732 133 -567 -207
2464b07O25M05j065m93L78O73M69p27o71L49O15K50k96p86r2P08N98l13p16l6
2484c32O58J33l11j92K43k98L54j07n49J01M72J66l41L37p09K23O74k63m31j29
2504c01O30L69l34o15k79M73O22j96l62n91M84N62L3n26l75O2P82j94m82k7L36
2525G1M60k14o62j48P23L99n31k76k59P08L54k05n36n53N43N85J8q51l38L28Q27
2546D43J7o76n20N75O33j5q00m56P07L93k0l13m29M80L53k77l18r4L73M75J18
2567F49r27n32O59Q66Oq80n18M65O85K04o72m16N07N60j27n56l85J99O92K50m56
2588B73r75O12M74K20j002l60Q57O42J5j429k63R91J13Rn37q2N63J22N6k64m33
2609c98r6N93J98k71n84K73N19j2m26J9L2M92j37k22n51J03Q92R0p72m19N52N01
$$ plain form
2464 -207 418 823 -242 -735 -357 316 785 58 -613 -264 351 601 305 -481 -573 135 733 420 -296 -332
2484 -332 326 459 148 -44 199 -99 255 148 -401 -300 172 338 -3 334 -375 -152 522 259 -172 -301
2504 -301 329 698 364 -251 -530 -57 565 369 7 -584 -100 462 495 -31 -406 -344 438 244 -238 -265 71
2525 71 531 317 -345 -493 230 629 98 -178 -437 271 625 420 -116 -669 -126 459 477 -374 -712 -384 443
2546 443 460 -216 -736 -161 472 457 -343 -799 -92 301 281 -32 -461 19 372 95 -223 -317 56 531 649
2567 649 -278 -810 -151 715 721 -159 -677 -212 473 677 5 -411 96 656 529 -27 -412 -213 479 729 273
2588 273 -702 -90 384 604 -398 -758 99 741 756 -673 -936 55 168 177 -360 -442 121 243 299 35 -398
2609 -398 -494 99 297 26 -558 -285 234 222 -204 -185 -153 339 202 -20 -571 -468 424 514 -258 -677 -125 376
2631C76K06p04l71J5O33O38p69k85n4N78M92m94q75L39L58K93l18p16O16L56J7
2652C31n94k09M57L57L18p02n71K49R51K29n31j231P13O11p0k38l47k92P81K08
2672D20l88k66j26M76J24k79k98M7J03Q35m52p04K3P48L87n29n22k99R34P37p47
2693B24r17M34L55M41l24p54L2Q29N36q79l97n4O63M72l24j065K58P92N25o16
2713B31r78N31P88K65o97q26M90N89J15n40k23j21O62N54p36k81k65N63M91m15
2733A97p44J54M62L16L6r96K60L50K35m76j08J03M84r9j73k58j27M25M39j82n20
2754b22l09M73P35k86n40m78M65P78k46n04k73L32M83n8m01j94J93M83j42n66
2774b77N6M19M06m09p16L8P00M71o92n50J19N10L75m09m00l00R70K66o5m60m39
$$ plain form
2631 376 582 -122 -493 -478 155 793 24 -261 -315 263 755 261 -614 -275 83 376 58 -658 -42 314 331
2652 331 -263 -472 -15 342 660 -42 -613 -364 587 816 285 -946 -233 378 308 70 -277 -569 212 420
2672 420 32 -234 -360 116 240 -39 -337 -290 -187 648 196 -508 -485 263 650 121 -401 -700 234 971 224
2693 224 -693 -259 96 537 213 -541 -509 320 856 -23 -420 -474 189 661 337 -728 -470 322 847 231
2713 231 -747 -216 572 837 140 -686 -196 393 508 -32 -255 -376 286 840 104 -177 -442 121 612 197
2733 197 -547 -393 69 385 421 -575 -315 35 270 -206 -314 -211 273 174 1 -257 -384 41 480 298 -222
2754 -222 -531 -58 677 391 -149 -627 -162 616 370 -134 -407 -75 408 350 -51 -245 -52 431 289 -277
2774 -277 -221 198 604 195 -521 -483 217 688 -4 -554 -435 75 450 41 -359 -659 311 577 512 52 -387
2795c87K83M45J0n74j89N8P75%q21p6O13J23j64l36J3J5O77J9o51j17O2M77L58
2818F13p50m31M78O29j82l37m03JJ050l64n61l80O27N48m55k68n11Q06K93m14
2838a1o07JP08J20J66n56m72N54N95r9o81j40J20J013n86k48l7O01k23J25o91
2859c48R8M14J91R1n07P0J06J77L14n22p03O40M21J57r66j64M51M92k11l30m45
2880e74N88k1N87o36l86L04J38J61n7o33K16N04K71l52n90L91N09j42m12l75O07
2901I8L5K69n40l31L44M47J1k99n26M02K20L86p88j81K92M01L8l13k75J4O48n5
2923B97m12k48J41M05Q5p30K85N5J88K19k11n44J47K87M35r0q09r8P78M56q44
2944b08L8k71N90K42l82k15L8P79j88m77k98J88L76J58j76p56N18K64K66l80o06
$$ plain form
2795 -387 -104 341 351 -223 -412 -354 421 421 -400 -476 137 260 96 -240 -227 -212 465 484 -167 -284 -222 255 613
2818 613 -137 -568 -90 539 357 20 -383 -382 668 304 -257 -637 -10 538 83 -185 -696 110 403 -11
2838 -11 -618 -617 91 211 377 -179 -651 -97 498 399 -282 -422 -302 711 125 -123 -160 441 218 343 -348
2859 -348 -250 164 355 446 -61 9 115 292 606 84 -619 21 442 599 -367 -531 -80 412 201 -129 -574
2880 -574 14 -7 580 -56 -442 -138 0 161 104 -529 -313 191 462 110 -480 -89 420 278 -134 -509 98
2901 98 133 402 -138 -469 -125 322 333 34 -492 -90 130 516 -272 -453 -161 240 278 -35 -310 -296 352 297
2923 297 -115 -363 -222 183 268 -462 -177 -122 66 285 74 -470 -323 -36 399 309 -500 -598 180 636 -208
2944 -208 -170 -441 149 391 9 -206 -168 611 423 -54 -352 -164 212 370 194 -562 -44 220 486 106 -500
2965e00K69P19j88l08m18N21J37L0k78o4k94O50O6m06k86J34K98J13n2o14K31
2986b40L28M13o96m16M15N62L56n55m46K41J76o7L34m51R0L41m38J99l44O9L4
3007i5M64k0n47n8O65j78l33k54M0O13O3l45k82J29J55K54j07l79P5K47J40j06
3029A41n14qP23J03m24o5j17L77J74k76k34K54p4j50J97j19L54m11j92L01J43
3050A83n38N0P82K9o39j69K70M90m32m48L14L65R2k66j65R6q0K47k45P5m51K81
3072a59K81K29m02o0J16L68K3m61k27K76L39m78k52K37M41q9k63j07K06N2K59
3093C29l18l09j13L92J13o7j32M5k4K43q0Mj00J54J82l60m0N6P5K5j35K53k88
3116i5K26N2K04n41p4L12L02m19L8m18O67P5j46l91j6K33K13m02J79l66L46R6
$$ plain form
2965 -500 -231 488 300 -8 -426 95 232 262 -16 -80 -374 276 342 -64 -350 -216 82 195 143 -471 -240
2986 -240 88 501 -195 -611 -196 366 722 167 -279 -38 138 71 405 -46 44 385 -53 146 -198 -129 -95
3007 -95 369 349 -198 -256 409 231 -102 -356 -316 297 360 15 -267 -138 17 271 164 -215 -140 107 247 141
3029 141 -373 -381 342 445 21 -44 -161 216 390 114 -120 134 60 -90 107 -12 342 -69 -261 40 183
3050 183 -355 -305 477 506 -133 -302 -32 458 26 -422 -108 257 349 83 -82 14 -66 181 -64 11 -440 -159
3072 -159 122 351 -51 -111 5 373 396 -65 -292 -16 323 -155 -407 -170 271 182 -81 -188 18 70 329
3093 329 11 -298 -411 -19 94 27 -105 -60 -84 159 79 83 -17 137 319 -41 -81 -25 50 75 -60 193 -95
3116 -95 131 183 387 -154 -228 84 386 -33 5 -413 254 329 183 -208 -224 9 222 -180 -1 -367 -21 75
3138G5j12j37m6N7K59J46k40k12K99K79Qn18k71M60L60m35r9K08J9J74m27rm9
3161b11L50o3Q9o2j12k58M00k79p0o3M29j99N8M1l36M8L58j81m4p1N0K20k7J29
3185A96m36l8K77K15K5m84L01j85M98q7m49L80l09N03n88k98M97J15j18j67J26
3206b6j67P04m96k29J45J8J59J87j69k42K95J22q9l93j04L12J35j41M1j58j56
3227b52N03j06M6j49N2j85n1Q3l2Q5J28L14m82j80L99m51N94k60k0l9m3K69k60
3250c7K78m86K08K74j82m11K53M1J89o3j96mM61J81p45J80l3N50j21l90l6Q4K43
3273B38k96J44k41L09j60R3j42J17n3M7j0J10l20L20R7l53r2j52K27M67l55J90
3295A85j86J06l22j32R5K03K5n0K58k80J94l44K33J25L6q7j79K4M18l50o2k71
$$ plain form
3138 75 -37 -174 -220 -163 96 242 2 -210 89 368 376 -142 -413 47 407 -28 -127 81 100 274 -153 -162 -211
3161 -211 139 76 165 103 -9 -267 133 -146 -216 -279 150 -49 9 50 -286 -238 120 -61 -105 -176 -126 94 67 196
3185 196 -240 -278 -1 214 239 -245 56 -129 369 282 -167 213 -96 407 -181 -479 18 133 15 -152 -26
3206 -26 -193 511 15 -214 -69 -51 108 295 126 -116 179 301 212 -181 -285 27 162 21 62 -96 -252
3227 -252 251 145 191 42 94 -91 -142 -59 -91 -6 122 436 -46 -226 173 -278 316 56 36 -3 -46 223 -37
3250 -37 241 -245 -37 237 55 -356 -103 -62 127 64 -132 -136 325 506 -239 -59 -92 458 337 -53 -89 -5 238
3273 238 -58 86 -155 154 -6 87 -55 62 9 56 46 156 -164 156 253 -100 -192 -344 -117 350 -5 185
3295 185 -1 105 -217 -349 -254 -51 -26 -76 182 -98 96 -248 -15 110 146 59 -120 -96 322 -28 -90 -361
3317c61K29L57k99L39j22l31N58l07O0k74P2K56k65K22N6O4k54m1p2q9L8N82m74
3340e6N7O0L6m9j22K2j50J83LK26m15J45P4k11K42j62K71j84J51j74N5Lj44L94
3364B55q2L8m4l90J70P7m8j83J67K73k57ON08n02J53k73k8J42j52K8K25m36M58
3387A05Q6J97k11m43j14M22K10j78J7p2p6J60N5k50q9J06K22j63p4L60R5l64j87
3410a86L90r9J22m20J73K08k93r3J68L6P0M7J5j29J19m4k01%j11O8R3o2j7K85
3434A39O7m56k6K96qk5J00j46r2J65K92k68j27j00P30o67J40j64J81LJ62l15P2
3457d7J54j40R0j93K72k01j86J92N4n9J15k54K21J18r9j13J44r6l3m3j5J51L2
3480F4l01M15q9k01r4L3k19J46n8M84mj13l10J31M84k50l74J08J54N3m6J21k33
$$ plain form
3317 -361 -132 225 -74 265 143 -188 370 63 123 -151 -79 177 -88 134 190 254 0 -41 -113 -202 -164 418 -56
3340 -56 1 61 97 48 -74 -52 -202 -19 -16 210 -205 -60 14 -197 45 -117 154 -30 121 -53 2 5 -139 255
3364 255 173 211 167 -223 -53 24 -24 -207 -40 233 -24 -18 490 -12 141 -132 -160 -18 -170 -142 83 -353 105
3387 105 191 388 177 -266 -380 42 252 74 91 19 -57 103 158 -92 -181 -75 147 -16 -90 270 365 1 -186
3410 -186 204 105 227 -193 -20 188 -105 -198 -30 6 76 123 138 9 128 84 -117 -117 -228 -160 -67 -129 -146 139
3434 139 206 -250 -276 20 12 -13 87 -59 -151 14 306 38 -89 -189 541 -126 14 -150 31 34 196 -119 -47
3457 -47 107 -33 57 -136 136 -65 -251 -59 -5 -64 51 -203 18 136 37 -76 68 -28 -61 -104 -119 32 64
3480 64 -237 178 89 -112 -206 -173 -392 -246 -304 180 176 63 -247 -116 368 118 -256 -148 6 59 13 134 -99
3503i9J8J09j65p4J16r7k4M71l78l0M0O10n74m39M31K90l29m0k56L24J9J11M46
3526D80j74L4o02jJ43J88p1j78L0J33J0m1Q8j2J8K08l04J41l81M57j61j85J23
3549e7N8K50j43j20k8J34L4L86r28J85J96J5K57j51L9j57Q0k44K4L27J3m20J69
3572h1J18j16J66l07j9K68l94M26k33J27N9J6k60p1K22J5K36j15J07j87L27j17
3594A87k65K8J09J93m62J21P8NJ73O0l30K4L65k15N7l2j79K43m05M07k00L4k6
3617c0Q6r7J46m7k18K08k00K90J38j56k91j2J79J25j61M6j25L5M4n0M0K0m5l47
3641d22K37K86j26r5K8P5l1j1K4J50m16L94j96J57N5k33M38l85J2j69J24J58j11
3664e7j56j23L68l9Q0j21J35J4r4j48K33r7N5m92M21n9O2r2K7O3p8k6K33j52Q
$$ plain form
3503 -99 -81 28 -137 -211 -95 -192 -216 255 -123 -153 -113 497 -77 -516 -85 205 -124 -164 -420 -96 -77 34 480
3526 480 306 340 -262 -263 -120 68 -3 -181 -151 -18 -8 -49 39 27 45 253 -51 90 -291 166 5 -180 -57
3549 -57 1 251 108 -12 -40 94 128 514 -414 -229 -33 -18 239 88 127 -30 50 -194 -170 157 170 -250 -81
3572 -81 37 -79 87 -220 -239 29 -365 61 -172 -45 14 30 -230 -301 -79 -64 172 57 164 -23 304 187
3594 187 -78 -50 59 252 -210 -89 -11 -6 167 227 -103 -79 286 71 128 96 -83 160 -245 162 -38 -4 -30
3617 -30 56 -41 105 58 -160 48 -152 138 276 120 -171 -183 -4 121 -40 6 -119 -84 -40 -90 -50 -30 -75 -422
3641 -422 -185 101 -25 -120 -92 -17 -48 -59 -35 115 -301 93 -103 54 109 -124 314 -71 -59 -228 -104 54 -57
3664 -57 -213 -336 32 -7 73 -48 87 101 7 -141 92 -5 50 -442 -21 -80 -18 -110 -83 -20 -98 -124 109 -43 -35
3689c5K07l6M1j86j5mJ76j54p9J02J26R3l03m4L15J08o11K84J96k56J11j04J95
3712A27L6k91J38p3R6J09k23J03j49M15k11r1j99K40l41N50p8j95Q1J15P5m72
3734b38K8L28r4K57l84l8kJ4lj15L10q2k6p1M5R6L9j61J21Lj7l8M2k62K00k7k5
3761a00J03K38Pj83J0N7j05k04L66l72pJ04K97j85l14K29k03J10L25j31j60J22
3783DK55n53P91k62N6j03j44K5j93qJ42Q9J7j25J33j63L0K14k50p9K68m4k6m3
3807C1k03j86L25M57m52O4n96N15J96m55P1J24J68r1q5l15M48k3j30K60l30L61
3829A54J37j89j93L24l72L15k47R3%j68j20J48J61j3P5J22j95N7M1l80J47O5K97
3852B59j78j12R5k97K96J37k48j6J9K11l15o1J13K77l21Q7O4k90K31j9j52J40
$$ plain form
3689 -35 172 136 177 -9 -24 -28 148 -6 -85 17 143 236 -67 -111 204 312 -299 -15 181 -75 36 -68 127
3712 127 163 -128 10 -63 33 142 -81 22 -127 288 77 -14 -213 27 -314 236 158 -37 44 159 234 -238
3734 -238 -210 118 24 281 -103 -141 -143 -129 -132 -247 63 -19 -45 -116 -71 25 64 -97 24 27 10 -28 14 -248 -48 -75 -100
3761 -100 3 241 248 65 75 132 27 -177 189 -183 -190 -86 211 26 -288 -59 -262 -152 173 42 -118 4
3783 4 259 -294 497 235 291 188 44 69 -124 -132 10 99 116 -9 124 -39 -9 205 -45 -124 144 100 74 31
3807 31 -172 -358 -33 424 -28 36 -560 -45 151 -304 -233 -109 59 -32 -117 -432 16 -7 -137 123 -207 154
3829 154 291 102 -91 233 -139 176 -71 22 22 -146 -266 -118 43 30 105 227 32 89 130 -250 -103 -38 259
3852 259 81 -31 64 -233 63 200 -48 -64 -45 166 -149 -210 -97 180 -141 -54 10 -280 -49 -68 -220 -80
3874h0J8k62N48k72L83k74J62l4k22J95M9o2M1l45J07M88n87j19L42lJ72l73Q5
3897d3J40pj79J32k67K87m7j56j01M59j02k71J86p6L3j96L04k10j36L54RM5l14
3920a56J88K52k81j37P1L65l43K3J10l55L95j27k61K00j70L84j83k35N10j24l92
3941b66N23j06j92N1Q3J92k55q4K09k37J02K95l78K45K12n36M7J40kJ4K8k72N77
3964C90k95m17l7O64k48Rj49nK82l52R0j55K38O3j20k27J77Q3K54r7k80J65K38
3987B71o83K32J87r9K29j47l26K14l8J56Mo2J89M3j73k50kM25J6j88k50K11K80
4010B39k33r1J18l4R1j44k81M68p7J38j53L9j35K15j45k02l1J51q9M16l03Q6l29
4033b86M76k63p8N5J47M7m16L87J08k35J4J41m06J81LN1p4M33k74k92L69R9k8
$$ plain form
3874 -80 -62 -324 224 -48 335 61 223 189 -33 162 211 149 190 -155 -48 440 -147 -266 76 73 245 -128 -43
3897 -43 97 90 -89 43 -224 63 16 -140 -241 218 116 -155 31 -45 -12 -208 96 -114 -250 104 113 158 -156
3920 -156 32 284 3 -134 -63 302 -41 -18 92 -263 132 5 -256 -56 -226 158 -25 -260 250 126 -266
3941 -266 257 151 -41 10 93 285 30 -54 155 -82 20 315 -63 182 394 -142 -95 45 43 57 85 -187 390
3964 390 95 -322 -359 305 57 66 -83 -88 194 -158 -68 -223 15 78 -42 -269 -92 -9 245 148 -132 33 271
3987 271 -412 -180 7 -92 137 -10 -336 -122 -160 -4 0 -62 127 170 -3 -253 -255 170 186 -2 -252 -41 239
4010 239 6 -85 33 -1 90 -54 -335 133 56 194 41 80 -55 160 15 -187 -218 -67 -156 260 -43 43 -286
4033 -286 190 -73 -151 -96 51 98 -318 69 177 -58 -44 97 -309 -128 -125 -74 -148 285 11 -281 88 187 159
4056A59J42k34k55K37l15J50L9J21l9%j4p0m8J27J20r3j40J34OR1M7j68O8J87
4080B52k29n8M1R0k42R4j61J3M00K7j8j95Q9k84L5Q8k83M32J73m69L5L43N1k66
4104d2J23l01K12R5j57J80p9J41n9J10l90K34q2J07k62J18Q1J14R8o11K94j36
4126b12J79J91N8%j89m4R7r1J27J48q9j51q6LJ82k58k3J35K03k9n01K92J61j4
4150H9K00m67K51J39l81oo7J74J18K05l47J98J80k52k3j12J12NJ80n18L77j4j40
4173i9J29J6J13j65K31N3l85O5Q5P5k50J76p8M6M2k16K92l6K12n85L92Q4j33P2
4197A36q1J36j61j21Q2K72l09J75Q6j03J70o6m09K41k04K05K11J79m02k82L12
4218F7j52j15J74j95K76Kj02p9K44J34j85R9k52K85q3J52l43J70O6j06m6j6k3
$$ plain form
4056 159 301 67 -188 49 -266 -116 -77 44 5 5 -9 -79 -127 0 120 27 -113 21 27 118 165 -3 65 252
4080 252 23 -35 6 96 -146 -52 -213 -200 200 227 209 14 103 -181 -146 -58 -341 91 264 -205 -170 173 224 -42
4104 -42 81 -220 -8 87 -70 110 31 172 113 223 -167 67 -15 92 -170 -52 29 143 241 -370 -76 -212
4126 -212 -33 158 216 216 27 -17 80 -11 116 264 175 24 -62 -59 123 -135 -158 -23 180 151 -350 -58 103 89
4150 89 289 -178 73 212 -169 -175 -242 -68 50 255 -92 106 286 34 11 -101 11 16 196 -322 55 41 -99
4173 -99 30 46 159 -6 225 278 -107 -42 43 118 -132 44 -34 12 54 -162 130 94 306 -279 113 197 64 136
4197 136 55 191 30 -91 -9 263 -46 129 215 112 282 216 -193 48 -156 49 260 439 37 -245 67
4218 67 -85 -200 -26 -221 55 57 -45 -124 120 254 69 168 -84 201 118 270 -73 97 163 57 11 -5 -28
4241b8JJ83m40j26J87K92j66n8M1M0m7K70l06J95m7p7p1M5O9L77r3k29j75J90
4265B7J98m01K10K61k42o0l3K72k06J51j26m5q0J21m1jj0k35K71K4P4j54p5K75
4289A75k22j55R2J49o2r6j13K09J58j55K56m01q1M4J93L6l20M51m18M50l69j54
4311c33J83r7J74j9Q8M63l33k51J05l00J74M14j6k02k54K38l28K54J73l9j13j39
4333a58L1M21rm34P2J05R8k92L29k87K66m42L03k47R3N8J36k43K91k60K49q3L19
4356C16l41K3j46k4M06m79L62j79p9L05j2K1j65l48M83k27J46o7o6P3L35n13J83
4379GK9J57K01l19m4j48J84k01J05L7m5M2Q7j52J25n6J91m27L29k79K62k26K95
4402A54l33J13K51k11P2j97K91QO8l3k98J16j79J09J42j86j10K01J60r6j66M71
$$ plain form
4241 -28 -27 156 -284 -410 -223 69 -97 -155 -114 -74 -121 149 -157 38 -9 -86 -157 -112 -43 334 241 12 -163 27
4265 27 225 -176 34 295 53 -7 -40 232 26 177 51 6 -74 47 6 5 -5 -240 31 55 129 -25 -100 175
4289 175 -47 -202 -110 39 -23 -119 -232 -23 135 -20 236 -165 -246 -202 -9 27 -293 158 -260 190 -179 -333
4311 -333 -150 -247 -73 -92 -4 459 126 -125 -20 -320 -146 268 252 50 -204 34 -294 -40 133 94 -19 -158
4333 -158 -127 294 285 -149 -77 28 126 -166 163 -124 142 -300 3 -244 -151 -93 43 -200 91 -169 80 -3 316
4356 316 -25 -2 -148 -172 234 -245 117 -62 -141 164 152 173 8 -340 143 -84 62 -5 -71 2 337 -176 7
4379 7 36 193 394 75 31 -117 67 -134 -29 8 -37 5 92 -60 65 9 200 -227 102 -177 85 -141 154
4402 154 -179 -66 185 -26 46 -151 140 148 216 183 -115 1 -178 -69 73 -113 -223 -22 138 42 -124 347
4424C47l9j38j41k6L3k52K16j58r9J15m6J57o2K25k00K55l11r3M78l33J72k32
4446a32K71k80P9L8K25j11j42O8K07k15l4j39J86J08j51p4P8l6lK32j66Q7j1Q6
4470A71j21k76p5K83m2ml09K04j15M67j88J3J4n1K42m03q3N58m93O6J61O2K29
4493C10l14j45o1K62k1R9K34n26J57L2j90L42l90J07J54j90j14K84N8l5k57Q9
4515a15L65L43m56j66M9J06q8l27P0L04o6KJ56R5k75N4q7j5J21o4l01K84L93l77
4539EN9j1J52j85m5n7K82l78M37l48R5o5p1J19QJ39l4j42M9J66o1n5O6k24J28
4564B9j71J68k24K2N5J38J58k66L25k80K48j34j92K57K8l20M26j57l8k02L22k35
4586d3n9J39L9j01J55l22K13K4L06l70q9J04K61j51k11qL10k22L05j86j22o1J44
$$ plain form
4424 347 308 170 29 3 36 -216 0 -158 -257 -142 -188 -31 -93 132 -68 187 -124 -217 261 -72 100 -132
4446 -132 139 -141 -62 -24 201 90 -52 16 223 8 -26 -165 21 129 -22 -96 -18 -54 -57 175 9 96 85 171
4470 171 50 -226 -301 -18 -60 -64 -373 -169 -284 183 -5 8 22 -29 213 -190 -273 285 -208 -142 19 81 310
4493 310 -4 -149 -210 52 31 130 364 -162 -5 27 -163 179 -211 -104 50 -140 -254 30 88 53 -204 -115
4515 -115 250 593 137 -29 20 126 38 -289 -219 85 19 21 177 272 -3 51 -36 -51 70 6 -295 -11 382 5
4539 5 64 53 205 20 -25 -82 200 -178 259 -89 6 -59 -130 -11 -3 136 102 -40 9 175 114 59 125 -99 29
4564 29 -142 26 -198 -176 -121 17 175 -91 234 -46 202 68 -124 133 161 -159 267 110 72 -130 192 -43
4586 -43 -102 37 76 -25 130 -192 21 45 351 -19 -108 -4 257 106 -105 -113 197 -25 280 94 -28 -89 55
4609E5R8k34j0J44j38M39k69l44K56K8j09N8J13J35j34k76lL88j24k39J6K48n4
4632D4Jo9j3K07l74j31O21k12N1k05l7k8K33j01l44Q9L72k31J99P7k18j12L26
4655A45k12J09m1L8N3q0J68k76J62m8R8l52L18M8j02J81l28KK01p5p7R9n1j90
4679b10L15j27K01J74p18N24j73O9j86J01l36L24j79K12P0l49J99J12k04N4M8
4700g9J42J77l91L06L9l6j09o6J7p2L38j62m9O3l44L69l3J95k33j27k51K78P2
4723D4k09J12J1k0O4K50j45n8q3l7J97k14M3K1k00M08k35K62j66k54K96mr7J12
4747I8j10j60L50j78j40K59l33K75J20k88nJ08k82L30K2j63K66j77k66N54l88
4768a08L08l02J32P1l88K10l1R9r7J96l15K09R5o4m7K12m14J51J58K2j11L8k51
$$ plain form
4609 55 153 -81 -91 53 -85 354 85 -259 -3 25 -84 -26 87 222 88 -188 -191 197 73 -166 -150 98 44
4632 44 45 -24 -37 170 -204 -335 286 74 125 -80 -117 -145 88 -13 -357 -268 104 -127 72 149 -69 -181 145
4655 145 -67 42 1 39 92 12 180 -96 66 18 116 -236 82 130 28 209 -119 -117 84 9 -68 31 -20 -210
4679 -210 105 -22 179 353 -365 159 -14 55 -131 -30 -366 -42 -221 -9 61 -288 -89 23 -181 -127 -79
4700 -79 63 240 -151 155 194 158 49 -17 0 -72 266 104 55 118 -226 143 110 305 72 -55 -306 -28 44
4723 44 -165 -53 -42 -62 2 252 107 49 -34 -71 126 -88 -45 -24 -224 184 -51 211 45 -209 87 83 -14 98
4747 98 -12 -172 178 0 -140 119 -214 61 181 -107 -112 -4 -286 44 66 -97 169 -8 -274 280 -108
4768 -108 200 -102 30 101 -287 -77 -108 -9 -106 90 -225 -16 79 15 -32 180 -234 -83 75 97 -14 24 -227
4791b27L45k48N1R3K5r1Q4kJ81p4j45j63R2L80m8m11L24P2o11J66J06K95o6l02
4815a74J77L15o1j49l68J83l04O16k29M5j62J31j23pP0L00l65j60K42k11K95j74
4837a13J62j8o9Lj9R6j37K0p8M54j17J81j30j37k62M4J41K58k80k74K82L06l27
4860a4O9r6J02J21m67L20lj91N8L47k32J83R8m02M41p53L08J33M06l26k90K89
4882A01m41L77l2j77J89J67k18L33l62J52m6n5P6K3l60L2J63k3K82r1K6k3j05
4905a2q1L14l71l6L60j85L9j37J53j24l6j3oN8K41k25k25J90M03k00l7L7l18K13
4929BO9k75J02Q4J70L7k57R9p1L29j55k34J75j1L3o5J0j43L2L19m28J01Q6J73
4953A82k08J75o0K14k74k5K21j94N4M1k83n6L52m75M27Q4n60L62o0k55L08J92
$$ plain form
4791 -227 118 -130 -79 14 39 -52 32 30 211 137 -8 -171 -79 301 253 -158 166 238 -373 -207 -101 194 128 -174
4815 -174 3 318 257 108 -260 -77 -381 235 6 51 -111 20 -103 -110 -40 260 -105 -265 -23 -234 61 -113
4837 -113 49 31 -38 -35 -54 42 -95 -75 -153 301 184 365 235 98 -164 -120 21 279 -1 -275 7 313 -14
4860 -14 55 -41 61 182 -285 35 32 -159 -101 246 14 197 295 -107 334 -419 -111 22 428 102 -188 101
4882 101 -340 37 5 -172 17 184 -34 299 -63 89 43 -12 64 87 -273 -241 -78 -101 181 90 116 93 -12
4905 -12 -93 221 -150 -186 174 -11 28 -109 44 -80 -116 -129 -135 -77 164 -61 -286 -96 307 107 70 107 -211 2
4929 2 71 -204 -102 -18 152 189 -68 31 -40 289 134 -100 75 64 97 32 42 -101 -69 250 -178 -77 9 182
4953 182 -26 149 89 303 29 4 225 31 85 126 -157 -213 139 -336 91 175 -385 -23 -83 -338 -30 162
4975A62k31J67j59Q6Q0q4o2l7J61J21%j59l19K78m2J4P8K0r3Q5l64L69r2J12j04
5000a3K2k4L9k43L72Mo2m0l9p3J60k27Q3J21o0J32R3m45N6J89r9K07k26q8j5J39
5026c7K7K70l51O7K65j66k33K95j83J12j79J15K08k67L01k48J3j14L50o37M47
5047E5j14J88l92L38J78l5j36J68k12n6L0j60M27m09j95K46J08k10L23k17J22
5068D7p2Lk80L45J54j40l52L10r5M8k05L33q3j10R4J44l1q3O2j45p2J59k00K8
5092a41K06j97O5J77J28k10p9M9R9q3K06l62K93J47n34lK90k3K18n30L92J04j88
5115B4j35J45k73M21n0l12J27o6O8K86k8k32K50l24p1J98O6J37l09J11j2k80P5
5138a84J36J94m61K39R7Q1J8L7m15L65k9l99N19l31P8m3K40k61j76J61Q3rk2P2
$$ plain form
4975 162 -69 98 -61 25 105 21 -41 -78 83 204 204 45 -274 4 -38 -24 54 74 -19 66 -298 71 -21 91 -13
5000 -13 9 -15 24 -219 153 157 95 55 16 -57 103 -124 -41 80 20 152 245 -200 -144 45 -54 153 -73 -161 -176 -37
5026 -37 -10 260 -91 -24 241 75 -158 137 -46 66 -113 2 210 -57 244 -4 9 -105 245 -392 55
5047 55 -59 129 -263 75 253 218 82 250 38 -18 12 -148 279 -130 -325 -79 29 -181 142 -75 47
5068 47 -25 -22 -302 43 197 57 -295 15 -80 -32 -237 96 13 -97 -3 141 110 27 89 -56 -128 31 -169 -141
5092 -141 65 -132 -67 110 238 28 -51 -2 97 14 220 -142 151 298 -236 -239 51 28 246 -284 108 212 24
5115 24 -111 34 -239 182 132 -180 -53 -119 -51 235 207 -25 225 -99 -170 28 94 231 -78 33 21 -259 -184
5138 -184 -48 146 -315 -76 21 102 120 157 -258 107 78 -321 198 -133 -55 -98 142 -119 -295 -134 -51 -60 -82 -10
5162a0l5k86L81K01l01K2M0J2j45K05k05J43J84M2Pm72L04K76k44n0JJ28J69l18
5186D9j3L02m95K39N9k00M23m99K10k41J76m6M2O2j43J11n5J88n97L36J48J62
5208B18l58L02k62q2O4j5J98J01j44K6l44L99J30l31J74m8P6K37k95k89M48l33
5230a28M25m48R9j95K62p9K35j49J61L4j98J99m6l60K85k43j07j89N25p6m69M07
5252e5n5rj38J01K8Pl8J41J26j77m3l2m7L49j14q8O1R2j26L9J3Q6J49l84L80J21
5278C87m74J28N3r4P8j39J97%m19L39j0p5K49l72O7J26K44k41J73j44L0Q6m85
5301b96K23L59l77P1j4j19J35N4l8n0n6j14L06k88K93l7j3J97l30j68L20k07K01
5324E2J01M7k10k45K64J49k53J25J9j51M20j36J21n59K91j96J41J31L0l1m0J81
$$ plain form
5162 -10 -45 -331 50 251 -50 -28 12 24 -121 84 -121 22 206 248 255 -217 87 363 119 69 70 198 367 49
5186 49 36 338 -157 82 141 -59 364 -135 75 -166 10 -36 6 68 -75 36 -19 169 -428 -92 56 218
5208 218 -140 162 -100 -182 -118 -133 65 166 22 48 -296 103 233 -98 76 28 104 341 46 -243 205 -128
5230 -128 297 -151 -52 -247 15 -64 171 22 183 217 19 218 172 -188 97 -146 -253 -442 83 7 -462 -55
5252 -55 -110 -119 -257 -156 -128 -121 -159 -18 108 -69 -112 -144 -191 158 44 -44 17 109 -17 22 35 121 270 -114 266 387
5278 387 -87 41 94 0 78 -61 136 136 -283 56 46 -29 220 -152 -85 41 285 44 217 73 103 189 -296
5301 -296 -73 286 -91 -20 -34 -153 -18 36 -2 -52 -108 -222 84 -204 89 52 39 236 -94 -262 58 -149 52
5324 52 153 200 -10 -255 9 158 -95 30 49 -102 318 182 303 -256 35 -161 -20 111 141 110 70 251
5346B51j52l83M25K0J67m7j32m97J90N45l78p5K69l28J57nJ78j14j04K29k40R6
5368G2m8O6n66N71q3L5q9L65m18n0O5J72l3J48j70pK8j87J54k91K10K75l23J35
5392C1K58j37j46K4q2n9K24l43L02k91L53m25K91M04l43J78n75O51l79j7K44k24
5414f1K02m25N18m30M9O4J67j76j54K80Q6N1j11k05J79J94L3m3l38J38j18L97
5436B97k78K12j01L7l01K3N4N3k2p9J96k72K83L0k49L10N3k08j03L47m79J44J35
5459H2J16j18P7J39j01l79K44j02lK16j54J22N9l52j08M77l23J82lk11K20p2l18
5482c10M16k76J43j2J66k64j8L07m99N31l38J06O3L8P7j07J33l08K77J05l27J68
5504G1o5K65n98M47j87J41j85K52k61J36o4O1o7K72j56k78R9K22N6j08j42L75
$$ plain form
5346 251 99 -284 141 161 328 281 149 -348 -158 387 9 -66 203 -125 32 27 205 91 -13 216 -24 72
5368 72 24 90 -476 95 12 47 -42 323 -95 -145 -80 92 59 207 37 30 58 -129 25 -266 -56 219 -104 31
5392 31 289 152 6 30 -52 -111 113 -230 72 -219 134 -291 0 404 61 239 -336 315 -64 -81 163 -61
5414 -61 141 -284 234 -196 -147 -83 84 -92 -246 34 120 171 60 -145 34 228 261 218 -120 18 -100 297
5436 297 19 231 130 167 -134 -111 -57 -4 -26 -105 91 -181 102 132 -117 193 246 38 -65 282 -197 -53 82
5459 82 198 80 157 296 195 -184 60 -42 -45 171 17 139 198 -154 -262 215 -108 74 71 -140 80 8 -310
5482 -310 106 -170 -27 -39 127 -137 -155 152 -347 184 -154 -48 15 53 130 23 156 -152 125 230 -97 71
5504 71 6 271 -327 120 -67 74 -111 141 -120 16 -48 13 -54 218 62 -216 -117 105 161 53 -89 286
5526B86j95j64J42p6M8k86M83l71k42N09J77m44K7K36J00j6q3j18M4K95k46k64
5548a58K51k70M16m92O35n02J08j63Q9J44j22K85j35Pl62J91M7P1Q1L6l27K69
5570I9m18J28K97J9r8p6j25J71J02j06J0j46N45o93kL71j65J76o4l8L5O0M4k72
5594a46J16K23j76j41L2R6P6M0Lk10n3Q4O6j71p6q9P4K30j62oO6l9J93K18l74
5619a26l5L04k42j00L23j69L71j33k30J13Q6j61j9L5n26O06N3k35P6j52L84j62
5641F1J47l45j41M10j53O7P0l33J95o7J8n2L58j05P6j92p5l2j64L84q3R1pl01
5665a73L62q7j52j8r5J73n8j54J27L66j52k49J0L4J88k31J20j89P2K04l35J86
5687e1n7R0K58m04J03K95n12n7K02J68j57q1J5J94j68L35j52l15M0K90MJ84m18
$$ plain form
5526 286 91 -73 69 -7 41 -245 238 -133 -375 134 311 -133 -106 130 230 214 131 13 57 352 106 -158
5548 -158 93 -177 239 -253 382 -120 -12 -175 -86 58 -64 221 86 93 -269 -78 -31 40 121 157 -170 99
5570 99 -319 -191 106 125 27 -49 -174 -3 99 -7 3 -143 402 -291 -293 78 -87 89 25 -13 22 82 126 -146
5594 -146 -30 193 17 -124 -92 4 80 120 123 -87 -140 -56 10 -161 -237 -326 -252 -22 -184 -190 -124 -163 30 248 -126
5619 -126 -161 143 -99 -199 124 -45 326 193 -37 76 162 1 -18 17 -509 97 150 -85 -9 -161 223 61
5641 61 208 -137 -278 132 -21 46 116 -217 -22 -89 -71 -123 235 130 206 14 -61 -93 -257 127 44 135 128 -173
5665 -173 189 102 -50 -68 -163 10 -48 -202 -75 291 139 -110 -100 -66 122 -109 11 -178 -106 98 -237 -51
5687 -51 -108 -18 240 -164 -61 234 -278 -335 -133 35 -122 -203 -188 6 -162 173 21 -294 -254 36 40 224 -194
5710a94K2L09k12J37r6J80j15o4j58K16J19j04p9j6k00K00R0q8L04l01K5j66m
5733a95Q8k32L23j07K10j06j44J61K58L26l08m1k86J99k16j21K50K11j05k27J28
5754F6j85K82k25R3k63J50M6R7J96m63M3R4J06pok4j58J05l7J36m93K22J10NM1
5779f9m6K27q8K4p6M2n6K05O3l34K30k72K16J64k53Q8J15J26m21K30k96M30k06
5802D3N6k31J86k27M81j19L9k46q3K34k92J91L4J57j88j23J59K93l15j54K80r2
5824H3k1m2L4l64J07L33j33J9p0J65j21J29k65L1K60j20lJ19j35P6j31mN3J33
5848A33k39K08j47J13j01l5K39k49K39l23J33n8J67l93O44m16K98k38o8J4J30
5869E1J94j45R3k65J31l22K87j60K16J00k58m9O3R1l3J17PO5j4ml74o3M49m0l54
$$ plain form
5710 -194 -172 137 -75 62 -34 146 31 -33 -191 25 144 40 -39 -55 -255 -55 35 -53 251 -50 -25 -191 -195
5733 -195 -107 -339 -16 -123 87 -19 -163 -2 256 582 274 233 -53 146 -70 -191 59 270 165 -62 66
5754 66 -119 163 -62 31 -232 -82 -36 61 257 -206 -163 -69 37 30 24 0 -158 -53 -90 46 -447 -225 -115 -110 -69
5779 -69 -115 112 24 48 -28 14 -42 163 226 -108 122 -150 66 230 -23 65 180 306 -115 115 -181 249 43
5802 43 99 -132 54 -173 308 189 228 -18 -101 133 -159 32 66 223 35 -88 71 364 49 -105 175 83
5824 83 62 20 54 -310 -203 130 -3 16 -54 111 -10 119 -146 -115 145 25 22 141 6 82 -49 -53 0 133
5848 133 -106 102 -45 68 -33 -68 171 -78 161 -162 -29 -87 80 -313 331 -85 213 -25 -93 -79 51
5869 51 245 100 193 -72 59 -263 24 -136 80 180 -78 -127 -64 27 -6 111 118 183 169 165 -209 -272 177 137 -217
5894b17j9K62O3R3M4k65j06L65L0k36k15l4K37Q5l52J38j5J14K8j48J26O5J15
5917A58k08J8j01L00k53j9N4J53O7Q0l88J29M3m76M53l45N01l27j61l5L84n3o8
5940i4j56r4J93J18k22L35m16N07n5o8L91j66k07R4q7k4j36O0J49n54N27l30K87
5963E2J9J6m4K16l5j6k98k61J88P8Q9j98K59j77Q7L42k58q9L84n22n6K25j29J47
5987A9J09o4l97L19Kk26R0L75j60k41K38j30M9K26m67K62k3j02p3L31j79J69k76
6010a49J96q2J8j34M2K20j34k06J42J26m0l3M7J20j01j42K45rm2k02j00N25P5
6033C82Lm23L0J34j86K61l05J36K75m17J54j91J56Q0j8n1P4J78j19j96M7J16l7
6056H3j51K93l47J66kl9j03K21q1K1J29l46J62Q8J61j99j02P9K8l7J18k3j81K20
$$ plain form
5894 -217 -236 26 89 182 226 -39 -145 220 250 14 -201 -235 2 87 -265 -127 -142 -28 0 -148 -22 43 158
5917 158 -50 -32 -133 167 -86 -105 -51 102 169 249 -139 -10 33 -443 10 -335 166 -161 -322 -357 27 -26 -94
5940 -94 -250 -344 -151 -33 -255 80 -336 171 116 48 439 273 66 160 73 49 -87 -27 122 -432 95 -235 52
5963 52 71 87 43 259 224 208 -90 -351 -163 -85 4 -194 65 -112 -25 317 59 -30 354 -168 -224 1 -128 19
5987 19 128 64 -333 -14 -12 -238 -148 227 67 -174 64 -66 -17 209 -258 4 -19 -121 -194 137 -42 127 -149
6010 -149 47 -35 -17 -151 -109 111 -23 -229 -87 39 -1 -34 13 133 32 -110 135 126 84 -118 -218 307 382
6033 382 385 -38 -8 126 -60 201 -104 32 307 -110 44 -147 9 89 71 20 94 272 153 -43 4 120 83
6056 83 -68 225 -122 44 42 3 -100 121 40 61 190 -156 6 94 255 56 -46 33 61 24 142 119 -62 158
6080A58k50K87k86J69k57J61j43L83k81K16k9r6q1K76l27k15L73k9K8l08M17k05
6102c9J96m30K69O4k12K98l25K55j19K3P6Ok90L93m17J8L58q8l26M16m3j93K07
6125I7o9K71m80K17M8J23l20K21rk86K70k80K46j30L56l12j54J13p2J19o5J33
6147C7k1L9J18k8q0L2l8J48l54L15k20J52J03j75J02j63j25L46k87J7J04M8J53
6170B23m13L31k17J21k71L40O1n4l23L09K35j29k32L9o5M63n82J3J96n6J66q8
6192F7n6j54j1O2OL15m42K31M2j08J77k20J03q0K72n4j67MJ90j22j79Ok71M66
6216G7r1m5J02K7Kk38l1K04J2K9P1k60p8L87m07J67r3Q3J49qk75K14k0j0J31q0
6242A9O9j10N3L3j11Q5q9k80N74j48j29k83L79j37J18k31M90k27j02j63R9Or4
$$ plain form
6080 158 -92 195 -91 78 -179 -18 -161 222 -59 157 128 32 -49 227 -100 -315 58 29 57 -251 166 -39
6102 -39 157 -273 -4 60 -152 146 -179 76 -43 -20 56 62 -228 165 -252 -234 124 36 -290 126 83 -110 97
6125 97 28 299 -181 36 84 207 -113 108 99 -187 83 -197 49 -81 275 -37 -191 -78 -150 -31 -96 37
6147 37 16 55 173 145 65 97 59 207 -147 168 -52 100 203 28 130 -33 -158 188 -99 -82 22 70 223
6170 223 -190 141 -76 45 -226 114 175 121 -202 107 342 213 -19 20 -45 418 -164 -151 45 -11 155 67
6192 67 11 -143 -154 -92 -86 229 -213 18 60 -48 129 -91 12 -68 204 150 -17 -13 177 55 -124 -118 -389 77
6216 77 -14 -59 43 70 72 -166 -197 7 19 48 119 -141 -219 168 -239 -72 -165 -82 67 59 -216 -2 -22 -32 99 19
6242 19 88 -22 31 64 -47 38 -51 -331 243 95 -34 -317 62 -75 43 -188 302 75 -27 -190 -91 -85 -179
6265a79J27L41j72l68J52M4j04K0P3k9J64j75P2kP5P4j28L82k71L1j5m23M63j82
6289c0M7k78J56j93K07k35L57j24q4K32m07L90N7O7l11J84k23m1K56K1K28k60
6311A6J03j12k09N2K55j40K71l59j26L14m01K39R1L32l25j13K21n1k8j25m5K55
6333A15k51K69j32J80o3o6N1n0J2J6jpk39J94NK6O1K8k08J94l3m4L7j18o3J70
6359H3J84m97J94Q2m41M80p9J29k57J71Q6l0J02j87J67l10R8k6kL2j24L84j74
6382F5l41K92r0M48n45j1M05j14J13m22L03J26m64L20j39K1P9Lk04K24q3n2L70
6405C04l9j57l49P4j61M12k06J82K42m36J36L05o14J50L05j44j78K7K86r9n66
6426e26O57k98O3J16j19K74j58R7j54J74r0jQ9J86l11K14K26l33M3j45P2J10l14
$$ plain form
6265 -179 -52 289 117 -251 -99 -55 -159 -139 -66 -95 69 -106 -34 -36 39 113 -15 367 96 127 112 -311 152 -30
6289 -30 17 -261 -105 -298 -91 -326 31 -93 -177 55 -352 38 95 162 -149 35 -188 -229 27 48 276 16
6311 16 119 7 -202 -150 105 -35 236 -123 -249 65 -336 -97 -6 326 1 -112 109 58 30 -95 -140 115
6333 115 -136 133 1 181 118 52 103 53 65 81 80 73 -166 28 33 59 120 148 -60 134 101 57 94 -24 -87 83
6359 83 267 -230 -36 46 -395 85 6 135 -122 49 135 105 207 20 187 -123 -25 -51 -53 -21 -145 239 65
6382 65 -276 16 -74 374 -171 -182 223 109 222 -200 103 229 -235 85 -54 -33 46 49 -155 69 -14 -66 304
6405 304 265 108 -241 -167 -328 84 -122 60 302 -134 2 307 -307 -157 148 4 -174 -147 139 40 -526
6426 -526 131 -167 -104 12 -107 167 9 106 -48 126 36 35 124 310 -1 213 439 106 149 4 76 186 -128
6449a28K66k95K29j74J73J59m81K08n5L1J36p6Q8r5J02jj95J64L8M2k31L1l9J05
6473BJ19j37k76L45l1J25k28L2J3L8Nk78N25k15J3k07L89O2l45M6R0l53J37Q7
6497d2m5j06L30j67J46Jr0M58n04lJ32L8j9k18K03p9J0J77k34j37L2j06M87r8
6521A66j12p1j80K97J0k77J79j4K89j8k11k14j4M26Q9j60j15q7L1q0p0K8J30p1
6545d9K13k42J78P5k94M34k03k21N3Q3r1k9Q8P3J35n3k52q4P2J83k57J75J75J2
6569A74k14K15j49P6K7p9M7j58j75L19j39oK0m1l3j45J39Q1N4JJ01k31J97R2j2
6594A61j05q2l5r7o5K19L4o1m1j12O2J09N3J65n11O06k99KJ57j09j44J2K59j93
6618a5j04J5K39j68p5P1Km5NL5J96k91O5J18J69o8k7l8k24J68j50K77j44k95L60
$$ plain form
6449 -128 138 -157 72 -102 71 230 -251 -43 -98 -67 69 -7 81 -14 88 87 -108 56 94 136 -95 -64 -103 2
6473 2 121 -16 -292 53 22 147 -81 -49 -36 2 7 -271 254 39 52 -155 234 296 -49 -3 87 -266 -129 -42
6497 -42 -87 -193 137 -30 116 117 27 485 -19 -22 110 148 129 -89 114 35 45 222 -12 -149 -117 -223 264 166
6521 166 54 -17 -197 100 110 -167 12 -2 287 269 58 -156 -170 256 345 185 70 -17 14 -66 -136 -108 22 -49
6545 -49 164 -78 100 175 -119 315 112 -109 -56 27 -64 -93 -5 68 203 150 -102 -186 -114 69 -188 -13 162 174
6569 174 -40 175 26 102 129 50 97 -61 -236 83 -56 -62 -42 -83 -116 -261 -122 -41 13 14 115 -116 81 173 161
6594 161 56 -26 -61 -158 -223 -4 30 -31 -72 -184 -122 -13 40 205 -306 300 1 3 160 51 -93 -81 178 -15
6618 -15 -119 -104 135 -33 -108 -37 -35 -80 -75 -40 156 -135 -70 48 217 149 122 84 -140 28 -122 155 11 -284 76
6643G6q0J33j07l33K80J33K02k87q7J86Qj57j64L73k27l2kk37L58j71J72pj73
6666a43k52L22j01K02k61J78L8k07L39q1K16k04l4j8k9N6J99k31J55J47j03l21
6688a33L30k62J65K8j88K03k98N1J27k9k35L04N5j4k35O8L33k41j40L06J99n38
6710a44j89N43o0j56qO7j11Q9j28k9J77P6J82k12L20n55R6K01J3l71K31k99N41
6733B74m99J56J50J08j91k72L95j25J50m8r9k9p7L1O8p9k6J73PJ59k65j77K73
6756E7J01p4J11o7n9j6k85K88j11L2n3j2j61J45J88j15P3J51j65J68k80k6J04
6779fL6j12K7j8K08j3j63J31j07j33LJ76R1kl24J13j01L59k98%J68M3n5R5N6l32
6805a58K01K5j99J23o8J0O6k99N8Q3L70l81j44K8L13L70n48L53l55o7L91k58K31
$$ plain form
6643 76 -4 129 22 -311 -31 102 304 17 -70 116 124 -33 -197 176 -51 -83 -85 -322 36 -135 37 30 -143
6666 -143 -395 -73 -174 28 -233 -55 -17 -224 115 34 250 46 12 -6 -35 21 220 -11 144 291 188 -133
6688 -133 197 -65 100 128 -60 143 -155 -104 23 -6 -241 63 118 104 -131 -63 270 29 -111 195 394 -144
6710 -144 -333 210 150 -6 -14 53 -58 31 -97 -126 51 127 309 97 417 -138 -42 159 172 -199 32 -267 274
6733 274 -225 -69 81 189 -2 -274 121 -4 146 98 -1 -30 -107 -76 -8 -87 -113 60 67 226 -39 -216 57
6756 57 158 84 195 128 69 53 -232 56 -55 -23 -76 -88 -249 -104 84 -31 42 193 28 196 -84 -110 -6
6779 -6 30 -82 -55 -73 135 122 -41 90 -17 -150 -147 29 120 118 -206 -93 -194 165 -133 -133 35 78 23 118 174 -158
6805 -158 43 68 -131 -8 -76 -66 0 -299 -241 -158 212 -169 -313 -285 28 398 -150 203 -152 -219 172 -86 145
6828A45l04J0K46k1L7j53J34r9m1Q5m8j07K79j3LP8k41j26J55K48M5j94L8j12
6852D4J91k82k52O17n75J78J77k83J65KO6n7J11q4m3M12n73k7J28K63k66L4L5
6875a9l16K91K43k97K97j20m1j88L77k5k60R0j99pr0O8K29J21j2l36L15j18J53
6898A56j76k89K25J76M3m49N28J44m43J75J29n02N52k25k06J06J29l9l2M4J68
6919B14m00o0n7M00p9K0m59M72j46J38J34J14k29j7O3K25k40j35o3LJ87k37J61
6942Ij39K16k5mM8l99L83K36m08P1O4M5q4k73M2J25K29M7L3l00J61k68J89j63
6966a65m7K19L66n80K16K3RJ09q5J31k63P1r4o3J16p6O6p7K81m79K09K05Pr7r3
6991i1Q0J00Lj53J77n3N8J16j67k50K67N4O9n6k16M7j2j22j27L08J7J45j55j10
$$ plain form
6828 145 -159 -149 97 76 113 -40 94 -5 -46 39 -9 -116 163 150 153 231 -10 -136 19 267 312 118 156 44
6852 44 235 -47 -299 318 -257 -79 98 -185 -20 -18 48 -9 102 18 -25 387 -186 -213 -85 178 -88 -54 -19
6875 -19 -335 -44 199 -98 199 79 38 -150 227 202 -58 32 -167 -174 -264 -196 33 154 142 -194 121 3 156
6898 156 -20 -309 -84 92 135 -314 214 358 -85 90 219 -283 269 44 -162 -56 73 34 2 46 214
6919 214 -186 -246 -303 97 18 38 -421 51 -95 43 177 291 62 45 108 333 93 -42 -105 -102 85 -152 9
6942 9 -130 86 61 57 105 -294 89 325 -83 -12 52 97 13 -260 -218 -93 136 183 216 -84 77 -191 -2 -165
6966 -165 -212 7 373 -207 9 32 41 150 65 196 -67 4 -90 -153 -37 -113 -47 -124 157 -322 -113 92 99 2 -91
6991 -91 -11 89 92 -61 116 63 121 237 70 -180 87 141 210 154 -62 -15 -27 -149 -276 32 49 194 39 -71
7015g1K13R5l50J54l07L04o4J03k76J68j9m0l0K46j40J35Q1l15J86L1J54k10j0
7038C8k31k11M62M8j11r1L73k06n2P6l0Rk71K72k34K24Q9j09oK41l8l90K25J59
7062B36k49l66J66J82l7k01M06j63Q8j1J54k66J8J88l32j44N78j9k56j61K37r4
7084d6l5k01K94oJ7J34k64p6J32O2l5K1l15K51J03K1k88K18j72K1L2l8J95K76
7108C01j90J43k09J55l1p5k03M6J06l65K44p9r0K66J2P2j69L34j89k30O5nK01
7131A10m02N23p4k03j11J93k10Q6P0q2J43j92K77j23K13l27J04J24j15J77j94
7152a3j9JJ10M1RK41l73p9P1l8Q1j62K05j85j25p4K56J03N2L3k23K05j07k23K03
7177a0K31k77n1O3l8p0m8K74J0p6J89m40J70L48j35k65K77j79J05k15N1J50l04
$$ plain form
7015 -71 142 237 -113 41 -266 38 -26 77 -199 -31 -50 -90 -120 126 -14 121 202 -113 73 104 258 48 38
7038 38 -193 -404 58 106 -5 -96 277 71 19 95 65 74 -197 75 -159 65 154 45 39 280 242 -148 77 236
7062 236 -13 -379 -213 -31 -68 -269 137 -26 62 51 205 -61 -43 145 -187 -331 247 228 -28 -189 48 -46
7084 -46 -81 -282 12 6 23 157 -107 -183 -51 11 -24 -3 -318 -67 36 57 -231 -13 -185 -164 -132 -170 25 301
7108 301 111 254 45 200 169 94 -109 -63 43 -322 -78 -157 -247 19 31 103 -66 268 79 -151 -86 -91 110
7131 110 -292 231 157 -46 -157 36 -174 -88 -18 -100 43 -149 128 5 218 -109 -5 119 4 181 -13
7152 -13 -32 -31 79 120 129 370 -3 -82 -11 -49 32 -130 75 -110 -235 -309 -53 50 102 135 -88 117 10 -213 -10
7177 -10 221 -56 -107 -44 -82 -152 -200 74 84 8 197 -243 -73 275 140 -125 152 -27 78 -137 -86 64 -240
7200b40O0M11o5J8P9k44J03J38k94r8L24j49J09m10J83K8L6N3N2j05r5J27J73
7223A94l83nM06k45j36K79j92J12Q0j40J42K5j12K9L8Q9j11q0M4j28o5j78L76
7246C9j40L94m70K5M58k20j96k08M40j0l01N27j38j90K03j80j44K40k04j59J55
7267g9j12K87k19J76j33J88J41l09k65M4M85k38k85L17l05N58j89r3m6k15O28
7288C36l76M7K94j87j19j88N11q2n02Q8J43K2m12J06K38O6N6K2k2M2l55N0K52
7311C0N3o5j37M6j48K44j55N3j18nm1M53q6k19K46j82l3K21j75j62K90k03K1J94
7335A22j44J05J88m71P1M08m05K25l40L84l07j02J81l1J60j23L65n14M4K62m6
7356C2k15J33L66l42J74o0k8j58L7J11p9L23k21J14k92K39J45l14K20k40M4K65
$$ plain form
7200 -240 -180 231 166 184 263 19 122 260 -34 -132 192 43 152 -258 -75 -47 -11 42 94 -11 -106 21 194
7223 194 -189 -194 212 -33 -169 110 -82 30 110 -30 112 137 25 54 92 181 70 -10 34 -94 -159 -337 39
7246 39 -101 293 -177 -152 306 86 -110 -318 122 112 -189 338 200 10 213 33 -111 129 -75 -234 -79
7267 -79 -191 96 -123 53 -80 108 249 -60 -325 -281 204 -34 -319 -2 -307 251 62 -31 -77 -292 336
7288 336 -40 7 301 114 -5 -193 318 236 -266 -178 -35 -13 -425 -319 -81 -15 41 63 41 83 -272 -222 30
7311 30 83 18 -119 -73 -221 23 -132 -79 -197 -202 -243 210 124 -95 151 -31 -64 157 -18 -180 110 -93 -72 122
7335 122 -22 83 271 -200 -129 279 -126 99 -241 143 -164 -266 -85 -116 44 -79 286 -228 -184 78 32
7356 32 -183 -50 316 -26 148 88 60 -98 -61 50 -29 294 73 187 -105 134 279 -35 185 -55 -11 254
7378B54m54O03n79j34J15J65J01P5k29J02K19n0k77J66k70J01K03j12j1JJ72k25
7400f4q2j96L44m3k03M31j96M0J76j03l1k5p5j05j9j06J94M6N7n9oN2J92L8j60
7425I7l94J57J11O8j22QJJ31j38J90k01J31L27j31p9l46K15j44J48L0k30K44K4
7448I7j48j30MJ40o9j97L37J32k3N6j57n8M5K1j09J05K07l22r8K31J95k60j8j2
7472c1l83O78k49j85R1J79j3J9q5j74L41p4K2J9j19J08j10mK04n33L33K38j21
7495A51k63J81k18K20j72J91j55J33J05j16l7n1j37J48M7j13pJ27j32J35k53N28
7517C12l94K26m1P0k69K18l95Q9K45o1k49mJ55J32J34k36J27J66l47L19j91j32
7539a26K40o4l2j56K34j46j77L04j8Q6k84J16M00o80M15k03m2N6J0J4R2O4oO9
$$ plain form
7378 254 -200 403 -176 -310 -195 -30 71 146 -83 19 238 188 -89 77 -193 -92 111 -1 -12 -11 161 -64
7400 -64 -146 -342 2 -41 -244 187 -9 31 207 104 73 48 -27 -132 -151 -257 -63 -17 40 -19 -25 27 219 257 97
7425 97 -297 -140 -29 39 -83 -75 -74 57 -81 109 -92 39 366 235 156 -190 25 -119 29 59 -171 73 97
7448 97 -51 -181 -177 -37 -106 -303 34 166 143 199 42 -16 29 50 -59 46 253 -69 -167 64 259 -1 -19 -31
7472 -31 -414 264 15 -170 -79 100 87 106 21 -153 188 114 136 155 36 144 34 30 234 -299 34 272 151
7495 151 -112 69 -149 71 -101 90 -65 68 173 57 20 -31 -168 -20 27 -86 -93 34 -98 37 -216 312
7517 312 -82 144 103 173 -96 122 -273 -184 61 0 -249 -253 -98 34 168 -68 59 225 -122 197 6 -126
7539 -126 114 50 18 -138 96 -50 -227 77 59 145 -139 -23 377 -303 112 -91 -133 -77 -67 -53 39 103 97 166
7563A66m3M8p9K51j84j41m9J61j26J16J04j43l40M20o0J7J50j56m5j62J54J46
7585B05q1k63J18l8J21J22m05L07NJK55n04j74K04j89M47l14N2K87N2l20M3j9
7608h8L11l00j63L29R8m8j01J46k92j21K1K05j14NK21l65L74k41K39J24o2n84
7630d06K74J24j30O3J14m1j71J35K59m74K24K88j01k60J84l13p2K73J77j77Q9
7651E9j18J7j16j9K57q0J12J06k05J61l21P6K2P4R4J38j66O5n7m37M11j04j41
7674a72J89j0M4LK57J05l25K40l44n6J14K43j74J60r8j40o7J09N05n40J12q1j48
7697g4R6n4P6P3n0o43Q01j72J3m2R1k69M1K28j1k51N8o0K92j64n4J63J49k42J44
7722A39o9J19l58J79j11j40K00Q0N9m3r8K36n69K81N9k3P3k41J1J75L8j18M4N6
$$ plain form
7563 166 123 171 92 343 159 18 -31 130 4 120 224 81 -259 161 101 118 268 112 67 -95 59 205
7585 205 124 -139 -21 -59 62 184 -221 86 91 92 347 -157 -331 -127 -316 131 -183 -131 156 208 -112 -69 -88
7608 -88 223 -77 -240 89 187 139 38 184 -108 -229 -208 -3 -117 -112 109 -256 118 -123 116 240 178 -406
7630 -406 -132 -8 -138 -75 39 -2 -173 -38 221 -253 -29 259 158 -102 82 -231 -303 -30 147 -30 59
7651 59 -59 -42 -158 -177 80 0 112 218 13 174 -147 -71 -49 25 119 257 91 156 99 -338 73 -31 -172
7674 -172 17 7 51 54 311 416 91 331 -13 -69 45 288 114 274 176 36 -31 78 583 43 155 74 -74
7697 -74 22 -32 44 117 67 -576 225 53 66 24 115 -154 -113 115 104 -147 -89 -149 143 -21 -75 88 237 -5 139
7722 139 70 189 -169 10 -101 -241 -41 39 98 55 -43 193 -376 -95 -36 -59 14 -227 -216 -41 -3 -121 -77 -21
7746b1j61K95j26m4k74L69RKo2K53k90J43n1q4K10l14k2K80j8j59r8L69o5k90
7770a49PM24k94j82n0N0L59n77M15j60R2k9J95P9k17jK70k66J19l70L48j01L0
7793hk80M46m61L71j50M41k26l60M85j46M2k20n0n2O0M8j64J52n6K68j58K8J50
7816A60N5k51j74P27m01j38J82k2K5K21k97N2m63J91N3K8K31j41j87k07K97k85
7838c44L26K07o8O0p2k88O7J27j62K83k33o1K24j53k12N82m89K64P5J30k13J49
7860A99P8m51K97j59K38j00l1N5p1l0R4j98K32k96M44n24O58l48k5R5n2j33k2
7883e0l0j21o1P34n01O7p5J24k60K30j69J53k73J27K06k82j46K21O1m4k2k98L47
7906f2K25k00m2j81L85O0j02j79K23k06m5K64n5n25N82n5j59K54k68R8K4L5J65
$$ plain form
7746 -21 -182 113 -13 -57 -331 38 47 49 -13 240 -50 93 42 -42 168 -146 -168 112 94 -65 -163 206 141 -149
7770 -149 -142 282 -12 -194 -244 -194 165 -412 3 -157 -65 -94 101 180 -37 -38 232 -34 85 -285 63 -38 -8
7793 -8 -288 158 -303 68 -82 359 133 -227 258 112 154 -66 -116 -168 -108 -60 -224 -72 -128 140 -18 10 160
7816 160 215 -36 -210 517 116 -22 160 138 163 384 87 139 -324 -133 -80 -52 179 38 -149 -356 -59 -344
7838 -344 -18 189 121 181 109 -179 -112 15 -147 136 -97 -158 66 -87 -299 283 -206 58 133 263 50 199
7860 199 277 -174 123 -36 202 102 71 126 55 25 119 -79 153 -143 301 -223 435 87 62 157 105 -28 -50
7883 -50 -80 -201 -262 472 -29 38 -37 87 -173 57 -112 41 -232 -105 101 -181 -327 -106 -45 -89 -111 -409 -62
7906 -62 163 -37 -79 -260 125 185 83 -96 127 -79 -124 140 85 -440 142 87 -72 182 -86 12 36 71 236
7929B36l82J90q2Q5K3r5J58j61j1j39Q0L4J07J18J73j70k04J18n5j83K46k30L6
7952a08o0K68K7k26K76k48N1k0M9K86k84l17L66k56L0L82j77n7Qj83k4O3J25n9
7976h8J96r5k24K1J53R0J41k17J5j50J01J92n6l6k34J92n5KK61J77n75K00j52
7999a41J53j81n0O3L87k11j15P5L13j76k30J51k66J1L86j07q8J4L2j37J36L22
8021C41j79k05J87j68r0J05O8j81J83k52m5K83JKk56j03L79j38j41J66J69k64
8043a38L9L1k37K51Q1j51J61j31K46k26j7j80J23J17q6K23J65k84K42k29O2p6
8065a4J84l24p8J45k55K28j80L33k7R1j11m3P9O0nk00M6M1k56K90j16K98m30K25
8089a9r4K87o0k46J58r3K68J26l38j04J81j28J87j85N1k86K75L6%Q8l25M90n0
$$ plain form
7929 236 -146 44 -38 47 70 -25 133 -28 -39 -178 -98 -64 43 161 334 164 -40 78 23 -160 86 -144 -108
7952 -108 -168 100 127 -99 177 -71 -20 -40 9 295 11 -306 60 -196 -166 216 39 -18 -10 -193 -217 -154 -29 -88
7976 -88 108 13 -211 -190 -37 53 194 -23 -8 -158 -57 135 79 43 -191 1 -54 -52 209 386 -189 11 -141
7999 -141 12 -169 -219 -156 231 20 -95 -20 293 117 -113 38 -228 -217 169 62 -26 -12 20 -117 19 341
8021 341 162 -43 144 -24 -114 -9 59 -122 61 -191 -236 47 48 50 -206 -309 70 -68 -209 -43 126 -138
8043 -138 -99 -68 -305 -54 27 -124 37 -94 152 -74 -91 -271 -148 -31 -117 106 271 -13 229 0 62 -14
8065 -14 170 -154 -232 -87 -342 -114 -294 39 12 103 -8 -51 28 88 83 -117 -71 -30 -286 4 -112 186 -244 -19
8089 -19 -113 174 114 -132 26 -67 201 327 -11 -115 66 -62 125 -60 -9 -295 -20 16 16 104 -221 269 219
8112B19l07K19k49N4J79J88k47k4k98L87n08O16k67k16K66n4Q5j53K46K1l4J15
8134B38m07M07l80J88k51K34J89l45l49L11J6K18J6l86L63l62K07kJ19pJ7q0K45
8157A99l81K94j58J83J55k46J04J01l05J08q6J39j12J40j12K46m74L27j23K8j74
8178a47M19l2l47J92J04j72J53o9L7k22J45j57k75
$$ plain form
8112 219 -88 131 -118 -64 115 303 56 32 -266 121 -387 229 -38 -254 12 -42 43 -110 136 157 123 238
8134 238 -169 238 -142 46 -205 29 218 -127 -476 -165 -149 69 85 -301 62 -300 -93 -95 24 17 34 -46 199
8157 199 -182 112 -46 137 292 46 150 251 -54 54 -32 107 -5 135 23 269 -205 122 -1 27 -147
8178 -147 272 240 -107 85 189 17 170 101 138 -84 61 -96 -371
8191c71
$$ Imaginary data points
##PAGE= N=2
##DATA TABLE= (X++(I..I)), XYDATA
0@%%%%%%%%%qJ6j6J6j7K5l2M0m8N6o5P3q8J04j20J36j53J74j98K25k56K88l24
32a72L64m07M55n07N64o29O97p71Q55r47J049j160J283j425J583j761J966k202
50a165K481k813L219l725M378n262O528q507J2058k0415P6059N1603j45482n2204
64h3247N5685P7768j7684l3640k857Q772k3536K648M4382K5753m8934n2483J4173
77c3200N1415J0232j8210k631K191k8672j4916M4716N5194k8980q4073j9832P2690
90E924N6244k9312n5214n648K2939N531J399J8901J211l7823k3583L7986M8408
103D6963j4572n3873j3458L2943K0100j0895O72J5749j3270l7717J892N1842K4568
116E0944m6324n2078J5288N3095J6350k6336k2317L5K755M594K0305J1417k6840
$$ plain form
0 0 0 0 0 0 0 0 0 0 0 -8 8 -8 8 -9 16 -16 24 -24 32 -33 40 -48 56 -64 72 -81 93 -105 120 -136 152 -172
32 -172 192 -215 240 -267 297 -332 365 -406 449 -498 551 -609 674 -751 832 -929 1037 -1165
50 -1165 1316 -1497 1722 -2003 2375 -2887 3641 -4866 7192 -13223 62836 114439 -31043 -83247
64 -83247 -27562 50206 32522 -1118 -3975 4797 -18739 -16091 28291 54044 5110 -47373 -33200
77 -33200 18215 28447 10237 7606 9797 -18875 -33791 10925 66119 37139 -46934 -66766 5924
90 5924 62168 32856 -22358 -28006 -5067 464 1863 20764 21975 -15848 -39431 -1445 46963
103 46963 32391 -21482 -34940 -1997 18103 7208 7880 23629 10359 -27358 -25466 26376 50944
116 50944 4620 -47458 -32170 20925 37275 10939 -11378 -11343 -8588 -3994 16311 27728 888
129H88l7767P808M6802K1715k7806l1066J879J4807L578L773J1243n220k9598
142a8964j5226K6772L4176m386l3937j6699J1644J7710J0359N742r721k8737j7678
155c8945K7037M5428K949m7347l4202K3417M4109Q839k7110j9983L577P773K662
168a796N983P935m716j7220r169J2337K0603Q167j2123k1740j2303J2331K9465
181A7754J4835k2373l6193n460L5178L2659r891l6729j6551J8027K3544J512j4905
194A407q926J712K437N43N607Q796j653j5823j2287O995J9282R732j1200k0331
208a3709q363J2742K4310R372j8058k8481m564K7238K5819q370l1260j2919J8400
221g843K1510j501j3599m576L311j091j889Q237J1137n186j9095q225J4447J8655
$$ plain form
129 888 -36879 -29071 17731 39446 11640 -19426 -17547 -2740 838 4611 15854 10634 -18964
142 -18964 -34190 -7418 26758 22372 -11565 -28264 -16620 1090 11449 17191 7470 -21267 -38945
155 -38945 -11908 33520 36469 -10878 -45080 -21663 22446 31285 4175 -15808 -12231 -4458 -1796
168 -1796 4187 12122 7406 -9814 -18983 -6646 13957 22124 10001 -11739 -24042 -11711 17754
181 17754 32589 10216 -25977 -31437 3741 36400 26509 -10220 -26771 -8744 14800 16312 1407
194 1407 -7519 -5807 -3370 -2827 2780 11576 9923 -5900 -18187 -11192 8090 17822 6622 -13709
208 -13709 -22072 -9330 14980 24352 6294 -22187 -26751 487 26306 17936 -13324 -26243 -7843
221 -7843 13667 12166 -1433 -6009 -2698 -3789 -5678 2559 13696 8510 -10585 -18810 -4363 14292
235A4292J903j3221j3249k906Q953J7081R023j4498k6188n121K5209K3974p587
248A7665k7123j0175J4076J4393Q21m602l902q494p678P356J9202N562j8123j6974
262a7996N072J6713N273m736l194m931j0618j823J9232J8877j1603l1172p863
275b8769K6639K3553o890k2446r715O076R199R012M751q529j8031l860J9378J7604
289A7972q581j8442j738J0854J135n605O626J1589r084k3244r94K9692J8768j8853
303A0095k9567j334K3595J5513n737j3345r769j537R910J6565L166j8336j7330
316a8111Q655K0784J774j5397n230R748Q26j1864O54J9303P894k1675k1797J1503
330a2933K9278N765k2616j8527M571J5859R310J11q885j3659m688J5249J9098
$$ plain form
235 14292 16195 2974 -10275 -13181 -4228 12853 21876 7378 -18810 -23931 1278 25252 17665
248 17665 -9458 -19633 -5557 8836 9657 5055 1153 -7341 -15019 -7663 11539 17101 -1022 -17996
262 -17996 -12924 3789 9062 4326 1132 -3799 -14417 -16240 2992 21869 10266 -20906 -28769
275 -28769 -2130 21423 14533 -7913 -17628 -11552 -2353 6659 11410 2881 -15150 -19010 368 17972
289 17972 9391 -9051 -10789 65 1200 -4405 2221 13810 4726 -18518 -19512 10180 28948 10095
303 10095 -19472 -20806 2789 18302 12565 -780 -10549 -12086 -2176 14389 17555 -781 -18111
316 -18111 -9456 11328 13102 -2295 -7525 2223 3049 -8815 -8161 11142 19036 -2639 -24436 -12933
330 -12933 16345 22110 -506 -19033 -14462 1397 10707 10818 1933 -11726 -16414 -1165 17933
343A7933m172k2597r498J4662J4461m909r121L705M409r242p735J3114J8895o521
357A3384k5574q466J9509J9396l528j5302q570J174O304J0940P492r125k0035
370a2401m983K0088J7709p853j9458m406J0752N933k000J932L631q796j3276L551
384i577J9746Q752j5436j7352K381J3675O592k355l464n684q457J095J5589J1980
398A7485j1001k1599l075J8755J4727n877j3916m500L337M717N188M133m402j1794
412g822l970J0741J0680k263r591l051K906J87J042P088M126j0324j4435M072
426a0614K0775J0216j5878k0260J398J8814J0508o718j2622m733L775P315N718
439G694p80p931p167K173Q342K940l170k844j185l456k214O296J1690r77j6673
$$ plain form
343 17933 13761 -8836 -18334 -3672 10789 5880 -3241 464 4873 -4369 -12104 1010 19905 13384
357 13384 -12190 -20656 -1147 18249 14721 -581 -9151 -7977 -1673 9267 16759 7634 -12401
370 -12401 -17384 2704 20413 12560 -6898 -11304 -552 5381 3381 5313 8944 148 -13128 -9577
384 -9577 10169 18921 3485 -13867 -11486 2189 8781 6426 2962 -2722 -11179 -10084 5505 17485
398 17485 6484 -15115 -18190 565 15292 9415 -4501 -9001 -5664 -947 4241 8374 3972 -7822
412 -7822 -11792 -1051 9629 7366 -2225 -5276 -2370 -2183 -1141 5947 10073 -251 -14686 -10614
426 -10614 10161 20377 4499 -15761 -14363 4451 14959 8241 -4381 -9114 -5339 1976 7694
439 7694 6914 -1017 -8184 -6011 2331 5271 2101 -743 -1928 -5384 -7598 -1302 10388 9411 -7262
454g262j1584J1005K0303L211j7609j5253L878J5443Q712m997j0374o489K314
467h702Q697O859j902q070n539J854N385L042J833m65n046p327P7J2101J0749
482A3546n548j7267p455J2958J6268P43j3981j1081K863J0907O720j634p153o242
496f356p20O012P119J050n826o653m86M039N589L028k514p074n702L120J0456
511E082O140p332j2411k576J0131R369r71q355n609M48M588M871L435l738r469
526f397l758P740J0843M58j0255p819L687P538L697j866l580l634j796L071O894
541D823K914n235p592j663O338O402J343m354o792l643L752J0705N457q531j3267
556i343j516J3770J0193n208j1733l587N937N112M00m46j105m035m690K754Q208
$$ plain form
454 -7262 -18846 -7841 12462 15673 -1936 -17189 -13311 2132 10844 5847 -4527 -11016 -8702
467 -8702 -5 6854 4952 -3118 -8657 -6803 -1418 1624 3457 2992 -2054 -9381 -9304 2797 13546
482 13546 7998 -9269 -16724 -3766 12502 13245 -736 -11817 -8954 1953 8673 7039 -114 -6356
496 -6356 -7076 -1064 6055 7105 1279 -5374 -5860 -1821 3768 6796 4282 -2792 -8494 -5374 5082
511 5082 11222 3890 -8521 -11097 -966 8403 7432 -923 -6532 -6084 -1496 3375 6810 3072 -6397
526 -6397 -10155 -2415 8428 8886 -1369 -9188 -5501 2037 5734 3868 288 -3346 -5142 -2071 4823
541 4823 7737 2502 -5090 -6753 -415 5987 7330 2976 -3816 -7459 -3707 6998 12455 3924 -9343
556 -9343 -10859 2911 13104 7896 -3837 -7424 -1487 3625 4025 3579 2474 -1561 -6251 -3497 4711
571D711L837n404q425j938M395O579L759k941r295o625N539J3834M134j1851j2475
586a2166K175J3063N827o502o703k84K340P06K004L374l30o339m725L498P144
601C082L116l893n590k989J863O921O145l343j0822n556Q957J1871o35j1528o363
616h764O091P260p53k677p10j49k768p68N286N086l275p536k346N376N506R42
632E801m004m613k342K959O981L206n702q504l83P765N906k453n955k341J371
647b308J944K594K519j304o391l780M595Q400J235p403o144J701N906L411o02
662D373k832l711j662K247N764K969l761o471j971M643N920J232l510n746k327
677d843L515O735L238m667q225j898O983O572j101o129l344J222K677K003R63
$$ plain form
571 4711 8548 3144 -5281 -7219 -2824 3755 7514 4573 -4722 -11347 -5808 8026 12160 309 -12166
586 -12166 -9991 3072 8899 2397 -4306 -4590 -2250 -1544 460 3834 3504 -2835 -7560 -4062 3082
601 3082 6198 2305 -3285 -6274 -4411 2510 8655 5312 -5510 -11066 -2109 9762 9127 -2401 -8764
616 -8764 -2673 4587 3834 1157 447 298 -2470 -3238 2048 7134 3859 -3677 -6023 -647 4859 5801
632 5801 1797 -2816 -5158 -2199 4782 7988 2286 -6218 -6601 1164 7070 4617 -1338 -3679 -2308
647 -2308 -364 2230 4749 3445 -2946 -6726 -2131 6269 7504 101 -6043 -4342 1564 4975 4373
662 4373 1541 -2170 -3832 -1585 4179 7148 3387 -3084 -5055 -412 5508 6740 3230 -2516 -4843
677 -4843 -1328 5407 8645 3978 -4247 -6145 838 7410 6309 180 -3164 -1942 735 2738 3701
692C701m53l594l364Q38M991M114k139o185l747K749O321L266l444o916k917M538
708b241O410J738n681n847L26N320L951j911l541j237Q46L01O17K742J022l383
724e68n092K91O919M801l531p629k119N140N866Q26m791n149l00M344M967L68
740D343n057l955R50L821K632j169j339j593j830m95L936M831j015p198m960M597
756c501Q392J587o446o175R41M685L560J02k461l994k151K901N539J318l449n041
772d193p74L001L597J757q56m609m397J676P650M339n193q116n34N994N347j396
788C293l517k078l92M15L290L391q88n560l583L114N934K186l530m795j371K499
804a592M227K617k383n725k480M218N828P32n131l609Q69L078J328N99q19k278
$$ plain form
692 3701 3248 -346 -3710 -2872 2119 6233 4094 -2091 -5838 -3089 3232 6498 3054 -3862 -6779 -2241
708 -2241 4169 5907 226 -5621 -5295 25 3976 2065 -1476 -2713 -1867 -1566 -949 1793 2815 -568
724 -568 -5660 -5369 1550 6351 2820 -4809 -6928 -1788 4078 4904 113 -5036 -5336 -992 3975 4343
740 4343 -714 -4669 -3719 102 2734 1565 226 -1367 -3197 -3692 244 5075 4060 -3138 -8098 -3501
756 -3501 4891 6478 32 -6143 -5202 -517 3043 3145 684 -3310 -5461 -2560 2979 4297 848 -4193
772 -4193 -4967 -1966 1631 3388 2532 -2077 -6474 -4798 2852 7191 1998 -6118 -6652 -658 4689 3293
788 3293 -224 -2302 -2694 -2279 1011 4402 3514 -2046 -5629 -2515 3419 5605 2075 -2720 -4091 -1592
804 -1592 2635 5252 2869 -2856 -5336 -1118 4710 5442 311 -3298 -2429 649 1977 2576 1757 -521
820e21k642K59N052L510k971n583k424L814N515N10l647m133j044K846M938J147
836D626l829n125J80M532L795k105k926j529k73J317J883K792p05m705l339K784
852b627O249J817m189n792q80M818M964j65m440m241P29M113L680o25l848k112
868b549p7K220K130J169q83l084k997J340M847L273l020o104k078M709N580r8
884D378m479m054J084L376K691m58k460k172m04R42K658J863j352l081k846J572
900b742M871J985k537m685j403L263M143L08l356l062k19L155L178m08k597k143
916b249OJ958J684Q57j053k301j863J002L886K082k454m505r93L446L814L1k776
933E72k963k86K783K628M75k593k979m2K980J914o38j731j552R4M30J795J991
$$ plain form
820 -521 -3163 -2904 2148 5658 2687 -2896 -5320 -1506 4009 4519 872 -3261 -4305 -1459 3479 4626
836 4626 797 -4328 -4148 384 4179 2074 -852 -2381 -2654 -1337 546 3338 2633 -2072 -5411 -2627
852 -2627 3622 5439 1250 -4542 -5422 -604 4360 4195 -245 -4486 -3757 356 4036 3411 -437 -2549
868 -2549 -2626 -406 1724 2893 2010 -1074 -4071 -2731 2116 5389 2369 -3735 -5813 -1104 4476 4378
884 4378 -101 -4155 -3071 305 2996 2538 78 -2094 -2498 -1556 1102 2965 1613 -1468 -4314 -2742
900 -2742 2129 4114 1577 -3108 -4511 -1248 2895 3203 -153 -3215 -3434 -279 2899 2491 -106 -2249
916 -2249 -2243 -285 1399 2256 1203 -1098 -2961 -1959 1927 4009 1555 -2950 -3943 -497 3317 3348 572
933 572 -2391 -2677 106 2734 3209 616 -2363 -2405 575 2489 1851 120 -1432 -1338 -908 887 2878
950B878n79l686k216J945M370J405l353m340J71L793L019r22k790k090L31J809
966b55K185M40j768k297l83J547J427J693r17k653k529J243L983L057l016n065
982c308p09M185L703j423k851j673R53J131J086N96j96j641k317P96K936K184
998C452j521l201j647J401L368J621j907l859j233K779L257M66l116k151P62J615
1014H6J118L3m81j085j348j22K423J785q62k679j909J815K809J119j611l406k8
1031b343J882K295M49k046k416k00K219K034q7j599j542n90J133J762N07n16k222
1048a280j471J146K676J555j504k982j599K036L642Q21k687l023R1K348K291m12
1064A648j929j214k38J135J271R12n19k429j175J093K115J997j325k630j767J009
$$ plain form
950 2878 2299 -1387 -3603 -1658 2712 4117 764 -3576 -3405 388 3407 2485 -305 -2395 -2064 -255
966 -255 1930 2370 602 -1695 -2078 -531 896 2589 1672 -981 -3510 -2267 1716 4773 1757 -3308
982 -3308 -4017 168 3871 2448 -403 -2076 -1123 8 1094 1690 1494 -147 -2464 -1668 1268 3452
998 3452 1931 -1270 -2917 -1516 1852 3473 1566 -2293 -3526 -747 2510 2976 -140 -2291 -1529 86
1014 86 1204 1237 756 -329 -1677 -1799 624 2409 1547 -1132 -3041 -1226 1583 2702 1091 -2315 -2343
1031 -2343 -461 1834 2283 237 -2179 -2379 -160 1874 1787 188 -1354 -1944 -811 951 1458 942 -1280
1048 -1280 -2751 -1605 1071 2626 1122 -1860 -3459 -1423 2219 3040 353 -2670 -2579 -231 2060 1648
1064 1648 -281 -1495 -1733 -598 673 1585 1066 -1363 -2538 -1445 670 2667 1342 -1288 -3055 -2046
1080b046M111J391k850l191l42K594K540o50k473o11M52N23O04J073K69j351k548
1097b505L55K951J772j357k900j338J965K722R88j932k675l37J736K637j80j958
1113e6j255L73J149P51oK04o44j950r2K286K274q07l459j762K695K679j07k123
1131A50j739K97J517J506K48j523j924j42J618J654L79j948r72N6J69J332J344
1148B022m02j962k158J514L084J133k659k796N29J821K011n66j173j350o27Q84
1164f95K227M13j847j586j0J621J029p4l44r26j413j8K444K087j468l351n45J854
1182f02K556r0k226j006J47J062P91L87o40j307o72M71J842M27l96j385j048K00
1200a489J789J751q30k498j649K067K689R0k490j673J081J547M75r00j07l54l60
$$ plain form
1080 -2046 2065 3456 606 -2585 -2927 -333 2207 1557 -916 -1527 -1075 -552 52 1125 1394 43 -2505
1097 -2505 -2150 801 2573 1216 -1684 -3022 -1057 1665 2653 721 -1954 -2291 -555 2082 1902 -56
1113 -56 -1311 -938 211 962 956 1160 516 -1434 -1526 760 3034 2227 -1232 -2994 -299 2380 2273 150
1131 150 -1589 -1292 225 1731 1979 456 -1468 -1610 8 1662 2041 93 -879 -823 -654 678 2022
1148 2022 1620 -342 -2500 -986 2098 3231 572 -2224 -1695 126 2137 1571 398 -952 -1579 -695
1164 -695 1532 1945 98 -1488 -1498 123 1152 1078 734 -192 -1605 -1623 821 2908 1440 -1911 -2456 -602
1182 -602 1954 1864 -362 -1368 -1221 -159 632 1019 379 -928 -1600 -1129 713 1140 744 -641 -1689 -1489
1200 -1489 300 2051 1221 -1277 -2926 -859 1830 1920 -570 -2243 -1162 385 860 -40 -147 -501 -861
1217h61O9N29J536l34j197j733O50K324J242j609k249q51J991K332l59j942j509
1234a971P51J540Q37o62q15O6n34M11M93R72M9j741j140O85K034J208j012k145
1252i74q52J429K083M16k097j720L88J441J579m75j349n68K76L91P86O89n12j163
1270b32q85L75J647J196j183j629r30R99J970P56j169j849o61J339K458l54j782
1287F6j169M4J468N91j72k93o44p58L43J121R12p55j152j130P48J571Q43q70j621
1306h57p21J113J808M8j402j279P37Q97K03l23L8j65p53m90J117J285k40j701
1324f85j321J068K236L58j570j603k2J535J106l37j119o05K21P64L58Q1k74p41
1342e50j42MN07J143Nj588j343P30K411R82j935k242J82K064J020o90q06o08J43
$$ plain form
1217 -861 -792 -263 1273 939 -258 -1991 -1341 983 2225 616 -1633 -2484 -493 1839 1480 -462 -1971
1234 -1971 -1220 320 1157 495 -320 -254 -788 -377 116 1088 1137 -604 -1744 -1059 975 2183 1171 -974
1252 -974 -1826 -397 1686 2102 5 -1715 -1327 114 1693 1218 -131 -699 -423 -32 754 1443 931 -232
1270 -232 -1117 -742 905 2101 918 -711 -1641 -642 1328 2084 915 -934 -1595 -256 2202 1848 66
1287 66 -1103 -1059 409 1000 828 535 -109 -867 -524 597 1509 754 -398 -1528 -780 791 1634 764 -857
1306 -857 -1578 -465 1343 1391 -11 -1290 -553 344 547 224 262 97 -656 -1146 -29 1256 1016 -685
1324 -685 -2006 -938 1298 1656 86 -1517 -1539 -4 1102 765 -354 -959 -738 26 384 465 191 -550
1342 -550 -692 -688 -181 962 967 -621 -1964 -1234 1177 2159 224 -2018 -1836 228 1248 558 -248 -856 -713
1361g13M93L23L16k33m47n52k15J184P51l53p58j291O28J677O85p27j751p73J501
1380b55J411K75j508j147M37P87Q23J48r17r2l81J6M97Q24q9q55q46L7J282P55
1400A202k24j261r07M92J521R69j152j457k65J050J275k01j048p26N55P16l30
1417B09k51O47k92q13m83Q94J206L20k111q08O76J827L67j161j274K18J137L26
1435F34J69q91j047K94Q82O96k31k75j23o84o6N01J336j72j581j236R05K139O41
1454A891j821j239M19J231j49j77m05J2l04j70P53J088l88j247o85N58R99M14
1472G80P5j608r58Q06J624Q79j127j726k09J192J489r39n55o9N9l92M4Q34Q73
1491A072j443j052K24J564Q49n26j467j61K37P83P88n1j356j093Q04J510K32j288
$$ plain form
1361 -713 -220 103 419 186 -261 -813 -1028 156 907 554 -204 -1495 -867 810 1495 768 -983 -1756 -255
1380 -255 1156 1431 -77 -1224 -787 0 823 971 54 -38 -419 -403 94 918 829 -26 -872 -835 447 1202
1400 1202 978 -283 -1190 -698 823 1792 640 -817 -1082 -32 1243 1042 -6 -732 -177 539 209
1417 209 -42 605 313 -500 -983 -89 1117 1437 -674 -1482 -806 1021 1388 227 -1047 -829 308 634
1435 634 803 -88 -1135 -841 41 737 506 231 108 -576 -642 -141 1195 1023 -558 -1794 -889 1250 1891
1454 1891 70 -1169 -750 481 332 155 -250 -238 -542 -712 41 1129 741 -506 -1191 -633 366 780
1472 780 855 -753 -1711 -905 719 1598 471 -1255 -1464 -272 1217 278 -277 -346 -287 -679 -635 199 1072
1491 1072 -371 -1423 -1199 365 1214 688 -779 -940 -703 80 868 817 -539 -1632 -828 682 914 -374
1509c74p72N79Q38n5k92P6J92p92k49O85J231K2j287o01L8J219N64k19j216r82
1529a395Q36J484L29r49j390J74J557M13m98j028M69k43j26J17O55P97q56j544
1547a198L15J432Q70p25j416o39J251J152K4r26r59k60J067R23j31j089m14L90
1565c33M3J55N16M50m35j544J93J414J060o43j808j25J062P03L90q49n90l92L28
1584d05J066J0l26n66n5P0O41N56k27r32p28K68J142J005o76j332n06J160N76
1603G41n9l59o59n9K97N46q3j7p76j55P03L91J50M8j167j28M1N86J116n33j189
1624e65p48J019J146K05j017q30K08Q17M31j40l52q97P1O19O27k83j77p60L20
1643c06M83m02R37j52l11j072K9J454Q51j285j317M6J412M32j51q92m68L34L49
$$ plain form
1509 -374 -1146 -567 271 216 -76 0 192 -600 -849 -164 1067 1089 -198 -799 -761 458 1022 803 -413 -1395
1529 -1395 -559 925 1254 305 -1085 -911 646 1059 561 -467 2 -241 -367 -250 405 1202 346 -1198
1547 -1198 -883 549 1419 694 -722 -1361 -110 1042 1066 140 -819 -1079 -12 911 780 -309 -723 -333
1565 -333 -290 -135 381 831 396 -1148 -955 459 1519 876 -932 -1057 5 708 1098 249 -341 -733 -405
1584 -405 661 671 345 -221 -276 -206 435 991 764 -168 -896 -628 514 1519 843 -489 -995 165 741
1603 741 682 323 -336 -395 -98 448 365 348 -428 -583 120 511 661 709 -458 -586 -545 41 1157 624 -565
1624 -565 -1313 -294 852 1057 40 -790 -582 235 666 526 174 -723 -652 -33 594 311 134 -626 -306
1643 -306 177 -225 712 560 249 -823 -794 660 1511 226 -1091 -1045 367 799 648 -244 -712 -378 -29
1662b9L32K93m03n97J61o9L83L14K5n58q99J71R21R54m41j498m84J090J388n00
1682E54j123J6M78L16l50k09L68j82n07k02R93P03n79q51j24K29Q06R0m95o28
1702f97k53O27J007J69j333k06J76J164o59M8j73J13l85q4O75L18l31o72l45N56
1722b85J120m97l56k26J2J86N04K36m80p05o7L02O59j33m74l1K02n8J45J49N33
1743G36j012l89M19M42N09m29p73k17K15N18O22m26n81l67N43O99k36m98k50K40
1763b35J81M9JK74J01m72p31P18P04kq94p30O58J155J10q69l83k51N17Q02m88
1784B15n37k9R5M56l29J60L82O1o32m70RJ151M24r74q74P08O52m0o26n93RL61
1806d21O48k60j08j18N7K41j97K80r5J64o83j84M75Q08n03o19j35M12Q84k33l93
$$ plain form
1662 -29 303 596 193 -404 -243 -312 71 385 410 -148 -1047 -876 45 999 558 -940 -1424 -334 1054 554
1682 554 -569 -553 -75 241 -109 -318 50 -132 -639 -841 152 855 276 -575 -699 -470 336 426 -69 -697
1702 -697 -950 -323 684 853 -480 -686 -510 654 -5 43 -130 -17 -402 -486 189 507 176 -496 -841 -285
1722 -285 835 338 -18 -244 -232 -46 458 694 214 -491 -558 -256 403 270 -204 -235 -33 -91 54 203 736
1743 736 -276 -665 -246 196 705 276 -497 -714 -499 19 641 215 -366 -733 -190 509 273 -225 -475 -235
1763 -235 -54 -5 -4 270 371 -101 -832 -114 590 588 -306 -1036 -378 777 887 18 -365 -616 -99 703 215
1784 215 -322 -351 -256 200 -129 31 413 474 -158 -628 -619 532 956 -18 -892 -184 468 428 -198 -791 -782 -421
1806 -421 227 -33 -141 -259 -202 39 -158 122 27 191 -492 -676 -201 607 104 -515 -650 -238 646 413 20
1827B0m83N51o5J03J25j18l83j97N08K14M2l09oO6j35M19J18O9p18j14n7Q20K97
1850G67l05p53QN82J18r5k40j04j34L59L67O6o69k66K32J93p2P3N72n05n24j95
1872e25R50O88m85q79m46M89P08L45p08p10K84N89M4l01J01m2j93j34Q1L77R5
1893C28N9o43k37N12R44J9q79p19L88R84j12o78j58J88O30p2m29j44M1J51j8k26
1915g1M48J66n16l51J29r0Q00j77l61p18L35Q91r1k62q04L24N04n4j53p4M12m80
1937a93k14K7N92J18l54k73j82P65M1j93m58J07j79L90L30l91l03j6J59L13J93
1958B79m89K79J03n79J84M54J37p66O5R7K68N07k0m36k13l19M20K64K99o19k96
1979c81m9O35Q6n94q7J70M28n16J35M26k38j46m80N55J09K15j40k12m53L39R98
$$ plain form
1827 20 -463 88 23 126 251 133 -250 -447 61 275 317 8 2 68 -67 352 470 539 -179 -293 -350 470 767
1850 767 462 -291 -283 299 417 322 82 -22 -156 203 570 636 -33 -299 -67 126 54 127 699 194 -330 -525
1872 -525 425 1113 628 -251 -697 -208 500 845 137 -573 -289 300 344 43 144 102 -91 -225 -144 233 328
1893 328 387 -256 -493 19 963 982 103 -616 -228 756 644 -34 -192 -4 626 554 125 -19 22 173 155 -71
1915 -71 377 543 27 -324 -195 -285 515 338 -23 -741 -406 485 394 132 -672 -348 156 102 -51 -125 287 -193
1937 -193 -407 -380 212 330 -24 -297 -479 286 327 134 -324 -217 -396 -6 324 -67 -370 -386 -227 86 279
1958 279 -210 69 172 -407 -223 231 368 -398 -333 -236 32 539 519 83 -130 -449 -29 235 534 -85 -381
1979 -381 -430 205 291 -303 -390 -220 208 -308 -173 253 15 -131 -611 -56 53 268 128 -84 -537 -198 800
2000H00m96p33j24P65J79k73j66m47N07R2R9k74k32O50m44m35j6Q32Q4l83o58
2021f73K99P66L58n85n78J24M98J52J40n22k25M54j43Jo1L2J72R0k59k79M39M01
2043F01o04n19K19P12K5j42q29P3N43J90l02j49j8K78m46M83L73m14k81j65M35
2064F3m6l15L51k86n4k44O28M28n32j75m61N81K10j26j87K8k33J68J21O45k48
2085C16n85m9L68J49l11k25J42J42k06J74L57N1k69m76L39J8K67j96m94M48QK91
2107B59K39n91k82k8L28M55j22l16r0lJ26K70l9k40l54P2j74R58m09ln50J78N74
2130B58J00n81m7L84k66k34J50K10N35l92p24N22O3O51k72n60k59L62P21K1p04
2151f2n78N52O55l13k26n67O07L87k68l00J83L01j51m24j22M51J66J18m34o47
$$ plain form
2000 800 304 -429 -553 212 391 118 -48 -495 12 104 203 -71 -303 347 -97 -532 -548 284 368 -15 -673
2021 -673 -374 392 750 165 -413 -289 209 361 501 -21 -246 208 65 66 5 37 209 299 40 -239 200 601
2043 601 -3 -522 -303 409 434 292 -537 -464 79 269 -33 -182 -200 78 -368 115 488 74 -207 -372 63
2064 63 17 -298 53 -233 -287 -531 97 525 -7 -182 -643 -62 148 22 -165 -137 -370 -202 -81 564 316
2085 316 -269 -318 50 199 -112 -337 -195 -53 -259 -85 272 323 54 -422 -83 -65 202 6 -488 -40 -32 259
2107 259 498 -93 -375 -403 -75 380 258 -58 -148 -151 -25 245 206 -34 -388 -316 -490 468 59 56 -494 -316 258
2130 258 358 -223 -270 114 -152 -386 -236 -26 509 117 -607 -85 -22 629 357 -203 -462 -100 621 642 -62
2151 -62 -640 -88 567 254 28 -539 68 455 187 -113 70 371 220 -204 -326 125 291 409 -25 -672
2171f72O17L91L10l73q56N5Q90R6k59m54P8N17j83k83l4j62L63j96pO0RM68k51
2194A24k81m5J45P08o45j00j59q3N41M48k62p77o2O02L31m53k81J4M68M3L2n37
2216b29K14l5P3K54l13R4K23m5k01n46M93M56j28p69j6M06M15n35j19J58L0Q4
2238c6J20k3n8qk77L34l4J41m19k71N79j92k6K37l19N15m08j16K4K48P8j40P5
2261B4k35j79L62P34m52r08L97N79N66j113p58M78R28K36j005pK01L53l1m37m2
2282c09L19L39l02j10j38L00L63r2p28p2O40N12l1j057j94O80J60K38p43l40N99
2303C4K37k94p9n53O51L6J79l40L9J1J37K15m04l09L81M61l0o70l74M49N98j05
2325B70p51j97N80O43k28j81p33N29M29n2k6n08J91L18j17n86J08L78O58n73o41
$$ plain form
2171 -672 -55 336 646 273 -583 -528 362 458 199 -255 -177 340 157 -126 -160 -322 41 -155 -162 -102 -93 375 124
2194 124 -157 -202 -57 651 6 -94 -253 -336 205 653 391 -386 -448 154 485 32 -249 -235 233 276 308 -229
2216 -229 -15 -50 23 277 -36 58 281 236 35 -511 -18 438 310 -459 -475 -69 346 -189 -308 -150 -120 -36
2238 -36 84 61 3 -5 -282 52 18 159 -260 -531 48 -144 -170 67 -252 263 -145 -261 -237 11 89 -51 24
2261 24 -211 -390 -28 706 254 -654 -257 322 888 -225 -983 -505 423 659 -346 -353 -152 201 170 -267 -309
2282 -309 10 349 47 -63 -201 99 462 370 -358 -430 210 722 691 -366 -560 120 280 518 -225 -565 34
2303 34 271 -23 -102 -655 -4 32 211 -129 -90 -79 58 273 -131 -440 -59 402 372 -298 -672 -223 375 270
2325 270 -481 -678 -98 545 317 136 -597 -68 361 309 283 -225 -34 284 167 -419 -311 67 725 152 -489
2346d89M05K95M72m89o61L60R1N43n31l46J24K5M75n0k42n07M04M06J80l39m50
2367c24J06K04J09m63K03L3K54l46J74j56J84O6J51l27k00J05N71K29p40n55M47
2388b75Q96K09r36o19K52O81N91o68m11K81N0N39n13qr6L47J76m11q43L43J008
2409E93Jn82n20L05J009p07k13n23O06L06L02n31m53J95L44K30P2p67J29M14M33
2430F43m29o38p0O40L97o02n85J55P68j06k58n90N43M60L33q20p23M46M65N28
2450E57j52j030J59N24O65o72o45j43J356k01k87l90j7P19L12q85l37L23N68J49
2470E73p54l57J2P02J80j25o57N0Q98L05o34o53L14M19L69o82l02L52l9K29j61
2491C9k48R7J84L00j32m79J55K05k8k5m67N9O23M7k03o60k29P97M39n75m91J63
$$ plain form
2346 -489 -84 211 683 194 -467 -107 -16 527 -4 -350 -226 -201 274 224 -18 -525 -121 285 465 126 -324
2367 -324 -218 -14 95 -368 -165 -132 122 -224 -50 -206 -22 44 195 -132 -332 -227 344 573 -167 -722 -275
2388 -275 621 830 -106 -725 -473 208 799 131 -280 1 51 590 77 69 -27 320 496 85 -758 -415 593
2409 593 594 12 -508 -203 806 99 -114 -637 -31 275 577 46 -407 -212 132 362 434 -333 -204 210 643
2430 643 214 -424 -494 146 543 -59 -644 -489 279 173 -85 -675 -132 328 661 -159 -882 -436 29 557
2450 557 405 -625 -466 58 723 51 -594 -737 619 418 131 -259 -276 443 755 -130 -467 -144 424 573
2470 573 -181 -538 -526 176 356 231 -426 -376 522 827 193 -460 -146 273 642 -40 -342 10 -29 200 39
2491 39 -209 -112 72 372 240 -239 -84 121 93 68 -399 -340 283 330 127 -533 -762 35 474 -101 -592 -429
2513d29K84N03j70n37k26N67O14j08r60k10O19M58k53m45j10N96L98q08n3k02
2533d72P03L06o39m20Q0Q88J23l87m31m61O31N74j49o49k68L55O18l57n77J28
2553d04L24N11o26k75J42N01M6k05k07p1K81O50l40o20p28R63Q59l03r97k44Q33
2574I0P49l55p54m52O53L42j22q24j47R22K72K10r72J22L05N71n89l38k5J19Q98
2595F75p12p32L76P57K89j31j064J10M23O46k68o16l66O89K89o1l34m81L81L67
2615B37J90p91r4N12L78l18n29k8O37J87j42l72k31K83N79j20n22o78O52N53l
2636C80l26q99L11P15L36n04l38N2N36K3m46m84P07L77m6p98P4N43K90k37l41
2657g5n27L91N88n2n83l33M73O92l5o93l52L68P36n84k72m07O09o3J015r01k60
$$ plain form
2513 -429 -145 358 188 -349 -575 -8 606 498 -462 -672 -53 405 152 -293 -403 193 591 -217 -270 -472
2533 -472 231 537 -102 -522 -442 446 569 182 -249 -710 -79 495 346 -303 -571 -216 402 45 -532 -404
2553 -404 -80 431 -195 -470 -328 173 219 14 -193 -264 17 667 327 -293 -1021 -58 801 498 -499 -743 90
2574 90 839 484 -270 -722 -69 273 151 -673 -820 102 374 584 -388 -266 39 610 21 -317 -342 -223 675
2595 675 -37 -769 -393 364 653 522 -542 -432 -9 637 369 -247 -613 76 365 304 -30 -511 -130 237
2615 237 427 -364 -458 54 432 114 -415 -443 194 381 239 -133 -364 -81 498 378 -144 -822 -170 383 380
2636 380 54 -845 -534 181 517 13 -325 -273 263 286 -160 -644 63 440 394 -404 -330 213 503 266 -75
2657 -75 -602 -211 377 325 -258 -591 -118 574 539 -154 -506 -138 598 14 -258 -665 -56 -119 896 -5 -265
2678b65J60M62P4l89k77p1Q17p7n47o15K49O80L09q12m08M48P84j69k46n82Q1
2699c94M11N69n72n71l7N68N22n37n60K16R41j94o56k76J45P67n9l31o64P26P87
2720H01m85n45k50K83N86K31r66k55K25O88J12n96k63R5Q03O2l48o28m2O54J86
2741C48k77l98J71O1L58l08k77j51M78M45j47m57l53P18K67l81n33k90P77K50
2761C01k66o06K36M06L12k35n98j82O97K09o2m19k4K18L45j88n96J6O28M74m91
2782A75p56N18L47L68n33l38j18O01R1l01m85P8M91J13j63k73j35M28K78J49o52
2803a17k73O63J55l64k98j64N11K95j82q34K6O51M73j63q52j76N51O31R6j077
2823d48k00Q59R5Kp21j4N78K42m55l12j98J027j41k61o34L1N74J20J33n69j58
$$ plain form
2678 -265 -105 357 431 42 -235 -306 511 434 -113 -728 -479 201 510 -302 -710 -262 522 353 107 -475 -394
2699 -394 17 586 14 -557 -594 -26 496 -41 -601 -385 556 362 -294 -570 -425 342 283 -48 -712 14 801
2720 801 316 -229 -479 -196 390 621 -345 -600 -375 313 425 -171 -434 -339 464 526 178 -450 -492 162 348
2741 348 71 -327 -156 -95 263 -45 -322 -473 5 450 303 -154 -507 211 478 97 -436 -726 51 301
2761 301 35 -571 -335 71 383 148 -450 -632 65 274 212 -207 -231 -13 332 144 -452 -436 192 666 175
2782 175 -581 -63 284 652 119 -219 -337 264 355 54 -431 -353 138 251 88 -185 -320 108 386 535 -117
2803 -117 -390 273 428 64 -234 -398 113 408 226 -608 -582 69 542 379 -473 -649 -98 533 629 -448
2823 -448 -648 211 306 308 -413 -427 151 393 -62 -374 -572 455 314 53 -581 -550 24 144 277 -292 -450
2844d50M58N15q8p69n01Q17O27m66l11Q1J63K38j84m94K34L49p4j48o4k3o4M94
2866C40n8m28k35M46L14P3p66k01M06N32j85l47j45L75P1j3m22l8L55M13j24k96
2888F7l38L11L23l75k46m31O95M69l60m54m2J75M14k52k36L39K7K50m8p76J55
2909c33J73N85j7m77k31k8L85N69o80j90N05k8R6n79j76L99K71K63q24J07r6M33
2931A27K03k61l50r7L51M14m10l91j10Q32K61m96n42M46J87L14o22m08L89N07
2951C44j40n61L7R0M22J72m67o48Q17L11Q7o11l34J14O82L48p33q4J64M54k31
2972B33m94K2L65J94n7l64J6j2L15r3l92O2q6L44J96j25o39M06L68k98j56k64
2994d59L40K54R8k6n49K81J08J62Q4m84J10o8O12k75o22J65L83L95k54n67L29
$$ plain form
2844 -450 8 523 435 -334 -835 -18 609 143 -168 -87 76 314 130 -364 -130 219 145 -3 -67 -90 -154 340
2866 340 282 -146 -381 65 379 452 -314 -515 -109 423 238 -109 -254 121 192 179 -243 -281 74 487 363 67
2888 67 -271 40 363 -12 -258 -689 6 475 115 -339 -381 -206 208 -44 -280 59 86 336 288 -488 -333
2909 -333 -160 425 408 -69 -300 -328 57 626 -54 -244 261 233 329 -250 -426 -27 244 507 -317 -210 -306 127
2931 127 330 69 -281 -378 -27 387 -23 -414 -524 308 569 73 -469 -23 164 478 -144 -552 -163 344
2951 344 204 -357 -320 -230 192 364 -103 -751 66 377 464 -147 -481 -367 315 663 -70 -154 10 464 233
2972 233 -261 -239 126 320 263 -101 -85 -97 218 125 -267 -205 -291 53 249 124 -515 -109 259 -39 -195 -459
2994 -459 -119 135 233 207 -342 -61 47 209 293 -191 -81 -149 463 188 -434 -269 114 509 255 -312 17
3015A7J00L01o13n7K02M36j87jj51l54O38j51m25n25Q63J34J44k51o02Q1Q10r5
3037C14n52J12J00j22L46j26l02R4L16P6j44n6k32L02J42o7l81K8M18Q1m50l55
3059d58J89M13J43r5n19J03L3N70q9l36n39L26P96r6r74J94N52j40P1o05K77L50
3081A66K45l58m01J05J50M38m45n8J01Q0J20j06k91M34n2L9k88j93J59K10L65
3102D20l42j73l0K74p1j36k8l2K55k38r2N0K8p6K01J53J3o87N41o8M05m50l57
3125d40K32M65k1n29J39M65k09l87q3K37l3M34m66J38j89K76K36j61j97J08P0
3146H5jj03n1j17K21L52m09m28J93L29j00J6j02l5K61n8N7k46J14j13N06k34k60
3169a23K08L2j98j58K69k84P04l74j67j16Q8N1K45j50J19l37Q9L86j52j31L0j83
$$ plain form
3015 17 117 418 -195 -252 -50 386 199 198 47 -307 331 180 -245 -770 93 227 371 120 -482 -401 409 314
3037 314 -238 -126 -26 -148 198 72 -230 -136 180 256 112 56 -176 126 268 201 -180 -152 266 347 -103 -458
3059 -458 -269 144 287 192 -327 -224 -191 379 290 -46 -585 -259 537 441 -533 -339 213 73 144 -461 -184 166
3081 166 411 53 -348 -243 -93 345 -100 -158 -57 23 143 37 -254 180 128 167 -121 -314 -155 55 420
3102 420 78 -95 -125 149 78 -58 -86 -118 137 -101 -193 -143 -115 -191 10 163 176 -511 30 -38 367 -83 -440
3125 -440 -208 257 236 -293 -154 311 102 -285 -368 -131 -164 270 -196 -58 -247 29 265 104 -93 15 85
3146 85 84 -19 -70 -187 34 386 -23 -451 -258 71 -29 -13 -115 -150 111 53 110 -136 -22 -135 371 137 -123
3169 -123 85 117 -81 -239 30 -254 450 76 -91 -207 -119 -68 177 27 146 -191 -102 284 132 1 31 -152
3191a52M21J00l61j35K8K92o8k33q2K57L49n5p43J35L75J53K2m47J38j48K77k6
3213I7k81n2J5N74k52j58l8m9M21k09j16P3K1p4M5R9l52M31n96M91lQ7j05o4P3
3238G8k98j49M00K04J20l43m23N65P9m4p0k93K08J13j74j2Q6q9K62K10n91J13
3260d8O2p3L94n29q7J95J67q2k11k01O28J38l52l46J37QK32J4k90L76k15k8J09
3283bR5m50R9L5K98J08l29K59j53j96L86n2n8o7N5K4j13J45r7K25j51j98j03j17
3307c57M00l19O9J94q3J34K88m17p3J68K39l20JJ39j2j05J40j17j8J57j78K13
3329A43m29K13J20J95j11j80k81N57N5l77K12K4k82J76l5Rm1J32R8k48J35k75
3351a90L14j73K68l54J36k55J15L50l25K64m15L30O1k08k79N15j18n3J91l57J42
$$ plain form
3191 -152 269 369 8 -127 -99 193 125 -108 -190 67 416 361 -382 -247 128 281 303 -144 -6 -154 123 97
3213 97 -184 -236 -221 353 101 -57 -95 -144 277 68 -48 25 46 -28 17 116 -236 195 -401 90 87 174 69 5 78
3238 78 -220 -369 31 235 355 12 -411 154 233 189 119 -174 34 147 -27 -39 47 -42 220 430 -161 -48
3260 -48 14 -59 335 -194 -281 -86 81 -1 -212 -413 215 353 1 -345 -208 -200 32 46 -244 132 -83 -111 -2
3283 -2 93 -357 -258 -223 75 183 -146 113 -40 -236 150 98 40 -27 28 52 -61 84 -13 212 61 -137 -240 -357
3307 -357 43 -276 -207 -13 -96 38 326 -91 -164 4 243 -77 -76 63 51 -54 86 -31 -49 108 -70 143
3329 143 -286 -73 47 242 131 -49 -330 227 282 -95 117 141 -141 35 0 9 -32 100 198 -50 85 -190
3351 -190 124 -49 219 -135 1 -254 -139 211 -114 150 -265 65 126 -82 -361 154 36 -17 174 -183 -41
3372d1K46j78j91j4J45L9k4l24Q3L74Rr1l03M43o4j34J22j61j6K6r5j55K39K36
3396A71Q1o3k64K3q5M00j55r8j37K14k97l7qJ66J75K2j98L7K37k67N5LJ1K8J16
3421A30q5m5j05J90mj98K97j63j27K18k59j70n5K08K8ll6O7J23j30J16j46M64
3444C15j18n42M43J80j35n75L11QL41l09O1P6l4m5N1Q1r1L86n15J14k19K09p8
3467h5Q2J35l16K09K92l16K1j4n1L01k27qN3l0K9n8J6O8j35L6Ol7K14l53M6K32
3493A10J53n69K99l59L00oN0o0K08j38j27m1J97n2J68j99J4J90j64M9J35j54j03
3516i9J21J13L3l45J75j15J53M7j84K56j26J73l31R8q8k2K03n9j38M9K82l69J49
3539b4j57J34j24M7M9K33o2q4j28Q5j24M56m21K23M8j95n1j51j57L90M3k30Q8
$$ plain form
3372 -41 205 27 -164 -178 -33 6 -18 -342 -259 115 124 33 -270 173 109 -25 97 -64 -80 -54 -149 -304 -65 171
3396 171 252 189 -75 -52 -137 263 108 10 -127 87 -210 -247 -255 -89 86 108 -90 -53 184 -83 -28 -25 -14 14 130
3421 130 45 0 -105 85 81 -117 180 17 -110 108 -151 -321 -376 -168 -140 -143 -179 -112 11 -119 -3 -149 315
3444 315 197 -345 98 278 143 -432 -121 -113 228 -81 -20 56 22 -23 28 109 18 404 -111 3 -216 -7 -85
3467 -85 -3 132 -184 25 317 1 22 8 -43 258 31 23 76 46 75 17 33 101 -34 2 8 -29 185 -168 -122 110
3493 110 263 -306 -7 -366 -66 -72 -22 -82 126 -12 -139 -180 17 -35 133 -66 -52 138 -26 23 158 4 -99
3516 -99 22 135 168 -177 -2 -117 36 83 -101 155 29 202 -129 -31 -119 -141 62 3 -135 -86 196 -173 -24
3539 -24 -181 -47 -171 -124 -75 158 96 12 -116 -31 -155 301 -120 103 151 -44 -95 -246 -403 -13 30 -200 -112
3562a12J56j95J84j88K1K73p5j52K3J19K00l54J10Q1M1r7j48J14O5j72N10k64
3584A40j02j78J10N1l15L47J38Q0m49j26K51L43j51O9l84L50pk85k90j39L16L74
3606A43j93o3J91k32M03k11J20Ml91K45p2J61j79K21l12n4M64m16n3K60j10K18
3628A44M3j50P2k02K89k08L72n32j9J20J61P5m37K86m3J38r5K06n6j71k01l2K41
3651Anj71K00j31R5j91L47j43o3j10M5K57n3J25k50M92o02p2L58m9k81L60j14
3674D5j32Q3Q1l81N13l1k84j65L10j82L15k08k64KP1M64l40j16J39J53P2k06r4
3697a55JK73m02K00q5M37j23j25j30M9K77j92K3l37QL56k60j80L45J37j67p8K55
3720A27J14p5Pj23m1J12k64j36M81r4k36K29l03J75J2L5p8L2k29N54l74J80k93
$$ plain form
3562 -112 44 -151 33 -155 -134 139 64 -88 -65 54 254 -100 10 91 132 35 -113 1 66 -106 404 140
3584 140 38 -140 -30 21 -294 53 191 271 -178 -304 -53 290 139 208 -176 174 167 -118 -408 -547 -231 143
3606 143 -50 -113 78 -154 249 38 158 162 -229 16 -56 105 -74 147 -165 -219 245 -171 -224 36 -74 144
3628 144 187 37 109 -93 196 -12 360 -172 -191 -71 90 165 -272 14 -29 109 14 220 164 -7 -208 -240 1
3651 1 -4 -175 25 -106 -11 -202 145 2 -61 -171 -126 131 78 203 -47 445 -157 -229 129 80 -201 159 45
3674 45 -87 -4 77 -304 209 178 -106 -271 39 -143 172 -36 -300 -298 -227 237 -103 -219 -80 73 145 -61 -155
3697 -155 -154 119 -283 -83 -168 269 146 21 -109 -60 217 25 48 -289 -281 75 -185 -365 -20 117 -50 -128 127
3720 127 241 166 173 50 9 121 -143 -279 202 108 -128 101 -202 -27 -15 20 -58 -26 -255 299 -75 105 -188
3743a88L2M69k46K16l82J50J37m30K74K72j03n4k6k17K05q6k50J81L6j43N4J10
3765A1j99K19K06j61j78k86K17K18o0k73J86K91Q1l16k38M26l52j51K64L9J64
3786A08O1k58J13j27J00J90n02K78L7k87L11P8l15J33q8j68K21j94R3J46R0J11
3808A31k12J62J28k30J68K49n10Q3k21J95j8K17n4m07L27J07l10J18L12N5j16
3829A74l15J39l50K89R1j50J59j19j05J90J41j14k35K46K54o77L90j16L3N5j06
3850a26K64k12k2Q6j63J77n3j88K95k48J71N3l16M12M3n7O5k75K36j37K50k64
3872iN3r5K40oj37L7J56j64j17j08K57J66m54J01L3K8j88L58k58rM29m21J73k06
3896a41J84j7J25k56j10L27k1k81m3J62L7j88K01N5OK37l27M6m2j77L18k66j47
$$ plain form
3743 -188 -156 313 67 283 -99 51 188 -242 32 304 201 147 121 -96 109 23 -227 -46 -10 -153 -99 11
3765 11 -188 31 237 76 -102 -388 -171 47 -13 -286 -100 191 272 -44 -282 144 -208 -359 -95 -56 108
3786 108 169 -89 24 -103 -3 187 -315 -37 0 -287 24 102 -213 -80 -168 -336 -115 -309 -216 -70 20 131
3808 131 -81 81 209 -21 147 396 -114 -31 -252 -57 -75 142 88 -319 8 115 -195 -77 235 290 174
3829 174 -141 -2 -352 -63 28 -122 37 -82 -187 3 144 30 -205 41 295 -382 8 -108 -75 -20 -126
3850 -126 138 -74 -96 -10 -173 4 -49 -237 58 -190 -19 34 -282 130 173 116 181 -94 142 5 255 -9
3872 -9 44 -51 189 183 46 83 239 75 -42 -150 107 273 -181 -80 -47 -19 -207 151 -107 -116 313 -108 65 -141
3896 -141 43 26 151 -105 -215 112 91 -190 -233 -71 -34 -222 -21 34 40 277 -50 -4 -46 -223 95 -171 -318
3919c18N4N61j61q4k43J79N4K1m6j71K94o5o8j92J78J31j06j67J3k5K25o0k02
3942a98K38O1k43Q5K46j53K23k56k41J18JR4K00j67k60q2M74m0j12N1l1K4k79
3965b47K5O4M84k72L50o01k8J71J20j29K85nl25j43j13K31K78o4J12k00q2K8r2
3988a53K21J95j30q5p0j60Q2J42Pr5j2L78j32m27R8o2K30j52j07K13K71j57k68
4011a73n7J94J42j05l83L97K4l33K53l6LqPK2r0K18J37k12p5j20J78n8M23l57
4035iO9K18l46J82J03p2Q6m52L18o2j12J96k97p5J44m9K73K2l11M86n12K64M5
4058A09k01k4J84O2j78J01qP8m29K42J83q0O7L9l06L65k49q8J83L15n47J37m1
4081h6K79k95K18r3j15K15j58k51K18k90L13L84n11K8M4M30l79J83k89J5K63m2
$$ plain form
3919 -318 -264 297 136 52 -191 -12 42 63 17 -154 140 75 7 -185 -7 124 18 -149 -136 -161 64 4 -198
3942 -198 40 101 -142 -57 189 36 259 3 -238 -120 -119 -25 175 8 -252 -334 140 100 -12 39 8 32 -247
3965 -247 -222 -158 326 54 404 -197 -225 -54 66 -63 222 217 -108 -251 -364 -133 145 81 193 -7 -89 -61 -153
3988 -153 68 263 133 48 -22 -182 -100 42 49 -46 -58 320 188 -239 -141 -203 27 -125 -232 -19 252 95 -173
4011 -173 -230 -36 106 1 -382 15 39 -294 -41 -77 -74 -82 -75 -53 -143 75 212 0 -75 -195 -17 -75 348 -9
4035 -9 60 278 -68 114 217 145 231 -221 97 35 -77 119 -178 -253 -109 -158 115 137 -174 312 -200 64 109
4058 109 -92 -116 68 130 -48 53 45 123 -306 -64 119 39 106 145 -161 204 -45 -133 50 365 -182 -45 -86
4081 -86 193 -102 116 23 -92 123 -35 -286 -68 -358 -45 339 -172 -144 -100 330 -49 134 -155 -140 123 81
4103H1l25m5N83m93K15l22J34M09k28k14J46J11j56J69k09O6j72O9K75m8qJ3j08
4126e7K78k18J3P2k51R2J7R5K5k1O6j70R0k7J23r5l79K66M4JO1j13P4K1L6k05
4152a62M0J19j74K29K21n14K93kj82K39m77J96J29j03M00l37k49M13m70J10N25
4173B44k05N4n6j22J44p8N9J68j40k60l3J72j75J96j04K31K57n66J06M1l27M16
4195B2K04j63K0K15m28M68m36n7J42K42m65J6L77j87Kl0K7r2K42J13k23l37L15
4218a3J0L31k39l55L04J4j32J18k8j1k36L17lP4J10l00Qj95L77k86J29J64k25
4241f7K33j45j92J13m8K02K8j38j67M92l32k26K19N5k53O4L14m4j80l60K39L87
4263A94q2p1N9j17J9J00j36j74K01P1J19k56j9J46k88N79m65J40j84J57r3K29
$$ plain form
4103 81 -244 -289 294 -199 16 -306 -172 237 9 -205 -59 52 -104 65 -144 -78 -250 -181 94 46 38 51 -57
4126 -57 221 3 16 88 -163 -71 -54 41 66 45 111 -59 31 4 127 32 -347 -81 -37 -36 25 -88 -14 7 43 -162
4152 -162 -122 -3 -177 52 273 -241 52 50 -132 107 -370 -174 -45 -148 252 -85 -334 79 -391 -281 244
4173 244 39 93 37 -85 59 -19 40 208 68 -192 -225 -53 -228 -32 -136 95 352 -214 -108 -67 -394 22
4195 22 226 63 83 298 -130 338 -98 -155 -13 229 -236 -220 157 -30 -28 -58 -31 -123 119 232 9 -328 -13
4218 -13 -3 328 89 -266 38 52 -80 38 10 -1 -237 80 77 151 261 -39 -31 -226 151 -135 -6 158 -67
4241 -67 166 21 -171 -58 -106 96 124 -14 -181 311 -21 -247 -28 27 -226 -162 152 108 -72 -432 -193 194
4263 194 112 41 100 -17 2 102 -34 -208 -7 64 183 -73 -92 54 -234 345 -120 20 -164 -7 -100 129
4285A29j00N0J02k54q8L14p1j12J02N1j74M53l55l1K38J8l90M1J93l47L30l21
4307b22J32P3k36M36l01K02Poj39L9J03n2j40R0l1q7K70l42K18J70j93j8O3k14
4331a78j5j91N77j6On9m6m00M03J93k29J66l59L23l50K76nL2j26k81N23r6k31
4354h3K48l8L3j66J04k36K20j28P6l12L24J49N8l21J51j48L43m15R3J29K68l04
4376D5J4j58j8M23l13J7K20k04M5Rj12K21j41J93l79j9J90j49J28k30K34q7M8
4399b3J3j79J34L50k73k6J95j46J15k25k4P9k2j31K56K02j36k54j92M02O5j68
4421A2Q7p2n0J06Rl05QK22L0J07j38j64K6j61O22m25J38j29k59K71J20k62Q5J52
4445C0K3mJ9j72J54q2j28J18L58l38O3r0l7K4M7k64K09J31J4m1J65k37J03K87
$$ plain form
4285 129 29 79 181 -73 -161 153 82 -30 72 123 -51 402 47 16 254 272 -118 -77 116 -231 99 -222
4307 -222 -90 -17 -253 183 -118 84 91 85 -54 -15 88 36 -104 -14 -45 -132 138 -204 14 184 -9 -27 36 -178
4331 -178 -193 -384 193 177 183 124 78 -322 81 274 45 211 -148 175 -175 101 96 128 2 -279 244 148 -83
4354 -83 165 127 160 -6 98 -138 82 -46 30 -282 42 191 249 -72 79 -69 274 -141 -48 81 349 45
4376 45 59 -99 -117 306 -7 10 230 26 71 80 -32 189 48 241 -138 -157 33 -116 12 -218 16 -71 -23
4399 -23 -10 -189 -55 295 22 -4 191 45 160 -65 -89 -10 -32 -163 93 295 159 -95 -287 115 180 12
4421 12 99 27 -23 83 92 -213 -205 17 47 154 16 -148 -122 -283 339 -86 52 -77 -336 -65 55 -207 -122 30
4445 30 53 49 68 -104 50 -32 -160 -42 316 -22 41 -49 -86 -62 -15 -279 -70 61 75 34 199 -38 65 352
4469C52l61L09N1m76O4o0K72L19l24n24L63L57l11m2j02J21K11l71L85o2j70J9
4491B0J27k48M19l76R1l89M11j96K19O6j29K50n12K42K7L8K61l43k08K02l9J60
4513I3j72J90P6j69l9j8L71k53k21K09o4J1k47J8K71J10k68L17l4n8k30J94k7
4536F0j68j93K82j16o1R4n0L84l87K73p9r8n4J54q0JJ74k91N06k04j92J72j60
4559c3O9J6o0m9J00K74k75J31n05O54r0l08m1pJ26J71j58R4m2J84k68q1J98Qp
4584A01k12K28K55n19J65L01n32J60R7J01j53K63j35K61k74n1L22k30j58p0j49
4605b29J55J12l03k3K06K61k40LM3J10l5m1N7k68K28J8O9J64j85m01P11l66j00
4628e4K23l86J98m3Q2j53L26L1j1k0j71K21k96Q1q5n1J92l71L29j27K92k3l34
$$ plain form
4469 352 -9 300 351 -125 -61 -121 151 470 146 -378 -15 342 31 -11 -113 8 219 -152 233 171 1 20
4491 20 147 -101 318 -58 33 -356 55 -141 78 144 15 265 -247 -5 22 60 321 -22 -230 -28 -67 93
4513 93 -79 111 187 18 -21 -39 332 79 -142 67 3 14 -233 -215 56 166 -102 215 181 123 -107 87 60
4536 60 -108 -301 -19 -135 -196 -102 -152 232 -155 118 39 -59 -113 41 -39 -38 136 -155 351 147 -45 127 -33
4559 -33 36 52 -8 -57 43 317 42 173 -332 322 232 -76 -117 -124 2 173 15 109 67 251 -17 -98 100 108 101
4584 101 -111 117 372 -147 18 319 -213 -53 44 145 -8 255 120 381 107 56 378 148 -10 -80 -229
4605 -229 -74 38 -265 -288 -82 179 -61 -58 -15 95 60 19 76 -192 36 54 123 287 102 -299 412 46 -54
4628 -54 169 -217 -19 -62 20 -133 193 224 213 193 22 243 -53 28 -57 -108 84 -287 42 -85 207 184 -150
4651a50J25R0j04K37l1j32J01j71k6J68l97K26J81r5L1K60j84p1K35m98K16j6
4673em04N71J94l52M9m4j14LK36ol34K60K02k63k15L8K37k38%k28j5M52J21k33
4697h8J49j07K25J18l38o5K27J81l38j25P9Q1j2J24j12K4m28M74j68J12K89l06
4719dp3K67j71Q2J08j1j10l28K48J49j51k87O6K41mk21mN29m15j91L07O9R0m27
4743b41J35O3J80k74J57Q6Rm12L27j33R9q3J93O3P4j20j21k28K59p0k80M87l42
4766a72R1J66j42j11J47K7j8R4j32Q0J7n8l00L77j72R2J31r1l1m1J62p6K8P0O
4791A44J5J63j86l62J25M0j9J22j70K32n8K0N5l20K65J9M6k92K93k23J59pj56
4814i5j59M16j50k56N2J16K1J50j54M8P1K16k18Qk23J90J22r6R2l4n3o3J96j86
$$ plain form
4651 -150 -25 65 -39 198 167 35 136 -35 -61 107 -290 -64 117 22 53 313 129 58 293 -205 11 -5
4673 -5 -409 162 356 4 53 9 -105 -102 134 128 -206 54 256 -7 -222 -184 53 -185 -185 -413 -428 24 145 -88
4697 -88 61 -46 179 297 -41 -106 121 302 -36 -161 -82 -1 -13 111 -1 23 -405 69 -99 13 302 -4
4719 -4 -77 190 19 101 209 198 88 -240 8 157 6 -281 -215 26 22 -199 -203 326 -89 -280 27 96 186 -241
4743 -241 -106 -43 137 -137 20 106 115 -297 30 -103 -4 -87 106 169 243 123 2 -226 33 -37 -317 170 -172
4766 -172 -81 85 -57 -168 -21 6 -12 82 -50 30 47 -11 -311 66 -106 -14 117 26 -5 -46 116 40 68 138 144
4791 144 159 322 136 -226 -101 -61 -80 42 -128 104 46 66 121 -199 66 85 131 -161 132 -91 68 61 -95
4814 -95 -254 162 12 -244 -192 -76 -55 95 -59 -11 60 276 58 66 -157 33 155 59 151 117 64 1 197 11
4838A1j28K44j91j41J78J53j11j96R9K03J07K6k04j64J16K61j3m27O4L01j54K3
4860E7k54L14P2m63L19j94K98l20J37K42l54q3K07R1J56j87o6J69l0m38L01K48
4882B22k80j31J75j05n3L1o9K59J28j13k00K27N9k62Q5K40j28r1R4R5n9J03r8
4905A29j64l01N20l12J94k16O5K08K4J71m73J00J95R3J5j71J49r4j3P7m94K97
4927aJ11l90L95j95R2K6nj39j57J87K09k12n1m8J37K78m57J02K20J11j14J54n20
4950b67K88j96J03m4LN7N7OJ81N6k75j50K04lm2L0R3L1l28J7L23M76m87P0O2k03
4976F2k48K86q2N8l8J5j36j19L66j75m3RJ12m64j3L85L98j25l06k58O6K91O8j03
5000FK01l11K93k29q5J92k10p5K55j15pj02O7M18k39J15j99l98N75j55M3J41n18
$$ plain form
4838 11 -117 127 -64 -205 -27 126 15 -181 -82 121 228 254 50 -114 2 263 250 -177 -113 188 34 57
4860 57 -197 117 189 -274 45 -149 149 -171 -34 208 -146 -229 -22 69 225 38 -28 141 111 -327 -26 222
4882 222 -58 -189 -14 -119 -172 -141 -210 49 177 64 -136 91 150 -112 -27 213 85 -6 88 183 124 227 129
4905 129 -35 -336 184 -128 66 -150 -85 123 147 318 -155 -55 140 233 248 77 226 132 119 196 -298 -1
4927 -1 110 -280 115 -80 12 38 33 -106 -263 -76 133 -79 -130 -178 -41 237 -220 -118 102 213 99 253 -267
4950 -267 21 -175 -72 -116 -113 -56 1 7 188 244 -31 -181 23 20 -22 8 101 132 -196 -179 144 620 133 203 265 62
4976 62 -186 100 18 76 38 53 -83 -202 164 -11 -54 -45 67 -397 -410 -25 373 248 -58 -316 -250 41 109 6
5000 6 207 -104 189 -40 -125 67 -143 -218 37 -78 -85 -187 -120 298 59 174 -25 -423 152 -3 40 181 -337
5023c37N76j14k19K22k13J40o9K21l28L9k1M61l77J02j86R8J46k58J50l5n2j09
5045a63J01r4N36l64P4l03J90r0k2L46k27j03l21O62M3l83k4K41k38J69k84K74
5067B0p1j52L84k60J20o4l13J51L20r1JJ29O9m11J7J83j76J63J29k55J9J30o8
5090b6k64M21k71J84K69k81O0J75l54J9J40m0jo9K94m25q4L31K15n08j22M37P9
5113A79k4j1n8m9j44R4l17M8J92M8Q7k2k5q5p0J13j8o2p8J56J26p2k74N50l53
5138f9j51J88O8K23q7J39o20J70j64L09L09r8l25q0K00J48l06K35j94R0M6j10
5160g9J97l3J3M0l39K87R7l19J18J82o8r3J2J67n67L84k41L04j41K63j49K8J48
5183B11l38K78l08K69j31J05j19l9k0L07q3l59R5J07K20L1p1l78K05J38j55J80
$$ plain form
5023 -337 239 125 -94 128 -85 55 -14 207 -121 -82 -103 358 -19 83 -103 -5 141 -117 33 -2 -54 -163
5045 -163 -62 -156 380 16 90 -213 -23 -113 -135 211 -16 -119 -440 222 265 -118 -142 99 -139 30 -254 20
5067 20 -51 -203 181 -79 41 -23 -336 -185 135 44 45 174 243 -168 -151 32 -144 19 148 -107 -88 42 -26
5090 -26 -290 131 -140 44 313 32 92 267 -87 -68 72 32 31 -38 256 -169 -253 78 293 -215 -337 100 179
5113 179 155 144 86 37 -107 -13 -330 -282 -90 -42 45 23 -2 -87 -157 -44 -62 -124 -202 -46 80 8 -266 284 -69
5138 -69 -220 -32 36 259 172 311 -309 -139 -303 6 315 217 -108 -188 12 160 -146 89 -105 -15 31 -79
5160 -79 118 85 98 138 -201 86 183 -136 -18 164 96 3 15 182 -385 -1 -242 62 -79 184 35 63 211
5183 211 -127 151 -157 112 -19 86 -33 -72 -92 215 132 -227 -132 -25 195 226 155 -223 -18 120 -35 145
5205A45j21rk02J09J7l19M64k27K98M7j49j20N3l1L6J70l76l3O39l42j55p3O09
5228D30l86j1k28J84R8q4J36k50k60Q49n78J38l2l04N51l42n3rK67k4K05k01l5
5251F1N2M9k33k6K15RM2l09J09j67KJ66K88k40O2j30K39k10k93K43l02N16J5N5
5275B13k71j03RK30j75P6K15l67K06K11j81k43J23K40K1j93J11k06K58j59K40
5296B55l83j57J35JJJ56Q6j28k43M42k36J17k84K02J77l79L04p6L9R5k41j2J74
5319D5l28L02m42L49L06m92K48K50k41N5p1Kk46K51j67Q8L12k02j95L49J88k89
5341G2K2l0lr4K06j81Q7J5J97j3k25pk35K16Nk1Q7Q9j02j89J19k21L90j4l19k2
5367a71L65j02l84M84l41J07M5K06j17K0J2k43K55j73J5l8R2J13j48J04K8n7J80
$$ plain form
5205 145 24 15 -187 -78 -61 -380 84 -143 155 202 53 -67 -14 -45 -9 161 -215 -248 391 49 -106 -179 430
5228 430 44 33 -195 -11 87 3 139 -111 -371 478 -100 38 6 -298 253 -89 -142 -151 116 92 297 96 61
5251 61 113 162 -71 -97 118 127 169 -140 -31 -198 -196 -30 258 18 80 -50 189 -21 -314 -71 -373 143 158 213
5275 213 -58 -161 -152 78 -97 -21 194 -173 33 244 63 -180 -57 183 204 11 122 -84 174 15 255
5296 255 -128 -285 -150 -149 -148 8 94 -34 -277 165 -71 46 -238 -36 141 -238 66 -10 29 124 -117 -129 45
5319 45 -283 19 -423 -74 232 -260 -12 238 -3 52 -19 -17 -263 -12 -179 -91 221 19 -176 173 361 72
5341 72 94 64 61 -33 173 -8 79 94 291 278 53 46 -189 27 32 11 98 187 85 -104 15 -206 184 170 -149 -171
5367 -171 194 92 -292 192 -149 -42 3 209 92 112 124 -119 136 -37 -22 -60 32 145 -3 101 129 72 252
5390B52j61l41L64j78L07k39Q0l08L55l55J77K09k98L21j42j33Q6J9j23N5J08
5411E5k60j01K99o2k8J12n8l38O59l70l3L02j77J17k72r4K30m4K95q2m8j84j09
5434a91K06j4n8k08J02J29J23k9j02k31L67J83l04M5q1J4m6p7K42j0j66j5J29
5457Hj68M45k32j64J71j23N8R5k76J29R9Q3l4J38j60j49M96j59q6J00J10j99j14
5480F8q5K3p1j18P4P6j87oR4L09j17j40J29j83j07L22j89L41q5k18p3J80k53J31
5504h5K95k66K30j54j36j65L13j89j96K66k9j1R9k2k4j14K27K7j22j01J42Pm4
5527e2J93k90L13j69l7P3O7P5k04NJk15L45k12k11L29J63M6l89J59r2R2K60n77
5551c27L41l7O2om7R4k90M5J99J88k28q4o7P8M1J48O5k43kjK92j22j8Q7J21j31
$$ plain form
5390 252 91 -250 114 -64 243 4 84 -224 131 -224 -47 162 -136 185 43 -90 -4 15 -108 -53 55
5411 55 -205 -306 -7 -69 -97 15 -43 -381 278 -92 -125 177 0 117 -155 -249 -19 -63 232 150 102 -82 -191
5434 -191 15 1 -57 -265 -163 -34 89 60 -42 -273 94 277 -27 18 -63 -49 -95 -172 70 60 -106 -121 8
5457 8 -160 285 53 -111 60 -63 -5 90 -186 -57 42 125 91 229 69 -80 416 257 171 271 381 182 68
5480 68 -17 6 -65 -183 -109 -33 -220 -226 -132 177 60 -80 49 -134 -241 81 -108 233 148 -70 -143 37 -216 -85
5504 -85 210 -56 174 20 -116 -281 32 -157 -353 -87 -116 -127 -28 -50 -74 -188 39 66 -56 -157 -15 -8 -52
5527 -52 141 -149 164 -5 -42 31 98 173 -31 -26 -25 -240 105 -107 -318 11 174 220 -169 -10 -102 -10 250 -327
5551 -327 14 -23 39 33 -14 80 -210 -165 34 222 -6 -90 -157 -79 -38 110 175 -68 -70 -71 221 99 81 168 289 158
5577A58k92K83j50L05l28k23Q3K91l28J76l2L27m13m7L18l54L66j75j81k7N54
5598C11m84O5L94l35l12J77K85PL2j85K91l90K21j86Mj54K01k3J67O2l14K08k49
5621b07K43o9J20j82m5J62O9j87K09l81P5K77j48j38J02j10M7K07J14j87k7j0
5643f6J45j17N2k13K07K5O0Mk95R6N2K8j5L05j64k25J07j11M53o04K54K16j18
5666G6J37k02K24j88k91L09NJ53l70J61l5j10J63J02l43rJ90O4L29m35k26J47
5688a49l8K00L2O2j83k6O4K84j91L9J27M7K3k65q1J95q8R8n9o8j58o9L93j81K0
5713B8q7J75j10K17j82Q4j47lj3o1J1OL99k78J27r4j8O6k08Q3J64k6O1k74n1o5
$$ plain form
5577 158 -134 149 -1 304 -24 -247 -164 127 -201 -25 -57 270 -143 -190 128 -226 140 -35 -216 -243 311
5598 311 -173 -108 286 -49 -361 -184 101 108 140 -45 246 -144 77 -109 -105 -259 -58 -81 86 148 -166 42 -207
5621 -207 36 -33 87 -95 -140 22 91 -96 113 -268 -193 84 -64 -202 -100 -210 -163 44 158 -29 -56 -66
5643 -66 79 -38 14 -199 8 33 93 97 -198 -102 -50 -22 -37 268 104 -121 -14 -125 328 -276 -22 194 76
5666 76 213 11 235 47 -244 65 70 223 -147 14 -21 -131 32 134 -209 -218 -28 36 365 -70 -296 -149
5688 -149 -187 13 45 107 -76 -102 -38 246 55 94 221 268 291 26 -55 140 52 150 91 23 -135 -204 189 8 28
5713 28 -59 116 6 223 41 125 -22 -25 -38 -99 -88 -82 317 39 166 72 54 120 -88 -5 159 133 194 -80 -131 -196
$$ [...]
8191A2
##END NTUPLES=NMR FID
##END=
