##TITLE=1H_Pr T-792-2
 D2O, 8 sc, 
 19.11.2019
##JCAMPDX= 6.0         $$ Bruker NMR JCAMP-DX V2.0
##DATA TYPE= NMR FID
##DATA CLASS= NTUPLES
##ORIGIN= UXNMR, Bruker Analytische Messtechnik GmbH
##OWNER= root
$$ XWIN-NMR		Version 3.5
$$ Tue Nov 19 16:08:54 2019 Russian Standard Time (UT+4h)  she@DPX200
##.OBSERVE FREQUENCY= 200.1315
##.OBSERVE NUCLEUS= ^1H
##.DELAY= (6, 6)
##.ACQUISITION MODE= SIMULTANEOUS
##.ACQUISITION SCHEME= undefined
##.AVERAGES= 8
##.DIGITISER RES= 18
##SPECTROMETER/DATA SYSTEM= spect
##.PULSE SEQUENCE= zg30
##.SOLVENT NAME= CDCl3
##.SHIFT REFERENCE= (INTERNAL, CDCl3, 0, 15.7039)
##AUDIT TRAIL= $$ (NUMBER, WHEN, WHO, WHERE, WHAT)
$$ ##TITLE= Audit trail, XWIN-NMR		Version 3.5
$$ ##JCAMPDX= 5.01
$$ ##ORIGIN= Bruker BioSpin GmbH
$$ ##OWNER= she
$$ F:/spectra/data/she/nmr/H-F/1/audita.txt
$$ ##AUDIT TRAIL=  $$ (NUMBER, WHEN, WHO, WHERE, WHAT)
(   1,<2019-11-19 16:07:55.01 +0400>,<she>,<DPX200>,
      <created by zg, POWCHK disabled, PULCHK disabled
       configuration hash MD5:
       00 E9 B6 7A A2 85 ED C7 34 08 36 98 17 FE 4E 26
       data hash MD5: 16K
       A5 A9 3B 57 5C 88 A2 75 C4 56 F0 58 0C BB 76 E7>)
$$ ##END=
$$ 
$$ hash MD5
$$ C8 4A EB 79 FE CE A3 F8 07 51 2D E5 6B D4 3D 0F
##$RELAX= 
##$RELAX= 
##$RELAX= 
##$RELAX= 
##$RELAX= 
##$RELAX= 
$$ Bruker specific parameters
$$ --------------------------
##$DU= <F:/spectra>
##$EXPNO= 1
##$NAME= <H-F>
##$PROCNO= 1
##$TYPE= <nmr>
##$USER= <she>
##$AMP= (0..31)
100 100 100 100 100 100 100 100 100 100 100 100 100 100 100 100 100 100 
100 100 100 100 100 100 100 100 100 100 100 100 100 100 
##$AQSEQ= 0
##$AQ_mod= 1
##$AUNM= <au_zg>
##$AUTOPOS= <>
##$BF1= 200.13
##$BF2= 200.13
##$BF3= 200.13
##$BF4= 200.13
##$BF5= 200.13
##$BF6= 200.13
##$BF7= 200.13
##$BF8= 200.13
##$BYTORDA= 1
##$CFDGTYP= 0
##$CFRGTYP= 5
##$CHEMSTR= <none>
##$CNST= (0..31)
1 1 145 1 1 1 1 1 1 1 1 1 1 1 1 1 1 1 1 1 1 1 1 1 1 1 1 1 1 1 1 1 
##$CPDPRG= <>
##$CPDPRG1= <>
##$CPDPRG2= <>
##$CPDPRG3= <>
##$CPDPRG4= <mlev>
##$CPDPRG5= <mlev>
##$CPDPRG6= <mlev>
##$CPDPRG7= <mlev>
##$CPDPRG8= <mlev>
##$CPDPRGB= <>
##$CPDPRGT= <>
##$D= (0..31)
0 1.2 0 0 0 0 0 0 0 0.06 0 0.03 0 0 0 0 0.0002 0 0 0 0 0 0 0 0 0 0 0 0 
0 0 0 
##$DATE= 1574165274
##$DBL= (0..7)
120 120 120 120 120 120 120 120 
##$DBP= (0..7)
150 150 150 150 150 150 150 150 
##$DBP07= 0
##$DBPNAM0= <>
##$DBPNAM1= <>
##$DBPNAM2= <>
##$DBPNAM3= <>
##$DBPNAM4= <>
##$DBPNAM5= <>
##$DBPNAM6= <>
##$DBPNAM7= <>
##$DBPOAL= (0..7)
0.5 0.5 0.5 0.5 0.5 0.5 0.5 0.5 
##$DBPOFFS= (0..7)
0 0 0 0 0 0 0 0 
##$DE= 6
##$DECBNUC= <off>
##$DECIM= 24
##$DECNUC= <off>
##$DECSTAT= 4
##$DIGMOD= 1
##$DIGTYP= 9
##$DL= (0..7)
0 120 120 120 120 120 120 120 
##$DP= (0..7)
150 150 150 150 150 150 150 150 
##$DP07= 0
##$DPNAME0= <>
##$DPNAME1= <>
##$DPNAME2= <>
##$DPNAME3= <>
##$DPNAME4= <>
##$DPNAME5= <>
##$DPNAME6= <>
##$DPNAME7= <>
##$DPOAL= (0..7)
0.5 0.5 0.5 0.5 0.5 0.5 0.5 0.5 
##$DPOFFS= (0..7)
0 0 0 0 0 0 0 0 
##$DQDMODE= 0
##$DR= 18
##$DS= 0
##$DSLIST= <SSSSSSSSSSSSSSS>
$$ [...]
##$SUBNAM2= <"">
##$SUBNAM3= <"">
##$SUBNAM4= <"">
##$SUBNAM5= <"">
##$SUBNAM6= <"">
##$SUBNAM7= <"">
##$SUBNAM8= <"">
##$SUBNAM9= <"">
##$SW= 24.9337058887773
##$SWIBOX= (0..15)
0 0 2 0 0 0 0 0 0 0 0 0 0 0 0 0 
##$SW_h= 4990.01996007984
##$TD= 16384
##$TD0= 1
##$TE= 0
##$TE2= 300
##$TE3= 300
##$TEG= 300
##$TL= (0..7)
0 120 120 120 120 120 120 120 
##$TP= (0..7)
150 150 150 150 150 150 150 150 
##$TP07= 0
##$TPNAME0= <>
##$TPNAME1= <>
##$TPNAME2= <>
##$TPNAME3= <>
##$TPNAME4= <>
##$TPNAME5= <>
##$TPNAME6= <>
##$TPNAME7= <>
##$TPOAL= (0..7)
0.5 0.5 0.5 0.5 0.5 0.5 0.5 0.5 
##$TPOFFS= (0..7)
0 0 0 0 0 0 0 0 
##$TUNHIN= 0
##$TUNHOUT= 0
##$TUNXOUT= 0
##$USERA1= <user>
##$USERA2= <user>
##$USERA3= <user>
##$USERA4= <user>
##$USERA5= <user>
##$V9= 5
##$VALIST= <valist>
##$VCLIST= <CCCCCCCCCCCCCCC>
##$VD= 0
##$VDLIST= <DDDDDDDDDDDDDDD>
##$VPLIST= <PPPPPPPPPPPPPPP>
##$VTLIST= <TTTTTTTTTTTTTTT>
##$WBST= 1024
##$WBSW= 4
##$XGAIN= (0..3)
0 0 0 0 
##$XL= 0
##$YL= 0
##$YMAX_a= 311310
##$YMIN_a= -169508
##$ZGOPTNS= <>
##$ZL1= 120
##$ZL2= 120
##$ZL3= 120
##$ZL4= 120
##$ABSF1= 10
##$ABSF2= 0
##$ABSG= 5
##$ABSL= 3
##$ALPHA= 0
##$AQORDER= 0
##$ASSFAC= 0
##$ASSFACI= 0
##$ASSFACX= 0
##$ASSWID= 0
##$AUNMP= <proc_1d>
##$AZFE= 0.1
##$AZFW= 0.1
##$BCFW= 1
##$BC_mod= 2
##$BYTORDP= 1
##$COROFFS= 0
##$CY= 11.3945322036743
##$DATMOD= 1
##$DC= 2
##$DFILT= <>
##$DTYPP= 0
##$F1P= 16.9975609425685
##$F2P= -3.02152046262296
##$FCOR= 0.5
##$FTSIZE= 0
##$FT_mod= 4
##$GAMMA= 1
##$GB= 0.15
##$INTBC= 1
##$INTSCL= 1
##$ISEN= 128
##$LB= 0.24
##$LEV0= 0
##$LPBIN= 0
##$MAXI= 10000
##$MC2= 0
##$MEAN= 0
##$ME_mod= 0
##$MI= 1.114404
##$NCOEF= 0
##$NC_proc= 0
##$NLEV= 6
##$NOISF1= 3.799351
##$NOISF2= 2.8
##$NSP= 1
##$NTH_PI= 0
##$NZP= 0
##$OFFSET= 15.70392
##$PC= 1
##$PHC0= -9790.063
##$PHC1= 14.80086
##$PH_mod= 1
##$PKNL= yes
##$PPARMOD= 0
##$PSCAL= 0
##$PSIGN= 0
##$REVERSE= no
##$SF= 200.130013532006
##$SI= 16384
##$SIGF1= 3
##$SIGF2= 2
##$SINO= 400
##$SIOLD= 16384
##$SREGLST= <1H.CDCl3>
##$SSB= 0
##$STSI= 0
##$STSR= 0
##$SW_p= 3612.71676300578
##$SYMM= 0
##$S_DEV= 0
##$TDeff= 0
##$TDoff= 0
##$TI= <>
##$TILT= no
##$TM1= 0
##$TM2= 0
##$TOPLEV= 0
##$USERP1= <user>
##$USERP2= <user>
##$USERP3= <user>
##$USERP4= <user>
##$USERP5= <user>
##$WDW= 1
##$XDIM= 8192
##$YMAX_p= 0
##$YMIN_p= 0
$$ End of Bruker specific parameters
$$ ---------------------------------
##NTUPLES= NMR FID
##VAR_NAME=  TIME,          FID/REAL,        FID/IMAG
##SYMBOL=    X,             R,               I
##VAR_TYPE=  INDEPENDENT,   DEPENDENT,       DEPENDENT
##VAR_FORM=  AFFN,          ASDF,            ASDF
##VAR_DIM=   8192,          8192,            8192
##UNITS=     SECONDS,       ARBITRARY UNITS, ARBITRARY UNITS
##FACTOR=    0.0002004,     1,               1
##FIRST=     0,             0,               0
##LAST=      1.6414764,     0,               0
##MIN=       0,             -169508,         0
##MAX=       1.6414764,     311310,          0
$$ Real data points
##PAGE= N=1
##DATA TABLE= (X++(R..R)), XYDATA
0 0 0 0 0 0 0 0 0 6 -8 8 -8 13 -16 23 -24 31 -37 40 -48 57 -71 80 -94 109 -126 144 -162 185 -213 239 -271
31 -271 303 -341 382 -426 476 -529 588 -652 724 -802 890 -981 1089 -1204 1337 -1482 1649
48 1649 -1841 2061 -2319 2629 -3002 3466 -4062 4861 -5987 7712 -10701 17305 -63712 142126
62 142126 235273 -97324 -169508 31077 93573 -88689 -75699 127181 137081 -95102 -139061
73 -139061 52879 122948 -22387 -56238 62556 61161 -74567 -41188 134049 128047 -64106
84 -64106 -95838 67447 115968 -18532 -60747 49275 75979 -32769 -55998 44128 62463
95 62463 -33635 -42952 55864 68226 -26876 -39611 47650 47936 -50993 -53846 61632 93216 -16958
108 -16958 -87544 -20181 54667 33231 -7895 5739 23435 -360 -16873 9882 32216 17952
120 17952 1155 2629 -3451 -15425 1214 35057 27783 -25012 -48266 410 53647 27338 -40742
133 -40742 -41803 28061 50284 -18483 -67073 -14293 49904 20557 -41203 -25453 21927 -1731
145 -1731 -49464 -12699 58279 35920 -41927 -40498 18072 15279 -21043 15452 67184 9257 -81987
158 -81987 -38555 78563 75738 -25428 -41444 31605 34865 -27602 -8962 69548 52055 -38689
170 -38689 -41166 31794 34057 -13401 14897 62722 -4087 -91109 -22267 103542 64890 -71590
182 -71590 -66291 51670 53634 -49660 -45426 58890 51391 -61006 -66188 45040 66674 -24589
194 -24589 -49729 15969 24076 -25431 -125 63028 17863 -76152 -37513 82302 75267 -39024
206 -39024 -54253 36221 49605 -23217 -16883 63565 52014 -43871 -49683 41865 67042 3153
218 3153 -15000 24213 9329 -39401 -2906 77241 50572 -52961 -58864 34433 59944 -10897
230 -10897 -34936 22333 35017 -24204 -39735 17976 43356 -2019 -29661 -3714 11978 -5489
242 -5489 -4269 18693 6516 -29195 -17493 30251 27812 -27170 -38644 14476 40592 -1494 -36633
255 -36633 -10872 22715 7936 -20762 -10489 16966 9847 -21894 -26883 1096 18100 4907
267 4907 -12488 -16900 -16764 -13672 3516 18938 1722 -34240 -36175 3621 24711 -3321 -29715
280 -29715 -11096 10553 -9826 -29826 -1477 29809 4042 -39219 -27520 16756 23252 -4657
292 -4657 -13284 -4258 -10112 -10763 17528 31075 -9731 -44522 -7814 41523 19743 -28573 -16238
305 -16238 24169 7637 -32032 -10354 39025 23106 -35714 -38855 10434 26218 -525 -8795
317 -8795 -318 -17294 -31837 3700 38889 4875 -46490 -27668 21200 10378 -29654 -13295
329 -13295 27178 3983 -47761 -32757 27974 31510 -19108 -34631 -4566 3152 -12080 1636
341 1636 21875 -6050 -43762 -16870 34250 20514 -30629 -26008 17917 13036 -28012 -19013 28159
354 28159 22934 -31378 -40306 10450 33927 -92 -25266 -10122 529 -6370 1989 18435 1145
367 1145 -31163 -19681 21545 24228 -13107 -23090 6325 15434 -10933 -16553 14500 25242 -6743
380 -6743 -27690 -3879 23687 16667 -3838 -7542 -2680 -512 7543 17746 9141 -12498 -12999 11446
394 11446 20704 1211 -10887 4271 15031 -2312 -15658 3797 24740 9858 -19145 -18068
406 -18068 7480 19447 5966 -7718 -9381 -7403 -2614 8762 13047 -3016 -19817 -10292 9830
419 9830 7971 -8300 -6258 6695 -777 -19643 -11877 17438 20668 -11188 -30163 -9440 16739
432 16739 13138 -3526 -9576 -8868 -8955 1559 15476 7999 -14615 -16202 4925 11299 -3730 -6011
446 -6011 10044 9143 -15290 -19469 11920 30250 4665 -23535 -13116 12415 15077 4908 3266
459 3266 641 -9201 -4989 16345 21629 -574 -13002 3887 16579 2915 -5259 13979 24537
472 24537 -1049 -22108 1352 34126 24754 -8458 -14797 6239 17104 12020 9152 7166 -2204
485 -2204 -6176 8209 21475 11150 -5588 -1910 10063 4867 -4285 7504 20838 5443 -19165
498 -19165 -12098 18153 25392 1722 -16414 -8876 5284 9143 7686 4632 -5071 -12056 -2787 12109
512 12109 8676 -5811 -5531 4946 144 -11693 -2146 18632 12510 -16853 -23783 4404 23561
525 23561 7226 -14223 -10314 1827 1701 491 7444 5252 -10240 -13275 4789 13067 -1280 -9660
539 -9660 2988 7027 -9906 -13912 10056 23257 -2390 -28081 -11105 19904 16516 -8299 -12961
552 -12961 289 1619 -4271 2789 10184 -1895 -14746 -5016 9289 3829 -7054 566 7776 -6651
566 -6651 -18537 476 22398 8409 -21161 -18837 7567 14771 -109 -7076 -1710 -3274 -7319
579 -7319 1244 11206 2025 -11802 -6947 5692 1902 -6527 2554 12434 -2224 -20184 -7217 20299
593 20299 16815 -10121 -18768 -391 11680 5080 -1008 1493 -1072 -7489 -1786 10073 8138 -4336
607 -4336 -5985 2338 1516 -4274 1975 13188 5006 -15073 -14802 8325 20454 3558 -15266 -11421
621 -11421 4195 7879 1859 -1499 -1929 -5615 -6348 102 5287 797 -5390 -5443 -3709 -5443 -3113 4833
637 4833 5769 -8408 -19905 -8057 12262 10526 -10593 -19559 -6067 6146 1385 -6442 -4373 -2653
651 -2653 -7475 -8689 -298 4850 -2446 -8643 -5036 -1839 -5603 -2011 8334 3776 -15282 -17227 6128
666 6128 18545 405 -17687 -8294 8989 5261 -5359 -212 7725 -1134 -10901 -1002 11718 5624
680 5624 -4707 -1242 3634 -3590 -4196 11945 16154 -5914 -20372 -130 22612 11591 -11019
693 -11019 -8507 7669 5496 -5101 1715 12507 2485 -12049 -5031 9672 7075 -2789 198
706 198 3598 -6182 -10398 6735 18615 1077 -20489 -10399 12896 11999 -6676 -8795 2623 1303
720 1303 -7842 -3397 8477 4160 -8718 -8066 1187 1280 -2728 2113 5680 -5952 -15243 -2232 14759
735 14759 7700 -11681 -12987 3010 7967 -1064 -4452 2302 2143 -5215 -5606 3457 7105 1462 -3481
750 -3481 -2922 -1493 643 5801 7876 -130 -9917 -5115 9743 12714 519 -8564 -3053 6761 6741
765 6741 1166 -240 2899 1767 -1704 -341 5676 7627 1189 -4220 -2185 3219 6124 5878 2315
780 2315 -3665 -5267 2127 11487 8073 -5222 -8735 2695 11071 2935 -4702 248 6378 110 -6130
795 -6130 1365 9720 4740 -6162 -5527 2756 4832 2846 2914 832 -6628 -5783 7095 12532 -577
810 -577 -12087 -3489 8875 4143 -5410 -34 7361 -1006 -10893 -3124 11269 8459 -5269 -8345
824 -8345 -1776 1220 1266 6022 5641 -7160 -14046 -143 14217 6219 -9018 -7398 3436 1558 -5021
839 -5021 577 9115 2027 -11220 -8123 5475 8526 558 -3584 -2962 -4453 -3066 5797 9262 -2430
854 -2430 -12784 -4224 8195 5959 -5017 -4450 3115 881 -5930 -2394 7207 5429 -5242 -8080
868 -8080 -1073 4354 3495 1879 -848 -5445 -4842 3303 8354 2550 -5961 -4367 2611 3837 429 356
884 356 2730 1341 -2709 -2420 3049 6280 2640 -2369 -4125 -791 4751 5895 1789 -3493 -3570 1793
900 1793 5035 3597 -1313 -3198 -662 3079 2872 -848 -1175 764 1255 -1346 -2093 1971 4782 -830
916 -830 -7164 -4316 4861 6831 -931 -6369 -4360 78 2801 3069 201 -4556 -5628 -279 4243 1447
932 1447 -2984 -1807 447 -2905 -5321 1394 7591 1644 -9552 -8393 1745 6592 1080 -3730 -3947
947 -3947 -4552 -2686 2397 4566 -1181 -7209 -3871 2015 1092 -2511 -681 2334 -2922 -8399 -2585 7509
963 7509 5621 -5199 -8421 -2354 3159 3144 1807 -541 -4818 -5009 1447 6429 2265 -3730 -2855 995
979 995 -921 -2013 3214 7237 191 -8581 -5238 5167 8490 1828 -4050 -4028 -1186 2040 4775 4025
995 4025 -1458 -4438 -1484 3049 2461 214 1113 1033 -2159 -3667 1517 5936 3329 -3539 -4691 -445
1011 -445 3862 3561 247 -2700 -2853 678 3817 2557 -1536 -2600 326 1882 362 -670 1245 1298
1027 1298 -1297 -2123 245 2578 2640 -169 -3123 -3091 945 4642 2887 -2914 -5077 -861 3343 2595
1043 2595 -1237 -2229 -648 -379 -1044 485 1794 587 -1597 -2609 -1624 867 3418 2163 -2461 -5398
1059 -5398 -1628 5035 5349 -895 -5418 -2485 2783 3165 1051 -70 -1165 -1921 -867 2311 2560 1375
1075 1375 -680 -2001 -1798 326 4309 4932 -758 -6296 -4202 3210 6449 1703 -3574 -3560 -579 1291
1091 1291 2111 1852 -71 -2081 -1994 -697 679 1605 2118 -459 -4154 -4298 1210 5490 2803 -3364 -5134
1108 -5134 -960 2781 2128 527 -1306 -2282 -1620 454 1459 822 297 -657 -2123 -2536 386 3765 2810
1125 2810 -2638 -5387 -1879 3659 4050 -511 -3674 -2670 -179 2017 2128 -45 -2206 -1602 356 749
1141 749 434 1003 1044 -1142 -3198 -1434 3470 3765 -401 -3754 -2000 1926 2849 1336 -379 -1799 -1047
1158 -1047 1626 2665 1050 -915 -549 1185 797 -231 1220 2546 1033 -2052 -1322 2301 3886 1551
1174 1551 -1668 -1961 10 2168 3050 1382 -1693 -2489 435 2753 1879 -488 -1089 -197 -147 -691 717
1191 717 2875 1560 -2241 -3715 -136 3427 2889 -937 -3325 -2647 437 3035 1980 -1234 -2827 -1504
1207 -1504 626 1512 510 -429 -725 -1654 -2088 -346 2071 1956 -1423 -4500 -3054 1083 3012 1167
1223 1167 -2528 -4367 -2119 1466 1723 49 -2194 -2559 -1209 -64 570 48 -45 -820 -2358 -2062 160
1240 160 2732 1812 -2222 -4081 -1328 2867 3007 -21 -2701 -1908 309 1545 1482 422 -996 -843 50
1257 50 547 1124 1147 1200 -173 -1793 -662 2358 4092 891 -3094 -2324 2367 4024 1418 -842 -1075
1274 -1075 -15 1191 1661 1716 530 -646 -636 156 1206 1624 1645 716 -1281 -1833 906 3898 2532 -1449
1292 -1449 -2826 -166 2684 2310 335 -772 -773 94 873 1689 1131 -10 -857 -440 59 598 1568 1430
1310 1430 -812 -2582 -963 2381 2893 -331 -3030 -2047 875 1718 938 -902 -1341 -1184 -550 619 777
1327 777 342 -1056 -1631 -1365 -370 582 1378 -222 -2893 -3006 119 2858 1191 -1745 -3309 -1203 1013
1344 1013 931 -361 -1126 -1366 -1207 -754 313 338 309 -1195 -2252 -1649 113 1451 1110 -1236 -3053 -1901
1362 -1901 1486 2627 -455 -2612 -1740 363 1047 504 -274 -404 -803 -666 -16 672 1929 368 -899
1379 -899 -1565 -356 1592 2750 888 -1974 -1960 900 3250 1698 -981 -1481 114 1069 730 761 856 -32
1397 -32 -868 -539 935 1802 1393 -14 -1160 -1280 731 2325 1736 -851 -2298 -701 2018 1928 204
1414 204 -1047 -1024 311 291 150 653 393 -699 -1528 -841 774 1578 455 -1382 -2404 -984 1295 1919
1432 1919 163 -2099 -2352 -53 1522 906 -949 -1341 -860 -461 -237 171 600 -298 -1335 -2203 -523
1449 -523 1115 1072 -803 -2137 -1971 -584 1749 1388 -999 -2331 -996 487 1027 42 -829 -795 -496 -666
1467 -666 -42 803 731 -766 -2094 -924 657 1717 598 -758 -1833 -783 1358 1983 447 -1331
1483 -1331 -1838 -319 1246 769 -265 -190 -4 -725 -417 800 1411 521 -1233 -1421 -498 1263 1545 353
1501 353 -1291 -1830 293 1706 1339 -716 -1328 -678 462 312 402 308 244 -603 -709 112 1177 1112 117
1520 117 -1562 -1330 394 1694 1744 -710 -1640 -776 1233 1717 346 -548 -696 -280 4 603 936 693
1538 693 -510 -792 -599 566 1566 971 -594 -1623 -608 1311 2065 371 -1001 -1136 519 1377 1147
1555 1147 231 -44 -439 -86 -42 869 818 568 -444 -743 -230 1255 1911 447 -1577 -1351 482 1936
1573 1936 881 -698 -1069 -366 392 816 741 307 -611 -555 -635 -97 932 742 -253 -1287 -1197 106 1527
1592 1527 954 -481 -1716 -728 888 1260 286 -432 -882 -389 -104 567 430 -283 -742 -299 -344 236 991
1611 991 514 -1094 -1866 -631 1188 1638 5 -1230 -1428 -389 1083 1103 52 -664 -561 71 402 522
1629 522 280 149 -902 -716 -187 662 979 209 -1395 -864 423 1264 1220 -181 -1259 -622 593 1111
1647 1111 474 -347 -316 -391 -63 85 750 724 -273 -902 -434 908 1373 1059 -469 -960 -435 755 1501 662
1667 662 -963 -1182 156 1017 899 -171 5 -263 -402 -357 399 1047 399 -540 -722 124 1188 915 443
1686 443 -618 -1068 -205 1015 982 -524 -968 -371 698 307 -18 241 57 -374 -526 -110 1161 849 -480
1705 -480 -1068 -751 -22 860 578 -241 -1298 -1053 597 908 274 -871 -1002 -224 -213 83 24 151 -548 -1041
1725 -1041 -698 440 700 -209 -890 -1205 -480 386 786 164 -785 -1423 -656 339 276 -357 -846 -637 -532 -120
1745 -120 100 305 -30 -903 -1297 -259 585 538 -431 -1032 -1292 -493 709 553 -290 -1225 -1150 103 533 346
1765 346 -530 -454 -57 -384 84 255 786 -229 -639 -805 534 999 769 -344 -410 -216 566 970 598 -110
1785 -110 -394 -424 353 1017 292 -170 -74 222 -68 -103 827 883 -76 -1077 -218 654 943 -86 -514 -260 143
1806 143 428 251 113 -780 -559 -98 564 23 -127 -122 -35 -521 -468 483 894 -28 -1243 -1009 254 791 140
1827 140 -380 -734 -651 -87 490 392 -602 -973 -676 158 208 128 -19 -255 -494 -277 247 845 318 -600 -870
1848 -870 -61 689 855 175 -336 -480 -88 673 723 185 -554 -574 -11 101 134 626 431 -176 -546 -85 585
1869 585 1020 61 -672 -613 143 725 416 -76 -599 -693 -59 430 681 274 -192 -365 101 337 347 532 290
1890 290 -649 -893 182 907 639 -599 -700 -192 262 783 340 -76 -102 9 -110 454 532 101 -315 -178
1910 -178 24 172 314 366 -170 -937 -330 693 1086 83 -415 -509 188 740 353 375 -263 -273 42 286 458
1931 458 431 -19 -277 175 8 288 782 74 -134 -538 78 699 512 -20 -255 -130 178 621 193 70
1951 70 -227 -103 133 511 407 233 -308 -261 -273 -188 428 722 -201 -921 -446 476 525 -309 -454 -323 -24 148
1973 148 367 298 -246 -422 -526 105 631 262 35 -215 -234 -424 -38 529 -106 -601 -873 216 646 588 -37
1994 -37 -341 -308 -408 299 425 384 113 -554 -163 323 623 208 -51 -476 -493 -153 362 272 -342 -619 -228 343
2016 343 604 255 -173 -248 -341 -63 17 275 48 -360 -548 -193 -239 -15 -138 -257 -784 -299 109 255 120
2037 120 -744 -435 -239 80 -46 -113 -405 -8 -239 -157 194 77 23 -314 -265 -64 262 389 486 -408 -146 51
2059 51 325 640 -43 -288 -360 120 406 85 -72 -191 -367 -10 316 288 376 138 -414 -334 211 228 434 -212
2081 -212 -352 -303 351 545 285 -224 -651 -82 214 425 -20 17 -540 -191 -291 162 159 -64 -131 -286 -326 174
2103 174 401 122 -133 -212 -490 360 460 56 -573 -354 -356 22 -101 107 -315 -386 -415 -35 228 433 -303 -642
2125 -642 -537 -274 382 279 -69 -531 -276 -31 276 271 -394 -434 51 213 221 410 458 93 -156 -347 190 768
2147 768 347 -62 -326 -367 112 520 326 -167 -411 -160 329 622 98 56 75 -45 -13 319 183 287 151
2168 151 -428 -176 422 459 -35 -204 -437 -145 123 188 355 -167 -258 467 300 408 143 24 35 -179 144
2189 144 304 628 58 -232 -233 270 239 193 -160 -247 -41 17 401 168 -131 -331 -6 174 216 184 -25 59 -271
2212 -271 -202 228 544 71 -26 -186 -285 432 565 236 -199 -247 -169 28 233 42 45 -207 0 -104 82 504
2234 504 219 -376 -88 -204 97 291 -329 -242 -239 58 122 285 169 -237 -603 -90 642 -26 26 -220 -319 -128
2256 -128 -61 195 26 200 -186 -144 21 -2 414 5 -328 -306 -84 48 288 -413 -277 71 -198 99 147 15
2278 15 -433 -310 30 21 264 -151 -91 -104 -102 -131 154 366 -289 -421 -50 370 274 -277 -12 -121 -197 6 60 -12
2302 -12 230 -30 91 -201 141 415 -196 -186 -196 57 -15 369 19 187 -164 -88 479 96 121 3 -46 -27 -125
2325 -125 111 206 -24 19 -79 -85 304 259 51 -388 -19 65 422 333 -132 -302 87 -133 19 310 -41 -266 -280
2348 -280 13 13 392 -25 -24 -258 -43 -272 -225 -43 -334 -181 -453 422 399 -103 -223 -246 160 11 -13 -10 -314
2371 -314 -89 148 160 286 408 228 -118 16 209 219 280 114 -221 78 -151 327 286 -268 -266 42 88 -56
2393 -56 388 -202 -70 -37 -40 -275 -68 33 -11 -149 -105 9 92 -106 -181 -115 -155 -52 44 -212 57 -78 -19 93
2417 93 -112 -175 -52 -52 -153 -44 180 423 238 -276 -360 -188 57 47 292 154 -63 34 190 328 5 -3 -321
2440 -321 207 242 -162 222 -205 -28 -502 50 254 163 -10 -83 -206 -166 153 75 -178 -67 -13 191 269 223 3
2463 3 -250 -178 46 148 -79 187 -54 119 107 323 283 148 -218 -184 -200 323 -40 -107 -85 -166 277 63 183
2486 183 43 -17 -40 33 200 155 171 174 -61 -233 78 19 54 -108 -158 -237 35 312 161 132 -258 -162 99 125 114
2511 114 -15 10 -89 37 -157 193 270 136 27 -26 156 68 217 176 -87 2 -65 273 -96 194 -158 71 -49
2534 -49 248 220 39 178 153 -43 84 267 11 102 -248 -91 56 183 7 347 28 -185 219 24 165
2555 165 -13 -100 -26 15 -41 -126 -181 -63 72 -8 137 138 -414 -208 -254 82 -3 78 -213 -239 176 99 -186 -52 -72
2580 -72 227 155 131 23 370 -16 -88 122 6 -32 61 -116 8 -63 -175 223 267 -7 -82 -52 -56 -97 83 80 106
2605 106 -292 -142 240 -114 65 -53 68 -224 -11 107 364 8 164 -36 173 116 288 198 -50 -45 -4 15
2627 15 41 36 58 69 30 48 -13 -132 -18 18 -475 -126 72 161 139 -312 182 -7 359 -11 -78 -78 -216 -116 -88
2652 -88 176 366 -25 -583 21 -148 38 -108 -173 180 -247 -22 -64 -184 -184 -13 -176 -168 261 -16 -130 6
2674 6 -23 142 106 -26 194 105 17 -108 -46 48 -80 315 -24 -179 -35 -250 160 -176 -73 -85 -232 -39 -34 -26
2698 -26 77 -121 139 308 91 -298 -278 90 85 31 39 104 -173 -219 -146 223 -155 160 -118 46 142 -275 -59 17
2722 17 -32 -219 -98 -22 -63 6 -74 22 41 -38 107 -97 -122 -255 27 41 -38 145 70 122 -139 206 -6 186 -153
2747 -153 -79 83 254 -53 162 82 -3 112 222 -280 173 -16 -1 33 -267 353 338 373 -271 -333 -413 217 -62
2770 -62 131 37 -250 173 -179 132 38 -325 3 -166 301 -28 170 120 -472 -140 -65 -214 -376 -175 235 -145
2792 -145 77 -51 -93 -18 186 202 159 -42 236 -141 126 -140 -195 103 -19 111 69 -163 -227 -133 143 -189 171
2815 171 -75 -317 -119 30 219 -53 67 -190 -45 303 390 -230 -130 -74 -65 186 -16 -85 -232 -34 3 -39
2837 -39 180 225 -128 204 77 -63 426 -361 -31 9 -77 133 0 -71 69 -81 374 29 -100 62 12 -131
2859 -131 -58 87 147 1 225 -93 29 188 -94 54 -180 45 -195 181 79 130 -260 -296 164 190 -231 160
2881 160 47 -39 -61 111 -56 -19 -206 -100 -39 -201 32 -141 -57 -362 -38 332 -50 331 -69 -266 -178 -79
2903 -79 10 -92 -2 -169 45 -98 109 15 104 165 136 -278 -194 133 -269 -18 35 -129 -26 23 148 12 0 -45
2927 -45 26 -502 143 -15 -139 4 -10 50 -127 86 14 -167 74 -313 214 -24 -303 177 -340 -340 15 237
2949 237 161 289 92 7 -46 149 68 -48 -38 148 22 -138 -71 -93 -23 35 74 280 -51 -174 285 158 95 56
2973 56 -60 61 -244 54 107 -291 -260 -118 -90 -117 54 -22 118 36 -130 -76 119 -5 264 72 16 193 -67
2996 -67 31 -211 197 223 212 262 70 147 76 0 110 22 -120 18 218 120 -134 -55 -218 -28 34 -92 -40 265
3020 265 -213 -111 -83 144 -211 95 -141 -1 42 170 -150 -77 -89 -41 35 89 114 -44 -150 -8 18 143 130
3043 130 28 -135 -25 87 -276 -44 -62 406 -265 56 -35 102 6 -99 230 32 3 -92 172 47 -221 192
3065 192 75 116 -175 -7 160 10 162 26 -69 -80 155 -130 96 -46 112 76 -43 79 63 98 270 118
3087 118 -127 -89 201 -9 -78 -55 159 125 -260 9 -78 -217 -16 -123 -43 -157 -47 -22 -506 114 148 -2 -374
3110 -374 8 -53 -64 218 126 230 36 97 -39 -83 68 348 52 -167 110 -142 137 162 108 -69 -88 11 -6
3133 -6 -159 -111 -7 20 67 148 -28 -224 -88 -120 -13 215 -15 -173 140 -121 146 -104 213 -38 233 219 245
3156 245 -166 -27 -152 37 114 -17 -163 -220 142 86 -174 163 -102 -78 94 208 -20 151 -27 -129 -36 -6
3178 -6 -132 -98 17 -35 70 -46 -164 31 -73 -110 5 130 382 -119 148 1 223 -78 203 155 -208 127
3200 127 -51 -326 -262 286 -229 -178 81 109 -349 67 261 128 107 -332 75 32 106 -149 -152 127 -429 -64 -91
3223 -91 -113 -159 229 58 -8 52 21 -99 -294 56 232 29 283 -79 -236 226 389 -45 -137 24 -139 54
3245 54 5 -7 -136 -108 -238 -9 132 260 -202 4 -28 25 -20 114 130 109 138 -252 15 339 8 -118 -5
3268 -5 -46 315 165 -23 -13 -264 59 48 -127 -151 67 -177 110 288 42 -88 191 173 -16 -55 -125 233 20
3291 20 -428 49 -57 -103 -86 -84 -25 82 -74 -16 48 140 -1 224 -57 -128 -104 -184 222 -49 -118 -47 39 256 201
3316 201 335 198 -168 -81 114 -85 -25 -342 -102 184 -394 191 8 187 -85 -284 -85 207 -136 -190 116
3337 116 -7 -122 -145 -130 86 81 -166 -118 -175 -41 -53 -74 318 187 -46 -93 173 63 52 16 70 -14 -23 -188 15
3362 15 -147 295 -101 -179 -152 53 -79 -13 -220 -52 -120 -158 65 181 -65 -104 -169 216 0 65 78 -247 -93
3385 -93 19 -24 227 279 141 -71 -213 31 -197 -54 276 -142 -21 133 153 292 112 25 -26 -260 220 -40
3407 -40 156 148 -184 -107 -74 220 94 -233 347 116 -152 129 96 -64 -38 186 -41 92 -93 -159 108 -236 -289
3430 -289 249 222 215 137 -226 131 -93 67 94 43 94 -3 -133 -365 223 62 -74 -108 -33 -44 -196 -27 69 278
3454 278 -29 -9 222 -227 -154 90 337 -119 -87 71 161 315 -25 -11 254 -167 -196 -85 -134 42 99 222 -216
3477 -216 -174 91 31 107 207 -60 -113 -258 -173 5 -34 91 223 -56 -256 229 260 127 72 56 7 48 227 142
3501 142 -31 -179 -102 147 -149 104 -30 -161 109 -3 105 -208 -156 -167 36 109 132 130 104 -117 61 14 -136
3524 -136 48 -112 -154 29 227 52 -138 34 -260 2 347 225 -276 197 -89 -22 -215 -129 192 -115 -158
3545 -158 113 292 44 138 125 78 65 -2 71 -232 -134 170 -77 32 229 208 -62 -220 -110 -41 385 293 -22
3568 -22 141 336 34 92 -107 90 -175 21 31 177 150 47 -41 -241 150 22 -226 -184 -45 284 -35 -179
3590 -179 -114 116 157 153 55 35 150 -40 -119 81 122 -149 251 -431 505 104 101 374 -207 -31 -200 136 321
3613 321 33 47 -14 282 96 201 -163 -371 -36 -92 63 -133 13 -136 183 -121 -268 -43 122 -288 164
3634 164 -57 0 -26 22 -36 79 -171 -94 -106 119 149 -28 -33 246 -237 -19 287 -75 239 -180 -254 247 -67
3657 -67 219 -68 55 150 96 -214 -4 -32 46 -157 -68 138 -187 6 -67 -32 116 213 38 -65 -12 136 69 -63
3681 -63 -65 86 102 -80 -219 -196 88 6 203 195 -75 -112 75 232 -23 -360 -84 -63 48 -100 171 -12 119
3704 119 -143 -64 101 -164 44 53 0 29 -5 251 335 48 259 209 127 78 132 -51 35 -22 -146 151 -43 234
3728 234 0 57 114 -112 139 107 71 -153 230 88 -83 -246 24 173 338 -87 285 14 -264 36 42 239
3750 239 4 94 158 140 -142 52 76 51 0 49 12 -245 -148 -21 201 97 3 -302 -80 -322 -393 27 0 -18
3774 -18 113 -98 125 -75 105 208 -33 -109 88 -71 135 237 70 53 -253 8 17 69 201 62 87 -35
3796 -35 -166 24 281 95 55 -117 -51 191 -27 -131 -377 -46 -263 -33 55 -230 43 -205 61 26 37 -144
3818 -144 -145 -51 -79 -89 -43 267 -128 -76 -225 -46 175 146 11 -201 37 -293 -176 80 -108 8 127 221 19
3841 19 -54 -221 -185 -180 52 106 34 2 182 104 61 -226 -108 134 -128 181 -85 -34 -36 31 76 -166 -121 -53 -16 202
3867 202 88 89 101 -183 -84 23 80 12 134 -29 12 -100 187 366 -25 -27 38 -203 196 58 95 179 -162 133
3891 133 -152 62 -10 -50 -194 282 37 -108 251 -123 55 -249 56 -35 4 62 219 -91 -239 33 -70 -117
3913 -117 61 -115 203 207 0 -219 -20 0 37 204 40 -46 238 90 82 -127 178 -435 13 6 120 67 -196
3936 -196 63 329 193 453 -27 -72 -156 38 135 -20 -146 154 77 -227 -26 -203 137 116 246 -149 19 -102
3958 -102 -47 195 223 -59 -69 218 70 36 -58 -24 -215 -114 32 197 -40 45 113 166 419 346 120 -125 -166 -309
3982 -309 45 -43 175 87 182 -198 166 -179 -14 39 14 -152 -86 -218 21 -26 -14 -37 -95 297 13 5 133 185
4006 185 -33 -48 -75 133 -47 254 241 -206 -134 80 96 104 -172 -148 93 -327 -20 141 74 -114 219 89 196
4029 196 -116 262 -13 45 -111 204 -93 33 -303 97 -93 -275 89 -40 -105 -370 -54 -75 361 172 146
4050 146 101 5 189 -163 -41 -45 -97 -200 -3 232 -228 -222 -127 20 251 -101 -137 15 25 -231 4 23 71 -35
4074 -35 246 -192 -334 102 -233 -151 27 92 -190 185 -3 200 85 -9 -76 153 272 175 -191 -282 -82 -67 290
4097 290 -90 -83 -372 -15 -124 -363 248 56 -38 30 247 -138 131 -55 64 -26 -73 144 -92 26 27 -77 153
4120 153 -6 130 41 137 54 64 -105 -69 -4 -182 -85 168 340 171 231 31 285 22 -68 32 175 -22 -78
4143 -78 107 -6 46 156 -213 67 -146 -71 -57 75 8 -82 -103 264 32 75 98 -10 -222 -4 261 107 -103
4166 -103 155 -118 -370 -123 -23 136 -199 80 278 178 -160 273 127 -73 -116 158 -293 -285 70 -179 -85
4187 -85 28 283 37 123 220 -117 -63 -81 113 2 142 -193 -6 -206 -289 136 -217 118 161 138 -235 -291 -135
4210 -135 -48 268 225 66 8 93 -346 11 -250 -83 57 -102 116 93 286 205 -196 -35 158 -47 351 79
4232 79 -182 -205 -206 42 -295 71 -14 -43 -45 14 92 -116 11 -51 -359 73 -45 243 -34 -8 -33 -2 -131 -71 113
4257 113 26 67 -99 -154 -6 22 -152 224 127 -403 80 205 111 -40 -198 206 -155 283 -77 11 105 -68 101
4280 101 106 -26 -10 -50 -45 82 324 -170 100 261 263 96 172 83 244 124 64 231 25 -41 8 -285 -237 84 100
4305 100 188 -287 -104 93 112 -89 23 63 -98 63 -39 -52 323 87 -137 -262 -40 134 -152 -273 152
4326 152 195 53 9 -207 19 -35 -63 -170 126 297 -120 -85 -26 -56 -57 -16 132 -295 -203 78 -179 294 -66 -63
4350 -63 60 92 166 -114 193 -68 74 21 6 207 124 -124 -75 -170 76 -14 -37 -61 -125 158 37 7 -16 -100 -267
4375 -267 -103 -163 -40 -204 -22 -431 -20 159 -134 222 -165 156 -244 246 22 149 192 184 -65 -77 -82 206
4397 206 80 202 102 32 33 -82 108 -216 65 129 -185 -179 -37 58 -115 -10 -110 -6 -110 127 2 -78 205
4420 205 10 -173 -132 -122 -53 -87 117 -121 226 -1 -66 -293 -2 68 -142 39 181 -259 -208 -64 -131 215 -68
4443 -68 -37 146 -246 -82 252 99 363 -116 -90 114 68 -8 -145 -55 57 -13 320 -92 -394 89 196 -128
4465 -128 36 -62 180 141 -274 -99 42 15 -266 107 4 197 -132 355 88 -165 -19 -112 -205 -126 -9 155
4487 155 0 -243 213 91 23 -41 -54 357 68 -101 308 -135 150 231 -152 43 53 -188 134 37 49 -226
4509 -226 212 193 90 2 -244 68 -61 -56 5 -23 -99 164 -16 174 6 2 -271 269 -120 -93 369 -158 174
4532 174 -3 -95 60 185 -219 69 68 -154 158 -1 3 -16 8 -159 -166 7 -75 -116 -293 3 -202 -70 -209 -70
4556 -70 67 348 -43 197 -146 -204 -150 146 221 -108 -7 -7 -16 46 53 -63 53 77 74 23 257 -66 -21 -37 293 -216
4582 -216 -19 -136 144 -124 239 47 -210 -137 -39 -75 136 224 -95 -37 153 -172 31 -67 74 -61 -93 -189 51
4605 51 -77 206 97 -176 -56 -143 -1 2 0 -16 -78 132 -60 -44 -280 320 83 -118 -77 33 -131 -16 137
4628 137 -48 116 -182 225 -285 326 64 -518 95 -138 19 -9 223 -35 -136 63 99 -43 60 84 229
4649 229 308 45 20 173 -120 -67 155 133 -438 -207 16 7 -3 5 84 32 121 169 134 -71 -79 -159 -111 106 -16 -218
4675 -218 -144 208 -222 250 110 98 -238 -81 -9 64 73 59 -21 -239 186 -171 104 -42 235 -57 43 -118 -75
4698 -75 -332 150 91 140 -184 -13 231 76 11 66 -30 51 145 -484 -33 -232 227 -256 82 -196 -154 -17 163
4721 163 -19 115 86 -266 16 49 357 8 70 -58 -295 48 -47 -100 218 -281 62 301 -264 -87 243 -42
4743 -42 87 210 -172 2 21 238 -42 -279 -37 -162 -202 -475 -53 -212 -33 -175 -40 -40 -226 39 -60 -17
4765 -17 298 78 60 45 -127 -263 -222 -60 2 -284 -93 66 143 -292 -34 15 -22 -324 -181 17 138 -109 203
4788 203 -243 3 -3 -111 -62 -104 249 71 389 118 -223 0 26 11 43 -69 34 77 6 -121 36 -213 -40
4811 -40 145 -43 -105 215 -194 -136 -336 -63 -211 -260 55 38 128 241 51 -134 82 -259 -73 128 240 -22
4833 -22 63 79 -122 -406 385 -151 114 -183 387 169 -133 -132 -29 -122 -9 290 112 240 53 -174 17 75
4855 75 -318 175 -194 153 -98 435 138 -81 62 77 -68 -94 -41 134 -1 20 157 396 124 27 124 -185
4877 -185 -224 110 -141 -27 279 -47 -7 238 83 -111 111 136 -141 -197 258 30 25 -357 152 190 224 -126 354
4900 354 192 181 -123 210 -97 -198 -1 26 -172 -214 181 -23 38 -134 477 200 -87 -57 55 -88 -183 13
4922 13 -33 237 -287 -70 -282 -122 -375 -41 238 -170 -223 314 81 -249 -153 99 12 -182 185 -145 -43 40
4944 40 40 75 -328 -123 32 -121 156 -11 -97 62 -147 -186 60 377 -433 82 -30 108 24 145 100 -298 50
4967 50 186 101 -155 -41 -253 -23 -60 -124 -212 -98 30 163 -69 256 -60 84 143 -78 194 216 -118 74
4989 74 123 277 145 -24 207 15 -103 39 148 -16 -54 -165 -95 -57 -36 -73 -15 84 -250 -1 -33 30 63 54 6
5014 6 377 -7 -180 12 -66 -293 151 -159 5 211 -131 -172 -248 -145 41 -60 -30 -56 -120 -340 -67 -44 -284
5037 -284 213 135 2 160 74 123 -40 -54 142 149 2 153 23 -6 222 15 -42 -347 -43 -50 -118 -152 63 89
5061 89 -352 -3 6 -26 -133 -165 8 -256 20 -59 -115 -233 -212 -51 41 1 -33 72 -34 -150 -47 -361 94 -24
5085 -24 455 16 -313 -172 38 -9 -44 -24 -124 165 65 145 13 -143 180 -73 154 73 -164 387 283 -99
5107 -99 250 67 -249 181 473 76 127 -8 89 -201 108 -76 -35 -59 107 -213 -114 163 10 102 -66 -20 94
5130 94 264 43 46 30 1 -63 238 -68 252 145 238 -113 103 -64 -25 192 -93 170 -344 -299 117 61 150 -11
5154 -11 244 -186 -113 306 -42 -68 65 -233 148 200 81 190 98 158 199 91 121 50 125 -3 -183 -176 -354 92
5178 92 -81 205 203 -137 -49 187 164 -95 92 46 121 -86 70 -39 13 -209 122 -102 -160 -161 -87 23 -159 -142
5202 -142 -121 120 -60 -133 8 244 -5 -45 -403 20 12 39 -160 69 -123 -124 294 172 -23 333 -54 -238 -121
5225 -121 128 -186 140 -182 -1 -208 135 213 8 -92 71 146 -178 -215 3 -188 -252 -235 52 -56 74 57
5247 57 142 -90 -55 -139 -38 -216 -330 -131 -2 -23 -281 52 -121 18 -6 95 123 -185 92 27 1 -49 20 145
5271 145 -224 -317 4 -275 -61 -114 276 115 -95 59 -33 -25 129 253 -229 -14 -73 173 -59 -157 88 199
5293 199 17 -189 -110 4 36 -233 161 -2 -214 453 22 -60 30 119 88 230 357 168 -122 130 -79 -323
5315 -323 -113 -1 84 162 -55 -209 195 87 24 -123 -69 -24 163 111 -102 -277 111 150 76 43 139 -49 -14 102
5339 102 286 58 4 45 51 -81 -24 60 -51 -40 -248 181 5 -252 320 152 -230 -39 243 -22 214 18
5361 18 137 -135 148 -93 -39 -178 -5 -131 98 207 -2 -123 10 -310 -228 -83 -129 294 -171 50 -151
5382 -151 -129 -25 78 20 -113 66 -11 66 -131 -53 94 88 -88 359 -108 -4 -151 -81 -222 24 194 279 -273
5405 -273 69 -14 236 -74 -302 138 329 106 80 18 191 -142 -319 -14 25 511 99 156 62 -70 -110 189
5427 189 267 -275 -382 -79 -174 32 -59 175 -14 35 68 222 -337 364 78 -119 -197 27 184 196 -12 -211
5449 -211 163 -104 132 -36 -99 191 249 120 164 131 94 47 -250 -238 69 -130 66 -152 -186 221 185 -72 -87
5472 -87 253 160 174 -151 -137 -251 -74 -22 53 385 138 -131 -125 105 -73 52 57 -176 -313 -167 -124 -50 37 -79
5496 -79 236 34 -117 -144 -15 99 -304 191 77 -58 -43 -36 -38 106 -143 209 65 -121 32 53 88 -103 44
5519 44 210 34 34 21 18 -22 -67 73 30 25 1 135 144 165 -284 -54 111 -22 -362 -71 -10 345 2 -70 -94 69
5545 69 -171 -131 -17 -86 235 -176 -9 -1 16 -9 101 72 -137 11 -50 300 80 212 222 -464 128 148 -158 97
5569 97 -242 -86 246 -297 -26 161 -25 78 57 22 -45 -283 4 65 236 -37 70 17 22 -47 106 64 -195
5592 -195 95 145 325 98 1 -129 -181 -173 -41 -254 182 102 152 80 30 210 -133 -207 -137 146 -200 130 11 51
5616 51 -56 114 163 15 99 -55 31 -133 -233 83 9 10 34 11 -35 96 94 -147 -96 32 -315 -77 -156 47 -275
5641 -275 121 -103 -173 185 -153 -81 71 96 281 300 149 -218 220 -24 195 -101 133 116 179 -55 -200 -215
5663 -215 80 4 208 -112 -103 10 109 -44 35 400 -311 -301 -15 201 -151 345 172 188 -145 -133 -29 -210 215
5686 215 53 -37 21 7 -129 -93 -42 108 -5 -17 -11 -114 125 -129 231 26 -25 150 34 107 46 -31 -159 2
5710 2 114 27 -161 -139 262 42 206 -153 85 -106 -63 212 -277 -26 76 54 45 -78 -93 474 0 -154 -137
5733 -137 -104 -102 150 117 -156 183 295 -18 185 259 -66 -117 -69 130 91 -182 50 -81 89 -362 -194 -86 -94
5756 -94 -159 -47 -2 -281 270 -105 -127 47 -72 -51 -31 129 45 116 10 93 -183 -112 130 -70 1 -148 41 89
5780 89 -34 -219 255 203 -121 2 42 -119 156 16 112 -163 221 73 48 -51 201 13 -217 -42 90 32
5802 32 -72 44 -284 -71 43 -181 127 -278 91 -94 -205 -93 -151 -260 -264 100 20 -4 188 -77 131 -102
5824 -102 262 110 121 304 -214 100 204 -95 -269 141 -104 -54 -8 46 183 -216 -311 -206 74 55 131 55 -16
5847 -16 -153 -57 -1 99 -124 76 -49 -44 10 150 -44 160 -152 73 322 -54 52 -10 144 23 258 -40
5869 -40 207 -306 63 -53 -139 61 -255 134 125 -142 177 -35 15 -215 -264 -285 175 240 31 73 226 -55 -31
5892 -31 -157 -14 148 -159 -129 -130 -91 -14 36 233 105 -66 207 -107 -5 -95 51 64 100 61 81 88 -198 26 10
5917 10 10 59 91 -198 317 -113 -173 -110 55 -29 313 256 68 12 -69 56 -84 181 -255 -195 -15 156 -5 -161
5941 -161 -70 -77 272 -65 84 104 -21 265 11 -23 172 111 20 127 -2 200 268 322 254 147 -181 -111 -83 62
5965 62 -6 14 -326 331 163 -455 12 98 -126 -38 54 -220 213 -157 -105 157 169 270 72 0 47 214 69
5988 69 191 -415 -78 -107 -212 -248 62 329 158 -104 -110 121 226 -67 7 -118 -62 114 -37 107 -206 74
6010 74 -247 91 -65 182 213 -52 -79 -74 -111 45 -211 124 208 -187 -1 89 -178 254 21 16 137 -8 202
6033 202 -121 -125 390 -106 -132 -235 -181 -31 -306 -100 36 -10 89 222 -228 -139 -158 -450 -243 340 228 136 -87
6056 -87 141 89 -5 286 141 142 -129 -242 109 -322 -24 71 -331 -108 81 105 -197 80 101 97 -191 84 -125
6079 -125 72 -130 -59 -92 -48 -19 -35 -18 -265 -155 200 -203 -172 210 159 -46 -325 256 129 -145 -32 271 134
6102 134 82 298 -59 4 -67 -276 121 -7 269 71 -14 58 -26 -219 44 201 167 23 -74 258 -28 -23 -97 -299
6126 -299 -190 -113 75 227 125 63 36 6 66 -13 -488 -218 32 -87 -43 -226 -104 39 -32 88 -20 -339 298
6149 298 113 -16 189 79 187 100 113 62 113 -44 -410 -30 -208 137 103 -296 119 182 -11 105 13 -6 -130
6172 -130 115 128 -35 208 241 -25 -91 -184 -45 -15 244 -255 -47 291 -310 -111 -224 118 -214 79 125 -11
6194 -11 191 -14 -266 165 -91 88 112 -155 159 29 -26 -29 -54 -145 5 -10 3 -147 -202 -127 -133 -14 15 144 176
6219 176 205 58 -78 128 -91 -138 -30 -159 -18 -121 -48 -337 198 103 237 -141 245 173 -107 -298 91 -211
6241 -211 2 -35 -76 -129 -256 -21 -157 5 140 51 66 213 72 -173 -67 54 79 85 29 -259 186 -95 -124
6264 -124 102 -22 -47 106 152 -210 -49 -166 -176 -63 102 7 -123 194 -48 104 -238 -178 -148 -155 -150 68 63 -205
6288 -205 -141 -125 199 94 -247 -23 -15 130 6 -65 -366 -123 -5 -291 13 106 71 292 81 227 -29 -189
6310 -189 256 158 -76 169 -44 246 57 -41 -152 20 255 -43 99 -329 87 158 160 148 105 179 -12 182 -31
6333 -31 36 54 37 15 -148 289 -47 134 -139 -239 154 -1 -1 18 69 99 60 -11 53 -140 93 -53 -19 86 -10
6358 -10 410 -119 -59 -115 181 75 -114 -224 -140 1 11 39 -326 34 78 -92 -250 187 148 211 -239 -119 -32
6381 -32 389 -129 -170 -114 -144 148 -59 -212 -21 -356 -239 -78 77 134 -262 46 -39 -122 -37 -244 134 279 222
6404 222 -13 -84 5 34 319 -91 329 111 158 127 27 43 -206 246 154 85 44 -184 118 48 -86 193 -36
6427 -36 -74 10 63 -115 294 71 139 134 -205 -40 -259 23 -40 175 201 -5 176 81 165 21 -109 87 225 -102
6451 -102 42 -149 55 166 -83 -288 150 -132 -243 -80 296 37 -31 48 95 -273 74 -30 -48 49 195 44
6473 44 -84 228 -376 -25 212 99 -244 65 -86 14 305 230 308 -188 53 203 293 -122 -5 96 62 107
6495 107 35 -72 150 -255 6 18 114 -64 -9 200 105 -34 34 153 -168 28 468 -30 -199 10 -72 -13 107
6518 107 -140 -39 -286 132 -248 -411 -47 131 225 -125 -2 67 -171 372 140 57 359 143 119 170 9 162
6540 162 -111 -261 -2 -188 -78 -138 347 52 8 -33 120 34 66 -119 266 25 -27 -38 -229 -181 -37 4 -150
6563 -150 77 -29 48 179 -23 -178 -399 24 72 56 -189 -101 -2 -7 -310 -141 9 66 -165 75 -323 7 37
6586 37 16 -21 114 -26 -18 103 -61 -409 -232 24 288 65 329 76 -99 -28 -13 -39 139 -153 136 113 184
6609 184 96 131 76 -135 60 222 -108 -56 209 -35 212 -161 -123 18 97 82 -192 72 -95 -104 34 -366 161
6632 161 157 -139 167 184 -90 28 -94 -66 -43 -162 -126 -13 222 -152 -112 -190 -130 10 92 -93 19 -141 114
6655 114 170 -270 -57 131 235 72 -46 181 -147 -17 -195 180 104 48 -177 -123 -182 308 0 47 -66 118
6677 118 90 -28 -47 -333 -84 -355 33 165 -52 1 -189 32 -198 -165 -219 -53 135 -242 -37 51 23 64 -95
6700 -95 -183 33 -168 -107 -217 -217 184 -125 -104 92 -81 70 162 134 93 46 -87 -117 68 56 -40 140 110 -140 -110
6725 -110 -115 -129 -115 -7 -95 230 -146 -17 -22 80 30 98 -41 -190 41 164 -479 -73 -295 291 -2 461 28
6748 28 28 41 163 46 84 176 -97 112 59 50 -106 118 -36 14 -77 -46 -109 326 -26 146 70 -26 -223 175 -79
6773 -79 -88 66 256 -103 -97 -188 -190 -253 -116 310 164 -254 104 -129 7 256 50 -14 430 -100 3 -209 -244 -98
6797 -98 -14 216 -52 282 138 -64 178 184 166 99 -107 135 85 44 -106 114 -314 -74 -88 30 358 24 -141
6820 -141 59 55 44 -19 158 11 24 -313 120 -186 -130 145 68 34 -202 -248 0 -140 -98 151 108 12 95 7 -83
6845 -83 33 19 217 216 54 -40 -180 -120 -74 -35 -45 -149 141 101 -84 -100 -89 -1 -111 276 135 -84 38 -70
6869 -70 -142 254 7 -11 20 -29 -39 -200 -21 170 -61 139 -95 197 105 50 270 94 74 -129 48 121 158 -167
6893 -167 90 -277 -108 -85 -284 138 82 -207 56 -180 -150 105 78 45 -186 151 -41 -122 213 -206 -254 52
6915 52 -301 6 141 160 36 106 -226 -7 21 -49 -157 -250 -66 223 63 -165 172 100 -160 -232 26 59 -112
6938 -112 144 -171 -229 64 -200 55 -48 4 -303 152 -143 -146 -77 -288 -108 -257 1 -219 -283 194 230 130
6960 130 23 -99 121 172 129 -100 116 -236 129 47 -446 139 -143 -215 106 19 155 -4 -16 102 194 -31
6982 -31 -37 186 -59 108 -140 35 -208 51 59 -451 9 131 -44 -35 -129 4 260 249 -256 -108 78 -73 -38
7005 -38 212 13 224 -291 9 -64 64 122 230 -84 -311 237 219 -41 135 -135 43 -134 -92 -15 77 -162
7027 -162 -27 301 -147 -68 152 -17 -103 234 12 -77 -79 211 -28 -176 -240 319 124 -53 155 -271 280 -35
7049 -35 -197 -122 -57 182 -242 -258 -193 -2 -210 -20 34 37 -192 115 182 -88 -175 63 167 10 74 -235 47 -246
7073 -246 223 18 -27 128 -82 -56 -51 -86 177 -72 -157 136 60 138 -58 -22 254 -1 13 89 0 117 16 -94
7097 -94 -5 56 10 8 -9 -151 203 187 266 -147 313 6 -346 -116 -111 -56 194 238 -121 -146 26 99 -23 143 -11
7122 -11 -59 -252 -87 -86 -151 -140 -168 114 -443 84 267 -322 280 -99 -336 66 -100 -150 -278 31 59 55 62 -62
7146 -62 78 132 -70 -227 -243 -113 -146 -236 184 -160 -40 -298 -146 91 -99 32 -20 33 -1 137 416 42 -155
7169 -155 86 223 -271 -319 -245 -164 -32 -305 -20 108 139 -33 312 158 -47 52 123 111 181 114 -59 116 51
7192 51 126 -118 -93 -20 -166 35 -84 -130 45 -217 46 -193 10 181 -141 65 366 -154 -164 -197 87 48 32
7215 32 169 -51 -27 -405 79 128 -90 -40 -215 -70 -13 -36 -115 150 49 202 97 251 -157 -124 111 -190 48
7238 48 -238 38 247 226 -331 -32 -136 -89 227 30 -91 194 38 -143 -66 1 271 -84 -57 -74 -56 46 -69
7261 -69 227 202 95 -124 -312 92 90 -206 -75 132 193 -69 -256 137 3 191 -11 -125 87 247 -45 -80
7283 -80 -207 -55 334 175 172 147 -160 -113 -31 -215 175 170 183 37 -14 5 31 199 177 62 -26 -535 -33 -41 -137 -158
7309 -158 -309 199 -138 -28 4 -124 -133 -206 -77 -37 82 217 47 143 -146 164 -248 326 -164 85 288 23
7331 23 70 76 -19 -167 -108 7 -33 95 -176 233 128 213 -434 -113 -61 33 52 12 -191 8 -250 84 11 25 38
7356 38 17 179 -70 -12 174 -146 3 268 22 54 47 -54 -156 193 -25 -220 67 -2 22 421 111 131 -35
7379 -35 95 268 -196 99 50 161 -25 181 -1 18 119 -227 284 -39 401 -120 52 -158 -62 139 81 -97
7401 -97 121 86 -78 -39 7 -142 -56 -95 -190 -270 80 -27 -293 -67 -55 102 -234 -93 -141 -89 -4 -121 62 55 46
7426 46 -185 -34 18 -32 42 85 239 34 -74 -276 250 92 211 -35 -197 -33 198 -266 77 232 -92 25
7448 25 -171 -36 -115 54 148 66 -4 -199 -144 -35 93 264 -171 -434 -112 -7 -315 114 -129 16 -37 -8 -119
7471 -119 -27 34 24 64 -87 17 184 309 52 21 -119 -41 238 -84 -57 -313 -97 -33 -222 -237 136 33 -96
7494 -96 -69 121 219 -22 95 8 -121 -119 136 -32 79 12 -245 59 100 189 -50 -95 386 -66 160 -359 292
7517 292 -106 14 176 143 228 -84 12 40 -103 -246 270 -140 85 -44 -96 -165 278 63 -88 -423 221 -61
7539 -61 231 -47 46 -165 -139 -14 -108 191 202 38 113 44 65 222 -208 199 70 361 59 -59 -81 -153 -151 264
7563 264 46 335 159 81 -91 147 -185 -7 130 -204 52 228 237 78 137 172 -60 127 95 92 -105 -188 -211
7586 -211 123 226 162 -289 31 133 -46 4 -141 20 288 40 75 39 -148 30 -101 -66 72 153 75 -265
7608 -265 -57 91 -55 -38 -73 249 -6 -45 -171 -42 -215 -201 24 106 -1 -212 155 223 -19 -185 -193 -191 -275 -5
7632 -5 -13 -178 -168 170 317 334 -22 -17 -199 204 35 -84 -212 -45 124 -116 23 -31 231 15 -102 215 61
7655 61 137 30 329 97 -151 -140 28 105 166 287 -155 259 -214 -71 118 174 98 285 -125 277 28 -276
7677 -276 171 67 -42 -174 -174 89 -337 -4 283 -244 -52 -284 -261 -20 312 306 -114 -318 26 72 -45 -77
7699 -77 315 -5 92 87 -164 76 63 310 63 155 53 197 -43 -173 195 -57 50 133 133 -23 40 -117 -125 78
7723 78 -22 -147 -130 -34 -176 -102 90 -116 -310 -42 -71 -52 -57 23 10 -41 -223 76 -241 14 -155 -93 39 -224
7747 -224 78 -91 156 42 -176 113 157 38 -236 172 -64 173 177 52 37 25 35 -86 173 104 -106 26
7769 26 -3 137 -174 -197 305 23 35 -234 12 -124 218 -25 -57 71 -64 -204 379 -188 106 -46 -79 71
7791 71 -61 -21 -18 -37 118 257 137 0 13 170 -77 -30 -171 86 108 108 261 -154 4 192 -98 -11 22 78
7815 78 -229 40 37 -49 53 -187 37 -54 -165 -219 117 -181 -106 116 -84 14 267 -271 28 494 -54 16 -280
7838 -280 -127 44 82 -28 -9 280 -56 -131 202 -50 66 35 -63 -29 298 -110 -268 23 107 -21 -13 231 237 231
7862 231 77 -2 117 -73 -164 -152 -176 -11 -263 -125 -186 72 75 84 -60 39 137 -58 77 -38 -5 49 99 -47 -201
7887 -201 6 247 6 270 -229 163 293 -368 -87 -94 81 285 108 36 19 -177 134 -44 -346 -198 -66
7908 -66 104 -147 -128 59 36 -16 73 5 -32 233 127 243 60 85 -53 109 -61 -79 -278 -109 -6 -210 181
7931 181 -53 -147 -316 166 123 69 -18 16 17 -155 -63 -216 -79 25 2 -7 90 -100 -44 -68 -363 -56 179 17 12
7956 12 -25 -270 109 105 3 68 80 -26 11 105 -16 -76 -11 -258 -379 138 -60 -126 38 226 -13 161 241 98
7980 98 -167 31 71 -165 -113 18 -173 -60 191 39 -70 113 112 -23 205 338 -123 139 36 -158 -305 -114
8002 -114 23 -228 227 -217 89 -55 -43 -101 86 217 -94 -2 18 -56 90 -69 -28 65 -3 37 170 235 -286
8025 -286 41 -78 -104 111 61 -152 -80 77 -19 15 -194 237 187 0 292 -192 215 -211 4 54 -1 -48 166
8048 166 -114 -190 -101 -214 -120 193 330 1 -85 102 -391 -176 -237 235 -47 -257 -6 -175 181 -104 96 -177
8070 -177 319 -73 150 -176 48 -209 -74 -97 -80 -251 -80 184 43 31 8 -92 312 -151 -78 29 -75 -71
8092 -71 -55 -161 136 201 141 -70 80 -5 -119 -1 -233 -22 17 33 -32 -301 140 -23 -120 105 -197 -110 -304
8115 -304 176 -7 -49 32 -130 244 33 350 136 -242 187 17 102 271 -81 -63 14 -55 -173 21 -153 -63
8137 -63 -33 -127 126 91 56 -238 -132 -114 32 117 43 -102 -150 9 291 -197 28 6 -268 -249 -74 313 -205 88
8161 88 -33 108 256 -14 8 -137 316 -56 203 153 -188 103 -191 166 -22 -81 -399 107 80 -135 211 -35
8183 -35 -15 303 212 75 -134 32 -147 13
8191A3
$$ Imaginary data points
##PAGE= N=2
##DATA TABLE= (X++(I..I)), XYDATA
0 0 0 0 0 0 8 0 8 -8 8 -11 16 -23 24 -32 39 -48 56 -64 73 -88 104 -120 138 -161 185 -212 241 -275 311
29 311 -351 397 -445 497 -556 620 -692 771 -853 948 -1050 1162 -1286 1425 -1578 1747 -1939
46 -1939 2157 -2405 2688 -3018 3413 -3885 4466 -5204 6175 -7514 9492 -12712 18854 -34767
60 -34767 160320 311310 -100809 -160824 72650 164117 -33147 -41471 136806 135453 -95974
71 -95974 -116100 95956 163779 -8318 -60469 61469 79769 -47025 -23686 127249 101920
82 101920 -91822 -106152 70887 114824 -36374 -83887 34081 68841 -40899 -64349 40582
93 40582 62911 -34391 -46983 49611 59453 -40199 -54538 34660 41322 -49310 -47579 60080 74305
106 74305 -42831 -94999 -2537 76384 35445 -24491 -11827 14331 -4681 -20195 6752 25865
118 25865 3266 -19443 -13859 -8431 -12409 1539 23681 8672 -36722 -43036 11574 50871 11858
131 11858 -50552 -38790 30837 42978 -26630 -61767 1406 60677 20095 -44367 -23964 31844
143 31844 15642 -27803 4829 64191 31727 -46182 -35182 35775 38432 -6520 11722 50838
155 50838 -1028 -71527 -16193 92338 68914 -45357 -56589 29288 41029 -23443 -15353 51997
167 51997 29502 -58887 -51466 33019 38360 -20675 -11672 30496 -19253 -83372 -10276 98538
179 98538 42190 -93618 -73212 55948 57746 -50735 -49800 52281 45601 -62274 -59296 55316
191 55316 69899 -32429 -57689 20754 40259 -13802 -5473 47591 9367 -68324 -22312 86718
203 86718 62583 -58636 -65921 37110 54126 -25252 -29763 43589 31206 -59114 -54609 42472
215 42472 59036 -21418 -48028 189 2341 -37070 -8681 54188 17741 -77773 -67243 34962
227 34962 53769 -28853 -55996 5818 23373 -33658 -45982 14776 34782 -17928 -45943 -10712
239 -10712 12733 -7007 -13747 5128 -2893 -31756 -18658 23934 15627 -36565 -40307 14812 33850
252 33850 -15067 -46708 -12627 22640 3405 -27749 -16394 11417 1944 -27369 -25694 5469
264 5469 18014 -3173 -23206 -19390 -8768 -1988 7786 12782 -6346 -33156 -23552 17395 30650
277 30650 -3995 -29281 -6568 18247 617 -17991 6554 31157 2986 -35100 -14810 31390
289 31390 29469 -8370 -18514 -535 3011 413 17183 21981 -15188 -39066 1064 44396 14491
302 14491 -36208 -20751 22988 9259 -29562 -9578 33883 12516 -43183 -35745 20255 31704
314 31704 -6978 -21736 -6456 -9798 -17751 10096 34736 -2292 -47275 -20154 32326 19401
326 19401 -24176 -11316 26854 6583 -38469 -17231 41324 35359 -22625 -34094 6938 21224
338 21224 1131 3640 18738 -3425 -32269 -2228 43709 22911 -29911 -21620 25840 21956 -18956
351 -18956 -11809 31566 23255 -28244 -29234 25063 42348 -1178 -27741 -3685 15914 7446 6429
364 6429 16721 2249 -22418 -6192 32246 27875 -12429 -19871 13084 23544 -3051 -10181 18259
377 18259 25540 -6997 -23349 6077 31469 15682 -10272 -9916 2660 7231 9983 12974 2613
390 2613 -14924 -10047 13786 19284 -3280 -15370 1276 12748 -3738 -15316 3466 20241 2007
403 2007 -24380 -15880 13476 19267 -1006 -15403 -10538 -1566 3488 8964 7493 -7243 -18049 -4373
417 -4373 15710 10636 -7770 -6641 6722 2673 -12213 -3011 21715 18293 -13917 -25377 3067
430 3067 27534 15546 -7288 -10071 -1376 3686 10428 17352 6590 -12694 -9869 13489 18908 1126
444 1126 -3858 10069 10707 -9257 -9146 19620 30873 291 -24150 -5408 23284 20279 2078
457 2078 -1768 604 -3059 2149 18473 18494 -4895 -14975 4960 18220 3896 -6447 8885 16762
471 16762 -6609 -21523 3805 31737 13470 -21429 -20801 7709 17139 4104 -4377 -4242 -8331
484 -8331 -8989 4566 13172 -376 -16949 -10459 4512 799 -9179 -720 8502 -6394 -25373 -12454
498 -12454 16548 16064 -12418 -26455 -10336 7547 6921 -1504 -6355 -11360 -13373 -1736 10157 3254
512 3254 -12189 -11096 1946 -94 -10073 -2215 13500 4187 -21527 -21234 9316 22985 102 -21577
526 -21577 -12308 5991 5240 -1170 1717 56 -11622 -11371 6675 12338 -3919 -12959 -505 5867
540 5867 -7638 -11412 9268 17635 -8997 -28580 -5841 23699 13740 -15692 -17002 1513 5699
553 5699 -1995 154 5739 -4415 -14833 -3136 11398 3922 -8711 -3467 5182 -5410 -13760 3901
567 3901 20741 2749 -23937 -15174 14014 17347 -3417 -11694 -2370 1047 -2475 2912 9659 295
581 295 -11954 -5016 8385 4833 -5474 665 8787 -3303 -16855 -1615 21829 12943 -15675
594 -15675 -19105 4258 15972 4130 -6022 -3004 -1527 -5064 -240 9192 4749 -8270 -8785 1563
608 1563 2952 -3731 -251 7180 -933 -16771 -11590 11076 16719 -4452 -21356 -10518 7446 8454
622 8454 -2923 -7339 -5193 -5446 -4657 1075 4226 -1761 -8027 -6443 -1811 -1281 -829 3793 2109 -9388
638 -9388 -14685 -506 16138 9146 -12897 -17067 1369 13412 4537 -5697 -2800 1834 -888 -1963
652 -1963 5510 8638 247 -5860 -36 4988 2708 3505 9708 4606 -10072 -7746 14367 21986 104
667 104 -16241 -2447 16376 10492 -3149 -274 8529 1942 -6785 3168 14405 6065 -6219 -2084
681 -2084 5501 1121 -642 10340 11283 -8573 -17644 4378 23657 7450 -16445 -10514 9010 7579
695 7579 -4899 -1167 8566 -863 -13073 -4007 11305 6643 -6683 -5200 1406 -4261 -7041 6716
709 6716 14375 -4305 -21411 -6575 16721 11660 -10237 -11211 3400 4029 -5497 -1585 8721 3711
723 3711 -8958 -6709 4960 5743 -377 1015 4250 -4082 -9519 3806 16997 6783 -12522 -10134
737 -10134 8531 12731 837 -4024 3158 4616 -2196 -1686 7163 8893 834 -3689 -630 2991 4671
752 4671 6532 5479 -2027 -8012 -877 12087 11184 -3036 -10165 -968 9114 6378 -1125 -2471 1300
767 1300 1629 -1681 -270 5081 4873 -2425 -5963 -1774 4289 5030 1444 -2429 -5496 -4382 3404 9179
783 9179 2825 -9362 -9522 3151 9826 -155 -8337 -2546 4503 -802 -6734 85 7223 880 -9370
798 -9370 -5711 3349 4941 -523 -1923 -2585 -6138 -3925 6916 8885 -5034 -14492 -3237 9592
812 9592 3491 -7354 -2907 4563 -2281 -10171 -1565 11139 5020 -9810 -10156 659 4738 1700
826 1700 2334 1116 -8557 -11076 3625 14377 3045 -12523 -8054 5112 4579 -3799 -290 6427
840 6427 -684 -11224 -5230 8458 9058 -2582 -7061 -2908 -789 551 6008 6370 -4937 -11954 -1192
855 -1192 11363 5761 -6215 -5235 3270 2024 -3806 -680 7279 4691 -6263 -7101 2376 7061 3428
870 3428 -534 -2694 -3818 -1533 5319 7954 17 -6922 -3468 4618 4961 -85 -1240 1138 457 -2811
886 -2811 -1721 3616 4951 -338 -4921 -4118 720 4447 3375 -2323 -5636 -3078 1957 4083 301
901 301 -4804 -4745 -719 2616 993 -3097 -3265 -601 231 -2376 -2789 828 2411 -2695 -7424 -2583 5568
918 5568 4711 -4266 -8185 -2966 2866 3225 1153 -2234 -5368 -4360 1616 4972 761 -4265 -2718 496
934 496 -1547 -3003 2067 6221 -533 -9654 -5788 5984 8008 -243 -5770 -3518 -694 1097 3874
949 3874 3854 -1934 -6410 -1663 5407 3510 -1502 -466 2526 -1090 -4787 1553 9349 4778 -6181
964 -6181 -6714 2303 7118 4232 702 -1952 -3148 -1559 4646 7648 1574 -4341 -1990 2795 2080 -56
980 -56 3245 5437 -1405 -8071 -2263 8362 8428 -970 -6513 -3459 1644 4047 4159 1076 -3631 -4321
996 -4321 73 4341 2585 -1045 -849 83 -1691 -2147 2027 5256 903 -5116 -4003 1439 4946 2111
1012 2111 -1912 -3705 -1995 1689 3652 1110 -2905 -2957 837 2092 439 -761 79 449 -1359 -1986
1028 -1986 642 2500 1155 -1849 -3336 -1881 2045 3926 807 -4057 -4514 660 4370 1988 -2215
1043 -2215 -2550 -52 703 92 779 1447 16 -1943 -1601 131 2441 2968 588 -3052 -3768 962 5844
1060 5844 3980 -3025 -5575 -566 4788 3378 -165 -1785 -1400 -771 543 2534 2116 -334 -2305 -2025
1076 -2025 -616 1539 3499 2794 -3172 -6403 -1939 5304 5767 -1300 -5671 -3187 977 2756 1567
1091 1567 204 -1150 -2722 -1909 746 1910 1458 698 -1260 -3513 -2126 2784 5381 766 -4852 -4703
1107 -4703 919 4126 2551 -887 -2400 -1733 -441 1359 1843 762 -864 -1113 -1348 -766 1628 3334
1123 3334 1221 -3479 -4261 907 5055 3330 -2001 -4039 -1211 2153 2830 1722 -1084 -2152 -722
1138 -722 1581 1674 815 908 803 -600 -2216 900 4414 3333 -1672 -3796 -111 3530 3225 219 -1605
1155 -1605 -1643 -80 2553 2434 431 -2011 -962 1001 691 -327 22 1397 -143 -2512 -1345 2183
1171 2183 2929 -441 -3591 -2067 732 1838 706 -1021 -2881 -2218 1052 2469 591 -2162 -2147 -292
1187 -292 111 -783 6 1121 -405 -3496 -3542 527 3634 1408 -2935 -4467 -1676 1619 2832 701
1203 701 -3160 -3574 -779 1683 1441 -56 -1642 -1242 -1052 -903 508 1615 798 -2157 -3805 -1123 2504
1220 2504 3464 34 -3432 -3137 484 3214 2573 -261 -2115 -1522 421 1371 1869 510 29 -131 -917
1237 -917 -57 2116 3429 1258 -2178 -2613 1078 4558 3143 -731 -2587 -137 2490 2667 1759 83
1253 83 -460 -177 808 1780 1541 959 395 -738 -1087 682 3158 2872 -825 -3769 -1602 3103 3534 91
1271 91 -2443 -1700 535 1424 1221 471 -67 -1224 -896 413 1318 897 461 -786 -1741 -1597 1364 2900
1289 2900 614 -2857 -3239 336 2820 1036 -1640 -2120 -1421 -29 474 487 -466 -1384 -1800 -770 -107
1306 -107 132 212 -348 -1709 -2733 -510 1976 1786 -2313 -4149 -1621 1317 1855 -598 -1903 -1825 -1220
1323 -1220 272 630 596 -747 -1441 -1304 -823 162 1329 948 -639 -2578 -1848 1183 2994 625 -3108
1340 -3108 -2645 107 2283 1152 -465 -1067 -909 -356 202 1438 949 35 -806 -1074 -22 1269 1893
1357 1893 814 -1275 -2009 175 3030 2845 -699 -2391 -649 1793 2097 995 -236 -299 -119 534 1056
1374 1056 1727 1239 107 -960 -448 1010 1997 1964 -108 -2565 -1408 1856 3323 888 -1951 -1521 412
1391 412 1645 902 287 -60 -254 -1367 -343 798 1294 362 -914 -1437 -1085 1057 1684 385 -2097
1408 -2097 -2629 -339 1846 1546 -972 -2075 -1052 368 487 7 -353 -43 -985 -1290 -308 847 737
1425 737 -436 -1597 -2061 -65 1847 1474 -1114 -2531 -1618 694 1871 637 -1572 -1431 -385 275
1441 275 188 532 549 -409 -1367 -770 672 1693 872 -914 -1610 -565 1360 1966 913 -1117 -1370 -130
1459 -130 1783 1325 -139 -778 -168 318 445 850 1131 821 -606 -1424 256 1800 1754 85 -1466 -833
1477 -833 380 1871 2334 -253 -1772 -1187 994 1839 873 -272 -433 4 -2 343 969 1236 27 -1178
1495 -1178 -963 535 2046 1289 -199 -1651 -1090 1160 2301 1113 -1128 -1064 -11 1221 588 336 153
1512 153 -82 -271 -145 744 1443 928 -259 -1074 -385 1261 1874 778 -964 -1380 55 1914 1419 -244
1530 -244 -1066 -459 338 714 513 681 -113 -847 -810 116 1431 1374 203 -1344 -1557 211 1932 1404 -667
1549 -667 -1825 -847 976 1399 419 -764 -888 -381 -204 317 594 233 -444 -681 -937 247 849 1116 -657
1568 -657 -2017 -921 976 1766 113 -1372 -1318 -117 695 548 -82 -380 -1112 -647 -208 429 543 -53
1586 -53 -763 -1260 -504 922 1306 403 -1272 -1766 -241 1564 1157 -296 -1310 -740 329 790 833 77
1604 77 -928 -683 -57 -9 612 855 -138 -933 -1043 153 1535 1088 -596 -1597 -381 648 1277 610
1622 610 -510 -849 -593 253 647 513 379 -461 -610 -324 364 1252 836 -356 -1427 -383 955 1448
1640 1448 504 -1130 -1199 -324 1061 1091 55 -891 -597 226 379 171 743 245 -428 -825 -495 797 822
1659 822 109 -1018 -1287 -258 798 827 -6 -1164 -1193 584 1055 17 -695 -675 -201 -121 -198 245 218 -147
1679 -147 -1191 -968 208 493 141 -287 -1238 -1061 83 1073 412 -801 -1442 -38 549 332 -483 -365
1697 -365 -185 -583 -670 -50 690 -28 -796 -1440 -294 359 908 73 -1087 -1329 -685 826 1009 -534 -1274
1716 -1274 -939 -78 166 88 124 -149 -287 -638 -129 698 568 -394 -1130 -706 -171 814 797 32 -959 -924 260
1737 260 1111 641 -216 -985 -464 388 345 582 390 170 -848 -400 635 1063 801 -291 -1001 -302 683
1756 683 1009 582 -210 -948 52 898 1296 434 61 -139 -86 378 238 883 529 -103 -361 -215 979 1538
1776 1538 345 -891 -463 248 834 773 179 -460 -768 47 626 631 -73 -416 -203 178 -46 152 895 292
1796 292 -561 -939 -341 823 504 -656 -957 -326 32 561 31 -376 -995 -713 363 579 65 -502 -163
1815 -163 -46 -268 -101 338 664 -204 -1001 -245 680 1103 114 -747 -632 12 354 756 579 -671 -803 329
1835 329 499 438 40 64 98 -318 -312 719 960 154 -510 -632 529 1315 836 -276 -456 56 402 697 719
1856 719 105 -360 -396 360 759 103 115 299 -562 -461 19 775 808 -279 -892 80 525 1009 297 -501 -451
1877 -451 -343 -50 538 299 -447 -434 -590 -189 317 489 139 -177 -398 -366 331 851 169 -780 -616 -174 600
1898 600 638 -11 -396 -370 75 -13 538 406 -108 -588 -127 -49 219 549 3 -112 -1003 -157 982 899 43
1919 43 -522 -183 487 953 -98 -94 -177 -259 112 229 316 246 -380 -331 -82 -181 296 254 -195 -721 -487 333 764
1942 764 45 -861 -881 -122 155 -1 -24 -246 -189 -390 -82 319 55 -179 -188 -220 -14 26 46 301 -646 -942 -130
1965 -130 479 508 -216 -676 -439 217 202 200 -41 -188 -571 -365 147 393 185 -331 -463 -111 99 399 685
1986 685 -176 -945 -572 182 433 424 -445 -372 -295 405 -83 -68 129 -509 -308 -178 392 208 222 -82 -443 -325
2008 -325 440 466 373 -356 -691 -333 416 511 62 -394 -456 -296 121 292 193 -59 -200 -554 -140 313 451 320
2030 320 -435 -10 -42 335 540 155 -496 -542 189 408 216 76 -95 -125 60 -99 540 55 -170 -260 -278 350
2052 350 205 398 -5 -421 -287 110 400 331 -328 -422 -288 701 248 94 -210 -219 12 25 148 348 484 -58
2074 -58 -206 -94 514 150 -240 -232 -381 -348 322 464 76 -371 -263 64 235 63 200 -90 46 34 -148 367
2096 367 225 55 -253 -335 23 110 569 170 -421 -441 -155 307 191 -239 -291 -260 88 -161 101 249 -120 -24
2118 -24 -299 114 458 242 -47 -306 -163 469 397 145 -90 -410 -95 258 431 502 -417 -265 214 156 346
2139 346 -34 31 23 12 -148 177 606 281 -317 -514 -165 505 238 -61 -328 -80 139 372 453 98 -105 -157
2161 -157 -59 307 400 36 263 -99 -201 179 273 312 -48 -332 -297 85 632 185 -276 -292 -108 163 402 94
2183 94 50 -65 -38 85 36 267 12 -5 -222 -199 256 453 190 -306 111 -117 272 520 78 -80 -341 90
2205 90 -20 473 -163 -117 -157 -577 -77 49 279 43 -254 -158 -85 95 -143 71 -489 -218 65 549 188 -324
2227 -324 -377 -139 -54 128 135 -208 -185 -277 293 183 1 81 59 -212 29 -242 570 58 57 -190 -316 72 235
2250 235 297 -77 -411 -2 57 50 519 56 -90 -229 77 120 -2 166 -217 -366 -438 -53 96 74 -246 -504
2272 -504 -300 133 130 89 151 -171 -98 105 -145 -172 165 -80 -120 45 196 275 142 -159 -179 -172 313 272 -314 -602
2296 -602 -27 -129 230 -92 -113 -128 -124 183 313 81 17 119 -216 -33 155 471 44 325 -156 -157 353 72
2318 72 -280 -270 -170 -265 -211 -59 1 -411 128 -411 -429 278 277 36 -203 -152 -448 204 304 -144 -152 -147 35 -137
2342 -137 83 -52 -105 -367 -9 63 -36 111 -426 -235 84 -44 108 68 -109 -77 7 -164 251 -89 -79 -89 -57
2365 -57 156 202 78 51 -227 -98 -49 369 332 -17 -33 -113 -163 60 85 -43 242 -258 221 -168 172 261 -201
2388 -201 126 151 159 191 193 96 51 -44 52 -267 -88 396 120 -362 -139 -19 159 -34 15 -277 78 45 -157 91
2412 91 90 -142 25 -159 -296 50 -147 120 -139 -161 54 152 -54 -139 16 136 281 -8 -222 -263 97 383
2434 383 449 27 -155 -123 21 294 68 339 -250 -12 69 115 -156 6 82 -114 -22 137 190 272 163 -28 13
2457 13 -68 24 129 -28 -29 -28 -257 -209 24 124 -383 18 -321 9 -54 44 -448 5 -165 161 -478 -33 130
2480 130 -344 -374 -261 -98 -1 12 -124 -301 -158 106 47 97 -174 -278 -120 -21 22 199 -181 -264 -150 140 16
2503 16 47 -303 -237 169 16 150 130 54 -141 -137 66 186 345 -94 -18 255 127 -171 34 170 -143 -16 -145
2526 -145 -73 -175 -139 -250 -217 71 -154 108 74 -136 138 -37 -115 253 85 337 -156 132 203 171 -148 80
2548 80 159 6 44 296 -151 25 -197 120 20 -26 -110 -92 258 -232 -156 -129 -196 277 -20 35 187 12 124
2571 124 -18 53 -131 -151 53 56 75 19 -399 -73 -274 34 115 -45 37 98 27 29 311 -194 -3 -227 -53 115
2595 115 199 -51 -18 191 79 -15 -51 -45 -71 55 43 79 -3 92 4 -166 -153 -35 312 169 48 -2 -13 240 -148
2620 -148 18 -159 -313 143 -138 137 65 212 -169 130 -254 263 35 -184 88 -172 230 290 311 9 -144
2641 -144 -100 -112 128 -71 244 146 69 17 -28 71 -228 80 92 231 432 -101 165 -61 -88 226 54 -114 168
2664 168 61 53 -93 -76 76 145 59 78 -161 -234 -37 170 50 61 -22 144 -153 -37 -70 148 92 -399 -45 -29
2688 -29 -288 57 -238 -104 202 -31 36 219 -353 34 303 -41 -5 -169 371 -33 -53 30 143 210 -249 -126
2710 -126 26 -56 137 176 257 -349 258 -70 16 435 -59 -130 -141 -77 -87 58 92 56 -192 -14 160 40 108 153
2734 153 237 -199 -191 -56 110 -78 36 -35 54 33 -141 -101 -245 -152 70 -329 -151 138 -189 -26 -60 -76 29
2757 29 -76 -202 106 165 120 -82 -274 -230 -312 38 -113 -4 -219 -81 -180 -69 163 80 -70 -363 -24 166
2779 166 -292 210 110 -102 -40 -173 152 227 116 53 144 -111 -15 -36 -119 -125 262 -149 64 156 -22 -7 304 -242
2803 -242 5 -87 277 74 -149 27 -306 36 -150 -125 24 219 6 -76 172 -43 -108 -428 -366 288 -37 -72
2825 -72 -104 -170 -174 3 169 -183 -79 57 135 50 141 110 92 153 -54 46 66 -55 -111 -117 -113 -110 4 331 -62 -125 19
2852 19 77 147 0 -47 -150 -21 198 98 268 40 69 -150 -95 -85 -126 51 -25 -108 -65 -354 373 139 -231 -158
2876 -158 -114 -21 -146 -34 -63 -66 13 -111 136 197 17 332 -92 29 31 8 -130 -56 -125 154 32 -142 136 -137
2900 -137 -79 5 251 -40 110 -98 -80 201 37 -180 -76 190 -116 -11 -41 -64 -145 61 217 -119 -145 -181 63
2923 63 77 92 55 26 136 -116 66 160 30 79 67 152 169 107 152 -200 -18 -54 -100 -145 -246 -15 -81 291 -21
2948 -21 184 41 -58 80 56 -154 18 -119 -205 72 -289 173 117 60 210 -8 -92 271 -67 -32 -122 160 246
2971 246 -211 186 39 194 23 1 133 -107 -45 -44 -220 168 -74 -141 -84 -35 -28 138 -232 67 -70 98 -199
2994 -199 -86 -52 134 42 -339 -185 -9 3 -69 -130 -151 -185 -25 -82 233 -18 179 -123 -152 -39 -171 235 174
3017 174 -152 -42 -42 -158 -111 -78 17 -175 -78 115 -81 136 183 -149 -40 -183 -79 115 66 135 -133 1 -56
3040 -56 237 61 -99 200 -166 126 -42 132 107 -144 25 54 47 -62 61 161 -19 -241 105 115 -214 -244
3062 -244 -108 -233 353 -134 56 117 -322 4 51 174 -243 -170 -38 -134 118 125 -168 -48 -73 -239 -37 286
3084 286 321 67 41 60 -97 40 65 -19 -161 195 -11 -3 -68 -96 177 -204 0 187 -33 -140 -2 -34 -46 -99
3108 -99 44 51 -250 265 -246 -190 20 -139 -104 170 41 -185 -420 74 23 -87 -383 -236 26 41 275 -178
3130 -178 -71 160 181 95 -73 276 157 -45 -484 -24 -143 99 114 68 66 195 -153 26 -132 -307 -66 -3
3152 -3 192 227 283 80 53 144 50 -214 -65 -32 -19 -203 218 59 -110 31 -48 -189 178 -67 -279 -31 -125 -131
3176 -131 6 -31 76 -45 -324 177 19 -37 -125 -34 316 -263 216 -190 -18 35 263 35 133 -117 -271 -282
3198 -282 -305 59 221 220 219 -199 133 -113 -279 -370 -30 -10 -175 -184 138 -131 -60 176 2 127 -61 -150 -114 85
3222 85 -92 250 184 61 142 30 82 231 -45 171 -30 48 -26 -11 -13 11 -53 -167 -136 -363 -63 -50 95 -43
3246 -43 11 225 -307 124 40 43 39 149 -229 -111 44 475 -59 -12 -181 -27 255 -29 48 -100 -4 -162 89
3269 89 21 105 151 104 -223 122 -136 50 149 9 216 -102 197 115 -93 -129 65 -158 -127 280 -410 131 108
3292 108 17 240 1 355 -63 31 119 171 68 149 -6 214 100 188 62 98 -252 -259 28 42 -144 97 -68
3315 -68 -437 90 -132 -118 99 -82 182 89 79 2 -328 -95 -110 140 -194 -53 11 -261 -198 40 28 -2 173
3338 173 -53 52 47 -98 135 132 147 14 -349 -28 190 -61 104 43 -64 121 172 -50 83 -54 319 240 210
3361 210 366 -283 -233 -99 101 14 215 45 63 -167 -265 -130 -195 -40 36 123 -135 134 -85 32 -104 59
3383 59 290 65 -81 0 -47 -100 -11 -190 15 135 1 238 5 -74 222 108 13 33 206 -66 150 73 -287
3406 -287 -59 27 63 117 54 70 -338 -131 0 -79 175 -103 6 4 0 -120 387 -41 134 -20 -89 -170 -106 -5
3430 -5 -118 -224 66 171 -56 -161 -276 -270 58 13 -372 -125 143 -296 68 165 -164 251 -256 -81 50 31
3452 31 158 -172 124 207 93 -192 -137 353 185 -71 14 112 -115 69 57 -54 56 -80 40 -114 56 -38
3474 -38 122 73 128 105 487 -183 -151 21 31 -52 30 22 39 -18 -155 -30 -37 18 0 -42 100 -218 -75 161 -48 -41
3500 -41 -201 -218 134 110 16 -136 39 5 217 378 -15 -169 -187 147 270 -55 129 -283 167 23 272 54
3522 54 103 -21 -49 26 -133 1 -193 96 92 226 266 -66 92 157 39 224 35 -105 -76 -64 -42 -5 113 61
3546 61 -213 205 -47 -47 -262 -316 310 -26 244 145 38 159 -247 -125 -178 107 69 -143 -222 -47 -106 -5 339
3569 339 -65 92 -116 413 -70 4 -6 -199 -108 -132 36 -113 134 141 232 -46 119 -161 -104 220 -63 202 255
3592 255 -103 -15 23 147 -9 -198 -262 113 -228 65 -140 122 -108 41 218 127 -2 -59 -29 56 -9 -126 148
3615 148 -171 -204 -162 241 441 -302 153 -114 167 -66 125 268 -144 23 -48 264 128 2 -183 149 27
3636 27 165 59 -3 -95 279 -223 14 116 85 186 -2 108 -52 -7 -131 -103 -140 -17 -50 -47 222 -206 151
3659 151 -479 12 257 49 -227 -3 -63 90 -132 -190 142 10 -214 -102 -81 30 -238 265 -16 66 -277
3680 -277 33 -15 -14 -34 -207 17 -245 75 -184 -176 -148 103 -111 132 -69 -112 -405 150 -27 -231 -92 258 59
3703 59 -57 -73 63 63 -44 130 -274 196 69 -55 81 92 -178 417 -19 -127 177 -6 29 282 6 -54
3725 -54 235 14 -60 313 121 97 -239 30 18 231 45 51 -37 229 36 -282 -16 8 113 -293 56 53 89 -264
3749 -264 185 -135 -315 -304 -170 -236 24 177 5 -31 -99 -26 -180 -159 -239 252 168 237 -42 16 73 10 -61 -386
3773 -386 -227 -149 -67 -110 -119 170 44 -118 253 214 54 345 39 296 96 -84 -245 50 -107 -95 -117 40 -54
3796 -54 -114 106 406 -48 115 187 59 63 25 61 -96 28 -126 -186 40 58 -83 156 16 -1 154 128 -293 -414
3820 -414 189 247 128 73 -28 -3 -90 -86 173 404 -254 -13 243 -351 265 228 306 108 -83 186 244 -244 14
3843 14 -369 116 362 117 -120 -5 1 -114 -137 57 75 -56 -32 -62 310 -123 270 41 5 5 61 -83 32 -330
3867 -330 -125 22 149 -234 -57 -113 -14 -182 50 477 92 36 -55 -49 43 116 189 -42 -205 -158 -215 155 -127 -166
3891 -166 -28 11 -300 46 -86 -210 227 -78 157 176 -151 4 9 53 6 122 317 73 30 245 150 -117 -95
3914 -95 27 88 -383 -94 320 -235 -217 -39 249 -20 -164 -94 40 -77 56 197 -129 53 -19 82 194 -124
3936 -124 -222 271 63 50 144 134 23 111 -224 -178 271 18 -133 -112 -139 -69 280 64 -185 -111 70 -44 28 -14
3960 -14 -72 -310 -37 -318 -40 -40 162 30 140 142 -317 -10 274 36 -119 109 1 -198 72 74 -50 212 62
3983 62 -30 -57 272 49 76 56 58 84 15 6 -45 -143 -93 -59 63 -8 411 64 -181 79 -221 202 32 -136 166
4008 166 -11 -279 18 46 -40 -325 -3 89 95 2 211 69 -88 -155 -346 18 131 -210 -59 108 -93 339
4030 339 144 135 -59 13 -194 19 -9 54 173 129 -88 -313 -176 243 80 46 19 88 75 -166 -32 -17 54 7
4054 7 -61 306 -18 -46 184 70 129 -20 -51 -90 43 62 65 -248 -246 110 288 -23 -64 -126 -37 -111 -38 72 -67 -4
4080 -4 -368 -13 -175 -48 145 -90 38 -183 -62 -12 -9 -53 -268 -169 29 -94 221 -186 -56 -96 154 -51 -76
4103 -76 252 139 -146 142 -141 -36 200 -226 64 -62 -50 -9 90 -72 -89 -164 32 -145 154 -192 522 -195
4125 -195 -26 14 -202 271 378 -58 -53 -162 203 -110 184 -158 14 -72 -155 49 -377 175 -20 83 -15 141
4147 141 39 122 102 203 142 -86 -50 -21 -133 -50 -26 39 -173 164 -7 6 -7 336 50 93 96 369 -64 -102 -223
4172 -223 196 177 107 -112 20 -302 79 171 173 14 72 107 101 -14 -187 190 145 59 104 -63 328 274 -115 36
4196 36 -382 7 242 183 92 120 23 22 -179 -27 21 100 -63 140 -47 -71 223 -90 -1 -121 -76 128 138 -332
4220 -332 -126 -21 -160 -139 2 14 -256 -148 -74 -275 -111 -139 178 -67 106 -137 77 -45 -133 -235 -200 117
4242 117 164 287 -61 133 30 112 -225 188 220 124 -127 -57 -31 335 -3 -36 365 -48 -68 34 -39 -98 316
4265 316 166 167 255 10 -425 244 -200 34 -85 38 -63 -101 -161 -238 39 -111 -278 -106 -130 192 -95 -330
4287 -330 189 5 239 -78 188 215 77 76 126 44 -107 -87 113 106 -146 178 342 58 264 306 184 -124 -25
4310 -25 3 -33 -246 -50 -300 107 118 -119 160 -78 -123 -284 -92 125 222 157 -25 164 -119 88 24 12 -97
4333 -97 -57 8 -201 -23 -29 320 56 -14 -258 -66 -37 14 117 148 -106 -159 124 91 -301 64 -45 120 -143 73
4357 73 230 166 26 170 -203 93 -76 -153 248 186 142 -110 -50 -68 134 229 105 279 -103 -266 75 -198 -173
4380 -173 12 44 -168 -104 -17 180 30 -250 -80 1 -209 237 -189 124 71 222 -179 76 -257 -123 -50 17
4402 17 205 -32 -74 -123 -63 4 180 17 185 -107 -142 -47 -33 136 235 329 114 -95 31 183 7 305 -107
4425 -107 -103 9 -102 -121 -139 -302 184 187 112 -70 -335 217 0 -93 233 -57 -24 66 -76 11 -69 101 -185 -210
4449 -210 -277 202 100 -85 -43 -107 -195 -82 129 -47 -192 -50 -108 -218 -126 -243 40 -238 -212 -214 270 -265 88
4472 88 -155 312 156 157 -202 -64 -88 37 97 87 13 -17 159 87 144 23 -115 18 -77 180 -142 -101 159 65
4496 65 140 -62 -70 -21 -297 -165 41 -233 -20 61 88 6 120 30 -36 -125 106 164 55 210 -44 234 -218 -12
4520 -12 19 129 234 -67 -57 -138 -344 -96 -42 125 -142 244 -44 -75 156 -53 -186 -86 202 23 -62 -295
4542 -295 93 -67 -12 -128 303 -132 -123 84 246 20 83 -124 147 198 -74 79 147 -16 -384 -164 107 -26
4564 -26 123 60 124 193 -79 361 211 -98 55 -116 90 36 -165 -9 -47 181 -72 -7 -315 3 -38 -149 150
4587 150 -160 -165 -137 -10 -127 -5 -276 141 -33 134 150 -164 -110 289 -187 -112 -26 -112 -175 -243 108 -162 27
4610 27 -192 62 -180 311 -92 -132 -160 299 118 164 116 24 -90 127 -23 -120 -232 -222 -163 -106 86 -96 28
4633 28 87 4 85 -115 -205 45 -15 -198 -90 363 -130 96 -82 188 -20 130 46 -78 51 -195 152 165 -4
4656 -4 -32 -74 148 -67 -106 -157 185 -266 -82 6 -161 -272 22 72 175 171 -58 132 -250 382 -124 -49 155 -250
4680 -250 -194 -55 -9 -110 -94 -157 -85 37 30 353 -197 82 -153 -16 -130 40 45 179 -38 -10 -32 396 101 -104
4704 -104 -254 -115 120 107 331 -230 192 40 154 229 -69 159 -88 460 -26 195 -19 71 69 -48 259 -95
4726 -95 84 -126 137 72 170 -126 147 -37 239 202 395 78 66 -187 -1 26 -57 -188 -40 -25 -205 -369 -52
4749 -52 5 128 -169 211 -440 -21 32 -56 -150 84 168 -41 7 -170 222 -57 298 -214 194 -277 34 87 -172
4772 -172 -84 116 272 76 -135 58 118 100 122 144 -182 -107 -99 166 -287 -3 118 57 -273 -76 125 72 139 104
4796 104 173 -188 33 121 3 -157 84 270 -143 133 -134 98 125 78 32 86 107 -65 -69 307 -153 112 27
4819 27 127 22 -101 -304 93 115 95 -105 -100 268 4 272 99 -122 165 -206 -51 -2 322 -45 154 88
4841 88 46 71 147 -69 122 45 -138 -184 131 -25 77 -147 -44 -74 40 159 30 180 -1 -17 -6 179 213
4864 213 -229 100 -65 95 13 -229 216 -14 -168 -107 5 34 -18 -136 58 -20 79 -38 -123 125 104 -29 -24
4887 -24 -14 185 -179 164 -47 -184 -145 48 348 319 -57 -166 93 -71 -98 244 -37 -17 -123 81 265 21
4909 21 -41 -76 73 36 -15 -150 184 -53 307 -264 -173 431 49 -181 -213 8 201 211 -263 62 38 -91 -58
4932 -58 -109 -126 -7 4 136 7 118 -241 31 155 -28 -145 441 209 -134 -102 -23 129 -105 236 19 -146
4954 -146 -65 366 -46 88 153 -150 84 -191 116 121 234 48 -4 -199 157 37 -94 44 -54 92 80 -150
4976 -150 136 15 137 -201 -12 -141 187 -34 53 -110 -21 -252 -2 41 -10 -136 75 211 -49 -143 -156 141
4998 141 65 46 -167 -183 16 -83 11 -233 -210 19 -42 -119 59 147 81 70 102 -81 29 102 -4 190 -426 84
5022 84 77 43 -15 15 -189 69 62 107 297 -254 32 62 319 166 -128 207 240 235 73 -100 -43 6 110 -223 -103
5047 -103 188 84 -155 -210 -125 94 -7 79 237 -198 -150 -111 -294 -27 226 74 185 -119 165 49 -227 150
5069 150 126 -159 -18 -126 -32 -92 -70 148 -89 -205 39 -36 24 57 -19 -255 -67 288 95 229 -66 -55 -5
5092 -5 -361 -60 35 281 124 145 235 71 41 284 178 -92 213 138 -41 -299 194 43 89 -69 -137 -22 22
5115 22 30 75 -86 -211 -79 -272 -108 -188 -136 163 -203 -218 123 -48 -163 -48 112 123 -82 -91 96 -47 -52 -33
5139 -33 -92 -32 89 -42 76 4 242 -110 -5 -56 -153 124 -56 165 70 -44 -93 -109 59 170 153 11 -159
5162 -159 -26 43 -112 98 -41 -131 82 58 91 -167 51 -59 -74 163 0 90 24 62 -273 -19 9 -131 363
5185 363 234 -219 132 29 -564 162 2 419 -42 219 90 -159 38 -55 -147 11 36 4 -185 31 306
5206 306 -118 -132 357 259 -84 37 -326 95 -116 381 70 -184 -85 38 36 34 54 -207 160 -131 82 150 -121
5229 -121 321 -54 -24 -82 -195 296 119 45 25 121 -126 106 -194 109 -125 95 -61 -227 165 62 81 3
5251 3 -28 94 -49 191 40 -128 121 248 201 -176 185 -175 416 -44 -24 124 -296 -77 -143 20 227 98
5273 98 -32 83 -127 130 -117 -50 74 121 227 -41 14 18 249 101 33 -185 16 199 -103 10 -125 -66 -114
5296 -114 -271 171 -238 179 129 325 56 -353 6 -95 -176 218 -35 -331 -38 36 80 140 -87 -272 8 155
5318 155 -73 -197 -171 -74 1 71 26 152 160 -38 33 33 223 -135 -135 5 -133 -238 -162 -281 -278 123 41 -230 273
5343 273 -125 18 -53 -63 162 -588 56 -270 101 35 237 17 268 55 -388 -2 -265 133 3 -172 -15
5364 -15 56 -27 24 268 -84 58 192 -66 -126 185 -113 27 194 -16 42 77 17 -99 -135 150 222 -167 490
5387 490 53 34 -224 -182 128 -171 -56 220 129 50 -12 -5 119 -145 67 -34 -216 -91 -83 124 -292 417 -45
5410 -45 -40 216 446 165 -105 155 88 25 -261 10 -114 9 -80 -8 52 108 -83 51 222 -136 155 144 106 -175
5434 -175 -121 196 15 -48 -231 207 347 12 -219 -36 177 -234 -139 -57 54 181 -64 155 4 -24 -50 -151
5456 -151 223 112 -51 -95 -2 -28 77 -1 142 233 -89 152 20 -157 143 -197 -371 179 107 -79 -267 187
5478 187 133 137 239 -149 -25 63 38 -341 16 -125 -61 19 33 -87 130 136 -47 80 -90 -301 -63 104 138 -33
5502 -33 -107 243 28 -38 75 94 323 115 -131 -163 -297 182 -86 238 67 -51 12 37 -27 38 -240 7 -128
5525 -128 218 -62 -94 56 -20 -134 94 252 31 -71 192 93 -17 8 -17 -210 -292 5 225 29 -108 -13
5547 -13 -219 -157 142 246 149 25 54 133 31 -51 49 235 -155 86 -200 297 136 -30 138 51 -18 -29 -327
5570 -327 114 24 174 88 83 54 59 47 -183 139 143 37 287 -266 -37 227 -170 144 243 121 -8 17 49 131 -205
5595 -205 30 -169 -54 193 120 -105 -59 -76 -257 51 235 -105 82 78 -118 322 -40 -237 -208 -160 261 -116
5617 -116 137 -110 -74 185 -238 169 -31 -142 317 -7 -98 6 19 -49 -106 -222 88 -139 162 364 104 230
5639 230 -133 -24 0 -112 148 -122 -273 244 142 -268 -101 -42 -142 259 -116 -132 -125 -10 5 246 -25 83
5661 83 256 -271 207 -164 66 -16 -111 -119 227 -236 64 -316 113 417 102 -255 202 136 33 62 -171 -82 -148
5684 -148 -235 -144 86 -150 117 -37 -177 -359 -121 -45 308 56 -60 388 319 23 12 -19 -86 -89 47 -223 -117
5707 -117 -58 -147 41 49 213 -13 239 -128 -208 -79 -16 56 -42 152 -174 13 114 42 -1 -103 45 229 60
5730 60 245 -279 121 199 140 147 125 -132 -55 67 -217 -123 91 8 10 352 28 121 -169 141 102 121 -252 101 -152
5755 -152 -205 6 -342 68 87 -280 38 76 130 39 -10 33 141 -27 -22 112 0 -64 108 -21 42 125 -237 86
5779 86 -52 -45 6 307 98 198 21 101 -30 112 67 39 128 112 -133 -409 185 -104 18 172 -6 -104 -109 -5
5803 -5 249 257 -25 -1 45 174 -59 49 -86 292 -321 -98 219 131 -74 12 120 231 17 -28 295 129 -182
5826 -182 217 -69 7 -168 179 161 -8 161 -57 195 130 79 -34 -60 -142 -127 16 -192 -125 226 222 117 19 -12
5850 -12 -19 -161 -156 36 133 -300 106 209 -112 89 15 5 -35 83 138 -151 -150 -221 37 -26 -212 -271 29 193 -85
5875 -85 -15 43 -68 -107 174 139 38 -119 239 91 61 68 145 -242 -10 122 -27 24 7 288 140 -73 -112 60
5899 60 -121 171 -52 -132 3 -226 175 -250 145 128 54 -142 54 96 43 -49 -77 267 -50 250 55 34 76
5922 76 -7 -58 47 -213 395 137 -52 -7 307 -95 308 -403 31 13 116 -32 -215 153 125 184 -88 178
5944 178 137 -87 115 309 138 283 -26 -210 -112 199 -90 -95 77 21 4 -12 252 237 -30 -179 -108 21 -78
5967 -78 -159 187 56 -189 -102 -34 47 89 -173 -123 -14 271 -55 75 101 104 106 -32 -62 154 188 -108 -78 -77 129 92
5993 92 -78 -118 -258 319 151 195 254 35 190 -96 101 279 -24 -107 -236 151 20 -125 -25 59 145 -85
6015 -85 10 -156 -73 -116 -115 26 223 25 -23 -67 318 -89 63 -15 84 94 -203 19 -1 -36 -118 20 -68 -38 -124 -93
6041 -93 -42 110 -23 144 16 89 -68 71 136 374 13 -114 364 -51 -253 29 -66 -31 355 302 460 -62
6063 -62 -184 -86 23 27 -113 -212 69 128 104 41 -462 -169 11 -98 -184 -256 26 -83 134 -83 -189 145 0
6086 0 -126 254 102 19 167 -142 39 -5 36 -28 -355 -150 7 39 -325 -149 50 -92 100 313 179 151 -54
6109 -54 138 71 47 24 -38 91 110 177 159 -161 110 157 -23 -48 244 28 78 -50 93 -156 -171 7 104 250
6133 250 -234 -64 48 205 -70 -59 14 37 -122 -232 -106 38 -6 45 -269 110 -17 -141 -36 -124 -129 185 8
6156 8 129 323 19 234 -48 -209 -99 13 115 278 165 -167 21 -380 204 -98 109 -135 -160 -84 -220
6177 -220 100 104 76 25 -210 78 -172 -146 284 -190 -172 128 63 155 -15 200 170 -221 -226 -327 -22 21 -125 46
6201 46 -83 -62 141 222 157 -139 99 -5 -28 24 283 150 163 -200 -90 -222 -83 -12 63 134 346 57 -28 180
6225 180 186 124 -171 48 118 229 -130 -15 154 -139 369 -261 -40 282 -113 -62 98 -224 -23 -179 284 229
6247 229 93 364 -52 20 -48 -258 20 78 62 -53 -151 42 -55 85 -67 -131 108 -73 60 25 53 93 -97
6270 -97 3 190 -264 44 41 185 -155 -243 -222 -268 -13 18 259 27 272 -6 51 48 177 -93 -167 226 -24 51
6294 51 124 -101 -178 166 -5 75 54 140 108 67 13 90 10 -328 -23 -179 198 -27 6 65 -10 120 -22 4 -145
6319 -145 29 98 125 77 281 -254 -158 -29 -113 36 -236 326 233 -279 -341 -62 -45 138 -35 172 38 1 273
6342 273 41 -63 31 -127 231 -61 -43 105 235 175 -16 -142 -148 -128 68 143 7 95 -72 -307 62 -93 -44
6365 -44 34 42 332 136 98 127 -130 -330 -338 -131 29 91 4 -145 -202 -292 -68 109 24 181 212 -212 281 372 -141
6390 -141 -156 -311 121 146 -154 -72 -285 -50 230 90 -125 160 34 -186 -101 -138 -178 5 24 61 -14 -86 141
6413 141 242 27 219 109 82 -53 -292 183 -111 -129 130 187 32 161 -91 52 375 -15 38 -108 -135 -298
6435 -298 -179 -18 -61 104 96 253 -236 22 103 193 -42 -204 201 -39 193 139 -248 3 11 -5 -256 5 -345
6458 -345 130 -4 205 -5 -59 -6 -11 46 -24 282 92 23 -84 4 -162 -112 -5 74 95 -119 -21 9 -220 157
6482 157 93 3 -174 -23 -283 93 243 -44 -68 -84 -173 132 -191 64 224 64 328 -9 21 199 -395 136
6504 136 -6 10 150 24 -77 -140 0 45 246 -19 36 -27 193 -128 -128 -146 50 165 164 -72 -203 -81 -144 269
6528 269 33 100 20 -89 -166 -52 140 190 -88 -81 -141 112 176 -150 -206 -240 -86 94 109 -46 97 118 11 -200
6552 -200 -255 109 -114 73 -79 115 -124 89 182 27 101 19 -109 -73 -65 -136 107 141 54 82 46 -155 -50 77
6576 77 304 46 281 298 -26 220 179 121 -62 -201 31 -64 -122 -103 192 -5 62 138 39 -47 12 -105 -17 30 26
6601 26 -44 -240 147 -146 -397 227 10 77 130 -181 13 -86 -63 79 237 -115 -86 89 -211 108 -135 -102 196
6624 196 -61 -264 -237 -143 153 -31 -261 90 248 171 -223 -35 -247 -130 -52 8 -42 -35 13 -57 -120 -78 482 0
6648 0 56 -98 92 157 11 30 -21 -104 -50 304 170 -190 -205 -209 -105 82 -119 -280 -90 99 -151 216 61 -163
6672 -163 112 -139 -85 -120 -37 96 107 -84 149 -53 -165 -39 154 10 11 -118 -154 177 -87 -91 -232 145 -168
6695 -168 -92 48 -107 220 157 -16 31 -314 59 -279 57 -57 -158 -33 -305 -102 75 104 19 77 -116 134
6717 134 14 -280 28 33 -12 68 196 -207 -133 -184 20 -143 150 -83 99 335 230 222 -73 192 99 72 331
6740 331 90 73 -102 -38 52 -97 -22 -104 -228 -202 -127 -179 74 91 -85 216 -152 164 -52 -14 59 70 90 140 -114
6765 -114 -159 129 24 -105 122 -80 -37 -114 -25 -125 237 -305 198 -71 -102 118 -43 179 73 216 41 -353
6787 -353 221 188 -81 -81 80 -1 4 -56 -279 -43 -343 133 391 64 -41 58 81 91 -73 -153 81 38 -76 -125
6811 -125 -72 89 82 154 -104 96 -64 16 154 35 -44 141 -74 25 -248 -360 93 18 196 96 82 64 -175
6834 -175 21 102 91 226 -69 -18 77 -90 283 -20 -92 -27 -241 -141 242 -107 53 -347 40 -328 -45 143
6856 143 -82 -75 -124 -110 15 114 -48 -68 131 11 107 166 -297 120 28 170 217 110 153 356 -213 106 -286 -50
6880 -50 88 199 38 -62 -139 -118 105 144 -134 52 165 -33 -86 61 0 -74 41 125 130 -39 -216 -114 -182 132
6904 132 -98 -220 -71 -179 271 -1 -248 154 283 -257 -41 139 -25 -121 -262 109 -183 -138 141 32 -68
6925 -68 -190 40 -74 61 -110 168 -187 -181 -203 -274 90 -113 136 -155 -163 -358 -107 31 -55 137 -55 132 5
6948 5 -54 -63 -176 -215 -119 149 106 -161 -254 198 88 -212 -153 -260 197 204 -253 15 -37 -80 -269 131 0 -42 -2
6973 -2 -217 -266 -218 -117 -128 88 -378 -164 90 9 89 127 -45 -25 -91 -281 28 -156 -41 -5 12 -25 186 160 -116
6998 -116 35 -43 -128 73 -147 -195 21 155 -97 -278 -4 108 45 114 99 144 14 -59 297 137 121 197 -74
7021 -74 26 145 -89 189 -62 -200 -122 -376 -74 122 -5 -26 -2 -85 24 -149 71 383 31 18 -113 -63
7043 -63 20 6 95 -85 45 109 -24 32 -156 -225 175 105 47 120 -220 74 25 328 79 -16 39 -251 35 -37 -8
7068 -8 -117 -49 -100 320 -70 166 -27 80 287 38 -132 283 -235 24 -48 -176 -15 50 -32 200 -36 -243
7090 -243 -126 7 166 -135 -169 -43 -255 -156 242 -33 27 45 -14 -147 -4 70 -256 -21 76 -393 62 23 298
7113 298 7 29 176 71 -101 121 -76 -17 -134 -85 -175 -130 54 -167 39 -69 -169 186 51 -48 -120 -218 208
7136 208 -3 -45 -33 -252 -107 -255 -85 -109 11 -368 -71 -36 -407 -19 149 -59 8 261 -167 -232 -24 47
7158 47 11 -4 43 72 -29 -52 203 -9 27 -73 83 78 30 -178 61 -42 -274 53 10 82 -61 292 0 -8 -19
7183 -19 340 274 227 -202 -351 -90 92 -136 -187 -5 90 196 74 96 12 153 290 43 9 160 20 192 -7
7206 -7 -59 -300 373 -234 -52 -134 -145 44 -267 395 -145 -52 -128 210 -160 -238 14 -62 -296 -31 -56 -63 -168 -188
7230 -188 213 155 -60 201 -151 257 132 -83 9 -171 -222 -99 -172 15 19 120 257 318 151 -90 -322 15
7252 15 -86 -84 -44 132 168 150 122 120 -378 -106 -161 154 -60 -354 107 258 149 -32 -296 100 115 -291 8 351
7276 351 -228 96 -67 332 -31 -39 -184 -218 -55 118 383 171 207 -110 202 67 287 -7 -2 29 175 216 122
7299 122 -32 -86 -232 227 -20 -132 261 25 417 -142 48 261 -134 49 39 -161 -234 -263 -61 -75 64 -449
7321 -449 102 -195 -199 -199 410 34 -198 32 173 56 -33 -6 -96 -234 -127 -162 -15 -34 -120 129 -116 -75 199 119
7345 119 78 -43 -264 -299 -64 136 196 -168 362 -13 -51 -86 41 292 24 -180 -399 85 -269 -116 43 37
7367 37 -201 -68 -71 7 -159 83 -129 76 -283 -137 16 -364 61 -56 106 -135 -115 33 -271 -27 185 247
7389 247 192 -136 198 -164 74 -278 208 -54 -4 -100 -121 154 88 -260 12 -144 3 8 84 -235 132 303 -6
7412 -6 -104 372 115 -31 94 144 91 74 165 -76 -123 -224 196 -27 -61 132 -157 167 64 -45 142 266 58
7435 58 36 -45 112 135 -235 -171 144 -15 -98 116 247 -131 -58 157 111 -63 -24 -188 -65 -211 7 284 74
7458 74 77 -92 -34 -100 35 48 163 122 229 -12 80 138 -21 -62 126 368 -244 229 -107 -104 -20 75 142 -210 100
7483 100 -114 -20 -56 -200 -102 -195 -5 376 -233 121 -137 198 452 234 -160 255 -51 132 -9 214 170 70
7505 70 -203 -203 31 0 57 -62 -166 -51 80 -187 -279 137 314 184 284 -115 -16 97 98 -62 76 -12 -79 -14
7529 -14 -83 -67 18 -359 67 139 86 89 -52 -7 193 -180 -276 71 -78 -146 -100 100 -143 74 -33 -117 127 75 -119
7554 -119 -52 -275 32 -32 -6 200 2 -323 -115 183 -190 74 -105 82 16 -199 128 -386 285 63 138 -27
7576 -27 -96 -83 -161 26 48 142 -125 -22 -6 -60 97 200 -36 -20 97 41 28 -172 -61 -92 93 103 155 -49 -51
7601 -51 206 185 3 34 -351 5 87 -17 -4 -41 229 278 102 1 -116 -183 355 -141 6 74 -66 22 30 226
7625 226 92 -101 -27 -84 -69 -202 24 280 -76 -55 11 -143 73 -18 -17 2 -119 -212 -424 -79 -3 -264 -186 40
7649 40 -62 49 9 118 72 100 37 -107 278 233 67 -53 7 -207 23 -361 -10 -120 74 -33 -116 44 137
7672 137 -223 177 35 -324 79 -102 -82 -468 -338 -44 389 310 18 13 172 -72 5 -141 -56 179 -305 191
7694 191 90 -106 10 167 -158 84 284 253 93 -94 111 190 14 94 139 -118 -187 87 59 -247 203 6
7716 6 -116 -70 21 98 130 -288 95 25 -228 232 165 16 88 -73 68 -347 -65 220 49 -146 -20 -29 -266 124
7740 124 -157 71 50 -44 -207 -71 105 68 -150 -187 213 -225 -248 11 -17 -7 117 -53 111 166 -76 138 -269
7763 -269 58 -131 -81 -34 -237 -126 197 47 237 134 173 185 230 -141 163 -170 -295 272 -85 365 -106 233
7785 233 121 -112 244 -158 -7 321 -163 -197 60 90 -97 -41 -76 131 -45 -41 131 -93 -61 120 33 223 -376
7808 -376 121 73 -276 -84 -198 22 271 51 -101 -127 -233 -37 -102 70 135 -113 133 -225 172 -37 237
7829 237 77 -255 172 -129 320 -186 228 142 -112 207 -101 46 -200 127 -145 -34 78 133 -30 -32 -248
7850 -248 298 -73 -123 95 216 257 -145 72 -50 119 21 82 -134 -123 176 -27 236 186 -108 120 55 -15 -168
7873 -168 104 92 32 -174 -157 -93 -13 107 -108 78 -258 -35 97 -8 -25 135 -188 -65 281 44 138 -214
7895 -214 -19 128 55 140 146 -55 82 293 65 259 -27 87 100 -26 7 -195 -145 -38 -100 210 166 121 -128
7918 -128 -186 -98 369 169 3 -34 -305 17 91 -247 -69 -99 -61 104 215 -11 194 -167 124 206 -141 32
7940 32 -17 -188 33 35 65 103 144 -130 -266 -70 23 252 -205 114 28 60 404 -66 135 -47 35 -221 -60 -17
7964 -17 -272 -31 -108 4 58 329 179 -80 190 -249 -41 -82 -181 -301 -76 -97 151 -119 329 -78 56 350
7986 350 -290 -143 -285 44 90 -270 104 -122 186 239 -288 54 -18 140 -102 -76 59 32 56 28 36 -48 -69 -34
8010 -34 284 268 -129 256 -26 -344 -33 64 -8 120 77 37 18 -53 28 113 72 57 178 -27 246 82 -29 -125
8034 -125 -116 -189 -244 384 -128 159 -221 -17 -291 -16 28 -49 333 185 -27 1 295 -381 45 -60 179 173 -140
8057 -140 87 -12 -34 317 122 -103 -78 -217 -5 -184 -146 -85 -51 160 -305 -283 -138 -71 -160 -10 93 -178 -256
8080 -256 -95 -337 -183 160 120 -57 30 0 -108 -133 -125 128 7 -39 83 110 -27 301 -22 126 144 85 -216
8103 -216 -102 318 172 -52 -75 -35 -44 140 -17 -224 -192 -4 -180 -273 349 -22 8 279 -122 -91 -212 128 82
8126 82 -8 -85 23 -76 45 -26 148 -260 7 -54 53 130 59 -10 -17 207 155 -213 -78 -284 386 136 -60 54
8150 54 183 93 436 60 -109 39 130 150 81 -386 -137 -100 -107 -74 47 -234 -90 6 148 67 54 136 230 -157 102
8175 102 -28 16 27 218 49 -145 55 232 -107 -12 6 10 43 -114 -30 -64
8191f4
##END NTUPLES=NMR FID
##END=
