##TITLE=1H_Pr T-792-1
 CDCl3, 8 sc, 
 19.11.2019
##JCAMPDX= 6.0         $$ Bruker NMR JCAMP-DX V2.0
##DATA TYPE= NMR FID
##DATA CLASS= NTUPLES
##ORIGIN= UXNMR, Bruker Analytische Messtechnik GmbH
##OWNER= root
$$ XWIN-NMR		Version 3.5
$$ Tue Nov 19 14:18:47 2019 Russian Standard Time (UT+4h)  she@DPX200
##.OBSERVE FREQUENCY= 200.1315
##.OBSERVE NUCLEUS= ^1H
##.DELAY= (6, 6)
##.ACQUISITION MODE= SIMULTANEOUS
##.ACQUISITION SCHEME= undefined
##.AVERAGES= 8
##.DIGITISER RES= 18
##SPECTROMETER/DATA SYSTEM= spect
##.PULSE SEQUENCE= zg30
##.SOLVENT NAME= D2O
##.SHIFT REFERENCE= (INTERNAL, D2O, 0, 15.7039)
##AUDIT TRAIL= $$ (NUMBER, WHEN, WHO, WHERE, WHAT)
$$ ##TITLE= Audit trail, XWIN-NMR		Version 3.5
$$ ##JCAMPDX= 5.01
$$ ##ORIGIN= Bruker BioSpin GmbH
$$ ##OWNER= she
$$ F:/spectra/data/she/nmr/H-F/1/audita.txt
$$ ##AUDIT TRAIL=  $$ (NUMBER, WHEN, WHO, WHERE, WHAT)
(   1,<2019-11-19 14:17:50.56 +0400>,<she>,<DPX200>,
      <created by zg, POWCHK disabled, PULCHK disabled
       configuration hash MD5:
       00 E9 B6 7A A2 85 ED C7 34 08 36 98 17 FE 4E 26
       data hash MD5: 16K
       8C 5E A2 2A 09 23 08 53 B0 CC C8 63 77 EB B6 4C>)
$$ ##END=
$$ 
$$ hash MD5
$$ DE 57 9F E5 60 8B 71 93 1E B3 3D FF 83 01 61 82
##$RELAX= 
##$RELAX= 
##$RELAX= 
##$RELAX= 
##$RELAX= 
##$RELAX= 
$$ Bruker specific parameters
$$ --------------------------
##$DU= <F:/spectra>
##$EXPNO= 1
##$NAME= <H-F>
##$PROCNO= 1
##$TYPE= <nmr>
##$USER= <she>
##$AMP= (0..31)
100 100 100 100 100 100 100 100 100 100 100 100 100 100 100 100 100 100 
100 100 100 100 100 100 100 100 100 100 100 100 100 100 
##$AQSEQ= 0
##$AQ_mod= 1
##$AUNM= <au_zg>
##$AUTOPOS= <>
##$BF1= 200.13
##$BF2= 200.13
##$BF3= 200.13
##$BF4= 200.13
##$BF5= 200.13
##$BF6= 200.13
##$BF7= 200.13
##$BF8= 200.13
##$BYTORDA= 1
##$CFDGTYP= 0
##$CFRGTYP= 5
##$CHEMSTR= <none>
##$CNST= (0..31)
1 1 145 1 1 1 1 1 1 1 1 1 1 1 1 1 1 1 1 1 1 1 1 1 1 1 1 1 1 1 1 1 
##$CPDPRG= <>
##$CPDPRG1= <>
##$CPDPRG2= <>
##$CPDPRG3= <>
##$CPDPRG4= <mlev>
##$CPDPRG5= <mlev>
##$CPDPRG6= <mlev>
##$CPDPRG7= <mlev>
##$CPDPRG8= <mlev>
##$CPDPRGB= <>
##$CPDPRGT= <>
##$D= (0..31)
0 1.2 0 0 0 0 0 0 0 0.06 0 0.03 0 0 0 0 0.0002 0 0 0 0 0 0 0 0 0 0 0 0 
0 0 0 
##$DATE= 1574158669
##$DBL= (0..7)
120 120 120 120 120 120 120 120 
##$DBP= (0..7)
150 150 150 150 150 150 150 150 
##$DBP07= 0
##$DBPNAM0= <>
##$DBPNAM1= <>
##$DBPNAM2= <>
##$DBPNAM3= <>
##$DBPNAM4= <>
##$DBPNAM5= <>
##$DBPNAM6= <>
##$DBPNAM7= <>
##$DBPOAL= (0..7)
0.5 0.5 0.5 0.5 0.5 0.5 0.5 0.5 
##$DBPOFFS= (0..7)
0 0 0 0 0 0 0 0 
##$DE= 6
##$DECBNUC= <off>
##$DECIM= 24
##$DECNUC= <off>
##$DECSTAT= 4
##$DIGMOD= 1
##$DIGTYP= 9
##$DL= (0..7)
0 120 120 120 120 120 120 120 
##$DP= (0..7)
150 150 150 150 150 150 150 150 
##$DP07= 0
##$DPNAME0= <>
##$DPNAME1= <>
##$DPNAME2= <>
##$DPNAME3= <>
##$DPNAME4= <>
##$DPNAME5= <>
##$DPNAME6= <>
##$DPNAME7= <>
##$DPOAL= (0..7)
0.5 0.5 0.5 0.5 0.5 0.5 0.5 0.5 
##$DPOFFS= (0..7)
0 0 0 0 0 0 0 0 
##$DQDMODE= 0
##$DR= 18
##$DS= 0
##$DSLIST= <SSSSSSSSSSSSSSS>
$$ [...]
##$SUBNAM2= <"">
##$SUBNAM3= <"">
##$SUBNAM4= <"">
##$SUBNAM5= <"">
##$SUBNAM6= <"">
##$SUBNAM7= <"">
##$SUBNAM8= <"">
##$SUBNAM9= <"">
##$SW= 24.9337058887773
##$SWIBOX= (0..15)
0 0 2 0 0 0 0 0 0 0 0 0 0 0 0 0 
##$SW_h= 4990.01996007984
##$TD= 16384
##$TD0= 1
##$TE= 0
##$TE2= 300
##$TE3= 300
##$TEG= 300
##$TL= (0..7)
0 120 120 120 120 120 120 120 
##$TP= (0..7)
150 150 150 150 150 150 150 150 
##$TP07= 0
##$TPNAME0= <>
##$TPNAME1= <>
##$TPNAME2= <>
##$TPNAME3= <>
##$TPNAME4= <>
##$TPNAME5= <>
##$TPNAME6= <>
##$TPNAME7= <>
##$TPOAL= (0..7)
0.5 0.5 0.5 0.5 0.5 0.5 0.5 0.5 
##$TPOFFS= (0..7)
0 0 0 0 0 0 0 0 
##$TUNHIN= 0
##$TUNHOUT= 0
##$TUNXOUT= 0
##$USERA1= <user>
##$USERA2= <user>
##$USERA3= <user>
##$USERA4= <user>
##$USERA5= <user>
##$V9= 5
##$VALIST= <valist>
##$VCLIST= <CCCCCCCCCCCCCCC>
##$VD= 0
##$VDLIST= <DDDDDDDDDDDDDDD>
##$VPLIST= <PPPPPPPPPPPPPPP>
##$VTLIST= <TTTTTTTTTTTTTTT>
##$WBST= 1024
##$WBSW= 4
##$XGAIN= (0..3)
0 0 0 0 
##$XL= 0
##$YL= 0
##$YMAX_a= 153663
##$YMIN_a= -82782
##$ZGOPTNS= <>
##$ZL1= 120
##$ZL2= 120
##$ZL3= 120
##$ZL4= 120
##$ABSF1= 10
##$ABSF2= 0
##$ABSG= 5
##$ABSL= 3
##$ALPHA= 0
##$AQORDER= 0
##$ASSFAC= 0
##$ASSFACI= 0
##$ASSFACX= 0
##$ASSWID= 0
##$AUNMP= <proc_1d>
##$AZFE= 0.1
##$AZFW= 0.1
##$BCFW= 1
##$BC_mod= 2
##$BYTORDP= 1
##$COROFFS= 0
##$CY= 11.3945322036743
##$DATMOD= 1
##$DC= 2
##$DFILT= <>
##$DTYPP= 0
##$F1P= 16.9975609425685
##$F2P= -3.02152046262296
##$FCOR= 0.5
##$FTSIZE= 0
##$FT_mod= 4
##$GAMMA= 1
##$GB= 0.15
##$INTBC= 1
##$INTSCL= 1
##$ISEN= 128
##$LB= 0.24
##$LEV0= 0
##$LPBIN= 0
##$MAXI= 10000
##$MC2= 0
##$MEAN= 0
##$ME_mod= 0
##$MI= 1.114404
##$NCOEF= 0
##$NC_proc= 0
##$NLEV= 6
##$NOISF1= 3.799351
##$NOISF2= 2.8
##$NSP= 1
##$NTH_PI= 0
##$NZP= 0
##$OFFSET= 15.70392
##$PC= 1
##$PHC0= -9788.3
##$PHC1= 13.00086
##$PH_mod= 1
##$PKNL= yes
##$PPARMOD= 0
##$PSCAL= 0
##$PSIGN= 0
##$REVERSE= no
##$SF= 200.130013532006
##$SI= 16384
##$SIGF1= 3
##$SIGF2= 2
##$SINO= 400
##$SIOLD= 16384
##$SREGLST= <1H.CDCl3>
##$SSB= 0
##$STSI= 0
##$STSR= 0
##$SW_p= 3612.71676300578
##$SYMM= 0
##$S_DEV= 0
##$TDeff= 0
##$TDoff= 0
##$TI= <>
##$TILT= no
##$TM1= 0
##$TM2= 0
##$TOPLEV= 0
##$USERP1= <user>
##$USERP2= <user>
##$USERP3= <user>
##$USERP4= <user>
##$USERP5= <user>
##$WDW= 1
##$XDIM= 8192
##$YMAX_p= 0
##$YMIN_p= 0
$$ End of Bruker specific parameters
$$ ---------------------------------
##NTUPLES= NMR FID
##VAR_NAME=  TIME,          FID/REAL,        FID/IMAG
##SYMBOL=    X,             R,               I
##VAR_TYPE=  INDEPENDENT,   DEPENDENT,       DEPENDENT
##VAR_FORM=  AFFN,          ASDF,            ASDF
##VAR_DIM=   8192,          8192,            8192
##UNITS=     SECONDS,       ARBITRARY UNITS, ARBITRARY UNITS
##FACTOR=    0.0002004,     1,               1
##FIRST=     0,             0,               0
##LAST=      1.6414764,     0,               0
##MIN=       0,             -82782,          0
##MAX=       1.6414764,     153663,          0
$$ Real data points
##PAGE= N=1
##DATA TABLE= (X++(R..R)), XYDATA
0 0 0 0 0 0 0 0 0 0 0 8 -8 8 -8 8 -16 16 -16 24 -24 32 -39 40 -48 56 -64 77 -88 97 -112 128 -143 160 -181
33 -181 202 -225 252 -280 311 -345 382 -424 470 -519 576 -639 708 -784 873 -975 1093 -1229
51 -1229 1394 -1591 1838 -2156 2584 -3190 4120 -5750 9443 -38489 61798 113013 -45288 -82782
65 -82782 10689 44290 -41757 -38799 57300 67447 -40864 -66710 21037 59532 -6889 -26597
77 -26597 28712 32830 -32370 -23131 60833 66303 -23419 -46382 29094 59497 -2184 -28460 21664
90 21664 41436 -8621 -27998 17904 34075 -9373 -20911 25460 38008 -8440 -22541 20350
102 20350 30302 -16189 -28452 22894 47766 110 -40506 -14759 25079 19929 -1965 1533 13364
115 13364 3776 -6833 4159 17471 11533 2918 6347 5171 -5013 -1606 18021 22466 -1734
128 -1734 -21077 -1597 31111 25931 -11689 -21734 13630 34885 4545 -28347 -9896 26555
140 26555 19461 -13857 -13151 11954 6466 -21066 -13071 24373 25032 -13398 -23580 1999 5732 -13179
154 -13179 -110 31681 11761 -40956 -36812 21337 37932 -6389 -26287 3887 12820 -18696
166 -18696 -18806 23640 30715 -15348 -32036 1610 13476 -10083 -3186 29025 8052 -48431 -36847
179 -36847 35511 47178 -20989 -47688 4843 29877 -15934 -34804 14972 34913 -18918 -47569
191 -47569 -160 34215 454 -28259 -4512 9888 -14410 -14053 24865 22418 -31811 -41045 19550
204 19550 46435 -4267 -37296 1042 28846 -3998 -22798 17523 37978 -5699 -35085 1346
216 1346 35378 13120 -9756 6648 14572 -12771 -16722 25903 41462 -5024 -37374 -2224 34471
229 34471 10789 -20047 -1987 22361 2117 -23896 -6745 19321 8922 -14462 -10245 3765
241 3765 -2433 -11288 449 7625 -10230 -22107 -568 17836 -3843 -30266 -14169 17379 12194
254 12194 -18448 -22945 907 10051 -6819 -14932 496 10124 -4764 -19276 -9310 8958 9184
267 9184 -1918 -6907 -7697 -10102 -3965 11739 15056 -6621 -24337 -10700 14499 12567 -9299 -11260
281 -11260 5165 2840 -15696 -12008 14306 17130 -11554 -25753 -5410 12881 5642 -5131 -3237
294 -3237 -5301 -14418 -5001 18054 13598 -18993 -25707 6739 21641 -3438 -17837 3743 14812
307 14812 -9041 -21127 6725 27751 4050 -23393 -11663 12516 11012 311 4546 4244 -13307
320 -13307 -13527 15732 26205 -3256 -22387 23 18821 201 -14076 8216 23808 -1743
332 -1743 -26469 -5536 25544 16053 -10761 -9608 5024 989 -3985 11029 18000 -6232 -21505
345 -21505 2893 25631 7732 -16007 -2864 18383 5910 -15164 -467 25384 13697 -16914
357 -16914 -13575 16662 22530 1245 -7046 2949 4290 535 9533 17134 2960 -14667 -3358 19766
371 19766 16412 -5759 -7891 9612 11347 -5642 -5853 13488 16826 -4464 -15629 -218 15825
384 15825 10394 -1762 -5148 -3179 -811 4553 10311 4550 -8941 -9874 4132 11159 44 -7102
398 -7102 942 6641 -3816 -11280 1614 14919 6063 -13410 -14631 2701 13167 5330 -5408
411 -5408 -7513 -5326 -2357 4854 8816 -248 -12518 -8771 4448 5603 -3440 -3973 2851 -892 -13078
426 -13078 -9797 9422 14964 -5726 -22007 -10596 9112 9456 -2552 -8543 -7892 -7101 -1842 6118
440 6118 3966 -8482 -12970 -2667 3944 -2260 -5998 1528 3423 -10139 -16233 695 15812 3710
454 3710 -16839 -15242 1332 7461 1921 -2883 -4728 -8526 -6871 3358 7952 -1858 -11710 -5330
468 -5330 3828 -1428 -8336 352 9257 -2198 -17992 -9049 12095 13287 -6034 -15708 -5294 5720
482 5720 5070 252 -867 -3195 -6481 -1694 7054 5873 -2860 -4388 2228 2424 -2666 1377 10165 7175
498 7175 -6900 -10100 4536 16731 9889 -5429 -7578 2187 9079 8711 4653 669 -1840 807
512 807 6140 6657 2801 2309 4363 1871 -3347 -228 10542 12163 -866 -11363 -3760 11108 11598
527 11598 72 -5882 -3554 811 3165 4647 2818 -3408 -5502 -756 3095 523 -2030 1016 1519
542 1519 -5748 -10157 -42 11380 4583 -12544 -14807 974 10233 2950 -7108 -7639 -3427 -1070
556 -1070 436 2113 205 -5104 -5943 -1903 593 -532 939 2217 -3541 -10343 -4805 8759 10186
571 10186 -3411 -12697 -6580 5469 8460 1365 -4438 -4971 -1785 1852 3738 2230 -988 -2090 -320
586 -320 -950 -1260 3714 7646 1469 -8550 -7012 5179 12115 4634 -6390 -7445 686 7243 6356
601 6356 1321 -2668 -2523 347 4164 3735 1432 1107 1339 -1050 -2616 2393 8527 6524 -3249 -7740
617 -7740 -605 9784 10867 773 -6575 -3343 5057 8345 4788 0 -1211 1272 3131 3000 3089
632 3089 4806 3694 -277 -2378 586 6630 9026 3000 -5550 -5644 4183 11159 6327 -3515 -6575 -173
648 -173 5540 4905 354 -1476 -695 -1439 -1516 458 2712 2247 -1376 -5452 -6099 -1831 5229 4923 -4719
665 -4719 -12323 -7369 3680 5964 -2671 -9513 -7096 -1763 -1737 -2597 -1913 -2043 -5911 -7990 -5350 -1584
681 -1584 341 -345 -4752 -10772 -9948 432 7512 1178 -11235 -13158 -2401 5616 1723 -4598 -5260
696 -5260 -3958 -3760 -1594 2023 1734 -2459 -4796 -4016 -2101 936 4858 3656 -4867 -10016 -1991 9290
712 9290 8485 -2990 -9087 -2242 5163 4335 1198 210 -615 -1789 393 3758 3369 1510 1149 940 -1713
729 -1713 -1346 4912 8947 2415 -6985 -4884 6278 10367 2604 -4027 -2193 2632 3768 3579 2650 704
745 704 -545 644 2384 2440 2224 3497 2450 -1892 -3401 3304 10044 5327 -4913 -7199 2225 9015
761 9015 5925 -541 -3791 -2039 1923 4897 4161 194 -1520 -959 522 1533 2515 3798 1789 -3540
777 -3540 -5909 -184 7563 6657 -2088 -8102 -4516 3024 6642 3154 -3521 -6004 -2147 2196 2534 250
793 250 -761 -1585 -2635 -3371 -1325 2764 3226 -1157 -6625 -6121 30 5395 3548 -4026 -8667 -4818
809 -4818 3022 4374 -728 -4277 -3150 -1811 -2048 -1318 1715 2407 -2193 -6691 -4885 1153 4854 2808
825 2808 -2648 -7027 -5512 2108 7591 3070 -5324 -6555 -8 3940 2061 -462 506 -97 -2399 -2062
841 -2062 2331 5279 2311 -2393 -3124 -777 2232 4629 3873 -1533 -5882 -1158 6488 5746 -2197 -4212
857 -4212 737 4125 1819 -1170 101 1835 252 -1269 520 2536 1563 327 -934 -1612 -292 3662
873 3662 5238 -332 -6107 -3158 5378 6608 -73 -4853 -2182 2121 1896 230 824 1389 -1008 -2877
889 -2877 -719 2410 3060 1759 -1252 -4350 -3021 2774 6477 2351 -4942 -5876 221 5455 3598 -1296
905 -1296 -3244 -1788 -265 742 2063 1454 -853 -2620 -2653 -1182 2480 3846 926 -4665 -6774 -1102
921 -1102 5285 5538 -1686 -6555 -5210 1319 4560 2558 -1668 -3655 -2608 -991 288 1355 2493
936 2493 784 -3767 -6150 -1181 5085 5368 -920 -6396 -5356 761 4627 3158 -1682 -4163 -2975
951 -2975 368 1970 679 -199 -548 -1086 -2790 -2198 1846 4072 -72 -4891 -4125 814 3324 1697
967 1697 -1537 -3528 -2248 584 2835 1156 -2339 -3137 97 2479 354 -1472 230 1329 -1096
982 -1096 -2714 487 3615 2061 -2359 -3627 -462 3319 3727 974 -2494 -3185 317 3945 3860 -1074
998 -1074 -3426 -88 2874 1296 -79 859 1790 17 -2116 81 3601 3433 -405 -2832 -1862 2313
1014 2313 4298 2681 -1368 -3567 -1128 3557 4963 442 -2643 -1245 1442 1793 1661 1862 1492 -621
1030 -621 -2015 -1008 2347 4499 2335 -1920 -4127 -1654 3257 5997 2321 -3139 -4241 -221 3137
1045 3137 2943 1121 -414 -1660 -1640 -1142 1499 3497 2292 -1395 -4868 -3180 2335 5078 2178 -3964
1061 -3964 -6098 -1819 3115 3462 -603 -3535 -3084 -1420 547 1081 407 -1023 -2185 -2552 -1491 821
1077 821 2412 761 -3285 -5181 -1971 3152 3379 -1596 -5158 -3307 739 1983 498 -1457 -2292 -2085
1093 -2085 -769 106 336 -28 -355 -1343 -2235 -1648 1029 2789 180 -4195 -3844 881 3534 1011 -2539
1110 -2539 -2780 -309 1127 1135 -12 -1035 -810 -318 316 653 584 612 257 -1015 -1085 1307 3609 2416 -1591
1129 -1591 -2853 520 4436 3727 146 -2368 -1171 1893 3781 2697 365 -711 -166 957 1929 1922
1145 1922 2123 948 -834 -1735 553 4222 4543 500 -3249 -2483 1665 4885 2606 -1425 -2793 -558
1161 -558 2020 2273 1370 144 -313 -580 -468 589 2278 2297 -128 -3076 -2443 807 3154 2313 -1332
1178 -1332 -3703 -2188 2029 3407 618 -2046 -2453 -911 239 84 450 455 -1300 -3048 -2242 416 2281
1195 2281 928 -1687 -3639 -2809 594 2763 807 -3438 -4608 -1502 1724 937 -1476 -2489 -1352
1210 -1352 -1635 -1280 -466 724 103 -1898 -2885 -1117 806 1104 575 -2325 -3503 -649 2248 2513 -890
1227 -890 -3469 -1868 1262 1721 -214 -846 -85 192 -942 -357 1369 1781 -325 -1432 -1221 728 2895
1244 2895 2290 97 -2086 -1375 1649 3680 1992 -1170 -2022 194 2379 1712 369 511 145 82 -16
1261 -16 1152 2447 1612 -451 -1428 -450 1697 3792 1582 -1202 -2003 166 3190 3457 216 -1724 -995
1278 -995 1026 1834 1506 861 322 -274 -952 -476 1925 2683 709 -1977 -2147 -233 2101 2542 54 -2593
1296 -2593 -2446 591 2338 1242 -930 -1639 -764 164 -277 23 533 221 -1782 -2712 -541 1843 1209
1313 1209 -1334 -3061 -2037 240 1889 944 -1345 -3058 -1928 574 1424 -28 -1912 -1864 -300 -579
1329 -579 -975 577 671 -679 -2844 -1782 585 2261 680 -1752 -2944 -1593 864 2023 413 -1901
1345 -1901 -2397 -842 1084 892 -659 -995 -427 -563 -1373 288 1552 911 -1414 -2531 -497 1968 2469
1362 2469 29 -1789 -1315 261 1855 2013 -24 -1825 -771 1078 1785 791 168 103 142 -518 -105 1869
1380 1869 2521 576 -1729 -1454 1144 3180 1830 -400 -1475 -644 1009 2417 1439 -439 -1054 -282
1396 -282 819 1135 776 660 246 -872 -1066 236 2156 1761 -689 -2316 -972 1551 2270 646 -1170
1413 -1170 -1339 -273 848 2052 330 -621 -724 -64 421 489 550 589 -2 -1619 -1219 1110 2094 295
1431 295 -1675 -2378 97 1660 968 -696 -1344 -1502 -263 1044 621 -474 -1195 -698 -723 -366 44 1028
1449 1028 33 -1377 -2465 -715 1549 1358 -840 -2554 -1274 400 1092 897 -712 -1738 -977 105
1465 105 895 95 -161 -754 -886 -422 -364 739 1152 143 -1892 -1735 830 2125 677 -1529 -2035 -434
1483 -434 1170 1117 278 -885 -1147 -569 375 913 282 -3 -555 -655 -426 442 1657 1123 -1119 -2133 -619
1502 -619 2122 1954 -379 -1269 -1232 354 1412 1155 382 -168 -581 8 884 882 698 322 -392 -1014 -380 1543
1522 1543 1924 293 -1634 -1440 562 2093 1120 -862 -1479 -89 977 933 625 125 -880 -574 -1
1539 -1 681 961 469 -310 -1039 -1044 181 1874 1336 -615 -2099 -853 1240 2017 242 -1270 -1103 -160 571
1558 571 771 503 76 -507 -710 -289 740 812 609 -485 -1423 -1100 677 1823 445 -1419 -1618 121
1576 121 1112 963 -270 -1097 -568 -244 265 304 298 -410 -932 -892 -378 436 1177 10 -1346 -1787 -374 1204
1596 1204 862 -834 -1880 -1190 212 1022 38 -947 -796 -514 -541 103 349 208 -149 -924 -755 238 1221
1615 1221 813 -655 -1368 -931 625 1251 669 -881 -1505 -179 936 579 -72 -247 -674 -302 140 458
1633 458 681 424 -200 -948 61 987 1485 546 -735 -1066 -132 1311 1418 14 -812 -557 679 1365
1651 1365 805 58 -338 23 -193 412 1131 1079 179 -831 -439 432 1475 1334 62 -1128 -958 603
1669 603 1503 995 -327 -899 -50 177 512 537 492 -120 -855 -528 395 798 946 -281 -1365 -957 442
1688 442 1174 631 -584 -1368 -576 486 877 544 -902 -672 -514 56 253 511 376 -701 -821 -676 147
1707 147 998 363 -795 -1370 -753 731 657 76 -1048 -1316 -290 639 246 -631 -643 -524 -382 -255 94
1726 94 79 -75 -953 -1185 -181 608 790 -355 -1031 -959 -50 678 366 -252 -671 -667 120 552 -58 -255 -662
1747 -662 -391 -91 63 542 554 112 -888 -717 362 1449 445 -550 -948 -49 667 1027 587 -733 -622
1766 -622 -281 461 888 112 192 -105 -317 -15 544 875 622 -317 -1303 -16 1207 1408 449 -749 -702 22
1786 22 976 862 296 -587 -724 69 476 642 446 336 -375 -765 -100 858 1178 120 -628 -911 438 984
1806 984 885 -450 -485 -678 294 511 491 -109 -254 -588 -295 160 94 131 184 -720 -628 -395 845 837 -159 -1167
1828 -1167 -693 326 577 264 -526 -837 89 324 -36 196 -149 -497 -620 -103 106 143 329 -229 -552 -884
1848 -884 273 509 394 -797 -1090 -25 476 660 -366 -450 -670 23 271 320 51 -195 -373 -211 -206 458
1868 458 398 -126 -472 -752 -65 704 576 -303 -683 -352 388 971 277 11 -439 -237 159 777 380 47
1888 47 -69 -259 -153 273 864 602 -30 -261 -512 458 1380 797 -400 -727 90 716 733 645 -231 -165 -275
1909 -275 21 838 619 134 -438 -580 -234 563 860 381 -198 -984 -318 795 782 -7 -577 -464 51 427
1929 427 209 454 268 -616 -547 60 124 655 -381 -806 -704 -272 503 730 -109 -746 -921 -344 452 648
1949 648 -336 -814 -131 -191 -316 -65 -140 -398 -450 -437 -223 381 35 -212 -584 -586 -110 507 466 -394 -890 -341
1971 -341 322 433 -192 -640 -270 -182 -134 -63 353 66 -347 -537 -210 437 499 -27 -445 -142 -401 468 526 121
1993 121 -585 -703 27 522 619 -327 -107 -160 194 -143 324 471 100 -800 -165 123 256 470 113 -279 -627
2014 -627 155 822 701 -236 -815 -298 546 638 310 -120 -119 -28 -148 198 532 241 369 -341 -193 508 685
2035 685 397 48 -419 -178 557 595 660 -490 -608 270 486 284 442 148 -98 -145 -33 738 698 -10 -236
2056 -236 -424 -14 252 517 89 -286 -891 -325 405 483 35 -651 -461 -59 -177 -59 280 89 -324 -587
2076 -587 -346 186 180 -84 -633 -443 118 34 573 -33 -508 -698 239 738 258 -160 -221 -50 -248 99 88 323
2098 323 -343 -398 -265 446 860 363 -490 -495 -66 254 360 305 -69 -704 -235 501 493 9 -57 -41 143 -15 355
2121 355 250 259 -302 -454 -95 523 548 103 -35 -654 -132 549 377 93 -383 -357 262 747 217 236 -102 -142
2143 -142 53 -122 316 452 -70 -347 -317 87 763 539 -82 -484 -169 140 485 257 104 -555 -345 35
2163 35 396 146 -24 -47 -541 -262 227 691 226 -87 -380 -227 422 600 236 -309 -317 -325 0 453 13 -163
2185 -163 -334 47 254 62 -217 -229 -406 -298 -148 198 355 -204 -597 -444 205 433 116 -76 -476 -417 -180
2206 -180 -172 362 -233 -325 -354 -153 93 -68 -54 53 -618 -625 -89 382 445 -329 -645 -321 414 556 165 -169 -414
2229 -414 -192 -12 209 218 99 -355 -452 -336 165 406 175 -237 -227 -315 113 335 167 -200 -317 -53 496 166
2251 166 -53 -11 -304 -140 425 514 306 -345 -312 -148 -21 253 550 274 -30 -276 -174 375 633 33 -87
2272 -87 -160 338 333 532 -91 -6 -235 236 243 245 115 -40 13 -36 -6 120 499 247 -474 -350 267 456 441 -190
2296 -190 -631 -49 184 281 405 -127 -231 -97 264 121 181 61 3 -363 -179 226 172 157 -508 -269 -11 233
2318 233 511 -134 -433 -3 -73 330 263 -8 -8 -127 -35 -110 247 107 -239 -5 -164 -216 175 235 62 -618 -541
2341 -541 -46 423 58 -306 -597 -183 -81 172 112 123 -526 -107 -206 57 205 -94 241 -72 -303 64 47
2362 47 12 -204 -778 -270 14 110 -19 87 -301 -216 114 319 227 -166 -169 -482 24 261 421 336 -142 -160 -217
2385 -217 42 562 109 -99 -162 75 393 69 542 -164 -256 185 78 485 200 104 -218 -154 32 372 497
2406 497 251 -288 -350 298 452 396 52 -84 -315 109 113 259 -174 -168 -41 -116 472 54 352 -70 -194 -310
2428 -310 -232 154 -108 -275 -173 160 527 473 132 -440 -192 -160 -113 131 -44 79 -164 -251 -215 283 322 133
2450 133 -269 -352 210 366 345 -35 -355 -391 -96 132 156 -184 -204 -70 -173 86 -15 -38 -168 -208 -119 8 98
2473 98 246 -109 -158 -225 -411 135 117 94 -168 -244 220 39 183 -173 -301 124 142 29 238 321 -429 -353 32
2496 32 390 300 40 -273 -148 -87 281 509 189 -373 -268 -173 43 -47 45 -123 53 -60 329 284 563 15
2518 15 -170 -276 78 317 322 254 -14 -245 -25 321 602 115 77 -43 -86 371 292 115 -44 -85 -175 96 217
2541 217 306 124 -105 -291 339 376 279 407 -255 -372 347 215 196 19 -271 -162 43 335 170 -210 -65
2562 -65 -339 -163 63 227 260 -290 -411 23 -88 251 163 -75 -474 -133 -50 302 85 -295 -66 -276 22
2583 22 88 -74 -185 102 -71 -448 34 -43 -38 -401 -422 -68 130 120 18 -376 -283 203 169 259 -123 -112 -276 22
2607 22 25 198 71 -186 -126 -107 135 171 -83 -53 -449 -268 91 319 260 -385 -279 162 -30 476 12 -70 -250
2630 -250 -271 -49 401 362 -36 -121 -413 47 310 437 321 -98 -302 63 440 425 329 -240 -350 -317 415 374
2652 374 380 103 19 -250 91 484 358 186 -114 -88 103 82 314 369 -121 -209 130 342 557 -127 -91 -359 -258
2675 -258 67 264 248 -358 -317 -273 341 130 316 246 -44 -346 -58 280 251 10 -541 -283 232 188 286 -116
2697 -116 -311 -328 -17 78 251 142 -268 -178 65 89 -124 -115 -97 -161 -351 -173 417 266 -245 -627 -348 183 9
2720 9 51 -271 -299 -56 35 -11 395 8 -83 -515 43 268 250 -121 -106 -417 -125 401 117 -286 -493 -354 -295
2743 -295 355 138 68 80 -135 -140 111 23 167 -252 -345 -253 -60 234 142 99 -362 -283 -85 442 83 122 -174 -70
2767 -70 -7 16 275 109 109 -74 -148 147 451 234 -154 -281 -2 540 270 476 128 -345 15 295 356 154
2789 154 -141 -323 -168 474 272 520 176 177 -240 -182 132 20 163 -328 -58 -277 310 544 142 -273 -596
2810 -596 -126 442 241 165 -137 -325 -73 233 186 608 -265 -58 -204 160 285 -81 -122 -440 -35 -3 160
2831 160 311 -184 -384 -146 -176 395 71 -40 -217 -279 -61 -125 11 165 93 -91 -110 -209 413 -4 -226 -189
2853 -189 -270 234 426 302 -154 -466 -225 24 74 91 -232 -452 -107 67 288 82 369 18 -761 220 326
2874 326 213 203 -252 -390 135 298 151 82 -174 -117 127 424 260 251 -18 -75 25 342 212 238 77 -316
2896 -316 -113 279 170 444 1 1 -37 -20 138 326 135 -66 -225 54 220 361 -195 163 146 -235 147 415
2918 415 292 100 -304 -141 223 207 209 67 -202 -177 307 134 232 -102 -16 -145 -20 89 397 193 -105 -200
2940 -200 -188 312 357 167 -103 -58 -157 -193 198 30 -59 -302 153 224 -35 56 -143 81 -214 171 398 282 187
2963 187 -129 -32 -67 269 495 52 -71 -204 -298 253 348 338 -285 -193 75 181 195 -41 -494 -168 -327 173
2985 173 -29 191 -118 -454 -63 89 246 165 -194 -350 -36 -55 276 -89 -85 -216 -444 -171 147 270 57
3006 57 -242 -85 -30 171 236 32 -408 -473 -121 266 188 61 7 -398 202 466 305 87 199 -97 62 223
3028 223 354 199 -72 -323 19 50 263 718 61 162 -85 92 393 113 151 41 -126 239 89 141 92
3049 92 -53 -20 -211 324 64 318 370 -93 -166 63 524 104 313 -249 -550 193 182 -9 65 -405 -352 103
3071 103 -23 261 55 35 -187 46 118 177 17 -113 -211 -306 -313 313 -162 -364 -373 -526 374 -71 273 20 -204
3094 -204 -320 -133 124 206 -309 -127 -113 11 97 115 -150 -165 -94 102 514 424 -24 -474 -386 -140 -49 15 107 -156
3118 -156 -345 -248 -106 145 93 89 -373 -105 -3 188 310 -124 -249 -91 62 432 -57 -93 -331 -414 268 498
3140 498 445 169 -212 -554 55 308 71 275 -151 -178 200 7 382 293 130 -37 -329 121 111 206 -144 -392
3162 -392 -198 -42 304 104 -264 41 -156 416 141 125 -31 -100 -173 -332 150 236 238 90 -296 -68 255 399
3184 399 9 -10 49 176 86 548 136 59 -181 -59 -6 134 -67 136 -170 -247 166 323 183 58 134 -115
3206 -115 143 252 290 -254 302 -195 -88 -25 145 -7 -116 -168 36 -18 178 -27 28 -132 -128 100 33 56 -117
3229 -117 -385 -216 -55 108 293 -61 -80 43 268 181 2 88 -510 -273 -13 233 217 50 -314 5 -64 32
3251 32 294 49 44 21 63 40 56 30 -109 -225 52 198 134 -35 -242 -14 -30 89 385 264 99 -115 -494
3274 -494 14 33 139 52 -354 -195 -43 199 33 234 -2 -196 -32 273 247 -93 -279 -329 227 125 289
3295 289 106 171 -201 -135 68 266 221 137 -96 -59 -275 99 298 -49 -229 -122 43 -61 268 -245 -65 -364
3317 -364 -9 44 459 -50 -149 70 -142 141 101 43 0 -211 57 -227 213 86 99 -91 69 -110 -121 119
3339 119 -202 -156 70 -115 178 148 51 221 -334 -129 -40 -156 -3 -76 -302 -87 42 309 50 -97 206 -292
3361 -292 57 78 34 -16 -304 -547 -101 90 293 -70 -203 -357 5 180 172 -39 -183 -261 96 9 -271 397
3383 397 -318 -370 210 372 15 14 -90 -203 -224 -312 -33 315 -273 -220 14 84 68 89 -66 -66 -236 68 -236 139
3407 139 50 -144 93 -256 440 120 -26 -280 -235 -37 412 263 87 6 -124 -85 202 239 11 -290 207 -50
3429 -50 -16 157 329 -137 -409 146 294 70 223 141 -235 116 75 271 6 45 -150 -167 82 251 235 95
3451 95 -83 -221 -107 330 97 -24 -315 -187 67 259 146 77 -156 -375 -181 -182 16 -202 246 -244 -420
3472 -420 -75 259 14 187 128 -264 216 -25 44 48 -294 -196 -273 -10 -100 16 -293 -396 47 9 35 -23 -213
3495 -213 -178 -353 11 138 44 -178 -457 9 -202 -114 168 -51 256 -82 -32 17 192 -260 132 -257 -208 3
3517 3 265 -121 -65 29 68 -226 81 -95 -145 83 -196 95 -196 110 -273 -80 -31 -117 430 62 -225 -293 21
3540 21 81 95 -19 -309 -64 -216 -163 336 102 252 -89 -71 124 165 31 -266 -50 147 -324 94 320 -24
3562 -24 110 -352 -106 60 -22 223 -144 -209 71 50 20 -91 8 -182 -120 -362 90 165 75 -72 4 -292 67
3585 67 85 386 -179 6 150 132 -259 70 -108 -173 46 77 -75 288 -299 -225 -61 -151 201 -83 -144 -75 63
3608 63 246 99 -55 134 88 -143 -73 140 214 -160 109 -47 -60 147 -126 310 -458 -400 -75 158 -8 142
3630 142 -109 -222 -65 70 -159 -350 -294 -126 219 -114 156 267 171 -207 -22 92 292 396 -34 -13 -56
3651 -56 -16 105 -33 100 -139 -254 61 175 128 128 -89 -168 -138 -38 112 265 -213 -84 -82 69 -65 -37 -137
3674 -137 44 21 114 73 92 -179 -83 2 100 -80 -109 -16 -19 27 -9 -316 188 1 -26 -204 70 207 -12 71 185
3699 185 18 -298 48 -63 224 -327 44 111 -183 -343 16 -111 -62 -117 -225 -191 137 137 -218 -138 -403 41
3721 41 134 -1 -79 10 -68 120 -85 218 -144 -117 -141 159 171 188 10 -181 120 -38 40 -234 26 27 -204 -152
3745 -152 431 114 34 -66 93 -122 -83 -107 -98 49 -86 -359 -153 42 -70 46 -172 -326 282 298 -113 58
3767 58 -442 -173 -81 -297 -17 94 -539 -188 36 224 49 68 -146 -186 -86 27 -105 -131 -230 -123 -17 -348
3789 -348 221 -35 70 -21 163 199 190 301 301 -160 -34 199 22 38 108 -230 -77 406 317 516 -382 -9 -41
3812 -41 30 224 39 -165 -152 20 -95 -125 175 175 -355 -52 -192 -124 -108 132 92 -212 -210 68 116 139 27 -186
3836 -186 16 124 98 -80 24 41 -65 -24 -144 -133 76 93 9 127 9 -69 140 124 -91 -7 312 15 -86
3859 -86 42 -263 213 161 -30 42 133 -178 -310 -13 192 -239 -190 179 66 48 116 -152 336 -90 -279 54
3881 54 318 40 69 -396 -217 97 74 170 215 -83 -279 265 46 -200 -33 292 301 209 -55 -240 257 -47 77
3904 77 -64 0 39 90 160 -102 -44 79 -206 -115 -24 64 -103 -151 88 30 125 -222 -253 -60 1 -35 71 2 0 -121
3930 -121 15 -98 48 -263 -89 -45 50 -252 -111 69 -63 -149 66 145 98 -179 -232 64 123 18 -111 -110 67
3953 67 -110 -145 80 235 253 -134 -211 154 -427 -85 67 -240 20 -86 178 101 -241 81 51 -150 100 52
3975 52 -59 -112 -84 153 -63 69 -254 -7 -116 -143 126 -29 -34 -72 93 -118 -194 -17 -39 -36 -99 -150 -82 -130 46
4000 46 291 95 55 -162 267 -66 146 180 91 13 328 -12 83 107 -215 -335 106 -3 138 -101 -94 -112 -12
4023 -12 82 281 169 -12 167 -179 205 308 -100 43 -67 -66 317 34 -63 62 -128 -36 -1 152 -95 238
4045 238 74 -76 -288 63 329 97 36 93 43 21 -261 206 -166 -172 -119 -98 37 -269 -29 -113 11 -176 -209
4068 -209 -58 -297 165 84 308 79 -104 25 -317 -146 152 -172 -100 -36 -448 -277 15 101 142 103 -166 -291
4090 -291 -72 -32 65 -97 -215 2 -230 -50 30 -131 -216 -106 -169 -165 -159 -70 83 43 -330 -486 -156 80 125 -260
4114 -260 -161 -5 302 -122 89 213 357 3 -39 212 -154 46 5 -71 -96 -37 115 69 -59 -228 -99 233
4136 233 86 13 -34 -42 -16 184 -100 292 194 141 69 91 26 -216 -33 82 306 96 -29 241 145 -17 -210 3
4160 3 155 -97 93 -447 74 -73 333 31 -101 -62 -58 163 188 67 141 389 -167 30 -110 -61 -255 166 -195
4183 -195 -114 -83 37 291 -15 -279 -25 189 63 215 -37 105 -315 80 -176 248 42 54 241 -69 109
4204 109 16 311 310 18 -403 22 -66 -64 -257 -258 -140 -1 120 55 -178 32 119 -230 -81 -8 3 67 -64 -13 86
4229 86 -138 -4 -7 -109 -34 -54 128 -137 -15 -6 35 -174 -133 -17 23 -201 168 -258 147 -89 -10 -111 255 -4
4253 -4 -166 -326 48 222 -92 64 -70 -162 36 132 22 -232 24 -49 -7 -10 -45 136 298 -215 127 138 -76
4276 -76 202 27 -16 -50 -40 -112 -86 87 134 137 -123 6 -45 -241 226 188 114 66 -63 158 -83 178 -61 349
4300 349 145 261 100 304 -57 203 -84 58 -89 -169 266 107 246 2 -146 131 -275 -154 -177 54 -16
4321 -16 -94 -222 -273 -60 59 198 -95 -33 93 -45 -211 -78 -160 -239 118 -59 -58 224 -272 -67 33 -26 39
4344 39 -79 -144 85 126 120 25 -95 -80 172 -131 -137 -180 -156 76 -87 184 -415 -109 -164 61 -3 137 -175 -113 94
4369 94 142 -42 30 -245 -240 -212 -127 20 -181 218 0 39 133 -1 137 -327 283 185 163 -373 -95 135 203 -112
4393 -112 -131 -134 37 -11 310 226 -66 -215 121 123 -153 491 -203 245 -96 214 281 -77 136 -119 -203 28 -53
4416 -53 133 -140 -197 356 95 234 -74 -97 22 93 267 222 -14 36 -58 99 36 2 8 -212 -51 157 -84 317
4440 317 93 -162 -80 -191 -160 14 294 -83 279 -30 36 -95 99 300 93 -66 -178 -68 121 -11 -243
4461 -243 229 -230 -95 191 133 120 -24 -123 69 -63 103 -147 61 -257 66 24 81 76 -231 -78 -78 -124 -243
4484 -243 -54 -32 -263 -87 11 363 224 193 64 -186 26 -10 -166 32 44 -30 236 170 -15 -92 -22 -24 -68 -103
4508 -103 63 -14 -135 -175 -252 -286 -165 -73 -104 -458 -162 10 34 133 -195 367 45 203 119 -156 15 -137 -49
4531 -49 -41 232 314 10 -194 79 -196 28 -249 230 185 -34 293 173 -22 78 -12 -108 293 266 74 249 46
4554 46 205 244 -78 -9 102 71 12 184 -21 146 -85 -41 -87 -33 70 211 153 7 -136 -90 286 12 68 56
4578 56 218 32 5 -49 -226 -221 259 -50 -146 152 88 249 177 -155 56 -13 -106 -206 -14 -153 0 3 -106 6
4602 6 -216 -275 39 -361 -54 -79 -153 56 -138 33 307 -70 -210 126 -231 75 -94 78 -342 -70 16 -119
4624 -119 -168 -146 -156 231 144 -164 -148 345 275 -127 82 -38 -105 -15 131 -89 -109 -228 -126 167 161 375 -171 -15
4648 -15 -267 -329 425 130 -8 392 82 -11 90 -106 -101 -172 134 303 241 90 208 -101 -43 207 150 187 119 -39
4672 -39 34 200 163 191 133 97 -24 111 -90 62 24 -79 -213 222 101 237 -75 193 -41 -38 -162 -12 -71
4695 -71 7 35 -461 -124 73 245 6 5 56 119 -1 -126 336 -13 -165 136 101 45 236 -266 -81 -41 -44 173
4719 173 103 -132 78 -152 316 -155 175 43 -333 -82 -105 46 -63 103 246 -32 -90 -61 184 102 90 137
4741 137 -138 77 -198 304 -265 66 -327 -54 -5 172 14 85 -102 -112 -152 -130 -124 -172 139 -200 113 -135 49
4764 49 53 93 -152 -126 -248 -99 -129 -199 79 -17 -206 34 54 -62 -31 6 60 228 21 48 78 -45 50 80 -204
4789 -204 369 245 -100 -58 -8 323 -88 109 97 145 282 31 -254 -39 287 -7 23 -7 -78 174 91 72 83
4812 83 -89 -120 130 87 -161 118 -139 -251 249 96 59 -57 -66 223 180 -52 -128 193 167 10 96 16 -145 41
4836 41 -109 -146 -271 -126 -234 -249 -135 -58 144 -303 -132 -389 195 223 -173 -17 -167 -187 -215 -36 -153 5
4858 5 61 -3 11 108 1 67 -56 -254 5 112 -18 -60 13 -117 -159 -73 -132 -7 289 -195 -163 -135 -268 -263 -132
4883 -132 -23 -315 41 141 -23 -99 23 -127 124 58 -262 -369 -176 -24 -112 186 157 -49 278 -7 4 -78
4905 -78 209 410 189 -28 -32 -113 -60 314 -3 302 111 -28 97 -79 119 -179 214 -168 119 33 171 -331
4927 -331 4 -136 263 294 192 -263 -160 74 323 110 -112 -117 177 317 346 10 188 -39 151 -48 204
4948 204 36 117 17 -20 -103 9 54 -25 173 -252 -131 -37 -13 164 81 -10 158 72 309 -91 66 -255 -195 -94
4972 -94 225 66 -133 310 -152 -60 -127 -149 -195 -141 -321 -140 77 117 162 119 -12 118 -136 134 25 -82 -23
4995 -23 -131 -23 27 -176 -209 -521 -401 -198 -169 -124 -310 -139 -262 -28 7 -99 234 -336 -137 -207 -225 -241 -60
5018 -60 -31 -381 -18 -224 -123 -74 -70 -123 -110 22 -215 -3 -328 49 -41 -148 -40 108 22 -393 153 -141 84
5041 84 -21 235 -103 53 131 163 25 88 13 73 -94 -14 118 -196 -200 -21 25 178 75 108 227 240 -89 -128
5065 -128 208 -55 -95 178 -255 107 -55 114 52 -74 -63 128 293 255 -109 -1 127 58 -264 -195 -139 -123 -143
5088 -143 82 72 88 -70 228 -40 114 213 25 62 -241 238 90 -174 123 80 33 18 -70 -175 -197 113 -105
5111 -105 -126 -176 -69 9 99 39 52 -133 -102 -9 -16 -130 39 212 39 48 -258 26 -196 -88 51 -166 -18 -27 -2
5136 -2 155 161 -5 -130 211 -90 -428 81 -90 -34 140 37 13 -131 61 -176 8 -36 70 -471 -170 200
5158 200 1 -43 -164 -32 130 -161 8 180 -300 -7 -44 -102 122 437 231 240 111 -21 232 67 247 -231
5180 -231 -153 -79 28 157 110 -3 -62 207 88 -106 195 165 -178 151 67 239 -113 -222 -160 -117 51 205 -56
5203 -56 256 -79 90 -37 117 89 41 -162 3 3 -120 -76 106 238 -248 -85 341 16 24 -39 -421 -256 27
5226 27 352 86 -172 -24 -289 -68 349 119 -135 -263 -79 127 -175 82 -216 71 -287 105 111 -276 -104
5247 -104 -313 -70 32 236 -55 99 35 -120 -251 -174 60 -72 -390 -429 -235 -310 -137 5 -137 -114 -61 -214
5269 -214 181 188 125 -91 57 -19 123 -151 41 93 -106 93 166 44 -50 146 -139 -197 236 125 -107 306 -46
5292 -46 96 -131 33 -36 -103 -325 79 -73 71 179 66 169 199 -92 98 27 -138 134 -77 164 -71 127
5314 127 165 -106 -172 168 61 255 56 155 186 354 12 200 266 -89 193 293 205 143 32 188 -49 4 76
5337 76 110 76 65 -93 -223 -63 289 38 59 83 -21 32 43 -34 344 102 -80 47 280 51 176 -105 -108 194
5361 194 -123 -131 369 44 -240 -228 -101 186 -76 -127 -16 109 -198 -177 -101 -186 2 -9 180 21 -247 -261 -61
5384 -61 -503 -302 211 -56 117 22 -16 15 -182 -1 -354 -112 -211 -225 -30 140 8 132 -253 177 48 73
5406 73 344 -43 -12 -219 212 -54 -81 -86 -170 46 98 37 193 62 -134 -65 8 213 -152 -90 23 -64 -29 41 -36
5431 -36 89 -52 313 -188 -69 -176 137 186 331 74 139 -241 288 129 -23 63 -18 161 -181 -83 208 -23
5453 -23 170 169 144 128 19 -271 57 66 114 5 69 -74 -98 24 137 48 -41 31 183 111 29 227 -17 155 274
5478 274 -27 52 145 4 76 -108 38 224 2 -70 -90 -169 -253 -22 -215 280 7 -205 50 -270 -4 -250
5500 -250 1 -62 23 17 196 347 41 -38 -291 -48 -90 70 194 -172 -304 -146 -13 -178 -186 122 -73 -263 -130
5523 -130 11 -98 -97 -106 -211 -515 252 132 244 -36 225 146 -355 -210 71 200 113 -168 -229 4 -164 -331
5545 -331 179 102 94 -7 118 304 217 190 8 10 145 -50 125 -222 -428 147 29 -66 76 157 386 -56 -147
5568 -147 118 31 132 244 123 41 -29 245 -58 -54 -67 -147 164 -116 294 350 162 31 -104 86 -9 -173 185
5591 185 224 -44 -102 242 171 296 44 93 -245 -181 67 116 11 234 -265 296 -151 152 12 70 -136 -345
5613 -345 161 -240 -26 -220 24 -9 -163 -233 17 117 186 -363 18 -64 -94 91 -268 147 -16 -202 -65 -194
5635 -194 -320 -102 22 -2 54 -103 106 -5 -260 -247 303 167 36 -54 -620 -21 -45 4 109 -50 -148 -128 336
5658 336 -51 -83 -135 311 -282 -158 -49 94 86 147 -187 19 132 -21 -153 5 -170 -163 336 87 153 -190 142
5681 142 30 25 140 -93 6 -7 31 -129 -131 277 105 -80 107 -141 -175 -87 -86 292 -48 -109 63 113 -34 58 61
5706 61 -252 -7 -202 10 106 25 116 -34 -103 188 131 -269 57 65 -19 85 106 -286 -203 12 82 -45 -12 130
5730 130 109 -5 229 -172 20 -176 -110 -47 -130 -50 -112 200 -312 -37 -199 80 -75 135 -75 -305 -75 -62
5752 -62 109 -159 -222 19 174 -222 102 -72 -220 -52 -69 55 140 96 -325 -574 89 -105 78 102 -219 198
5774 198 -90 164 8 -134 -173 -399 5 136 -49 -328 369 72 -503 40 146 5 57 6 -116 54 26
5795 26 205 222 -161 -202 54 258 -20 56 -69 -73 -58 51 317 -120 212 72 -136 52 -161 -62 199 -121 59
5818 59 124 41 139 -56 211 29 -12 126 68 83 147 202 55 -63 -276 -229 21 57 -37 48 -111 -95 -41 169 72
5843 72 -43 284 -251 61 46 -34 109 82 53 235 185 -172 -92 10 -66 145 -28 -114 51 78 -186 11 17 -78
5867 -78 271 187 -268 138 -57 63 55 -38 -222 -34 274 216 -199 2 -39 -162 -66 172 36 44 -8 -30 -280 58
5891 58 261 -176 -71 -12 -104 -135 -188 -62 -358 107 26 -189 -38 6 155 -62 409 114 -59 -265 -199 124 7
5914 7 -244 100 -335 60 -103 18 145 -38 82 262 -407 53 195 146 -55 -235 271 -59 27 -65 -223 46
5936 46 -120 -103 6 -50 332 191 154 248 -12 -19 68 -142 -59 -30 -26 95 275 -49 -61 -27 -85 93 -192 -47 -40 -137
5962 -137 64 281 -160 -5 -4 178 303 91 50 -366 -177 200 -65 -2 101 -80 -167 26 132 -172 -86 213
5984 213 -158 -38 73 294 108 201 106 -216 98 60 26 92 -381 -82 71 53 -179 -148 102 -366 20 129
6006 129 139 -166 -156 -67 36 197 105 74 -92 86 -79 -172 -38 -152 -158 153 327 137 107 299 -165 -20 -42
6029 -42 -135 -100 65 -61 -4 -25 -407 -1 -53 118 -68 127 116 -76 -131 14 55 -196 79 -178 84 16 34 342
6053 342 -162 211 192 220 -144 221 -75 -221 -19 -3 317 124 -52 148 198 -201 119 -51 -68 -161 93 -213
6075 -213 12 89 -92 89 187 -38 163 58 -45 37 -98 -122 198 -15 -48 85 204 182 136 -23 -26 -81 44
6098 44 396 77 70 148 -119 97 212 55 53 -294 158 -144 223 -31 -333 -230 -32 236 35 -295 -25 107
6120 107 38 18 213 -167 -75 210 -307 -20 6 25 -143 5 52 7 -5 -5 21 15 72 -228 -62 82 -36 119 -208
6145 -208 -217 -332 -298 222 -255 -236 -40 -150 -142 -4 -326 14 -147 -49 -35 -62 158 87 -14 -361 -60 147 -100
6168 -100 66 33 179 -247 -58 136 390 -25 117 -185 19 -34 -48 79 -12 178 -152 -7 111 -133 104
6189 104 -19 91 129 173 -400 120 175 -68 225 84 -185 253 174 -273 186 -60 20 -79 -150 -208 235 -123 242
6212 242 -142 -240 -240 66 -79 -38 -185 -209 198 -59 -145 -58 -102 -31 -66 -204 11 -201 212 -6 -175 -134 -36 317
6236 317 109 43 88 118 57 -102 168 -14 163 -157 -2 99 -228 91 -14 232 -131 105 -19 -87 35 -262
6258 -262 143 -82 -214 -275 -59 59 -128 73 -63 55 -62 -8 144 102 158 49 -272 213 127 -40 229 -205
6280 -205 -222 -83 -25 75 159 -316 -25 28 193 -61 -47 42 -133 219 41 40 123 -59 16 -127 144 -269 218
6303 218 105 274 -270 101 -90 2 -62 97 -102 -42 91 -71 47 159 219 128 -125 -146 -252 232 -97 -52
6325 -52 225 -105 39 179 -16 -139 165 129 -210 -40 275 130 -99 34 358 82 186 216 -329 8 187
6346 187 10 -302 91 -25 -149 97 -115 -91 149 30 232 -203 -144 70 -202 -13 50 -212 -16 45 54 115
6368 115 -39 32 122 224 -81 209 -109 -50 -62 -120 23 169 -382 101 163 -9 -161 -10 72 -43 42 134 227
6391 227 -142 -156 -149 -295 301 17 -158 -26 -303 -407 10 47 67 -67 -124 362 -320 -120 99 57 -91 84
6413 84 173 -142 63 -160 179 -127 -232 -12 216 -21 198 -79 -69 75 -179 129 -3 -33 -113 -99 -7 154
6435 154 127 115 210 218 -109 72 214 -25 -43 68 -68 210 116 29 178 -253 286 -245 -44 -146 -276 -154 -62
6458 -62 22 1 -49 -142 238 -130 148 -123 -123 170 305 -70 107 -132 -71 187 -37 -105 128 -42 -103 -25 -118 -113 -109
6483 -109 103 -49 191 317 -1 -348 17 -159 44 -61 -164 -100 -31 -104 28 36 258 199 223 156 -92 -45 60
6506 60 -114 -268 -41 175 -181 -131 -30 -286 -67 -198 335 23 -34 -198 -131 36 -72 -95 -73 -172 76 -2 -294
6529 -294 78 -110 -118 178 113 93 216 157 53 -38 -46 -83 101 -234 -20 -166 -195 139 64 28 -95 56 55 68 -24
6554 -24 -180 -48 64 -141 -135 381 -217 60 -138 357 -124 42 -201 40 94 -41 -86 392 124 -179 -50 90
6576 90 161 107 151 -178 12 128 80 -150 -49 80 -311 171 153 -148 191 241 -54 100 249 235 -16 121 -134
6599 -134 122 166 -329 102 -172 -184 126 -151 180 25 -124 -27 -6 -292 -50 58 13 49 -282 -99 77 -467
6621 -467 41 146 -33 -121 14 -98 25 225 -22 -93 -103 -76 -308 -143 -86 119 -154 72 -27 13 34 49 166
6644 166 -475 9 116 -35 -21 -87 -88 12 -53 -128 94 -115 -171 159 175 24 -63 -140 -113 73 158 63 -19 76 -11
6669 -11 255 213 36 312 -335 211 38 153 51 12 220 287 -82 389 32 -11 22 -144 281 50 101 -238
6691 -238 111 -133 76 -126 99 -171 -240 142 89 168 -43 -82 58 133 -29 141 37 -51 154 -167 -10 215
6713 215 124 -109 -35 372 -175 125 135 10 16 -145 -231 -132 57 -36 9 269 167 93 -223 165 -66 170 -35
6736 -35 25 -256 -105 -232 276 -26 -76 -27 306 -168 -262 31 4 23 40 -5 22 107 6 -80 319 -64 -21 69 -165
6761 -165 -170 -97 90 -69 37 -24 -225 236 -414 -304 -188 -35 -347 -72 -89 -307 206 17 -232 -99 8 -25
6783 -25 162 195 105 -155 -265 -225 83 -127 176 -128 62 193 -190 1 132 -42 168 111 163 52 166 60
6805 60 -36 51 235 103 -314 57 -158 83 222 27 64 57 68 178 284 20 -100 10 45 -155 -132 59 35
6828 35 376 1 -16 162 105 56 90 11 -18 66 234 9 -226 13 105 -28 161 -53 131 161 -22 3 21 107
6852 107 77 478 -253 119 153 54 219 -18 87 66 204 76 100 -41 171 -9 -156 -24 219 -205 0 33
6874 33 -206 2 -131 -96 129 -160 87 -173 151 -69 -414 -54 -220 145 -9 26 -67 -96 -378 320 73 -213
6896 -213 27 0 -36 187 -149 80 -24 -303 -157 6 89 140 89 -199 -102 -177 52 -7 181 62 39 -93 -100 221
6920 221 89 -28 -88 72 61 176 -53 -148 -156 -221 -84 113 126 -84 -96 89 109 -171 -82 -162 0 54 119 147 -63
6945 -63 -4 -80 -62 -61 222 -24 59 19 -176 215 106 191 -109 396 79 303 -45 26 158 222 143 -76 -26 184
6969 184 331 108 123 -307 32 -85 105 224 127 154 -187 -41 -11 -111 21 -78 166 1 281 -21 4 -158
6991 -158 -219 -59 89 87 -325 153 -185 -69 34 147 -222 -147 -112 170 -200 -8 75 -52 -230 -166 67 165 -181
7014 -181 -91 -1 150 -149 -202 127 -21 26 57 -21 -210 -134 -30 157 -66 282 48 -264 -213 -71 -178 92 24
7037 24 95 -203 -8 -233 -144 -78 -76 -120 98 26 -67 -25 -290 244 61 51 -194 28 117 -180 -123 -60 43 106 259
7062 259 -73 -142 -30 9 -179 35 3 56 269 -22 204 115 254 -24 -129 41 103 216 160 -112 41 -42 479
7085 479 24 -222 -4 43 -31 191 122 -87 191 128 60 280 294 -222 262 -103 149 -98 294 304 43 -323
7107 -323 -35 294 281 209 95 -342 -99 -141 251 267 -34 33 339 59 -42 56 33 60 -209 -121 -170 -5 192
7130 192 238 -1 32 -68 42 177 76 -101 -273 -126 -160 224 -56 111 2 197 -48 52 108 2 31 49
7152 49 15 -82 15 -21 -294 68 169 18 -30 -159 2 213 -53 -291 -35 -35 -379 295 -82 3 -198 -26 -133
7175 -133 55 -34 -15 -286 -191 33 -3 46 -132 -205 -51 -97 43 177 -100 -186 -91 -131 -24 -202 -103 154 -78 117
7199 117 -297 135 18 123 115 215 33 75 325 -104 331 44 69 82 -137 107 -161 -88 -74 290 -83 -137 72
7222 72 149 8 -60 86 280 -62 -32 95 -76 -8 -6 36 -81 -161 74 70 5 63 -3 51 -216 -350 -328 -190 390
7247 390 -90 -101 74 -127 312 194 110 11 -91 -159 -65 -36 -204 -69 -265 174 86 116 208 -59 -110 -299 52
7270 52 198 -242 -219 0 -103 80 127 348 88 -75 225 -11 -19 -144 168 11 100 -3 -456 79 -34 98
7292 98 135 -231 -388 125 -198 -166 -233 -104 152 -71 144 73 -42 -279 82 -230 -67 -68 -91 25 261 -1 17
7315 17 -119 -1 243 184 -27 158 -235 -211 89 194 10 -19 15 -52 252 287 280 104 242 -8 0 -140 -7 50
7339 50 164 71 -233 -197 -86 70 15 75 105 -108 -4 34 -209 39 128 -171 171 326 103 70 -58 167 -229
7362 -229 47 93 -146 68 70 130 165 130 68 245 283 108 63 23 9 202 -192 -26 37 272 222 29 26 -1 218
7387 218 -158 312 -328 -253 -349 -134 57 -68 -93 231 -96 -18 94 -72 13 125 -61 -151 -190 -200 -218 -216 -72 -172
7411 -172 -2 -131 105 36 -114 -143 -113 -3 203 -213 -87 -161 75 92 -111 255 72 -120 43 134 226 -159
7433 -159 106 -51 71 -163 -83 -46 -210 -126 -145 -118 -3 -65 241 169 -136 -364 76 194 -80 -42 -118 196 -71
7456 -71 125 -23 -25 -12 -164 -27 -27 143 -16 -188 12 -10 167 -65 41 -16 -17 144 -10 -49 -44 -231 -74 185
7480 185 -3 -319 81 -8 26 134 137 25 -117 309 24 -190 91 29 18 110 -181 -98 216 -193 304 70 154
7503 154 88 -83 194 -139 -46 364 52 5 179 144 -58 -77 162 260 84 150 -238 38 -236 -262 59 -19 142
7526 142 47 -350 -401 -1 14 -144 26 52 183 88 35 -268 -110 115 -213 -36 -259 233 161 -167 35 59 199
7549 199 -122 -531 45 -270 -122 -4 63 58 -127 76 41 -29 16 -68 -297 -35 214 -243 -196 -310 -158 -186 35
7572 35 139 18 -58 65 -146 -120 21 20 131 -159 -122 141 -42 -118 304 106 297 -99 340 13 306 -62
7594 -62 -206 -303 89 16 161 274 -126 -178 -48 -150 15 -185 149 -66 -122 101 -106 -48 4 -194 268 201 62
7617 62 135 -59 -57 14 101 7 64 -3 -6 -9 -140 31 42 184 -126 -26 93 60 115 -267 328 -58 -199 -37 -26 18
7643 18 -23 -48 23 -95 -119 -107 -97 -18 174 -53 -190 97 79 -74 -83 104 -84 -95 -132 -64 -215 -131 -81 -178 -198 -59
7669 -59 139 -182 207 16 -225 59 -17 -130 67 -140 41 77 -229 -307 -66 92 288 154 -139 -13 -317
7690 -317 224 84 59 -111 177 17 208 159 195 -42 -211 -99 -175 -45 241 -1 -111 -115 61 -69 260 -169
7712 -169 182 -133 -73 -26 52 -212 -181 99 141 168 143 53 202 -40 -95 -134 287 23 167 81 -131 163 121 177
7736 177 153 -76 53 171 -4 70 -42 -255 260 -134 322 403 -41 60 63 -291 -11 63 78 19 -209 -89 13
7759 13 127 11 -77 174 -174 76 184 34 334 -113 -236 -154 199 27 -60 -32 224 -100 -238 -97 -314 201
7781 201 -143 -9 120 46 -111 102 268 -127 -43 -9 19 83 -68 -124 229 95 -74 148 -18 232 -44 70
7803 70 202 3 117 94 -57 44 74 -301 -92 -39 85 -50 -76 112 -150 -364 263 94 258 -22 -178 6
7825 6 -26 81 -38 -1 -291 -160 94 -149 7 148 5 207 -125 -130 125 -307 271 -61 -15 56 -31 -167 -286
7848 -286 -131 -151 137 -40 149 -272 -163 41 -173 -217 247 218 -155 171 -61 268 398 -60 -188 -256 110
7869 110 159 209 100 -22 150 297 -73 0 146 -238 12 188 18 -133 250 -147 -164 -2 225 -97 60
7890 60 144 -122 47 4 313 -211 -129 -110 113 -82 -22 76 116 84 86 8 -76 -83 15 -177 223 -265 109 -36 -90 -372
7916 -372 -3 201 -141 -220 129 21 143 -31 -185 -18 -128 -76 38 -59 18 127 155 104 61 -92 165 138 -152
7939 -152 40 223 7 -245 -105 148 -113 -452 -19 10 -13 -130 145 -50 -182 -254 -122 -64 158 129 225 -289
7961 -289 -47 -109 208 199 21 -287 -17 119 46 186 30 -113 -153 -161 129 275 165 6 -37 -142 73 92 -7
7984 -7 73 -122 366 83 32 43 -53 107 -149 -7 212 313 11 32 -76 -36 89 166 -166 40 134 451 302
8007 302 252 -307 -263 56 -236 126 -137 -60 266 6 -321 7 180 -49 132 128 87 42 99 326 5 62 -21
8030 -21 -161 -210 -87 2 314 68 -49 304 25 -39 -136 -228 -300 -173 -174 -104 -50 -272 -129 0 83 -193 -24 165
8054 165 -33 -59 167 3 -293 -53 -35 -39 175 -22 -51 -66 -151 -25 -60 131 14 -120 -13 -213 -42 58 -172
8077 -172 3 -116 117 215 86 2 -49 224 172 126 -83 161 99 -246 -289 148 -160 11 -217 -155 34 -122 254
8100 254 86 155 -79 -19 -79 209 305 164 60 -34 222 274 159 113 241 18 -87 20 -72 49 343 103 -135
8123 -135 216 229 -77 38 -388 -159 49 -164 78 -59 -327 -148 -193 123 -49 57 14 -60 39 -77 224 40
8145 40 108 157 168 -18 4 19 7 -213 -47 -35 -183 -58 132 -26 168 -45 -204 -300 -101 31 185 -32 -131
8168 -131 -159 10 -25 52 -121 1 -107 33 -102 111 178 73 -12 -364 -116 -264 56 161 -346 -106 86 165
8190 165 -65
8191f5
$$ Imaginary data points
##PAGE= N=2
##DATA TABLE= (X++(I..I)), XYDATA
0 0 0 0 0 0 0 0 0 -7 8 -8 8 -8 16 -16 16 -24 24 -32 40 -46 52 -60 72 -80 93 -104 120 -137 156 -175 197
31 197 -221 249 -277 310 -347 384 -427 473 -525 582 -642 713 -790 875 -969 1079 -1202 1344
49 1344 -1510 1705 -1941 2232 -2600 3084 -3749 4735 -6334 9385 -17289 79992 153663 -44201
63 -44201 -75999 32874 79774 -13050 -19790 63873 67879 -41264 -55843 41843 79877 1638
75 1638 -27252 28948 42177 -18247 -12750 59608 55395 -36360 -52115 30160 58018 -11190 -41033
88 -41033 12805 35495 -15333 -33949 14268 32978 -11551 -24994 19522 31021 -16823 -30715
100 -30715 13362 25083 -18975 -28724 20957 38265 -13735 -46891 -8258 34992 21544 -9858
112 -9858 -7825 7445 608 -9680 1657 13881 4056 -7903 -4470 -1711 -7188 -4269 10669 10312
126 10312 -13322 -24892 -1537 24827 11669 -25057 -28033 8246 23760 -9663 -37137 -12312
138 -12312 22988 10123 -25295 -22675 5878 4452 -20505 -12439 20716 15852 -23714 -30807 2282
151 2282 11719 -8274 -3370 19470 140 -42097 -28074 30528 37936 -14325 -35089 694 16192
164 16192 -12421 -15704 20989 23014 -23282 -36146 4800 21662 -5266 -9116 16230 237 -43580
177 -43580 -24452 42810 42458 -29992 -51306 8981 36789 -10370 -31269 15545 33653 -18725
189 -18725 -42184 9838 43086 2460 -30022 -2049 20228 -1452 -7141 23314 20359 -26705
201 -26705 -28581 30861 49407 -7377 -39841 4138 35871 1768 -20786 14647 32375 -11010
213 -11010 -35939 5507 38033 8372 -21790 -5595 9117 -11348 -15607 19209 27398 -19676
225 -19676 -45121 -3396 32544 3752 -31285 -11856 15349 -4213 -29111 -9593 17104 3007
237 3007 -22299 -15370 3501 -802 -11341 -2309 5280 -9551 -18242 2307 17178 -4628 -26330
250 -26330 -6525 23752 12679 -19163 -18624 9199 17299 -2519 -11146 4450 12905 -2487 -14258
263 -14258 -768 16727 11687 -4090 -7941 -3204 -254 4633 14137 10676 -9637 -20182 -1499
276 -1499 21721 14155 -10249 -11314 6649 7468 -9052 -5116 17261 15570 -12992 -21219 4438 22252
290 22252 8573 -6834 -3820 560 -3242 4130 20226 11859 -16582 -17750 16035 28027 -641
303 -641 -16575 5852 19269 -3182 -14005 12749 28596 1521 -23609 -5659 21781 16322 -2029
316 -2029 -776 3192 -6809 -5601 18917 23454 -7756 -23333 2892 22561 2479 -13473 6284
329 6284 20121 -4313 -24302 783 29115 13931 -16591 -12808 8497 7529 -1359 7419 12380
342 12380 -8243 -18650 6799 26262 4785 -19155 -4078 18479 5858 -14655 -784 21947
354 21947 7759 -21148 -13128 18738 19895 -7257 -15319 -292 5414 -514 3079 7932 -4872
367 -4872 -18273 -4333 16623 9156 -14314 -14695 4861 7293 -9548 -10347 7066 8340 -12870 -19994
381 -19994 -478 13844 3010 -11843 -12248 -4546 -595 2310 3351 -3409 -13885 -10865 4011 8775
395 8775 -4243 -12316 -2858 3588 -5442 -11346 859 10721 -1056 -17917 -13376 6155 12632 -938
409 -938 -12685 -10414 -3120 520 3803 3809 -5753 -14440 -7136 6477 5862 -5622 -7035 78 -1339 -10073
425 -10073 -5635 10484 10757 -10349 -21762 -4094 15089 10217 -7334 -11288 -4960 -273 3476 7168
439 7168 2119 -8992 -9730 2384 8566 1389 -4551 1723 3588 -6578 -9532 6774 17246 1685
453 1685 -17110 -9606 10091 13256 1506 -4532 -3238 -2700 85 7959 9545 -1519 -9024 -619
467 -619 9351 3939 -3280 3041 10425 -414 -12078 -850 18458 14265 -7175 -13124 2292 14254
481 14254 9063 666 -604 24 82 4762 10671 7150 -2389 -2694 5313 6199 1235 3248 9123 4876
497 4876 -6865 -6167 9116 17207 5003 -9992 -8057 5067 10522 5164 -1031 -3695 -3467 251
511 251 4634 3654 -1717 -3012 -347 -1799 -4809 -1311 6421 4672 -7922 -14336 -3213 9904 6507
526 6507 -7370 -11874 -4680 1567 1779 442 -2462 -6635 -7113 -1118 2886 -670 -4022 -2227 -1168
541 -1168 -5471 -7142 2147 10330 749 -14190 -11378 6067 12763 1055 -9438 -6700 909 3555
555 3555 2995 2250 -159 -3813 -2641 2373 4597 2123 1295 1841 -1769 -5451 1040 11624 9045 -5163
571 -5163 -11483 -395 11334 9754 -278 -5822 -2592 2631 5369 5063 2428 -1472 -1470 1194 2090 1651
587 1651 4266 5710 -796 -7499 -2922 8853 11451 1012 -8901 -6280 4632 9332 4341 -2391
601 -2391 -4413 -1724 2403 4746 3063 -514 -1300 72 -962 -1277 3327 6798 2516 -5854 -7408 1705
617 1705 9981 6695 -4693 -9196 -2768 6050 6516 -5 -4949 -4438 -319 1622 563 -246 -297 -1383
633 -1383 -4091 -4406 -460 3565 2776 -4373 -9786 -6790 3052 7049 -1237 -10394 -9782 -1092 3874 242
649 242 -5483 -6529 -4004 -3329 -3749 -2030 -663 -2603 -5791 -7494 -5461 -727 3219 204 -8794 -12548
665 -12548 -3908 6027 4767 -5769 -10654 -5095 1835 1762 -1234 -1143 -1345 -3643 -3919 -137 3271 3002
681 3002 462 -2944 -5387 -1890 7296 10657 1484 -9356 -6676 6377 11887 4430 -3196 -2145 1586
696 1586 3023 4183 6100 4472 -50 -1378 1347 4175 5837 6734 3570 -3174 -4670 4357 13092
711 13092 8121 -4133 -6909 2566 9602 6485 714 49 892 504 2463 5179 3788 749 -100 961
727 961 146 1203 5364 6274 -358 -7282 -2615 8138 9018 -701 -6836 -2113 3601 4015 1551 -106
743 -106 -1177 -1692 168 2053 1583 152 411 -322 -3162 -2957 3213 6955 1020 -8553 -7079 3418
759 3418 8276 1724 -6185 -6401 -1790 2355 3284 302 -3822 -4796 -2407 59 456 772 -173 -2284 -5913
776 -5913 -5395 750 5972 2051 -6780 -9529 -3333 4453 5171 -866 -7025 -6550 -880 3148 1618 -1803
792 -1803 -2875 -2662 -2406 -2022 289 2453 1425 -3326 -6920 -3642 3266 6162 1347 -5795 -7237 -1131
808 -1131 6027 5177 -2062 -4701 -1462 1604 987 953 2731 2238 -1847 -4116 -830 5200 6444 1650
824 1650 -3916 -4777 -411 6080 7918 1805 -6517 -4538 3926 7017 2546 -998 303 1087 -766 140
840 140 3763 4935 928 -3190 -2165 1501 3709 3904 1520 -2972 -4930 782 7148 4055 -4138 -5224
856 -5224 1407 4618 1029 -2190 -868 1289 80 -1501 -33 1945 474 -1628 -1695 -1038 41 2729
872 2729 2334 -2865 -6495 -1670 5772 4913 -3295 -6515 -1951 3142 2170 -810 -1036 79 -1595 -2589
888 -2589 -244 2382 1619 -880 -2993 -3915 -1096 3702 4669 -1034 -6902 -5063 2303 5783 1391 -4131
904 -4131 -4638 -1193 999 1241 705 -378 -2299 -2942 -1476 557 2227 2058 -1199 -5608 -4218 1727
920 1727 6376 3283 -4253 -7284 -2740 4137 5609 960 -3399 -3970 -1142 1418 1922 1482 1204 -1170
936 -1170 -3715 -3699 1526 6463 3794 -3380 -6561 -2291 4065 5422 1961 -3116 -4516 -836 2634 3161
952 3161 809 -710 -845 -435 -1075 -161 3096 3785 -1101 -4509 -2101 3269 4589 1159 -2049 -2297 19
969 19 3107 3473 782 -2339 -1744 2042 3707 1108 -1267 427 2070 32 -1019 1953 4271 1411
985 1411 -2964 -2443 1782 4456 2904 -785 -2769 -1566 2382 4865 2582 -2671 -3507 710 3602 1220
1001 1220 -1243 -28 1157 -715 -1926 728 2985 1912 -2053 -3394 -690 3172 3253 314 -3135
1016 -3135 -3478 575 3984 3247 -1531 -4268 -1411 1962 1830 484 -245 -545 -1544 -2282 -686 2574 2862
1033 2862 -437 -4471 -4038 -243 3611 3498 -1151 -5741 -4383 975 3727 1458 -2116 -3100 -2544 -1665
1049 -1665 -233 1213 1498 -675 -3955 -4719 -1501 3107 3646 -726 -5821 -5599 383 4569 2574 -2584
1065 -2584 -4370 -2379 320 1432 1004 -278 -1666 -2032 -1241 17 1760 2179 -301 -3370 -3225 829
1081 829 4427 2947 -2477 -4610 -974 3494 3425 120 -1555 -1206 -132 1246 1612 1004 234 -318 -449
1098 -449 -585 741 2479 2734 -334 -3038 -1466 3703 4858 1217 -2408 -1129 1914 2671 1683 636
1114 636 -356 130 868 1669 1684 1175 995 298 -118 175 1914 3326 1496 -2129 -2205 2045 4896 2601
1132 2601 -1509 -2965 -536 2769 3592 1010 -1888 -1915 -619 886 1353 706 28 -1267 -2089 -1857 534
1149 534 3404 1352 -2940 -4452 -2021 2323 3673 -214 -3848 -3679 -540 2150 944 -990 -2234
1164 -2234 -1878 -1278 -770 -58 1187 -48 -2375 -3753 -1758 1170 2572 102 -3539 -4303 -1286 2272
1180 2272 2147 -1128 -3679 -2438 -92 724 133 -480 -1044 -1652 -2080 -1069 1083 2115 -294 -2618 -3314
1197 -3314 -801 1999 2946 -86 -3560 -3258 854 3325 1421 -1660 -1851 73 622 592 583 1527 765 -1345
1215 -1345 -1315 1100 2503 2237 486 -1508 -1455 1460 4013 2828 -911 -2423 224 3436 2759 446
1231 446 -624 707 1263 768 992 2377 2070 -391 -1348 204 2010 2794 1529 -906 -2085 -89 2608
1248 2608 3016 626 -2230 -1854 1198 2512 1224 -771 -770 -82 -425 99 1151 1454 627 -1312 -1864 -78
1266 -78 2050 2259 -301 -2387 -2246 569 2701 1733 -1641 -3191 -1274 1081 1043 -121 -1133 -985 -1212
1283 -1212 -1463 -507 1027 1355 -1263 -2805 -2218 511 1852 1068 -1664 -3644 -2520 1054 2023 61
1299 61 -2495 -2426 -771 523 -79 -580 -750 -439 -1721 -1684 374 2082 762 -1951 -2531 -785 1506 2109
1317 2109 324 -2143 -2188 -690 1866 2038 -545 -1964 -1434 743 591 170 639 1064 -629 -2051 -501
1334 -501 2006 2591 198 -2013 -1859 831 2568 2360 91 -1744 -1289 1004 2588 1333 -340 -458
1350 -458 319 499 532 1223 2010 1087 -1200 -1072 1070 2795 2157 -449 -1488 -333 1693 2528 1814 -766
1368 -766 -1469 -68 1669 2024 357 -617 -288 -10 81 525 1602 1130 -435 -2327 -645 1952 2332 438
1386 438 -1982 -2098 -612 1536 1846 221 -1682 -1766 -560 775 526 145 -575 -684 -1366 -824 281 1922
1404 1922 129 -2009 -2505 -646 1763 1252 -825 -2169 -1697 275 1368 782 -628 -1961 -1120 384
1420 384 618 270 -163 -197 -801 -1547 -625 1250 1652 -819 -2903 -1976 996 2031 315 -1821 -1821 -1015 647
1439 647 1224 867 -829 -1500 -565 255 328 204 447 -359 -1419 -1228 672 2274 887 -1443 -2137 -94
1457 -94 1609 1524 274 -1110 -934 84 913 1404 256 -680 -486 -365 426 644 935 519 -765 -1503 -330
1476 -330 2049 2383 -114 -1812 -1091 836 1838 1178 -462 -914 -708 556 1145 1110 490 -280 -326 -199
1494 -199 176 1054 1581 338 -1230 -1481 370 2328 1518 -739 -1998 -375 1156 1477 437 -473 -773
1511 -773 -268 61 990 825 80 -375 -551 -395 259 1180 1125 -754 -1785 -979 1035 1847 290 -1885 -1353
1530 -1353 -16 1138 597 -95 -485 -1035 -513 77 223 206 -92 -691 -1051 -939 636 1615 195 -1731
1548 -1731 -1836 -200 1856 1394 -967 -1546 -1033 260 705 433 -91 -847 -1131 -576 213 583 245 -607
1566 -607 -1095 -1438 -174 1003 1358 -575 -1964 -1329 758 1465 564 -996 -1215 -335 244 739 194 186 -202
1585 -202 -605 -308 455 865 487 -315 -1219 -771 493 1714 558 -1034 -1167 -230 1440 1389 -98 -599
1603 -599 -556 109 643 761 675 210 -575 -536 -252 1012 1226 454 -873 -1148 -121 1287 1451 144 -1228
1622 -1228 -620 693 1633 828 -337 -245 -243 198 307 1086 470 186 -456 -616 207 1250 943 -208 -1326
1641 -1326 -888 651 1623 965 -497 -1311 -429 865 1057 382 -553 -248 -196 -244 264 721 212 -257 -1106
1660 -1106 -569 490 1262 441 -533 -1522 -626 826 1414 147 -998 -1097 19 566 531 -142 -321 -558 -1051
1679 -1051 -553 265 833 34 -1095 -1396 -524 432 945 -176 -1241 -1188 -461 971 779 -278 -1342 -753
1697 -753 -216 130 57 -135 -143 -972 -1104 -103 657 658 60 -1051 -1140 191 637 620 -445 -1410 -795 606 781
1718 781 523 -469 -625 -228 195 10 192 498 -132 -482 -403 48 909 820 -426 -801 -469 644 1106 432
1738 432 -525 -563 -49 778 608 144 -375 -100 -19 478 292 571 458 -117 -591 -120 889 1390 279 -904
1758 -904 -594 398 1207 984 42 -559 -275 451 780 877 -35 -729 -320 -199 256 738 698 357 -753 -809 125
1779 125 1229 791 -380 -1643 -541 833 979 680 -523 -1067 -353 189 493 289 -156 -405 -580 -137
1797 -137 35 565 294 -371 -1106 -731 721 992 73 -671 -1219 -599 472 530 185 -512 -834 -224 -199 254
1817 254 486 -32 -405 -696 -471 11 751 541 -602 -1071 -156 808 701 -129 -782 -799 -183 551 732 252
1837 252 -212 -315 168 174 328 347 110 -236 -239 -89 835 893 163 -947 -271 386 670 492 -216 -481 -200 373
1859 373 473 501 -8 117 -470 236 403 203 465 -33 -535 -92 564 934 469 -707 -1009 -116 1139 911
1879 911 170 -257 -261 78 303 502 417 4 -299 -158 194 463 352 -209 -317 -886 15 666 1036 230 -1019
1900 -1019 -655 623 638 416 -467 -850 -357 -341 367 166 111 -605 -794 -535 -27 142 38 -361 -1135 -1233 -23
1921 -23 725 507 -466 -1096 -715 289 427 39 -385 -446 -808 -574 118 360 -47 -462 -491 -362 -42 624 395
1942 395 -327 -891 -568 358 902 -10 -460 -728 2 536 273 190 218 -354 -436 55 440 461 330 -146 -432
1963 -432 -125 564 799 616 -534 -842 -106 848 722 -312 -189 -45 206 382 332 279 45 -317 11 469
1983 469 410 157 -117 -173 -174 453 739 687 -112 -596 -222 459 831 461 -135 -381 219 154 214 767 -160 -507
2005 -507 -254 154 494 498 48 -26 -512 -221 581 968 571 -218 -670 225 708 732 -80 -350 -106 -186 275 474
2027 474 394 174 -423 -462 -195 647 389 125 -716 -485 -90 600 997 31 -685 -497 187 362 267 -155 -195
2048 -195 -363 -318 -27 156 631 33 -878 -350 104 404 152 -161 -434 -385 8 705 504 -183 -613 -197 162
2069 162 350 -295 -41 -242 -472 -359 32 633 217 -439 -480 22 373 461 343 -57 -220 -171 210 741 52
2090 52 -425 -91 181 329 345 218 -16 -285 -425 -68 447 293 -271 -305 -401 180 528 283 106 -436 -659
2111 -659 58 564 352 -230 -320 -202 -201 68 109 195 -138 -246 -195 155 467 221 -88 -607 -195 -99 274 308 -79
2134 -79 -515 -468 443 609 223 -426 -384 -36 35 81 76 388 -162 -642 -226 232 405 -413 -490 -830 -134 75 422
2157 422 -78 -457 -589 -436 278 248 -106 -284 -211 -71 -269 236 -62 -145 -169 -622 56 278 360 2 -342 -357
2179 -357 -71 577 306 -14 -539 -596 27 327 -103 -120 -165 -341 -306 1 177 332 111 -681 -376 69 202
2200 202 40 -146 -728 -401 76 436 139 -245 -352 -189 191 17 91 -69 -132 -192 -219 627 391 281 -339
2221 -339 -710 -101 725 760 327 72 -258 126 457 194 390 -159 34 38 53 44 286 451 233 -243 238 688
2243 688 497 280 -268 18 201 410 619 -85 -290 -407 -89 526 143 39 -304 -23 159 246 275 423 -81
2264 -81 -527 -100 244 320 236 -468 -369 -436 429 403 161 -81 -49 -437 233 144 494 -188 -645 -291 -108 -57 64
2287 64 176 -369 -393 -144 301 260 78 -299 -368 -26 196 243 66 -455 -511 -107 177 379 -252 -219 -173 -474 -104
2310 -104 282 233 -228 -515 -730 61 316 110 -510 -318 -375 -1 188 -116 229 -347 -435 -97 473 301 -6
2331 -6 -110 -297 -96 -115 262 -23 -317 -266 -358 -29 387 -98 -359 -417 -169 34 138 292 -17 -135 -328 -66
2353 -66 105 128 20 -59 34 -69 51 603 331 -351 -300 87 431 603 182 92 123 372 261 424 249 -137
2375 -137 -240 -66 334 195 295 -12 69 139 76 410 461 200 -272 -187 333 701 16 -282 -186 -274 20 51 200
2398 200 366 -412 -342 -247 329 191 418 -18 -540 -362 144 522 83 13 -337 22 319 285 -75 -252 -210 -281
2420 -281 43 -108 162 49 -515 -419 136 74 378 108 -317 -390 -356 204 506 112 -491 -556 -362 180 37 77
2442 77 64 -112 -404 -18 424 94 -131 -170 -27 293 310 299 -50 -359 -315 -128 378 260 -228 -148 -260 319
2464 319 364 447 -85 -130 -524 183 471 363 29 221 -311 -114 136 276 260 -88 -409 -97 671 380 86
2485 86 -93 -336 -15 162 -9 338 149 -45 -126 235 504 317 232 -194 -399 -109 300 339 191 -176 -121 306
2507 306 226 -30 7 -79 -35 4 28 185 18 71 -225 121 310 460 411 31 -313 -213 -156 501 359 -121 -300
2530 -300 -238 240 182 -95 -276 -446 -317 -131 -95 16 84 -271 -345 -321 56 103 112 -307 -532 -279 -31 216 -3
2553 -3 -334 -401 -244 -57 97 -300 -361 -112 -305 -417 248 126 -100 -233 -207 -169 289 454 -12 -223 -328 -64
2575 -64 253 296 -179 -67 -402 -113 -34 36 -42 -236 -304 99 150 265 297 -72 -150 -298 48 294 263 -133 -49 -119
2599 -119 610 363 533 177 32 -248 -77 184 109 409 -95 -192 0 175 232 179 -114 -203 -42 403 347 222
2621 222 -288 -121 -30 228 18 231 133 -64 108 -48 334 237 21 -47 -51 138 352 336 5 -119 -248 132
2643 132 474 421 137 -138 -213 377 124 269 51 -163 -525 137 -76 295 197 42 -508 -108 87 233 51
2664 51 2 -321 -340 22 289 413 -175 -317 -373 -6 126 233 38 -201 -343 -141 -100 384 -117 -132 -252 -43
2686 -43 27 353 -99 -343 -441 -145 46 212 158 -383 -44 -246 30 32 270 -144 -472 -125 -234 354 222 -98
2708 -98 -36 -410 88 218 308 -125 -387 -188 -16 350 302 -92 -328 -287 -205 150 410 194 -147 -155 -155 310 344 296
2732 296 125 -139 -64 73 282 318 -99 -236 -282 -64 379 -28 -8 3 139 -23 218 309 -135 -129 -267 175 179
2755 179 170 314 -221 -323 102 242 440 113 -191 -22 15 -28 502 105 -208 -94 -92 -293 378 96 65 -361
2777 -361 -173 -151 238 201 340 14 -219 32 275 125 45 -302 -237 -29 256 277 248 53 -389 -283 69 -47
2799 -47 420 -305 -512 -251 164 313 96 278 -170 -344 85 199 55 -55 -338 24 -15 -189 23 126 -431
2820 -431 -442 -105 71 62 259 -3 -356 -297 6 198 69 -245 -326 -211 176 132 366 -139 -277 169 -110 142
2842 142 290 -241 -266 -213 50 387 205 135 -24 -289 167 165 319 112 -133 -105 -8 434 655 -98 -148 -128 -33
2865 -33 331 509 29 -58 -3 -5 254 587 403 82 187 -140 -1 236 200 95 -633 -261 377 84 110 138 123
2888 123 15 -217 383 275 147 92 -303 -75 241 336 112 -63 -305 -79 285 500 225 70 -242 -224 -236
2909 -236 263 -2 -13 -76 -36 -10 -102 218 -2 -310 -170 136 214 398 -202 -182 -181 -86 6 240 -85 -167 -386 -205
2933 -205 -3 17 50 -233 -278 -626 -88 276 54 -87 -721 -252 -146 -43 -63 -602 -277 -115 -111 110 136 -158
2955 -158 -319 -178 -54 86 84 83 -190 -75 1 57 -38 126 -247 282 -114 264 241 15 -438 -202 114 419 310
2978 310 -28 -95 -89 -362 86 421 25 84 -110 84 -308 -116 422 399 289 -303 -186 55 54 60 -133 -234 -145
3001 -145 211 315 403 17 -47 430 89 72 291 -171 -324 113 236 232 305 -293 -89 -316 187 344 477 81
3023 81 49 -26 46 252 228 -13 -41 -289 -182 85 104 216 65 -138 -122 138 276 -37 -176 -265 -35 -126 147
3046 147 183 -28 -115 -150 23 -224 -84 -28 -194 -25 -46 -114 419 -105 -233 -93 -46 418 192 158 -454 -54 -217
3069 -217 125 232 -121 -46 37 -178 -21 225 7 -64 -130 -271 -115 87 295 -315 -271 -558 -19 69 80 -348
3091 -348 -143 -361 -92 268 -10 -363 -87 -250 -152 101 342 88 189 -376 -272 124 103 136 -35 -128 -293
3112 -293 262 198 236 -49 -210 -32 103 338 275 94 -163 -225 81 56 312 229 15 -322 308 378 376 182 -68
3135 -68 -181 -61 103 430 114 215 -236 -139 273 198 -57 -86 -84 -202 111 163 335 -24 72 -56 112 380 65
3158 65 -83 -149 -126 114 56 32 277 43 101 289 -25 -27 -243 -351 65 -14 -131 225 96 -275 -19 -630 193
3181 193 189 -81 -44 -336 -85 -11 -42 112 -110 -109 -166 -205 209 460 53 -167 -337 -142 213 313 -208 -274 -374
3204 -374 -230 66 51 105 -201 77 -204 108 196 398 225 -140 -84 112 -15 195 -239 -503 -80 -47 25 171
3226 171 49 -155 -81 -82 126 427 -119 -184 -384 182 -14 254 -9 -160 -320 -350 -106 51 53 -60 11 -152 158
3249 158 62 132 603 -12 -166 7 65 127 99 105 412 -39 201 -111 12 4 -281 71 -114 49 246 127 -433
3272 -433 140 166 377 26 -122 -347 64 343 340 -3 -116 -315 -22 283 44 -76 -102 -217 -46 -203 282
3293 282 309 262 -68 -115 -65 -37 116 234 -168 -113 -103 310 382 411 -168 23 -17 -130 233 34 -154 -325 -283 281
3317 281 242 -28 -185 -523 4 338 264 294 18 -92 -226 194 -15 336 -35 -96 -287 83 328 298 183 -41
3339 -41 -57 79 -271 235 20 -105 -161 128 234 317 248 -320 -198 -177 116 -53 268 35 -196 -45 -334 -107
3361 -107 155 115 -57 -98 263 224 116 -120 -412 -196 31 144 455 198 -149 -258 26 122 445 -99 -127 184
3383 184 -213 -243 -88 383 -218 -361 -45 64 287 245 -17 -260 56 -135 346 241 282 159 -364 -55 86
3404 86 -20 11 -83 -42 -215 276 414 -157 -111 -192 -232 -229 77 -83 -40 -211 21 25 -81 248 -22 -28 -198 -45 36
3429 36 -5 154 170 -56 -9 -160 68 114 -10 -43 -57 69 237 -134 3 -39 35 -84 98 289 -100 -284 59
3452 59 -178 244 185 -519 -76 70 133 -100 133 -9 -133 -315 -77 262 179 24 -234 116 36 102 -163 24
3474 24 -269 -101 -106 131 160 308 116 -320 -281 -65 226 -45 -44 -228 -85 25 420 271 81 76 49 -31 -98 91
3498 91 -186 6 -272 77 269 35 277 -31 184 -107 115 96 89 15 -14 -226 57 190 234 -133 -453 -84
3520 -84 -19 133 -128 107 -141 -9 -146 230 382 -88 -13 -244 100 -23 -133 221 53 -58 -200 43 40 133
3542 133 -133 19 11 224 27 79 18 109 -188 388 137 59 127 -121 29 -76 141 -42 3 103 -184 141 -4
3565 -4 191 40 -523 -32 62 -75 270 20 -127 -68 -21 -66 230 36 -233 -271 -138 130 -110 73 73 -3 215
3588 215 -164 194 32 -55 -138 44 -58 78 143 -4 -504 -7 289 154 163 -155 -244 -265 47 93 304 164 -71
3611 -71 -329 -167 -57 135 -113 94 37 -50 172 43 -53 -34 -166 -232 128 415 25 64 11 -43 280 216 -3
3634 -3 -92 -14 -450 31 335 271 25 221 68 27 273 -89 -58 52 57 -18 -70 361 195 50 -261 -258 251 75
3658 75 17 -33 -147 133 -68 -140 273 -185 -66 78 36 -102 119 194 -109 152 -109 -131 -148 152 -113 -235 -6
3681 -6 -235 -281 102 83 -302 75 -54 67 38 -17 -70 -64 -200 125 239 -112 16 -56 -184 266 119 -109 -162 107
3705 107 -83 -166 202 346 -27 -356 -7 57 -41 255 100 -91 -5 43 -26 113 -116 -306 -51 51 204 -151
3727 -151 -102 -238 -65 -157 91 -116 -286 -46 36 -163 40 38 -130 84 -32 61 214 287 -49 124 -243 -138
3749 -138 249 -30 60 77 -99 -363 -75 60 102 -175 -199 -287 -347 87 226 -100 -14 66 -270 -264 43 1 -12 113
3773 113 -22 58 -75 30 67 -75 99 5 151 114 -74 58 43 -31 -110 77 54 77 -87 141 327 -1 -90
3796 -90 -46 -221 275 -201 -139 160 -297 137 162 -93 240 45 164 -19 -306 -20 202 152 -78 16 -537 -75
3818 -75 -52 128 -64 -131 62 -133 61 155 176 -27 135 26 -110 -22 119 -145 77 1 -426 -80 15 77 46
3841 46 -94 77 46 134 -46 74 168 282 81 222 -60 -309 199 206 71 219 164 84 167 -483 10 149 151 245
3865 245 -135 42 196 154 -111 -190 -213 -310 40 98 238 -5 -215 -223 30 115 192 202 -83 151 111 -16 81 77 -46
3890 -46 -195 -22 317 316 -190 -186 -148 -61 235 244 68 -113 -142 189 71 -21 -132 25 73 9 120 -64 -290 192
3914 192 -161 -38 -107 -177 -208 -261 66 -59 -335 125 -15 76 -145 -167 41 -74 134 -223 62 81 -203 25
3936 25 64 -44 -161 -115 303 -43 -64 -296 -120 35 -60 133 132 170 -241 -285 101 154 -297 160 60 -330 -193
3959 -193 -74 -63 65 -73 -48 -8 -55 46 -98 -107 140 58 -104 233 281 268 -66 61 74 -146 -41 229 -247
3982 -247 6 49 66 210 -32 89 -55 131 23 -50 73 249 79 -53 323 -98 47 1 350 116 152 -113
4004 -113 427 27 131 316 -218 44 -115 38 -188 -160 -184 140 -14 49 13 -263 223 -132 309 -211 -83
4025 -83 -61 -331 -35 53 318 -46 -114 -137 -72 -61 -82 -85 97 -144 -270 236 53 -35 84 51 -229 355 -41 108
4049 108 248 45 164 -320 -295 78 -147 -126 -173 -3 -69 14 32 -178 -131 -175 21 -114 -150 -31 -66 9 -161 319
4073 319 -28 -17 -177 -424 -148 220 35 17 222 -53 -73 -249 9 -25 -294 -220 25 239 127 -190 57 -68
4095 -68 92 19 150 -161 53 70 108 362 224 88 -32 -25 -103 -77 46 183 164 -193 -22 291 62 -26 -58 -301
4119 -301 214 -75 228 -35 -137 -103 131 216 -158 4 -41 110 131 -264 -109 -261 -23 -171 -121 22 -130 206
4141 206 200 -107 -100 -184 -209 57 32 24 58 -135 30 -149 -71 -38 -1 -188 194 307 8 -214 77 67 -88 65 62
4166 62 94 -34 -90 -411 -17 85 10 -63 -7 92 -87 -227 8 202 -271 -45 44 98 130 -57 -119 -90 -208 -2
4190 -2 28 209 -51 -250 -11 -17 -65 -366 -324 -99 318 180 37 186 148 138 74 -158 76 204 -141 134 35 131
4214 131 -129 94 -25 118 29 -202 266 -29 -41 -56 159 173 70 -114 98 240 -88 -64 -174 129 -108 -99
4236 -99 9 -193 150 21 -105 207 231 7 -57 -82 -10 53 61 196 265 31 146 159 -73 -137 232 64 10 256
4260 256 3 248 -13 -82 93 156 -27 51 39 -479 96 -72 103 43 98 209 129 24 -86 16 -122 56
4282 56 16 -37 89 71 164 353 123 -208 -78 -74 -384 -90 146 17 -98 -118 -28 104 -177 -191 137 -57 -185
4305 -185 -245 -265 -59 54 -167 -21 -260 -466 15 -343 246 -303 -285 3 240 163 -378 170 126 -55 -225 67
4327 67 170 -164 -222 14 -233 -149 -178 -21 -127 -105 438 -111 74 185 70 -115 30 -153 130 129 -26 -9 -1
4350 -1 316 43 -58 -366 179 2 -127 249 246 -277 -4 200 28 -157 37 -255 18 0 204 133 4 23
4372 23 -33 -160 63 154 147 -67 123 238 -125 130 -204 58 114 218 -132 146 136 -198 -119 165 -2 247 4
4395 4 539 208 252 128 32 -379 17 296 -20 -52 205 -110 20 -254 221 131 3 -174 -44 110 -122 24
4417 24 101 -101 122 -47 -18 230 8 -84 -44 171 47 -177 -198 -269 -64 -160 -216 -187 -105 140 -206 227 -50 -245
4441 -245 -215 -103 14 46 -233 -46 -113 -93 -185 -161 -76 -93 -42 -102 132 -227 -182 145 38 -4 -150 -150 203 91 162
4466 162 95 -198 91 257 68 121 128 -335 80 62 -37 308 267 129 127 -55 -136 58 148 19 193 54 257 70
4490 70 -300 -177 -115 226 -104 115 -109 -180 31 201 124 84 -62 40 154 18 314 -175 -36 27 -30 12 177
4513 177 73 -10 230 54 77 -67 196 -86 -52 -200 175 322 -71 102 51 -60 -56 -56 214 122 136 121 195 -77
4537 -77 187 -265 54 -34 -213 -24 -64 -97 -225 -179 -91 -187 142 99 -156 -29 -172 226 -42 379 -60 71 27
4560 27 -106 -206 -83 124 66 70 -131 -8 -128 71 46 74 143 -26 -215 -215 9 -116 -13 -118 -165 170 -183
4583 -183 165 -88 -191 -12 -178 180 -21 -64 144 -47 237 -97 32 13 45 -126 265 -250 61 -160 -114
4604 -114 113 -113 -2 57 -252 -98 145 22 -87 -215 -5 225 -194 4 220 -227 -86 208 -58 21 33
4625 33 137 -69 -393 101 38 -291 -252 247 244 108 -74 92 330 173 228 -17 -55 279 6 -65 -138 -246 329
4648 329 102 -91 150 -127 -176 141 222 13 -179 38 410 128 27 -122 108 20 -56 -17 51 86 69 65 -39
4671 -39 -116 -132 -101 224 -228 93 -151 89 -236 95 343 -184 -187 -273 -258 38 -112 -327 -101 -258 60 -36 188
4694 188 -84 -18 -105 -101 3 144 220 -300 -55 311 244 -100 -113 239 -147 -271 128 51 317 122 -21 14 91
4717 91 47 -76 94 -184 -331 -76 -29 -64 -163 -104 -299 105 271 -52 -30 -212 -188 -146 193 107 -8 -29 -52 76
4741 76 -85 53 -23 -134 212 234 -28 -47 126 99 44 7 -81 18 200 -137 243 273 -58 174 331 370 42 -12
4765 -12 90 115 -112 2 135 -182 -23 63 65 170 123 -170 -19 -58 201 -193 188 114 236 -268 214 201 158
4788 158 48 -94 15 179 169 -141 -24 -110 -31 -20 216 -53 329 -109 -84 121 -5 -42 -69 -199 -265 -32 108
4811 108 -111 -462 -108 193 -72 38 390 66 -340 -253 275 -99 -99 41 -78 61 -298 183 38 -110 -433
4832 -433 -132 24 84 -103 -88 -253 -46 -277 271 242 58 -142 -100 32 -200 134 -420 43 -106 -130 -197 -223
4854 -223 -48 64 -2 -108 -215 -187 -178 -180 -385 69 -35 33 172 -39 133 -73 124 361 -60 19 -304 -51 -32
4877 -32 100 176 201 46 170 167 155 57 145 167 -182 -99 202 24 253 -95 -44 167 53 130 64 -197 6 336
4901 336 274 -38 55 139 -81 136 34 253 12 -53 -171 72 -37 -33 25 72 -28 295 -83 10 213 -17 -313
4924 -313 87 71 -153 177 339 -33 -162 -174 -104 178 -422 -68 -325 -149 157 142 21 -93 -316 165 1
4945 1 -254 -360 212 -271 -289 -200 -2 102 -436 -103 -77 -224 -98 -94 37 -27 -48 -255 -70 23 342 68 -111
4968 -111 -2 -206 176 -166 -111 -181 -350 34 -98 -54 -38 30 22 -233 12 228 -123 -240 -262 11 181 -149 51
4991 51 129 66 54 -165 290 283 -121 77 -163 115 -105 193 24 -114 108 199 -2 164 209 -358 126 7 94
5014 94 -79 201 302 196 -12 108 26 90 276 -41 77 115 337 -202 278 -12 285 404 1 135 -69
5035 -69 -235 -262 255 316 137 -171 -89 246 216 204 -4 -80 226 50 250 -40 82 136 -107 88 -168 -91 -229
5058 -229 343 36 -112 -54 -38 19 25 101 -211 41 96 94 318 -44 -44 -57 -40 -226 445 213 289 18 -221 -5 62
5083 62 -47 -45 -253 -121 -164 -102 -114 -119 -316 -239 -1 -84 81 -147 81 -68 -75 192 -32 -96 -40 -199 19 -134 279
5108 279 -82 -42 -14 145 178 132 166 136 -182 -186 217 48 440 -320 -130 -35 -403 -41 192 -155 -142 58 -180
5131 -180 268 97 169 226 -167 -283 -161 85 124 -144 -217 -206 196 -107 -43 -36 83 168 -116 224 11 -4 5 -145
5155 -145 170 189 -124 155 -124 -111 -73 -98 189 92 -75 -199 128 34 439 -55 138 112 -60 -50 79 -134 119
5178 119 119 183 199 75 -197 67 38 -150 152 105 -26 -93 -142 -108 -255 90 8 193 -119 -68 -201 123 110 -94
5202 -94 89 -72 -23 -19 64 88 -89 -202 41 210 2 7 -88 -297 -157 -447 -35 -95 -57 -147 -62 213 -77 -11 -60
5227 -60 1 -19 -60 176 -82 -171 16 -186 -31 -116 -168 -140 -44 -273 -286 -44 111 47 36 -203 -153 -23 174 4
5251 4 -46 -32 -161 106 -15 -177 61 275 90 -341 138 552 33 -26 280 -23 149 333 60 -262 -232 -293
5273 -293 -166 -38 147 -7 -49 -212 154 111 31 26 199 248 166 80 -75 356 41 -86 -15 34 58 -187 195 -132
5297 -132 -367 19 -6 154 83 158 -42 272 -46 -66 142 109 46 -57 284 32 -218 66 -273 15 49 -36 8
5320 8 -45 18 -150 -47 218 -130 23 -157 -149 -219 -22 -21 8 -19 -102 -42 -19 100 33 -331 159 -8 44 213 -147
5345 -147 -83 238 -25 -129 21 -147 -148 146 -284 -182 -183 -316 95 -207 62 107 -23 89 130 -140 4 121
5367 121 284 -14 -415 -330 -15 285 143 186 170 -163 -158 -1 -36 -94 -9 -35 136 -38 214 -243 -157 -73 114 60
5391 60 140 150 123 -162 0 401 102 259 -88 65 68 -66 235 195 127 13 -94 -30 96 243 83 302 -91
5414 -91 256 20 142 211 93 121 160 384 152 114 122 57 11 -62 284 -121 -165 59 162 122 121 16 -19 -205 -202 35
5440 35 -206 90 100 -58 -184 -279 310 -209 -13 -64 -194 -244 -31 -122 21 206 152 180 11 -165 -183 -226 159
5463 159 39 -224 -37 284 -110 -188 -394 -122 -25 178 -99 -258 -56 -36 -169 -242 54 138 -234 -84 -230 128
5485 128 30 -34 100 -43 -350 103 196 -109 82 58 -135 65 70 389 -6 -180 109 -159 61 -309 180 -193
5507 -193 -126 -198 -91 199 -249 255 90 77 5 -99 178 66 -217 -102 -130 -119 164 59 -135 84 38 -8 154
5530 154 111 112 232 52 -97 74 -7 -28 14 -90 289 402 291 68 88 140 168 341 -368 -28 -123 -171 174 182
5554 182 -61 44 -214 -11 -133 212 189 28 214 76 141 313 36 -197 3 179 157 109 240 97 -121
5575 -121 -180 -33 -107 -233 -239 -52 155 122 24 186 -189 -174 -48 -150 -27 9 84 -51 59 247 -218 -151 -152 -120
5599 -120 -44 -113 -346 -112 -137 24 136 -105 92 -231 -114 -104 -30 141 -18 101 -15 -115 -130 -469 204 -123
5621 -123 -57 -31 75 -201 118 289 307 -232 -118 -163 225 134 -26 -143 -252 85 82 -319 -64 88 16 -297 -177
5644 -177 -115 206 332 -68 197 -84 115 -22 43 56 99 -119 184 -66 -51 -128 -184 -258 125 189 -125 228 5
5667 5 -11 -22 393 148 15 9 -64 292 -64 -121 46 488 -39 78 6 147 247 -143 -99 -322 -88 -128 221 241
5691 241 217 25 22 188 45 -143 159 -201 16 -87 149 211 -20 -154 -282 12 157 130 130 -86 32 -25 163
5714 163 7 -37 132 -1 -3 137 34 -15 -168 -287 254 -116 105 -210 -1 -214 -139 8 172 7 -419 -218
5736 -218 26 79 -35 -156 -24 43 -276 4 127 107 -202 -62 -29 -148 116 -41 104 175 -110 -130 68 -80
5758 -80 84 -24 -88 -130 19 6 216 -61 -151 -134 208 71 94 -96 211 37 -144 -153 -7 42 391 -93 177
5781 177 117 98 249 9 -245 172 183 101 80 -25 -228 40 -14 235 223 -113 150 35 47 304 48 -206 93
5804 93 8 171 -142 60 -270 45 190 157 118 -79 -174 -100 -161 258 140 136 191 -20 -118 -76 102 364 100 -42
5828 -42 -181 -34 -32 -90 42 -286 -281 -34 -261 103 290 -66 -28 137 -169 -2 266 -259 -269 -166 63 -42 -97
5851 -97 -29 -537 -108 59 -20 -45 39 -368 19 -20 242 -65 -112 -384 4 72 28 96 -278 15 -221 -91 5 276
5875 276 108 72 -190 -288 70 22 -166 238 -174 -105 -40 -196 -49 -248 36 52 -189 -9 -60 204 66 52 41
5898 41 150 -72 81 72 13 -93 141 -73 54 77 277 -36 -161 251 -23 39 21 94 -99 54 -7 7 -26 -142
5922 -142 227 361 -254 -288 317 -281 67 205 255 -15 -90 -24 204 119 -112 84 122 11 -66 -106 -107 -46 -215 91
5946 91 188 -110 85 132 -281 196 -44 -69 -30 -130 -64 157 216 157 -59 -83 -204 -172 -89 -99 8 -92 -107 109
5970 109 55 208 217 31 -25 -71 74 161 75 49 -131 108 132 -240 81 211 106 -119 1 93 126 38 170 -79
5994 -79 -210 -191 136 -146 80 -532 40 102 -46 -33 309 -83 20 -147 -43 -206 3 164 158 18 233 -49
6016 -49 150 30 157 104 -64 94 101 332 240 198 -123 -135 -39 88 20 340 78 -164 375 231 -87 -359 -90
6039 -90 -47 332 133 -62 -68 127 -36 161 73 -134 59 77 -18 94 91 193 175 14 28 -176 155 -40 -122 60
6063 60 -127 -161 175 27 247 -238 -139 11 -318 16 -92 -40 140 -269 112 247 -39 87 87 -355 62 241
6085 241 57 -32 117 3 -40 98 120 6 198 -43 -156 -9 126 -67 -53 -190 231 -22 5 84 214 -227
6107 -227 208 -244 -297 -37 -92 -109 3 317 -66 -421 -305 166 -34 -32 -32 16 -185 113 -328 -21 -106 137 209
6130 209 -160 39 -168 -181 -90 -16 -201 -88 -64 -206 104 -142 44 -11 -151 33 -22 -68 -98 -300 -206 -211 203 26
6154 26 10 254 291 252 91 -85 80 1 -108 13 75 68 207 -120 44 -196 -174 308 -72 60 -71 8 275
6177 275 81 -76 129 127 9 -132 5 -11 -32 105 329 92 -190 -203 -26 74 18 -352 -115 127 165 36
6199 36 -26 -355 -112 72 -29 58 -3 199 17 -44 -98 -219 -175 112 -255 85 -147 223 17 169 134 64 -47
6222 -47 277 -86 -45 55 150 75 -332 -29 -349 238 316 -267 175 168 302 -24 198 187 -50 -39 -5 -33 101 -291
6246 -291 79 -11 -153 -122 -146 195 34 234 -104 139 171 124 -153 -116 -116 -347 -175 191 173 81 -187 -257 -301 127
6270 127 -80 298 145 31 172 108 251 -17 262 93 19 -128 102 54 331 -194 331 136 346 306 -312
6291 -312 186 171 144 22 108 365 251 195 42 169 47 74 -73 111 110 -241 -204 52 63 60 -76 -6 -2 -16 59
6316 59 8 283 -159 119 126 98 244 21 257 105 -37 181 97 -157 -139 24 33 55 97 -247 -136 -74 218 144
6340 144 -255 189 -164 -114 159 123 4 -70 -243 -147 -87 4 -32 49 -91 494 -132 84 -116 97 72 13 52 -258
6364 -258 -34 38 -198 38 -12 -118 -66 92 -85 84 -107 239 -192 -120 67 -133 -117 258 -12 -27 -15 13 257
6387 257 -219 -75 38 73 -14 55 94 -11 201 -62 -367 115 -370 -214 -10 111 -428 -84 20 270 -6
6408 -6 18 109 171 94 -145 -63 296 306 -30 -246 163 -6 162 -159 -230 15 96 7 209 104 -252 92 58 -251
6432 -251 -188 212 18 201 -30 6 143 -223 -39 -113 245 91 -135 48 46 -21 -60 -82 -47 177 -128 -186 -20
6455 -20 324 169 5 -103 -28 -74 -187 -111 -134 -68 -278 -114 338 -262 -152 -325 -106 -161 4 230 -71 62
6477 62 173 -36 249 -234 278 -325 -150 100 -32 -281 -71 112 -50 68 81 169 -72 3 -47 -208 -43 7
6499 7 -21 -290 -213 82 -71 -79 -186 284 239 -153 84 -154 172 -22 -55 63 75 362 97 -310 -401 106 -125
6522 -125 -84 185 215 279 -193 14 210 -39 112 -85 -99 -235 -27 209 -308 114 -84 197 166 20 -155 -27
6544 -27 -111 192 -103 -88 219 -147 -260 206 359 384 154 -65 163 122 247 -162 -255 66 35 125 -58 8 91
6567 91 -221 86 -67 248 321 28 -113 234 4 -77 -351 136 -175 23 230 -330 -26 -147 62 147 230 157
6589 157 -209 -336 153 -243 -98 -13 17 -299 -120 152 102 100 308 213 61 -122 146 -100 -172 179 -45 -49 18
6612 18 -1 326 -150 -112 98 201 64 27 161 44 -80 4 11 11 -86 -43 -92 -42 -192 -128 -61 121 143 41 175
6637 175 -84 395 -454 128 115 -41 177 -136 15 -324 9 -5 -171 -85 72 -138 65 21 -64 20 94 123 14
6660 14 169 35 277 73 -32 157 119 18 84 102 110 1 242 -115 49 87 -72 -42 -161 195 -79 -44 85
6683 85 130 149 54 -24 -86 30 -95 185 144 7 -42 63 34 97 -55 -81 -177 -14 -63 -63 -32 -9 -3 370 135 113 -103
6710 -103 88 -2 304 176 -21 -124 -90 218 -192 -81 -39 91 -118 -226 -204 -288 148 -127 131 89 18 253
6732 253 -157 -3 -107 200 -2 -54 -186 11 -21 -70 -95 -116 -290 -59 -391 -89 99 171 104 -24 -357 -12
6754 -12 -106 -112 -5 -208 9 -127 -4 38 -58 -6 141 71 -170 261 -56 -93 -222 60 -68 108 314 2 -26
6777 -26 81 49 -235 -391 -59 266 -211 357 -122 392 33 -57 17 -97 -330 176 -90 128 -54 -106 -27 203
6799 203 163 93 -9 23 85 56 175 28 14 58 -96 47 78 21 139 -267 124 171 260 -1 -227 163 -67 -16
6823 -16 167 -310 88 56 241 -102 -404 -1 -352 -78 -33 -139 199 135 -36 -27 -214 12 104 259 -102 -216
6845 -216 0 10 -215 60 127 -41 33 -42 -38 -12 -183 188 -157 112 -170 -188 8 60 -75 -206 -27 178 -218
6868 -218 -224 -239 -341 11 -70 158 -467 -76 -210 -100 178 41 -208 157 -104 -2 -204 -66 -201 -150 -120 41
6890 41 -113 -251 -297 -54 -74 277 28 49 -206 216 27 -58 106 140 134 -116 47 -428 197 -130 7 141 96
6913 96 -141 111 -159 -24 261 52 80 -170 138 140 248 36 -79 101 65 91 271 88 67 36 -3 -25 44 92
6937 92 -50 210 -282 -8 37 -300 -133 -204 203 129 183 192 -74 122 18 154 -273 -104 -67 -39 -146 312 -69
6960 -69 116 42 54 70 -199 -30 73 -19 -60 -47 -165 -209 283 64 -55 102 -130 111 74 -102 -228 -79 -223
6983 -223 -71 245 166 -261 -122 -388 -79 34 -89 -112 -130 -157 -87 -185 -204 -45 209 -163 6 -76 -110 122 -86
7006 -86 -168 -153 -79 -22 59 -37 243 -32 132 19 -29 -77 -41 -49 -12 -128 -103 159 -59 -164 -60 7 -40 -72 -109 139
7032 139 -132 152 119 200 -434 164 -8 36 60 81 -10 96 -108 -9 7 -116 -203 76 157 200 3 -211 -275 452
7056 452 115 201 318 -71 28 118 108 -254 35 258 -49 116 124 176 -75 204 150 186 -391 101 86 365 146
7079 146 -140 -106 37 -237 -2 216 255 -45 77 86 203 135 237 -69 125 375 -23 93 187 106 37 -54 -119
7102 -119 5 -201 -69 -42 39 -164 -198 20 -333 -126 80 247 46 233 57 42 298 245 112 -115 219 209
7124 209 -53 54 84 -312 -98 -80 12 -174 122 -4 -381 109 28 -480 -78 -168 186 -94 4 -280 110 -151
7146 -151 -86 -59 -80 109 -95 -191 -84 -247 109 -67 -100 109 85 49 -170 -17 265 213 236 -159 -13 5 -51 232
7170 232 199 134 144 42 80 95 219 265 29 -6 -67 124 -80 -77 -138 80 -105 267 350 119 -8 243 -132 -357
7194 -357 -4 153 -25 -75 42 -87 182 213 99 182 117 124 17 112 89 -312 -116 -62 117 -154 -43 88 -126
7217 -126 145 -110 -18 89 119 65 237 -45 -260 168 141 120 86 -53 -278 -234 -11 -278 32 -201 158 379
7239 379 97 -82 -100 -376 19 -316 97 -327 -19 30 -206 -80 -92 70 -137 103 -282 -107 150 -48 -176
7260 -176 -28 74 154 -24 -38 155 -348 -251 -239 134 -118 82 26 -48 -135 26 -357 19 -4 -247 3 -97 -199
7283 -199 139 -147 55 160 7 -165 -95 -201 -125 161 -51 172 91 198 -165 84 234 -78 104 -53 -96
7304 -96 22 -42 -262 -38 -129 57 32 265 291 196 -55 147 1 80 35 -243 197 -13 27 59 180 -13 41 169
7328 169 -40 92 213 -175 -15 -110 -63 119 177 130 13 -85 7 -26 -53 -57 -58 -263 94 37 -18 293 -35 204 -124
7353 -124 52 134 124 43 219 -14 -151 -3 -232 -26 -11 -80 146 228 -9 -200 -94 219 -155 -113 15 -93
7375 -93 -182 47 5 50 -75 -4 -49 98 -137 25 162 -220 56 -108 -279 72 -237 -144 -208 -244 -372 -152 -60
7398 -60 293 -103 -55 15 -246 91 195 368 -150 -70 95 -54 -318 -64 113 -267 55 192 148 -27 -60 141
7420 141 312 -32 -236 -18 91 156 10 121 -53 290 43 120 -96 -48 24 58 91 -137 -250 95 20 367
7442 367 -121 -109 76 97 117 -56 126 -2 79 44 167 -81 -74 -63 90 127 66 96 -168 193 47 349 9 -37
7466 -37 198 263 94 215 177 -150 36 152 48 -179 38 103 307 194 330 103 -140 -66 70 -187 176 21
7488 21 110 252 -99 -28 161 42 -235 -19 50 -99 -41 122 -265 129 -35 84 -51 8 -425 -311 -164 -146
7510 -146 -237 253 -177 85 -133 45 -121 166 -7 -204 -321 94 -5 -218 -132 -78 51 -61 450 -26 -171
7531 -171 -85 -80 -169 -151 -92 -110 71 -374 27 -51 -33 -208 -275 108 119 -9 -92 -259 89 -16 16 -60 -42 -14 -294
7556 -294 297 -424 176 -132 124 -152 -64 89 -47 151 103 -48 19 55 8 197 378 239 -22 20 40 56 -182
7579 -182 -59 -151 -84 -75 276 -231 15 203 133 -13 -75 -18 -54 -23 11 157 -29 16 -86 4 97 201 87 194
7603 194 -1 87 -238 206 90 68 -6 25 228 305 -296 -133 59 -226 -198 -160 111 -353 -51 45 -164 -187 -551
7626 -551 -63 -120 -60 -119 189 132 -67 -38 279 -149 -142 -97 -54 91 68 63 -8 -182 -100 48 37 -135 108 -270 -143
7651 -143 -117 92 269 -47 -22 -129 -260 -94 -75 -333 7 -183 130 -381 61 142 -157 101 -36 144 -5
7672 -5 8 99 -24 101 -71 244 212 -110 27 113 37 -159 458 -69 -90 -67 -19 99 92 41 -242 -150 137 40 -80
7697 -80 -59 -72 266 114 113 209 67 -74 -125 -94 16 96 294 -17 60 32 244 -39 -2 -137 -150 -89 -111 -273 17
7722 17 -61 112 -330 345 117 25 -141 131 237 53 93 72 27 -98 44 49 76 11 78 79 210 24 6 -105 -121
7747 -121 -90 129 -172 34 104 -128 87 -51 107 99 23 -146 -176 -208 -275 -277 0 -46 93 -192 -330 -34 255 58
7771 58 9 -84 -79 -173 243 261 -228 -172 -90 156 -188 -99 -337 -203 -97 -352 114 -143 51 87 -203 23 164 -183
7795 -183 -210 -29 -97 -85 -10 63 18 -295 14 -94 -359 -103 227 87 -92 -158 57 193 398 -53 -146 42 -144
7818 -144 7 47 453 -244 66 40 -140 -2 251 107 -3 9 134 -63 -80 -40 129 -83 57 171 236 -115
7840 -115 32 -159 33 186 64 306 144 188 -172 315 55 118 105 -212 83 24 74 -170 97 -67 -51 22
7862 22 188 164 -79 -34 177 135 34 280 -152 -101 44 22 108 33 -145 140 3 54 89 71 37 -97 -127 -24
7886 -24 -241 -63 18 -71 149 -8 223 11 333 -246 -260 -41 -339 102 109 -539 -149 -90 -265 27 177 -31
7908 -31 50 -148 38 102 -311 -28 -68 -172 -142 -165 207 89 -133 55 24 51 -208 236 -265 259 -12 310 158
7931 158 4 -170 122 -6 -65 27 -262 77 18 -147 -33 84 -15 -148 209 -29 94 -157 215 315 -42
7952 -42 17 -50 130 141 315 189 142 202 340 390 50 59 79 47 99 -132 -216 -74 -10 150 -106 141 36 -30 65
7977 65 40 96 -204 -45 -292 -208 -30 -64 28 3 145 -164 -73 -261 -312 -167 -83 329 -71 -316 113 76 82 -132
8001 -132 -86 -107 -115 84 141 -211 177 -73 -211 28 9 -86 127 -38 -44 -4 209 78 -23 -375 31 63 -59 -109
8025 -109 -101 12 78 209 -269 39 -185 51 -7 0 87 -11 -174 -336 30 90 191 253 -97 -16 -177 -42 87 -95
8049 -95 -63 -69 1 143 345 6 4 63 183 28 338 217 -200 115 -192 44 -52 319 142 28 -93 -110 -41 -198
8073 -198 121 -164 122 385 17 6 176 5 -112 -109 -142 42 -111 -143 196 149 -110 -222 15 -57 -31 55 -162
8096 -162 -164 53 -115 -11 7 269 65 87 24 287 231 10 -152 -320 417 43 260 -384 21 -19 89 -90
8118 -90 197 -73 4 226 189 55 -20 6 110 154 -134 12 -71 -217 -45 135 201 -186 65 16 41 -207 -165 -54
8142 -54 138 75 -366 -135 -150 227 50 -34 77 151 72 24 176 -24 -19 -32 -248 4 -142 91 199 -56 236
8165 236 153 -55 -5 13 -3 65 294 142 34 -127 -172 -206 -15 -290 2 2 98 -276 -162 97 -19 87 -225
8188 -225 -4 -124 -106
8191a06
##END NTUPLES=NMR FID
##END=
