##TITLE=1H_Pr T-724
 CD3OD, 8 sc, 
 20.11.2020
##JCAMPDX= 6.0         $$ Bruker NMR JCAMP-DX V2.0
##DATA TYPE= NMR FID
##DATA CLASS= NTUPLES
##ORIGIN= UXNMR, Bruker Analytische Messtechnik GmbH
##OWNER= root
$$ XWIN-NMR		Version 3.5
$$ Fri Nov 20 12:35:20 2020 Russian Standard Time (UT+4h)  she@DPX200
##.OBSERVE FREQUENCY= 200.1315066352
##.OBSERVE NUCLEUS= ^1H
##.DELAY= (6, 6)
##.ACQUISITION MODE= SIMULTANEOUS
##.ACQUISITION SCHEME= undefined
##.AVERAGES= 8
##.DIGITISER RES= 18
##SPECTROMETER/DATA SYSTEM= spect
##.PULSE SEQUENCE= zg30
##.SOLVENT NAME= MeOD
##.SHIFT REFERENCE= (INTERNAL, MeOD, 0, 15.7039)
##AUDIT TRAIL= $$ (NUMBER, WHEN, WHO, WHERE, WHAT)
$$ ##TITLE= Audit trail, XWIN-NMR		Version 3.5
$$ ##JCAMPDX= 5.01
$$ ##ORIGIN= Bruker BioSpin GmbH
$$ ##OWNER= she
$$ F:/spectra/data/she/nmr/H-F/1/audita.txt
$$ ##AUDIT TRAIL=  $$ (NUMBER, WHEN, WHO, WHERE, WHAT)
(   1,<2020-11-20 12:32:44.20 +0400>,<she>,<DPX200>,
      <created by zg, POWCHK disabled, PULCHK disabled
       configuration hash MD5:
       00 E9 B6 7A A2 85 ED C7 34 08 36 98 17 FE 4E 26
       data hash MD5: 16K
       75 30 91 97 DD 8F 17 65 65 8A 20 80 F3 D9 FA DD>)
$$ ##END=
$$ 
$$ hash MD5
$$ 94 60 0F C2 66 80 4D 80 6E F6 EC FA A1 98 77 25
##$RELAX= 
##$RELAX= 
##$RELAX= 
##$RELAX= 
##$RELAX= 
##$RELAX= 
$$ Bruker specific parameters
$$ --------------------------
##$DU= <F:/spectra>
##$EXPNO= 1
##$NAME= <H-F>
##$PROCNO= 1
##$TYPE= <nmr>
##$USER= <she>
##$AMP= (0..31)
100 100 100 100 100 100 100 100 100 100 100 100 100 100 100 100 100 100 
100 100 100 100 100 100 100 100 100 100 100 100 100 100 
##$AQSEQ= 0
##$AQ_mod= 1
##$AUNM= <au_zg>
##$AUTOPOS= <>
##$BF1= 200.13
##$BF2= 200.13
##$BF3= 200.13
##$BF4= 200.13
##$BF5= 200.13
##$BF6= 200.13
##$BF7= 200.13
##$BF8= 200.13
##$BYTORDA= 1
##$CFDGTYP= 0
##$CFRGTYP= 5
##$CHEMSTR= <none>
##$CNST= (0..31)
1 1 145 1 1 1 1 1 1 1 1 1 1 1 1 1 1 1 1 1 1 1 1 1 1 1 1 1 1 1 1 1 
##$CPDPRG= <>
##$CPDPRG1= <>
##$CPDPRG2= <>
##$CPDPRG3= <>
##$CPDPRG4= <mlev>
##$CPDPRG5= <mlev>
##$CPDPRG6= <mlev>
##$CPDPRG7= <mlev>
##$CPDPRG8= <mlev>
##$CPDPRGB= <>
##$CPDPRGT= <>
##$D= (0..31)
0 1.2 0 0 0 0 0 0 0 0.06 0 0.03 0 0 0 0 0.0002 0 0 0 0 0 0 0 0 0 0 0 0 
0 0 0 
##$DATE= 1605861163
##$DBL= (0..7)
120 120 120 120 120 120 120 120 
##$DBP= (0..7)
150 150 150 150 150 150 150 150 
##$DBP07= 0
##$DBPNAM0= <>
##$DBPNAM1= <>
##$DBPNAM2= <>
##$DBPNAM3= <>
##$DBPNAM4= <>
##$DBPNAM5= <>
##$DBPNAM6= <>
##$DBPNAM7= <>
##$DBPOAL= (0..7)
0.5 0.5 0.5 0.5 0.5 0.5 0.5 0.5 
##$DBPOFFS= (0..7)
0 0 0 0 0 0 0 0 
##$DE= 6
##$DECBNUC= <off>
##$DECIM= 32
##$DECNUC= <off>
##$DECSTAT= 4
##$DIGMOD= 1
##$DIGTYP= 9
##$DL= (0..7)
0 120 120 120 120 120 120 120 
##$DP= (0..7)
150 150 150 150 150 150 150 150 
##$DP07= 0
##$DPNAME0= <>
##$DPNAME1= <>
##$DPNAME2= <>
##$DPNAME3= <>
##$DPNAME4= <>
##$DPNAME5= <>
##$DPNAME6= <>
##$DPNAME7= <>
##$DPOAL= (0..7)
0.5 0.5 0.5 0.5 0.5 0.5 0.5 0.5 
##$DPOFFS= (0..7)
0 0 0 0 0 0 0 0 
##$DQDMODE= 0
##$DR= 18
##$DS= 0
##$DSLIST= <SSSSSSSSSSSSSSS>
$$ [...]
##$SUBNAM2= <"">
##$SUBNAM3= <"">
##$SUBNAM4= <"">
##$SUBNAM5= <"">
##$SUBNAM6= <"">
##$SUBNAM7= <"">
##$SUBNAM8= <"">
##$SUBNAM9= <"">
##$SW= 16.9725356469052
##$SWIBOX= (0..15)
0 0 2 0 0 0 0 0 0 0 0 0 0 0 0 0 
##$SW_h= 3396.73913043478
##$TD= 16384
##$TD0= 1
##$TE= 0
##$TE2= 300
##$TE3= 300
##$TEG= 300
##$TL= (0..7)
0 120 120 120 120 120 120 120 
##$TP= (0..7)
150 150 150 150 150 150 150 150 
##$TP07= 0
##$TPNAME0= <>
##$TPNAME1= <>
##$TPNAME2= <>
##$TPNAME3= <>
##$TPNAME4= <>
##$TPNAME5= <>
##$TPNAME6= <>
##$TPNAME7= <>
##$TPOAL= (0..7)
0.5 0.5 0.5 0.5 0.5 0.5 0.5 0.5 
##$TPOFFS= (0..7)
0 0 0 0 0 0 0 0 
##$TUNHIN= 0
##$TUNHOUT= 0
##$TUNXOUT= 0
##$USERA1= <user>
##$USERA2= <user>
##$USERA3= <user>
##$USERA4= <user>
##$USERA5= <user>
##$V9= 5
##$VALIST= <valist>
##$VCLIST= <CCCCCCCCCCCCCCC>
##$VD= 0
##$VDLIST= <DDDDDDDDDDDDDDD>
##$VPLIST= <PPPPPPPPPPPPPPP>
##$VTLIST= <TTTTTTTTTTTTTTT>
##$WBST= 1024
##$WBSW= 4
##$XGAIN= (0..3)
0 0 0 0 
##$XL= 0
##$YL= 0
##$YMAX_a= 160727
##$YMIN_a= -126672
##$ZGOPTNS= <>
##$ZL1= 120
##$ZL2= 120
##$ZL3= 120
##$ZL4= 120
##$ABSF1= 10
##$ABSF2= 0
##$ABSG= 5
##$ABSL= 3
##$ALPHA= 0
##$AQORDER= 0
##$ASSFAC= 0
##$ASSFACI= 0
##$ASSFACX= 0
##$ASSWID= 0
##$AUNMP= <proc_1d>
##$AZFE= 0.1
##$AZFW= 0.1
##$BCFW= 1
##$BC_mod= 2
##$BYTORDP= 1
##$COROFFS= 0
##$CY= 11.3945322036743
##$DATMOD= 1
##$DC= 2
##$DFILT= <>
##$DTYPP= 0
##$F1P= 15.9154993809931
##$F2P= -4.1035820241983
##$FCOR= 0.5
##$FTSIZE= 0
##$FT_mod= 4
##$GAMMA= 1
##$GB= 0.15
##$INTBC= 1
##$INTSCL= 1
##$ISEN= 128
##$LB= 0.24
##$LEV0= 0
##$LPBIN= 0
##$MAXI= 10000
##$MC2= 0
##$MEAN= 0
##$ME_mod= 0
##$MI= 1.114404
##$NCOEF= 0
##$NC_proc= 0
##$NLEV= 6
##$NOISF1= 3.799351
##$NOISF2= 2.8
##$NSP= 1
##$NTH_PI= 0
##$NZP= 0
##$OFFSET= 15.70392
##$PC= 1
##$PHC0= -11055.2
##$PHC1= 16.40089
##$PH_mod= 1
##$PKNL= yes
##$PPARMOD= 0
##$PSCAL= 0
##$PSIGN= 0
##$REVERSE= no
##$SF= 200.130013532006
##$SI= 16384
##$SIGF1= 3
##$SIGF2= 2
##$SINO= 400
##$SIOLD= 16384
##$SREGLST= <1H.CDCl3>
##$SSB= 0
##$STSI= 0
##$STSR= 0
##$SW_p= 3612.71676300578
##$SYMM= 0
##$S_DEV= 0
##$TDeff= 0
##$TDoff= 0
##$TI= <>
##$TILT= no
##$TM1= 0
##$TM2= 0
##$TOPLEV= 0
##$USERP1= <user>
##$USERP2= <user>
##$USERP3= <user>
##$USERP4= <user>
##$USERP5= <user>
##$WDW= 1
##$XDIM= 8192
##$YMAX_p= 0
##$YMIN_p= 0
$$ End of Bruker specific parameters
$$ ---------------------------------
##NTUPLES= NMR FID
##VAR_NAME=  TIME,          FID/REAL,        FID/IMAG
##SYMBOL=    X,             R,               I
##VAR_TYPE=  INDEPENDENT,   DEPENDENT,       DEPENDENT
##VAR_FORM=  AFFN,          ASDF,            ASDF
##VAR_DIM=   8192,          8192,            8192
##UNITS=     SECONDS,       ARBITRARY UNITS, ARBITRARY UNITS
##FACTOR=    0.0002944,     1,               1
##FIRST=     0,             0,               0
##LAST=      2.4114304,     0,               0
##MIN=       0,             -126672,         0
##MAX=       2.4114304,     160727,          0
$$ Real data points
##PAGE= N=1
##DATA TABLE= (X++(R..R)), XYDATA
0@%%%%%%%%%%%%%%Mj2J6j6J6k4L2l2M0m8N6p2Q3r2J06j25J48j68J91k19K48k80
$$ 0 0 0 0 0 0 0 0 0 0 0 0 0 0 0 4 -8 8 -8 8 -16 16 -16 24 -24 32 -40 43 -49 57 -68 80 -88 103 -116 132 -148
36a48L15l55M00m48M98n54O15o85P63q44R31j028J135j249J377j518J670j840
$$ -148 167 -188 212 -236 262 -292 323 -362 401 -443 488 -540 595 -654 723 -795 875 -965
54i65K028k238K472k737L044l395L801m281M858n567O465p638R239j1568J5314
$$ -965 1063 -1175 1297 -1440 1604 -1791 2010 -2271 2587 -2980 3485 -4153 5086 -6482 8832
69H832l4488J86383j46661m9458J22391k09716Q6105O4023o9039J55900n9812
$$ 8832 -25656 160727 14066 -35392 86999 -122717 -36612 27411 -41628 114272 54460
80E4460j44326Q8168o2477P1430J16953j46339L5145L3308j72994J20286J03228
$$ 54460 -89866 -1698 -64175 7255 124208 -22131 13014 46322 -126672 -6386 96842
91I6842j02473O2441k5063j29384Q2644M5308j2198M6231n2430m0401J1587l5332
$$ 96842 -5631 56810 31747 -97637 -14993 30315 18117 64348 11918 -28483 -16896 -52228
103e2228P4437O0390q2649R16q143p1632R0547M3784o7886N7943l7656j05021
$$ -52228 22209 82599 -50 866 -7277 -78909 11638 55422 -12464 45479 7823 -97198
115i7198R4189K8546k9271N7950o0178l6155L0576m1992Q3669L5694j03055M8918
$$ -97198 -3009 25537 -3734 54216 -5962 -42117 -11541 -53533 30136 65830 -37225 11693
127A1693k3023p2108J17964p862l8449O7783r8652k4304R6996m2392K7956L1387
$$ 11693 -11330 -83438 34526 26664 -11785 55998 -42654 -66958 30038 -12354 15602 46989
139D6989p7723K1758j7306j6642J05789m1463m8415N7442p2118j399Q6937m3711
$$ 46989 -30734 -8976 -26282 -42924 62865 21402 -27013 30429 -41689 -43088 43849 138
151A38J5685J9216q4619K5419L5872j8016M3573k1306l7076K2162l4217K3609
$$ 138 15823 35039 -49580 -24161 11711 -6305 37268 15962 -21114 1048 -33169 -9560
163i560N9737m7572j796J3114o1261L5987M9181m0557J9071M670n6157J8612K1761
$$ -9560 50177 2605 809 13923 -47338 -11351 37830 -2727 16344 21014 -35143 -16531 5230
176E230J373K7244l0298k1845J9448k4797K3314L7559l7668Q332m720m9847N3620
$$ 5230 6603 33847 3549 -18296 1152 -23645 -331 37228 -440 7892 3172 -46675 6945
189F945K5604m4561L1619q035m6917K9325P365O972K2825m0768l712J4213k6939
$$ 6945 32549 -12012 19607 11572 -35345 -6020 1345 8317 31142 -9626 -13338 875 -26064
202b6064L7696J4858l6791K4328k3904l1209O1260o155k3876L3735l2536j8025
$$ -26064 11632 26490 -10301 14027 -9877 -41086 20174 14019 -9857 23878 -8658 -26683
214b6683K8770q690K0813N613l5641J3940q881j0118M5479j6026j7323K6198l7973
$$ -26683 2087 -6603 14210 19823 -15818 -1878 -10759 -20877 24602 8576 -8747 17451 -20522
227b0522m911M5722j6600j268J2563l1326L905J3369m786K0403p401j6909O850
$$ -20522 -25433 20289 3689 2421 14984 -16342 -12437 932 -3854 16549 9148 -7761 -911
240i11j6599J3295K9212k7237M63J6220l5593P149L1881j4368L066K008k4140
$$ -911 -17510 -4215 24997 -2240 -1777 14443 -21150 -14001 17880 3512 6578 8586 -15554
253a5554R026R111k859J3750p382r872O0j2765K0952J6119k8239J1234O228l3275
$$ -15554 -6528 2583 -276 13474 6092 -3780 -3720 -16485 4467 20586 -7653 3581 9809 -23466
267b3466J9824J9423j8235J2165n347k1839J5494L246J88J0103j2722J22l988
$$ -23466 -3642 15781 -2454 9711 4364 -17475 -1981 1265 1453 11556 -1166 -1044 -5032
280e032j1508K7547J254k0998J7580j0775j8553K7109k64j0157J5746j4624j1692
$$ -5032 -16540 11007 12261 -8737 8843 -1932 -20485 6624 6360 -3797 11949 -2675 -14367
293a4367J4103O57M668R41q560L716r981j493K2645q116p547J1213j6931k326
$$ -14367 -264 393 5061 6002 -2558 1158 -8823 -10316 12329 4213 -3334 7879 -9052 -11378
307a1378K0679r496N98J1030j7374m260J0536J307M598l292m264L234j1039M202
$$ -11378 9301 -195 403 11433 -5941 -10201 335 1642 6240 2948 -1316 1918 -9121 -4919
321d919J6763j0508j165N516j6786O816J3629j1585N955M334j5061J031O096K332
$$ -4919 11844 1336 171 5687 -11099 -4283 9346 -2239 3716 8050 -7011 -5980 116 2448
335B448M770p162o63J864j0325R380Q593j0796O328k142j4859J2483O954r719
$$ 2448 7218 56 -607 1257 -9068 312 8905 -1891 4437 2295 -12564 -81 6873 -2846
349b846P031r32r592J799K287N069K568p099Q98j507n081J1153j07o197Q367p536
$$ -2846 4185 3253 -6339 -4540 -2253 2816 5384 -1715 -817 -2324 -7405 3748 3641 -2556 5811 -1725
365a725r757J3814J900o251N139k745m939J555J688M863K30m976J272m429k06
$$ -1725 -11482 2332 4232 -2019 3120 375 -4564 -3009 -1321 3542 3772 -1204 68 -4361 -4567
380d567J0384m773k705Q050j0175m274J2633j954k919M204n012k247K466M48M630
$$ -4567 5817 1044 -1661 6389 -3786 -8060 4573 2619 -300 3904 -1108 -3355 -889 -441 4189
395D189j926j900P68o479M196Q467q523J587N339j1037J561P826l189J702rn130
$$ 4189 2263 363 1131 -5348 -1152 7315 -1208 379 5718 -5319 -3758 4068 879 2581 2572 -2558
411b558J070K44K268J951l246K588k565o406Q709K669o905M305l50o859L773L033
$$ -2558 -1488 -1244 1024 2975 -271 2317 -248 -6654 2055 4724 -2181 2124 1774 -5085 -1312 1721
427A721j255J665j105l355p80K596K618j876m12K107m365k730O886O42m160L427
$$ 1721 466 2131 1026 -2329 -3109 -513 2105 229 -183 1924 -2441 -5171 1715 2357 -1803 1624
443A624j411n302M685K352k967K680n90m040M67K060K036p59j581K317m032j659
$$ 1624 213 -5089 -404 1948 -1019 1661 1071 -2969 -2502 -442 1594 835 -746 1571 -2461 -4120
459d120Q082l419k414N619n382k249N880j662L86J853l283k80p66K009K919m638
$$ -4120 3962 543 -1871 3748 -1634 -3883 1997 335 721 2574 -709 -989 -1755 254 3173 -1465
475a465K531K071p711L924M473m802K829L7m736K406J249k92N53p9M07l730j65
$$ -1465 1066 3137 -4574 -650 3823 -979 1850 1887 -2849 -443 806 514 1067 988 1395 -2335 -2500
492b500N646j822k391L023k012k462K727R52j000J020j94l685Q14M497k563r79
$$ -2500 3146 1324 -1067 1956 -56 -2518 209 1161 161 1181 987 -2698 -1884 2613 50 -929
508i29K665j707k175J087J949L98j587M82q10k372M325m93l354M602j303m654
$$ -929 1736 29 -2146 -1059 890 1288 -299 183 -627 -2999 1326 833 -2521 2081 778 -3876
524c876L785P94j044J348j868N99n46p01L418k566l8L469n758N76N601l984M40
$$ -3876 -91 703 -341 1007 -861 -262 -808 -1509 1909 -657 -695 2774 -2984 -2408 3193 -791 -351
541c51K077l111M59J023j73J208j187R46j054k289M032P8l197K837p1l258J954
$$ -351 1726 -1385 -926 97 -76 1132 -55 891 -163 -2452 1580 1658 -1539 1298 1227 -2031 -77
558g7J402j490N00O48j752j002K814J40j345N47N57j559n11J668M36j220J179
$$ -77 1325 -165 335 983 -769 -1771 1043 1183 -162 385 942 -617 -1128 540 976 -244 935
575I35o63k551L168R17l252K041J219l520J024J187l33N21r11R9m80o70K498j322
$$ 935 272 -2279 889 1806 -1446 595 1814 -1706 -682 505 172 693 -218 -119 -599 -1269 1229 -93
593i3r58L134k694k202M220r53j383J926j176p22P39q8M29m92R84m02k233J829
$$ -93 -1051 2083 -611 -2813 1407 454 -929 997 -179 -901 -162 -250 179 -313 671 269 -1964 -135
611a35J743k378L04J838k362k13K226j000j70J117j403p76J550L44r81N36L36
$$ -135 1608 -770 -466 1372 -990 -1203 1023 23 -147 970 -433 -1209 341 685 -296 240 576
628E76l21j895J435J577k033J036P30k915J677J637k465J170J203k142jR15J21
$$ 576 255 -1640 -205 1372 -661 375 1105 -1810 -133 1504 -961 209 1412 -730 -731 184 305
645C05j0o39Q52n56j234K172k63j786K514o07k589K092N04j208Q98J32j011k29
$$ 305 295 -344 508 -48 -1282 890 627 -1159 1355 748 -1841 251 755 -453 445 577 -434 -663
663f63O51L51n98N31L72j453K73J462r57n61J656j059j215J885m95r87J635n57
$$ -663 -12 339 -259 272 644 -809 -536 926 -31 -592 1064 5 -1210 675 180 -807 828 271
681B71j200R28K04j59l8p6M57r09m37K187j685k04J985k205k8K161j555j10J315
$$ 271 -929 -1 203 44 6 -70 387 -522 -959 1228 -457 -661 1324 -881 -909 1252 -303 -413 902
700I02j185k93N53L5L90p25O08L98j612J169P84j804J278M22k097R69R88j072
$$ 902 -283 -576 -23 12 402 -323 285 683 -929 240 1024 -780 498 920 -1177 -208 780 -292
718b92L08M03m91l60M96O38q36J75M28n00q88J336k2j015J060p9j400J169N43
$$ -292 16 419 -72 -432 64 702 -134 41 469 -31 -919 417 395 -620 440 361 -1039 130 673
737F73j206R76L61j181j37N63L28n15K73L03k46r59J366k43j168J883j038r06
$$ 673 -533 443 804 -377 -514 49 377 -138 135 438 192 -767 599 356 -812 1071 33 -873
755h73J465k73r17J179l67q18M49K10J26l40K73L54o79l79J539j354J28J143j334
$$ -873 592 319 -598 581 214 -604 -155 55 181 -159 114 468 -211 -590 949 -405 -277 866 -468
774d68j35J396q49m65R90m77j49L7K02J71m24L76q1o95O75O92j409N04Q28j250
$$ -468 -603 793 -56 -521 469 -8 -157 -120 82 253 -171 205 124 -571 104 796 -613 -109 719 -531
794e31M14J220j377K4P48n42j27L6L22k99N1L01j08p63P90K89j083J026n5j156
$$ -531 -117 1103 -274 -250 498 -44 -171 -135 187 -112 -61 240 132 -631 159 448 -635 391 336 -820
814h20P80L93q07N62K43n44j28L31M3k28J82L04m90n54J064m88l48Q55j47j013
$$ -820 -40 353 -454 108 351 -193 -321 10 53 -175 7 311 -179 -733 331 -157 -505 350 203 -810
834h10R22J99p42N04L19p01J94J82P9k02J45K27p58K47P22l26l95P89q81o48J445
$$ -810 112 311 -431 73 392 -309 -115 67 146 -56 89 316 -442 -195 527 201 -194 595 -286 -934 511
855E11n25n36Q08j81l75J23L24j94O6k7M96q58K41O72r71L20R99j273J89P17o78
$$ 511 -14 -550 258 77 -298 -175 149 -45 21 -6 490 -368 -127 545 -426 -106 893 -380 -191 526 -152
876a52m6K60lq8j11L52n5j34L48j67m50O26j82q26P15J17m44L1O49p25M8N52j96
$$ -152 -198 62 59 -29 -140 212 157 23 371 204 -246 380 198 -628 87 204 -240 -209 440 -285 -237 315 119
899A19l82N91j07o56N48L7L8l77L10j59j54Q3M68j011N18N40q25P34k07k58J95
$$ 119 -263 328 221 -435 113 150 188 -189 121 -38 -192 -109 359 -652 -134 406 -419 315 108 -150 45
920D5j97j07L04j77M71o11k28J117o31m26J106o23m36Q99m84j99P4m8L8p7K15
$$ 45 -152 -259 45 -132 339 -272 -500 617 -14 -440 666 43 -393 506 22 -177 -103 -151 -113 -190 25
941B5Pl57M67M1o02K34M06l64j64P17m41j79M00k47k64N29n0l92L44J87k99j50
$$ 25 32 -325 142 183 -419 -185 221 -143 -307 410 -31 -210 190 -57 -321 208 158 -234 110 297 -2 -152
963a52Q5J98j29q6J78j34P8M10q54J61P73q29K64P3l6j54O8N4K51k84K91j99o61
$$ -152 -67 131 2 -84 94 -40 38 448 -406 -245 528 -301 -37 36 0 -154 -86 -32 219 -65 226 27 -634
986f34Q88j68o35R17l76l34M84l4k71M45k66k01J21J63J7m98K71N76p29J2M09
$$ -634 254 86 -549 368 -8 -342 142 108 -163 282 16 -185 -64 99 116 -382 -111 465 -264 -252 157
1007A57l01R5m2n5K33K8O7o01O11L09j165N84L92J46m76j23k46R1L1M06l8K1M24
$$ 157 -144 -49 -91 -146 87 115 182 -419 192 501 -664 -80 312 458 -18 -141 -387 -296 -265 141 103 124 548
1030E48q62j06R62m13o54P55l04J33J20j16K65l48j63L74m29M76j02n38L00M87
$$ 548 -314 -420 542 129 -525 230 -74 59 179 63 328 -20 -183 191 -238 238 136 -402 -102 385
1050C85o07J50k3K83m2n9o8k91L12J44k43K1M47l85j38J82m3j57r6L32l29O1M48
$$ 385 -222 -72 -95 188 146 87 19 -272 40 184 -59 -38 409 24 -114 68 25 -132 -228 104 -225 -164 284
1073B84k43p5L06j85k63L77m76L25j80K2P2q5r9L15n35P32l32m23N49L41n24K07
$$ 284 41 -34 272 87 -176 201 -275 50 -130 -108 -36 -121 -220 95 -440 292 -40 -463 86 427 -97 110
1095A10O5q9J07k58K82k56l9K03l33J4N40m80j39N00j05k45J48k07O1K01J13l24
$$ 110 175 86 193 -65 217 -39 -78 125 -208 -194 346 -134 -273 227 122 -123 25 -182 -121 80 193 -131
1117a31N8K60k17J86k2k11j76Q1Q0oj65L24K69l07L86o33J42L40l31r5K79J20
$$ -131 -73 187 -30 156 134 -77 -253 -172 -92 -98 -263 61 330 23 409 -224 -82 258 -73 -168 111 231
1139B31k28j17J95j67j09K57Q6k97J26L00o84O43p8j26P0j13J33J41k50J83o7
$$ 231 3 -114 81 -86 -195 62 148 -149 -23 277 -407 236 158 32 102 -11 122 263 13 196 129
1160A29P0j16pj75J18o1r4L14k40p8J93J28l09J08M9M0K5k02P9j62L58l01Q4L53
$$ 129 199 83 76 -99 19 -42 -136 178 -62 -140 53 181 -128 -20 29 69 94 -108 -29 -191 167 -134 -50 303
1184C03m18J24l8R2N2k79L79O8n16L86m23J86L2J19l29J56K81j42j76LK45l34
$$ 303 -115 9 -29 63 115 -164 215 283 -233 153 -270 -84 -52 67 -262 -106 175 33 -143 -140 105 -229
1206b29L07K8j05K4Q6j27M2p2K21k14j10K15j78L8K36n9k31R4J17k42L28l85P6
$$ -229 78 106 1 25 111 -16 26 -46 175 -39 -149 66 -112 -74 162 103 -128 -34 83 -159 169 -216 -140
1229a40K73k67K8L17j12j61q6J15O5j51J98j29K4M4j39L83o11M00o9j62J29K06
$$ -140 133 -134 -106 211 99 -62 -148 -33 32 -119 79 -50 -26 18 -121 262 -349 51 -18 -180 -51 155
1251A55m1q3K16j74q5J61r4k4J55k58K26p4k01J36k06J39K26m78O46j19j44k90
$$ 155 114 31 247 73 -12 149 55 31 186 -72 154 80 -121 15 -191 -52 174 -304 342 223 79 -211
1273b11K30j82O2K76M6k85N5P6m6j9J68j07K1J37l97J61mRr6K82j72k61J08L39
$$ -211 19 -163 -101 175 221 -64 -9 67 21 2 170 63 84 221 -176 -15 -19 -10 -106 176 4 -257 -149 190
1297A90p4k47K50m43K16J18N2k28J85J82k67J6J7j39J76K2l5J82j99L2j34r4N51
$$ 190 116 -131 119 -324 -108 10 62 -166 19 201 -66 -50 -33 -172 4 26 -9 173 -26 6 -128 -222 329
1320C29k53r7j02J6L14k18J45j38J45J34j37m27K86n6M9J8J5J4j27J73k57K53
$$ 329 76 -21 -123 -107 207 -11 134 -4 141 275 138 -289 -3 -59 -10 8 23 37 -90 83 -174 79
1342G9J86k57Qm8J5J27l5P6l76J05M06m93k1L45L3j64l7O3j72K69j91Q9J69o1
$$ 79 265 8 16 -32 -17 110 75 151 -225 -120 286 -207 -228 117 150 -14 -51 12 -160 109 -82 7 176 115
1366A15J5j63K59k48p7L34l29K8J88n9j81r9L30q2k66L37J94m97J79K40k91J47
$$ 115 130 -33 226 -22 -99 235 -94 -66 122 63 -118 -217 113 31 -235 102 296 -201 -22 218 -73 74
1388G4L9m21O6K82j42K24mJ22k26Q6j71Q4k7j95J19Q4N2J4m4K49jj73j44o6J16
$$ 74 113 -308 -242 40 -102 122 118 240 14 100 -71 13 -14 -209 -90 -6 46 60 16 265 264 91 -53 -119 -3
1413ck44K93k12K30m24K44L4J01P8o5k92N24J73n72K67k0j74J06k31J94L21n06
$$ -3 -247 46 -166 64 -360 -116 -82 19 97 32 -260 264 437 -135 132 112 -62 44 -187 7 328 -178
1435a78L04k95J60P2RO6M7l35K22%j42K8j91K93k42R5K11k54J71j90M9k62N80
$$ -178 126 -169 -9 63 72 138 185 -150 72 72 -70 -42 -233 60 -182 -87 124 -130 41 -149 -100 -362 218
1458B18k81J63p7j6K6k05L9K14j76L06kl72J36q4L21l63Q4J64o9J2j01k19L85
$$ 218 -63 100 23 7 33 -172 -133 81 -95 211 209 -163 -27 -111 210 -153 -69 95 26 38 -63 -282 103
1481A03J08k10j41L60m16O5J06K52k40j60L71p3l7L8j09L2J09m01J51L46l1l01
$$ 103 211 1 -140 220 -196 -131 -25 227 -13 -173 198 125 88 126 17 49 158 -243 -92 254 223 -78
1503g8m1j79K05Qn8P0j77L59o0m50M35J02l51J65K86m7j09n8M7m3r6j4J08RJ9
$$ -78 -119 -298 -93 -85 -143 -73 -250 109 49 -401 34 136 -215 -50 236 189 80 22 69 26 -70 -84 24 33 52
1528E2k91K31P8Q7j57P0K1P0j52q8J68k04J83k8j89k7K90j09k52L68j36P3O8m9
$$ 52 -239 -8 70 157 0 70 91 161 9 -79 89 -115 68 40 -149 -176 114 5 -247 121 -15 58 126 77
1552G7j74J76k2J70j86r6n2K51k03j01J00N0N8o8J8N7J57Rl94M6K51p2k29J51
$$ 77 -97 79 57 227 41 -55 -107 144 -59 -160 -60 -10 48 -20 -2 55 212 221 -173 -127 124 52 -177 -26
1576b6r3O8L1j24J44R4m3l2r3M5k6m1K02n8j60J37r6J22P1QM1k12o6J39l21K03
$$ -26 -119 -51 -20 -144 0 94 51 19 -74 -29 -55 -96 106 48 -112 25 -71 51 122 130 171 -41 -107 32 -289 -86
1602h6J48j74J89k16J04p6O7j79M17k73J58j77N1n8L30l43J10J9j92K86Kk00J48
$$ -86 62 -112 77 -139 -35 -111 -44 -223 194 -79 79 -98 -47 -105 225 -118 -8 11 -181 105 107 -93 55
1625E5l90J65J90k11o4L14k00J08j40K82pq2N7j35q3O3j8jj6K66j27j74R2K07
$$ 55 -335 -170 20 -191 -255 59 -141 -33 -173 109 102 20 77 -58 -141 -78 -96 -97 -113 153 26 -148 -56 151
1649A51k50K00j37J57m3l14M54j50k98J77k1j63M13n5j04J32nj57J54m82M80j13
$$ 151 -99 101 -36 121 78 -236 218 68 -230 -53 -74 -237 176 121 17 149 144 -13 141 -341 139 26
1671B6rK5K01l35J37J1m0j61j9K07O1j56j39J56K02j2j78n1pP8kk5j5k7q4l2K0
$$ 26 17 42 243 -92 45 56 16 -145 -164 43 104 -52 -191 -35 167 155 -23 -74 -81 -3 -5 -30 -45 -72 -156 -188 -168
1698a68J45K4p8P8Qr5K59j87K4j5J22k76n0L77k64k4J65k9L2l96M06q6K13j66
$$ -168 -23 1 -77 1 9 -86 173 -14 10 -5 117 -159 -209 168 -96 -120 45 16 48 -348 58 -28 185 19
1722A9K06k87M8O3o4o5N4J21L0j75P2J61k11N1j38K09p6K25o9l6j31j57j5J88
$$ 19 225 -62 -14 49 -15 -80 -26 95 125 -50 22 183 -28 23 -115 94 18 243 174 138 7 -150 -165 23
1746B3O1J1j85N4N1j07J25J24j2j83Q8o1k03K99j34N2j41J4L59j39j97K8K41k85
$$ 23 84 95 -90 -36 15 -92 33 157 145 -38 50 -11 -214 85 -49 3 -138 -124 235 96 -101 -73 168 -117
1770a17L9J65K70m15k15K84k06J8lK65k57J65J99j60o5J04k65M40j72j13o2Jj68
$$ -117 -78 87 357 -58 -273 11 -195 -177 -180 85 -172 -7 192 32 -33 71 -194 246 74 -39 -101 -100 -268
1793b68O29m26m4R0N9jJ04J29k30n5j3O7l48L58qN0j94K02L5p2J17j21k02J07
$$ -268 361 -65 -109 -19 40 39 143 272 42 -13 -26 41 -307 51 43 93 -101 101 136 64 181 60 -142 -35
1817c5J24j43K30j74K9k18R0r6K31r3R6p5J28l06K26J88k16J30k57M75m22J89
$$ -35 89 -54 176 2 31 -187 -97 -193 38 -55 41 -34 94 -212 14 202 -14 116 -141 334 -88 101
1839A01J3J38l55K03o7l26K98K6O4q2q1J07J40l3k11J92j92K27o1k21L08l35K93
$$ 101 114 252 -103 100 33 -293 5 31 95 13 -68 39 179 146 -65 127 -65 162 101 -120 188 -147 146
1862A46l05K23k66M05l88J06J57r9J54K7N4k51L4n1O9K5K43l35J63RL0j54J9K0
$$ 146 -159 64 -202 203 -185 -79 78 -21 133 160 214 -37 -3 -54 15 40 283 -52 111 120 150 -4 15 35
1886C5M4J29j9K5k80K1j65J04Q2j48PJ96rl24M88k2k52k7pK94L1k57J45m6j67
$$ 35 79 208 189 214 -66 -45 -210 -106 -24 -172 -165 31 22 -302 186 164 -88 -115 -122 172 203 -54 91 45 -122
1911a22J52l5M0L4o6j00J25j35M18l75pL06m58K59q2j02K60l31K12K19l21J56
$$ -122 30 -5 35 69 3 -97 28 -107 311 -64 -71 235 -223 36 -46 -148 112 -219 -7 212 -109 47
1933D7j68M6J0p2J72j98J48l8J14J76q5j48K8j35K12r1n6J14k23J76p7Q7J05o8
$$ 47 -121 -75 -65 -137 35 -163 -15 -53 61 237 152 4 32 -103 109 18 -38 76 -147 29 -48 39 144 76
1957G6k55J63j19o0J55Q8M5j36J38j16r7K24l00K45k05O2J59P3k84j15L20k0r0
$$ 76 -179 -16 -135 -195 -40 48 93 -43 95 -21 -118 106 -194 51 -154 -92 67 140 -144 -259 61 41 -49
1980d9J13N2j41p6J39k6J16j45j8J68k58L5N9k22J86jj84K75m6j11R0k20L95K11
$$ -49 64 116 -25 -101 38 12 128 -17 -35 133 -125 -90 -31 -253 -67 -68 -252 23 -23 -134 -44 -264 131 342
2004C42k93k0j98K06L3j7j95K73j42N9j37J79K16k95K30k46%q4P1l09J56M47k12
$$ 342 49 29 -169 37 70 53 -142 131 -11 48 -89 90 306 11 241 -5 -5 -89 -18 -327 -171 276 64
2027F4n89K60P6N80m30NN94r31K60M24j53l05k03K66m93N87N2n34N39j88Q3p2
$$ 64 -525 -265 -189 391 -39 -34 560 -371 -111 313 160 -145 -348 -82 -575 12 64 -470 69 -119 -36 -108
2049a08j60M99m61m9q2R6l4K54J2l8J21J77j57k27J86R3k37K16m38L58j79O8N9
$$ -108 -268 231 -230 -279 -361 -265 -299 -45 -33 -71 50 227 70 -157 29 122 -115 101 -337 21 -158 -90 -31
2072c1l2P9L18j89k44R3j10O0R2k90L69J80m37L81l35l50m4o0L73M83j68k80r0
$$ -31 -63 16 334 145 -99 -6 -116 -56 36 -254 115 295 -142 239 -96 -446 -490 -550 -177 306 138 -142 -232
2095b32j05P02k09m95J84j6J05M0k30K88j2J79j11j56O4K99m82n1L64l89M53N
$$ -232 -337 365 156 -339 -155 -171 -66 -26 -256 32 20 199 88 -68 -4 295 -187 -238 126 -263 190 195
2117A95k03J37p5l2k12LJ68M5j64j05L8k57M52L28n79P70m04k5l92j09O65m66
$$ 195 -8 129 54 22 -190 -187 -19 26 -138 -243 -205 -462 -10 318 -261 509 105 80 -312 -421 244 -222
2139b22M74m48J10J22k86j56M0M85l21L50k55M37m00J94J02q30J499l58r48M32
$$ -222 252 -196 -86 36 -250 -406 -366 119 -202 148 -107 330 -70 124 226 -604 895 537 -411 21
2159B1m8Q2o1J30l02O5Q7R3j09k08M19k26j6j60K02J66kj24J2M2m9P6k05K08j67
$$ 21 -27 55 -6 124 -178 -113 -26 67 -42 -250 169 -57 -73 -233 -31 135 133 9 21 63 14 90 -115 93 -74
2184g4K99m3l99j0K15J17J0K11k18J01k76J51j03M6q1o8J50k7J96k22J7J58l83
$$ -74 225 182 -217 -227 -12 105 115 326 108 209 -67 84 -19 27 -54 -122 28 1 197 -25 -8 150 -233
2207b33K66p5L15k34m0r9j39M25m3j30j98J67j37K23j42k6rK18Mk46MJ52P7k87
$$ -233 33 -42 273 39 -1 -100 -239 186 143 13 -185 -18 -155 68 -74 -100 -109 109 113 -133 -129 23 100 -187
2231a87R1J22j58L38j63k25Q9K45m27J02M5J24Q2k27M8M05k02M5j48j23N3QK58
$$ -187 -96 26 -132 206 43 -182 -93 152 -275 -173 -128 -4 78 -149 -101 304 102 147 -1 -124 -71 -63 195
2254A95j47k9j18J47L50p5l86r9n6L03J94j18j56J71l25J76r5qK79n31K20L58
$$ 195 48 19 -99 48 398 323 -63 -162 -218 85 279 161 5 176 -149 27 -68 -76 203 -328 -108 250
2276B50j82J0pj52Q7J63l04J9l41K41k0j69L78M30l92J8j54P8L25k85k70M10J71
$$ 250 68 78 71 -81 6 169 -135 -116 -457 -216 -236 -405 -27 403 11 29 -125 -47 278 -7 -277 133 304
2299C04j97k13L72J04J77l77k1j94r1L98k93MM90o88J54K79j11m9J82l77J25N64
$$ 304 107 -106 266 370 547 170 149 -45 -136 262 -31 -27 463 -225 -71 208 97 48 230 -147 -22 542
2321E42m23L84q59K5M39j29M16k39p1j61K62k49M23o49N17j18M41n55n11N40l56
$$ 542 119 503 -356 -331 108 -21 395 156 85 -76 186 -63 360 -289 228 110 551 -4 -515 25 -331
2342c31Ol16J214o76j97j57K00q0R21k71j74k12j96j0M76o70M10N9M51j60p28
$$ -331 -325 -641 573 -103 -300 -457 -257 -337 584 313 139 -73 -269 -279 197 -473 -63 -4 447 287 -441
2363d41M82j02M07p69K93J15K64j07j84j51J90k43K93J66l95N44j60o12Q80m2
$$ -441 41 -61 346 -423 -130 -15 249 142 -42 -193 -3 -246 47 213 -182 362 202 -410 470 428
2383D28n92K78m18ML14j39P96q38m3J67l62O42m16L59O11j343J70J25K54k46o0
$$ 428 -164 114 -304 -300 14 -125 671 -167 -210 -43 -405 237 -179 180 791 -552 -382 -257 -3 -249 -309
2404c09L62j31k28M17K41k57k53l9M28l45m8N8K03l08K70r6K30jl96K66J41N4
$$ -309 53 -78 -306 111 352 95 -158 -197 231 -114 -162 -104 99 -209 61 -35 195 194 -202 64 205 259
2426B59J97j040N62L34m52K17l00J392j006K44o80R45o94J46j23L30r31J875n93
$$ 259 456 -584 -22 312 -140 77 -223 1169 163 407 -273 672 -22 124 1 331 -600 1275 682
2445F82m09K10q69M20p1m82P59k42J87j05m50Q10l03N4m43R74n87K12n32l20P64
$$ 682 273 483 -386 34 -37 -519 240 -2 185 80 -370 440 137 191 -252 722 135 347 -185 -505 259
2466B59l35p11O36J09K95j71L02l12P3K64n97q6L20k89L72p11O35M9P83l81N1
$$ 259 -76 -787 -151 -42 253 82 384 72 145 409 -188 -274 46 -243 129 -582 53 102 885 504 555
2487E55o97k6J75k71M60M11p16LJ160p17j15k21P3M4j45j30K54N3j76K75p4l06
$$ 555 -142 -168 7 -264 196 607 -109 -106 1054 337 222 1 74 118 -27 -157 97 150 -26 249 175 -131
2509a31L82l98nL11J63j54n45M93j58n86Q00N67m82j41J94n42k37R52o31KP19
$$ -131 251 -147 -152 159 322 168 -377 116 -42 -628 172 739 257 116 310 -232 -469 483 -148 -146 573
2530E73m04o17Q58J75p81L29l7k11M27q26N29N52o31j74L07L6k57p0M78J1J57
$$ 573 169 -448 410 585 -196 133 96 -115 312 -514 15 567 -64 -238 69 105 -152 -222 256 267 424
2551D24j83j83p0K85M45r31P33l30q45J344r3p67l8P76o35j1O4J69j82P2m08P01
$$ 424 241 58 -12 273 718 -213 520 190 -655 689 596 -171 -209 567 -68 -79 -15 154 -28 44 -364 337
2573C37K12k95J33l25M97j53j8o24j71J63J56M12o50M09o45O40l98O61p58O82
$$ 337 549 254 387 62 559 406 388 -236 -407 -244 -88 324 -326 83 -562 78 -320 341 -417 265
2593B65r45O54K26j00K01l06j86l01M67M61n32M4K94m37O2J77J60p65M34O3M16
$$ 265 -680 -26 200 100 301 -5 -191 -492 -25 436 -96 -52 242 -195 -133 44 204 -561 -127 -64 352
2614C52j09p3m96N08l34j61J12K71j48o6M17n91J42L50q52N67K00j58J00j17K62
$$ 352 243 170 -326 182 -152 -313 -201 70 -78 -144 273 -318 -176 174 -678 -111 89 -69 31 -86 176
2635A76l79K00k33L06M8j03m6L74k43K2j25J69O7j21o0j23K54l02J3Q0L65m52
$$ 176 -203 -3 -236 70 118 15 -31 343 100 122 -3 166 233 112 52 -71 183 -119 -106 -26 339 -113
2657a13K8R1l52M91J63k11J41j86O99j483O10K51J23j8k90K7K3J4K9P0q8k37O2
$$ -113 -85 6 -346 145 308 97 238 52 751 -732 -122 129 252 234 -56 -29 -6 8 37 107 19 -218 -156
2680a56L63k29q1N33l08l7k6Onj28J79j13K2j36K20r4N0m9k33J02J0K73k53J28
$$ -156 207 -22 -103 430 122 85 59 65 60 -68 111 -2 20 -116 104 10 60 11 -222 -120 -110 163 -90 38
2704C8l6M8J37j09j03j12L94l73J78j50J96j96J43j34j51K91J13j0j73O3n5r2
$$ 38 2 50 187 78 -25 -137 257 -116 62 -88 108 -88 55 -79 -230 61 174 164 -9 54 -1 -93
2726i3J2Ok02K71L2K40l21j39J67K3J8K2j46N5p2Q3j10L58j77P2j9O6j71J81j16
$$ -93 -81 -75 -277 -6 26 266 -55 -194 -27 -4 14 36 -110 -55 -127 -44 -154 204 27 99 80 146 -25 156 40
2751D0k02J91n1Q3j77Q7N0J6rm2q0J29j21N2M0o2L4Pr9J60J9N1j29o3R7J65j92
$$ 40 -162 29 -22 61 -116 -29 21 37 28 -14 -94 35 -86 -34 6 -56 -22 -15 -114 46 65 116 -13 -76 21 186 -6
2778fq5kLJ45k35Q9O7j74K96k66K59Q0J4j58J83m02L18l83N00j84k18n7j58K16
$$ -6 -91 -93 -90 55 -180 -91 -24 -198 98 -168 91 171 185 27 210 -192 126 -257 243 59 -159 -216 -374 -158
2802a58K64k1n1J39k83L59k18l9J3K2j41J53k67K58K3l0l42K34j31L00j95M1L31
$$ -158 106 85 34 173 -110 249 31 -8 5 27 -114 39 -228 30 53 23 -319 -85 -216 84 -111 -70 261
2825B61l19J19J72l51q7L10k84N8L30k05j26k2p9J62O4J2l4J49o2pj29M79l88
$$ 261 -58 61 233 -118 -205 105 -179 -121 209 4 -122 -144 -223 -61 3 15 -19 130 68 61 -68 411 23
2848B3P0j19R9j28j11O1j32K21P6j67M0J89k44R0J98J3n8j73J29r3j39lJ90J58
$$ 23 93 -26 73 -55 -166 -105 -237 -16 60 -107 -67 122 -122 -32 166 179 121 -52 77 -16 -155 -158 32 190
2872A90k66J21K02j99n0L1j05J84J5j26P7k42J93p2Kq3l7J53O6k02%J54o7Lo0
$$ 190 -76 45 247 48 -2 29 -76 108 123 -3 74 -168 25 -47 -45 -128 -165 -12 54 -148 -148 6 -61 -58 -118
2897a18L19j29j96K62O5K5r0j31N2p2P9K9j09j57k71N12j7n0m6L27l34J1m6L11
$$ -118 201 72 -124 138 203 228 138 7 59 -13 66 95 -14 -171 -442 70 53 3 -43 284 -50 -39 -85 226
2921B26j34j64J00o7o2r6R1K81m08K52k46J72QK6m0J45j46J46mL89p43N5N3J77
$$ 226 92 -72 28 -39 -101 -197 -106 175 -233 19 -227 -55 -47 -21 -61 84 -62 84 80 469 -274 -219 -166 11
2945A1J51Rk46J19j45R5j54N53M15r20N29l1m26m8j1J17j81J43J18o8PP4J45m89
$$ 11 162 171 -75 44 -101 -6 -160 393 808 -112 417 386 -40 -88 -99 18 -163 -20 98 30 37 111 256 -233
2969b33J53K76k69K91l03R5l10L81J57k82P3j11M23n40K67m0o5k83L26QL25l5
$$ -233 -80 196 -73 218 -85 10 -300 81 238 -44 29 -82 341 -199 68 28 -37 -320 6 14 339 304
2991C04l41n3J1J09o6L4lj69K57k77J84J68m76N05j60Km2j55k04J65L91m8j89
$$ 304 -37 -90 -79 30 -36 -2 -5 -174 83 -194 -10 158 -318 187 27 29 -13 -168 -372 -207 184 136 -53
3014e3k0n2K76k43n4L41n26N21l35J95k11K97k74J25k6J49l17L76k36L23k98k2
$$ -53 -73 -125 151 -92 -146 195 -331 190 -145 50 -161 136 -138 -13 -39 110 -207 169 -67 256 -42 -64
3036f4J08k28J53K47j5J1k79P0q9k42k4N48J25q20O13K6J04k96j40K16M4m00O24
$$ -64 44 -184 -31 216 201 212 -67 3 -86 -328 -352 196 321 -499 114 140 244 -52 -192 24 68 -332 292
3059B92m46K09r9J37K23k85l27L20k36K89J94r4k27J09L4O4k8k20L1J81L84o9
$$ 292 -154 55 -44 93 316 31 -296 24 -212 77 271 177 -50 59 93 157 129 -91 -60 121 505 436
3081D36k40k02r4L16k1m18N08m65L73n01K46OM23m07J22K09j66l88M45k71O4j06
$$ 436 196 -6 -100 216 195 -223 285 -180 193 -308 -62 -56 367 -40 82 291 125 -263 182 -89 -25 -131
3103a31N69m74q9K98j80J80m39L04j51M67m80K69q0j17K56L00m68J07q8J81j09
$$ -131 438 -36 -125 173 -7 173 -266 38 -113 354 -126 143 63 -54 202 502 34 141 53 234 125
3124A25r5j89K49Q2k34k7K3J43j25J59j11j10J78J14k72L12j66O8P3k50J07J85
$$ 125 30 -159 90 172 -62 -89 -66 77 -48 111 0 -110 68 182 -90 222 56 124 197 -53 54 239
3146B39j38k28Q1j01OK71q1n7p3J27K36k67J15j82j0J31j63K1K4k41L29k55O0
$$ 239 101 -127 -46 -147 -141 130 49 -8 -81 46 282 15 130 -52 -62 69 -94 -73 -49 -290 39 -216 -156
3169a56J5L79o1k08L93l72Kj7j1J20l80K41K47p7K23J2m4l97K10j46K72j88L5
$$ -156 -141 238 177 -31 362 -10 -8 -25 -36 84 -296 -55 192 115 338 350 306 -91 119 -27 245 57 92
3192I2P2j78J46p3O2k2k31J63j87L27j71J86j05j39j49K06K16k37l7J83j28j86
$$ 92 164 -14 132 59 121 99 -132 31 -156 171 0 186 81 -58 -207 -1 215 -22 -59 124 -4 -190
3214a90J71J09q4J35j86k49L12j66L37k62M6J3J33k59J17oL1J77j48r4j12j3n9
$$ -190 -19 90 6 141 -45 -294 18 -148 189 -73 -27 -14 119 -140 -23 -29 2 179 31 -63 -175 -188 -247
3237b47K51jl8J59Kk31J25J79l07J11k28J98J30j86J69k3m2l7l0r3L32k04K21
$$ -247 4 3 -35 124 126 -105 20 199 -108 3 -225 -27 103 -83 86 63 21 -16 -46 -139 193 -11 210
3260B10k03M2j30j31J75O5Ln1j95K41k55L18KM1mj86K57l5l20N8M2n7K67k37k5
$$ 210 7 49 -81 -212 -37 28 31 -20 -215 26 -229 89 91 132 128 -58 199 164 -156 -98 -56 -113 154 -83 -108
3285a08M21k41o1OJ28j64k02L20j46J19m22N66m1k71P4N3j21R4j90J17J54j52
$$ -108 313 72 11 17 145 -19 -221 99 -47 72 -350 216 175 -96 -22 31 -90 4 -186 -69 85 -67
3307f7K05P1j71J73l4r6k01n7K65Q2r0j40l1l2K65k40R3j22M5J00l8J24O8M2j47
$$ -67 138 209 38 211 177 81 -120 -177 88 170 80 -60 -91 -123 142 -98 -5 -127 -82 18 -20 104 172 214 67
3332F7j15O2J20P8j63n6o8K04m42L68j7K25l57K94n7J3l08L20j55k3J7n7L9k27
$$ 67 -48 14 134 212 49 -7 -75 129 -313 55 38 263 -94 200 143 156 -152 168 13 -10 7 -50 -11 -238
3356b38J71J07K6k4K1j16L52k70J05o8P1j35P1o7K06k12M4j77L9r1k3J57m3m2
$$ -238 -67 40 66 42 63 -53 299 29 134 66 137 2 73 6 212 0 44 -133 -94 -185 -208 -51 -94 -136
3380a36P3J18p9R8k15L73j42j51r4J84Jj10L56l15L8j25K50j12j79K08L26k83
$$ -136 -63 55 -24 74 -141 232 90 -61 -155 29 30 -80 276 -39 -1 -126 124 12 -167 41 367 84
3402H4j85J35j7l0Q0O4r1m3k5J35l24M76k61j14Om4J81l52L19K66m09K80m59N59
$$ 84 -101 34 17 -13 67 131 40 -3 -28 107 -217 259 -2 -116 -110 -154 27 -325 -6 260 -149 131 -328 231
3426B31j10j46j32J76l0j49K00j82m0L16l54J86R8l5l8o1M2R7M0j12j52M69l68
$$ 231 121 -25 -157 19 -11 -160 40 -142 -182 134 -220 -34 64 29 -9 -70 -28 69 109 -3 -155 314 -54
3449e4K99k79Q9N1r4k85J87J75RJ8m50M01J22j55j0k14K8L30m58LJ62J04nM1l
$$ -54 245 -34 55 106 12 -273 -86 89 98 116 -334 67 189 34 24 -190 -162 168 -290 -287 -125 -21 -26 15 12
3474A2J6l57M28M9j88p4N1J49J16Pj28J81l20J15j34L51l22M2l7j18R5K28j16
$$ 12 28 -329 99 148 -40 -114 -63 86 202 209 81 262 -58 57 -77 274 -48 -6 -43 -161 -66 162 46
3497D6j87P8pK04j54j05l3K81j65jJ23Q8j16j34j40j3J58J08k49L8N48j90n6l36
$$ 46 -141 -63 -70 134 -20 -125 -158 123 -42 -43 80 168 52 -82 -222 -235 -77 31 -218 -180 368 178 122 -214
3521b14j30N39l09K97k09k12L76k09J1K24k37K92j57j33K08j80o0Q0k42M30l67
$$ -214 -344 195 -114 183 -26 -238 138 -71 -60 164 -73 219 62 -71 137 -43 -103 -23 -265 165 -202
3542b02J49J3j08P8N7r5J39Jq8J21K13j28k61n1K31K29m8j95O4R6j42j66k0L2
$$ -202 -53 -40 -148 -70 -13 -108 31 32 -56 65 278 150 -111 -162 69 298 250 55 119 215 73 -93 -113 -81
3566h1n7o2L1K27m56j14M57Q9q3l4l51L93N79p96K44P44j455P61J14m54k29M37
$$ -81 -138 -200 -169 58 -398 -512 -55 34 -49 -83 -434 -41 538 -258 -14 730 -725 36 150 -304 -533 -96
3588i6k70L78Q02q44J01k72O4L89lj05J17r3n06L07k99K66K4n5J29j24J17ml81
$$ -96 -366 12 814 -30 71 -201 -137 252 249 144 261 168 -338 -31 -330 -64 -40 -95 34 -90 27 23 -358
3611c58O10k94J55l20J16K76o01M88p4J71l35K04j60J66l12K78J34K0j55J02k8
$$ -358 252 -42 113 -207 -91 185 -416 72 -2 169 -166 38 -122 44 -268 10 144 164 9 111 83
3632H3k44R7J88l8k74J33kJ20k65Q9J37J35j82o5L53k98Oj8j53K06K51m08K04
$$ 83 -161 -64 124 86 -188 -55 -57 63 -202 -113 24 159 -23 -88 265 -33 -27 -45 -198 8 259 -149 55
3655E5j78K04L4k48L47k70jN1J01k09J6MK13J4k01p6Q0No3K01P1j68K50k24Q3
$$ 55 -123 81 115 -133 214 -56 -57 -6 95 -114 -98 -94 119 133 -68 -144 -64 -59 -122 79 150 -18 232 8 91
3680I1j67K34m0o0N5k24J05K68k78K52M2k93K22l22p5J16K42r0nl5M9m7k17J56
$$ 91 -76 158 118 58 113 -111 -6 262 -16 236 278 -15 207 -115 -190 -74 168 78 73 38 87 40 -177 -21
3704b1J03k72K24J30k74K1NM17r4j73m9k28lJ86oj54J12l2J35O2j58o8J92N9j99
$$ -21 82 -190 34 164 -110 -89 -84 333 239 66 17 -211 -214 -28 -34 -188 -76 -108 27 89 -69 -137 55 114 -85
3729h5K23k20m8L87k38j39J30j19L44j50k56K94k12J43K31k44K42l56M0j13J81
$$ -85 138 -82 -130 257 19 -120 10 -109 235 85 -171 123 -89 54 285 41 283 -73 -33 -146 35
3750C5K31m67M38m23R4J71K86l00p19O71j78J63P3J1j34mj7J74k03l1J78m3J57
$$ 35 266 -201 237 -186 -92 79 365 65 -654 17 -161 2 75 86 -48 -52 -69 105 -98 -129 49 6 163
3773A63k64K41j93J09K22k49P2j43N1k90M8L89k52K35m2k89K79j19J87l22J44
$$ 163 -101 140 -53 56 278 29 101 -42 9 -281 -233 156 -96 139 97 -192 87 -32 155 -167 -23
3794b3P3n2M6N4j06J36J37n97P41k98l52J01P58l31m08j62M1P0O1L89m23O5J05
$$ -23 50 -2 44 98 -8 128 265 -332 409 111 -241 -140 618 287 -121 -283 -242 -172 -111 278 -145 -80 25
3817B5j10J12J12l41J46J43k21P1N7j59L01j31J28m4m3p7J84oo3j46M7P4K33k20
$$ 25 -85 27 139 -202 -56 87 -134 -63 -6 -165 136 5 133 89 46 -31 153 147 84 -62 -15 59 292 72
3841G2P9M3l02M6l3L11j18j60J23k49K94Qj88J40J06M6O9O8l67p1J42J1l00R0
$$ 72 151 194 -108 -62 -95 216 98 -62 61 -188 106 114 -74 66 172 218 287 355 -12 -83 59 70 -230 -140
3865a40O40q80P87k42k25L17M9j27k17L6R9r7k9k45L05J40l97J38Q6M5N2j2j03
$$ -140 500 -380 407 165 -60 257 306 179 -38 -2 97 0 -29 -274 31 171 -226 -88 -2 43 95 83 -20
3888b0j70L09pj34L22k46N5l81M19k13J41q6J6J13j93K0M4q7M32k74K42l44K0
$$ -20 -190 119 112 -22 300 54 109 -272 147 -66 75 -11 5 118 -75 -55 -11 -98 334 60 302 -42 -22
3911b2KK9J48j50R0l08J12J15Q2l8j1K8k44J97P2k77J75L7l9j87J28R1j43m8R0
$$ -22 -20 9 157 7 97 -211 -99 16 98 60 49 77 -167 30 102 -175 0 37 -2 -189 -61 30 -113 -161 -71
3936g1J12j08P8j53J26J41j44M5j61M1J20k79R9J86q3JKJ96p2j05R1j03P4q7M5
$$ -71 41 -67 11 -142 -16 125 -19 26 -135 -94 26 -253 -154 32 -51 -50 -48 148 76 -29 62 -41 33 -54 -9
3961iR5l30J33J52%J98p4k39J92k95k5O4K37k08J88q7q3J38j21L53l76J12o3j5
$$ -9 86 -244 -111 41 41 239 165 -74 118 -177 -202 -138 99 -109 79 -8 -91 47 -74 279 -97 15 -48 -63
3985f3p4k1Q4J78Mj45K74L4m03J42J17j09K5j00O2l07K99j21K28q6j5J76j72o
$$ -63 -137 -158 -74 104 108 -37 237 271 -132 10 127 18 43 -57 5 -302 -3 -124 104 18 3 179 7 1
4009AL36l37l8K08j80M7j64L2J13o2R7m2J55k24J82k75J14J00k17Q7j52L22q4
$$ 1 337 0 -38 170 -10 37 -127 -95 18 -44 53 11 166 -58 124 -151 -37 63 -154 -67 -219 103 19
4032A9N7Q2q8M7q1k22Q0K77k43O2J48k8j17j53J90R5j09Oj9R9l08K1K43M7o6L00
$$ 19 76 158 70 117 36 -186 -106 171 -72 -10 138 110 -7 -160 30 125 16 22 3 102 -206 -185 58 105 39 339
4058C39m05J17J29k35q7K37J7M4m54K57k09M01L7k98r5L64m52K78j85L21n7l9
$$ 339 -66 51 180 -55 -142 95 112 156 -298 -41 -250 151 188 -110 -205 159 -293 -15 -200 121 64 25
4080B5J57q9N74r25N54o42K73R6K3l99P75k68m84N30l47k66O66n88L91o2n25L79
$$ 25 182 93 667 -258 296 -346 -73 23 46 -353 422 154 -330 200 -147 -413 253 -335 56 -6 -531 -152
4102a52n88R3j46R11R66k302J205po03L45L61K46k48j51l71K36K97m64K43R0L43
$$ -152 -740 -647 -793 118 1084 -1218 -13 -20 -623 -278 83 329 81 -70 -441 -205 92 -372 -129 -39 304
4123C04L2k27L7k70n6K39o1j41J52j02M4JK23n69L72R8N0m10m0L91J03j26l77
$$ 304 336 109 146 -124 -180 59 -2 -143 9 -93 -49 -48 175 -394 -22 76 126 -284 -324 67 170 44 -333
4146c33N39k57k08K87j02K09j08j20k48L13J08l29J66j52K27l6J59j28J68j31
$$ -333 206 -51 -259 28 -74 135 27 -93 -341 -28 80 -249 -83 -235 -8 -44 115 -13 155 24
4166B4M30m71j77L62k29j38J12l05pJ09K85P7r8j77J36k12J82R5J30J2k34M0J45
$$ 24 454 -17 -194 168 -61 -199 -87 -392 -399 -290 -5 72 -26 -203 -67 -279 -97 -2 128 140 -94 -54 91
4189I1m10K54M29m63j7J4L06k2j08k32K42m7k9j68J88p8J26J51m11L25j93j17
$$ 91 -319 -65 364 -99 -116 -102 204 182 74 -158 84 37 8 -160 28 -50 76 227 -184 141 -52 -169
4211a69J82r9J04k86L95j31N03l05k76K09M57j339P85N92m91k99l2l11O71l13
$$ -169 13 -86 18 -268 127 -4 499 194 -82 127 584 -755 30 622 131 -168 -200 -511 160 -153
4231a53K53P76j350M76j448J139m9O7R02n25ON2l31k3K71n7J56k82J40J39Mj44
$$ -153 100 876 -474 2 -1446 -307 -356 -289 613 88 94 146 -185 -208 63 6 162 -120 20 159 163 19
4253A9m3K47j40o7k90J59j63L11j48K0K27n3o9n4K09j37K43k78j89J71j25K51
$$ 19 -24 223 83 16 -274 -115 -278 33 -115 -95 132 79 10 -44 165 28 271 -7 -196 -25 -150 101
4275A01p2m15M53q9L65k75n0K58m00O1RK68m0j43M76m05M00n43M3K23L8m27k7
$$ 101 29 -386 67 -22 343 68 18 276 -124 -63 -54 214 174 31 507 102 502 -41 2 225 263 -164 -191
4298a91P87m84j73j12J44j10L44k26M29o34J79j35L27j98l3J45r3J0J72Q7L04
$$ -191 596 112 -61 -173 -29 -139 205 -21 408 -226 -47 -182 145 -53 -86 59 -34 -24 148 235 539
4319E39j20m31M83o44j37L89p7K95l15k18K74l74O55o29K63Q2P8j81J87J01l61
$$ 539 419 -12 471 -173 -310 79 2 297 -18 -236 38 -336 319 -310 -47 35 113 -68 119 220 -141
4340a41l1J80J14k88L15j56J18k65J79J13j89m7L36k99l1n7K07j87J9q2L08j63
$$ -141 -172 8 122 -166 149 -7 111 -154 25 138 -51 -98 238 -61 -92 -149 58 -129 -110 -192 116 -47
4362d7p8L4J30K5r0RQ9L5k04J19j03J1K46k34K34L7j30Q3k18J05j65l4j58K22
$$ -47 -125 -91 39 64 -26 -17 72 107 -97 22 -81 -70 176 -58 176 213 83 166 -52 53 -112 -146 -304 -82
4386h2j48N03j35q3j39k1K10j57J04J56j28k97J48J37MR0l08K0K09j48j11J33
$$ -82 -230 273 138 55 -84 -105 105 -52 52 208 80 -217 -69 68 72 162 -146 -126 83 -65 -176 -43
4408d3j65K87j21K55m53J84J2o5O8K6m1K68k25P9j69J09K3j6Rj11R0Mk8jj14K74
$$ -43 -208 79 -42 213 -240 -56 -44 -109 -41 -15 -56 212 -13 66 -103 6 29 13 22 -89 1 5 -23 -24 -138 136
4434A36j38J11k22P4L70n68J31J25r3P0J47k52Q1P0j80K10l10J60R8j67P9J73
$$ 136 -2 109 -113 -39 331 -237 -106 19 -74 -4 143 -109 -28 42 -138 72 -238 -78 20 -147 -68 105
4456A05O7j11j68J53J58l09J92k07J96q1j56J38J39k4K55k99K15k90OK6J06J3
$$ 105 172 61 -107 46 204 -105 87 -120 76 -5 -161 -23 116 92 347 48 263 -27 -21 5 111 124
4478A24j66q8K70O1k73j17J34lK8J11j89j63J89K85k50j8J93R6j33L9j40k6Rj65
$$ 124 -42 -130 140 201 -72 -189 -55 -58 -30 81 -108 -271 -82 203 -47 -65 128 224 91 130 -10 -36 -27 -192
4502a92lL01k14L36q6K39m13N6pJq0OK3P5Mj30J65l6K0K1j53Q1lj07J20j86J62
$$ -192 -195 106 -108 228 142 381 -32 24 17 18 -62 -56 -33 42 46 -84 81 45 65 86 -67 14 11 -96 24 -162 0
4529@q4l7K1L08K90n55O5K25q0k17J49K3j33J74k82L2J09K5j7j23L09k09jq2j40
$$ 0 -84 -121 -100 208 498 -57 8 233 153 -64 85 108 -25 149 -133 -101 8 33 16 -107 202 -7 -8 -90 -230
4554b30M38Pj69K1o2O1j47J06L0L0j15J41k69K72J64k40j09K18j10k2p9O3QJ52
$$ -230 208 215 46 67 5 66 -81 25 55 85 -30 111 -158 114 278 38 -71 147 37 15 -64 -1 7 159
4578A59k60K80j43j00nJ40p4Q6O2K5p4j03k02J07P5J14N7q3j77K41o3n0Kq8r3
$$ 159 -101 179 36 -64 -69 71 -3 83 145 170 96 -7 -209 -102 -27 87 144 61 -116 125 62 12 14 -74 -167
4603a67l6K37K02l90O8J51N9j4k69j0J70M1p6K5j48K39j66o6L35k49J63K4j69
$$ -167 -203 34 236 -154 -86 65 124 110 -159 -169 1 42 -34 -9 -157 82 -84 -150 185 -64 99 123 -46
4626d6J2n3Q0j61M51m66R6K1N6J17j16k4J18K3j23K10l08J43k31K26j8m1o9J71
$$ -46 -34 -87 -7 -168 283 -183 -87 -66 -10 107 -9 -33 85 108 -15 195 -113 30 -201 25 7 -34 -103 68
4650F8M3O8j74J01l53R3l28J85M10l64J62L16r87P54k41k63O54O5n94J47M71l09
$$ 68 111 179 5 106 -247 -154 -482 -297 113 -251 -89 227 -760 -6 -247 -510 144 209 -385 -238 233 -76
4672g6J52m46L52p7L14l58O6o9J56k18J93k45J44k8L10j95j31j11O18k04j39J15
$$ -76 76 -370 -18 -95 219 -139 -73 -142 14 -204 -11 -256 -112 -140 170 -25 -156 -267 351 147 8 123
4694A23K66r4j69Q2R4l22q9l6J03l4j25J56j97J78pK1j50J85K81l01K66l57J3
$$ 123 389 295 126 208 302 -20 -109 -145 -42 -76 -201 -45 -242 -64 -71 -50 -200 -15 266 -35 231 -126 -113
4717a13J54j31K21l63J71K01j24j50J04o6K9K22j63L4J01k0j78m2K60r4j37N1
$$ -113 41 -90 131 -232 -61 140 16 -134 -30 -96 -67 155 -8 26 127 107 -71 -113 147 53 -84 -33
4739c3k23K27L7k66K10L9J05k50J95l2O5Oj70J50j67N1j1M4j21P1J96Q4l07K5
$$ -33 -256 -29 8 -258 -48 -9 96 -154 41 9 74 80 -90 60 -107 -56 -67 -23 -144 -73 123 207 -100 -75
4763g5r2K97j2k26J96l07J51n2M57n91P7J56M1K4j41q2O4L55k40r0J15q5K56n9
$$ -75 -167 130 118 -108 88 -219 -68 -120 337 -254 -177 -21 20 44 -97 -179 -115 240 0 -90 25 -60 196 137
4787A37l63K24p2K67k42K19r8j31Q3l47K38K54j68J38j71N6o1J69J51j88r8m2
$$ 137 -226 -2 -74 193 -49 170 72 -59 24 -323 -85 169 1 139 -32 24 -37 132 283 95 -3 -45
4809d5J32n9q3n8Q5J77K1l88N9n1J94j83J30K52k39q9m0K02q1L7N5q7Q5m9M7j73
$$ -45 87 28 -55 -113 -28 149 170 -218 -159 -210 -16 -199 -69 183 -56 -145 -185 17 -64 -27 28 -59 26 -23 24 -149
4835a49Lk0J25l8j8L3k52M09M0j13k7j67N1O7J63k32K56k85J33M64m65k52L28
$$ -149 -146 -166 -41 -79 -97 -64 -316 93 133 20 -7 -174 -123 -56 107 -125 131 -154 -21 443 -22 -274 54
4858E4j47M4O1j33J81j5O5o9r4K37L8j95j48j02J99n9QnJ60j01K20l29k4J57j
$$ 54 -93 -49 12 -121 60 45 110 41 -53 184 222 27 -121 -223 -24 -83 -75 -80 80 -21 199 -130 -154 3 2
4883BLn7o7N8K14j24k2o0K83j07j55j57J70J25k89J85J7L1o9N8n5K1r2Q4k08K76
$$ 2 5 -52 -119 -61 153 29 7 -53 230 123 -32 -189 -19 106 -183 2 19 50 -19 39 -16 5 -87 -3 -211 65
4909F5k61K45r4R1R8j91K0k40K66m1R7o0o9K8J34j60l1J6J51k7k2Q8j25P5p0j9
$$ 65 -196 49 -45 46 144 -47 -27 -267 -1 -42 55 -5 -74 -46 88 -72 -103 -87 64 37 15 103 -22 53 -17 -36
4935c6P6j27J08Kj46J0O2J47R8l38L10j40j63K22k65K46M3O0l65K62q9l4K65j4
$$ -36 40 -87 21 23 -123 -113 -51 96 194 -144 166 26 -137 85 -180 66 109 169 -196 66 -23 -57 208 194
4959A94N7k23j45J02m7O7N0j12j81K71l17M50o3k66M0Q1J25k28K14P7j67O6J83
$$ 194 251 28 -117 -15 -62 5 55 -57 -238 33 -284 166 103 -163 -123 -42 83 -145 69 146 -21 45 228
4982B28j34kj43k42O3J03j0J47Q4M7M0j00j27J92l9k14q4L46k51Q7R1l8J1n3J05
$$ 228 94 92 -51 -293 -230 -127 -137 10 94 141 181 81 -46 146 107 -107 -191 155 -96 -9 82 44 55 2 107
5007A07K4k78K37l07K63m9P5j20J06koK0r0K00k62J32l35K53j66K69K9Q9j86m4
$$ 107 131 -147 90 -217 46 -3 72 -48 58 56 50 70 -20 180 -82 50 -285 -32 -198 71 100 189 3 -41
5031d1l46M91o8j7l80P03k63k04O34r27Q56j60L01r1P4m93j44M49j3k70J37k59
$$ -41 -387 104 36 19 -361 342 79 -125 509 -418 438 278 579 488 562 69 -75 374 361 91 228 -31
5053c1r0J44O8J3j15J33j90q3Np4J61P4J8j02J55l6J73R4m75M95k42j03J20J15
$$ -31 -121 23 91 104 -11 122 -68 -151 -146 -220 -59 15 33 -69 86 50 223 317 -158 337 95 -8 112 227
5077B27j07J29r5Rm19M73L9p1K68m87j72K69J25j43J74m40L52k07O8J94p2k5j08
$$ 227 120 249 154 163 -256 217 256 185 453 -34 -206 63 188 45 219 -221 131 -76 -8 186 114 89 -19
5100a9O3J2j80r8K04LJ59k7m8j93O2K97k69K06j5j66j1j57J86m9P6j7N3j17J36
$$ -19 44 56 -124 -222 -18 -15 144 117 69 -124 -62 235 -34 172 157 -9 -20 -177 9 -40 36 19 72 -45 91
5125I1Jl56K42k11J65J40J50k69N5k92L1L74j01l78O18m16K30j13P9k01L49j35
$$ 91 92 -264 -22 -233 -68 72 222 -47 8 -284 -253 121 20 -358 260 -156 74 -39 40 -161 188 53
5147E3k20J9J39o4K76j61k77R8M0N8J1P5r9M4J00J03l60K06J1n5p5R2j56Kp3J65
$$ 53 -167 -148 -9 -73 203 42 -235 -137 -97 -39 -28 47 -52 -8 92 195 -165 41 52 -3 -78 14 -142 -140 -213 -48
5173d8rK91j26j85J89n5P8m30N71j52J5m39M02J9j65J47l88L60N7l24K15j2KJ53
$$ -48 -57 234 108 -77 112 57 135 -295 276 124 139 -300 102 121 -44 103 -285 75 132 -192 23 11 13 166
5197A66j58j8Q7j88J36P8j10J60l52K74k14M79k77J34k02R9j5j41J24k00J18O8
$$ 166 8 -10 77 -111 25 103 -7 153 -199 75 -139 340 63 197 -5 94 79 -62 62 -138 -20 48
5219D8Q4j87N3K9J5P4m34L11J04r5J06M1k96N5M1p4J54Q2M1j36K4k16L40r1k22
$$ 48 132 -55 -2 27 42 116 -318 -7 97 2 108 149 -147 -92 -51 -125 29 111 152 16 40 -176 164 73 -149
5244a49L18N3k03j12J64J0o9N2L2n5k10M93j12k80J58q9O8o3k1j13Q4J47J06k93
$$ -149 169 222 19 -93 71 81 12 64 96 41 -169 324 212 -68 90 1 69 6 -15 -128 -44 103 209 -84
5268h4n2K60l57J35M3R3j05N17n68O8J37p5L3j26O7J68k92N7j33M49k04j21K86
$$ -84 -136 124 -233 -98 -55 38 -67 450 -118 -50 87 12 45 -81 -14 154 -138 -81 -214 235 31 -90 196
5291A96j78j9m4J89j91n5Q2Q3k16J85K31l14J24P9j13r7Q8j04J34j32j15K89p3
$$ 196 18 -1 -45 144 -47 -102 -20 63 -153 32 263 -51 73 152 39 -58 30 -74 60 -72 -187 102 29
5314B9P3j2j95J17K49l68k08R0j20L03j3k2j52J62lo4O0J29j14K0J13j58L14j81
$$ 29 102 90 -105 12 261 -107 -315 -225 -345 -42 -55 -77 -229 -67 -70 -134 -74 55 -59 -39 74 -84 230 49
5338D9l9l0J94j30j25J74J84j38l7j42P7n1j0R0J66j01k93O7N8j18L9J26J71l17
$$ 49 10 -20 174 44 -81 93 277 139 102 -40 37 -14 -24 66 232 131 -162 -95 -37 -155 -116 10 181 -136
5362a36l4K48j63O4pR3k94L74k02J51L0k16J41J13r7K7j81L1J10k61L54j69J64
$$ -136 -170 78 -85 -21 -28 65 -229 145 -57 94 124 -92 49 162 65 92 -89 -58 52 -209 145 -24 140
5385A40ml67K21p0R0r3k5K42l65K20O0nL8j84K39n2R3j65o4p8L09j3l39J35m2
$$ 140 136 -231 -10 -80 10 -83 -108 134 -231 -11 49 44 82 -102 137 85 178 13 -51 -129 180 167 -172 -37 -79
5410g9J39n51P08o75M23N70m56j02L75n97M89m20L70k4n69K57O1K43k61n37L97
$$ -79 60 -491 217 -458 -35 535 79 -23 352 -245 244 -176 194 170 -399 -142 -81 162 -99 -636 -239
5431b39L41o91R80p16K45L55m12o4M14j8j33N4k65J08j9j66J23O9K93m44M61r2
$$ -239 102 -589 391 -325 -80 275 -137 -201 213 195 62 116 -149 -41 -60 -226 -103 -34 259 -185 276 184
5453A84k76L19k61J09r0P5p1L6O9j69J12j25K43l18J89rj6N8k1q2j5j3R5k80L22
$$ 184 -92 227 -34 75 -15 60 -11 25 94 -75 37 -88 155 -163 26 17 1 59 38 -44 -59 -72 23 -257 65
5478F5n9j13p0L13p5q8n5j20Q0J82l98M24J71k13j15O1K32l74J86P4k27j35L20
$$ 65 6 -107 -177 136 61 -27 -82 -202 -122 60 -338 86 257 44 -71 -10 222 -152 34 108 -119 -254 66
5501F6j37LL3J43J9o5j50K26j63j25K6J09P1N5J02r8j9k52Q4K36J7j18j42J36
$$ 66 -71 -68 -35 108 127 62 -88 138 -25 -150 -124 -15 56 111 213 115 96 -156 -72 164 181 63 -79 57
5525E7k79K91L4o6j17J79j52K79k78R6J92k69L8n8K07k55J07N7m13J32J78J47
$$ 57 -222 69 103 37 -80 99 -53 226 -52 44 236 -33 5 -53 154 -101 6 63 -350 -218 -40 107
5547A07o6j54J63p9j3j54L70m30M58j98r0M5J02l6J09j3k54J51j10M7P4rl4o6
$$ 107 41 -113 50 -29 -42 -196 174 -256 202 4 -86 -41 61 25 134 121 -133 18 -92 -45 29 20 -14 -80
5571h0J07O9j98j13P4j81j5N21l1Q9j77m6J3l06M20p0P3K75j88o47j53P78j86
$$ -80 27 96 -102 -215 -141 -322 -337 184 153 242 65 19 32 -274 146 76 149 424 236 -411 -564 214 28
5594B8m5J58k74J66l25L78J27j91k9Rj04J00J21K6O1J7l94q3l00R89l61l94L86
$$ 28 -17 141 -133 33 -292 86 213 22 -7 2 -102 -2 119 145 206 223 -171 -254 -554 435 74 -320 66
5617F6O9p0l47N78J72m04j36o7N3K02j99j15R4L55p78P80k82j3J76j35n9J98j63
$$ 66 135 65 -282 296 468 64 -72 -139 -86 116 -83 -198 -104 251 -527 253 -29 -42 134 -1 -60 138 -25
5640b5L48p60O40j46n61JJ090k36o19m48L01R54n21k31M07J11j90j7R9o00O11
$$ -25 323 -437 203 57 -504 -503 587 351 -268 -716 -415 539 18 -213 194 305 115 98 197 -403 208
5661B08j90M1k76J23M23l14l15N84k82M02j23n08L07k6K0J05k52NLk8R0n8K40
$$ 208 18 59 -217 -94 329 15 -300 284 2 404 281 -227 80 54 74 179 -73 -68 -65 -93 -3 -61 179
5684A79l4p8k06K37M5l82L11p1j77L6J28j25J85J31j81j68J87K3J14k49m5L53
$$ 179 145 67 -139 98 143 -239 72 1 -176 -140 -12 -137 48 179 -2 -170 17 40 154 -95 -140 213
5706B13k97J76j69m1J86J02k96k1m5M07k36knO4k21L8J57J97k67O0j42K45k9O0
$$ 213 -84 92 -77 -118 68 170 -126 -147 -192 215 -21 -23 -28 36 -185 -147 10 207 -60 0 -142 103 74 134
5730A34m5p0J81k58M0j72L05k18J81k4p5Kj44P9P0L2J58j07m4j77J17K35n80N30
$$ 134 89 19 200 -58 -18 -190 115 -103 78 54 -21 -19 -163 -84 -14 18 176 69 25 -152 -35 200 -380 150
5754A50%l2N3k12J09j5k11J02j69K74r6K98j23m17N49l45J20j35n9K05Q3j83k4
$$ 150 150 118 171 -41 68 53 -158 -56 -225 49 -47 251 128 -289 260 -85 35 -100 -159 46 129 -54 -78
5777g8J22m0j82N00k30m4K05l94P2J04O5J47j30k34J43j43O8J06L2Q5l19K12j14
$$ -78 44 4 -178 322 92 48 253 -141 -69 35 100 247 117 -117 26 -117 -49 57 89 174 -145 67 -47
5800d7o1J40O6j21J9R7q5N5j5p1Q7j78L43m02K91k00R8r7j18NL10N2m79K53j26
$$ -47 -108 32 98 -23 -4 93 8 63 48 -23 64 -114 229 -173 118 -82 16 -81 -199 -194 116 168 -311 -58 -184
5825a84J68R8o1q4Q4rk20K2K23l80L65k92K62J12r5O8n3j15o4K16k60L47J4p3
$$ -184 -16 82 21 -63 21 12 -208 -186 37 -343 22 -270 -8 104 9 77 24 -91 -155 61 -199 148 162 89
5849H9j07r2L4J44j34j49K50J24m02L31J06j89q4R6K49k81Q8L2K20l54j78J69
$$ 89 -18 -110 -76 68 -66 -215 35 159 -243 88 194 5 -79 17 266 -15 73 105 325 -29 -207 -38
5871c8Nj2K4O0K18l37p1J10L4j0L9j41L53l66Q4n0K73j4j11R0m51L33j08J62j80
$$ -38 -33 -45 -21 39 257 -80 -151 -41 -7 -17 22 -119 234 -132 -48 -98 175 161 50 140 -311 22 -86 76 -104
5896a04J73j8j91J99k6k36K61j6M2P5j09k12J58K54k43J79k21L9J03l66J22J93
$$ -104 69 51 -140 59 33 -203 58 42 84 159 50 -162 -4 250 7 186 -35 4 107 -259 -137 56
5918E6j02J43p8n6J54j45J48k09L16n6m49L76j71R4K05k65J44k8j01J4k51M37
$$ 56 -46 97 19 -37 117 -28 120 -89 227 171 -278 98 -73 21 226 -39 105 77 -24 -10 -261 176
5940A76k02O8R5j29n8R3j50j2J53K6Q0k92L29n9l22K91J9j7p0r3J74l3J33l26
$$ 176 -26 42 137 8 -50 43 -107 -119 34 60 140 -152 177 118 -204 87 106 89 19 -74 100 67 200 -126
5964a26K28l85L24j29R4oj52J32J86j25n8R3K1j29J78j54J26J01j14j73R7R1p3
$$ -126 102 -283 41 -88 6 0 -152 -20 166 41 -17 76 97 -32 146 -8 118 219 105 -68 29 120 47
5987D7J59j48k18K92k8j09q5j32M36n49L36J44k68P1p6J70N8j22J63q4j38P3J25
$$ 47 206 58 -160 132 104 -5 -90 -222 214 -335 1 145 -123 -52 -128 42 100 -22 141 57 -81 -8 117
6010A17r2j69j73M46j25J93m75M33k68m7L03k25N8m5P9p7J59o4K6p0k3r5L77k06
$$ 117 25 -144 -317 129 4 197 -278 155 -113 -160 143 -82 -24 -69 10 -67 92 28 54 -16 -39 -134 243 37
6034C7L0l80O13m81K81l5L4m7l01J21K94k61J74r0j12k3j14J89O7Q5J90p8l20
$$ 37 67 -313 300 -181 100 65 99 52 -249 -128 166 -95 79 -11 -123 -146 -260 -71 -4 81 271 193 -127
6057a27Nq0L95k47L2j07j33K9J10RK1J48K7Q8k87J17J38j9k18K01j10n2J67l28
$$ -127 -122 -202 193 -54 -22 -129 -262 -233 -123 -114 -93 55 82 170 -117 0 138 119 -99 102 -8 -60 107 -221
6081b21P9J14j21M1nR6J8k09J92Q5Qk00K44j66J29j55l8p9K31M7k08J65l1l6L5
$$ -221 -142 -28 -149 -108 -113 -17 1 -208 -16 69 77 -123 121 -45 84 -71 -109 -188 43 90 -118 47 16 -20 15
6106A5o9M8p9j22O9K7K1K35r0R0j87MJ51k10o3J46o2J63r9M4k9L9m8p5o0L23N7
$$ 15 -54 -6 -85 -207 -138 -111 -90 145 55 145 -42 -38 113 -97 -160 -14 -76 87 -12 32 3 42 -6 -81 -141 182 239
6133B39j85k22K83j14j12R8K20l11L71k85O8k82J73K49J55l89J74j10j18M8NJ71
$$ 239 54 -168 115 1 -111 -13 207 -104 267 -18 50 -232 -59 190 345 -44 130 20 -98 -50 -45 126
6155A26k92P1O5J32J4j29J53k47J78n7j78J1j92M08k8j28J82K23j31k7j14j51
$$ 126 -166 -95 -30 102 116 -13 140 -107 71 14 -164 -153 -345 63 35 -93 89 312 181 154 40 -111
6177a11q8O1M60k47N2k00M3J24L4k2j37lj99J67O8j28L8R7j24k4J79P2j58k7J14
$$ -111 -199 -138 322 75 127 -73 -30 94 128 106 -31 -34 -233 -66 2 -126 -88 9 -115 -139 40 112 -46 -73 41
6202D1m1L12l37K06j10k72L38j83P8j92JJ06J01N8j33J09j24n1K27l70J26L57
$$ 41 0 312 -25 181 71 -201 137 -46 32 -160 -159 -53 48 106 -27 82 -42 -93 134 -236 -110 247
6224B47k03J46j53j90J66Q8j10P1n2k0Q6k45J22J09O4j68J54m90M36p2J47j97
$$ 247 44 190 37 -153 13 101 -9 62 10 -10 76 -169 -47 62 126 -42 112 -378 58 -14 133 -64
6246f4K6q3K69j54N8O2o4j32m3J54q3n1J81l12L09J82j9K3n01M50k95L49k63J98
$$ -64 -38 -121 148 -6 52 114 50 -82 -125 29 -54 -105 76 -236 73 255 236 259 -242 208 -87 262 -1 197
6270A97o43M85k23l52R92n91j52p2Q04q40P0Q8M31j49j91j2J32m1M2j32L33j25
$$ 197 -446 39 -184 -536 456 -135 -287 -359 445 -395 -325 -237 194 45 -146 -158 -26 -67 -25 -157 176 51
6292E1k18P8K64j20J78k58O1Q7j81j34l8K25%p1K64p4k80L58m27K94j23J65j20
$$ 51 -167 -89 175 55 233 -25 36 123 -58 -192 -230 -5 -5 -76 188 114 -166 192 -235 59 -64 101 -19
6315a9r9qK38K14l08o0J74j81J04k4L47m39p0M4J07J16k40J23J6M3r3j38k34L42
$$ -19 -118 -126 112 326 18 -42 132 -49 55 31 378 -61 -131 -87 20 136 -104 19 35 78 -15 -153 -387 -45
6339d5L27n79L39l69K3J76Q42p43R8j14n08O04Jl57P26p41J22M80m19J08O4m50
$$ -45 282 -297 42 -327 -304 -128 714 -29 69 -45 -553 51 52 -305 421 -320 -198 282 -137 -29 35 -415
6361d15K67J29lQ0j21P6J21j97j0K06j99k30L26j4j32J09j12K1L90m15J98Pk5
$$ -415 -148 -19 -22 58 -63 13 134 -63 -73 133 -66 -296 30 16 -116 -7 -119 -98 292 -123 75 82 57
6384E7r9j46J51j6o5M1K21j37K03J1k99P3k6n8L87k78j00Q6k01J89R9M0j51O3
$$ 57 -42 -188 -37 -53 -118 -77 144 7 210 221 -78 -5 -31 -89 298 20 -80 6 -195 -6 93 133 -18 45
6408D5j8n5K6n1Q1M1p8L7O4k23J27m5L7j61K38R1j72J06k41o8J91k5J12j22j09
$$ 45 27 -28 -2 -53 28 69 -9 28 92 -131 -4 -49 -12 -173 65 156 -16 90 -151 -219 -28 -53 59 -63 -172
6433a72J2L2J30j20L03k05L1o5p0J20j26J1L50l62R2N7J43j53q0p0N4k9L7J75
$$ -172 -160 -128 2 -118 185 -20 11 -54 -124 -4 -130 -119 231 -131 -39 18 161 8 -72 -142 -88 -117 -80 95
6457I5k32K75j91m8j34J70J42j70K85k76l3K18n5J06J9j7Pk00J42K5J1p4L5l74
$$ 95 -137 138 -53 -101 -235 -65 77 -93 192 -84 -117 101 46 152 171 154 161 -39 103 128 139 65 100 -274
6481b74J83K5R8K8k77K12P8M2J79r5k4o76O12l86J37P28Q9o50l10L07J98j97L03
$$ -274 -91 -66 32 60 -217 -5 73 115 294 199 175 -501 111 -275 -138 590 679 29 -281 26 224 27 330
6504C30o68k30J069n10Q6k76J40J64K3k95P7J69j82m1K44k52J78q5qm3M6K96q5
$$ 330 -338 -568 501 -9 77 -199 -59 105 128 -167 -90 79 -103 -144 100 -152 26 -59 -67 -110 -64 232 147
6527A47J16k45J67r4K11k80o0J21m7J53j78n5k4J9J11j13M1k4K75k36j63M05j60
$$ 147 263 18 185 91 302 22 -38 83 36 189 11 -44 -68 -49 62 -51 -10 -34 241 5 -158 247 87
6550H7o7l1k7J74J59j62Q8k75J43k85L24k58P0J83k00K6r4Q0Q9J6J22k52J42j45
$$ 87 20 -11 -38 136 295 133 221 -54 89 -196 128 -130 -60 123 -77 -51 -145 -65 24 40 162 -90 52 -93
6574i3j66L52k01K39r9J32J8k11k7K18q7jj37K54j15r7K25j81j45J48j20k18K00
$$ -93 -259 93 -108 131 32 164 182 -29 -56 162 75 74 -63 191 76 -21 204 23 -122 26 -94 -312 -112
6597a12M1J19J65k36K50j98j78K75l8Q0r5r5J3j06J08J76j82j86L40n5k6o0N6
$$ -112 -71 48 213 -23 227 29 -149 126 88 168 73 -22 -9 -115 -7 169 -13 -199 141 86 60 0 56
6620E6j37L9mJ70k16K75l9l1j10oJ43k93N5M4Q0nL5j11j90J73Q4n2J05J22l06
$$ 56 -81 -42 -46 124 -92 183 144 113 3 -3 140 -153 -98 -54 26 21 56 -55 -245 -72 12 -40 65 187 -119
6645a19L3P5p6J64o7J10k14K1n7J28J16Q9k76L00k10P0l45J71J37K34j15k76L8
$$ -119 -86 -11 -87 77 10 120 -94 -73 -130 -2 114 203 -73 227 17 87 -258 -87 50 284 169 -107 -69
6668f9K57k92Q7%K20p2jr9q9j4K1K33l51M92k30k4N9k11k18J26J29Q9j95J19l2
$$ -69 188 -104 -17 -17 203 131 130 31 -58 -72 -51 182 -169 323 93 69 128 -83 -301 -175 -46 43 -152 -33 -65
6693f5K8K39k56Q6k42J11K6K66k75L02k82n8j2k37L33l1j94J34K62k76L08k99
$$ -65 -37 202 -54 32 -210 -99 -73 193 -82 220 -62 -120 -132 -369 -36 -67 -261 -127 135 -141 167 -132
6715a32L53k82J63L3Q9qn3m8k1r9J5J0o0N3P3m2O5J27k11p4J59p0pK1q5L27m09
$$ -132 221 -61 102 135 224 216 163 115 94 -5 10 20 -40 13 86 44 109 236 25 -49 110 40 33 54 -31 296 -113
6742a13j11K43j08P4J67k24M7K22j48J70k30O8k00L0R6j88J89Q4r7j78L2L96k37
$$ -113 -224 19 -89 -15 152 -72 -25 197 49 219 -11 57 -143 -113 -17 -205 -16 68 -29 -207 -175 221 -16
6765a6k8L5j42K86l60L65j93n2K45l03J62K4p2J89k01j6P8L26k18j28J27j12M0
$$ -16 -44 -9 -151 135 -225 140 -53 -105 140 -163 -1 23 -49 140 -61 -77 1 327 109 -19 108 -4 36
6788C6ok7r7K68j91j32J27k39j8J91J55Lj15l3L98l37j38K1L38k63l9J37j01K55
$$ 36 30 3 -94 174 -17 -149 -22 -261 -279 -88 67 70 -45 -78 320 -17 -155 -134 204 -59 -98 39 -62 193
6812A93j79R3k37jL3j18J99q0NK79L24m91P1M7j67j39NK53m6o6M9j88K06J52k25
$$ 193 14 107 -130 -131 -98 -216 -17 -97 -92 187 511 20 91 138 -29 -168 -163 90 44 -22 27 -161 45 197 -28
6837b8J05J02m99M11j17P4k51K1J27J31J54k56K6K10l65oK06r8MM8J59J38q3k57
$$ -28 77 179 -320 91 -26 48 -203 -182 -55 76 230 -26 0 210 -155 -161 45 -53 -49 -1 158 296 213 -44
6861d4K02r1j1O3k82K58N0j11j14j25N38k34j5K0k10O2j20K51q6L2M13m55j27
$$ -44 158 67 56 119 -163 95 145 34 -80 -205 333 99 84 104 -106 -44 -164 87 1 33 446 -9 -136
6884a36K13k78K44O4r0j01J04L3R6q6j90L13j62N9k38O6J05n5j07n1L31O0k24
$$ -136 77 -201 43 107 17 -84 20 53 149 63 -127 186 24 83 -155 -89 16 -39 -146 -197 134 194 -30
6907c0J25k67N19n83K25J79l46J40K92k51n56J43R76n25q1L27K0n40j3K08l36
$$ -30 95 -172 347 -236 -11 168 -178 -38 254 3 -553 -410 566 41 -40 287 307 -233 -246 -38 -374
6928c74O73l15L31n15M40l0l49k2J49q7K30J4j83j47L39k34P6j92L33j25oOj4
$$ -374 299 -16 315 -200 240 210 -139 -161 -12 -99 131 145 -38 -185 154 -80 -4 -196 137 12 6 12 -2
6951bm2j8O7M0j54J83n7J5j34K22K9j85j40K84j65j8L00q8k47n3q9Q1K50j17L0
$$ -2 -44 -62 5 45 -109 74 17 32 -102 120 149 -36 -176 108 -57 -75 225 137 -110 -163 -252 -171 79 -38 -8
6976hJ55j29J4j44J52J44k01R2j07q3K68j30k7J7q5L7K00j16k44mN26k01j67K8
$$ -8 147 18 32 -112 40 184 -17 75 -32 -115 153 23 -4 13 -72 -35 165 49 -195 -199 327 126 -41 -13
7000a3Q7k9M2lr9P2k39J51m9k3L04k01L3j70J01J77J27l22R3J78k60jJ34l49p
$$ -13 74 45 87 84 -15 57 -182 -31 -80 -103 201 0 33 -137 -36 141 268 -54 39 217 -43 -44 90 -259 -266
7025b66J02J67j25Q7r0J5J79l0J41o9k09M0L8M1K22k03L53o56J31j04L3J49J08
$$ -266 -164 3 -122 -35 -125 -110 69 39 180 111 -98 -58 -20 21 243 40 393 -263 -132 -236 -203 -54 54
7048E4o4rMJ16l48j57K96L27j02O0k26K21k00K40k11L73l70l68L24j5J60j56J00
$$ 54 -10 -19 -15 101 -247 -404 -108 219 117 177 -49 172 -28 212 1 374 4 -364 -40 -55 105 -51 49
7071D9j5M8j06k7K30k40K55m8k56K11l65L02J86j75j60R3R7j15R7J54l4l14J47
$$ 49 34 82 -24 -51 179 -61 194 146 -110 101 -264 38 224 49 -111 -18 79 -36 61 215 181 -133 14
7094A4J72k40N9J10m61N82j22l11O23l62j64K06J74o03M77q4m68M29k39J80j01
$$ 14 186 -54 5 115 -346 236 114 -197 426 64 -100 106 280 -323 154 70 -398 31 -208 -28 -129
7115a29J71J23k00k6j20L85j45J54J70n75j9L62K37o09K54m28N29o5n93Q05j47
$$ -129 42 165 -35 -61 -181 204 59 213 383 -192 -211 151 388 -221 33 -395 134 69 -524 281 134
7136A34J32l99k28J66J06K55J32l79Q3k0K01l49j20K33K34k67l4K67J4m08J15
$$ 134 266 -133 -361 -195 -89 166 298 -81 2 -18 183 -166 -286 -53 181 -86 -120 147 161 -247 -132
7157a32Q4K12j38j9l5J67k16pJ6j14j60n6K78K34j75m8K7j97K60J98q9J27j96
$$ -132 -48 164 26 7 -28 139 -77 -84 -68 -182 -342 -398 -120 114 -61 -109 -82 -279 -19 179 90 217 21
7180B1L1m0p4M7Q7j29j69J61k4K6J15n0K74k95J91l55J49o6J99O0k73J63O1m0
$$ 21 52 12 -62 -15 72 -57 -226 -65 -89 -63 52 2 276 -19 172 -183 -34 -100 99 159 -114 49 110 70
7204G0k6j7k08J34J08l5Q7j37N7m4Q0j43J57j44J67k02j40L17J7n8l48J77L4P5
$$ 70 44 27 -181 -47 61 26 113 -24 33 -11 69 -74 83 -61 106 -96 -236 81 98 40 -308 -131 -97 -22
7228b2J50k65J47N0m8j85J32k9n1K36J11n4Jj7r0n9k15N02l14J49jp6J60m29L14
$$ -22 128 -137 10 60 12 -173 -41 -70 -121 115 226 172 173 156 66 7 -208 294 -20 129 128 52 212 -217 97
7253I7j32JJ86k72l0R1O3J6K25L0j10k52k7P1JK11j61j37N3Q6j86j10K92m6J4
$$ 97 -35 -34 152 -120 -150 -59 4 20 245 275 165 -87 -114 -43 -42 169 8 -129 -76 10 -176 -286 6 -40 -26
7278b6K17j33j31L1j29L15k24Q3o3N3q6J27j09o1M0j94P6K12J82p6l19K24M9J0
$$ -26 191 58 -73 -42 -171 144 -80 3 -60 -7 -93 34 -75 -136 -96 -290 -214 -2 180 104 -215 9 58 68
7302F8R7j93r5K42k31K48n5p0R0k04J11j05M1kJ46J5P4k79J84Mj48K12m41M26
$$ 68 165 -28 -123 119 -112 136 81 11 101 -103 8 -97 -56 -58 88 103 177 -102 82 86 -62 150 -291 135
7326A35k02M9k6L7k4m8J08K4j38K03p1k95j0K06j0k03Q4K54j63R7K8n2p2L4L6
$$ 135 -67 -18 -44 -7 -31 -79 29 53 -85 118 47 -248 -258 -52 -62 -265 -181 73 -90 7 35 -17 -89 -55 -19
7351a9O9r5J12j76R7K66k87J37j46k9J43j24O8k68K31j69J66K26k31L1k25L90
$$ -19 50 -45 67 -109 -12 254 -33 104 -42 -71 72 -52 16 -252 -21 -190 -24 202 -29 2 -223 167
7373A67o4k73L43k15K06J86l41j7p2J29lOJ13k58q9K31K39k56n38N07K9l8J53
$$ 167 103 -170 173 -42 164 350 9 -8 -80 49 46 52 165 -93 -182 49 288 32 -506 1 30 -8 145
7396A45k76K06n5L2j38k03J24K01j00Q2j14J44p1m3m3J02q2j79M18j56j68J33
$$ 145 -131 75 20 52 -86 -289 -165 36 -64 18 -96 48 -23 -66 -109 -7 -89 -268 150 -6 -174 -41
7418d1M2K60l15O1J6m2M01l24j00L5j8r7L02l89K02l7k28L97o8q2P7j13J11k77
$$ -41 1 261 -54 7 23 -19 382 58 -42 -7 -25 -122 180 -209 -7 -44 -272 125 57 -25 52 -61 50 -227
7442b27K35P5j10k71N45j41k04J33k12J17J70Q6k26J73K5k66Q3K4N7k18J17r2
$$ -227 8 83 -27 -298 247 106 -98 35 -177 -60 110 196 -30 143 168 -98 -15 9 66 -152 -35 -127
7464a27L32J15l88K19n6j50L04j97k15J28K06pj34Qj6Rk15J03K25j49k8Q6j28
$$ -127 205 320 -68 151 95 -55 249 52 -163 -35 171 164 30 38 22 31 -184 -81 144 -5 -33 53 -75
7487g5L02m3k73r6K10M7n3Q8K5q0J56k03k5J67m72K55k42N99k51k0j37K16k53
$$ -75 227 184 -89 -185 25 72 19 107 132 52 208 5 -20 147 -325 -70 -312 287 36 16 -121 95 -158
7510a58J71K53m16M57n51L81o99Q28L0j67k4j38j3J5J07p0q3L5j08R8O4o4j27
$$ -158 13 266 -150 307 -244 137 -562 266 296 129 105 -33 -46 -31 76 6 -77 -42 -150 -52 12 -52 -179
7533a79J88l6r7K04k29K23q9k86J92J27jM0P6j69K6j02LL58k62Q9rJ05k66M31
$$ -179 9 -27 -124 80 -149 74 -15 -301 -109 18 17 57 133 -36 -10 -112 -109 249 -13 76 67 172 -94 337
7557C37n52K45Q8j01J19K10p27Q15l1l56Q2j4J46k83P08j407M17N6K93K04m10
$$ 337 -215 30 118 17 136 346 -381 434 403 47 129 115 261 -22 686 -721 -304 -248 45 249 -161
7578a61k02P23o40Q85n37o7j8j88J23k15K52P7p3o6J46j51M1K94j33j25m4O9J40
$$ -161 -363 360 -280 605 68 1 -17 -205 -82 -297 -45 32 -41 -107 39 -112 -71 223 90 -35 -79 -10 130
7601A30k52K18l19K91k45K93Kk73K54J2k13mJ61j80K65l34J92K9M2J08k55k32
$$ 130 -122 96 -223 68 -177 116 118 -155 99 111 -102 -106 55 -125 140 -194 -2 27 69 177 -78 -310
7623c10K74P9K9o4L0j85R4k87M64k71J16J54j41j92J13o0N10k10l08Q2j13J91
$$ -310 -36 43 72 8 38 -147 -53 -340 124 -147 -31 123 -18 -210 -97 -157 353 143 -165 -83 -196 -5
7645eJ39j97Q5L05j47l94L95m36K76j72R0k5j67M81k48K2j88L37m4m8r9k56N56
$$ -5 134 -63 22 327 180 -214 181 -255 21 -151 -61 -86 -253 228 -20 2 -186 151 107 59 -40 -296 260
7668B60l59l08R74m12l46K72k93M04j68o8l3j8J10k21J55L2K40j41L5j44k8K2
$$ 260 -99 -407 567 155 -191 81 -212 192 24 -44 -77 -95 15 -206 -51 -19 221 80 115 -29 -57 -35
7690c5K18m7k65J55O7q6J37Q8l90K57M5k70R2P3Lk24M00p8L2j01K9j59J92m59
$$ -35 183 136 -129 26 93 7 144 232 -158 99 144 -126 -34 39 42 -182 218 140 172 71 100 -59 133 -326
7714c26L39q8M13l20J19k15l2J25k66M88j58j07ol6K03n1j0j32R5%j69J94j10
$$ -326 13 -75 338 18 137 -78 -110 15 -251 237 79 -28 -34 -70 133 82 72 -60 35 35 -134 60 -50
7737e0Pj48J43K49j08m7k00K94r2j80jn0Q0J49j32jj2m6J84K9o1J34j02J03j22
$$ -50 -43 -191 -48 201 93 46 -154 140 48 -132 -133 -183 -103 46 -86 -87 -99 -145 39 68 7 141 39 142 20
7762B0r9j30L9K38P8j26q1O4k9L3K3l0o8K4P0j62L7J61k88L26k41L09m16M32q3
$$ 20 -79 -209 -170 68 146 20 -61 3 -26 7 30 0 -68 -44 26 -136 -99 62 -226 100 -141 168 -248 184 101
7787A01j34J3P4k66J00M9J73O6k83k15K24Q8J02k06J9j89J28n2M09j06k14K45
$$ 101 -33 -20 54 -212 -112 -63 110 176 -107 -322 -98 -10 92 -114 -95 -284 -156 -208 201 95 -119 126
7809A26j37K94l19J94j35J21k38P7O8j41K62j35k85J96J60j57L8n7J15m4p1K59
$$ 126 -11 283 -36 158 23 144 -94 -17 51 -90 172 37 -248 -52 108 -49 -11 -68 47 3 -68 191
7831A91j40L5k19J15J33m6rJ16k02J18j23p9L8J91k81M4J91p5j85J61r2O3L7k16
$$ 191 51 86 -133 -18 115 69 60 176 -26 92 -31 -110 -72 119 -162 -118 73 -2 -187 -26 -118 -55 -18 -234
7855b34K24j3k1J07Jm4%Q8k48J03j42R9K2L3J1m8K11m84L68Lj17j41J16J93L7
$$ -234 -10 -23 -44 63 64 20 20 108 -140 -37 -179 -80 -58 -25 -14 -62 149 -335 33 36 -81 -222 -106 87 124
7880A24k92L28jj75J29q7Nj88K71N9l02K67K39o27J96J24Ll00J97L4j57N4K95
$$ 124 -168 160 159 -16 113 26 31 -157 114 173 -129 138 377 -250 -54 70 73 -227 -30 4 -153 -99 196
7903A96r2o7Mm5OP3k31K2K11J22k99O6P6j48N9o7R5Q6n3N5o1k9j19J65k30M8K61
$$ 196 104 37 41 -4 2 75 -156 -134 77 199 -100 -34 42 -106 -47 -114 -19 67 14 69 8 -21 -140 25 -205 -157 104
7930A04n4o9k54K58k09K39M7m5q8J85L6M6j71j1O9j4k3J27k49J46q5M6J0J36k94
$$ 104 50 -19 -273 -15 -224 15 62 17 -71 114 150 196 25 14 83 69 46 173 -76 70 -15 31 41 177 -117
7955a17l9O9j50J77j90K51q7J00M6n6j22L89k15q1K41l66J63L4K42m95J43L1J93
$$ -117 -156 -87 -237 -60 -250 1 -86 14 60 4 -118 271 56 -25 216 -150 13 47 289 -206 -63 -32 161
7978A61n03L19l6P2ln4O8J3M1j30j02J80p6K29pk29r7J92N2k13n6J25KR9j28M2
$$ 161 -342 -23 -59 13 10 -44 24 37 78 -52 -154 26 -50 179 172 -57 -154 38 90 -123 -179 -54 -52 47 -81 -39
8004c9j22P1K7J09p3Q9j61J37L4J94l56L32k34j7K8O3k02PJ49j69M07n11K13j29
$$ -39 -161 -90 -63 46 -27 62 -99 38 72 266 -90 242 8 -9 19 82 -120 -113 36 -133 274 -237 -24 -153
8028a53K98j90l9J51L5Q8k45J71%k3N3J1q1LN7j05k44K18K5j7k23K22j50J74j6
$$ -153 145 -45 -84 67 102 190 -55 116 116 93 146 157 76 79 136 31 -213 5 30 13 -210 12 -138 36 20
8053B0o2N9J3M1J46l97K15Op7J18k2j97J16j11L8K59m6lQ9k04j22k2M2n2R0J95
$$ 20 -42 17 30 71 217 -180 35 41 -36 82 60 -137 -21 -132 -94 165 119 116 205 1 -121 -143 -101 -153 -63 132
8079A32J18n07M22j01j73K38k13J50R0J74n76R4O9N7J98j71r1K01l07R1L24j7
$$ 132 250 -257 165 64 -109 129 -84 66 156 330 -246 -152 -83 -26 172 1 -90 111 -196 -105 219 202
8101B02k00Jj23P1K32N4j36j56K6K0p0j08J9L16j11Pj53L67k20R7P5n09K99K21
$$ 202 2 3 -120 -49 183 237 101 -55 -29 -9 -79 -187 -168 148 37 44 -109 258 38 135 210 -299 0 221
8125B21j38k26K63p6L3j69j33K9K06J06k90J80n3ml0l6K70j77K81k67r7P6o2m3
$$ 221 83 -143 120 44 77 -92 -225 -196 10 116 -174 6 -47 -51 -81 -117 153 -24 257 -10 -107 -31 -93 -136
8149a36k4M1K36k04r5r9K94o6M9K07Nj30k2k07J42J86k8j67M2o3k9KK60m64K45
$$ -136 -160 -119 117 -87 -182 -281 13 -53 -4 203 208 78 56 -151 -9 177 149 -18 24 -39 -68 -66 194 -270 -25
8174b5j15L5J31lJ06k94j47L70pj83L14k62k61M31r5K4M0
$$ -25 -140 -105 26 23 129 -165 -312 58 51 -132 182 -80 -341 90 -5 19 59
8191E9
$$ Imaginary data points
##PAGE= N=2
##DATA TABLE= (X++(I..I)), XYDATA
0@%%%%%%%%%%%Qj6J6j6K4l2L2m0M8n6P2q8J04j20J36j60J87k13K46k84L23l65
$$ 0 0 0 0 0 0 0 0 0 0 0 0 8 -8 8 -8 16 -16 16 -24 24 -32 40 -48 56 -64 72 -88 99 -114 132 -152 171 -194
33a94M13m67N28n94O63p40Q27r21J025j138J260j393J538j698J873k064K273k501
$$ -194 219 -248 280 -314 349 -391 436 -485 540 -598 662 -731 807 -891 982 -1082 1191 -1310
51a310K755l039L352l702M097m544N056n651O351p184Q201r475J1116j3324J6464
$$ -1310 1445 -1594 1758 -1944 2153 -2391 2665 -2986 3365 -3819 4382 -5093 6023 -7301 9163
66I163k1311K9805m8823J65219j5214k37994K00954j42677O964J62370r7207N1985
$$ 9163 -12148 17657 -31166 134053 118839 -119155 81799 -60878 -53914 108456 11249 63234
78F3234J2811j96518J07258L6279j3102J16132j29365o1622J11961j27823N7272
$$ 63234 76045 -120473 -13215 23064 9962 126094 -3271 -64893 47068 -80755 -23483
89b3483J60033j33754k1843M2156j19553P2377R7360n6693P000k9755n8757M5398
$$ -23483 136550 2796 -19047 23109 -96444 -24067 73293 16600 23600 -6155 -64912 -19514
101a9514K639L4824N8450r2937l8967M5179m3794N8914P2006r4463N049J8459
$$ -19514 -16875 17949 76399 -16538 -55505 -10326 -54120 4794 76800 -17663 -12614 5845
113E845r6637Q0365P8720p4264K3474k2823o2110O4035n541K7408N4517j14203
$$ 5845 -90792 -10427 68293 -5971 17503 -5320 -67430 -3395 -8936 18472 72989 -41214
125d1214N200N0549p5507Q8849L9761r8186M9471l6981n7451J21532j4796l7972
$$ -41214 -36014 14535 -60972 27877 67638 -30548 18923 -18058 -75509 46023 31227 -6745
137f745M8013p2379k738M2312k9343P5385j1680r5495N9729j5438l4934R8937
$$ -6745 41268 -31111 -33849 8463 -20880 54505 42825 -52670 7059 -8379 -43313 55624
149E5624k8388m2151L9247o3800O293P2904k9849R477k818n3475K9702K608j646
$$ 55624 27236 -14915 24332 -39468 -33175 39729 9880 19357 16539 -36936 -7234 -4626 -6272
162f272N8337m2347l8393L6332l6230J4238O6067m5672j6601K4577m6691J1839
$$ -6272 52065 9718 -28675 7657 -28573 -14335 51732 6060 -10541 14036 -32655 -20816
174b0816M6304j2773N734j8412l3229L1215j069J384L9455l7964j9295K1814l5171
$$ -20816 25488 12715 18449 37 -33192 -1977 -3046 -1662 37793 -171 -19466 2348 -32823
187c2823L3223M6226n7595L585J9282m7838K6538L1004j6725J3722k9340j8630
$$ -32823 400 46626 -10969 -7384 11898 -35940 -9402 21602 4877 18599 -10741 -29371
199b9371L4861j4623J3785K7908m6775M928R500l4403N0767J5969n0685K4471
$$ -29371 5490 -9133 4652 32560 -14215 -9287 213 -34190 16577 32546 -18139 6332
211F332p677l0542M0294K652m882J1461l6865N342J7973j6370L3596k198l9165
$$ 6332 -1345 -31887 8407 11059 6177 17638 -19227 -13885 4088 -12282 21314 19116 -20049
224b0049K5284j1866j8086N0271q311k7260J8794k0885m180K8501p168N533j190
$$ -20049 5235 -6631 -24717 25554 17243 -10017 8777 -12108 -16288 12213 5045 10578 9388
237I388k4338R557J127J991K8013k2608j8247K4621k1315l815L9561j3906j5691
$$ 9388 -14950 -5393 -4266 -2275 25738 3130 -15117 9504 -11811 -15626 23935 10029 -5662
250e662R424j7759N587J9504p683L920l432j5996O800j840J0789J8520k8561m285
$$ -5662 3762 -13997 -8410 11094 3411 7331 3899 -12097 -5297 -7137 3652 22172 -6389 -10674
264a0674J9817k5630Q481L1095k3213l269P061k1133J3918J4198r705O225r183
$$ -10674 9143 -16487 -8006 23089 -124 -3393 3668 -17465 -3547 10651 946 7171 -2012
277b012o962O830o870J7025R440k8851R187N640k1294K3504J0293k2385J0761
$$ -2012 -8974 -2144 -9014 8011 17451 -11400 -2213 3427 -17867 5637 15930 -6455 4306
290D306m283j6207J8583N665m988J795j0418K154J112m812J9843k597j8906J0842
$$ 4306 23 -16184 2399 8064 3076 4871 -5547 -3393 -2281 -7093 12750 10153 -8753 2089
304B089n214q190K2787l769j2191J1357j1101p876J6450K215k424j915p770M681
$$ 2089 -3125 -11315 11472 7703 -4488 6869 -4232 -12108 4342 6557 4133 2218 -5552 -871
318h71k818l51J6779q677j0848R602r905P80J8664j1358l999Q699j3087m67J2183
$$ -871 -3689 -4040 12739 4062 -6786 2816 -7089 -6309 12355 997 -3002 5697 -7390 -7857 4326
333D326o38M99m638n590O071m622L779J1110j1907j870N709j1938Q408J1912j2378
$$ 4326 3688 4187 -451 -6041 30 -4592 -813 10297 -1610 -3480 2229 -9709 -1301 10611 -1767
348a767O45M666j0617L191O416J153J090p973j454M323l750P414L342j0364M566
$$ -1767 -1122 3544 -7073 -3882 2534 3687 4777 -3196 -4650 -327 -4077 3337 6679 -3685 881
363H81l88j0219J1893P079j1518K308Q16n914L784L407J966k50o556R63M15j097
$$ 881 493 -9726 2167 9246 -2272 36 852 -5062 -1278 2129 4095 3845 -2711 -1748 -1333 -2430
379b430Q680k334p159O435l974p382J3245J549q660L589k272l413N181P61J569
$$ -2430 6250 3916 -3243 3192 -782 -8164 5081 6630 -2030 1559 -713 -4126 1055 1816 3385
394C385j103m917K059k520J258R540p313m014P582p725j771J1079l321l156J866
$$ 3385 2282 -2635 -576 -3096 -1838 7702 389 -3625 3957 -3768 -5539 5540 2219 -937 929
409I29m503R93L422L88J430l459m76J047n479O800N524r151P82L239o562L250
$$ 929 -3574 -2581 841 1229 2659 -800 -1276 -229 -5708 1092 6616 -2535 -1753 1486 -5076 -1826
425a826N362k813m48k74k785K77L104K301k049k262J830j839k326O072J857n836
$$ -1826 3536 723 275 1 -2784 -2507 597 2898 849 -1413 417 -1422 -3748 2324 4181 -1655
441a655J049J521m744L583M247m015L35P53l962J672K990K61m53k654J678j134
$$ -1655 -606 915 -3829 -246 4001 -14 321 1074 -2888 -1216 1774 2035 1582 -1072 606 -528
457e28k467O853k49o232M632j609m748P125o13k655K684l291p15J777O12K767
$$ -528 -2995 3858 3609 -2623 2009 400 -4348 2777 2164 -491 2193 -1098 -1813 -36 576 3343
473C343l805j036M005n611J203P316n513r02K444m496J833L167j835N04p70j15
$$ 3343 -462 -1498 2507 -3104 -1901 5415 -98 -1000 1444 -3052 -1219 1948 113 617 -153 -268
489b68j481n98N231r47m399K627l03k448K699J499k072K81L68k589L36M640j555
$$ -268 -1749 -2347 2884 1937 -2462 165 -138 -2586 113 1612 -460 -179 189 -2400 -2064 2576 1021
506A021l025K738o76k480J633J896J94j969k87J011k105K775J844m797K488J531
$$ 1021 -2004 734 58 -2422 -789 1107 1301 -668 -955 56 -2049 726 2570 -2227 261 1792
522A792n742L883K641l010J205r81p35J213j096K580q35k596L714l170j789O716
$$ 1792 -3950 -67 2574 -436 769 -212 -947 266 -830 1750 915 -1681 2033 -1137 -2926 3790
538C790k831k673L415k457l99K393o74L75q30k08M65k071K350K064m333J665J405
$$ 3790 959 -1714 1701 -756 -1155 1238 564 939 109 -99 366 -1705 645 2709 -1624 41 1446
555A446l121J251K272j683k99P82j306q22K137J007k120K15Q15j505j25J547M69
$$ 1446 -1675 -424 1848 165 -134 648 -658 -1480 657 1664 -456 -241 574 -931 -1056 491 960
572I60j185j22P33k235J733K487l617M69K447l235J41K518j048Q9m34k54N35p62
$$ 960 -225 -347 386 -1849 -116 2371 -1246 -777 1670 -1565 -1424 1094 46 135 -299 -553 -18 -780
590g80J433k4k193K547q97k975L829O71k994K054n40j413J621j32p4Q1l40L29
$$ -780 653 629 -1564 983 86 -2889 940 1611 -1383 671 131 -1282 339 207 133 214 -126 203
608B03j553J029K354k210n81J979j650q54K683q06j119J558j108j002J724J24
$$ 203 -1350 -321 2033 -177 -758 1221 -429 -1283 1400 594 -525 1033 -75 -1077 647 771
624G71q63j69N90q1r81P19J560j676l05J533k294N29K713k176l99J666j814k20
$$ 771 -92 -261 329 248 -733 -14 1546 -130 -435 1098 -1196 -667 2046 -130 -529 1137 -677 -897
642h97J253J90l73n07K98K36j224J410P97k248J521L94k675J869J190j764L37
$$ -897 356 546 173 -334 -36 200 -1024 386 1183 -1065 456 850 -1825 44 1234 -530 -193
659a93Q36j230p4J049k45q2n8L15r07j97J777p78j216J323M5j715J408J025j729
$$ -193 643 -587 -661 388 143 61 3 318 -589 -786 991 213 -1003 320 365 -1350 58 1083 -646
678f46R24M58j742J011N80n94l7j74M19n60l53J886j031j020K003j343j145K975
$$ -646 278 736 -1006 5 585 -9 -46 -220 199 -361 -714 1172 141 -879 1124 -219 -1364 1611
696A611j239j241J791p88r73Q69J48L41o88k91R63j134N21J387j869oJ651j953
$$ 1611 372 -869 922 134 -839 30 178 519 -169 -460 503 -631 -110 1277 -592 -598 1053 -900
714i00J67J917j613n1P83l63l42N37J37j33o37N53j26q22J128M02j124L52Q17
$$ -900 -733 1184 -429 -480 303 -60 -402 135 272 139 -498 55 -71 -893 235 637 -487 -135 682
733F82j619P68J285j505j24J353j186k65Q58m23L37j93J16n99P7J042J58j603
$$ 682 -937 -169 1116 -389 -513 840 -346 -611 247 -176 161 -32 84 -515 -438 604 762 -841
751h41J208J00j686J679L91j394N23L51r71L17N44j04k00p4L76m40l24R89l34
$$ -841 367 467 -1219 460 851 -543 -20 331 -640 -323 221 117 -83 -157 219 -221 -545 444 110
770A10r21J685r97r45J602j38q76Q32k29m12K04L97j94m22L08L34j015L71J148
$$ 110 -811 874 -123 -1068 534 396 -480 352 123 -289 -85 312 118 -304 4 338 -677 -306 842
789H42j300N2J183j120m51J673q87m35R20o12k78N37k7M4l78K87Q0p57O09O74
$$ 842 -458 -406 777 -343 -794 879 -8 -443 477 -135 -413 124 97 141 -237 50 130 -627 -18 656
809F56j376P10J98p94M36O97r22N4P57n92J1J80L42k46l88M19l11n49J008O1r18
$$ 656 -720 -10 188 -606 -170 527 -395 -341 416 -176 -165 15 357 111 -277 142 -169 -718 290 351 -567
830e67R25k22o56O65L77j179O26K09k78j2M72K1m64r7M34n90l52J243L0q76J113
$$ -567 358 136 -520 145 522 -657 -31 178 -100 -112 360 381 -83 -180 254 -336 -688 555 585 -291 822
851H22r07k92M09L76r98O03M49r89O95M1k64j23k1O41o04j18N31r8p11J038l98
$$ 822 -85 -377 32 408 -590 13 462 -527 168 209 -55 -178 -199 442 -162 -280 251 153 -558 480 82
872H2q20J249m49o57P99j52n55K89L47o4m00N76j07m81K31Q38q39J65N27q84P5
$$ 82 -738 511 62 -595 204 52 -503 -214 133 69 -331 245 138 -343 -112 726 -113 52 579 -305 -230
893b30P09n16k42M63l18k53K67K88k44k37M13k26l01N55K60p18L65L14o66J16
$$ -230 479 -37 -279 184 -134 -387 -120 168 -76 -313 100 -126 -427 128 388 -330 35 349 -317 -201
913b01R42j021K05O60q08J70J59k13J55j87J48q7k89N70J66r49Q75k0p96R41k87
$$ -201 741 -280 -75 585 -223 -53 106 -107 48 -139 9 -78 -367 203 369 -580 295 275 -521 420 133
934A33l24N26k53k56K67J05k7j91J04J11j89P5L86n61j76L59j22o6L26r0m07M27
$$ 133 -191 335 82 -174 93 198 171 -20 84 195 6 81 467 -94 -270 89 -33 -99 227 137 -270 157
956A57k9n23L89M45m20l8M6n5J20k46L42j91j90O58o74l02J043o04m06R56k92
$$ 157 128 -395 -6 439 19 -19 27 -28 92 -154 188 -3 -193 465 -209 -511 532 -72 -478 478 186
977A86l33J90p8r6j90L86J78n24L71J60q82P88J51n62K42K10l80J03n0O5R9R5
$$ 186 -147 43 -35 -131 -321 65 243 -281 90 250 -632 156 307 -255 -13 197 -183 -80 -130 -65 34 129
999A29k0k72k44Q03l79l64N36l05K43j07O5k53K0L87m03J36M39n03j16N87j90
$$ 129 109 -163 -407 396 17 -347 189 -116 127 20 85 -168 -148 239 -164 -28 411 -92 -208 379 189
1020A89k58K01n57L54o36P87%l46J015o60o50M13j60j57O21n5m2k97j06P39m65
$$ 189 -69 132 -425 -71 -707 80 80 -266 749 89 -561 -148 -308 -465 156 101 59 -238 -344 395 -70
1041g0r9K69k25l0N67q16N31J03n40J69M99j58o07M73k5m4o8J22l42L10K63k90
$$ -70 -169 100 -125 -155 412 -404 127 230 -310 -141 358 200 -407 66 41 -3 -71 51 -291 19 282 -8
1063hk96N15k05j37k37L48O2k51L95n17K98O15o35k59N07j71K51k77j02K28m15
$$ -8 -304 211 6 -131 -368 -20 42 -209 186 -331 -33 582 -53 -312 195 24 275 -2 -104 124 -291
1084b91M24j06k08K70K55n22K02L30n80M39j65j5Qj6N0j35J2L18k24l00Q70o19
$$ -291 133 27 -181 89 344 -178 24 354 -226 213 48 33 41 25 75 -60 -48 270 46 -254 616 -3
1106cj54L86j37k00L68q9l23J16J07j23l01N11k38LJ75r2p5q8O41o8p63M39k10
$$ -3 -157 229 92 -108 260 171 -152 -36 71 -52 -353 158 -80 -77 98 6 -69 -157 484 416 -347 92 -118
1129a18j04L31K01o71L53j66p1M36K0k28O7j62K82m35k6L61l62Q0K50j56q9N16
$$ -118 -222 109 310 -361 -8 -174 -245 191 211 -17 50 -112 170 -265 -291 70 -292 -212 38 -118 -207 309
1151C09k79k24K36n4o7J69j87K01j92K10j27j82N04l45k23M78j03k50K64lL3l81
$$ 309 30 -194 42 -12 -79 90 -97 104 -88 122 -5 -187 317 -28 -251 227 124 -126 138 135 168 -213
1173b13L92m8l46L19k8j67L02j41j58q5L84k73ML44l15J63M0m5j57R5k22J2K42
$$ -213 179 131 -215 104 76 -91 211 70 -88 -173 211 -62 -58 286 -29 134 174 129 -28 67 -155 -143 99
1196I9k07n3L3J30O4%k3k04l0K42l5j69J89k09K28k34J23J54o5j43J39K67m78
$$ 99 -108 -161 -128 2 66 66 43 -161 -191 51 16 -153 36 -173 55 -179 -56 98 33 -110 29 296 -182
1219a82L92j52l36L25p8j43L44J20l80J38K63n21J67O9k5M1j70L45k03j40J65
$$ -182 210 58 -278 47 -31 -174 170 290 -90 48 311 -210 -43 26 1 42 -128 217 14 -126 39
1240C9l5j67K22j28j09R3r4l9M33k77L20k26O4l9j14K95k27j9j77L90l64q9K05
$$ 39 4 -163 59 -69 -178 -85 -179 -218 215 -62 258 32 96 57 -57 238 11 -8 -185 205 -159 -248 -43
1263d3j6QN8J74l99j12M81j74J66k6l91R9L00M3j88j3Q5k12j19M71k24l1J33N1
$$ -43 -59 -51 7 181 -218 -330 151 -23 143 117 -274 -175 125 168 -20 -33 52 -160 -279 192 -32 -63 70 121
1287A21j45N4J94l51j97J43J01k72M09J24k23J54k47K17j01K77k02r4l0j65L72
$$ 121 -24 30 224 -127 -324 -181 -80 -352 57 181 -42 112 -135 82 -19 258 56 -38 -68 -233 139
1308A39j79j87K2J06J52L1l67M02M9k38J2K94m81N08m97M7M01k59m64L30L70k81
$$ 139 -40 -227 -205 -99 53 84 -283 119 168 -70 -58 236 -245 263 -234 -187 214 -45 -509 -179 191 -90
1330i0j7J53k41r5L25M2j57R3k0r4J47j2L6j8n3k2k34L56j25q9J72k05K46j43
$$ -90 -107 46 -195 -290 35 77 -80 13 -7 -101 46 34 70 52 -1 -23 -257 99 -26 -115 57 -148 98 -45
1354d5Q9j26m4o0L7m2K63J56k81q7L30J36k98k00J18n1J43k02J65O3J58l66R4
$$ -45 44 -82 -126 -186 -149 -191 72 228 -53 -140 190 326 28 -172 -54 -105 38 -164 1 64 222 -144 -50
1377e0M5L58l48j01K60Oo6j5j59N3J03J02N5j02K94m35j49J80Mk03M1R1K1m5J14
$$ -50 -5 353 5 -96 164 170 104 89 -70 -17 86 188 243 141 435 0 -149 31 35 -168 -127 -36 -15 -60 54
1402E4J5K3k22K0M9M9n9MJ59j50j9J35K25m28J46K35k31K41k93J76l37K18L00
$$ 54 69 92 -130 -110 -61 -12 -71 -67 92 -58 -77 58 283 -145 1 236 5 246 -47 129 -208 10 310
1425C10l66Q8k8K6q3o1l0J19K10l57K46MJ17m88o0N14q0k22K33k3j42m0mj3K69
$$ 310 -56 32 4 30 -53 -114 -144 -25 185 -172 74 78 195 -293 -353 161 81 -141 92 69 -73 -113 -117 -130 139
1450A39k07J84j50K48n08J86L28l55K62l7J68m00L40k48j2l5K51j55q6L10r5k44
$$ 139 -68 116 -34 214 -294 -108 220 -135 127 90 258 -142 198 -50 -62 -97 154 -1 -87 223 128 -116
1472a16L74j57j76J62k55K15K13k8n23K75k3K52k05k48L53j70R3J91o9k17J88
$$ -116 258 101 -75 87 -168 47 260 232 -291 -16 -39 213 8 -240 113 -57 36 227 158 -59 129
1493A29k48O8K58j05j30j19J36j64J95m1j49K98j17q6J5O1L39j73k27J16O4l7
$$ 129 -119 -51 207 102 -28 -147 -11 -175 20 -21 -170 128 11 -75 -60 1 340 167 -60 56 120 83
1515H3j02QL4P8J45r7j2l11K06L6q4L70l56o2M09l66j15L28j69j33R3o5m8J44
$$ 83 -19 -11 23 101 246 149 137 -174 32 68 -16 354 -2 -64 345 -21 -136 192 23 -110 -17 -82 -130 14
1539A4K26k50j56K54R4l77j48J45N8J81l2K32j29lj5k40L77l68N7J6l3K03l32
$$ 14 240 -10 -166 88 182 -195 -343 -198 -140 41 9 241 112 109 94 -146 231 -137 -80 -64 -97 106 -226
1562b26J24J06j36J46J88k13J23N1k32p2J55j54l3J60M6r5j67M70k62J4j9O0J46
$$ -226 -102 4 -132 14 202 -11 112 163 -69 -141 14 -140 -173 -13 33 -62 -229 241 -21 -7 -26 34 180
1585A80p1l31J98J36j89K63k78R2J64m02J1K96%n7o2j51L09m10L21j91j71K77
$$ 180 109 -222 -24 112 -77 186 -92 0 164 -238 -227 69 69 12 -50 -201 108 -302 19 -172 -343 -66
1607f6K02k76J51qp4M3k6O3O5J01k98K44r9m3O9L40l00K24m56J27n67N50k2l43
$$ -66 136 -140 11 3 -71 -28 -54 9 74 175 -123 121 22 -21 48 388 88 312 -144 -17 -584 -34 -56 -399
1631c99K41J24n2J18k11K96j52J38K0k88P2L97l52k9j04J3J95k1l9lp4Q1J18q4
$$ -399 -158 -34 -86 32 -179 117 -35 103 123 -165 -93 304 -48 -77 -181 -168 27 6 -33 -36 -110 -29 89 5
1655EN6m1K07m95J70J52Q2l54K46p7R8l1J3k42K35R2l25O4J2j45L05L43j78m9
$$ 5 61 20 227 -268 -98 54 136 -218 28 -49 49 18 31 -211 24 116 -209 -145 -133 -278 27 370 192 143
1679A43j7j27N9J5l6J39j43l19O06k92j7J71j51k21K45j61J48l4p2R2l20O42j14
$$ 143 126 -1 58 73 37 176 33 -286 320 28 11 182 31 -190 55 -106 42 8 -64 28 -292 350 236
1702B36l72L54L7l36q9j6l3K42K34m83L34l81K87l5j74J20K37k8m3J46j76j12
$$ 236 -136 218 255 -81 -170 -186 -219 23 257 -226 108 -273 14 -21 -195 -75 162 134 91 237 61 -51
1724e1J94j39Qj25J35J95k07J07k67J87k35q2N60j52n8j70J01k02J80j26K03j56
$$ -51 143 4 12 -113 22 217 10 117 -150 37 -198 -280 280 128 70 -100 1 -201 -21 -147 56 -100
1746a00k42M12j30j75M73m02M50l58j38M29k91J73l17K22pq1K36K8k4j88N2j26
$$ -100 -342 70 -60 -235 238 -164 286 -72 -210 219 -72 101 -216 6 -1 -82 154 182 158 -30 22 -104
1768a04k3j9L50P0m06K78q4m6j39J76Q0K1j59P1j41J16rK7jj63K25k14Mm4N0J35
$$ -104 -127 -146 204 274 -132 146 62 16 -123 53 133 154 -5 66 -75 41 32 59 58 -105 120 -94 -90 -134 -84 51
1794E1p2n7J82p7rN5j82M5N0K19l95J75j36j12K08j75M37l2j91r7K45j48J23J32
$$ 51 -21 -78 104 27 18 73 -109 -64 -14 205 -190 -15 -151 -263 -55 -230 207 175 -16 -113 132 -16 107 239
1818B39l09j76K46p8K37l65oJ14L47j66l0J06k44J78j0j71K5J10q5K2K25k92P9
$$ 239 -70 -246 0 -78 159 -206 -212 -98 249 83 53 159 -85 93 83 -88 -63 47 -38 -16 209 -83 -4
1841dk18L09k2O9j24R5j30Q2l7Q2O1j0m1M3j30k56L64j7J7k76o0L47k42K93k14
$$ -4 -222 87 65 134 10 105 -25 57 20 102 163 153 112 155 25 -231 133 116 133 -143 -203 144 -98 195 -19
1866a9l50L19J58p1j35J78m4O3N6l32L4J68r8Q3J37r3j63R2j85K13L52m75N2r5
$$ -19 -369 -50 108 37 -98 80 36 99 155 -177 -143 25 -73 10 147 54 -109 -17 -202 11 363 -112 -60 -155
1890a55J55K46k31mq9J17L6k39l5K95N9r7m7L6n8j4P0L6K12p0l28j46L45l30J47
$$ -155 0 246 15 11 -78 39 75 -164 -199 96 155 58 11 47 -11 -25 45 81 293 223 -105 -251 94 -236 -89
1915h9L62l72L2K5R8j4k17J27J05r6J03o5J37k15n1J60J29l06J75N5j22m3L7L1
$$ -89 273 -99 -67 -42 56 42 -175 -48 57 -39 64 -1 136 -79 -130 30 159 -147 28 83 -39 -82 -45 -14
1939a4K06l31J98K82l51o6J30j88J44j60l4J33J36j08J97j4k27J27O3o1j7J97
$$ -14 192 -139 59 341 -10 -76 54 -134 10 -150 -184 -51 85 -23 174 160 -67 60 123 62 45 242
1961B42j05l7j08j8J8l4J18k6l02J29J60om8J62m7j53K90m44nN10n09K33J6k01
$$ 242 137 100 -8 -26 -8 -42 76 50 -252 -123 37 31 -17 145 98 -55 235 -209 -214 296 -213 20 36 -165
1985a65N99m81O1R7k65N20l15k24M10l44J17q3J45k7j54j76K4K54K64l69J60m1
$$ -165 434 -47 14 111 -154 366 51 -173 237 -107 10 -73 72 45 -109 -285 -261 -7 257 -112 48 7
2007Gn8J02l51M06j34j41J25j33J0L14J73j323J004N50o42l3K57J49q23p7O07
$$ 7 -51 51 -300 106 -28 -169 -44 -177 -167 147 320 -1003 1 551 -91 -124 133 282 -541 -618 -11
2028a1m2l68L58k15j11J27J07K94l22J34M27p94K77N83l99j98N22p43J84N90k72
$$ -11 -53 -421 -63 -278 -389 -262 -155 139 -183 -49 378 -416 -139 444 45 -153 369 -374 -190 400 128
2049A28j63r2R6J04Rl02r5O3J34N5Q6r8J64q2K4m0L9l05L26j30K02j14n5p2L28
$$ 128 -35 -127 -31 73 82 -220 -315 -252 -118 -63 23 -75 89 7 31 -9 30 -275 51 -79 123 9 -46 -118 210
2074B10j71J31L36o43m4K19O08j048P22r96O77l16K41K71k47rj27J43K33l85j71
$$ 210 39 170 506 -137 -181 38 646 -402 320 -676 1 -315 -74 197 -50 -59 -186 -43 190 -195 -366
2095c66N10R7l15J9j15K52J1L4K68q43j76N74j69K01Pn3r3M83n11J09l1K54j34
$$ -366 144 241 -74 -55 -170 82 93 127 395 -448 -624 -50 -219 -18 -11 -64 -157 326 -185 -76 -107 147 13
2118A3l8J4k9p1J24k99K47%J3Q7j04l65M11Rj97k87P34n35L40j4k44j70j53M20
$$ 13 -25 -11 -40 -111 13 -286 -39 -39 -26 61 -43 -408 3 12 -185 -472 262 -273 67 53 -191 -361 -514 -94
2142i4M23j37o90L84j45K65l77lN94o67M34J83J99j536M35J222m89K01n23L40
$$ -94 329 192 -498 -114 -259 6 -371 -374 220 -447 -13 170 369 -1167 -732 490 1 202 -321 19
2162A9m02L40J8j05N8K59rj43o5j63M9NK84l05K14q7K53m24J65J04j17l6J37R
$$ 19 -383 -43 -25 -130 -72 187 178 35 -30 -193 -144 -139 145 -160 54 -33 220 -204 -39 65 -52 -88 49 58
2186E8k90J14J95j22L02l82J50k46Q3%K35J59j67k68K32Q2k34k79M66M7n2N5j01
$$ 58 -232 -118 77 -45 257 -125 25 -221 -138 -138 97 256 89 -179 53 135 -99 -378 88 135 83 138 37
2209C7m46N06P6j87Nj88J91j42J86j21J66j17j84K79j87n5k1K30m7m4JJ22j73
$$ 37 -409 97 173 -14 -9 -197 -6 -148 38 -83 83 -34 -218 61 -126 -181 -202 28 -19 -63 -62 60 -113
2232a13nO2j48L40M7j97j70K3N6J42J45K49m89J13p1j26J09qn2k30L57j24j61
$$ -113 -118 -56 -204 136 183 -14 -184 -161 -105 37 182 431 -58 55 -16 -142 -33 -41 -93 -323 34 -90 -251
2255b51K19K08l20K78l29J24J43J24J5k80J59r7k4L9L39l18m27M39J56k51J57
$$ -251 -32 176 -144 134 -195 -71 72 196 211 -69 90 -7 -31 8 347 29 -398 41 197 -54 103
2276A03j3k3M04n43N4Q0L9j47N1k36N42m86M00k50j6J59j05J38j49j1J80j59k1
$$ 103 90 67 471 -72 -18 62 101 -46 5 -231 311 -175 225 -25 -41 118 13 151 2 -9 171 12 -9
2299iJ95l90L85j01m08N05p0k64K80j26l60M45M1o2L22l32N3k00N23q11K42j9
$$ -9 186 -204 181 80 -328 177 107 -157 123 -3 -363 82 123 61 383 51 104 -96 427 -384 -142 -161
2321a61K35L85k61M76p26k28j02N00l77o7l73O09j5j8K29j59k79J14O17k35N5
$$ -161 74 459 198 674 -52 -280 -382 118 -259 -326 -699 -90 -105 -123 106 -53 -332 -218 399 164 219
2342B19j36o45K02L2J00j69L87M76m85J23Q0q1ol67K08nr6J17K1k79N11L6k42
$$ 219 83 -562 -360 -328 -228 -397 -10 466 -19 104 184 103 97 -270 -62 -67 -163 -46 -25 -304 207 243 1
2365Aj75N8n13M98j40J84k97K09J07L63N1m46L5j61N62m08Q0j86K90m09M26K80
$$ 1 -174 -116 -629 -131 -271 -87 -384 -175 -68 295 346 -100 -65 -226 336 -72 8 -178 112 -297 129 409
2387D09k21k45j04Q9J64k07L11J33M64n36o06M43P5k11l9K28j46p6L9Q78r14L82
$$ 409 188 -57 -161 -72 92 -115 196 329 793 257 -349 94 169 -42 -81 147 1 -75 -36 842 -72 310
2409C10p6k07p85L31r7N71K09m14N86j24K7k36L3l46L64m5j51k44P01J50l50k42
$$ 310 234 27 -758 -427 -524 47 256 -158 428 304 331 95 128 -218 146 101 -50 -294 407 557 207 -35
2431c5l07J32K09J15o06R48j6q74L51l03Q6M05n3M66k26k25j39N49k21m20O50
$$ -35 -342 -210 -1 114 -492 456 440 -434 -83 -386 -300 105 52 518 292 67 -72 477 256 -164 486
2452D86k55k76j15M67K11m06J38k2k70J41n9N1k74M20o41M30l26N66q1N07p42
$$ 486 231 -45 -160 307 518 112 250 228 -42 99 40 91 -183 237 -404 26 -300 266 185 692 -50
2473e0L53L0j162M27k3O82o04Q50q68O19J142j507q1O47k27m54k12M31r8l50J00
$$ -50 303 333 -829 -402 -425 257 -347 503 -365 254 1396 -111 -192 455 228 -226 -438 -7 -105 -455 -355
2494c55K1J37K35j22q8k11P78n54O70n94q6K57kj46m49K36J33L87J58n35J15l34
$$ -355 -334 -197 38 -84 -172 -383 395 -159 511 -83 -169 88 86 -60 -509 -273 -140 247 405 -130 -15 -349
2516c49J65l35Q69j71m98J334q89N02q59L20l31l1Q67j97R61r92j3q64k97J278
$$ -349 -184 -519 350 179 -319 1015 126 628 -231 89 -242 -273 594 397 1358 366 353 -511 -808 470
2536D70j283J135m50k11m89J206j11J36n57j36J45o99J545o03R59q97k13l05k3
$$ 470 -813 322 -128 -339 -828 378 267 403 -154 -290 -145 -844 701 98 1057 160 -53 -358 -381
2555c81r7K31J69M64J94o44k59M84L08m64L99n73P5K92K13l21m74K54l39M37l94
$$ -381 -478 -247 -78 386 580 -64 -323 161 469 5 404 -169 -94 198 411 90 -384 -130 -469 -32 -426
2576d26Q15m63Q2N51p38J51L78n75Q22p82m42O58q8L15m01p6K06r3l32L44K94
$$ -426 389 -74 8 559 -179 -28 350 -225 597 -185 -627 31 -57 258 -143 -219 -13 -106 -438 -94 200
2597B00k07j05K59M25l27n49Q85n67o6M29l49J64K39n81K13K13jQ6q58K68M38
$$ 200 -7 -112 147 572 245 -304 581 14 -52 377 28 192 431 -150 63 276 275 361 -497 -229 209
2618B09j67J76q9J16j65M0j39k33K26k07M35j85J37l52J55K1m8L29Q6m90J27K61
$$ 209 42 218 129 245 80 120 -19 -252 -26 -233 202 17 154 -198 -43 -22 -70 259 345 -145 -18 243
2640B43l40pN2r3P7o8p4K06j22M38n17L86k13O8P8n1k24n8J44K62l89j73L21m48
$$ 243 -97 -104 -52 -145 -68 -136 -210 -4 -126 312 -205 181 -32 36 114 63 -161 -219 -75 187 -202 -375 -54 -502
2664e02K5K25K71r0OK7Q0J28k19K17j28n2q6o0QQ4K25l14K6J14L23m28R8n5R6
$$ -502 -477 -252 19 -71 -65 -38 42 170 -49 168 40 -12 -98 -158 -150 -66 159 -155 -129 -15 308 -120 -22 -77 19
2689A9j84M6K89k49l3K0J58j80O4J83j03J43O6k77k03K31l2qJ75m3Lo4k04O7J72
$$ 19 -165 -119 170 -79 -112 -92 66 -114 -50 133 30 173 239 -38 -241 -10 -42 -50 125 82 85 21 -183 -116 56
2714E6J06k22q1J02p5K03j8J39m7l31K42p0j71K42p3lk41L49j45n8K46l24K03
$$ 56 162 -60 -141 -39 -114 89 71 210 163 -168 74 4 -167 75 2 -1 -242 107 -38 -96 150 -174 29
2737B9p0j16M20l84J62j76L09l02J20R5k09J42j56K52j74k9J94JK5j03j5k18J54
$$ 29 -41 -157 263 -121 41 -135 174 -128 -8 87 -122 20 -136 116 -58 -87 107 108 133 30 15 -203 -49
2760d9j6l1K02l87M66j21J50j01O2oj73j35J02K96l47r2K81l29KK93n0Q2n8o7
$$ -49 -65 -96 106 -281 185 64 214 113 175 169 -4 -139 -37 259 -88 -180 101 -228 -226 67 17 99 41 -26
2784b6j07P7J71l97M88r8k94J54p1r0Q1K85j39j16J13r4J3m4L1N7j24J0K23n4
$$ -26 -133 -56 115 -282 206 108 -186 -32 -103 -193 -112 173 34 -82 31 -63 -50 -94 -63 -6 -130 -120 103 49
2808D9j56J19K0M5k80K92j65J61j0j23j12J59j59J06L8j7J89L9l45K01j9r1N5
$$ 49 -107 12 32 77 -203 89 -76 85 75 -48 -160 -1 -160 -54 -16 -33 156 195 -150 51 32 -59 -4
2831dk05M04Nk20p9P6K54l25M6LJ1J70o9p9J30j34j73qO9%K24o6r0P9n5Q6j91
$$ -4 -209 195 200 -20 -99 -23 231 -94 -48 -45 -34 136 67 -12 118 -16 -189 -197 -128 -128 96 30 -60 19 -36 50 -141
2858a41J77o6j6OO5Q0k25L15k09r9J59p6p1P8J6k25N84m40NJ19j50J65k22K59
$$ -141 36 -30 -46 -40 25 105 -120 195 -14 -113 46 -30 -101 -23 -7 -232 352 -88 -83 36 -114 51 -171 88
2882H8j04J04P9p9j77J50J6j03P1j0j29J8%Q7j92O7Q3R1j54j9K67l34j01K74j55
$$ 88 -16 88 167 88 -89 61 77 -26 45 35 -94 -76 -76 11 -181 -114 -31 60 -94 -113 154 -180 -281 -7 -162
2907a62L55j88j77K39M0j04K27l61K57O1m27M45j73N9q9N9n9j36q2J25q4m8J80
$$ -162 193 5 -172 67 107 3 230 -131 126 187 -240 205 32 91 2 61 2 -134 -216 -91 -175 -223 -43
2930d3j84J99n5J59j1K02l52L27j66q5K19m38K64j01J93k75L33k18l5L24j74J12
$$ -43 -227 -28 -83 76 65 267 -85 242 76 -9 210 -228 36 -65 128 -147 186 -32 -67 257 83 195
2952A95n06M65k37J17J10n00K06J91m8j5M1o0m56N19j70L29r7L01n31L49l01J49
$$ 195 -311 154 -83 34 144 -356 -150 41 -7 -22 19 -41 -497 22 -148 181 84 385 -146 203 -98 51
2974E1K66j41j90J40R5l80L79k93J26o2K63j48kJ40j10q7J00k5k74N7M51k72l14
$$ 51 317 176 -14 126 221 -159 220 -73 53 -9 254 106 104 244 134 47 147 122 -152 -95 356 84 -230
2997b30K34J97k67J64r6j03M03l20L3q9M8J06J51K2o13K84N8J80k75M0J34Q9m43
$$ -230 4 201 -66 98 2 -101 302 -18 15 -74 -26 80 231 253 -360 -76 -18 162 -113 -73 61 150 -293
3020b93J81J08J56n23N20k37J2N4J23j19k3j13M96m50jj83M27o4l62K86K01k52
$$ -293 -112 -4 152 -371 149 -88 -76 -22 101 -18 -41 -154 342 -108 -109 -292 135 71 -291 -5 196 -56
3042e6P9M33m17Q8k26K14m05J79J63L00r0l18L18j72k64J48M0O0K3j89K63L68
$$ -56 23 456 39 127 -99 115 -290 -111 52 352 262 -56 262 90 -174 -26 14 74 97 -92 171 539
3064E39j5m11m38K98j49J67PJ22p2k90l1m6M89K21r0m12K04k78N27o86J98R2l6
$$ 539 524 113 -325 -27 -176 -9 -2 120 48 -242 -273 -319 170 391 301 -111 93 -185 342 -344 -146 -54 -90
3087i0J76k1O4k61K29m2k15m4N11n60M12k31L74l60K96m63N68k59o3P8K12k14
$$ -90 86 65 129 -132 97 55 -160 -204 307 -253 159 -72 302 -58 238 -225 343 84 21 99 311 97
3109I7K43j30k50k4J8L9J5O0j73J73j59J18k90K90q7j35K32K5m9N8N2j22j56J83
$$ 97 340 210 -40 -64 -46 -7 8 68 -105 68 -91 27 -263 27 -60 -195 37 62 13 71 123 1 -155 28
3133B8J54m7J42j07p5J04l18K34m9L5OK66k65j80o3M3N8N6j5K19j87k92J90RM4
$$ 28 182 135 277 170 95 199 -119 115 66 101 107 373 108 -72 -135 -92 -34 22 7 226 39 -253 -63 -54 -10
3158a0n8P8j03J4k5J44N7j7K1l9j81R4J23j84J93K3K4r8j60J08j17J90j60O0j1
$$ -10 -68 10 -93 -79 -104 40 97 80 101 62 -119 -25 98 -86 107 130 154 56 -104 4 -113 77 -83 -23 -34
3183c4J64l52M01q3l23K93J16J8M3j43K2j37j18j02K33K18j11k33L82K80k38k21
$$ -34 130 -222 179 96 -227 66 182 200 243 100 122 -15 -133 -235 -2 216 105 -128 254 534 296 75
3205G5k08R5L2J35j91Q6M4j63J59K31k95L9o8m7Pj00K81j97J37j7j78O0O1j2R3
$$ 75 -133 -38 -6 129 -62 24 68 -95 64 295 0 39 -29 -76 -69 -169 112 -85 52 35 -143 -83 -22 -34 59
3230E9j10m0K77k06L00k85J83j63j23J41K3r6J51j9R4j98J19l8m1Q4k48J3K11
$$ 59 -51 -91 186 -20 280 -5 178 15 -108 33 56 -40 111 92 186 -12 107 69 28 112 -136 -123 88
3253H8o8q3M5j50J97LMJ92j29j15O5J15j44J20j53r5J36q3lJ49lj60J57j6j02
$$ 88 20 -63 -18 -168 29 32 36 228 99 -16 49 164 20 140 -13 -108 28 -55 -58 91 88 -72 85 69 -33
3278c3p4j34J13P5K14j59j12K22k61nJ61J7l6kn0J63m90L63k0K20k9l5J81k63
$$ -33 -107 -241 -128 -53 161 2 -110 112 -149 -154 7 24 -12 -14 -64 99 -391 -28 -48 172 143 108 289 26
3302B6k3P1j14j81L27j21k6j97N19j08k11j89J89K4M2l06M02j77k38K32O8l45
$$ 26 3 74 -40 -221 106 -15 -41 -238 281 173 -38 -227 -38 -14 28 -278 124 -53 -291 -59 9 -336
3324c36L88O0m9o6k92M64j98mK28j76j90L46M5l84K60J4l26M08l34N4P3RK4m4
$$ -336 52 112 63 -3 -295 169 -29 -33 195 19 -171 175 220 -164 96 110 -216 192 -142 -88 -15 -6 18 -26
3348b6Q1J37o6p1p2J03Lj41j4J96j46j37J85Q0k66q7K99K65q1l45o2J11P2K0K9
$$ -26 55 192 126 55 -17 86 89 -52 -66 130 -16 -153 32 112 -154 -241 58 323 242 -103 -165 -54 18 38 67
3373F7J59rn31K21M4j87J05J58j44J94J21o7n2j90J81p7k15L78k84Q7J20j59K9
$$ 67 226 217 -314 -93 -49 -236 -131 27 -117 77 198 131 79 -111 70 -7 -222 156 -128 -41 79 -80 -51
3396e1J76k29o9J9K58J06j51k67K73k35j3M61k72n9O8M9j46J18k2J06l45J48p8
$$ -51 125 -104 -173 -154 104 210 59 -208 65 -170 -183 278 6 -53 15 64 -82 36 14 120 -225 -77 -155
3419a55J23N7k9J33j82J6M79m79J63kj90R9J53j60OJ66l31J69K36m39K84L4q6
$$ -155 -32 25 -4 129 -53 -37 442 -37 126 124 -66 33 186 26 32 198 -133 36 272 -167 117 151 65
3442F5j27K1j69L3J27JL66l51j42J27p6K20j8q1L1J07j60K9j51k3N8J52p9J75
$$ 65 -62 -41 -210 -177 -50 -49 317 -34 -176 -49 -125 95 77 -4 27 134 -26 3 -148 -171 -113 39 -40 135
3466A35j14o9L36L5k34k23J45R2j12j02p0J09J13o7L01k96q9J55l25L15o6J7k8
$$ 135 21 -48 288 323 89 -134 11 103 -9 -111 -181 -72 41 -26 275 -21 -110 45 -280 35 -31 -14 -42
3489d2n4K04K45k13l9j97r%oK11j18p4J55j27l7J45M6j40J38r4M8m2K6L6k13K15
$$ -42 -96 108 353 140 101 -96 -105 -105 -111 100 -18 -92 63 -64 -101 44 90 -50 88 -6 42 0 26 62 -151 64
3515F4P6m7n1O3j49K02o3J12J27j75k03q7oj1q3q0M5L71no4j09K03q0k18K22j06
$$ 64 140 93 42 105 -44 158 95 207 334 159 -44 -131 -137 -148 -231 -311 -266 105 100 36 -73 130 50 -168 54 -52
3541e2P8J88l74o5K52M6J36l38n7p1K67K62l96J80p2K20q8O9j84j04J48j77J18
$$ -52 26 214 -160 -225 27 73 209 -129 -186 -257 10 272 -124 56 -16 204 116 185 1 -103 45 -132 -14
3564a4m15O39p11K35M69m80K11M05k41P5m27M56o63M10k29N34J79j04n44l05R09
$$ -14 -429 210 -501 -266 203 -277 -66 339 98 173 -254 202 -461 -51 -280 254 433 329 -215 -520 389
3585C89o66J335j269P7K62J54p5n08J5k17O38m2oj10O5oO3j8j88J30J45j88J79
$$ 389 -277 1058 -211 -134 128 282 207 -301 -286 -503 135 93 87 -23 42 36 99 81 -107 23 168 -20 159
3608A59k02mj89K43J03K5o0l3L85j32o08L64K3J80k86M1q7J93j35l6J68k20Q5
$$ 159 -43 -47 -236 7 110 135 75 42 427 295 -313 51 74 254 -32 9 -78 115 -20 -56 112 -108 -23
3631b3j11L30k07J01k00P8J78p4j98L49l72P0l5j25J49N5p5J50NJ25l16J70r0
$$ -23 -134 196 -11 90 -110 -32 146 72 -126 223 -149 -79 -114 -239 -90 -35 -110 40 45 170 -146 24 -66
3654f6J56o4k5j08J46J49j01k9k23M3j5J06K30j63p9K41k01j8l4k12K75j53J26
$$ -66 90 26 1 -107 39 188 87 58 -165 -122 -137 -31 199 36 -43 198 -3 -21 -55 -267 8 -145 -19
3677a9j0l40L98l5J77k31j27L23q5j61NK13j30j25n6J31M0Q9l1J50l1K0l7J61
$$ -19 -29 -369 29 -6 171 -60 -187 136 51 -110 -105 108 -22 -147 -203 -72 -32 57 26 176 145 165 128 289
3701B89j40k09l8J78K33l26LMj0J98m8J02k45j12J82N8k22j3J96l17N30k45J11
$$ 289 149 -60 -98 80 313 -13 -10 -6 -16 182 134 236 -9 -121 61 119 -103 -116 80 -237 293 48 159
3724A59P8k82J00K3j64o3N6J67r1m3O5J04l53J74J19j5L6j56J41j20L03l73K16
$$ 159 237 -45 55 78 -86 -149 -93 74 -17 -60 5 109 -244 -70 49 34 70 -86 55 -65 238 -135 81
3747H1k90L80n11N23N24j320P32k14j82P45k15r0j27j1J06k03Q3K9k4k0K9j12
$$ 81 -209 171 -340 183 707 -613 119 -95 -277 468 253 163 36 25 131 -72 11 40 16 -4 25 -87
3769h7J14j73J44L1j82L64q5j72r1n2J50j2k1P3j43J82r2j65K78m07L70p4j55
$$ -87 27 -146 -2 29 -153 211 126 -46 -137 -189 -39 -51 -72 1 -142 40 -52 -217 61 -346 24 -50 -205
3792b05K16J35mnj71P2j41Q89r97j6L73Q6M1J20q3o06N9O49m76J00l56Q1L22p2
$$ -205 11 146 142 137 -34 38 -103 786 -211 -227 146 232 273 393 310 -296 -237 412 -64 36 -320 -239 83 11
3816A1l0m0J26j9j10L33k94J06k97J86J16k44PK01k03K09m0K69j77j93K58k80
$$ 11 -19 -59 67 48 -62 271 -23 83 -214 -28 88 -156 -149 52 -151 58 18 287 110 -83 175 -105
3838a05O8j8K1q6R1R0l1M5k5j21K0m3j03K18NL62n56j09M73j24m26P97o08R13
$$ -105 -37 -55 -34 -120 -29 61 30 75 50 -71 -51 -94 -197 21 26 388 -168 -277 196 72 -354 443 -165 748
3862G48o01J4J93l07J25k73R6j64K36l60L07j12J18Q4k23MJ80n7j87L13k30j01
$$ 748 147 161 354 47 172 -101 -5 -169 67 -293 14 -98 20 104 -119 -115 65 8 -179 134 -96 -197
3884a97J85J61j35K8p0Jj20J22J28j38j0KJ41m1Jr9j74J50J11m7j45j4O3J22j56
$$ -197 -12 149 14 42 -28 -27 -147 -25 103 -35 -45 -43 98 57 58 -41 -215 -65 46 -1 -146 -160 -97 25 -131
3909a31J00Q4N2Q0j33r3K38j12M2k86J67nK19k14j54n5K06J34lk55L67k21j47
$$ -131 -31 53 105 185 52 -41 197 85 127 -159 8 3 222 8 -146 -201 5 139 136 -119 248 27 -120
3932a20J29k7K2r2K25k69J99k76J96J52m34J43L33m81K61J33k29j12J30K13j70
$$ -120 9 -18 4 -88 137 -132 67 -209 -13 139 -295 -152 181 -300 -39 94 -135 -247 -117 96 -74
3953g4J65N9j79L6o7m3L50j88Q7J1j79m8Jk29K06K59l54K63K7j98J52r1K5r6K90
$$ -74 91 150 -29 7 -60 -103 247 59 146 157 -22 -70 -69 -298 -92 167 -187 76 103 -95 57 -34 -9 -105 185
3978A85kj77J8j83K21M4k84o0J14J00K17L8j78l17K57j00J07Q0J04K7j62j73R9
$$ 185 183 6 24 -159 62 106 -178 -238 -124 -24 193 231 53 -264 -7 -107 0 80 184 211 49 -124 -25
4001b5j70L39K08k70p2p8JM7L28m73R8K6K84l99P9p2n5R5K00j18M2r2J88j14J35
$$ -25 -195 144 352 82 10 -68 -67 -20 308 -165 -67 -41 243 -156 -77 -149 -204 -109 91 -27 15 -77 111 -3 132
4026A32o0k51O1p6L66j12p6j0q2N8J17M2j49J53j9M3j19L43m33J19k36K10k37
$$ 132 72 -179 -118 -194 172 60 -16 -26 -108 -50 67 109 -40 113 94 137 18 361 -72 47 -189 21 -216
$$ [...]
8191e2
##END NTUPLES=NMR FID
##END=
