##TITLE=1H_Pr T-4
 CDCl3, 8 sc, 
 26.08.2021
##JCAMPDX= 6.0         $$ Bruker NMR JCAMP-DX V2.0
##DATA TYPE= NMR FID
##DATA CLASS= NTUPLES
##ORIGIN= UXNMR, Bruker Analytische Messtechnik GmbH
##OWNER= root
$$ XWIN-NMR		Version 3.5
$$ Thu Aug 26 11:54:13 2021 Russian Standard Time (UT+4h)  she@DPX200
##.OBSERVE FREQUENCY= 200.131506
##.OBSERVE NUCLEUS= ^1H
##.DELAY= (6, 6)
##.ACQUISITION MODE= SIMULTANEOUS
##.ACQUISITION SCHEME= undefined
##.AVERAGES= 8
##.DIGITISER RES= 18
##SPECTROMETER/DATA SYSTEM= spect
##.PULSE SEQUENCE= zg30
##.SOLVENT NAME= CDCl3
##.SHIFT REFERENCE= (INTERNAL, CDCl3, 0, 15.7039)
##AUDIT TRAIL= $$ (NUMBER, WHEN, WHO, WHERE, WHAT)
$$ ##TITLE= Audit trail, XWIN-NMR		Version 3.5
$$ ##JCAMPDX= 5.01
$$ ##ORIGIN= Bruker BioSpin GmbH
$$ ##OWNER= she
$$ F:/spectra/data/she/nmr/H-F/1/audita.txt
$$ ##AUDIT TRAIL=  $$ (NUMBER, WHEN, WHO, WHERE, WHAT)
(   1,<2021-08-26 11:52:48.15 +0400>,<she>,<DPX200>,
      <created by zg, POWCHK disabled, PULCHK disabled
       configuration hash MD5:
       00 E9 B6 7A A2 85 ED C7 34 08 36 98 17 FE 4E 26
       data hash MD5: 16K
       91 52 82 8D E2 5D 92 E2 CA 41 3A 9D 6A 3D 99 78>)
$$ ##END=
$$ 
$$ hash MD5
$$ 82 88 1B 44 DB FE 9D 8F A7 2A 4E C3 3F 80 92 B3
##$RELAX= 
##$RELAX= 
##$RELAX= 
##$RELAX= 
##$RELAX= 
##$RELAX= 
$$ Bruker specific parameters
$$ --------------------------
##$DU= <F:/spectra>
##$EXPNO= 1
##$NAME= <H-F>
##$PROCNO= 1
##$TYPE= <nmr>
##$USER= <she>
##$AMP= (0..31)
100 100 100 100 100 100 100 100 100 100 100 100 100 100 100 100 100 100 
100 100 100 100 100 100 100 100 100 100 100 100 100 100 
##$AQSEQ= 0
##$AQ_mod= 1
##$AUNM= <au_zg>
##$AUTOPOS= <>
##$BF1= 200.13
##$BF2= 200.13
##$BF3= 200.13
##$BF4= 200.13
##$BF5= 200.13
##$BF6= 200.13
##$BF7= 200.13
##$BF8= 200.13
##$BYTORDA= 1
##$CFDGTYP= 0
##$CFRGTYP= 5
##$CHEMSTR= <none>
##$CNST= (0..31)
1 1 145 1 1 1 1 1 1 1 1 1 1 1 1 1 1 1 1 1 1 1 1 1 1 1 1 1 1 1 1 1 
##$CPDPRG= <>
##$CPDPRG1= <>
##$CPDPRG2= <>
##$CPDPRG3= <>
##$CPDPRG4= <mlev>
##$CPDPRG5= <mlev>
##$CPDPRG6= <mlev>
##$CPDPRG7= <mlev>
##$CPDPRG8= <mlev>
##$CPDPRGB= <>
##$CPDPRGT= <>
##$D= (0..31)
0 1.2 0 0 0 0 0 0 0 0.06 0 0.03 0 0 0 0 0.0002 0 0 0 0 0 0 0 0 0 0 0 0 
0 0 0 
##$DATE= 1629964367
##$DBL= (0..7)
120 120 120 120 120 120 120 120 
##$DBP= (0..7)
150 150 150 150 150 150 150 150 
##$DBP07= 0
##$DBPNAM0= <>
##$DBPNAM1= <>
##$DBPNAM2= <>
##$DBPNAM3= <>
##$DBPNAM4= <>
##$DBPNAM5= <>
##$DBPNAM6= <>
##$DBPNAM7= <>
##$DBPOAL= (0..7)
0.5 0.5 0.5 0.5 0.5 0.5 0.5 0.5 
##$DBPOFFS= (0..7)
0 0 0 0 0 0 0 0 
##$DE= 6
##$DECBNUC= <off>
##$DECIM= 32
##$DECNUC= <off>
##$DECSTAT= 4
##$DIGMOD= 1
##$DIGTYP= 9
##$DL= (0..7)
0 120 120 120 120 120 120 120 
##$DP= (0..7)
150 150 150 150 150 150 150 150 
##$DP07= 0
##$DPNAME0= <>
##$DPNAME1= <>
##$DPNAME2= <>
##$DPNAME3= <>
##$DPNAME4= <>
##$DPNAME5= <>
##$DPNAME6= <>
##$DPNAME7= <>
##$DPOAL= (0..7)
0.5 0.5 0.5 0.5 0.5 0.5 0.5 0.5 
##$DPOFFS= (0..7)
0 0 0 0 0 0 0 0 
##$DQDMODE= 0
##$DR= 18
##$DS= 0
##$DSLIST= <SSSSSSSSSSSSSSS>
$$ [...]
##$SUBNAM2= <"">
##$SUBNAM3= <"">
##$SUBNAM4= <"">
##$SUBNAM5= <"">
##$SUBNAM6= <"">
##$SUBNAM7= <"">
##$SUBNAM8= <"">
##$SUBNAM9= <"">
##$SW= 20.0188882624521
##$SWIBOX= (0..15)
0 0 2 0 0 0 0 0 0 0 0 0 0 0 0 0 
##$SW_h= 4006.41025641026
##$TD= 16384
##$TD0= 1
##$TE= 0
##$TE2= 300
##$TE3= 300
##$TEG= 300
##$TL= (0..7)
0 120 120 120 120 120 120 120 
##$TP= (0..7)
150 150 150 150 150 150 150 150 
##$TP07= 0
##$TPNAME0= <>
##$TPNAME1= <>
##$TPNAME2= <>
##$TPNAME3= <>
##$TPNAME4= <>
##$TPNAME5= <>
##$TPNAME6= <>
##$TPNAME7= <>
##$TPOAL= (0..7)
0.5 0.5 0.5 0.5 0.5 0.5 0.5 0.5 
##$TPOFFS= (0..7)
0 0 0 0 0 0 0 0 
##$TUNHIN= 0
##$TUNHOUT= 0
##$TUNXOUT= 0
##$USERA1= <user>
##$USERA2= <user>
##$USERA3= <user>
##$USERA4= <user>
##$USERA5= <user>
##$V9= 5
##$VALIST= <valist>
##$VCLIST= <CCCCCCCCCCCCCCC>
##$VD= 0
##$VDLIST= <DDDDDDDDDDDDDDD>
##$VPLIST= <PPPPPPPPPPPPPPP>
##$VTLIST= <TTTTTTTTTTTTTTT>
##$WBST= 1024
##$WBSW= 4
##$XGAIN= (0..3)
0 0 0 0 
##$XL= 0
##$YL= 0
##$YMAX_a= 281801
##$YMIN_a= -233994
##$ZGOPTNS= <>
##$ZL1= 120
##$ZL2= 120
##$ZL3= 120
##$ZL4= 120
##$ABSF1= 10
##$ABSF2= 0
##$ABSG= 5
##$ABSL= 3
##$ALPHA= 0
##$AQORDER= 0
##$ASSFAC= 0
##$ASSFACI= 0
##$ASSFACX= 0
##$ASSWID= 0
##$AUNMP= <proc_1d>
##$AZFE= 0.1
##$AZFW= 0.1
##$BCFW= 1
##$BC_mod= 2
##$BYTORDP= 1
##$COROFFS= 0
##$CY= 11.3945322036743
##$DATMOD= 1
##$DC= 2
##$DFILT= <>
##$DTYPP= 0
##$F1P= 2.36226072786647
##$F2P= -0.459571619588291
##$FCOR= 0.5
##$FTSIZE= 0
##$FT_mod= 4
##$GAMMA= 1
##$GB= 0.15
##$INTBC= 1
##$INTSCL= 1
##$ISEN= 128
##$LB= 0.24
##$LEV0= 0
##$LPBIN= 0
##$MAXI= 10000
##$MC2= 0
##$MEAN= 0
##$ME_mod= 0
##$MI= 1.114404
##$NCOEF= 0
##$NC_proc= 0
##$NLEV= 6
##$NOISF1= 3.799351
##$NOISF2= 2.8
##$NSP= 1
##$NTH_PI= 0
##$NZP= 0
##$OFFSET= 15.70392
##$PC= 1
##$PHC0= -13354.81
##$PHC1= 9.60099
##$PH_mod= 1
##$PKNL= yes
##$PPARMOD= 0
##$PSCAL= 0
##$PSIGN= 0
##$REVERSE= no
##$SF= 200.130013532006
##$SI= 16384
##$SIGF1= 3
##$SIGF2= 2
##$SINO= 400
##$SIOLD= 16384
##$SREGLST= <1H.CDCl3>
##$SSB= 0
##$STSI= 0
##$STSR= 0
##$SW_p= 3612.71676300578
##$SYMM= 0
##$S_DEV= 0
##$TDeff= 0
##$TDoff= 0
##$TI= <>
##$TILT= no
##$TM1= 0
##$TM2= 0
##$TOPLEV= 0
##$USERP1= <user>
##$USERP2= <user>
##$USERP3= <user>
##$USERP4= <user>
##$USERP5= <user>
##$WDW= 1
##$XDIM= 8192
##$YMAX_p= 0
##$YMIN_p= 0
$$ End of Bruker specific parameters
$$ ---------------------------------
##NTUPLES= NMR FID
##VAR_NAME=  TIME,          FID/REAL,        FID/IMAG
##SYMBOL=    X,             R,               I
##VAR_TYPE=  INDEPENDENT,   DEPENDENT,       DEPENDENT
##VAR_FORM=  AFFN,          ASDF,            ASDF
##VAR_DIM=   8192,          8192,            8192
##UNITS=     SECONDS,       ARBITRARY UNITS, ARBITRARY UNITS
##FACTOR=    0.0002496,     1,               1
##FIRST=     0,             0,               0
##LAST=      2.0444736,     0,               0
##MIN=       0,             -233994,         0
##MAX=       2.0444736,     281801,          0
$$ Real data points
##PAGE= N=1
##DATA TABLE= (X++(R..R)), XYDATA
0@%%%%%%%%%%%%qJ6j6J6j6K4l2L9m7N6o5P3q8J04j21J38j57J81k10K39k71L08
34A63l47L90m37M91n51O15o85P62q45R37j037J146j266J397j539J694j867K058
52A079k267K500k761L055l390L771m209M725n343O094p031Q243r875J2203j5838
67i044K2361l7790J49710J56564l7049K6116o2519n3000n7742n6261r4407n4382
79a07443m2658m7120l6773J6152J0329J6795M7415O4052M1181N1766O2048M1515
91A17259J4381K5983J1073k2328k4265j5519m0422m6552k7022k3948l7239j6828
103h5427M636m992l084K4542J9626N052J8690K3972K147k441J1494j122j8519
116e426j829L888j4526m040J5022M782K050K0908K1579N202J0127J8394j710j2719
$$ y = [0, 0, 0, 0, 0, 0, 0, 0, 0, 0, 0, 0, 0, -8, 8, -8, 8, -8, 16, -16, 23, -24, 32, -33, 40, -48, 56, -65, 73, -84, 97, -113, 126, -145, 163, -184, 206, -231, 260, -291, 324, -361, 401, -444, 493, -544, 602, -664, 733, -806, 888, -979, 1079, -1188, 1312, -1449, 1606, -1784, 1987, -2222, 2503, -2840, 3254, -3777, 4466, -5409, 6794, -9044, 13317, -24473, 125237, 281801, 244752, 270868, 208349, 155349, 97607, 41346, -53061, -107443, -150101, -197221, -233994, -217842, -207513, -190718, -143303, -79251, -38070, 13696, 75744, 117259, 131640, 157623, 168696, 146368, 122103, 106584, 66162, 19610, -7412, -31360, -68599, -85427, -80791, -85783, -88867, -64325, -44699, -39647, -20957, 3015, 5162, 2721, 14215, 13093, -5426, -7255, -3367, -17893, -21933, -6911, -2129, -79, 20829, 42408, 47610, 57737, 76131, 74421, 61702]
130F1702l450j4764l2550k6253k0198l1185k9372j0450n861q597J1393K7227K1754
143f0604L0021M4465L8390K8340L2429K7233O397m098l823k2491l8430l3509l6944
156G376m8084l9531k5394k4789j8328M125J4815J3976L0444M2942L4857L3921
168B6330M1393K9904J4766J2686O260j3340k1056j8862k9471l7846k7294k4840
180d1370k7684j7234n068j396J761J4583K1055J5401K0552K6184J6449J1206J3605
193D8044P253l908m861l467j1829j5322p372q693j3612m307L66l629o51O490M865
208a0633L07M753O095k618k274K541m551o755m92p13m080J30O477L571L216J1139
224F113R484L997Q460P877J128j867n67m848j1385j0136q570j3766j2612o324
$$ y = [61702, 58252, 43488, 10938, -15315, -35513, -66698, -96070, -106520, -112381, -120978, -109585, -82358, -60604, -30583, 13882, 52272, 80612, 113041, 140274, 146671, 142573, 138750, 116259, 77829, 44320, 7376, -40708, -80239, -105633, -130422, -148750, -144625, -129810, -115834, -85390, -42448, -7591, 26330, 67723, 97627, 112393, 125079, 131339, 117999, 96943, 78081, 48610, 10764, -16530, -41370, -69054, -86288, -91356, -92752, -90991, -76408, -55353, -39952, -19400, 6784, 23233, 34439, 48044, 55297, 51389, 46528, 43061, 31232, 15910, 8538, -155, -13767, -18074, -17708, -21337, -21988, -15498, -10633, -10326, -5573, 522, -2096, -4370, -1829, -6380, -13135, -13627, -14340, -18420, -18290, -11813, -8242, -5026, 6113, 15597, 19594, 28054, 35931, 37059, 35192, 34625, 29777, 18392, 8256, -314, -14080, -26692, -33016]
238c3016o447o004J554N843N483R031J4986J3212J0161J3798J2050L874L419K443
252E0387n140q962q446j0509j5399j2606q471j1240q846p10l66Q37O751R330Q432
267a4958R284J2547R243N600O931M731j603k313k829o858r056p365o767r040p523
282a9976k222l903k692L028L394K444O083P537N392M650O707N348J51K342J442
297A9725l745l209k594n198o564m191l493n237l703L79m35n34M231L968K841O011
313a748O384M619L344M411L497q82k32p07m487m809m616n314o418m954k804l688
329a8404k193J836K191J872O179N793N078N794O427M676J825K003J230l581l520
344A7206l230o562o530m844n066n173l142j36o91Q13M430L600K711N280M484K495
$$ y = [-33016, -39463, -45467, -43913, -38070, -32587, -23556, -8570, 4642, 14803, 28601, 40651, 44525, 47944, 50387, 45247, 36285, 27839, 17330, 1931, -10675, -19146, -30386, -39232, -39942, -40308, -39471, -32720, -23390, -14958, -5674, 6873, 16116, 21716, 28647, 33378, 31775, 29462, 26633, 19775, 10719, 3354, -3413, -12453, -19976, -22198, -26101, -28793, -25765, -22371, -19927, -13844, -6307, -915, 3735, 10442, 15790, 15941, 18283, 19725, 15980, 12771, 10177, 4979, -1585, -5776, -9269, -14506, -18209, -17830, -18265, -18799, -14568, -10600, -7759, -1748, 4636, 9255, 12599, 17010, 20507, 19625, 19393, 18686, 14199, 9390, 4774, -540, -6958, -11912, -14716, -18404, -20597, -18761, -16570, -14698, -8519, -2726, 2352, 8146, 14573, 19249, 21074, 23077, 24307, 20726, 17206, 13976, 7414, 884, -3960, -9026, -14199, -17341, -17477, -18168, -17355, -12925, -9325, -6614, -1334, 3150, 5645]
360E645K395K157O88j736j166j315l250k467q48k000j152K80O51N49J069K138
376A638L49q10K98q31l422k708k814l335l873k155m37n89J939M800M530O094Q581
393G255O946O490O245M231J479j321l242o212r600r221j1029j1927r508q012n666
408d3092k543J829N529P714J1531J3977J3585J3720J3346J0002O776L094r69n279
422D9220r663j2318j3911j6244j4953j3216j1802p971k966O39M577Q875J2221
435b7512J3471J4483J5147J2599R837P592L158q12m415p007j0218j1787j1550
448B986j1699j0404p222n055k979J045L473M835O321O931P490O131M918M181J453
463A2405N2p48k306k925k740k186j954q83N05K022J567K169L357R66P81n82j936
$$ y = [5645, 8040, 10197, 10885, 9149, 7983, 6668, 3418, 951, 103, -1897, -3049, -2769, -2118, -1569, -500, 1638, 1987, 1177, 1475, 644, -2778, -5486, -8300, -11635, -15508, -17663, -18100, -18689, -16750, -11950, -7420, -1326, 7255, 14201, 20691, 26936, 31167, 32646, 31325, 28083, 21871, 12271, 3050, -7979, -19906, -29414, -37426, -43092, -45635, -43806, -38277, -30563, -19032, -5055, 8530, 22250, 35596, 45598, 52374, 55468, 54499, 49220, 39557, 27239, 13328, -2916, -17869, -31085, -42887, -50858, -53824, -53185, -48608, -39733, -27512, -14041, 442, 15589, 28188, 38025, 45617, 48775, 47963, 43548, 36541, 26323, 14536, 2986, -8713, -19117, -26339, -31394, -34373, -33328, -29855, -25020, -18699, -11768, -4278, 1853, 6771, 10952, 12405, 12457, 11709, 9403, 6478, 3738, 1552, -402, -1285, -780, 1242, 2809, 4978, 8335, 9301, 10082, 9500, 7564]
480G564m046n068n740o939o760m908m271j804J217L818O142Q746J0662J1495J0912
495B1020J1048Q705M905K745j391n781q346j1991j4092j4631j4696j2881j0447
508d5833p162k616J976N801J0219J2763J5696J5593J6119J4511J0927P838L714
521E9546j819n553r354j2818j4899j5377j4821j4174j0577o979m065N52N486P437
535c7415J0143J2212J2450J1991J0384Q268N564J974m53l004o227p089p817q483
549B498p073o205m571k651j116Q78K153K948L890K827L231K132J285M95q94j070
565a243j400j932r08ON55K071K867L789M039M162L711L374J209M9k093m629n051
582H576p459p833p728p347n766m022j742J552L581O155Q867R511J0687J0503R357
$$ y = [7564, 3518, -1550, -7290, -14229, -20989, -25897, -30168, -31972, -30755, -26937, -20795, -12049, -1387, 10108, 21020, 32068, 40773, 45678, 48423, 47032, 41251, 32905, 20914, 6822, -7809, -22505, -35386, -45833, -52995, -55611, -53635, -47834, -37615, -24852, -9156, 6437, 22556, 37067, 47994, 55832, 59546, 57727, 52174, 42820, 30002, 15103, -274, -15095, -29269, -39846, -46825, -50890, -50338, -44852, -37415, -27272, -15060, -2610, 9381, 19765, 28033, 33597, 35571, 35118, 32114, 25887, 18798, 10981, 2498, -4575, -10780, -15351, -18002, -19118, -18240, -16087, -13139, -9249, -6422, -3191, -1059, 226, 721, -173, -1243, -2643, -4575, -5483, -5477, -4922, -2851, 16, 3805, 7844, 12006, 15717, 19091, 20300, 20349, 18256, 13627, 8576, 1117, -6716, -14444, -21791, -27557, -31579, -33321, -31769, -28188, -22033, -13166, -3655, 7032, 17535, 26892]
597B6892P537M975J987j150m020p281r051j0778j1784j1134r929q166n586k355
611c9843M92L802O596Q578J0318J1131J0354R718P691M726K461m25l028n383p731
626A9457q543q953q568p797o084m228k112J90K363L600N245N909N467N949M690
641F585L336K847R81q45p67k699k588k859l006k270j913j012k65J91L15R56R27
658b086J179N81k85K5j369j015j293j496j239n70Q0P05J507J994L272K885L561
675F436K887K538K031P05l70j229k773l505m429m337l986m198l089k004j055P06
691a5672J754K951M373M474M759M822L970L578K120R68l72j719l094l785m623
706D504m110m812l984k937k553j200M68J175K168L235L446L688L811L279K489
$$ y = [26892, 34429, 39404, 41391, 40241, 36221, 28940, 19889, 9111, -2673, -13807, -23736, -31902, -37488, -39843, -39351, -35549, -28953, -20375, -10057, 1074, 11428, 21146, 28837, 33563, 36024, 35599, 32571, 27188, 19457, 10914, 1961, -6607, -14404, -20488, -24716, -26828, -26638, -24275, -20675, -15430, -9521, -4054, 1895, 6585, 9921, 12768, 13749, 12904, 12137, 9438, 6850, 3991, 985, -1285, -3198, -4210, -4475, -4284, -3969, -3013, -2086, -907, -326, -611, -586, -1955, -2970, -4263, -5759, -6998, -7568, -7488, -6783, -5276, -3282, -10, 2875, 6436, 9323, 11861, 13892, 14597, 14227, 12998, 10225, 6720, 2291, -2046, -6032, -10230, -13319, -15323, -16378, -15672, -13918, -10967, -6594, -2120, 2639, 7461, 11431, 15009, 17129, 18097, 17725, 16006, 12912, 9127, 4504, 394, -4418, -8402, -11339, -13892, -15092, -14624, -13449, -11281, -8046, -4600, -912, 2899, 6178, 8667]
721H667J578J212r5j427j467k574k440l060k632k305k186j432m89p9J1J508J395
738e815J861K052J454J796J258J044N50J26k05n38q12q30j515p51r66j259m22
755b972k87p92O02K31N79R11M55J539N52R64P76L84J57M55n61l4o17p62m47q62
775B71q37p67m18K1k19k9J57Q18J75J209M22R64R77K54M57N61j64k71o85n46r10
796A440j061m48j099m65m18m57L53r5O4J008L37P26J6N20K94K84j35n1o93K29
816C49m08l88m5J81M0K59L27L70K32N7k8j98l50q47q23j155p03j563q61M3o90
837f201N41N98J073J972J808K516J859K255J545J043J23k10j460j457k388l209
853D08l024l076k804j801j522n76L30J561K553L413L535L891L736L700K884J282
$$ y = [8667, 10245, 11457, 11362, 9935, 8468, 5894, 3454, 394, -2238, -4543, -6729, -8161, -8650, -8729, -8718, -7210, -5815, -3954, -1902, -448, 1348, 2606, 3650, 4200, 4326, 4121, 3583, 2771, 1941, 426, -325, -1291, -2550, -2972, -3259, -4051, -3449, -3218, -2639, -1728, -1273, 266, 818, 1782, 2558, 2942, 3099, 3554, 2993, 2959, 2342, 1580, 1133, 271, -566, -1333, -1751, -1730, -1949, -1978, -1821, -1003, -828, 381, 803, 1767, 2744, 2998, 3455, 4016, 3852, 3581, 2896, 2350, 1440, 379, -69, -1168, -1633, -2051, -2508, -2155, -2250, -2186, -1178, -841, -115, -99, 421, 715, 999, 864, 813, 120, 349, -59, -447, -492, -311, -271, -12, 315, 685, 917, 974, 946, 748, 398, -449, -1272, -2427, -3130, -4693, -5554, -5511, -6201, -5660, -5062, -3989, -2017, -209, 2307, 4166, 6421, 7966, 9009, 9132, 8922, 7462, 6005, 3617, 408, -2616, -5692, -8496, -10297, -11819, -12395, -12065, -10504, -7951, -4538, -1003, 2888, 6624, 10324, 13208, 14490]
869A4490J240m64j519k716l558l950l911m237l513l283k044q76n6J559K381L374
885g083L715L852L975L313K642K168N90k40j105k145k608k752l481k944k669k430
901g202j213p49J02O74J302K047J731J849J220J255R91N90m16k16j75n47p78m66
919al40K76L32N96R31P13P03J56J64j78j092j226j737k240k162k223j593j123
937a0044m18M28J352K257K550L809L208M401K686L166J723N15n58j623l115l560
953F777m351m388m802m284l285k438q33O33J906L096M440M421N421M757M145M099
969A5314K295J061m43j736k885l616m927m745m759l944l643k390j207N8J411K508
985a1648L066L585L831L383L432K458J808R62m93r56j169k315k461k683k265j728
$$ y = [14490, 15730, 15266, 13747, 11031, 7473, 3523, -388, -4625, -8138, -11421, -13465, -14341, -14397, -12838, -10457, -7083, -3368, 484, 4459, 7772, 10414, 12582, 13172, 12932, 11827, 9682, 7074, 4322, 841, -2103, -4772, -7202, -8415, -9164, -9062, -8388, -7086, -5039, -3308, -1459, -239, 1016, 2007, 2597, 2181, 1965, 1790, 1243, 465, -1, -341, -65, 267, 863, 1794, 2507, 3210, 3366, 3530, 3352, 2260, 1034, -703, -2943, -5105, -7328, -8921, -10044, -10462, -10034, -8682, -6425, -3875, -66, 3142, 7543, 10229, 13395, 15118, 15633, 15075, 13452, 10337, 6777, 2426, -1962, -6764, -11048, -14333, -16771, -17604, -16971, -15065, -11969, -7529, -3108, 2313, 7070, 11215, 15314, 17609, 18670, 18227, 16491, 13606, 9990, 5063, 318, -4441, -8385, -12028, -14418, -15625, -15567, -14156, -11648, -8582, -4997, -1166, 2217, 5649, 8107, 9915, 10877, 10384, 9428, 8259, 5944, 3483, 800, -1465, -3193]
1001c193j391q49k26k04P69P93J163J047O62O25O85n77k95j68o74k91m08J80N57
1020a795Q35J167J320J288J961P18J484J57k82n58j444j905k318l078k499k189
1036g138j995j409n58M96J172K026K872L592L217L715L013K852J942N60n33r83
1052A2841k509k977m046l562l556l583k933k026p85J08J024K005L537L018L578
1067A34L527K897K508J931R77j58q14j987k362k890k687l121k687j924j527m87
1083h670k32K43J368J754J654K105K246J175J295J125M20L7l27o76j286p65j121
1100C45r14l19o40k93L95l85M83M22K16M41p5r8m68k28j68j86l76j0k13J11Q34
1121a126L38O91Q78J086P86P73M96L82K2o53o16m82j668j014j531p87j052n61
$$ y = [-3193, -4584, -5433, -5659, -5863, -5094, -4301, -3138, -2091, -1429, -804, -119, -696, -991, -1159, -1833, -2124, -2532, -2352, -1795, -960, 207, 1527, 2815, 4776, 5494, 6978, 7135, 6853, 6295, 4851, 2946, 628, -2450, -4949, -7138, -9133, -10542, -11100, -10604, -9432, -7406, -4534, -942, 2275, 5990, 9003, 11855, 13797, 14357, 13824, 12841, 10332, 7355, 3309, -253, -3809, -7392, -10325, -12351, -13136, -13028, -12004, -9999, -6462, -3444, 134, 3661, 6558, 9066, 10997, 11974, 11816, 11002, 9015, 6653, 3763, 1076, -2045, -4732, -6656, -8183, -8670, -8902, -8659, -7291, -5537, -3883, -1778, 468, 1643, 2938, 4063, 4483, 4520, 4193, 3517, 2231, 1466, 345, -569, -888, -1528, -1821, -1426, -1811, -1328, -906, -690, -249, -324, -422, -890, -1118, -1286, -1472, -1848, -1858, -2071, -1960, -1126, -788, -97, 781, 1867, 2653, 3426, 3922, 4304, 4326, 3673, 3057, 2575, 907, -107, -1638, -2425, -3477, -4038]
1139d038l84p9N68R14J142J354R95J731J145J050P99l2j33k02q51r61j292j186
1157E40j401j211j190p49k70M5P3O98P70O52J399J280R63Q92R05k32M43j65n56
1176B886o17j459n70j061j127m79j037k91Lj71K96P35P34O78J250Q01R38M58P81
1195B748K22M6k00o22l99q87r72q72m76j336m31m27R5K15J47R64R33Q45J156J115
1215A864J042J063J53N20k65m08p54r25r86j013j534j196p09p44j15l52N82P84
1233b993O16J823R60J059J414P81N24M04o9m4p26p59j245j159j241j055p16n58
1251b984m19M5K37O50L40P90P65P07O70J60M95k16l50J88m49N4p73j55L51j45
1271c9J8R0M90P4M71k00J07m40n44m57j115r08q22o32n23j00M7K65Q37J211J687
$$ y = [-4038, -4422, -4501, -3933, -3019, -1877, -523, 472, 2203, 3348, 4398, 5197, 5165, 5032, 4830, 3979, 3018, 1726, 540, -861, -2072, -3262, -4011, -4281, -4236, -4163, -3465, -2695, -2043, -644, 636, 1599, 2491, 3396, 3164, 3607, 3442, 2886, 2269, 810, 240, -821, -1948, -2427, -3464, -3755, -3752, -3923, -3627, -2892, -2158, -1480, -230, 571, 1509, 1967, 2748, 2970, 3016, 2816, 2194, 1795, 908, -64, -936, -1412, -2748, -3179, -3606, -3511, -3296, -3149, -2185, -1252, -407, 749, 1864, 2906, 3969, 4122, 4642, 4377, 3969, 3215, 2290, 1304, 291, -1243, -2439, -3148, -3892, -4007, -4359, -3777, -2993, -2377, -554, 406, 1465, 2879, 3660, 4184, 4588, 4519, 4475, 3749, 2990, 1745, 586, -655, -1710, -2426, -2984, -3403, -3358, -3121, -2471, -2131, -1341, -576, 131, 801, 961, 1456, 1240, 890, 1078, 629, 683, -90, -245, 106, -39, -21, 69, 559, 633, 1104, 904, 1011, 571, 27, -430, -1545, -2453, -3275, -3907, -4430, -4530, -4483, -4218, -3381, -2170, -483]
1292d83K024J810J192J418J252K02P4j049j265j858k011k508k284k508j809j251
1308i054p56K75Q50J705K317K980K956K890K921K102J603O48n8q09j992k330k998
1325C250k666l332k914j926k128m20l65Q47J714K003K428K944K737K273K471J157
1341H073Q03o5o22j293j794j809k067k444j413j380j473j00m2P36L52R18J293
1358b327J213P95P26M44J82m21m07l9q9n68k9L47OM98R40N96Q98M66O33l04k50
1379C310p24j083j474j769j815j802r75j589l24K44Q02J440K058K391K709L152
1395D551K622K023J454Q65k71q08k218k406l023l303l142l317k846j677p72K36
1411a2032R28K053K903K895L560L498K762L054K097P10O5j032j627k455k881l168
$$ y = [-483, 1541, 3351, 4543, 5961, 7213, 7415, 7489, 6440, 5175, 3317, 1306, -1202, -3486, -5994, -7803, -9054, -9810, -9535, -8685, -6980, -4663, -1683, 1273, 4163, 7084, 9186, 10789, 11437, 11379, 10570, 8578, 6248, 3250, 584, -2748, -5662, -7588, -9716, -10136, -10501, -9654, -7940, -5937, -3509, -565, 2172, 4445, 6916, 8073, 8876, 8811, 8189, 6896, 5102, 3293, 1226, -1218, -2631, -4011, -5484, -5584, -5626, -4890, -4538, -3620, -2327, -1114, -319, 407, 851, 1033, 612, 205, 166, 77, -491, -520, -173, -167, 331, 1271, 1867, 2765, 3231, 3864, 3560, 3310, 2586, 1503, 29, -1740, -3555, -5357, -6332, -7921, -8245, -8001, -7199, -5759, -3701, -1310, 1399, 4551, 7173, 9196, 10650, 11515, 11244, 10436, 8218, 5812, 2789, -514, -3656, -6973, -9819, -11496, -12268, -12032, -11104, -9051, -6148, -3253, 307, 3805, 6567, 9621, 11718, 12428, 12493, 11461, 9834, 7379, 4498, 1330]
1427A330l580k603k433j557j212k80P95J285K002K460J918K328K292J696J433
1442E874L34L98m34j159j168j475j343j075j571q33l15k02K59K3M46N86O46k6
1460a035L00Q7kl55n76k61j78j48l9N94M07J116J071J362P11J253P76N00m7n99
1480D937o67j756j427j932j982j860j269j082l97J1P96J074K022J845K585K282
1496C180K249J691J421P30L6o24j464k074k313k243k772j866k022j141j109m1
1512h362N75J152J620J968K117K479K033J603J089R16j1r2j317j090j514k003
1528A163j737j842j117j169p92j38K87M48J112R55J279J391R60R16O42K75L9M4
1546B716m01o49k92o68q72l31l41n12k26M14j85K02L76M19k1J02n0l2J25r4o5
$$ y = [1330, -2250, -4853, -7286, -8843, -10055, -10335, -9540, -8255, -6253, -3793, -1875, 453, 2745, 4441, 5874, 6208, 6606, 6172, 5013, 3845, 2370, 1027, -48, -1619, -2452, -2767, -2969, -2710, -2687, -2241, -1655, -1009, -1035, -735, -648, -650, -1005, -1581, -1842, -2020, -2168, -2207, -1613, -1206, -90, 981, 2343, 3054, 4307, 5083, 5583, 5536, 4937, 4270, 2514, 1087, -845, -2827, -4687, -5956, -7038, -7435, -7424, -6628, -5554, -3532, -1687, 898, 3180, 5429, 7120, 8541, 9271, 9307, 8683, 7219, 5145, 2832, 589, -2183, -4049, -6071, -7212, -8321, -8362, -7787, -6635, -5015, -3047, -930, 1549, 3582, 5185, 6274, 7190, 7179, 7087, 5770, 4680, 3166, 1163, -574, -2416, -3533, -4702, -5494, -5632, -5345, -4897, -3785, -2830, -1551, -160, 800, 1716, 2358, 2633, 2672, 2716, 2315, 1666, 1374, 706, -166, -497, -838, -1350, -1576, -1162, -1347, -1145, -769, -350, -371, -269, -319, -351, -226, -320, -385]
1567c85l93L84j62j38N61O6P85p1N43L5K48N9K65n45L29n87n36k25n70m01j90
1588i28n66P2k11K51M99qN30P58N73K84K29J90O15o0k52l43m38l39m37o26o48
1609h55o49pj76m61R6M17J0N49M91P34P07K21M88L07J19j9m18q5o73p44j92j134
1631a274l62o95l48k95p0K08L12O10N94P91R50J069J073R0N40L11j04k94q53o25
1651A628j090r18j425r33q11o54k73K11L36P51J107J356J011J498J049J742N97
1668E182J59m1m7r01j184j196j658j355j686j048p26n01j47R2P24J421J067J606
1686b39J372J538Q51J091L12K20l05m70j447o49j416j479o78j233n83l50j12J5
1704c562L90P14O62P71P86O97M58K55K07l77J56n17k52l38r9J5J22O6L84M23L23
$$ y = [-385, -778, -394, -556, -694, -133, -67, 718, 647, 1190, 1225, 1473, 1532, 1797, 1252, 1581, 994, 458, 233, -337, -738, -928, -1494, -1422, -1633, -1382, -883, -891, -361, 397, 970, 1254, 1483, 1673, 2288, 2228, 1976, 1633, 1195, 856, 419, -207, -855, -1504, -1511, -1687, -2148, -2052, -1635, -1625, -1076, -585, 149, 856, 1077, 1565, 1872, 1991, 1972, 1554, 1469, 796, 52, -140, -1274, -1636, -2331, -2679, -2974, -3044, -2836, -2524, -1914, -1320, -529, 421, 1490, 2563, 2653, 3193, 3504, 3400, 3106, 2253, 1628, 538, -380, -1805, -2738, -3549, -4203, -4476, -4265, -3929, -3178, -2071, -715, 296, 1794, 2843, 4585, 5182, 5341, 5300, 5253, 4352, 3168, 1972, 314, -1041, -2727, -3775, -4501, -5002, -5149, -5057, -4333, -2912, -1845, -239, 1133, 2671, 3522, 4613, 4925, 5145, 4840, 4370, 2923, 2274, 858, -621, -1299, -2532, -3115, -3465, -3577, -3562, -3172, -2458, -1796, -1025, -239, 458, 916, 1171, 1378, 1001, 1157, 640, 388, 50, -49, -34, 88, 154, 538, 961, 1284]
1725A284M20k37j18O9q52o69r15r53j128p91p53o4k42O22O22J259J645J373J942
1744B514J771J403J030O13M6m51j405j464j978k279k230k384j996j503p77j13
1760i203O06J553J858K432K411L020K702K146J502R39N90j062j289j958k426k502
1776A319k755k570j939j670j174p3O66P53J550K158K198K252K078K006R39J019
1792F757J22J22j271r76j806j537j408j508j348m80l35l13m5O99O41N83R54O34
1810e15K46M27j31J5j50n47l10L2j01M52L64O40Q81N41J193M84M43M58p23m78
1830C221j019j712j376j730j755j269j192l17k34O64J159J680J883K451K297K382
1846E133J874J429J268r2o31j286j926k237k831k960k289k465j668j242q4P30
$$ y = [1284, 1704, 1467, 1349, 1418, 566, -103, -1018, -1971, -3099, -3890, -4643, -4707, -4949, -4327, -3705, -2446, -801, 572, 2514, 4285, 5688, 6718, 7331, 7377, 6926, 5521, 4057, 2079, -200, -2430, -4814, -6810, -8313, -9090, -9203, -8597, -7044, -5186, -2754, -343, 2677, 5379, 7525, 9027, 9966, 10556, 9494, 8205, 6247, 3821, 1319, -1436, -4006, -5945, -7615, -8789, -8862, -8196, -7443, -5893, -3735, -1537, 715, 2793, 4799, 5738, 6757, 6879, 7001, 5730, 4754, 2948, 1411, 3, -1505, -2853, -3333, -3668, -3981, -4026, -3327, -2686, -2103, -1149, -515, -269, 158, 27, 42, -108, -655, -965, -933, -1034, -582, -218, 422, 1303, 1844, 3037, 3521, 3964, 4422, 3699, 3221, 2202, 490, -886, -2616, -4371, -5640, -6832, -7149, -7383, -6719, -5560, -3880, -1997, 454, 2751, 5133, 7007, 8436, 9704, 9612, 8981, 7695, 5769, 3532, 701, -2259, -4548, -7013, -8681, -9923, -10007, -9277]
1862i277J106K226K520K313K889K767J848J763J125K54l11j262j603k205k107
1877B046k586k119k125j368q74l39M78O34J311J403J675J862J067J450J049M59
1893D023J49l71m91p20p44m27j411n37n38k57j35QK66J87N18j51J95l3q1j85m47
1914a182m37k12m54l7K6K77P64O66J074Q90J056R45Q34M47or1o79j063j670j350
1934b02j005j867j129j144n53j31L17R15J280J435J777J973J679J736J113N37
1950F731M77p26n15j557j551j663j927j903j293j286o51l26K07Q51R11J498J436
1967a287J686J683J108P54Q48L25k55n21q71j266j042j524n64r83j287j92q2J19
1985c351K57M33P40N95Q31P27L64P66J03n5q4J9k94l94l23k09l08j20o5j72L40
$$ y = [-9277, -8171, -5945, -3425, -1112, 1777, 4544, 6392, 8155, 9280, 9534, 9223, 7961, 6358, 4153, 2046, -540, -2659, -4784, -6152, -7026, -7365, -6887, -6253, -4942, -3539, -1864, -2, 1065, 2515, 3564, 4023, 4172, 3801, 3310, 2590, 1846, 1419, 8, -529, -1067, -1324, -1459, -1451, -1185, -998, -480, -631, -436, -469, -550, -735, -1182, -1619, -1831, -2285, -2322, -2296, -2019, -1255, -589, 485, 1375, 2431, 3376, 4210, 4657, 4651, 4560, 3881, 2818, 1148, -202, -1207, -3074, -4203, -5347, -5900, -6031, -5714, -4799, -3519, -2084, -307, 1666, 3345, 5081, 6194, 6731, 7208, 6482, 5967, 4410, 2859, 1196, -731, -2634, -3927, -5213, -5864, -6190, -5983, -5132, -4221, -2723, -1287, 399, 2082, 3190, 3944, 4792, 5117, 4862, 4341, 3470, 2204, 1162, -362, -926, -1909, -3196, -3388, -3470, -3351, -3094, -2661, -1921, -1326, -495, 232, 596, 1362, 1465, 1410, 1326, 1345, 1051, 657, 334, 125, -183, -303, -368, -540, -200]
2006b00r9J78J47k7K82k08n95R9j3l20j24j76J03J12K51Q2M04J68M73M22L74M82
2028A815j27J0L30l94m12k55m70o81o04o37r1k81R9j0L49K57N84L70O89M53N66
2049A560L0K18K68k9k36l99p17m90m7o83m29n18r0k35P9K46o8L85P21J93M29L84
2071E72N07J39q4l13N93m70n65K99r13l10l79m75l14o4l18L28J98K59K76N82O46
2092A94L08M11L79J14L63Q1k80l57n42r6n54p84k55m79l80J01j91l6O87L02N42
2113d72O07N45O88M14K84L76j73L59n54l07n25p27p58p90j51n24l81n1m8J81O56
2134a351N18N93L67O08O75L24K94J28J83n16l03p47l13m13m51n46k49j29j59K54
2154a233N0M62k21M49K46m0M45j7K3K8p5j26Q0l35K02j63J09K59J17O00R9J26
$$ y = [-200, -299, -121, 26, -1, 281, 73, -522, -423, -436, -756, -880, -1056, -953, -841, -590, -508, -104, 64, 537, 959, 1333, 1815, 1688, 1698, 2028, 1634, 1222, 967, 497, -184, -788, -1425, -1516, -1797, -1698, -1708, -1359, -1102, -518, -148, 541, 994, 1560, 1590, 1808, 2076, 2047, 1811, 1412, 695, 205, 158, -525, -954, -1472, -1562, -1797, -1718, -1472, -1540, -1155, -434, -241, 188, 572, 1079, 1218, 1134, 821, 1414, 944, 379, 678, -235, -545, -924, -1399, -1713, -1777, -2095, -1767, -1569, -1310, -1034, -452, 194, 502, 913, 1292, 1406, 1769, 1850, 1570, 1213, 671, 575, 21, -763, -1018, -1497, -1877, -1776, -1967, -2003, -1316, -1014, -472, 135, 680, 1368, 1782, 2066, 2442, 2269, 2628, 2074, 1767, 1242, 515, -243, -1033, -1184, -1708, -2089, -2140, -2188, -2007, -1351, -833, -240, 127, 735, 1410, 1734, 2028, 2156, 2339, 1823, 1520, 773, 460, 47, -404, -950, -1199, -1328, -1487, -1233, -1183, -721, -942, -493, -247, -287, 158, 141, 164, 192, 117, -9, 71, -264, -62, -225, -116, 143, 260, 860, 959, 1085]
2176A085j3k56p2Q5q25m53n28n53m95k39k95R8P9M21O74O06Q13J001O92O36O92
2197C153N35n9k27k40q11r59q88j143j296q59r27l47j81N19K62P27J288Q55J377
2216G79J443Q40R98O79j20l5n14r22j012j046j305j021j176r71m97k12K35K46
2234c611P15J027P15R60J112O79Q67kL43K8n29j74q43m65n67p04o21mj88l03J45
2255a420M9M40p7L18N35m64K50K25l56K14k00j74j04J80J09K74j27Q94N26L88
2275A480M15L47n7l57l14k32q12m32j136m62j033l18o51lK91O51M92R04J335Q35
2295I43J336J106N29M72K40j90n26p20j376j123j287j196j006q27j026J64L69
2312d118M84M61J304R81J090J476J307P68L60n1K9m96q65p14j031j215m85j076
$$ y = [1085, 1072, 816, 744, 829, 4, -449, -977, -1530, -2025, -2264, -2559, -2461, -2382, -1961, -1287, -681, 132, 1133, 1825, 2461, 3153, 3688, 3629, 3402, 3162, 2351, 1392, 504, -639, -1935, -2794, -3721, -4068, -4249, -3730, -3468, -2741, -1453, -598, 779, 2222, 3062, 4060, 4739, 4619, 4584, 4070, 3148, 2136, 1090, -215, -1236, -2412, -3383, -3880, -4092, -3857, -3611, -2896, -1869, -1154, -194, 918, 1597, 2464, 2462, 2805, 2833, 2304, 2130, 1287, 822, 255, -449, -1070, -1074, -1262, -1565, -1420, -1371, -931, -1008, -690, -155, -619, -369, -144, -500, -286, -486, -660, -764, -584, -475, -201, -328, 566, 1092, 1480, 1895, 2242, 2185, 1828, 1514, 1282, 470, 38, -1098, -1560, -2593, -2911, -3562, -3565, -3274, -2623, -2131, -1227, 108, 943, 2279, 3385, 3914, 4386, 4626, 4436, 3910, 3190, 1814, 691, -596, -1792, -2798, -3625, -4651, -4487, -4118, -3634, -3173, -1869, -888, 202, 1678, 2985, 3753, 4113, 4062, 4091, 3595, 2730, 2016, 985, -230, -715, -1791]
2330a791q44j17m33Q7L00M09M26R48O66Q41L30M65L91m1N5n08j15l66l45k19m12
2351b73j09k2J33k65K13K51j26L35j95n4l36q5j28m51J47n33k70K96K84K98M41
2372d49L20N22P97M83L89P58k97p0m62k33p22p27p05j008n43q06j6j78L4J18P75
2393b020Q79P90J147Q88P89M82M71J35J3m62p80n50j043r24j100m64o64n78J2
2412b979J36K3L66P61P92Q25O93Q35N13J37M74l25k55l97m19n34o15l50o16l62
2432a297l88j30M57r3L15K98J54N61K68J0K2L9k88L18l4k50j02J06M21l26j51
2453i0J79L16l5J22K47j00j11k14k4l72l2l41m28K11n94L11P7L8Q0M52N37J69
2475C98N24j44O55K40O5k23j14j95m23n33j92q29j47k63l10O1k9L44J2K77Q67
$$ y = [-1791, -2635, -2752, -3185, -3098, -2798, -2389, -1963, -1015, -349, 492, 822, 1287, 1678, 1637, 1692, 1184, 1069, 703, 358, 139, -273, -382, -404, -271, -536, -323, -72, -198, 137, -58, -112, -448, -533, -661, -1112, -965, -1498, -1768, -1472, -1188, -890, -449, -129, 393, 1190, 1673, 2062, 2820, 2523, 2453, 1991, 1758, 1036, 309, -396, -1404, -1947, -2753, -2769, -2947, -2913, -2795, -2020, -1141, -351, 796, 1684, 2473, 2955, 3426, 3561, 3574, 3112, 2332, 1782, 739, -185, -1285, -1749, -2413, -2991, -2979, -2843, -2820, -2454, -1693, -901, -76, 617, 1452, 1965, 2102, 2576, 2251, 1996, 1599, 1180, 646, 31, -319, -935, -1297, -1685, -1815, -1358, -1451, -1136, -838, -684, -123, 145, 155, 177, 216, -72, 246, 212, -38, -140, -34, 387, 61, -90, 89, 405, 370, 492, 739, 639, 528, 314, 290, -82, -114, -455, -883, -672, -1266, -955, -878, -840, -760, -308, 229, 398, 922, 778, 1433, 1673, 1738, 1515, 1401, 1206, 783, 250, 58, -771, -918, -1181, -1491, -1430, -1459, -1115, -1103, -826, 41]
2496D1M28L79J58K49J21J71J15k69j57k24o35n19o40K61m84l58K74l15J53K25
2516a026J71L00L97L75qJ48M72k51J3l5m9nq7m00j51l51m24M96j35k00L25k21
2538f46J2K86J68R5nK35nJ72J18k34n3j62J3o1K49j43l60L65j28j0m4N1j16n2
2562b55L13j7nm2K09r9J15j21l8J39k4J53j61j52L6p2n4j94N97l83k02L52k17
2585a22K14P6k72K16j86K53j38j90L06K34k89k58K26k39j41L58k66J27j5p2J80
2606BK62k45k91K80l31L47l67L28l03n1J25K23l87M33k0R9j7J15K6J28R9o1j45
2629B49k37n0k22o9m5j06m24K80o4M2J63J02M05K59J59p2L45L15k94K48j9o5l02
2652E98j10l72j22l77j27j18l56Q0j16K52J39L10L87M78L7Q0L53L11J96m11P3
$$ y = [41, 469, 848, 1006, 1255, 1376, 1547, 1662, 1393, 1236, 1012, 377, -142, -782, -521, -1005, -1363, -1089, -1404, -1251, -1026, -855, -555, -158, 217, 209, 357, 829, 578, 591, 556, 507, 502, 415, 15, -136, -487, -911, -415, -550, -750, -425, -646, -634, -348, -180, -85, -90, 145, 140, 312, 430, 196, 143, -19, -6, -67, 182, 39, -321, 44, -84, -94, -138, -87, -203, -255, 58, 41, 36, -6, 203, 104, 219, 98, 60, 199, 175, 328, 167, 15, 51, -21, -75, -269, 328, -55, -257, 95, -122, 92, 168, -104, 112, -74, 179, 41, -149, 157, 391, 102, -156, 70, -169, -310, 48, -218, -91, -106, -178, 2, 264, 19, -272, 8, -323, 24, -343, -15, -318, -369, -244, -21, -408, 25, 5, 104, 87, 202, 228, 356, 455, 394, 249, 12, -38, -260, -329, -374, -480, -904, -624, -688, -646, -483, -381, 24, 283, 442, 370, 715, 1030, 736, 984, 965, 900, 598, 488, 116, -6, -383, -510, -628, -984, -904, -1020, -768, -629, -319, 68, 546, 583, 663, 1016, 1327, 1523, 1112, 1185]
2673A185p64K03k22m78j52k27o06r0O6K32j21J13L09K65J02M19Q2J99J93j22J54
2694G40j70Kk42Pn72J86k43k20K34l62L44M3j9j27j86M34q9r7k13K52K73k26l2
2717b83l3r7L26O7K59k41L02L15J80r0l11L69j94k26o4l63l03k59l3k32l63k6
2739a300L42j9K20J40O55L55L44M83J69J79rj26J5k76l05n07k78m73l63m05k3
2760a182j53l28O79R1M73K74M43M8O32L78J8Kk91L08l88k61m53k48l60k73m12
2781a003k90J17j80j15P40J6M19J92J37J14K09n2K37O5L3l24l0l66J53j37k10
2802b75q2K28n0j44K64j21J39k6Lm50L70j18N1k37j43J3K0l6L52K69P5M2L30L24
2826G98J57k9K23O7k82j93l49k83n37p9j83k71l5j00L53k34M68J31N75P5L78K38
$$ y = [1185, 421, 624, 402, -76, -228, -455, -1061, -1151, -1085, -853, -974, -861, -552, -287, -185, 234, 316, 515, 708, 586, 740, 570, 572, 330, 337, -235, -49, -292, -512, -278, -640, -296, -253, -272, -399, -585, -151, -240, -337, -550, -298, -25, -251, -283, -316, -413, -87, -20, 239, -2, 300, 615, 795, 705, 394, 763, 569, 343, 279, -84, -387, -646, -679, -911, -1274, -1300, -958, -977, -757, -617, 38, 393, 737, 1220, 1389, 1568, 1559, 1433, 1448, 1172, 867, 360, 82, -391, -754, -1159, -1182, -1335, -1663, -984, -893, -420, -146, 297, 345, 977, 1355, 1373, 1375, 1084, 1392, 1004, 743, 290, 42, -318, -591, -1003, -1293, -1176, -1356, -1471, -731, -715, -296, -104, 33, 147, 356, 304, 541, 606, 639, 315, 285, -81, 72, -65, -275, -357, -129, -179, -323, -59, -180, -41, -67, -64, -514, -144, -262, -211, -448, -591, -578, -558, -594, -242, 27, 102, 144, 474, 798, 955, 926, 1149, 1216, 934, 741, 392, 109, -428, -507, -690, -961, -996, -1096, -743, -977, -509, -378, 197, 272, 650, 888]
2848H88M08J72k89R6m6j48k02m05n26m63L2m82p9Pk3j35N51Q7K89M16J7L48J61
2871F74K35j9k10K28J22o71m24Qj51k04o3j01r8n2K04j08N34j22J00L5K54qN2
2894B15j20P3P3k40L07j92j98j34K54n0J34j22J17J32j08j89K64j03j76j8n3J3
2916a21j47j03L2J16JP1J46J88nJ26r2K22j1L87n60r4J43p6N9k51l25J29j02k20
2940d87K83k41M1R2J26K00N0K75J47l8n4J22J07m26J12o5j18j43k82R4j84j10
2962d99K06m9nJ33O7j35J21K90J95k16m8M65j51J26j62q0k95o2p5k51K46j76l3
2985c88m4jJ61k7J60k5K32J73j72K41J48p2kj26j57L51o59L43l7j98k51J04p9
3008c25P1j16J32Q6R7J48Q8r2J76J82K13l0J0j63k15J50k40l57r7j67L68k58k18
$$ y = [888, 1296, 1468, 1179, 1275, 1229, 1081, 879, 474, -52, -515, -483, -965, -1044, -1037, -1060, -1195, -644, -557, -268, 148, 165, 513, 674, 909, 890, 680, 908, 1030, 359, -65, -57, -208, -412, -475, -576, -674, -726, -522, -630, -96, -218, -118, -83, 171, 163, 215, 95, 168, 241, 1, 308, 116, -82, -216, 38, -12, 122, 0, 117, 249, 141, -48, 216, 113, -63, -81, -134, -121, -268, -371, -339, -223, -222, -151, -5, 183, 178, 304, 212, 434, 423, 810, 250, 156, 299, 223, 282, 31, -294, -165, -267, -487, -204, -445, -404, -312, -186, 14, 64, 339, 486, 448, 394, 516, 623, 197, 309, 244, 126, -17, -299, -205, -389, -499, -293, -342, -347, -214, -147, -282, -161, 129, 324, 108, 60, 525, 374, 500, 338, 258, -37, -99, -174, -425, -179, -355, -388, -432, -433, -272, -299, -139, -164, 68, 241, 69, 310, 458, 386, 384, 258, 101, 452, -207, 136, 99, -99, -350, -246, -325, -254, -370, -238, -152, -55, 93, 181, 89, 265, 447, 660, 630, 640, 477, 262, 412, 172, -185, -282, -449, -81, -339, -557]
3031e57N6R7J65P1Q6K12L7J34j31O1L08m17R3k81L01k80j05k2K33l78p9L15p1
3054a52q6P4J68l05L75l34K58j23j84J85ql57L93q5l7O9K15R1J35L5l13J82J60
3077C56J33l15K5l90l2o2j35l6n40M71K7j05J11K74P1Q7K37L35J12r0O07k83O4
3100I22r4j44o3n36m31k51m9n0k50M28k30QJ28M30N8m3O04R4N16j0j0k38l24K52
3124G17k42r8l96k00k14o9l26K99k10L53o7m2O29j19R4L40k8K0j08L32l26j5Q5
3147D09m10J21j70j46k1l5K39L8j25j24j04L38j17R5j9j99r4O7r5j05K64j3Ll2
3171b35O26m65L81L51k82r1J87J48j62j46m6k2l76k10k22j48k5k0j54L04N1K43
3193c13L27O57k14J86K37n4L0q8K10l78K8l92j23m22n25J04l54J39K84k84L97
$$ y = [-557, -501, -404, -239, -168, -82, 130, 167, 301, 170, 231, 539, 122, 215, -66, 235, -45, -150, -172, 61, -317, -396, -81, -152, -238, -164, 4, -301, 74, -260, -2, -125, -309, -124, -132, -489, -96, -181, -218, -149, 66, 157, 292, 327, 14, 196, 356, 489, 174, 199, -191, -223, -285, -420, -456, -996, -525, -498, -603, -492, -218, -147, -60, 177, 512, 624, 534, 1141, 858, 922, 828, 684, 621, 85, -346, -597, -646, -696, -946, -518, -748, -740, -612, -182, -124, -167, 437, 531, 1047, 1037, 1027, 789, 465, 717, 475, 377, -19, -219, -433, -502, -828, -529, -739, -386, -453, -495, 134, 15, 109, 449, 421, 441, 333, 665, 339, 324, 409, -1, 120, -50, -196, -217, -252, -13, 25, -100, -224, -328, 10, -107, -12, -31, -230, -324, -257, -352, -457, -193, -206, -203, -235, 391, -74, 307, 658, 376, 285, 472, 620, 458, 312, 266, 244, -132, -342, -564, -712, -737, -757, -911, -607, -556, -313, 14, 671, 457, 643, 880, 826, 856, 768, 978, 600, 628, 236, 113, -309, -834, -730, -1084, -945, -661, -945, -548]
3214e48K11J10J74J78L49l8K96P8K36k74j73k74k36o0k33k95J30j50k80K22K5
3235e52j11L18p2P0J95Q4K35o3J79l9j21L19m54O9o2o6R9l64j7Q8L72k37J05K05
3259A80l07n0O9K50l34L81l34jO1lj36J35J66k2j17J1K74k7O0J72p3K5n1J5l70
3284b6j03mk51J04j52J89r8J01LrJ51K96J99j34N4L05j10l1j21k08P8l15n2j5
3308a49l01J58k00J6Lj18K06j34L50K66J23l4J93O5l2K03j87n8k49l4m29J92P4
3331g6m27L2l3k6J80j46K45R2k18L25J99j40N4K60K06j25mn8j69K1l21O9l05J00
3355b65o0j43j2K82j50J49N0K73J14J51j09j06K46O7K0k13j13J09n0k69%j58k08
3378c95p8J00k5P5J30N3J81M3K16Q6j07pk48M00k6L03l02k32j11j04R4p8k44K49
$$ y = [-548, -337, -227, -53, 125, 474, 436, 732, 810, 1046, 772, 599, 325, 89, 29, -204, -499, -369, -519, -799, -577, -552, -663, -345, -417, -347, -152, -68, 167, 104, 283, 244, 123, 442, -12, 57, -5, -71, 28, -336, -353, -265, 107, -130, -25, 180, -127, -177, -108, 142, -192, 189, -145, -146, -85, -88, -224, -89, 77, 55, -62, -51, 223, 196, 256, 428, 355, 380, 329, 344, -26, -129, -133, -384, -280, -432, -243, -341, -240, -237, -246, -95, 201, 400, 266, 320, 625, 515, 484, 363, 155, 233, -82, -134, -149, -450, -292, -492, -476, -473, -591, -385, -519, -169, 97, 220, 186, 379, 444, 412, 615, 428, 370, 121, 87, -342, -150, -76, -503, -471, -504, -530, -350, -496, -251, -159, -377, -52, 147, 7, 61, 321, 527, 402, 398, 340, 171, 192, -129, -60, -365, -265, -325, -468, -480, -198, -348, -199, -149, 124, 238, 389, 280, 174, 420, 487, 507, 294, 181, 290, 240, -29, -29, -187, -395, -473, -373, -398, -323, -193, -140, 41, 84, 300, 386, 279, 272, 24, 424, 398, 701, 399, 167, 56, -48, 46, -32, -276, -27]
3402b7j43K0oJ76l48L55K69m00P6j09p9k8K7J04J9M9k7J14J10L14k91K17k17j16
3426E9J48k49K92k46Q3m33j50J3j22j24K58j75K07L7M83n9L15p2J18N90l23k0
3448F30K30k21j91j7o20Q9k04m16k02J39j83J49K75j29O58q4L99J84K92M13j32
3469A059P4j90l57l3j35k11k04l54k4k75k95L90k27L19p9K70L37J65K7M55N1l7
3491G26k82L06j76o8n03J23r1k59J99j58j51J79M0j74J76P9j05j28K53P7j87J19
3513ej42J79l64R9j16K1M4K42J89J63J27n7J75q6j57j41J98j31k67j84j53l55
3535g21n2j43Q2J2j4N18J06J90K27N32P4P9K47j71p2j49j29j24k68k78l74n08
3557i36M0p7O2P2N7L0M40J79L18K77m7K46J07J9K50l25l8j50j64m45j32m59Q3
$$ y = [-27, -170, -150, -156, 20, -328, 27, 296, -104, -28, -137, -216, -244, -217, -113, -94, -45, -72, 42, 152, 466, 175, 392, 175, 59, 207, -42, 250, 4, 87, -346, -496, -483, -605, -729, -471, -646, -439, -402, 81, 22, 337, 265, 383, 973, 650, 630, 860, 639, 448, 431, -189, -100, -304, -720, -922, -783, -966, -817, -542, -671, -13, -97, 302, 486, 778, 1191, 1059, 1133, 943, 586, 553, 418, 207, 3, -351, -375, -650, -945, -555, -782, -463, -542, -272, 65, 230, 257, 712, 763, 726, 444, 750, 574, 506, 3, 126, 35, -224, -25, -183, -334, -155, -115, -289, -113, -34, -139, -267, -14, 63, -124, -5, -147, 32, -332, -233, -349, -328, -284, -42, 147, 310, 437, 380, 555, 469, 312, 171, 369, 238, -29, -213, -366, -721, -773, -916, -834, -822, -836, -318, -212, -22, 205, 737, 811, 890, 1137, 966, 894, 745, 616, 492, 224, -54, -428, -936, -896, -973, -911, -839, -782, -752, -312, -133, 185, 462, 415, 661, 768, 787, 1037, 712, 674, 524, 360, -85, -217, -676, -593]
3580e93j10q7L52r4nJ02J63L95N2R2J21k46J96J79m41J77R9k25l59K93j64L0o7
3603a40o3j41J98k2L00l87K55j26j19K96m06L4j34L8k3R1J45J6J94m5K56J40M3
3626D00L29m15L34j45k22j36j10m18J12k98Rj49mj05L2N46p6M09n8N78k11N66
3648I68k4J73l33q2n5k29k41j8o36J16k44L50l54o6K37L40j88M01j8K77R7R7L5
3671F03m45K28J32k88p3J00Kl58j24p3r2L99k69k90J35J95P1K68k24J33K55k52
3693C3RK69n15K0J30J25k51m2K9K37j5k18j07L36OK4l27M63l58j04K58j5l4L4
3717a3j41J5j09K26k5MQ0Q4J06J55l40L02j62p9j3J72j56j85L88n35K73l6j40
3740a29m9K9j27K03m0L80l19L32j35K39k19m9M7J67k43M1l63M1K02m02J34K36
$$ y = [-593, -703, -790, -438, -532, -537, -435, -272, 123, 175, 267, 388, 142, 338, 517, 76, 253, 352, 127, -232, 61, -103, -73, -140, -203, -344, -146, -168, 132, -255, 0, -126, -245, 51, -355, -321, -455, -417, -440, -349, -204, -188, 6, -39, 217, 357, 400, 729, 314, 648, 503, 281, 145, 35, -383, -271, -569, -560, -709, -713, -818, -786, -240, -316, 93, 35, 613, 402, 968, 944, 1117, 784, 702, 647, 418, 177, 159, -477, -361, -605, -255, -609, -675, -438, -98, -286, 115, 97, 374, 471, 568, 603, 158, 386, 518, 230, 157, 257, 259, -99, -223, -296, -388, 11, -258, -548, -413, -218, -147, 121, -103, 30, 285, 33, 42, 311, -204, -184, -54, 71, -180, -222, -193, 44, 29, -189, -296, 40, 46, 70, -257, 206, -152, -256, 2, -13, -47, -13, -154, -139, -248, -22, -47, -43, 37, 121, 227, 382, 42, 344, 182, 103, 90, 262, 106, -79, 309, -226, 47, 11, -129, -178, -149, -276, -73, -113, 267, -52, 280, 145, 384, 165, 116, 163, 330, 87, 128, -235, -194, 8, -394, -260, -24]
3762b4k02J2Q2p2O5j45M85l84L33j70J33Q4j06j51L38k83o8j66J79j95J26j04
3784b33l67K43L02L7J06l67J04n5L83j93J09J5K37j32j60K15j9j10m67k1L13j88
3806b48p9J89j59J52O8M7Q6J84j12K06Qm4p4j59M08n03k29N69p9m43J52o8K39
3829A11k14k43K73L5LO8k41L78RJ5P6o2J10J17l98J7NJ69j99j87K06k43j56K5
3853c26M15n2n5Q9j07%M5m69M72O6l71M00m7o5K26j65n9mJ05K21k11Om1k9J47
3878A91l61K01P1O3l34j81J91j17J99k88J29k46N92PJ25j98k7L71r6P9O7k79J10
3901B69j27n9l94K29l43K31k72O6P6J14M8K40P0P3o9j36O68k2j70j44K00l32k
3924B14k14Q3j91l04J50n1l45K33n2L83l29L59M4j15N02R4j40pN7q2l6j6l35J75
$$ y = [-24, -226, -214, -132, -204, -139, -284, 201, -183, 150, -20, 113, 197, 91, -60, 278, -5, -73, -239, -60, -255, -129, -233, -600, -357, -55, -18, 88, -279, -175, -230, 153, -40, 69, 84, 321, 189, 29, 244, 225, 115, -352, -373, -60, -248, -327, -138, -297, -145, -77, -30, 56, 240, 128, 334, 342, 298, 224, 65, 473, -30, -259, 310, 231, -212, -60, -128, 111, -103, -346, -73, -38, -35, 33, -208, 170, 179, 194, 270, 208, 318, 435, 37, 54, 59, 228, 29, -158, 48, -195, -351, -326, 89, 37, -18, 71, -36, -36, 9, -460, 12, 78, -293, 107, 60, -5, 221, 56, -3, -7, 98, 319, 108, 114, 73, 44, 191, -170, 31, 102, 165, -169, -350, -159, -276, -77, -365, -236, -482, 110, 117, 242, 44, 17, 388, 292, 371, 438, 159, 269, 142, 83, -311, -82, -425, -194, -466, -400, -324, -210, -162, 78, 148, 221, 152, 16, 684, 662, 492, 348, 548, 216, 214, 0, 83, -108, -412, -262, -313, -658, -425, -477, -94, -423, -64, -20, -135, 367, 461, 321, 314, 371, 289, 253, 237, -98, 77]
3948G7k9j69J25r1j69J06J1O5j95J03M15j93P4j56k19M20j40m31N18j11j47P2
3970f4J53N6M8K47k98L9K20j08j86j27j92K48j74j03k16J05o1j62R6K26J7R4K61
3993A19J54k12L26K7L5j9N6O9n49K36q8j17l38r8k40M21j77Qj5K13p4J23M42J5
4017C17nJ9m5J87J76k84J10k69l31J36r8M6k38J27K02k28L3m27K13J18K60p0J97
4040A46Qk89K02M0J61n1k77P2R3k71K32M7m2j94K25J00l16J53q5Q4j4j56L8k02
4064b96J52p3j6r3J12K80j51J44j25M48l62K45K6j26J99j30K22op77J42J01m6
4086a30j50j21m1J43l33N04Q2k6J79J20j77P1l4K70K37l04O2N3m95J60L2j08P5
4109F9j62j05j0pM0J01J2k3R0K43l12J74J91l21J64j36RK79M0l31L0r7j0Ll16
$$ y = [77, 48, -121, 4, -87, -256, -150, -139, -74, -269, -166, 249, 56, 130, -26, -245, 175, 35, -396, 122, 11, -136, -64, 89, 145, 193, 440, 142, 181, 401, 293, 107, -20, -212, 36, -138, -241, -457, -352, -413, -575, -479, -253, -236, -142, 119, 273, 61, 387, 414, 449, 430, 486, 555, 6, 242, 154, 37, -301, -399, -639, -218, -395, -387, -402, -189, -263, -140, 302, 317, 312, 331, 286, 473, 649, 365, 475, 206, -125, 11, -87, -41, -279, -152, 50, -178, -145, -572, -359, -241, 19, -51, 146, 154, -135, 67, 107, 268, 217, -60, 12, 105, -166, 66, 113, 71, -123, 102, 202, -114, 39, -46, 38, 24, -132, -94, -296, -144, -217, -233, -326, -214, 66, -85, 59, -66, 382, 20, 265, 291, 165, 364, 234, 456, 450, -327, -185, -84, -130, -280, -401, -442, -299, -632, -128, -46, -72, 107, 227, 50, 121, 87, 357, 594, 290, 352, 405, -90, 70, 102, -6, 69, -93, -198, -208, -215, -175, -74, -62, -85, 5, 248, -64, 110, 301, -20, 144, 8, 17, 296, 336, 5, 35, -62, -72, -69, -385]
4134c85R9O5J71P5r4M5l1l5J77Q3k91J4K95m86K37M3K95m14J86r2j4O6n8L21l86
4159a14n5K10m5j37J24l5J64l91j19K25J66J40k20LK21K6k22L33k34R3K28l15
4181D6K40j86l72K61J04R7j65j78J0M8j49K54k24L48k58LL31j39oj89J36J70j43
4204C9N4j28J17k54J39l16K12J86O6J00k33k91J78K26m0K3j52lPJ6J23q8J25k
4228A04j14j38R8pq7J21j39J8K53j85k12L05j60K56j40K65j91j31Q5j1j32j49
4250b91J94K56J70m89R3j24J85J57j72j08J66k25L23j58l06L48J64l77j20L43
4270B9K28m30J61j12j78L70k20q1M22j25k04L16n56M67p9n5o7K35j38j38L01j77
4292c1L33j87k23N7l65L70J54k6j27o1m1O3N0j07O1k15K74p5R2j42K02q3K2p6
$$ y = [-385, -286, -221, -50, 25, -69, -24, -55, -90, 87, 170, -121, -107, 188, -298, -61, -18, 277, -137, 49, -43, -57, 9, -49, 272, -114, -169, 41, -4, -141, -17, -52, 112, -279, -398, -173, -7, 133, -87, -84, 137, 163, -59, 274, 40, 133, 361, 46, 286, 100, -272, -11, 93, 190, 25, -153, -143, -95, -244, 10, -214, 134, -124, -121, 210, 71, 65, -124, 12, 182, 39, 93, -35, 82, -172, -33, -349, -137, 49, 115, 215, -18, -309, -131, 95, 55, 78, -74, -77, -70, -54, 69, -19, 106, 104, -10, -148, -50, -57, -144, -23, -162, -144, 109, -76, -288, 17, -143, 113, -27, 238, 47, -84, 1, -10, -142, -291, -97, 159, 329, -160, -67, -191, -6, 151, -21, -129, 37, -188, 135, -23, -329, 19, 183, -194, -314, 29, 257, -173, -12, -124, -302, 68, -152, -233, 189, 64, -140, 176, -380, 87, 8, -47, -114, 121, -17, -155, 146, -31, 302, 115, -108, -51, -416, -46, 108, 82, -45, -106, -147, -84, -34, -141, -80, -295, -21, -96, -4, -146, 56, -27, -5, -81]
4316h1K83j75K31k84J4k1N2m9n1j7J59l7k04M63k45j33K60m39O4L28l94L61l12
4339b27J57P7l3o2O1j1J6K61R8l96K77k02J96j58l31K0K01P1k0m9l1P0J8Mj8j48
4365a59K87K31l37R6j15O7J29L4M2k75J78k2k23M0m6j86J19J33p6q8L40j49P6
4388I6J53j63L7m6p8j0k52K73PJ27j61J68l25J06Q9J14j20j70J06N6R1P4j94j23
4412a45J60Q1j59p0P7N7K74n86L75J29J01j54j79j20M95r4o7l06J05K7k00L28
4434A29nm35L04p3r9L35j39P0o4J77m3j44j6j64L18m2k23K49k67K36J48l14j3
4457g5O9k55J49m7J25N6j61J02M13k18j35j63K61k32jN20j24m52M8J81M2j24K15
4480A94k62j75q0O2N2J11L63j47l3k01j95K46K23j14J67j04j63Q7J22j10R5p6
$$ y = [-81, 202, 27, 258, -26, -12, -33, 19, -30, -81, -98, 61, 24, -180, 283, 38, -95, 165, -274, -210, 118, -276, 85, -227, -70, 7, -26, -88, -27, -38, -22, 239, 337, -59, 218, 16, 212, 54, -277, -257, -56, 15, -5, -54, -85, -15, 3, 7, -11, -159, 128, 359, 22, 118, 3, 70, 199, 233, 275, 0, 178, 156, -67, -27, -73, -259, -140, -7, -83, -171, 169, 20, 96, 249, 86, 123, 77, -1, -11, -263, 10, 17, 144, -17, 151, -174, -68, 21, 135, 15, -155, -49, 7, 98, 172, -22, -145, 15, 96, -63, -133, -56, 1, 275, -311, 64, 193, 294, 140, -39, -159, 336, 242, 175, -131, -26, 1, -199, 129, 124, -311, -7, -80, -179, 156, 17, 87, 23, 200, 157, 13, -3, -167, 151, 109, -114, 135, -132, 104, 252, -62, -75, -6, -261, -112, -159, -34, 22, -139, -37, 376, 158, 23, -140, 121, -111, -112, 408, 284, -168, -120, 61, 103, -21, 194, -68, -243, -323, -261, -209, -98, 265, 118, 85, -116, -311, -65, 158, 44, 211, 107, -56, 31, 153, 43, 138, 62]
4502F2K3n5n6j25m5J70J57O8l27J4K2mJ45Jk13j80K71J90j64J07K74k59l4k8L63
4527C77n23J60Q4j50L2j64K10j84R7l06L05j57J08K26m6J01J99m80K78O4m79K80
4549C2J68j63J11r6Q9j79J1K4k5N0n6k7p1J78j06K51l75K78j77k49M4M50m46J00
4573a84M93j97p0J92l43l5L17n00R9L4L6R5O8P7o8j37n3J33J07k43J61O2j47o5
4597a68J07L50l91K04k57J27m7K66m00l0l5K10m3J74j96J30r1K6L01m04L69j68
4619C4P1j14K82k77L54k35j59J20n7j29L08k68L9J18K6O7j82m0J23j76L2j87K13
4642c7L69k14L2m6Q2l28L10j47j39K10L6k71L2K20J5P7P8l46J12q6K32k66N6J85
4666A66j82K31k11J26j81o7N9K18l56J99J22k40J16r5R1J45r5J69k24l57L00n
$$ y = [62, 85, 30, -26, -151, -196, -26, 131, 199, -128, -114, -92, -96, 49, 50, -163, -343, -72, 118, -46, 61, 335, 76, 42, 14, 377, -146, 14, 98, -52, -20, -184, 26, -158, -61, -367, -62, -219, -111, 115, 69, 170, 369, -111, 167, 231, -248, 32, 200, 37, 148, 52, 141, -38, -27, -3, -28, 22, -34, -61, -132, 46, -60, 191, -184, 94, -83, -332, -288, 162, -284, -184, 309, 112, 42, 234, -109, -144, 173, -327, -228, -194, -158, -63, 5, 82, 14, -123, -176, -43, 64, -179, -18, 44, -103, -168, -61, 289, -102, 102, -155, -28, -75, 191, -209, -239, -274, -64, -107, 67, -129, 1, -90, -64, 237, -167, 202, 34, 105, -9, 273, -4, 350, 115, -44, 76, 19, -110, 198, -70, -31, 87, 113, 180, -2, -42, 81, -95, -63, -250, -37, 332, 118, 150, 104, 186, -142, 168, 21, -118, 92, 128, -143, -111, 109, 124, 201, 279, -67, 45, -41, 191, -75, -19, 166, -16, 215, 4, 130, -51, -118, -59, 159, -197, 2, 124, -116, 0, -95, -4, 141, 46, 215, -9, -366, -66, -71]
4688g1J65j51K12o4J28L2j61Rk41J65J11J07j03j06j21J81nJ63j78m7J17k03n5
4711a16K30j97P8N8j05j9R1O5j86L61k05l2m19K97L9j19k68K73K11J46k84J64
4733F3j27J01J73Nj66j1K51j81j61J86K30l79N8m3N6q9r3R1m5O4kj30K35k40%
4758a54j1J56K11j74Rj92QL65n3J7J46m30L76k12j28L2J12q7p1p3K88j26k65N0
4782b06O3o9j60K15j40Q9J86J19l91K40R8J37q9J96j63J02l21L1J52j11J67J17
4804B62k01J45k2k33M1J16j27l2J42j51J35K19O5j50r2mJ14o1n25O08k66Q7j2
4827E8P7j66o6j73r2O32k36j84p2K7o6M06O8k50kJ39J9j99J89j08Kj05j45K43
4851dQ9j49j28Q5J57j2J16j24r3l6J9J25l44M0O18k96l00J18j3K6l2J21J50k78
$$ y = [-71, 94, -57, 155, 91, 219, 251, 90, 99, -142, 23, 134, 241, 138, 32, -89, 92, 87, 250, 72, 25, 142, -61, -116, 114, -83, -5, 53, -52, -71, 20, 85, -101, 260, 55, 23, -396, -99, -60, -179, -447, -174, 37, 183, -101, 63, -64, 37, 210, 215, 49, 38, 289, 108, -53, 133, 363, -16, 42, -1, 55, -34, -127, -36, -81, -17, -19, -149, 86, -154, -154, -165, -9, 202, 28, 37, -155, -147, 218, 165, 182, 328, -102, 274, 62, -66, -34, 78, -9, -80, -153, 135, 9, -256, -206, -143, -212, -372, -157, -297, -208, -22, 97, -294, -54, 44, 181, 92, 288, 125, 227, -94, -63, 89, -22, 145, 262, 61, 206, 184, -49, -8, 108, -19, -51, 91, -60, 75, 294, 359, 209, 117, 113, 227, 166, -359, 249, -17, 70, 58, 135, -31, -97, -270, -362, 270, 34, -150, -222, -195, -261, 145, 213, -37, -39, 100, 119, -80, 109, 1, 3, -102, -247, -4, 85, -64, -192, -107, 50, 38, 154, 30, -63, -99, -80, 45, -299, -259, 359, 63, -237, -119, -132, -106, -138, -17, 133, -145]
4875a45K35j65O4j93k1M38l03j47J50n0M7j65N7K01k60L52p8L07j79j93J44J07
4897B03l42R0k3J48J4o2R4j26K38m88M94j04j60K73k84j2P5k52J06J21J64j76
4919iL2J18l95M58k60K08k05P8L3j84j7pJ19l6l3j9k8J50k08L70p1J46k19J48
4943A69j04k52J92J00l48K84Qm5M12k79q3j58J79m6j80j16L03n9K41l96J57p8
4965i9J82K0J00k59K1o8L76k75r5M02n34L88Q0k06j20O8r5J33r4K13p3L5j23J93
4989A70j28p3Ql6J61k4j55k5M1J95k6n6k0k4l6M09j94j58j10m4J95o3k18J40L1
5014d0O4J95m26J01j72J20L16l62K82l59N4J44r0m3P4n9N2K78n9o7J02j72j1L8
5038d0q9j87J49K03J26l70M03j69J1j19K30jk27J59j25k7j86K20p1K2N9N0k03
$$ y = [-145, 90, -75, -11, -204, -225, 213, -90, -237, -87, -137, -90, -255, -198, 3, -257, 95, 17, 324, 145, -48, 96, 203, -139, -49, -72, 76, 90, 28, 122, -4, 234, -254, 240, 136, -24, 249, -35, -47, 28, -224, -118, 3, 167, -9, 23, 141, -254, 204, -56, 152, -53, 25, 58, -126, -143, -150, -31, -67, -100, -119, -147, 3, -205, 165, 94, 240, 21, 169, 65, -187, 5, 105, -243, 41, 49, 4, 416, 137, 54, -104, 75, 29, -151, -267, 36, -23, 218, -178, -21, -99, 83, 103, 203, -56, -35, -103, 273, -2, -97, 305, -229, 159, 239, 33, -87, -19, -114, 19, -75, 138, 65, 100, -23, 170, 42, -31, -23, -59, 102, 78, -77, -102, -61, 134, 108, 52, 32, 8, -28, 381, 187, 29, -81, -125, 70, 7, -211, -71, -40, 24, 219, -207, -106, -278, -158, 158, -204, 78, -281, -227, -83, -173, -216, -142, -201, -149, 129, 70, 3, 105, -67, -78, -40, -129, -316, -167, 36, 162, -208, 195, 26, 37, -82, 148, 147, -80, 79, -46, -73, -259, -39, -110, -88, -29, 21, -182]
5061a82M07r0m5k94J73k13M61l32M34k48j50J67j68K44m48L57O6l85K17k57K05
5082h1J43j65M81j35j72J4J65m1k05J05PQ5M0r8l12J3K53O5j81j91J71K7l4m5
5106i1L62l49N8J7mJ19KJ1j16j13O5K54k81J65j48L7n3j0j88L42N6k90J99M6k16
5131a26J21k77M38k70J11m3K27j32J7m8j89K71N6k2k55K12K01k73K5R7K5j29l00
5154b63L52q5k47J34J04j16J2L9l9J90J52j1j15P1n6J55k07k05K85j05j97Q2r4
5177a64r7M5j77K66p7m2K14k3l9K11R3p8J9k6p1k47K73j84K90k43p3Q3k20J18
5201a49K23l51J51K38J69k03Q2r3j27J22k91K76n1r5K44k59K9J02O4J13k79J75
5223I0m7P2l0K83o72M17q7r9J20j88K8k21L28j40j65J09J40K9K02m2Q1k90K90
$$ y = [-182, 225, 135, 90, -204, -31, -244, 217, -115, 319, 71, -79, 88, -80, 164, -284, 73, 139, -246, -29, -286, -81, 62, -103, 378, 243, 71, 85, 250, 209, 4, 109, 116, 201, 241, 143, -169, -156, 97, 162, -19, -210, -39, -12, -46, -91, 271, -78, -20, -3, -7, 112, 114, 125, 9, -104, -39, 215, -66, 99, -49, -12, -65, -75, -263, 79, 135, -155, 44, 90, -126, -5, -282, 156, -114, -3, -46, 181, 49, 66, 18, -171, 100, 156, 134, -121, 91, 292, 19, 44, 141, 166, 37, -263, 89, 4, -243, -109, -5, -121, -109, -70, -109, 81, 233, 222, 107, 178, 122, 277, 70, -135, 150, 45, -152, -70, -164, -261, -216, -393, -127, -204, -246, -32, -55, -94, 117, 210, 132, 151, 125, 54, -193, 80, -104, 186, -57, -130, -47, -267, -149, 74, -277, -126, 112, 281, 78, 160, 67, -60, 62, -229, 47, -4, -99, 145, -114, -85, 17, 81, 194, -85, 90, 43, 115, 85, 368, -304, 113, 26, -73, 47, -141, -113, -334, -6, -146, -311, -202, -62, -33, 169, 127, 208, -82, 208]
5246B08j08M5mm5J22l18O4j19MJ02l6NK93l69L3J40j6j0M1R4j99K1J4J34MJ20
5272B20j73R5k38M6O7p5K22n4k74N9k81M1M81l38L20l9L53m20J28j59p4R5R7l0
5296F9Lk49O5N0O5K49n45L07l17K43K13j13j03Q1k1N0l64L35j91L05j22j30m9
5319a69L45j54q6P0J04r4J58m1k34J57q6m3J33K4l54K46k4J1J2k64L63j40N8K53
5343B45l42J88p1O7J63j83O3m1j85J44k13M44k49j77J8j51J38r6L89k16n0J6R7
5366bQ3k29J22j01J36J41k20K66l57K72q1j98j29K4K71j90J72Q5j84K17j57k4
5388h3j39J71o5J00mR9n0K16m41L13p3q3J70j15k59K72j73L02k07K2j2J39k80
5411a80M67l95LP9J18j33J28L6k67k2K11J21j45j40L53j6k63j5Q4J82k09M6N9
$$ y = [208, 100, 145, 141, 96, 218, -100, -36, -155, -151, -49, -85, -80, 213, -156, -123, 17, 1, -9, 32, 126, -73, -52, -38, 96, 100, 220, 47, 142, -96, -50, 17, -58, 164, 110, -164, -105, -386, -345, 136, -202, 118, 79, 432, 12, 140, -19, -93, 2, 99, 69, 72, -177, -112, -62, 3, 252, -293, 14, -303, -60, 153, 40, -63, 18, -3, 47, -317, 18, -173, 132, 10, -120, -169, 176, 22, -64, 6, 110, 16, 174, 133, -101, 56, -30, -73, 60, 84, -270, -24, -48, -37, -25, -289, 74, -66, -8, 245, -97, 91, 20, 87, 250, 67, 130, 89, -96, 48, -165, 279, 30, -147, -129, -280, -142, -238, 151, -65, -115, -99, -2, 81, -148, -26, -127, 9, 150, -70, 196, -161, 111, 30, -168, -297, -273, -2, -192, -20, 65, -119, 98, -59, -83, -222, -51, -116, -16, -20, 79, 29, 245, -196, 117, 44, -39, 131, 16, -243, 29, -144, 158, -49, -27, -39, 100, -180, 287, -108, -105, -26, 92, -41, 87, 123, -144, -166, 45, 166, 21, -119, 234, 218, -45, -60, 24, 206, -3, 43, 102]
5434A02J92k28j65K56m48M01j53J82k02j32K31N0r2m1j8J23m34K78j6jK05j24
5456c4Q9p2j85K17J63l28K87r5J02j8j54Q7M7P4j70j33j8k2K79J9o8q1k3q5K42
5481A20Lk65q8J37l2l8Q4j1K0K9k23K20j0J40o0j11J32j91J78k1p9RK4K2J1j98
5507a98J71k11K31Q4o3J1O9j2j5k2J52l05L44l90L00k97J42k07J97p6q0j57M35
5530A03l87K72K18l28J06m1K99m3j47J81o7k7R8q8j48J11j63q0j19l2J69j64K52
5553b5j39o9K68J30J0m83J98J49J99m2o7n8J87k24P2J38j97J12k88r8M46l64P8
5576f7J62J86m35P2K24l18L5O1k16L35j13k42N04j61O5j19KN4K53k91r4PJ73m3
5600C4j15J48l18K91l08J32n2j18L22k74J93J65K5k4K94n28J13K87J0j84p2P3
$$ y = [102, 294, 66, -99, 157, -291, 110, -43, 139, -63, -195, 36, 86, -6, -47, -65, 58, -376, -98, -114, -115, 90, -34, 55, -17, -202, 15, 178, -150, 137, 42, 144, 126, -28, 59, 106, 180, 10, -123, -141, -163, 116, 135, 67, -14, -37, -122, 120, 123, -142, -230, -93, -125, -163, -79, -90, -70, -41, -264, -44, -54, 86, 26, -85, 47, -144, 34, 13, -66, -57, -33, -11, 0, -198, -27, -238, -7, 77, 14, 25, 94, 82, 67, 45, 197, -108, 236, -154, 146, -151, -9, -216, -19, -95, -175, -332, 103, -284, -12, 206, -122, -16, -57, 242, 199, 52, 233, 166, 139, 237, 149, 1, 112, -51, -131, -250, -282, -113, -277, -25, -164, -233, 35, 165, 175, -308, -110, 39, 238, 196, 129, 71, 258, 34, 106, 244, 47, 159, -129, -227, 219, -145, -67, 95, 281, -154, -82, 142, -176, -141, -80, -296, 39, -74, -316, 188, 27, 92, -27, -25, 29, 282, -9, -103, -96, 77, 34, -81, 67, -251, 40, -268, -136, -188, -306, 16, -258, -65, 100, 125, 101, 395, -133, -20, 267, 277, 93, 21, 94]
5622I4j22M7j79K10jn41N76n31L55K23j64l91P78l90M8%O4J4m5J23KJ49l88K47
5646A78r3J12k02k65K44M6L0k37L25O3j73j66J08n0R5K58j33m67L68p8l9N3L09
5669B86l56K28l22J78J2k4N5j6q6K7j12K62j48k6r3L1K9j15Q2k26J88K66j56N4
5693A8K90j49Rk18L16O3j21k85p3K91o7j49P2k88J95j48J23L8P5nm4K0j00J85
5717D8K06j11k15K27P5l59J23J95N4k86J34l50m3L04J75k19j58Q2l6lJ32P2k42
5740a95M11rq5j19P2j38k5o8J11j78L50l07J76J2o8J15l32L20N4r4J33l11M11
5763B36l71M00k01j14Q2r0J24k40L53m44J91L46n12L87k20o7M16k62j8N3J35l19
5785a35K59l99K51j39R3K08Pj19j91M27k44j74J14K9j57J57j56K42j81J26j91
$$ y = [94, -28, 19, -160, 50, 49, -492, 84, -447, -92, 131, -33, -424, 354, -36, 12, 12, 76, 90, 45, 168, 170, 319, -69, 178, 85, 197, -5, -270, -26, 20, 50, -187, 138, 201, 28, -138, -30, -80, 15, 273, 140, -327, 41, -37, -76, -23, 286, -70, 158, -164, 14, 26, 2, 57, 41, -45, -18, -130, 132, -16, -42, -135, -104, -75, -190, -108, -334, -146, 120, -36, 18, 308, 159, 168, -50, 266, 329, 208, -77, -150, 141, 74, -75, -3, -291, -96, -244, -121, -83, -8, -13, -57, -37, -137, 48, 254, 143, -72, 155, 230, -129, -6, 189, 243, -43, 91, -259, -302, 2, 177, -42, -200, -118, -154, -157, -25, 47, -195, 216, 207, 122, 3, 75, -63, -88, -156, -45, -223, 127, -180, -4, 8, -60, 55, -277, 43, 97, 3, 136, -175, 236, -135, 265, 64, -50, 32, -58, 66, -174, 179, -265, -74, 272, -240, 147, -73, -140, 276, 14, -4, 49, 184, -135, 124, -275, -24, -163, -70, 138, 145, 26, -165, 262, 18, -156, -42, -13, -170, -13, -169, 73, -108, 18, -173]
5806a73L59k64N8J5k77K54k21K75Rj19J34k9L2j50r5J02j2m7K80l4j55q4J52k7
5830a7j89L18K5j76L9k81J29K71k47k40M14O0m9Rp6Rj26L96l18J11R8j98%J46
5854A08l57L72j91R1j82K19o9m9N4J55k92J39j57L6J92o8l39L87Q4k98J26j56
5876a95J93o3O7L1N9k31K30k9k89L22j19k3j51j61K51KM71m56K66l55L42o2k39
5899a39L80j98r5P8nj21M4K07L8l25J72J44j01j35OjK92m27P6J58n0L2J37%l06
5924a39J00L36j92n63L11K19o8K71o2l88J09j93M27j41j89k7N0N7J2n9m1j43M04
5947I1l13K64j26J32J44l16P5R0K9N9l0R1j87j35JL66O1m16R3L90n02K35m1Qj10
5972d7J88j18L7k43J16J62l86L08l53J9L28j36lK9J88p6K19j55R0k87L30o0j54
$$ y = [-173, 186, -78, -20, -5, -282, -28, -249, 26, 35, -84, 50, 21, 53, -97, -192, -90, -102, -149, 131, 97, -58, -142, 10, -17, -206, 112, 137, -39, 0, -281, -152, 119, -128, -368, 46, 106, 57, 66, -10, -1, -127, 269, -49, 62, 160, -38, -38, 108, -249, 123, -68, 23, -159, 60, -9, -58, -4, 151, -141, -2, -159, -123, 69, 1, -338, 49, 133, -165, -39, -195, -2, -65, 2, 33, 92, -139, 91, 62, -227, 95, -24, -47, -198, -359, -108, -106, 365, -91, 175, -180, 162, 100, -139, 241, 43, -52, 26, 21, -100, -56, 151, 189, -136, 36, 180, 79, -56, -50, -51, 241, -186, -110, 48, -2, 30, 167, 167, -139, -39, 297, 105, -458, -147, 72, 4, 275, 213, -175, -66, -259, 168, 27, -162, -189, -139, -82, -70, -129, -170, -313, 91, -222, 42, -84, 48, 192, -124, -49, 41, 70, 129, 99, 190, 3, -132, -131, 235, 296, -120, -27, 363, -139, 96, 55, 63, -47, 141, 23, 60, -183, -67, 95, -291, 17, -336, -317, 11, -125, -128, -99, 89, 13, 232, 77, 167, -120, 210, 150, -4]
5995dM5j76J4J33J05l58K39L1q3J93j90N3J38k05J08k12J66J67k7k44L54n41L84
6018I0j54k04K25o0k9K1J83j40j37K60k2n6N7Oj84J23l16K15J74l41L60j76K35
6041A30j72j90M05l02N1%j41P0Q3Q6O5j22J07p0k28K88j60J78m50N02j60m6j10
6064a86J06J31j9M3j04J78O7L5j50k72K00K19l85m0kk3J9K6J47rj04J99k56J87
6088GK45k9k49K04p4j71k7K41Q8m10K12k47Q9Jl53N37k58n1M04j15P8K94k81Q7
6112B22k73L6J24l04J75R0m15K55j15M69n21J61m8o6K17Q2j74k52J63%K6j9Q3
6135h4O9J28m54J67Q7K20k39M95l36J9p2L38j49O3j20P6j32j68K05l15R0O5M1
6158fK3q7j11J88R4l72K65M6J76P7m19J19K4o3J71l7P7j17j32L11n09j24M51k17
$$ y = [-4, 41, -135, -121, 12, 117, -241, -2, 29, -54, 139, -51, 2, 140, -65, 43, -169, -3, 164, 137, -107, 247, -294, 90, -64, -268, -43, -103, -132, -111, 72, -68, -205, 55, 33, -23, 34, 40, -144, -21, -337, -122, 52, -289, 71, -105, 130, -42, -232, 173, -129, -78, -78, -219, -149, -66, 20, 85, -37, 70, 0, -228, 60, -100, 78, -372, 130, -30, -76, -186, -80, 51, 32, 75, -29, 149, 216, 251, 101, -171, 29, 248, -137, -177, -179, -202, -183, -157, -10, -19, -123, 76, -180, 7, 252, 223, -26, 178, 104, -67, -94, 147, 235, -175, 37, -210, -121, -120, -473, 64, -194, -245, 159, 44, 122, 416, 135, 222, -51, -15, 109, -195, -20, 70, -345, -90, -205, 264, -257, -96, -144, -210, 7, 89, -85, -337, -174, -174, -148, -167, -84, -15, 113, -341, -174, -87, 133, -106, 389, 53, 72, 0, 338, 189, 252, 132, 208, 76, -92, 113, -202, -112, -47, -6, 17, -70, -181, 7, 101, -271, -6, 40, 216, 293, -126, -7, 17, -46, 125, 88, 165, 48, -84, 227, -282, -406, 45, -172]
6182a72J17J11j83J10J3j5J08j11K3r2J17L2P1p8j24k46K21K0J95l37J40O7J49
6205A36m2n9J10l3j39J4M3q9j3N6j14J77l07N70j65j97L03J8k09j60J56k97M23
6228A82j54j32j05L88r2j09J28l70L73m2J57k39j77K10k87L43l01L91r6P3j81
6249d0L19j56l39K05j62J67O9J47j83j20K06m1k51Q5J05j46J85J34J68m23J83
6270A12j48K01k34M2J90j62K63m18K72k60K2M8K0K30k22M6Q9k77L06l26j79L41
6292d4J02Q0k80K74k96J7J88j74K97P1j83l0K6k07L67p3K4k19L52l99K02j82J53
6315F6k33L0J91k30J32P1k45K77j62P7r1R3M2k78M40k33K9j31N4M8L05k02j73
6338a23O1Q2o4J70j77L17l96L25or2k86J31M8K93l61K87k50j97M55m65P0J21j30
$$ y = [-172, -55, 56, -127, -17, -4, -19, 89, -22, 1, -91, 26, 58, 129, 51, -73, -319, -98, -78, 117, -220, -80, -13, 136, 94, 35, 145, 112, -27, -13, 30, -59, -72, -16, -130, 47, -260, 310, 145, -52, 251, 269, 60, -100, 56, -241, 182, 28, -104, -209, 179, 87, -22, 106, -264, 109, 67, 224, -15, -192, 18, -269, 74, -227, 164, 68, 141, -40, 279, 123, -216, -11, -173, -6, 63, 210, 27, -93, 113, 72, -179, -94, 11, -135, 50, 184, 352, -71, 112, -36, 165, -69, -27, 163, 1, 264, -154, 118, -142, -120, -72, -52, 178, -44, 2, 91, -186, 120, -206, -385, -44, 58, 138, -142, 132, -164, -147, 41, -133, 164, 235, 52, 22, 48, -159, 208, 135, 159, -60, 292, -107, 95, -87, 66, -167, -137, 54, -176, -44, 27, -218, 59, -103, -26, -117, -24, 18, -260, 180, -53, -24, -155, -101, -53, 252, 50, -123, -62, 20, -44, 126, -51, 266, -130, 195, 189, 97, -189, -58, -10, 283, -78, 209, -41, -238, 217, -248, -178, -57, -187]
6361a87j5L49j55J40k59J65l4k3j38k5K5l4M5J24j72J1L30l9l10J90L3kq8N7M1
6386B9j11J51j05J90k90K89k53P2J57m2j10k01L97m80L17M5r5j81j9L07j56L49
6408B60n19M78m24k4M03k22K19n30M91j35j8r1M6l8J5m4L42J32m34J12o5j6n8
6431a20J38k75J95K93r3Pj7O2k50k4J10N6l36L07l96O37l60j65L13J40m88K8K54
6454A6l72M48m08M23o1J09k64Q4R3j62J16N4R1j10P1j81J07j56J26k23J13K70
6476A84n18K27J83j62j41K56np7J62j56P4r8K37k14J59q9N4j66K89l34lN9N2n3
6500h0M7K44l12J34j02J22j41K20l81K32J88l03K64k22K50J37j38k05J82m4o0
6521C2R7k26L44m6k73l2J9O2j98k3K62q5J99M9l69L66j72J22j7j06K40j72J25
$$ y = [-187, -202, 147, -8, 132, -127, 38, 4, -19, -157, -182, -157, -191, -146, -22, -194, -183, 147, 108, -202, -12, 21, 19, -69, -12, 29, -82, 69, -36, 154, -136, 153, -100, -28, 129, 87, -23, -224, 173, -307, 10, 55, -40, -221, -240, 67, -89, 260, -259, 219, -205, -229, 174, -48, 171, -359, 132, -3, -21, -112, -66, -104, -89, -133, 209, 341, -93, 19, -46, -62, -120, 18, -257, -62, 231, 138, 145, 128, 190, -60, -84, 26, 82, -254, 53, -343, 294, -66, -231, 82, 222, -266, -238, 16, -356, 92, -316, 107, 46, 155, -109, -25, 68, -94, 22, 76, 167, 57, 128, -53, 54, -102, 24, -199, -86, 184, -334, -107, 76, -86, -227, 29, 24, -53, 109, -47, 27, -71, 166, -48, 111, 22, 76, -90, 199, -135, -138, -79, -27, -80, -33, 211, -101, 33, -69, 53, -88, 132, -249, -17, 171, -132, 132, -90, 160, 297, 159, -46, 136, 92, 32, 129, -97, 247, 201, -72, -104, -85, -23, -221, -244, 18, -67, 132, 181, -188, 178, 6, 128, 111, 5, 245, 73, 198]
6544A98l21J83o8j36J45k6J45k33J86K4m0j01L44n88K70O6P6r3J40k43K00j60
6566c2k03J19L6N9J27p8M8R7l73K24J55r1qj73n7O4N2N0k34K85j30k02N9J41j49
6591b14M68j82j85J69j9R7L6r7j16K7R4J14j16l09J14n3K03j02l1K27n1k0J35
6614A89j89J05L4j54Q7k37K90rj76JP2J6n3K34k45l4j33J38o4o2J73j24l5K05
6638B9L8L0k53K91j36M9j25J76j11j65J89m0J89n7k20m9M7N7R7L0K1kj12o6L35
6663B42j55j51k07N58l39o8MJ35j99J33r9K75l4K7p4J42k46q6J61j80J91J68m49
6686b51L08J2J24q1k49K38k9j80m0K3K86j35j45L6j6K07m9j23k66K62o5J27J03
6709I7j30O3q4J0j2n8m2Q9J24l5kk25q3K69J78j90k52J62K10l24J91jP9p6r3K76
$$ y = [198, -123, 60, -8, -144, 1, -25, 120, -113, 73, 97, 57, -44, 300, -288, -18, 48, 124, 31, 171, -72, 128, -32, -235, -116, -80, -21, 106, 28, 76, 173, -200, 24, 179, 88, 80, -93, -150, -86, -34, 16, -218, 67, -63, -265, -206, -65, -214, 254, 72, -113, 56, 37, 134, 170, 73, -43, -16, 78, 192, 76, -233, -119, -172, 31, -71, -102, 125, 74, 54, 189, 0, 105, 139, -15, 72, -165, 125, 116, -60, -59, 13, 29, -24, 210, -35, -69, -202, -64, -128, -190, -17, -141, -176, 29, 67, 97, -156, 135, -1, 48, -77, 99, -12, -177, 12, -28, 161, 104, -116, -165, -118, -61, 36, 66, 87, 85, -27, -93, 242, 87, -64, -271, 287, -52, -120, -116, 19, -180, -47, -146, 129, 95, 122, 48, 190, -56, -142, 19, -161, 30, 198, -251, 57, 69, 193, 112, -137, 101, 72, -108, -148, -125, 161, 26, -119, -83, -99, 108, 59, -64, -330, -68, -133, -6, 97, -33, 30, -54, -44, -56, -114, -156, -67, 57, 22, 20, -205, -288, -19, 159, -31, -283, -121, 89, -235, -44, -45, 34, -42, -135, 141]
6735A41q0j83J70k02K00K8L2m45M48Pj21lJ02o0M5q0l28L03L7K2O4p0k38J29j14
6760a96L72k81nM60k23j74K76l23K75n5j40q4K03o1j23k0J63J84m01j20K62M7
6782C6j13K71j81K49o5l60J08j54K29M8n5l57M74j09L4k95J55J97j33P1j94lK64
6805A17m37M46j80N0m9J28j69o8l0M8J39L09k66o9N6L0j30k6K65j38Q3k72K10
6828D7q0K26n27M09k07K03j66K55kk90P2J63J0j00kj8J38m2j10R1K36j40j89L3
6852A0L09m11J53j13j65J43k06J29L44l1p1N7L2j31J74m45K20p5l7K80j03q4K4
6875Cj45L17j83j96K26p4k20L52O6j28L4K60r6k90J61K3J11k4P6k39J52j59ml5
6899a2l05L09j40K11k40J36j65M4K32l2R7o1K01N3k91J6jk61J56J48j25j10J67
$$ y = [141, 61, -122, 48, -154, 46, 74, 106, -339, 109, 116, -5, -8, 94, 34, 79, -1, -329, -26, 11, 33, 97, 27, -211, -82, -196, 176, -105, -110, 350, 127, -47, 229, -94, 181, 126, -14, -98, 105, 44, -79, -99, 64, 248, -153, -273, -11, 36, -77, 194, 13, 262, 197, -163, -55, -209, 20, 68, 13, -344, 130, 21, 55, -240, -85, 112, -21, 50, -144, -147, 117, -320, 126, -54, -4, -53, 75, -94, -162, -192, -144, -5, 304, 38, -31, 25, 55, -75, -101, 164, 26, 109, -163, 47, -33, 193, -334, 75, -132, 71, -95, 160, 158, -132, -60, 103, 113, 13, 11, -7, 131, 89, -21, 70, 306, 166, -23, 10, 319, -92, 61, -52, -217, -74, -280, -151, 193, 162, 91, 148, 180, 49, 223, -222, -2, -77, -114, 166, 63, -21, 3, -142, 175, -8, -204, 22, -52, -272, 80, 146, 18, 52, 312, 216, -74, 87, 110, 221, 197, 273, 34, 186, 27, 23, -12, -317, -8, -148, 63, -177, -41, -206, -162, 70, 38, 135, 74, 275, 328, 37, 53, 52, -209, -53, 95, -30, -140, 27]
6922B7J08l4l03L70m2j99J82k19r3J85l4J07j54k6J9k28J12J78l8j0l7J80K7k29
6946a51J87j4L19m8j79r6L2k9J30k38o1M9p4n8M1OK43K55n8k50K98p6j08J67k71
6971A6J60k19K58k27p0l7j97K92k88L64j79P8O8m01M00p2j42NK62m5M9l16O8K8
6995a45P4J71J27Qj00l8j98j00J11NpO8p5K39k53L7L74m17K15j50J1j27J64M2
7019C6N1l4j0l87M09j04K72l27J85kn7n9m4j61L83K6k08P8l6j70j29J72p6jJ47
7044d6L31j82L9p6r0N8O1l20M11k43J60j92K51k91l4J09k85J50R6L77l76K93j91
7067A0q0o9K20k0Q1k49l8K32j64m3j70J86k17M25j47q4p6n9K26r7K1K40k40P5
7091c7mL01l69j1M8j17N28r9l03o7j45L36k0N3Q4o4j65n0l47M21j8L61n95K6L62
$$ y = [27, 135, 101, -202, 168, 126, -73, 109, -110, -203, -18, -52, 55, -99, -125, -106, -334, -222, -44, -82, -92, -129, 51, 78, -151, 36, 22, 341, 293, 114, 18, 50, 21, 151, -87, -148, -99, -173, -231, -190, -184, 59, 314, 256, 6, 304, 228, 120, 287, 16, 176, -43, 215, -12, -82, -119, -316, -24, -312, 52, -127, -49, 19, -382, 18, -54, -196, -191, 71, 26, 75, -241, -173, -145, -71, 100, 227, 235, 135, 97, -101, -201, -90, -85, -92, -24, -99, 140, -113, -76, 298, -119, 96, -54, -43, -170, -6, 36, 87, 53, 43, -344, 65, -39, 233, -94, 91, 89, 32, -27, -71, -232, 151, 177, -31, 47, 11, -159, -288, -116, -192, -193, -46, 285, 103, 142, 66, -24, 34, 95, -225, 186, -57, 103, -89, 162, -129, -163, -54, -339, -189, -93, 284, -92, 201, 10, -70, -139, 81, 61, 142, -107, -145, 87, -77, -120, -290, -104, -321, 104, -43, -127, -203, -262, -36, -133, -112, 128, -112, -37, -41, 260, -109, -120, -72, -189, 339, 240, -63, -130, -275, 61, 41, 94, 178, 114, -51, -101, -448, -27, -45, 316, -279, -253, 109]
7116A09k48J9j5J31o4K44Pk99J5M3L08Mj73j4j89O9R7j67j09J71N3k34K6O7J09
7141d0N2K15m97K18l07M80j97K97j82J44k04J4K35j24l9m02J95J85k8n2J35j51
7163e3K81l50N4K30l32J84J5k40L81m29L42k53P0M6q7J03P8J00j72J20j24j41
7185a77L7l8J86k3J0J59n1O7q2l2k06J61Q6J27k20j32J42K5J08j01m2m37K88K7
7209a18K50o2J57m94J35o6J88NJ11j76R0j02R9K13l23P0j01K14j41O7J26j3q2
7232D7o2J38J50j93R8r8n8p8J70k70k5O0P1L22l22l01K87J64J03j24l29M80l78
7255a48k76K82J16l11P70j28m39R2L17k13K7q3P5m8j47M1L2N41n88J43l53K30
7277f8K29M5l26K34j31J67j70N4N5k97J94Q9m8k18J55R2lJ18j53J99k36J67K29
$$ y = [109, -139, -120, -135, -4, -68, 176, 183, -116, -101, -58, 250, 254, 81, 67, -122, -53, 44, -123, -232, -61, -8, -242, -216, -149, -40, 12, 227, -270, -52, -359, 121, -76, 221, 39, 183, -21, -7, 228, 104, 65, -337, -142, 43, 15, -37, 98, -53, 228, -122, -68, 162, -170, 14, 29, -211, 170, -259, 83, -170, -100, -54, -141, -38, 40, 140, -32, 88, -36, -177, -140, -178, 8, -15, -5, 154, 103, 170, 88, 56, -150, 11, 97, 224, 4, -128, 14, 39, 147, 46, 4, -433, -145, -118, 132, 70, 227, -267, -132, -198, -10, -5, 106, -70, 20, -82, 17, 230, -93, -23, -124, 90, -51, 16, 142, 129, 47, -15, 123, 273, 80, 178, 80, 22, -56, 114, -156, -181, -121, -50, 272, -50, -351, -64, 100, 203, 79, -250, 230, -148, -424, -142, -26, -337, 433, 305, -134, -42, 275, 62, 89, 6, 81, 33, -114, -73, -41, 500, -88, 55, -298, -68, 161, 206, -120, 114, -17, 150, -20, 34, 89, -208, -14, 75, 27, -191, -36, 56, 53, 171, 18, 217, -19, 148, 377]
7300C77j55l13j8J18o3k82K9J64K53k33j7P8Q4j56J15K43n00K65K79m20j8l0P0
7323a30K2j27J83O2K8k97R1L45k11N3N1k57J60l0J67J56k10k8K29k80j10NJ12
7346a6j27L43j01p3j03K78j68l9j92J29K78j87J37j79J48j80m9R8J2Q3j70Q5p6
7369f9J37N8j35K2k81M75j52O7j58l9L55k41j90J85j69K27M9m19L88M6j85N0q9
7392f8K78j00r2M6l5p8Pn0O2J2k43Q0P5L24q6r1l45l2M24m9j13P2j70K11K23j19
7418A43j66L33n31K79j17K37j29j21j28K43N0p9l13K62J47j58P6L2L0q6J63p1
7440I6Q7k49L20k85L5l8J56k41P6O3l0K4N1nj00j90J82J50oP7j42l7k23M04k99
7465a24kQ0l05K76J76j08K64k18j76K48k6J01j54M5J70J2m71J44J14j94J01l3
$$ y = [377, 222, -91, -109, 9, -54, -336, -307, -143, 110, -123, -140, -62, 22, -134, -19, 224, -276, -11, 268, -152, -170, -200, -130, -108, -235, -52, 10, 38, -259, -168, 177, -34, 19, 70, -187, -27, -57, 110, 266, 56, 28, 257, -23, -133, -128, -16, -143, 200, 99, 26, -77, 201, 33, -6, -198, -69, 209, 22, 159, -20, 128, -52, -101, -3, 9, 92, -78, 7, -69, 68, 126, -9, 13, -268, 207, 55, 122, -36, -75, 280, 39, -151, 34, -135, 92, 141, -278, 110, 156, -29, 21, -68, 210, 110, 18, 64, 29, -49, -42, -92, -30, -18, -261, -181, -106, 218, 132, 41, -304, -336, 88, 39, -74, -2, -172, 39, 262, 143, -23, 310, -221, 58, -59, 178, 49, -72, -200, 43, 93, 14, -299, -37, 110, -48, 28, 60, 90, 4, 167, 96, 183, -66, 254, -31, 4, -34, 122, -119, -43, 20, -10, 14, 65, 60, -40, -230, -48, 102, 96, 173, 31, -6, -229, 175, -124, -126, -46, -351, -75, 101, -7, 257, 39, -137, 111, 85, 186, 32, 77, 247, 259, -212, -68, 46, -148, -47, -80]
7487h0l7j72L29k54K10L4J87J24j44m8k49K50n0m33M36P0j22J80k69J04Ok92o4
7510b84K11K31k58J83j1J45j14j23L98pl48K44l62J60O8K6m0J67m66K18q5j60
7532b07J82p8J18k20J62O4p9l9L40m92L04P0J7Rk12j17L27j20K39k0j74Q3j59
7555bj17J2L49j7l17k8K71k52j3R0m0o3R4J58lk26J75q9N7Lo1J04k18K47j38K08
7581A84k69R9P0l07L08k87J62Q7r4P7O4l8l02J84o0Q9O5J8J99j46j82J32rl01
7605b57J03J55o8Q3j35q7J78j09L08k33K05m51N02k08m1J87l17J01q6K88k22L2
7627g2LJ37O7m8k40j02L79l90L92m26L30k48J86L4J87j22p8o0J13Q7k02j24nL57
7651A55r7n7M29l16j55K33j4k71n8K14q0p8P7P8p1j22L26j63k81L30K45l65nL
$$ y = [-80, -117, -289, 40, -214, -4, 30, 217, 341, 197, 149, -100, 150, 100, -333, 103, 173, 51, 231, -38, 66, 72, -220, -284, -73, 158, -100, 83, 72, 217, 103, -20, 378, 371, 23, 267, -95, 65, 133, 159, 119, 286, -180, 38, -47, -207, -25, -103, 15, -205, -43, 21, -58, -97, 243, -249, 55, 125, 142, 151, -61, -178, 149, 29, 268, 248, 74, 157, -2, -119, -107, 242, 225, -92, -120, 151, -101, -114, -24, -64, -127, -33, 125, 122, -104, 71, -18, 39, 42, -19, 85, -133, 114, -24, 184, -85, 14, 84, -223, 85, -202, -40, 47, -47, 30, 94, 56, -246, -62, -122, -33, 32, 50, 249, 103, -79, 53, 44, -257, -154, 1, -67, 16, -119, -206, -28, -137, 171, -62, 143, -308, 194, -14, -55, 132, -185, -84, -170, 118, -104, -72, -69, 68, 135, 87, -153, -255, 124, -266, 126, -300, 30, -218, -32, 2, 189, 67, -11, -71, 42, 129, -73, -197, -202, 155, 58, 1, 430, 114, -41, 192, 178, -93, -151, 63, -17, -95, -18, 60, -11, -133, 193, 30, -251, 79, 324, -41, -46, -43]
7675d3M4k5P7K6j68O5K44N3k75Q0l09K67K8k11p3R5K77j0r4j02K16k32J91j98
7699g7M6J6j21K13j74J40j93J25L61k74M0j15K3j91K05O6j51J55j52J71k84K86
7721A15k4l60N19l37j06K82k81J24L6l2r5P2O2j34PP1j0J31r0L02l29O1m6j96
7745b58K66k27K00j85J20j45L48j15j8j33L15k20K6J3M0Q5k9j99J86K58n12J41
7767d3o5J10L62l33J67k41J95J33l79k84K95J96k15K96J28k73Q8j00M1l2j4K5
7789E7j02Q5L04k00j42R4j59J75q4l07L63K7j31q3J61rk97K35n1Q2n4J29j20R0
7813F3k61k7L53k00j2j63L91q1j99L38M4k37k55J61j10j80K53J11K5k61J46l6
7835a37J61k94K77r4l8J42k7Q0J03L4n64N69q4r5j0k7j7J21k00P5m2K46p2j48
$$ y = [-43, 1, -24, 53, 79, -89, -24, 220, 273, -2, 78, -231, 36, 64, -147, -220, -125, 152, 142, 48, -54, 162, -70, 121, -77, -31, -15, -136, 77, -97, 43, -150, -25, 336, 62, 102, -13, 10, -181, 24, 90, -61, 94, -58, 113, -171, 115, 91, -269, 250, -87, -193, 89, -192, -68, -32, -64, -159, -87, -25, -159, -152, -81, -91, 40, -50, 252, -77, -16, -62, -258, 8, -219, -19, -204, -84, -229, 119, 4, -14, -147, 168, -52, -26, -13, 27, 112, 83, -116, 70, 328, -184, -43, -108, 2, 364, 31, 198, -43, 152, 285, -94, -378, -83, 113, -102, 194, 322, 49, 137, 37, 78, 46, 32, 57, -45, 40, 344, 144, 2, 96, -63, 112, 28, -279, 84, 111, -20, -103, 58, 49, -248, -13, -64, 18, -36, 93, -27, 63, -198, -225, 128, -72, -84, -247, 144, 63, -136, 202, 246, 9, -246, -85, -195, -375, -122, -11, 14, -247, -101, -137, 24, -270, 7, -87, -125, 17, -10, 70, 173, 207, -357, 212, 128, 33, 23, -4, -21, 100, -100, -25, -67, 179, 107, -41]
7859d1j56J94%L1p3m37N71j20J37k2J47J77m10J18k33k4L40j08p8p2mj19K93k90
7883a79N8M1n7J11J32j38M3J76j23j16J85j5l8N3k92K22M2pj29L85n03J49J97
7906A97k64r1Q5P7j79q5K15Q5o8K15l63K61j17j83J14J3K29Lnj64j53K03J23n
7930A43j08n8l2J29J53l70L1R6L4o9j38J3K50q9oq8J29K7m2J35j23n4J48Ok18
7955a01j03J72k10J73L21k41J58k78J55j56J49p7K61L7j81j27L41n29L29J55J0
7976B58j22K41k69k00L49k88k27L6O7L52j74J39o7l68J77K52k11J52o6k00J79
7997A0J80l75P8J60J01m9k08n8K3L15k18k8J22j55j75K01J60k54L15j36r4N8J33
8020A06O0l37O6k39j4O49j00k58K76l70M76l21m6N9r6j96J07J91j87J74p2q7K93
$$ y = [-41, -197, -3, -3, 28, -45, -482, 89, -31, 106, 84, 231, 408, -2, 116, -117, -141, 199, 91, 13, -59, -63, -182, 111, -179, -121, -80, -137, -26, 106, -32, 11, 187, 64, -52, 133, 118, 80, 133, -159, 63, 105, 98, -31, 354, -149, 0, 197, -67, -158, -73, 4, -175, -260, -45, 40, -28, 187, -176, 85, -32, -215, -101, -88, 141, 144, 139, -25, -178, 25, 148, 143, 35, -23, -55, 74, 227, -143, -112, -16, 18, -51, -189, -176, 74, -15, -21, -109, 20, 47, 5, 140, 17, -37, 111, 117, -101, -204, -32, -242, -69, 252, 11, 169, -109, 46, -110, 39, -38, 223, 260, 79, -48, 293, -236, 93, 248, 258, 136, 377, 108, -92, 257, -31, -258, -222, -155, 197, 23, 162, 95, -273, -96, 156, -55, 97, 31, -169, 10, 190, -185, -107, 53, 154, 105, -103, -161, -138, 177, -41, -69, 53, -102, -277, -76, 84, -170, 145, 9, -85, -27, 106, 166, -171, -105, -344, -358, 291, 191, -67, 209, -161, 315, -6, -52, 7, -89, -285, -178, 13, -174, 0, -72, -159, 134]
8043A34l70J39J05J33p9j09M15m75o7K30j11J8K03k86M4K26k24j04K4J94L4N4
8065A28k45K56j9J27l88K16J6q3l3P3n3k7O3j43J70j79J26M2K84j06o6k70L08
8088A97l37M35k34l45K84J1K7J2j12j6K5J82j65J29k9j61K00o7J41k40L72n27
8110b18L38p2n5K1K2Q9p1k61R3J40k6j11N0q6K26j84Q9J71k79L1L39m27J61q9
8134a09J79J91l07Q5l25L58K44j23m5k12N42m16J46l4l60J69k95L48k95J45R4
8155b0nJ6K12j20j49p5K49k05K55j63k2J54lk40J80r5R0K22j45k19l1J16J35j76
8179c9K08m4k0k70M7J42K00k43j73J19L82l67
$$ y = [134, -236, -97, 8, 141, 62, -47, 368, -107, -174, 56, -55, -37, 166, -120, -76, 150, -74, -178, -154, 40, 74, 128, -117, 139, 120, 247, -141, 75, 91, 8, -25, 48, -5, -32, 31, -112, 58, -121, 5, 47, 331, 225, 159, -111, 197, -140, 295, 61, -284, 0, 11, 38, 50, -62, -78, -53, 129, -36, 93, 64, -97, 103, 36, 177, -63, 309, -218, 120, 48, -7, 14, 36, 125, 54, -207, -114, 26, 0, -111, -61, -147, 79, -105, -16, 155, -124, -93, 246, -181, -20, -109, 70, 261, -46, 39, -286, 72, 316, 193, 148, -64, 478, 62, 208, 174, -186, -17, -312, 36, -259, -114, -20, -25, -9, 203, 83, -66, -141, 108, -97, 158, -5, -27, 127, 124, -116, 64, -31, 59, 281, 136, -83, -114, 2, 137, -39, 169, 125, 105, -165, -118, 24, 224, -19, -192, -73, 309, -58]
8191e8
$$ Imaginary data points
##PAGE= N=2
##DATA TABLE= (X++(I..I)), XYDATA
0@%%%%%%%%%%%%%%%qJ6j6J6j6K4l2L2l8M6n3O2p3Q6r6J08j24J42j63J84k07K33
37A23k62K93l27L65m06M50m97N50o07O69p40Q18r02R93j093J204j330J471j625
56h53J800k002K236k510K836l233L730m368N227o450Q345j1713J9517p2451k4825
71h4714J19081N3880N4127N6596M6812p686k662j0425m6004p0336m4085o0652
83C932p6071n1508k7576l8830j8271J5963K2381J5958M5799N7541L6194L6868
95B2380N1914K7205O757J3438N763k3698k3710j1656k8703l7849j3266j0524k3814
108d5763n426J2503L20k55J9243J4623m523O078J2301j0846j3221L105q857j8760
122c9478p40O267m487M528K4825J7181J1164K8303K7209P956J0888J2960o558
$$ y = [0, 0, 0, 0, 0, 0, 0, 0, 0, 0, 0, 0, 0, 0, 0, 0, -8, 8, -8, 8, -8, 16, -16, 16, -22, 24, -29, 33, -40, 46, -50, 58, -66, 76, -87, 97, -110, 123, -139, 154, -173, 192, -214, 236, -261, 289, -318, 351, -389, 429, -473, 520, -573, 631, -699, 772, -853, 947, -1055, 1181, -1329, 1507, -1726, 2004, -2364, 2863, -3587, 4758, -6955, 12562, -59889, -84714, 34367, 88247, 142374, 198970, 245782, 238096, 235434, 225009, 179005, 108669, 64584, 3932, -72139, -123647, -151223, -190053, -208324, -192361, -169980, -154022, -108223, -50682, -14488, 22380, 74294, 101499, 108256, 121694, 127457, 103759, 80049, 68393, 39690, 1841, -11425, -21949, -45763, -51189, -38686, -38366, -38621, -19378, -4755, -9278, -3200, 9101, -1745, -14966, -11861, -20718, -39478, -40218, -33951, -38438, -33910, -9085, 8096, 19260, 47563, 74772, 82728, 93616, 106576, 100018]
135A00018j8726j4968k1944l9678l4593k4726l4089k9901q374l071k018J7195
147a14875L2259K9385L3614M7135M1173K6534K9869K3485j27q013j0896k7497
159A02046m1753l6582l6174m5870l7035j9219k0220j2676J0721J7338J8015L1142
171g0267M0561L3037K9175L4593K4971P990P681J552j5931k0314j8436k6059l0974
184b421k2871j7456k0033j2685J364J854L166J5407J7602J2802J5626J8936J1726
197B3017M160Q442M136o777m440j963r408j0065k430l189o309p15N497n65N9P242
213F692K037l233J668K29p011o026k203o096q521j566Q11k980L339R339O121P485
229H5J2123J1183O473O540P771Qm999k285p933j4076j1259j1110j3790j2689o392
$$ y = [100018, 81292, 66324, 44380, 4702, -29891, -54617, -88706, -118607, -126981, -130052, -132070, -114875, -82616, -53231, -19617, 27518, 68691, 95225, 125094, 148579, 148452, 140439, 129543, 102046, 60293, 23711, -12463, -58333, -95368, -114587, -134807, -147483, -136762, -119424, -101409, -70267, -29706, 3331, 32506, 67099, 92070, 100060, 107741, 109293, 93362, 73048, 54612, 28553, -2421, -25292, -42748, -62781, -75466, -74102, -72248, -69082, -53675, -36073, -23271, -7645, 11291, 23017, 27177, 35619, 39755, 32978, 28538, 26575, 17167, 7102, 4672, 1483, -4826, -5541, -44, -609, -550, 6692, 8729, 5496, 7164, 7393, 382, -5644, -7847, -13943, -22464, -24030, -23219, -26199, -22860, -13521, -7400, 85, 12208, 23391, 29864, 36404, 44175, 44183, 39184, 36899, 28966, 14890, 3631, -7479, -21269, -33958, -40350]
244d0350m619n034L139Q237O358J0027J5536J2792R849J2749R972L302M00R36
258D3294n618j1046p456j0663j4418j0324q377q612o020l87K270J545O778J0302
272a8732P175Q685J0873P801M879N123L293j266l776k197n962q878n591n679q121
287a2373n053j880k173j762K731M542K590M696P933M469M387O723L021J100J126
302B0077Q67k908m647k078m934p066l736l630n434k655k41j67M56L600N248L026
318d222N169P193M062L592L846K152n35j763j770m478o629m630n648p400m165
333a5226l146l238j307J549L209K842N351P116N149N033O501L227J385J327n27
348A9245l436m034l975n423o567l903l618m091j042M31L19J872L301L311K912
$$ y = [-40350, -44969, -50003, -46864, -38627, -32269, -22242, -6706, 6086, 15935, 28684, 38656, 41958, 42358, 43294, 37676, 26630, 19174, 8511, -5907, -16231, -24608, -33220, -39240, -39627, -37357, -35812, -29034, -18732, -11557, -2872, 8001, 15802, 20681, 25804, 29097, 27831, 24055, 21858, 15896, 7018, 1427, -4252, -12373, -17426, -19306, -21479, -23241, -20510, -15968, -13378, -8682, -749, 3720, 8107, 14830, 17851, 18951, 20077, 20944, 18036, 13389, 11311, 6377, -689, -4425, -8055, -13489, -16144, -16385, -16552, -16096, -12496, -7248, -4222, 947, 8140, 12202, 15794, 19640, 21792, 21257, 19494, 17724, 13246, 6617, 1987, -3661, -11061, -15226, -18372, -21610, -22917, -21368, -18159, -15317, -9966, -2850, 2299, 7332, 13833, 17060, 18445, 19772, 19245, 15809, 11775, 7800, 2377, -4190, -8093, -11711, -15802, -16844, -16413, -16094, -14222, -10921, -7610, -4698]
363d698L118L883Q64P88J503r41j468q97p18j553r10Q40J207L32K331K739R61
380G381J615J511l70k089k457k961n008n637m077n221m604j389m56J333M401O382
396a1646P751Q422J0403R331O560O934M018p12k895n303r623j1269j2604j2532
410a3165j2771j0922p046n233j224M308O848J0086J3248J4775J4801J3536J2527
423C9768R756M553J290k864p670j1058j3313j5234j5419j5134j1818r863o550
436e3556o49K807N761J0548J1868J3214J3632J2487J0850P425M897J335k822m686
450C3111p118r835r448q952q413p015m479k034o72J793L879M324M503N749L673
465i34L038J937R18k41j677j799j333j730o22Q42J988K639L517M769M146L449
$$ y = [-4698, -1580, 2303, 3167, 3955, 5458, 4517, 3049, 2152, 1434, -119, -1029, -189, 1018, 1350, 3681, 6420, 7381, 8996, 10507, 10137, 8048, 5591, 2630, -2378, -8015, -12092, -17313, -21917, -23306, -23762, -22429, -18028, -11646, -3895, 4527, 14930, 24261, 30821, 37755, 41773, 41061, 38166, 32863, 23240, 11971, -633, -13165, -25936, -36858, -43904, -49137, -50361, -46053, -39205, -29119, -15871, -1096, 13705, 27241, 39768, 49524, 54077, 55367, 52503, 44833, 33775, 20462, 5228, -10191, -25325, -37143, -47006, -53556, -54205, -51398, -45637, -35089, -23221, -10007, 3625, 16112, 26962, 34387, 39284, 40619, 37797, 33111, 25993, 16158, 6710, -2242, -10655, -17670, -22149, -24183, -24855, -23062, -19183, -14859, -10356, -4607, -934, 2104, 4041, 4959, 4718, 3041, 1242, -91, -1821, -2443, -1601, 387, 3026, 6543, 11312, 15458, 18907]
481A8907L313M59j221k813n408q058p860r350q958q200n675l632n27K882O658
496b9483R145J1333J3468J2567J3254J0573P984M547N4l627p866j1575j3896j5460
510A018j6093j4776j2787r311n563j165L895P597J1398J4932J5570J5866J5325
523B5906J2427R521N645J434l173p655r914j2849j4745j3690j3295j1328p917
536c9633n135p13K081N483Q313R517J0305J0774R129P548N663K684P11j632l601
551B1494m682n860n452n057m535k730j529p51J331J205K278J628J495J676r0j205
567g84r66k384k886j979j836q93L82J833L651M150N989O056N653N806M465K170
583B8427O67k279m448o271q206q536r771r612p065o284l335j23K266N772P924
$$ y = [18907, 22220, 22679, 21458, 18645, 13237, 5179, -2681, -12031, -20989, -29189, -34864, -38496, -39023, -36141, -29483, -20338, -9005, 4463, 17030, 30284, 40857, 48841, 53388, 53442, 49815, 41949, 30374, 16478, 1018, -15075, -29851, -42638, -51949, -57512, -58677, -54782, -47185, -35787, -20855, -5285, 10581, 25906, 38333, 47854, 53499, 54933, 51760, 44105, 34191, 21342, 6597, -7093, -20388, -31716, -39633, -44768, -45481, -43400, -37917, -29604, -20087, -9782, 992, 10121, 17669, 23332, 26016, 26727, 25095, 21494, 16812, 10952, 5500, 443, -4092, -6822, -8351, -9102, -7771, -6566, -4288, -2660, -1165, 511, 421, -784, -1750, -4134, -7020, -8999, -10835, -11728, -11346, -9513, -5862, -1712, 4277, 10333, 15986, 21792, 26257, 28427, 29094, 26815, 22367, 16096, 7890, -646, -10417, -20029, -27094, -33378, -36713, -36836, -34570, -28798, -20874]
598b0874R571J0962J1257J0326R068O174L957Q60k860n444q257j0118j1055j1831
612h264j0411r015p279l948j182K011N212P034R116R575J0090R313P913N892L796
627B9853N33j155l501o150o460p707o910o979n962l770k369o07J117K503L441
642a4123M337M079N013L517K951K214Q23j52m83j409j642j519j669r15n73q9M53
659H13N05J349P30M49L87k30j234p66k283k289k133k234j571j598j52J171J260
676g826K825L470K952M479L442L336K496J229J49j203k574l277m606m495m797
691d400m876l334l164j620j28P96K640L481L809M942M893L976M367K342J818K24
707A5766j356j944k878l997m034m234m151k844l040j052n85N83J832K126L070
$$ y = [-20874, -11303, -341, 10916, 21242, 30310, 36484, 40441, 41301, 38441, 32997, 24740, 14622, 3567, -8264, -18675, -27690, -34969, -38917, -40099, -38088, -32876, -25842, -16726, -7151, 2939, 12252, 20165, 26057, 29853, 30386, 29231, 25730, 19580, 13120, 5413, -1497, -8476, -14438, -18208, -20577, -21184, -20067, -17564, -14123, -9786, -5707, -694, 2823, 5774, 7988, 8811, 8659, 8176, 6767, 5125, 3606, 1937, 1022, 449, 360, 813, 1318, 2667, 3397, 3846, 4233, 4003, 2769, 2003, -280, -2569, -4702, -6936, -8507, -10105, -10257, -9086, -7826, -5001, -1531, 1421, 5900, 9342, 12678, 15174, 16403, 16552, 15349, 12775, 9498, 4892, 397, -4400, -9276, -12610, -15774, -17394, -17522, -16726, -14086, -10605, -6796, -1854, 3039, 7015, 11382, 13724, 15542, 15766, 14410, 12466, 9588, 5591, 1557, -2677, -6828, -9672, -12712, -13764, -14349, -13766, -11934, -9808, -6738]
722f738L234L268L182K760J485J642L64j77r79j849j842j978k626j825j938j487
738e504l31p34M78O25R24J299J696J401J553J169J053O79L70L98n60l68p51p78
756B619j036r74j408o05p08J29n57K40M39L32P35J189M4Q38J239K18N12J31j63
775C214j06n03p72o38r83m10j187o74p68m7k68K60J92L81R23O00R90O72M80N00
795A856J04L34j97n32n20n39p16q43p32m73k99m08J27K58K55N93J98L22M82K66
815d64L39l24r1m0j15q5J04j2L28N44O62N69L79O94R99L47M8l09p89p56j280j314
837e66j925j541j079j078o98N67R8J742J890J849K817K526K619K301J489O40L4
854A1685r35j665k819l252l274l611l520k593k276j135k16N99K351K676M088L823
$$ y = [-6738, -3504, -236, 2946, 5706, 7191, 8833, 9197, 9020, 8041, 6192, 4350, 2372, -254, -2079, -4017, -5504, -5835, -6569, -6091, -5466, -4542, -3243, -1547, -146, 1407, 2576, 3629, 4308, 4678, 5076, 4516, 4148, 3397, 2619, 1583, 609, -799, -1404, -2112, -1983, -2540, -2300, -1861, -1529, -794, 395, 439, 1277, 2516, 2734, 3246, 3377, 3214, 3108, 2605, 1833, 1195, 212, -198, -1385, -2059, -2827, -2874, -3142, -2882, -2690, -2309, -1386, -786, 204, 876, 1356, 1856, 1960, 2294, 2097, 1565, 1045, 506, -210, -1053, -1785, -2258, -2557, -2965, -2838, -2580, -2325, -1732, -1534, -1212, -730, -464, -125, -449, -540, -580, -695, -780, -676, -688, -360, 184, 846, 1415, 1794, 2488, 3487, 3834, 3882, 3573, 2784, 2028, 748, -566, -2491, -4032, -5111, -6189, -6887, -6320, -6222, -4480, -2590, -741, 2076, 4602, 7221, 9522, 11011, 11651, 11685, 10750, 9085, 6266, 3014, -260, -3871, -7391, -9984, -12260, -13395, -13611, -13012, -10661, -7985, -3897, -74]
870g4M075L747L475K051J877n01l96k377k980l553m274m384l947l212k480j490
886a4443n71P00J727K723L075L618L704L301K802K408J117L96k19j780j892k286
902D380k740k320k256j836q95p18K0M57N93J514J165J111R32N88N95q4j78l23
920El24n31j69J45N88P36Q54J682J244J457J843J35J10m10j156j918k319k732
938g60l061k993k490j895j175K91R02J786L372L350M354M098L754L761K259J313
954A6866K43j086k638l658m755m501n410m559l604l451j792j24O31L163K920M551
970g204N178M951M576M099K703K256j5o53k142l418l661m332m554l946l713k564
986a2439j443n65R24J676K369K790L330L011L143K142J774Q03K27l35r47j512
$$ y = [-74, 4001, 7748, 11223, 13274, 15151, 14650, 14254, 11877, 8897, 5344, 1070, -3314, -7261, -10473, -12953, -14443, -15014, -14314, -12587, -9864, -6789, -3171, 533, 3834, 6636, 9044, 10161, 10557, 10338, 8558, 6666, 4380, 1640, -680, -2936, -4772, -5667, -6385, -6365, -5908, -5315, -3801, -2636, -1525, -593, -5, 590, 506, 328, 5, -319, -850, -1019, -874, -286, 450, 1304, 2986, 4230, 5687, 7530, 7665, 7775, 7365, 6209, 4291, 1972, -760, -3821, -6814, -9304, -11199, -12374, -12083, -11181, -9395, -6023, -2673, 1681, 5779, 9533, 13294, 15553, 16866, 17109, 16023, 13385, 9727, 4972, 471, -4939, -9498, -13102, -16553, -18345, -18469, -17838, -14675, -11755, -7204, -2026, 2925, 7501, 11600, 14303, 16559, 16544, 15891, 13749, 10331, 6670, 2338, -2216, -6162, -9875, -12439, -13882, -14447, -13523, -11847, -9478, -6688, -3358, -347, 2796, 4938, 6712, 7515, 7742, 7407, 6460, 4948]
1002D948j208k126j325q10j099m02l36M61N27M26P34K27K69j67m42p77n00j024
1020b624n00q37m69O43P22J241J226K415K296J964J498J741O35L29q47j708k095
1037E630k677l220l003l181k801j837j315m6Q35J660K543L135L983L607L302L455
1053A0070K217J016P30j112j868k616l286m020l515l967l026k337j601n8N45J607
1069a1221J976L086L220L037L225K935J460J957N01o44j366j242k374k257k501
1084b08k465j826j546p21l62K46Q61P97J659J542J305J523J200O35O00k17k2J22
1102C123r43l65m17o14l43k75J70lM41L66K66k06J71l25r5o34q37m68j108j13
1122b209o0n31M78M23N49R15J080J014J161N80Q65K46O8jp87r41j261j236j294
$$ y = [4948, 3740, 1614, 289, -521, -1620, -2022, -2358, -1897, -1370, -944, -210, 17, 286, 119, -323, -1100, -1600, -2624, -3124, -3961, -4430, -3787, -3065, -1824, -598, 1817, 4113, 6077, 7575, 9316, 9951, 10280, 9433, 7725, 5630, 2953, -267, -3270, -6451, -9252, -11089, -12404, -12450, -11615, -9955, -7412, -4277, -294, 3313, 6615, 10070, 12287, 13303, 14033, 12921, 11053, 8437, 5151, 1131, -2384, -6351, -9377, -11714, -13315, -13373, -12828, -11221, -9245, -6159, -2939, 98, 3323, 6258, 7718, 9675, 10176, 9532, 8166, 6924, 4550, 2293, -208, -2673, -4499, -6045, -6766, -7128, -6882, -6021, -5224, -3565, -2023, -718, 805, 2005, 2640, 3240, 3023, 3001, 3123, 2180, 1815, 1398, 784, 441, 166, 336, 333, 774, 1140, 1406, 1200, 1371, 1046, 951, 317, -520, -988, -2096, -2209, -2269, -2800, -2322, -1899, -1350, -435, 645, 1659, 2820, 3400, 4265, 4511, 4579, 4578, 3791, 2850, 1589, 353, -941]
1141i41j480j313p51p37j62M32P64O64J123J374J372J462R21R69L15K47p6n90
1159C593r18j035j142j393j150j140n19p10j36r3N69R37N03J532J054Q66P56Q03
1177B377O27N10k53M9p18o66m13j405r32o31r04o78k19OK86M18N41O50J440Q64
1197I49Q72L93R83L01J86K79n32n35p93o49j232j111p57j058n16l39M3L45M80
1216b691P97R38J170J184R46R14R91M67j21M0o70j165j006j369j471q53j460m20
1234c779p35j52R5M07Q17J127R91J338J117R13J171L37j97j7k86j135m26j187
1252C99q43j010q32l53l90j70L18J58L09R79N98L57N00j2R7m00M03m22lp8RJ64
1274b22O37L2N29L84O14N71L73k6j09m66o35p69j588j171j310q89j039p53J41
$$ y = [-941, -2421, -3734, -4485, -5222, -5384, -4952, -4188, -3524, -2401, -1027, 345, 1807, 2728, 3697, 4012, 4259, 4183, 3593, 2675, 1640, 498, -895, -2045, -3185, -3704, -4414, -4550, -4643, -4074, -3137, -2634, -1102, -48, 818, 1574, 2377, 3004, 3514, 3261, 3310, 2592, 1926, 1513, 108, -824, -1455, -2359, -3037, -3256, -3250, -2964, -2546, -2005, -1355, 85, 949, 1821, 2214, 3197, 3498, 3684, 3963, 3431, 2896, 2103, 1454, 222, -889, -1646, -2704, -3220, -3559, -3516, -3171, -2691, -1894, -956, 214, 1398, 2344, 3258, 4249, 4716, 4595, 4635, 3965, 2800, 1794, 425, -1046, -1899, -3359, -3779, -4514, -4666, -4571, -4164, -3347, -2220, -1229, 109, 1226, 2139, 3310, 3647, 3450, 3433, 3147, 2012, 1586, 399, -444, -1454, -2286, -2639, -3029, -3199, -2881, -2723, -2414, -1435, -837, -480, 20, 8, 105, -295, 108, -314, -317, -395, -386, -222, 415, 447, 976, 1360, 1974, 2545, 2918, 2892, 2783, 2317, 1682, 913, -675, -1846, -3156, -4045, -5084, -5837, -5696]
1293e696P21P27J252J746K208K009J914J815J831P77j78l75j433j595k396k861
1309D66k605k792k259k133j033n6J45J431K320K355K996L213K656K845J892J471
1325A0912J78m05j631k107k389k723l118l007k489k135r05p31K24J255J744K234
1341e093K451K450K266J889J682J270j12m30o56r87j595j503j676j317j396k55
1357c012n34o7O47M9O99R66N10L87K31m8j4m40k17n11r0j65J93N42J083O52J091
1378A952J331J113R54Q32M83m40j056j433j789j979k264k367k188j413j053k13
1394i530O11J257J898K559L066L360K645K788J945J068M56l64j521k547k822l561
1410A308l437l685k414k695j317o34M40J643K088K762L305L464L134K741K218
$$ y = [-5696, -4975, -4248, -2996, -1250, 958, 2967, 4881, 6696, 8527, 9304, 9126, 8751, 7318, 5723, 3327, 466, -2139, -4931, -7190, -9323, -10356, -10412, -10267, -8836, -6516, -4161, -1165, 2048, 4704, 7549, 9441, 10912, 11090, 10685, 9054, 6947, 4558, 1835, -1283, -4290, -6779, -8914, -9819, -10550, -10326, -9071, -7327, -5093, -2642, -192, 2074, 3963, 5645, 6915, 6803, 6373, 5717, 4730, 3135, 1632, -44, -1361, -2757, -3012, -3546, -3613, -2966, -2917, -2218, -1252, -742, -355, -124, -172, -186, -626, -843, -1354, -1444, -1609, -1416, -874, 209, 861, 1952, 3283, 4396, 5350, 6182, 6665, 6225, 5169, 3736, 1947, -32, -2296, -4663, -6851, -8264, -9317, -9530, -8919, -7662, -5764, -3205, -139, 3221, 5866, 8654, 10599, 11667, 12123, 11759, 10238, 7691, 4869, 1308, -2129, -5814, -8228, -10923, -12240, -12874, -12434, -10791, -8703, -5941, -2636, 828, 3962, 6703, 8921]
1425H921J590N60l18j073k243k460k361l088k587k661j759r11m02N6P89J493J681
1442d773K056J583J970J661J078O33J63j78q1j080o04q77r84o90k48k25k42N16
1460c22K56L15N5J59mj62o44m49p13p75p18j91m76K83Q94K22J518J269J817J589
1480C923J259J175M29L57j46j033j517j948j929k379j848k054j696r10q7M09Q49
1497g146J671K184K209K383K511K042J603P92M72k03j058j626j867k351k561k156
1513c101k241j458j081p80M87O25J618J665J686K187J847J698J624N80P56j29
1529E983m17r59j609j307j421j276j214r49j021N0k63M73L60J063R96J145O91
1546C25R37N19N1L78j66m9j51m51m24n58j06J37n50J06j7j1L07P2j8L86m48k04
$$ y = [8921, 10511, 11071, 10753, 9680, 7437, 4977, 2616, -472, -3059, -5720, -7479, -8390, -8792, -8736, -7947, -6454, -4773, -2717, -1134, 836, 2497, 3575, 4208, 4371, 4193, 4112, 3032, 2428, 1551, 567, -123, -371, -596, -838, -322, -66, 249, 304, 463, 459, 297, -347, -796, -1509, -2284, -3002, -3193, -3669, -3386, -2492, -2270, -752, 517, 2334, 3923, 5182, 6357, 6786, 7143, 6997, 5964, 4447, 2499, 570, -1809, -3657, -5711, -7407, -8317, -8404, -7995, -7146, -5475, -3291, -1082, 1301, 3812, 5854, 7457, 8249, 8721, 8518, 7460, 5834, 3967, 1616, -945, -3101, -5342, -6800, -7881, -8661, -8174, -7549, -5931, -4266, -2580, -393, 1454, 3152, 4776, 5356, 6112, 5983, 5566, 4607, 2998, 1691, 270, -1006, -2220, -3169, -4190, -4140, -4403, -3930, -3570, -2507, -1511, -366, 325, 1262, 1781, 1832, 2210, 2044, 1995, 1844, 1393, 969, 411, 305, 442, -108, -2, -19, -30, 277, 349, 331, 717, 269, 65]
1568F5j08j25k4j00j31j29k43R8K64N85J88O0L50O68L89J42j31m2l11j71o06m34
1590B54n75o22l81k78l23k20n3K37M94K38M56N84M44N70N70j1M53l42j05q7m47
1611H56q67l98m61m83n15l5m61K08j9K31P22J25Q46N49M93N84N54L45K18l24J19
1632B287m98l93q69p76r40p70j99o04l05m7N14M85O18R93Q98R92R18J015P29K54
1652D302o8mo01j030p98j383j303j335r65n80o91p1R7L48J123J312J037J715J378
1671B483J104J139L82L08ro55p33j338j801j580j179j468j039q82r3j5M72Q38
1689d066Q58J524J286J372J162J094M37M76R8n02j008o35o53j187j401o42l83
1706b170m36o7L5J50M29N64O32J49N01j7K98N5j36j63m27O7j81PN84N51O14N59
$$ y = [65, -43, -168, -192, -292, -423, -552, -795, -697, -433, 152, 340, 400, 750, 1418, 1807, 1949, 1818, 1776, 1465, 1294, 688, 254, -321, -943, -1324, -1602, -1925, -2145, -2198, -1961, -1467, -1229, -773, -189, 255, 825, 1395, 1384, 1837, 1495, 1390, 1303, 856, -11, -409, -870, -1353, -1868, -1903, -2364, -2156, -2175, -1944, -1222, -1097, -251, 298, 791, 1375, 1929, 2274, 2492, 2168, 2287, 1789, 1396, 527, -249, -1189, -1959, -2158, -2762, -3067, -3114, -2600, -2115, -1497, -504, 394, 1386, 2304, 3319, 4048, 4302, 4234, 4230, 3629, 2599, 1801, 418, -885, -2220, -3185, -3765, -4456, -4527, -4430, -4082, -2959, -1647, -610, 1105, 2483, 3587, 4726, 5108, 5416, 5407, 4752, 4019, 2681, 880, -700, -1879, -3347, -4386, -5268, -5361, -5376, -4904, -4066, -3208, -1684, -398, 974, 2136, 3230, 3667, 4143, 4241, 3739, 2731, 2096, 1443, 256, -1145, -1787, -2170, -2606, -2673, -2638, -2488, -2059, -1495, -863, -714, -213, -230, 68, 123, -13, -176, -603, -536, -717, -710, -126, 425, 1039, 1598]
1728A598P12N72L37pK36l83o76j060j463j091j648j138j132l11p14N37O75J277
1746c679J834J626K171K019J856J521J011N27n27p71j778j848k521k753k452k572
1762f336j727j401l94K89N72K120K202K412L013K333K639J838J329O56j12q05
1778H628j480k245k687k336k609k289j355j641k94k42O59J466J822J743J984J703
1794H27K100R83R87N41j65m19q38j115j282r18r92p19o45l10k82L10L59N95R0
1813h93L82N25j42k7o31l92n33j03k98r5J39P98N67J035J210J352J047J182Q44
1832E967L76l61o16r79j725j950k092k019j970j436j144m80L72Q20J478K322K199
1849a238K646K589K256K003J266N62k25j106j714j952k617k979l011k583j665
$$ y = [1598, 2310, 2882, 3219, 3212, 3448, 3065, 2389, 1329, -134, -1225, -2873, -4011, -5143, -5454, -6168, -5631, -4956, -3679, -1845, -219, 1952, 3971, 5827, 7348, 8359, 8886, 8359, 7588, 5810, 3962, 1441, -1312, -3764, -6336, -8063, -9464, -9858, -9569, -8997, -6877, -4675, -2263, 750, 3083, 5722, 7560, 8889, 9545, 9433, 8628, 7148, 4903, 2216, -120, -2729, -5018, -6373, -8014, -8308, -8550, -7891, -6425, -4603, -2860, -876, 827, 2927, 3910, 4897, 5438, 5273, 4854, 4016, 2901, 1619, 701, -291, -1010, -1655, -1965, -2247, -1937, -1578, -983, -893, -511, 14, -128, -155, -786, -1178, -1711, -1814, -2112, -2207, -2068, -1270, -703, 332, 1542, 2894, 3941, 5123, 5967, 6343, 5982, 5366, 4387, 2662, 712, -1380, -3399, -5369, -6805, -7949, -8429, -8057, -7237, -5759, -3437, -1238, 1408, 3997, 6253, 8256, 9522, 10084, 9859, 8753, 7039, 5087, 2470, -509, -3520, -6103, -7768]
1864g768j796o62N27N45J740J816K445K588K346K430K148Q94P30K20n89j380j474
1881D760k241j700k207j657j535q21m91k54M63J212J047J032J403J260J247N28
1897B046Q04l7j10n47j35q64k38j87n27o5r1K64N0J06N76j37q3P0m06j75p48r51
1919a385p21o38n55J33p8M26O27R94J164J212J325J078J116N47M48K40q08j030
1937D095j424j318j919j859j629j172q97l57q4Q28Q56J439J684J955J835J854
1953C887J390O73O40j17o98r52j282j807j628j765j708j070q25p37J80M54O99
1970d666J406J028J569J493J232Q87Q73L02q8k85m41n76j007j108q12j131o82
1987b006k06m93L61J6M39L45L43Q28M73L44M19L1L52j25l4m21n2l04k7k67N45
$$ y = [-7768, -9564, -10226, -9699, -9154, -7414, -5598, -3153, -565, 1781, 4211, 6359, 7253, 7983, 8203, 7614, 6234, 4760, 2519, 819, -1388, -3045, -4580, -5401, -5892, -6146, -5683, -4471, -3424, -2392, -989, 271, 1518, 2046, 2850, 2813, 2703, 2156, 2021, 1157, 919, 732, 205, 140, 49, 313, 363, 469, 1045, 908, 825, 895, 489, 314, -434, -1385, -2106, -2744, -3299, -3166, -3244, -2818, -2191, -1197, -33, 1179, 2504, 3582, 4698, 5245, 5693, 5933, 5125, 4095, 2671, 1353, -566, -2425, -4054, -5226, -6123, -6480, -6564, -5736, -4880, -3441, -1757, 198, 2033, 3887, 5277, 5950, 6590, 6473, 5775, 4823, 3541, 1734, 106, -1659, -3367, -4437, -5262, -5999, -5819, -5365, -4666, -3260, -2232, -663, 830, 2062, 2949, 3822, 4124, 4036, 3751, 3310, 2734, 1727, 619, -193, -1324, -2006, -2212, -2705, -2344, -2328, -1889, -1544, -1201, -373, 100, 444, 863, 894, 1246, 1121, 1087, 666, 614, 310, 283, 16, 561]
2008E61m70M78r9K27K23k01k27n3j88l44k9k67k77k30j10k5k04p3L78L99K18O92
2030C79K56N38M17J71K06j46k50q2p36j02p92n57k97n01k71m08J57N61j22K99
2050a280P51Q3O64P66J67J15M14j42j65k00k91n90k50k71o94l85k98M8lR3J2L71
2072a085K36M09N57N77R1K86M13Pm2k09j30l68l05l12k56j010J03k76O3k71L7
2093a485J16L78N65P31K27M65O69J19R3R6K51l91k10o64l90n12o93n24m36l19
2113a914m44M03J65N1O83P50N86N76P07M03M30Qm8R5p38m75n20r23m46r47j6m28
2135b042k72m1J25M13K90P60M44M47O32J12KM64J61k63j37o90L18m97n73n8m03
2156h08k39K35k79L25J0K21L1N6K72K36j43k81p6J25o4K1n3pK97N64qL18M01L28
$$ y = [561, 91, 569, 470, 697, 920, 719, 492, 439, 251, -93, -122, -389, -666, -896, -1006, -1031, -1235, -1308, -930, -531, -313, 379, 635, 1173, 1590, 1761, 1967, 1821, 1571, 1489, 753, 651, -141, -698, -995, -1496, -1767, -2175, -2018, -1457, -1579, -1280, -529, -446, 218, 984, 1151, 1266, 1680, 1538, 1373, 1173, 882, 292, 42, -229, -923, -1308, -1606, -1558, -1561, -1468, -1456, -1085, -849, -440, 117, 694, 785, 1071, 1484, 1491, 1449, 1240, 1110, 742, 437, 125, -131, -1141, -1038, -1314, -1251, -1522, -1485, -1369, -991, -426, 305, 532, 997, 1666, 1785, 1878, 1974, 2225, 1834, 1624, 960, 570, 58, -635, -1159, -1595, -1914, -2358, -1955, -1790, -1739, -1056, -306, 280, 856, 1563, 1966, 2396, 2404, 2356, 2451, 1713, 1238, 718, -205, -651, -1598, -1614, -2042, -2314, -2355, -2230, -1817, -1527, -767, -323, 124, 756, 868, 870, 1334, 1495, 1232, 1095, 405, 723, 226, -347, -405, -808, -1047, -812, -1091, -766, -756, -535, -504, -448, -176, 60, -83, -364, -440, -315, -379, -358, -411, -418, -121, 443, 435, 753, 1154, 1482]
2180A482K92N8j29Q9R1q19o22o73r86n79o10m37M6N9K38N19Q08Q48J211N31J185
2201B602N93O62N51l49l59p36q60j125r76j400j374o76p84o4l76L82R17R15R15
2220a542J169J415J032J324J93P14N4n50l82q46j207j222j053r92r03n52k39n2
2238c639K8O78N90P33P70J024P42L75L06M31J76l52l10n37k08j29m74n20l55Q5
2258e86k05K44M1J47K27J82K78l63j72j3l60l11m02J05K7J63J36K98M37Q75L59
2279A107P26N54L83N54l27r7n24q01j137o66r98r97r85m90k90q8L11R32P32J065
2299a036J324J107J394N84Q50O53k49m13m09j366j241j180j136j413r50o24j87
2316d292o2j00R48P12J150J031J046J170R79O92J74L17l60n93m42j028r56r14
$$ y = [1482, 1774, 1832, 1703, 1792, 1883, 1064, 442, -231, -1217, -1796, -2406, -2843, -2797, -2738, -2500, -1981, -1173, -325, 886, 1417, 2602, 3195, 3857, 4408, 4059, 3700, 2964, 2104, 979, 3, -1397, -2771, -3447, -4231, -4295, -4671, -4289, -3372, -2457, -1542, -373, 1042, 2074, 3398, 3591, 4305, 4359, 3809, 3427, 2581, 1374, 152, -901, -1893, -2796, -3348, -3587, -3639, -3611, -2933, -2343, -1610, -840, 184, 926, 1301, 1607, 2038, 2214, 1862, 1552, 1015, 807, 678, 204, -316, -671, -586, -791, -547, -506, -359, -132, 50, 328, -35, -207, -220, -580, -891, -1293, -1188, -1161, -998, -862, -564, -127, 748, 1107, 1833, 2387, 2770, 3324, 2997, 2900, 2376, 1575, 438, -228, -1226, -2223, -3208, -3698, -3988, -4076, -3765, -2833, -2101, -1036, 288, 1395, 2789, 3373, 4223, 4876, 4627, 4214, 3805, 2439, 1198, 18, -1118, -2531, -3481, -4105, -4292, -4354, -4454, -3506, -2794, -1644, -613, 433, 1603, 2582, 3274, 3448, 3765, 3405, 2812, 2370, 1342, 386, -528]
2334e28m18m87j078k17j5M16J50O00O88L19L92N85M60K2J67N7l91J65k95Jj67
2355D26p6l28L63L7K17r1K22j3l4j53k73o8n57j30n83l34j34n66K02K28L79K52
2377a014P33P37R26M70L87M54L35L15n76l58q23q12p25j111r41n46n35k32k66
2396c582L39M85R44N56R63J284O30N89P42J32N4l52m18l83q42p75j280m26r20
2415b260l12l28k28N04J26P97N16M06O06P80N40O68M4q5p3k64k60m44m23l36n34
2436e60K06o10k7J31N9JK78L46l90N90j96L25k31O9J3Q7O0J0j88K83j94L46m0
2459C68M54K53r0L15l20J71k74k98l13k94m21k05l18l73N8m0K45M2N56J17O19
2480B52J90N42Q0N37K81l77r4j98l06o99k23o25n9o47j63j02l9J01J1O99K41M61
$$ y = [-528, -946, -1433, -2511, -2728, -2743, -2327, -2177, -1577, -889, -570, -178, 407, 867, 889, 1056, 1113, 722, 887, 592, 593, 426, 350, 22, 385, 422, 639, 548, 770, 757, 723, 570, 297, 229, -328, -458, -1041, -1375, -1509, -2075, -1873, -1645, -1266, -1014, -281, 456, 1382, 1852, 2239, 2693, 3028, 3343, 2767, 2409, 1586, 774, 49, -1062, -2003, -2549, -3084, -3316, -3582, -3243, -2758, -1814, -1258, -295, 989, 1619, 2208, 2950, 3082, 3136, 2784, 2366, 1983, 1141, 366, -914, -1340, -2260, -2572, -2900, -3128, -2624, -2498, -1701, -1185, -779, -173, 607, 1147, 1815, 1859, 1774, 1701, 1437, 1177, 733, 310, -26, -560, -354, -964, -991, -860, -801, -800, -522, -176, -566, 24, -172, 153, -78, -9, 4, 91, 151, 161, -27, 256, 62, 408, 368, 822, 1075, 985, 1300, 980, 1151, 877, 579, 266, -28, -449, -654, -972, -1345, -1287, -1327, -1082, -1040, -484, -367, 252, 442, 984, 1064, 1601, 1882, 1505, 1411, 1213, 907, 208, -15, -640, -699, -1346, -1509, -1611, -1650, -1549, -1538, -839, -598, -137]
2502a37L65K47M24K79J32l21j34K12j40n54m47Q7o84j06J06k98o9q1K92L59n8
2523e26J92K27L93o1K24J33k2j02L7j12l7l97L14k16l46K49j38n22N73j9r7K03
2545e0J69j13K12j84M60k4l98K09J31k16j96J99j94K54j64j33P0J71k97K19k60
2566a35N3OK54l94L21N2J23j90M8p9o8KJ93k10j83M31m78M75l38R1j31J10l49
2589c96J63K41q5J9r3L09j91j08L0O4j27R8k81K40Q7q1l0K31k17K91k23P1l6K66
2613B42k40k74L08m81K55j32J13k38n1L52m0K13RO9K21K58l3k03J98J04k56P4
2635D68o4l09j65O1J3p20J08j26J83MpJ80L09L23J58K42n2L11K46l0k87j50j38
2658E58m25K7n92n2k95l16L02j02l3j08M39L52J52L31J20M32K03J83q3j18j57
$$ y = [-137, 228, 475, 899, 1178, 1310, 989, 855, 1067, 927, 373, -74, 13, -671, -777, -671, -969, -1038, -1119, -827, -468, -526, -334, -107, 286, 225, 449, 582, 560, 458, 495, 383, 346, -51, 263, 47, -299, -50, -188, -710, -137, -156, -253, -50, 119, 6, 218, 34, 494, 470, 72, 281, 412, 196, 0, 199, 5, 259, 95, -38, 32, 203, -94, 125, -135, -82, -76, 178, -216, 105, 157, 280, 90, 138, 59, -9, -7, 186, -24, -207, 224, -254, 221, -117, -26, -157, -47, -396, -233, 8, -77, -58, -151, 158, -33, -141, -111, -47, -174, -76, -357, -117, -30, -111, -141, 90, -127, 164, -59, 12, -24, 242, 2, -272, 36, -445, -190, -322, -209, -447, -498, -146, -186, 27, 36, 105, 326, 584, 551, 348, 546, 650, 394, 468, 404, 95, -70, -9, 4, -716, -608, -734, -551, -547, -554, -374, -65, 258, 416, 658, 606, 917, 1163, 1133, 846, 696, 558, 133, 160, -432, -484, -779, -1095, -793, -895, -928, -1036, -597, -245, -93, 238, 358, 790, 993, 1176, 1093, 975, 818]
2679H18l61k82j35k34k48k32k06K11n38O9M7L84K70j37M54J80K05N1J44j36K54
2700E78j72j33j9k74QL7o9k91L99K6j88J12Q7m0M2J28j01l20j3J2q5p7j6K8K50
2725i1K15O5L10Q1R9M52l3j55J92l06j81o1l17n49K1k61p18j57j52J33L84K72
$$ y = [818, 457, 175, 40, -194, -442, -674, -880, -669, -1207, -1138, -1091, -707, -437, -574, -120, 60, 265, 316, 460, 324, 578, 406, 273, 254, -20, -12, 25, -44, -335, 64, 90, -98, 14, 101, 61, 103, 231, 130, -190, -203, -191, -276, -353, -369, -341, -91, 124, 189, 499, 580, 679, 1131, 1098, 943, 1135, 829, 648, 587, 270, -279, -258, -519, -1237, -1394, -1546, -1413, -1029, -757]
$$ [...]
8191A
##END NTUPLES=NMR FID
##END=
