##TITLE=1H_Pr T-3475
 200.13MHz, CDCl3,
 8 sc
 
 16.1.2025
##JCAMPDX= 6.0         $$ Bruker NMR JCAMP-DX V2.0
##DATA TYPE= NMR FID
##DATA CLASS= NTUPLES
##ORIGIN= UXNMR, Bruker Analytische Messtechnik GmbH
##OWNER= pz
$$ XWIN-NMR		Version 3.5
$$ Thu Jan 16 14:10:00 2025 Russian Standard Time (UT+4h)  she@DPX200
##.OBSERVE FREQUENCY= 200.1313
##.OBSERVE NUCLEUS= ^1H
##.DELAY= (6, 6)
##.ACQUISITION MODE= SIMULTANEOUS
##.ACQUISITION SCHEME= undefined
##.AVERAGES= 8
##.DIGITISER RES= 18
##SPECTROMETER/DATA SYSTEM= spect
##.PULSE SEQUENCE= zg30
##.SOLVENT NAME= DMSO
##.SHIFT REFERENCE= (INTERNAL, DMSO, 0, 14.3821)
##AUDIT TRAIL= $$ (NUMBER, WHEN, WHO, WHERE, WHAT)
$$ ##TITLE= Audit trail, XWIN-NMR		Version 3.5
$$ ##JCAMPDX= 5.01
$$ ##ORIGIN= Bruker BioSpin GmbH
$$ ##OWNER= she
$$ F:/spectra/data/she/nmr/H-C/1/audita.txt
$$ ##AUDIT TRAIL=  $$ (NUMBER, WHEN, WHO, WHERE, WHAT)
(   1,<2025-01-16 14:08:50.18 +0400>,<she>,<DPX200>,
      <created by zg, POWCHK disabled, PULCHK disabled
       configuration hash MD5:
       00 E9 B6 7A A2 85 ED C7 34 08 36 98 17 FE 4E 26
       data hash MD5: 16K
       D0 04 B9 E4 97 65 54 C6 F2 7C 4C E4 82 E8 5F 6C>)
$$ ##END=
$$ 
$$ hash MD5
$$ A8 E7 BB 6F FA C2 B7 F5 C7 5E B0 F1 51 4C FF EA
##$RELAX= 
##$RELAX= 
##$RELAX= 
##$RELAX= 
##$RELAX= 
##$RELAX= 
$$ Bruker specific parameters
$$ --------------------------
##$DU= <F:/spectra>
##$EXPNO= 1
##$NAME= <H-C>
##$PROCNO= 1
##$TYPE= <nmr>
##$USER= <she>
##$AMP= (0..31)
100 100 100 100 100 100 100 100 100 100 100 100 100 100 100 100 100 100 
100 100 100 100 100 100 100 100 100 100 100 100 100 100 
##$AQSEQ= 0
##$AQ_mod= 1
##$AUNM= <au_zg>
##$AUTOPOS= <>
##$BF1= 200.13
##$BF2= 200.13
##$BF3= 200.13
##$BF4= 200.13
##$BF5= 200.13
##$BF6= 200.13
##$BF7= 200.13
##$BF8= 200.13
##$BYTORDA= 1
##$CFDGTYP= 0
##$CFRGTYP= 5
##$CHEMSTR= <none>
##$CNST= (0..31)
1 1 145 1 1 1 1 1 1 1 1 1 1 1 1 1 1 1 1 1 1 1 1 1 1 1 1 1 1 1 1 1 
##$CPDPRG= <>
##$CPDPRG1= <>
##$CPDPRG2= <>
##$CPDPRG3= <>
##$CPDPRG4= <mlev>
##$CPDPRG5= <mlev>
##$CPDPRG6= <mlev>
##$CPDPRG7= <mlev>
##$CPDPRG8= <mlev>
##$CPDPRGB= <>
##$CPDPRGT= <>
##$D= (0..31)
0 0.7 0 0 0 0 0 0 0 0 0 0.03 0 0 0 0 0 0 0 0 0 0 0 0 0 0 0 0 0 0 0 0 
##$DATE= 1737022129
##$DBL= (0..7)
120 120 120 120 120 120 120 120 
##$DBP= (0..7)
150 150 150 150 150 150 150 150 
##$DBP07= 0
##$DBPNAM0= <>
##$DBPNAM1= <>
##$DBPNAM2= <>
##$DBPNAM3= <>
##$DBPNAM4= <>
##$DBPNAM5= <>
##$DBPNAM6= <>
##$DBPNAM7= <>
##$DBPOAL= (0..7)
0.5 0.5 0.5 0.5 0.5 0.5 0.5 0.5 
##$DBPOFFS= (0..7)
0 0 0 0 0 0 0 0 
##$DE= 6
##$DECBNUC= <off>
##$DECIM= 32
##$DECNUC= <off>
##$DECSTAT= 4
##$DIGMOD= 1
##$DIGTYP= 9
##$DL= (0..7)
0 120 120 120 120 120 120 120 
##$DP= (0..7)
150 150 150 150 150 150 150 150 
##$DP07= 0
##$DPNAME0= <>
##$DPNAME1= <>
##$DPNAME2= <>
##$DPNAME3= <>
##$DPNAME4= <>
##$DPNAME5= <>
##$DPNAME6= <>
##$DPNAME7= <>
##$DPOAL= (0..7)
0.5 0.5 0.5 0.5 0.5 0.5 0.5 0.5 
##$DPOFFS= (0..7)
0 0 0 0 0 0 0 0 
##$DQDMODE= 0
##$DR= 18
##$DS= 0
##$DSLIST= <SSSSSSSSSSSSSSS>
$$ [...]
##$SUBNAM0= <"">
##$SUBNAM1= <"">
##$SUBNAM2= <"">
##$SUBNAM3= <"">
##$SUBNAM4= <"">
##$SUBNAM5= <"">
##$SUBNAM6= <"">
##$SUBNAM7= <"">
##$SUBNAM8= <"">
##$SUBNAM9= <"">
##$SW= 18.0517328524113
##$SWIBOX= (0..15)
0 0 2 0 0 0 0 0 0 0 0 0 0 0 0 0 
##$SW_h= 3612.71676300578
##$TD= 16384
##$TD0= 1
##$TE= 0
##$TE2= 300
##$TE3= 300
##$TEG= 300
##$TL= (0..7)
0 120 120 120 120 120 120 120 
##$TP= (0..7)
150 150 150 150 150 150 150 150 
##$TP07= 0
##$TPNAME0= <>
##$TPNAME1= <>
##$TPNAME2= <>
##$TPNAME3= <>
##$TPNAME4= <>
##$TPNAME5= <>
##$TPNAME6= <>
##$TPNAME7= <>
##$TPOAL= (0..7)
0.5 0.5 0.5 0.5 0.5 0.5 0.5 0.5 
##$TPOFFS= (0..7)
0 0 0 0 0 0 0 0 
##$TUNHIN= 0
##$TUNHOUT= 0
##$TUNXOUT= 0
##$USERA1= <user>
##$USERA2= <user>
##$USERA3= <user>
##$USERA4= <user>
##$USERA5= <user>
##$V9= 5
##$VALIST= <valist>
##$VCLIST= <CCCCCCCCCCCCCCC>
##$VD= 0
##$VDLIST= <DDDDDDDDDDDDDDD>
##$VPLIST= <PPPPPPPPPPPPPPP>
##$VTLIST= <TTTTTTTTTTTTTTT>
##$WBST= 1024
##$WBSW= 4
##$XGAIN= (0..3)
0 0 0 0 
##$XL= 0
##$YL= 0
##$YMAX_a= 202615
##$YMIN_a= -276512
##$ZGOPTNS= <>
##$ZL1= 120
##$ZL2= 120
##$ZL3= 120
##$ZL4= 120
##$ABSF1= 10
##$ABSF2= 0
##$ABSG= 5
##$ABSL= 3
##$ALPHA= 0
##$AQORDER= 0
##$ASSFAC= 0
##$ASSFACI= 0
##$ASSFACX= 0
##$ASSWID= 0
##$AUNMP= <proc_1d>
##$AZFE= 0.1
##$AZFW= 0.1
##$BCFW= 1
##$BC_mod= 2
##$BYTORDP= 1
##$COROFFS= 0
##$CY= -3
##$DATMOD= 1
##$DC= 2
##$DFILT= <>
##$DTYPP= 0
##$F1P= 0
##$F2P= 0
##$FCOR= 0.5
##$FTSIZE= 0
##$FT_mod= 4
##$GAMMA= 1
##$GB= 0.15
##$INTBC= 1
##$INTSCL= 1
##$ISEN= 128
##$LB= 0.25
##$LEV0= 0
##$LPBIN= 0
##$MAXI= 10000
##$MC2= 0
##$MEAN= 0
##$ME_mod= 0
##$MI= 1.114404
##$NCOEF= 0
##$NC_proc= 0
##$NLEV= 6
##$NOISF1= 3.799351
##$NOISF2= 2.8
##$NSP= 1
##$NTH_PI= 0
##$NZP= 0
##$OFFSET= 14.38212
##$PC= 1
##$PHC0= 248.7829
##$PHC1= 14.5922
##$PH_mod= 1
##$PKNL= yes
##$PPARMOD= 0
##$PSCAL= 0
##$PSIGN= 0
##$REVERSE= no
##$SF= 200.129724274929
##$SI= 16384
##$SIGF1= 3
##$SIGF2= 2
##$SINO= 400
##$SIOLD= 16384
##$SREGLST= <1H.CDCl3>
##$SSB= 0
##$STSI= 0
##$STSR= 0
##$SW_p= 3205.1282051282
##$SYMM= 0
##$S_DEV= 0
##$TDeff= 0
##$TDoff= 0
##$TI= <>
##$TILT= no
##$TM1= 0
##$TM2= 0
##$TOPLEV= 0
##$USERP1= <user>
##$USERP2= <user>
##$USERP3= <user>
##$USERP4= <user>
##$USERP5= <user>
##$WDW= 1
##$XDIM= 8192
##$YMAX_p= 0
##$YMIN_p= 0
$$ End of Bruker specific parameters
$$ ---------------------------------
##NTUPLES= NMR FID
##VAR_NAME=  TIME,          FID/REAL,        FID/IMAG
##SYMBOL=    X,             R,               I
##VAR_TYPE=  INDEPENDENT,   DEPENDENT,       DEPENDENT
##VAR_FORM=  AFFN,          ASDF,            ASDF
##VAR_DIM=   8192,          8192,            8192
##UNITS=     SECONDS,       ARBITRARY UNITS, ARBITRARY UNITS
##FACTOR=    0.0002768,     1,               1
##FIRST=     0,             0,               0
##LAST=      2.2672688,     0,               0
##MIN=       0,             -276512,         0
##MAX=       2.2672688,     202615,          0
$$ Real data points
##PAGE= N=1
##DATA TABLE= (X++(R..R)), XYDATA
$$ plain form
0 0 0 0 0 0 0 0 0 0 0 0 0 0 0 0 0 0 0 0 5 -5 8 -8 8 -8 8 -13 16 -16 19 -23 24 -29 32 -37 43 -45 53 -60 64 -73
40 -73 81 -90 100 -111 123 -135 148 -164 183 -201 221 -243 269 -296 328 -362 403 -448 502 -566 642
61 642 -736 854 -1009 1221 -1533 2035 -2988 5416 -27240 -29117 51722 123827 180728 202615
75 202615 197797 146938 56342 -54629 -147463 -203988 -200943 -145749 -69093 2634 64827 103671
87 103671 111901 91677 70532 65488 67810 63271 53228 26334 -17650 -63726 -92435 -96659 -77167
100 -77167 -33053 32619 90402 109549 95809 66727 33415 4749 -10594 -5569 12923 30047
112 30047 34551 13778 -28302 -59215 -60614 -44845 -18615 21967 69767 97448 83332 42422
124 42422 1879 -30865 -46919 -43718 -27444 -6018 10453 12439 -1708 -24926 -35934 -22538
$$ packed form
0@%%%%%%%%%%%%%%%%%%Nj0J3j6J6j6J6k1K9l2L5m2M7n3O1o9Q0q8R8j13J24j37
40g3J54j71J90k11K34k58K83l12L47l84M22m64N12n65O24o90P65q51R50j068J208
61F42j378J590j863K230k754L568n023Q404l2656j877Q0839P2105N6901K1887
75B02615m818n0859r0596j10971r2834n6525L045N5194P6656P1727O2193L8844
87A03671Q230k0224k1145n044K322m539j0043k6894m3984m6076k8709m224J9492
100g7167M4114O5672N7783J9147j3740k9082l3312k8666j5343N025J8492J7124
112C0047M504k0773m2080l0913j399J5769K6230M0582M7800K7681j4116m0910
124D2422m0543l2744j6054L201J6274K1426J6471J986j4147k3218j1008J3396
$$ plain form
136 -22538 49 22435 40001 42589 24033 -13074 -53045 -77973 -81467 -58366 -11922 32679
148 32679 54249 54051 37294 7744 -29732 -58862 -60825 -41828 -21867 -9600 -9754 -19610 -27846
161 -27846 -30578 -26795 -11327 18534 51446 61675 39089 3062 -29949 -58341 -74285 -68100 -38885
174 -38885 1111 29538 37435 26708 4100 -15050 -21683 -17576 -2831 18291 35834 37721 19049
187 19049 -8168 -28994 -37648 -30208 -7516 17339 34245 38542 30346 10880 -13767 -26514 -13606
200 -13606 11636 32318 44292 45399 33143 7528 -21832 -39609 -35048 -11326 20173 40502
212 40502 44408 39287 26401 4793 -14581 -16896 1608 25636 36468 34608 22599 1347 -21276
225 -21276 -36377 -36245 -18547 8122 32949 44328 36124 18447 1263 -11686 -15286 -6394 9119
$$ packed form
136b2538K2587K2386J7566K588j8556l7107l9971k4928l494K3101M6444M4601
148C2679K1570j98j6757k9550l7476k9130j963J8997J9961J2267j54r856q236
161b7846k732L783J5468K9861L2912J0229k2586l6027l3011k8392j5944O185K9215
174c8885L9996K8427P897j0727k2608j9150o633M107J4745K1122J7543J887j8672
187A9049k7217k0826q654P440K2692K4855J6906M297q196j9466k4647j2747J2908
200a3606K5242K0682J1974J107j2256k5615k9360j7777M561K3722L1499K0329
212D0502L906n121j2886k1608j9374k315J8504K4028J0832j860j2009k1252k2623
225b1276j5101J32J7698K6669K4827J1379q204j7677j7184j2949l600Q892J5513
$$ plain form
238 9119 22882 24120 10557 -13923 -40873 -53926 -45314 -25025 -102 26678 46306 47954 26295
251 26295 -4954 -27333 -35428 -32655 -22854 -12043 -2714 331 -8058 -23853 -32654 -25271 -2946 17837
265 17837 28811 30909 21300 -2545 -34170 -60005 -64987 -49324 -23295 5698 26584 32365 25660
278 25660 10482 -8503 -21072 -21352 -10513 3102 7972 2729 -9104 -24651 -32901 -29974 -18289
291 -18289 2553 26567 43127 41111 19981 -5546 -21762 -28903 -26668 -12953 8654 28974 34322
304 34322 21817 2616 -12236 -16351 -9660 1905 17030 32456 36819 24520 1624 -17867 -23103
317 -23103 -16192 -3634 14273 30309 36411 30417 14076 -2943 -11957 -9183 4638 20028 27683
330 27683 26570 16390 -1707 -19327 -29249 -25158 -6021 18324 36928 41539 30624 14445 -3791
$$ packed form
238I119J3763J238j3563k4480k6950j3053Q612K0289K4923K6780J9628J648k1659
251B6295l1249k2379q095K773R801J0811R329L045q389j5795q801P383K2325K0783
265A7837J0974K098r609k3845l1625k5835m982J5663K6029K8993K0886N781o705
278B5660j5178j8985j2569k80J0839J3615M870n243j1833j5547q250K927J1685
291a8289K0842K4014J6560k016k1130k5527j6216p141K235J3715K1607K0320N348
304C4322j2505j9201j4852m115O691J1565J5125J5426M363j2299k2896j9491n236
317b3103O911J2558J7907J6036O102n994j6341j7019r014K774J3821J5390P655
330B7683j113j0180j8097j7620r922M091J9137K4345J8604M611j0915j6179j8236
$$ plain form
343 -3791 -21053 -30041 -22628 -3099 14793 18837 12285 3266 -5829 -12586 -13585 -5976 9345 22304
357 22304 21432 6171 -16085 -34172 -41660 -40003 -26989 -3037 21727 35534 32538 15907 -3568
370 -3568 -20138 -28766 -26246 -17535 -7646 -740 -1257 -11081 -24224 -31727 -26691 -10588 7641 22452
384 22452 28553 23645 9350 -12103 -32458 -40556 -32314 -14205 1248 8124 9558 5822 -4707
397 -4707 -16871 -20076 -9949 9884 24898 28321 22287 8234 -9519 -26372 -36392 -31644 -13607
410 -13607 7805 22070 25091 19947 12030 2737 -3144 6 10187 21009 26848 21425 7066 -11722
424 -11722 -25930 -27889 -19967 -4966 14097 30662 37350 30893 14569 -948 -6829 -3101 6571
437 6571 16345 23895 26610 18589 -263 -19609 -28516 -23075 -9020 4039 16152 24867 24446 15212
$$ packed form
343c791j7262q988P413J9529J7892M044o552r019r095o757r99P609J5321J2959
357B2304q72j5261k2256j8087p488J657J3014K3952K4764J3807k996j6631j9475
370c568j6570q628K520Q711R889O906n17r824j3143p503N036J6103J8229J4811
384B2452O101m908j4295k1453k0355q098Q242J8109J5453O876J434l736j0529
397d707j2164l205J0127J9833J5014L423o034j4053j7753j6853j0020M748J8037
410a3607K1412J4265L021n144p917r293n881L150J0181J0822N839n423j4359j8788
424a1722j4208j959P922J5001J9063J6565O688o457j6324j5517n881L728R672
437F571R774P550K715q021j8852j9346q907N441J4055J3059J2113Q715m21r234
$$ plain form
451 15212 2068 -5443 -1448 8824 18084 20930 15180 3185 -13580 -31849 -42172 -37164 -18878
464 -18878 4906 24533 34041 32828 20900 4578 -9687 -19173 -20209 -13256 -4751 -2298 -8165 -17820
478 -17820 -23785 -23474 -17737 -5857 9733 24430 29733 19781 -523 -19983 -31537 -32574 -26595 -14913
492 -14913 1374 13789 13522 1877 -13553 -21940 -21424 -15803 -5950 6207 14822 15125 6160 -7342
506 -7342 -16524 -16285 -8456 2515 11358 15373 12111 535 -14242 -25637 -28504 -19297 -2937 13584
520 13584 23355 23868 17358 7761 -2593 -9025 -5660 5519 19321 24358 18518 6331 -6876 -18700
534 -18700 -25100 -23457 -10515 8816 24273 27981 23812 16745 11768 8146 6970 11399 18174 20249
548 20249 12281 -4482 -22284 -32125 -32637 -23072 -4334 17879 37697 47940 43137 28744 10435
$$ packed form
451A5212j3144p511L995J0272R260K846n750j1995j6765j8269j0323N008J8286
464a8878K3784J9627R508j213j1928j6322j4265r486j036O953Q505K453n867r655
478a7820n965L11N737J1880J5590J4697N303r952k0304j9460j1554j037N979J1682
492a4913J6287J2415k67j1645j5430q387N16N621R853J2157Q615L03q965j3502
506g342r182K39P829J0971Q843M015l262j1576j4777j1395k867R207J6360J6521
520A3584R771N13o510r597j0354o432L365J1179J3802N037n840j2187j3207j1824
534a8700o400J643J2942J9331J5457L708m169p067m977l622j176M429O775K075
548B0249p968j6763j7802r841n12R565J8738K2213J9818J0243m803j4393j8309
$$ plain form
561 10435 -4638 -12561 -14823 -13229 -10143 -9558 -11046 -14471 -17962 -15129 -2582 15836 32042 38446
575 38446 35263 23862 5247 -17434 -35175 -40650 -32344 -17237 -5144 1762 4112 2861 -809
588 -809 -6793 -7381 1473 12821 18269 15051 4457 -8618 -21070 -31362 -32901 -25157 -10045 4589
602 4589 11883 9731 2197 -6349 -12449 -13422 -8979 -234 8984 12261 8503 -3067 -16279 -23389 -21848
617 -21848 -13857 -1943 8938 17473 18797 9900 -3864 -14648 -16667 -10310 -2375 4453 10910 12016
631 12016 6960 -2945 -11948 -11408 -1860 9418 17445 20587 18514 11202 -2434 -14630 -18703 -12476
645 -12476 198 12448 19561 20126 15948 6591 -2975 -8146 -6400 2550 12420 18047 17187 9415 -184
660 -184 -7119 -10351 -7429 926 11991 20894 21657 12773 1003 -7967 -11120 -9189 -3657 5711 15092
$$ packed form
561A0435j5073p923k262J594L086N85j488l425l491K833J2547J8418J6206O404
575C8446l183j1401j8615k2681j7741n475Q306J5107J2093O906K350j251l670
588h09n984n88Q854J1348N448l218j0594j3075j2452j0292j539P744J5112J4634
602D589P294k152p534q546o100r73M443Q745R218L277l758j1570j3212p110J541
617b1848P991J1914J0881Q535J324q897j3764j0784k019O357P935O828O457J106
631A2016n056r905r003N40R548J1278Q027L142k073p312j3636j2196m073O227
645a2476J2674J2250P113N65m178r357r566n171J746Q950R870N627q60p772r599
660a84o935l232K922Q355J1065Q903P63q884j1770q970l153J931N532R368R381
$$ plain form
675 15092 17221 10075 -2085 -12329 -14884 -10797 -4760 4766 13848 17961 13628 1370 -10270 -15025
689 -15025 -13454 -7632 -630 4848 7465 4180 -5765 -15604 -20204 -17067 -7696 3285 11452 13769 9951
704 9951 1483 -8602 -17483 -19385 -13887 -3771 4281 5697 1111 -5474 -12578 -17682 -17802 -11760 1057
719 1057 12214 14994 9966 559 -7994 -14151 -17345 -14418 -5532 5081 11097 8003 -186 -6844 -9628
734 -9628 -9580 -5099 3165 12129 16790 12316 2167 -8912 -16022 -16023 -10594 -1156 9762 17616 18827 14060
750 14060 4619 -3311 -5651 -2850 3801 9058 10890 9754 4606 -3704 -10833 -12381 -5499 6602 16668
765 16668 20875 19608 13913 5238 -4448 -11160 -9210 -3 9037 13574 12137 7293 1969 -4514 -8948
780 -8948 -6888 843 10852 16237 13640 6691 -1617 -8426 -12561 -11593 -4892 5167 12218 13311 8095
$$ packed form
675A5092K129p146j2160j0244k555M087O037R526R082M113m333j2258j1640m755
689a5025J571N822P002N478K617l285r945r839m600L137R371J0981Q167K317l818
704I951q468j0085q881j902N498J0116Q052J416m586o585p104n104j20O042J2817
719A057J1157K780n028r407q553o157l194K927Q886J0613O016l094q189o658k784
734i628M8M481Q264Q964M661m474j0149j1079p110jN429R438J0918P854J211m767
750A4060r441p930k340K801O651N257J832j136n148q310p129j548O882J2101J0066
765A6668M207j267n695q675r686o712J950R207R040M537j437m844n324o483m434
780h948K060P731J0009N385k597o949q308o809m135R68O701J0059P051J093n216
$$ plain form
795 8095 -994 -7991 -11166 -9752 -4342 2592 8504 10262 5329 -4802 -13710 -17734 -14937 -7590 -767
810 -767 5936 9396 7655 -146 -9779 -15242 -12509 -5690 654 5312 6350 4007 -2652 -12622 -18785
825 -18785 -17358 -9396 -1 5771 7535 6135 605 -7377 -13397 -13999 -8130 974 7600 9446 6137
840 6137 -165 -7278 -12414 -13081 -8561 -244 8450 12732 10081 3363 -3447 -8072 -8441 -5610 93 8009
856 8009 12787 10221 2932 -5407 -9207 -7584 -2875 3931 12173 18090 18295 10868 825 -6221 -7610
871 -7610 -4856 -315 4747 9043 10093 5459 -1896 -6952 -6468 98 8342 14888 18648 18113 12404 2991
887 2991 -6644 -11684 -9788 -4113 2627 7040 6686 3918 -513 -4945 -6368 -3715 3642 12297 16485
902 16485 13603 6057 -2328 -9605 -14342 -14885 -9702 -594 6198 7496 3068 -2422 -5779 -7222 -6255
$$ packed form
795H095r089o997l175J414N410O934N912J758m933j0131q908m024K797P347O823
810g67O703L460j741p801r633n463K733O819O344M658J038k343o659r970o163
825a8785J427P962R395N772J764j400n530p982o020o02N869R104O626J846l309
840F137o302p113n136o67M520Q317Q694M282k651o718o810m625l69K831N703P916
856H009M778k566p289q339l800J623M709O806Q242N917K05p427j0043p046j389
871g610K754M541N062M296J050m634p355n056M84O566Q244O546L760n35n709r413
887B991r635n040J896N675O740M413l54k768m431m432j423K653P357Q655M188
902A6485k882p546q385p277m737n43N183R108O792J298m428n490l357j443R67
$$ plain form
917 -6255 -2539 4024 9447 9175 2001 -6872 -13959 -17165 -15230 -10331 -2822 4600 8000 5790 -439
932 -439 -7364 -9723 -8282 -3906 1772 5254 5978 2946 -4302 -12307 -17162 -16128 -9210 -1040 4776 7398
948 7398 6799 2923 -2575 -7720 -8246 -2739 4677 9143 9176 4695 -332 -6576 -12320 -13908 -8913 -167
964 -167 8080 10580 8429 4630 154 -3441 -4341 -1412 5375 12259 14001 10594 3946 -3143 -7213 -8562
980 -8562 -5889 297 7373 11861 11348 6489 346 -3483 -3519 545 5346 9966 13580 12486 6981 -1296
996 -1296 -8063 -9130 -4970 535 6011 9372 10279 7826 1083 -5490 -6887 -3555 2529 7237 8702
1011 8702 7951 4568 -2063 -8679 -11560 -8890 -1692 4675 7626 7864 4331 -995 -6208 -9632 -8528
1026 -8528 -3667 2874 6689 5625 1001 -4959 -9838 -12424 -11256 -6929 -491 5456 6530 3153 -2815
$$ packed form
917f255L716O563N423k72p174q873p087l206J935M899P509P422L400k210o229
932d39o925k359J441M376N678L482P24l032p248q005m855J034O918Q170N816K622
948G398n99l876n498n145n26N507P416M466L3m481n027o244n744j588M995Q746
964a67Q247K500k151l799m476l595r00K929O787O884J742l407o648p089m070j349
980h562K673O186P076M488n13m859o143l829l6M064M801M620L614j094n505q277
996a296o767j067M160N505N476L361R07k453o743o573j397L332O084M708J465
1011H702p51l383o631o616k881K670P198O367K951K38l533n326n213l424J104
1026h528M861O541L815j064m624n960m879k586J168M327O438N947J074l377n968
$$ plain form
1041 -2815 -7558 -8876 -7700 -4362 654 5427 7000 3267 -4395 -10943 -13143 -11344 -7065 -2244 2593
1056 2593 6580 5162 -318 -6383 -8333 -6267 -744 3248 7101 9019 6856 1002 -6448 -11088 -10590
1071 -10590 -5815 -176 4901 6589 5758 2840 -2022 -4812 -4917 -603 6377 11432 12188 8825 3714
1086 3714 -1795 -6063 -7864 -5242 466 6918 10059 8768 3690 309 -1743 -2467 -353 4616 10027
1101 10027 12769 9587 3377 -3002 -6439 -6569 -4416 91 6352 10961 10538 6141 105 -3830 -4035
1116 -4035 -1705 1645 5907 8112 7143 2849 -3487 -8720 -9841 -6536 -1257 3783 6646 7584 4690
1131 4690 175 -4707 -7519 -5777 -608 3765 5259 3571 43 -4313 -9713 -12774 -11206 -5382 1851
1146 1851 5423 5062 2473 -923 -4927 -7501 -7754 -3856 1643 5289 4035 -189 -5477 -9171 -10809
$$ packed form
1041b815m743j318J176L338N016M773J573l733p662o548k200J799M279M821M837
1056B593L987j418n480o065j950K066N523L992L853J918k163n854p450m640M98
1071a0590M775N639N077J688q31k918m862k790j05M314O980N055P56l363n111
1086C714n509m268j801K622N708O452L141j291n078l381k052p24K114M969N411
1101A0027K742l182o210o379l437j30K153M507O261M609m23m397o036l935k05
1116d035K330L350M262K205r69m294o336n233j121L305N279N040K863R38k894
1131D690m515m882k812J742N169M373J494j688l528m356n400l061J568N824P233
1146A851L572l61k589l396m004k574k53L898N499L646j254m224n288l694j638
$$ plain form
1161 -10809 -10293 -5959 111 5138 6543 3520 -1281 -5671 -7713 -6535 -3455 399 4643 6186 4121
1176 4121 -741 -5904 -7943 -6330 -2454 1877 5577 7248 6430 2289 -3875 -7033 -6088 -1794 2970
1191 2970 6237 7017 6498 3220 -1685 -5170 -4652 -183 5264 8991 9725 7962 4162 -192 -4921 -6047
1207 -6047 -2639 2471 6725 8229 6677 3590 -86 -3036 -3668 -1070 3420 8498 10138 8410 3722
1222 3722 -1537 -4615 -5341 -3948 -142 4807 7720 7635 2626 -2389 -5302 -5458 -3152 -130 3459 6709
1238 6709 6857 2863 -2944 -6740 -7390 -4299 -608 2520 5122 5175 2270 -2790 -8126 -9146 -6857 -2438
1254 -2438 1258 3185 3232 1106 -2861 -7287 -9107 -7548 -2409 2185 4289 4049 1424 -2481 -6064 -8620
1270 -8620 -8076 -4199 886 3630 3395 313 -3139 -5700 -7692 -6910 -3856 1193 5877 6163 2809 -1276
$$ packed form
1161a0809N16M334O070N027J405l023m801m390k042J178L080L854M244J543k065
1176D121m862n163k039J613L876M331L700J671q18m141o164l158R45M294M764
1191B970L267P80n19l278m905l485N18M469N447L727P34j763l800m354m729j126
1207f047L408N110M254J504j552l087l676k950o32K598M490N078J640j728m688
1222C722n259l078p26J393L806M949K913q5n009n015k913j56K306L022L589L250
1238F709J48l994n807l796o50L091L691L128K602N3k905n060n336j020K289M419
1254b438L696J927M7k126l967m426j820J559N139M594K104k40k625l905l583k556
1270h620N44L877N085K744k35l082l452k561j992P82L054N049M684K86l354m085
$$ plain form
1286 -1276 -4639 -5594 -5186 -2785 1307 5454 6751 4050 -687 -4479 -5608 -4314 -1732 1867 5415
1301 5415 7129 6021 1353 -3085 -4904 -3484 -253 3477 6223 8018 6776 3438 -955 -3820 -3458
1316 -3458 -394 3662 6228 6801 5205 2875 -697 -4440 -4723 -1988 3315 7307 7966 6534 3678 420
1332 420 -2041 -3711 -1936 2591 6357 6966 4467 924 -2846 -5105 -5860 -4470 -270 4505 6919 5625
1348 5625 2070 -1388 -3617 -4457 -3306 -633 2325 4845 3941 335 -4058 -7125 -6982 -4958 -1791 1683
1364 1683 3924 4134 1805 -2755 -6924 -7421 -5443 -2428 763 1959 2550 734 -2681 -6306 -7636 -5619
1380 -5619 -1385 1918 3497 2862 1491 -1605 -5664 -7898 -6482 -3180 1271 3298 2704 644 -1813
1395 -1813 -4163 -5862 -5073 -1508 3135 5872 5585 2988 18 -3247 -4457 -4306 -2202 1625 4505 5381
$$ packed form
1286a276l363r55M08K401M092M147J297k701m737l792j129J294K582L599L548
1301E415J714j108m668m438j819J420L231L730K746J795j242l338m393k865L62
1316c458L064M056K566N73j596k330l572l743k83K735N303L992O59j432k856l258
1332D20k461j670J775M527L766O09k499l543l770k259p55J390M200M775K414j294
1348E625l555l458k229q40J151K673K958K520r04l606m393l067J43K024L167L474
1364A683K241K10k329m560m169m97J978L015L191J196N91j816l415l625j330K017
1380e619M234L303J579o35j371l096m059k234J416L302M451K027n94k060k457
1395a813k350j699P89L565M643K737k87k597k970l265j210J51K104L827K880Q76
$$ plain form
1411 5381 3549 -112 -2976 -3886 -2744 -572 2473 5687 7383 5980 2522 -1309 -2807 -1397 971
1426 971 3309 5233 6823 5397 1693 -2957 -5255 -3921 -874 2438 5120 6362 6660 4236 492
1441 492 -2311 -2361 105 3452 5024 4933 3647 1015 -2081 -4500 -5364 -3030 859 4036 5524 3936
1457 3936 1508 -977 -3081 -4308 -2718 75 3505 4770 3027 -162 -3546 -5290 -5735 -4878 -2476
1472 -2476 1604 3901 3682 814 -2605 -4061 -4377 -3164 -1351 747 2258 1851 -1388 -5242 -7576 -7670
1488 -7670 -5116 -1755 1302 4041 4982 3141 -374 -3585 -4817 -3847 -1906 -276 674 309 -1337 -3725
1504 -3725 -6138 -6820 -4656 -505 3606 5749 5745 4839 2040 -800 -2882 -3958 -1996 1261 2467 1529
1520 1529 -251 -2242 -3471 -4447 -3370 -12 4294 7922 8260 5763 2697 38 -1661 -2464 -1440 429
$$ packed form
1411E381j832l661k864r10J142K172L045L214J696j403l458l831j498J410K368
1426I71K338J924J590j426l704m650k298J334L047L312K682J242K98k424l744
1441D92k803n0K466L347J572r1j286k632l096k419q64K334L889L177J488j588
1457C936k428k485k104j227J590K793L430J265j743l189l384j744m45Q57K402
1472b476M080K297k19k868l419j456l16J213J813K098J511m07l239l854k334r4
1488g670K554L361L057K739R41j841l515l211j232R70J941J630R50l65j646k388
1504c725k413o82K164M151M111K143mr06k799k840k082j076J962L257J206r38
1520A529j780j991j229r76J077L358M306L628L38k497l066k659j699q03J024J869
$$ plain form
1536 429 3615 4199 2205 -89 -2407 -2314 -854 873 3754 6426 7085 5847 2594 -1259 -3139 -2762
1552 -2762 -1016 1165 2931 3548 3657 1284 -1465 -3307 -2796 -239 2617 4098 4804 4043 2254 -904
1568 -904 -3802 -4687 -2385 -67 1490 2254 902 -237 -2070 -3846 -4325 -1983 1112 3996 4409 2822
1584 2822 937 -1923 -4068 -5578 -4965 -2859 -272 1352 404 -1567 -3530 -4437 -4370 -2662 -270 2307
1600 2307 4790 4619 1289 -1965 -4281 -5370 -4632 -3431 -1589 -113 850 -193 -2482 -4251 -3301 -933
1616 -933 1524 3223 4282 3993 2164 -1301 -4845 -5762 -4806 -1702 669 2520 3632 3406 1888 -158
1632 -158 -1597 -1265 760 2603 2975 2467 585 -1318 -2666 -3387 -2334 281 3579 6294 6455 4659
1648 4659 2353 -5 -1725 -1979 -1126 891 3670 3754 2386 176 -1503 -1473 -979 171 1988 4272 5273
$$ packed form
1536D29L186N84j994k294k318R3J460J727K881K672O59j238l253l853j880L77
1552b762J746K181J766O17J09k373k749j842N11K557K856J481P06p61j789l158
1568i04k898q85K302K318J557P64j352j139j833j776m79K342L095K884M13j587
1584B822j885k860k145j510O13K106K587J624r48j971j963r07O7J708K392K577
1600B307K483j71l330l254k316j089P38J201J842J476R63j043k289j769R50K368
1616i33K457J699J059k89j829l465l544r17R56L104K371J851J112k26j518k046
1632a58j439L32K025J843L72n08j882j903j348p21J053K615L298K715J61j796
1648D659k306k358j720k54Q53K017K779Q4j368k210j679L0M94J150J817K284J001
$$ plain form
1665 5273 4014 1177 -1340 -2228 -1952 -631 913 2514 3616 2648 611 -1874 -3229 -2493 -639 791
1681 791 2588 2956 2527 422 -2303 -4227 -4006 -2379 205 2056 2597 2120 824 -1081 -2947 -3567 -2555
1698 -2555 -387 804 1171 -192 -1698 -2990 -4018 -4709 -3178 -538 1977 2920 1995 -170 -1819 -3102
1714 -3102 -4243 -3240 -1863 641 2364 1751 -511 -2174 -3476 -3302 -2766 -1219 909 1947 2290 698
1730 698 -1596 -2619 -2577 -1367 210 1726 2568 2984 1483 -1083 -2828 -2897 -1790 497 2040 3226 3529
1747 3529 2526 564 -1716 -2933 -2425 20 1873 3031 2844 2379 1521 235 -828 -37 1678 3427
1763 3427 3943 3320 1579 -49 -1741 -2850 -2327 -495 2135 3935 4027 3071 1477 178 -488 -783 -73
1780 -73 1364 2968 3402 1944 -799 -1988 -2687 -2362 -1178 315 2413 3317 2836 951 -1495 -2371 -2170
$$ packed form
1665E273j259k837k517q88K76J321J544J601J102r68k037k485j355P36J854J430
1681G91J797L68m29k105k725j924K21J627K584J851N41m77j296j905j866o20J012
1698b555K168J191L67j363j506j292j028o91J531K640K515R43r25k165j649j283
1714c102j141J003J377K504J723o13k262j663j302J74N36J547K128J038L43j592
1730F98k294j023M2J210J577J516Q42M16j501k566j745o9J107K287J543J186L03
1747C529j003j962k280j217N08K445J853J158j87m65q58j286j063P91J715J749
1763C427N16o23j741j628j692j109N23J832K630J800R2r56j594j299o66k95P10
1780g3J437J604M34j458k743j189o99L25J184J493K098R04m81j885k446q76K01
$$ plain form
1797 -2170 -1477 -263 411 715 409 -775 -2585 -3397 -2206 -337 1928 2843 2940 2330 130 -2588 -5147
1814 -5147 -6074 -4850 -2907 -989 -37 592 872 363 -384 -870 132 1315 2141 1211 -894 -2698 -4161
1831 -4161 -5351 -5286 -3645 -1028 2422 3921 4058 2172 475 -768 -2080 -2324 -1962 -808 595 604 -857
1848 -857 -1868 -2023 -993 204 1375 2824 4382 4138 2197 -206 -2187 -2697 -1974 -886 427 1173
1864 1173 1861 1396 152 -1159 -978 929 2790 4028 4460 4374 3526 1234 -1234 -2522 -3344 -1536 -388
1881 -388 553 1344 1209 1311 833 592 925 2186 4050 4389 2906 757 -1471 -2768 -3766 -3764 -1956 475
1899 475 2765 3605 2677 1448 327 -364 -1015 -1068 -583 369 899 148 -1709 -2399 -2418 -1312 -425 975 2072
1918 2072 2389 1402 -416 -2547 -3364 -3166 -1985 -949 -61 842 921 8 -1664 -2781 -2879 -1619 26 160
$$ packed form
1797b170O93J214O74L04l06j184j810q12J191J869K265R15R7o10k200k718k559
1814e147r27J224J943J918R52O29K80n09p47m86J002J183Q26r30k105j804j463
1831d161j190O5J641K617L450J499J37j886j697j243j312k44L62J154J403Rj461
1848h57j011j55J030J197J171J449J558k44j941k403j981n10P23J088J313P46
1864A173O88m65j244j311J81J907J861J238M32q6q48k292k468j288q22J808J148
1881c88R41P91j35J02m78k41L33J261J864L39j483k149k228j297r98KJ808K431
1899D75K290Q40r28j229j121o91o51n3M85R52N30p51j857o90j9J106Q87J400J097
1918B072L17r87j818k131q17J98J181J036Q88R03P9r13j672j117r8J260J645J34
$$ plain form
1936 160 688 479 95 -1230 -2358 -2458 -1396 403 1323 1342 318 -246 -1308 -2158 -2695 -2185 -491 1318
1954 1318 1589 989 -371 -935 -1319 -1415 -784 563 2455 3474 2537 1371 -148 -1299 -1762 -1836 -1479 73
1972 73 902 1140 675 -352 -731 234 1239 2262 3615 4174 3780 2344 -83 -1845 -2739 -2263 -1248 -129
1990 -129 753 2004 2168 1581 588 554 1447 2365 2970 2646 1874 397 -1302 -2979 -3439 -3083 -1196 1184
2008 1184 2683 2778 2733 1969 1056 42 -624 -548 113 565 -365 -1464 -2483 -2884 -2419 -1975 -567 1232 2671
2027 2671 3339 2097 421 -1094 -2000 -2214 -2274 -2017 -834 -256 -265 -1471 -2272 -2380 -1391 -357 403 1186 1336
2046 1336 1391 -179 -1971 -2585 -2257 -1236 -79 -131 525 428 -140 -1428 -2100 -2453 -1240 622 952 1073
2064 1073 960 351 -425 -1630 -2157 -1136 377 1334 1602 1142 552 56 -671 -1096 -649 190 1581 1999
$$ packed form
1936A60N28k09l84j325j128j00J062J799R20J9j024n64j062q50n37N10J694J809
1954A318K71o00j360n64l84r6O31J347J892J019r37j166j519j151m63p4L57J552
1972G3Q29K38m65j027l79R65J005J023J353N59l94j436k427j762q94M76J015J119
1990a29Q82J251J64n87r93l4Q93R18O05l24p72j477j699j677m60L56J887K380
2008A184J499R5m5p64r13j014o66P6O61M52r30j099j019m01M65M44J408J799J439
2027B671O68j242j676j515r06k14o0K57J183N78rj206q01j08R89J034P60P83J50
2046A336N5j570j792o14L28J021J157n2O56r7n68j288o72l53J213J862L30J21
2064A073j13o09p76j205n27J021J513R57K68m60n90m96p27m25M47Q39J391M18
$$ plain form
2082 1999 999 295 -644 -1085 -849 -459 738 2069 2850 2532 784 -261 -490 -1157 -529 2 862 2038
2100 2038 2731 2000 601 -276 -560 -49 238 467 786 1064 370 -564 -1175 -1310 93 1412 2844 2995
2118 2995 2580 2078 759 -1118 -2223 -2302 -1368 -76 200 617 669 341 -87 -365 -661 425 946 1268 666
2137 666 -706 -1221 -1663 -2089 -1959 -811 425 1586 1455 771 -457 -1058 -1739 -1842 -1841 -1037 87 409 5
2156 5 -818 -1616 -1656 -1119 -641 223 723 1351 1205 -515 -1398 -1877 -1670 -1084 -363 104 359 472 -367 -1056 -1739
2177 -1739 -1228 56 810 1104 1278 1378 507 -191 -1073 -1517 -835 360 1082 1264 961 867 601 -256 -612
2196 -612 -587 555 1488 1480 839 500 44 -421 -295 -126 639 1793 2013 1967 607 -449 -669 -569 -28 146
2216 146 782 1913 1603 654 -285 -878 -814 -724 -80 504 1302 1618 1397 532 -683 -173 235 556 828 830 526
$$ packed form
2082A999j000p04r39m41K36L90J197J331P81l18j748j045k29o67O28N31Q60J176
2100B038O93p31j399q77k84N11K87K29L19K78o94r34o11j35J403J319J432J51
2118B995m15n02j319j877j105p9R34J292K76M17N2l28m28k78k96J086N21L22o02
2137F66j372n15m42m26J30J148J236J161j31o84j228o01o81j03JQ04J124L22m04
2156Eq23p98m0N37M78Q64N00O28j46j720q83m79K07N86P21M67K55J13q39o89o83
2177a739N11J284P54K94J74J00q71o98q82m44O82J195P22J82l03r4k66q57l56
2196f12K5J142R33qo41l39m56m65J26J69P65J154K20m6j360j056k20J00N41J74
2216A46O36J131l10r49r39n93O4R0O44N84P98L16k21q65j215N10M08L21K72Kl04
$$ plain form
2237 526 -68 -1042 -1896 -2099 -1090 88 869 1357 1322 923 649 -658 -1238 -1344 -820 -221 -229 -107 -401 -447
2257 -447 -913 -1216 -1209 -815 132 801 491 -445 -633 -1480 -1749 -1694 -1509 -214 509 941 336 -571 -807 -975 -519
2278 -519 -32 232 749 1081 423 -972 -1338 -1728 -1835 -1363 -785 74 678 973 757 278 -1 760 758 1053
2298 1053 893 256 76 -445 -1636 -1829 -1681 -511 803 1997 2160 2350 1775 900 112 -846 -858 -560 -122
2317 -122 296 -129 66 539 610 751 1291 1988 2677 2463 1192 25 -730 -1625 -2000 -2101 -1052 103 1374
2336 1374 1541 1473 882 967 1226 842 667 518 881 555 -481 -1438 -2037 -1879 -1311 -523 293 883 1459 1433
2356 1433 382 -223 -386 24 -113 227 -206 -319 -851 -1277 -1882 -2370 -1605 -144 668 1149 1223 1307 859 141
2376 141 -1248 -1463 -1243 -1206 -1397 -1364 -1739 -1435 -874 -576 -27 891 2073 2142 2041 940 -153 -1125 -2259
$$ packed form
2237E26n94r74q54k03J009J178P81M88l5l99k74j307n80j06N24N99qJ22k94m6
2257d47m66l03PL94R47O69l10r36j88q47k69N5J85J295P23M32o05r07k36j68M56
2278e19M87K64N17L32o58j395l66l90j07M72N78Q59O04K95k16m79k79P61kK95
2298A053j60o37j80n21j191j93J48J170J314J194J63J90n75q75p88r58j2K98M38
2317a22M18m25J95M73P1J41N40O97O89k14j271j167p55q95l75j01J049J155J271
2336A374J67o8n91Q5K59l84j75j49L63l26j036r57n99J58N68P88Q16N90N76k6
2356A433j051o05j63M10j37L40m33j13n32m26o05m88P65J461Q12M81P4Q4m48p18
2376A41j389k15K20L7j91L3l75L04N61K98N49R18J182O9j01j101j093r72j134
$$ plain form
2395 -2259 -2496 -2346 -1928 -771 262 468 214 366 606 888 1171 1225 1382 1294 314 -698 -1732 -1902 -1503
2414 -1503 -899 -296 485 938 1503 1228 485 35 52 493 766 498 160 393 12 -83 -992 -743 155 1199
2434 1199 1679 1852 1688 1147 702 -282 -350 -430 -263 419 188 -193 -246 -402 -207 -365 185 1055 1645 1831 1725
2455 1725 956 -209 -618 -882 -1182 -991 -464 -64 104 94 -297 -366 27 229 443 826 774 596 -117 -915
2475 -915 -1674 -1831 -1219 -772 -28 159 734 769 451 -504 -649 -327 -256 -246 -581 -694 -625 -1047 -1550 -1216 -901
2496 -901 158 818 1378 1143 957 741 -180 -975 -1225 -1256 -775 -291 -494 -748 -618 -210 -294 73 127 756 1424
2517 1424 1155 742 -179 -518 -970 -605 -450 122 688 1014 510 32 -210 210 -89 212 621 668 1006 676
2537 676 200 -404 -638 -588 -72 234 814 946 1181 1059 496 -26 107 290 651 381 160 15 -83 -501 -853
$$ packed form
2395b259k37J50M18J157J033K06k54J52K40K82K83N4J57q8r80j012j034j70L99
2414a503O04O03P81M53N65k75p43m50J7M41K73k68l38K33l81r5r09K49Q98J044
2434A199M80J73j64n41m45r84o8q0J67O82k31l81n3j56J95j58N50Q70N90J86j06
2455A725p69j165m09k64l00J91N27M00J68j0l91o9L93K02K14L83n2j78p13p98
2475i15p59j57O12M47P44J87N75L5l18r55j45L22P1J0l35j13O9m22n03L34L15
2496i01J059O60N60k35j86k16r21p95k50l1M81M84k03k54J30M08q4L67N4O29O68
2517A424k69m13r21l39m52L65J55N72N66L26n04m78k42M20k99L01M09M7L38l30
2537F76m76o04k34N0N16L06N80J32K35j22n63n22J33J83L61k70k21j45r8m18l52
$$ plain form
2558 -853 -691 -478 183 974 965 1148 915 596 60 -185 -373 -208 312 254 -159 -570 -378 -500 -512 -285 -120
2579 -120 636 1176 718 83 -509 -686 -656 -464 -770 -377 124 270 -305 -810 -923 -660 -301 -345 152 372 255
2600 255 -101 -710 -1073 -1308 -747 -413 -261 -125 344 307 -20 -275 -874 -472 422 161 438 208 -325 -228 -608
2621 -608 -1318 -868 -331 242 585 434 376 478 290 -16 -108 243 451 700 609 186 -271 -387 -554 -690 -293
2642 -293 211 834 804 917 -120 -59 82 -57 -122 427 490 638 614 339 -113 -131 263 360 717 550 725 721 429
2665 429 -231 -577 -506 -105 -135 -28 32 263 321 157 -327 150 153 435 574 465 91 96 -188 -750 -749 -805 -10 88
2689 88 299 -23 -170 -178 -294 -196 -141 -47 236 601 215 -143 -622 -280 -681 -775 -685 -185 126 222 -68 -405 -560
2712 -560 -598 -462 -525 -354 60 434 -113 -643 -644 -535 41 -172 -48 305 291 347 -100 -849 -702 -624 -343 -153
$$ packed form
2558h53J62K13O61P91rJ83k33l19n36k45j88J65N20n8m13m11J92j22j2K27J65
2579a20P56N40m58o35n92j77L0J92l06L93N01J46n75n05j13K63L59m4M97K20j17
2600B55l56o09l63k35N61L34J52J36M69l7l27k55n99M02Q94k61K77k30n33R7l80
2621f08p10M50N37N73L43j51n8J02j88l06r2L51K08K49r1m23m57j16j67j36L97
2642b93N04O23l0J13j037O1J41j39o5N49O3J48k4k75m52j8L94R7L57j67J75mk92
2665D29o60l46P1M01l0J07O0K31N8j64m84M77LK82J39j09l74Nk84n62Jn6P95R8
2689H8K11l22j47qj16R8N5R4K83L65l86l58m79L42m01r4R0N00L11R6k90l37j55
2712e60l8J36o3J71M14L74n47n30jJ09N76k13J24L53j4N6m47p49J47P8K81J90
$$ plain form
2734 -153 -134 42 119 -200 -264 -385 -134 291 789 872 424 589 207 -51 -251 -343 -278 365 413 268 148 90 171
2757 171 -7 -149 99 308 779 210 18 -17 90 75 83 323 246 731 744 419 98 -281 -247 -59 -105 -178 275
2780 275 703 524 43 -242 -211 -87 147 164 258 318 482 485 -346 -523 -220 -45 -195 -145 157 72 -126 -144 -461
2803 -461 -491 -246 -78 122 -16 -95 -99 43 -70 -479 -478 -96 135 384 7 15 -559 -312 -423 -626 -216 -338 209
2826 209 30 -204 -589 -348 -326 88 -236 283 490 310 75 -335 -628 -291 -232 -72 149 258 302 453 -105
2847 -105 -488 -197 -350 -286 52 43 45 105 69 4 -262 -5 499 596 602 552 434 -32 -71 -284 -405 -170 -243 102 133
2872 133 437 318 335 382 257 153 524 684 642 361 174 -59 -306 32 -135 -93 537 145 490 135 -215
2893 -215 -37 103 478 223 74 137 505 -291 -292 -372 120 221 203 135 163 285 334 48 -714 -239 -362 -199 -258
$$ packed form
2734a53J9J76P7l19o4j21K51M25M98Q3m48J65l82k58k00r2O5O43M8j45j20n8Q1
2757A71j78j42K48K09M71n69j92l5J07j5QK40p7M85J3l25l21l79L4J88m6p3M53
2780B75M28j79m81k85L1J24K34J7R4O0J64Lq31j77L03J75j50N0L02q5j98j8l17
2803d61l0K45J68K00j38p9mJ42j13m09JL82K31K49l77Qn74K47j11k03M10j22N47
2826B09j79k34l85K41K2M14l24N19K07j80k35m10k93L37N9J60K21J09M4J51n58
2847a05l83K91j53O4L38rKO0l6o5k66K57N04R7On0j18m66l9k13j21K35p3L45L1
2872A33L04j19J7M7j25j04L71J60m2k81j87k33k47L38j67M2O30l92L45l55l50
2893b15J78J40L75k55j49O3L68p96jq0M92J01j8o8K8J22M9k86p62M75j23J63n9
$$ plain form
2916 -258 -290 -34 -127 -550 -453 -388 442 324 743 526 122 234 -287 -578 -839 -861 -437 -77 -364 -179 -100 -210
2938 -210 -9 -107 284 253 408 74 31 -140 -371 -784 -645 -579 -145 215 309 449 572 -40 -289 83 -154 -78
2960 -78 -226 138 -100 -340 -265 -222 27 62 280 273 731 960 650 184 -174 -300 -253 -224 -169 -82 -211 227 200 45
2984 45 -57 93 267 474 580 501 452 534 97 -120 -432 -126 157 33 -9 -71 187 380 274 -30 -81 196
3006 196 296 72 -2 -338 -414 -96 -215 31 -202 455 549 18 45 265 2 -136 -190 -341 -158 -431 -169 -461
3028 -461 -524 -617 -64 -38 162 262 206 558 474 102 -506 -190 -24 -92 -349 -220 -209 -228 -177 -287 -495 -79 -8
3051 -8 51 111 -52 182 -79 -354 -493 -180 -90 203 191 158 -283 82 -198 25 -33 -339 54 101 -144 -175 -538
3074 -538 -244 -69 -1 55 222 440 407 371 -90 -109 151 239 -114 -3 -52 132 166 -127 -248 134 11 -206 149
$$ packed form
2916b58l2K56r3m23R7O5Q30j18M19k17m04J12n21k91k61k2M24L60k87J85P9j10
2938b10K01r8L91l1J55l34m3j71k31m13J39O6M34L60R4J40J23o12k49L72k37P6
2960g8j48L64k38k40P5M3K49L5K18pM58K29l10m66l58j26M7K9N5Q7j29M38k7j55
2984D5j02J50J74K07J06p9m9Q2m37k17l12L06K83j24m2o2K58J93j06l04n1K77
3006A96J00k24p4l36p6L18j19K46k33O57R4n31K7K20k63j38n4j51J83k73K62k92
3028d61o3r3N53K6K00J00n6L52q4l72o08L16J66o8k57J29J1j9N1j10k08M16P1
3051hN9O0j63K34k61k75j39L13R0K93j2l3m41L65k80K23n8l06L93M7k45l1l63
3074e38K94J75O8N6J67K18l3l6m61j9K60Q8l53J11m9J84L4k93j21L82j23k17L55
$$ plain form
3097 149 140 147 481 247 76 196 -47 -2 -1 -7 126 219 -56 -121 -159 10 103 382 -2 353 -84 -11 162 14 -114
3122 -114 -44 -212 360 240 -213 13 -5 61 -131 5 183 114 -53 -172 -181 -421 -443 -110 -137 -469 -138 150 28
3145 28 -19 56 140 16 82 182 -51 -134 337 -360 -499 -771 23 139 -11 -242 59 -5 42 66 -311 -137 45
3168 45 70 91 47 112 -194 -106 -243 -259 -155 166 121 -153 -2 -304 -65 119 -144 -335 -11 -113 2 86 35
3191 35 264 229 123 74 17 235 547 176 -8 106 23 145 -78 -322 -60 92 27 195 -39 -17 162 277
3213 277 479 271 170 230 101 -109 -196 -8 -291 229 -72 159 240 187 184 -143 -63 46 30 -158 -48 125 -129
3236 -129 222 36 -133 245 115 553 434 -68 -108 -324 -262 -507 -515 -479 -344 38 -114 -167 -384 61 7 -77 -131
3259 -131 93 -54 -16 -149 -135 -58 -307 -216 -377 -386 -287 -26 41 -113 -199 -224 61 166 275 5 -1 194 -82 -15
$$ packed form
3097A49rPL34k34j71J20k43M5JoJ33R3k75o5l8J69R3K79l84L55m37P3J73j48j28
3122a14P0j68N72j20m53K26j8O6j92J36J78o9j67j19rk40k2L33k7l32L31K88j22
3145B8m7P5Q4j24O6J00k33q3M71o97j39k72P94J16j50k31L01o4M7K4l77J74J82
3168D5K5K1m4O5l06Q8j37j6J04L21m5k74J51l02K39J84k63j91L24j02J15Q4n1
3191C5K29l5j06m9n7K18L12l71j84J14q3J22k23k44K62J52o5J68k34K2J79J15
3213B77K02k08j01O0j29k10q7J88k83N20l01K31Q1n3ll27Q0J09j6j88J10J73k54
3236a29L51j86j69L78j30M38j19n02m0k16O2k45qL6J35L82j52n3k17M45n4q4n4
3259a31K24j47L8j33J4P7k49R1j61rR9K61O7j54q6k5K85J05J09k70oJ95k76O7
$$ plain form
3283 -15 -227 -102 -74 63 -210 -66 -13 58 293 -140 -390 -8 97 48 -67 -469 178 -84 97 -20 13 170
3305 170 370 380 167 -10 -91 250 46 -137 -124 -227 111 182 10 28 276 189 -130 -74 -105 136 166 53 97
3328 97 32 99 335 160 293 103 357 -56 94 -351 -211 -90 -294 -10 23 111 50 252 28 -187 194 43
3350 43 130 297 103 -159 -105 -73 -74 -200 152 222 65 -103 -134 101 -291 -373 -120 -442 222 251 158 -232 -17 295
3374 295 376 -132 -100 -246 104 -117 -579 -375 -24 -250 -466 -150 -56 139 -27 47 -4 -35 -2 6 -153 -302 -10
3397 -10 -62 273 77 -347 196 -196 308 167 -14 132 144 -42 58 -374 -51 92 159 -59 -32 267 207 139
3419 139 112 -89 -151 475 131 53 117 236 27 18 -159 -239 11 144 -81 -133 258 83 68 303 52 299 482
3442 482 261 386 120 -70 -279 -16 -236 29 -18 117 -78 126 -246 -83 238 125 155 -33 -30 54 -30 -63
$$ packed form
3283a5k12J25K8J37k73J44N3P1K35m33k50L82J05m9j15m02O47k62J81j17L3J57
3305A70K00J0k13j77q1L41k04j83J3j03L38P1j72J8K48q7l19N6l1K41L0j13M4
3328I7o5O7K36j75J33j90K54m13J50m45J40J21k04K84L3Q8o1K02k24k15L81j51
3350D3Q7J67j94k62N4L2jj26L52P0j57j68l1K35l92q2K53l22O64K9r3l90K15L12
3374B95Q1n08L2j46L50k21m62K04L51k26k16L16R4J95j66P4n1l1L3Qj59j49K92
3397a0n2L35j96m24N43l92N04j41j81J46J2j86J00m32L23J43O7k18K7K99o0o8
3419A39k7k01o2O26l44p8O4J19k09rj77q0K50J33k25n2L91j75j5K35k51K47J83
3442D82k21J25k66j90k09K63k20K65m7J35j95K04l72J63L21j13L0j88LQ4q4l3
$$ plain form
3464 -63 -97 -177 -151 73 310 -392 6 -18 -57 121 -52 -5 -164 -73 112 -311 99 90 -190 -291 -6 17 142 275
3488 275 -304 -281 68 7 -151 -203 5 103 -120 -336 -283 -36 -146 -267 237 -147 128 157 29 113 30 71 30
3511 30 -14 111 -341 45 122 107 -167 -148 -119 -167 -68 -364 -19 -19 251 186 147 -172 127 -31 44 198 0 170
3535 170 35 62 17 105 67 24 12 -96 -26 236 153 96 -112 -17 205 129 21 234 -169 204 113 -81 -204 -2
3559 -2 157 50 -40 -9 14 -56 -47 -383 -139 171 -251 9 -254 179 43 114 -221 28 -92 39 109 -105 -411
3582 -411 -302 84 -293 -36 -125 4 -112 -85 -7 127 20 76 76 50 -113 133 100 186 71 -21 -169 -144 -275 37
3606 37 -408 -307 -37 -52 202 -93 -34 74 119 288 -152 32 452 2 69 213 -63 -117 190 -291 -264 -95
3628 -95 -89 31 119 -7 214 447 -232 42 70 -183 300 -192 203 -290 451 178 228 73 -6 -19 110 -56 -18
$$ packed form
3464f3l4q0K6K24K37p02L98k4l9J78j73M7j59R1J85m23M10rk80j01K85K3J25J33
3488B75n79K3L49o1j58n2K08R8k23k16N3K47j10j21N04l84K75K9j28Q4q3M1m1
3511C0m4J25m52L86P7j5k74J9K9m8R9k96L45%K70o5l9l19K99j58P5J54j98J70
3535A70j35K7m5Q8l8m3j2j08P0K62q3n7k08R5K22p6j08K13m03L73r1j94j23K02
3559bJ59j07r0L1K3p0Rl36K44L10m22K60k63M33j36P1l35K49j20J31P0k14l06
3582d11J09L86l77K57q9J29j16K7P8J34j07N6%k6j63K46l3Q6j15r2j48K5j31L12
3606C7m45J01K70j5K54k95N9J08M5J69m40J84M20m50O7J44k76n4L07m81K7J69
3628i5OJ20Q8j26K21K33o79K74K8k53M83m92L95m93P41k73N0j55p9j3J29j66L8
$$ plain form
3651 -18 -275 -164 85 -197 -103 -4 200 -54 -87 73 -95 214 46 -19 -16 -171 148 192 26 295 -130 -126 139
3674 139 -185 69 -290 69 -120 101 -117 -181 -150 -97 -82 334 392 135 290 -104 -166 6 26 -210 -122 -66 -276
3697 -276 29 -193 -205 -148 -192 -313 -180 79 -231 104 6 193 -42 55 103 148 32 -137 33 -4 -6 120 -345
3720 -345 -94 -30 -224 2 -105 40 -143 181 60 -274 -49 -208 -40 -53 15 127 -151 222 -45 -92 74
3741 74 158 -1 -191 -108 -167 -280 -2 87 216 555 99 6 -8 -155 110 98 61 -230 29 136 -187 -131 -212 -271
3765 -271 38 347 -199 172 91 17 94 -67 -29 -268 -24 0 -112 -170 40 -14 151 20 -9 15 7 -41 -207 -27
3789 -27 72 -311 -85 38 -81 -334 488 -60 61 33 97 26 -55 300 -150 -169 40 -35 -220 -115 -63 -130 -443
3812 -443 -22 -156 -53 -91 89 -105 5 -200 265 -111 -119 -61 191 -50 -327 -153 -230 -98 -3 61 -172 132
$$ packed form
3651a8k57J11K49k82R4R9K04k54l3J60j68L09j68o5Lj55L19M4j66K69m25MK65
3674A39l24K54l59L59j89K21k18o4L1N3J5M16N8k57J55l94o2J72K0k36Q8N6k10
3697b76L05k22j2N7m4j21J33K59l10L35r8J87k35R7M8M5j16j69J70l7kJ26m65
3720c45K51O4j94K26j07J45j83L24j21l34K25j59J68j3O8J12k78L73k67m7J66
3741G4Q4j59j90Q3n9j13K78Q9J29L39m56r3j4j47K65j2l7k91K59J07l23N6q1n9
3765b71L09L09n46L71q1p4P7j61L8k39K44K4j12n8K10n4J65j31k9K4qm8j66J80
3789b7R9l83K26J23j19k53Q22n48J21k8O4p1q1L55m50j9K09p5j85J05N2o7l13
3812d43M21j34J03l8J80j94J10k05M65l76qN8K52k41k77J74p7J32R5O4k33L04
$$ plain form
3834 132 132 -46 66 -101 155 237 -32 -28 -49 230 222 29 -163 -236 168 148 82 -210 86 -103 45 102 176 -53
3858 -53 3 -155 -21 -182 -115 73 -255 101 12 73 201 5 30 263 -101 155 88 -236 -60 -206 39 -47 65
3881 65 -154 230 237 177 85 234 109 30 159 -89 288 225 42 9 -443 -66 -256 -24 -101 -124 -132 -127 -8 -279 128
3906 128 -52 118 35 -186 93 79 25 -39 -175 -47 -186 -114 -46 48 2 199 264 60 -60 208 -177 27 286
3929 286 -37 8 23 129 66 -290 -60 -190 32 75 -130 20 169 177 -196 -140 -97 -206 165 -179 -137 -231 -32
3952 -32 24 -149 -185 78 208 132 53 71 156 150 123 -382 -91 243 -27 315 73 -164 -305 100 255 316 52 124
3976 124 40 274 8 34 56 -72 42 -217 16 -72 252 307 -88 208 -138 160 393 -142 83 314 118 12
3998 12 -54 311 88 -16 56 113 321 -141 243 91 -113 -71 -10 114 21 -104 -31 -307 25 85 -33 83 -37
$$ packed form
3834A32%j78J12j67K56Q2k69Mk1K79qj93j92p3M04k0o6k92K96j89J48N7P4k29
3858e3N6j58J34j61O7J88l28L56q9O1J28j96K5K33l64K56o7l24J76j46K45q6J12
3881F5k19L84Po0r2J49j25p9J29k48L77o3j83l3m52L77j90K32p7k3qNJ19k71M07
3906A28j80J70q3k21K79j4n4o4j36J28j39P2O8R4m6J97O5k04j20K68l85K04K59
3929B86l23M5J5J06o3l56K30j30K22M3k05J50J49Ql73N6M3j09L71l44M2r4J99
3952c2N6j73l6K63J30p6p9J8Q5ok7n05K91L34k70L42k42k37j41M05J55O1k64P2
3976A24q4K34k66K6K2j28J14k59K33q8L24N5l95K96l46K98K33n35K25K31j96j06
3998A2o6L65k23j04P2N7K08m62L84j52k04M2O1J24r3j25P3k76L32O0j18J16j20
$$ plain form
4021 -37 17 -40 43 35 56 -135 -40 181 -86 103 4 -230 -273 96 -306 -48 -121 -134 -264 306 103 47 -333 51
4045 51 183 -163 -35 -27 -20 -108 -37 -14 27 283 192 -126 117 126 117 18 18 -18 105 -125 96 168 -266 -5 -152 -97 -77
4072 -77 -122 -260 83 188 -43 -214 -241 -331 52 16 -220 138 -188 -125 -16 -34 60 104 185 28 -166 67 98 -24
4096 -24 32 113 284 -218 -232 -76 -120 163 -42 149 -43 41 -147 12 164 397 446 47 232 -258 80 -172
4118 -172 55 -406 -176 15 -84 -123 118 -53 -426 1 28 81 140 -68 -64 141 51 96 98 -25 183 -227 -28 -127
4142 -127 98 -165 133 -30 -200 70 -60 -93 -206 -310 -264 23 89 20 94 -25 141 -9 -34 20 -92 -187 -148
4165 -148 -63 -1 5 -156 -188 -108 182 20 -43 -37 -167 -62 -88 -76 179 -61 50 83 119 189 -128 -143 -30 176 -16
4190 -16 7 -176 -190 53 -359 -232 -18 -64 155 143 69 184 -315 -237 73 -119 6 13 -193 -354 -12 231 227 254
$$ packed form
4021c7N4n7Q3qK1j91R5K21k67J89r9k34m3L69m02K58p3j3j30N70k03n6l80L84
4045E1J32l46J28QPq8P1K3M1K56r1l18K43Rrr9%l6J23k30K21P2m34K61j47N5K0
4072g7m5j38L43J05k31j71k7r0L83l6k36L58l26O3J09j8R4M4Q1j57j94K33L1j22
4096b4N6Q1J71n02j4J56m4K83k05J91j92Q4j88J59J52K33M9l99J85m90L38k52
4118a72K27m61K30J91r9l9K41j71l73M27K7N3N9k08MK05r0M5Kj23K08m10J99r9
4142a27K25k63K98j63j70K70j30l3j13j04M6K87O6o9P4j19J66j50k5N4j12r5L9
4165a48Q5O2Oj61l2Q0K90j62o3Oj30J05k6J2K55k40J11L3L6P0l17j5J13K06j92
4190a6K3j83j4K43m12J27K14m6K19j2p4J15m99P8L10j92J25Pk06j61L42K43mK7
$$ plain form
4214 254 112 96 289 45 162 -33 317 60 -69 107 -137 78 158 210 18 11 88 281 40 201 -221 51
4236 51 148 323 -308 -11 -190 -93 -225 102 186 131 118 11 113 43 108 177 -95 -66 -25 -68 54 -15 -117 -480
4260 -480 -58 269 177 56 77 156 15 175 80 -113 -49 87 -99 -112 30 39 -322 266 -269 130 -26 41 -84
4283 -84 334 304 374 181 131 -57 -187 -114 -67 123 -126 -6 -85 78 103 198 -105 454 266 130 30 180 40
4306 40 -108 -10 54 -253 28 49 128 -68 197 278 6 41 365 -13 -9 -95 -30 -177 -89 49 -119 -196 54 -27 -230
4331 -230 -83 175 -56 161 92 -221 -295 197 232 -68 -117 -173 50 -33 -66 -157 -91 212 -205 -122 81 37 -114 104
4355 104 -2 -217 -48 19 60 -247 -113 -197 -196 -2 95 -115 91 -222 34 -73 149 1 155 -90 29 197
4377 197 161 -1 3 297 -157 145 148 -72 250 31 92 -36 30 -236 -11 9 -357 -17 -113 -243 102 -171 -48
$$ packed form
4214B54j42j6J93k44J17j95L50k57j29J76k44K15Q0N2j92pP7J93k41J61m22K72
4236E1R7J75o31K97j79R7j32L27Q4n5j3j07J02p0O5O9k72K9M1m3J22o9j02l63
4260d80M22L27r2j21K1P9j41J60r5j93O4J36j86j3J42Rl61N88n35L99j56O7j25
4283h4M18l0P0j93n0j88j30P3M7J90k49J20p9J63K5R5l03N59j88j36j00J50j40
4306D0j48R8O4l07K81K1P9j96K65Q1k72L5L24l78Mq6O5j47Q8J38j68p7K50q1k03
4331b30J47K58k31K17o9l13p4M92L5l00m9n6K23q3l3r1O6L03m17Q3K03m4j51K18
4355A04j06k15J69O7M1l07J34q4JJ94R7k10K06l13K56j07K22j48J54k45J19J68
4377A97l6j62MK94m54L02Lk20L22k19O1j28O6k66K25K0l66L40r6j30L45k73J23
$$ plain form
4400 -48 -29 17 84 -42 -89 12 149 304 56 -138 -359 -175 -223 -20 -156 133 133 -54 74 0 215 83 -39
4423 -39 -317 135 135 -28 22 52 -148 158 26 -164 188 -42 125 -219 -63 3 38 220 229 6 -69 -13 100 -284
4447 -284 -23 29 -89 289 312 113 -119 -39 49 -185 197 48 121 -57 -112 -273 84 116 -91 18 -473 147
4469 147 -114 -143 9 -34 65 -118 -299 -215 -22 4 57 -324 63 -65 -171 113 280 -373 45 -60 218 162
4491 162 3 80 -134 159 127 -108 -270 -334 -117 -270 155 204 -84 -344 222 -185 -70 -400 24 -7 210 271
4513 271 -240 74 120 497 -275 26 140 -12 -111 -349 -200 -182 -162 94 98 -58 -6 -210 -103 95 -83 1 0
4536 0 -161 74 351 69 54 -44 -144 -30 -101 -40 437 139 -14 91 120 121 130 206 -37 103 -297 -8 153 179
4560 179 -243 172 143 -138 -35 -138 -109 -12 136 -38 -221 -193 13 58 142 -184 10 -156 223 103 -2 52
$$ packed form
4400d8J9M6O7j26m7J01J37J55k48j94k21J84m8K03j36K89%j87J28p4K15j32j22
4423c9k78M52%j63N0L0k00L06j32j90L52k30J67l44J56O6L5J82Rk23p5N6J13l84
4447b84K61N2j18L78K3j99k32Q0Q8k34L82j49P3j78n5j61L57L2k07J09m91O20
4469A47k61k9J52m3R9j83j81Q4J93K6N3l81L87j28j06K84J67o53M18j05K78n6
4491A62j59P7k14K93l2k35j62o4K17j53M25M9k88k60N66m07J15l30M24l1K17O1
4513B71n11L14M6L77p72L01J14j52r9k38J49J8K0K56Mj56N2k04J07J98j78Q4j
4536@j61K35K77k82j5r8j00J14p1O1M77k98j53J05K9JRP6k43J40m00K89J61K6
4560A79m22M15k9k81J03j03K9R7J48j74j83K8K06M5Q4l26J94j66L79j20j05N4
$$ plain form
4582 52 28 -116 -99 -223 1 -60 195 -36 -74 -295 179 -54 205 214 75 29 207 -19 -88 -248 71 -260 166
4605 166 -62 297 218 13 -176 116 120 -2 112 -47 -288 -59 45 111 45 89 -202 -169 92 135 123 12 303
4628 303 163 185 -202 109 139 -159 217 -285 29 76 -189 78 -23 16 -140 -87 -32 45 185 -9 6 5 -145
4651 -145 -178 -113 -257 -83 -166 202 -3 99 -24 92 273 86 -39 46 -161 -117 184 -211 32 -298 143 -130
4673 -130 -53 -29 134 294 -134 56 -68 63 203 -81 -256 -36 108 23 -63 -305 -99 355 41 153 -99
4694 -99 -1 -149 79 7 10 278 -132 95 71 -374 100 197 64 94 -46 -55 124 205 -100 -21 16 199 119 3 -54
4719 -54 -76 -124 153 -190 43 -140 20 -128 -215 -8 -272 55 85 -30 23 108 13 79 143 -203 -135 -13 -171 -120
4743 -120 193 -78 -86 91 183 27 157 -74 -177 29 194 1 58 -92 -51 -266 127 168 111 12 88 34 84 123
$$ packed form
4582E2k4j44J7j24K24o1K55k31l8k21M74k33K59Rj39m6J78k26o9j60L19l31M26
4605A66k28L59p9k05j89K92Mj22J14j59k41K29J04O6o6M4k91L3K61M3j2j11K91
4628C03j40K2l87L11L0k98L76n02L14M7k65K67j01L9j56N3N5P7J40j94J5jj50
4651a45l3O5j44J74q3L68k05J02j23J16J81j87j25Q5k07M4L01l95K43l30M41k73
4673a30P7K4J63J60m28J90j24J31J40k84j75K20J44q5q6k42K06M54l14J12k52
4694i9R8j48K28p2LK68m10K27k4m45M74R7j33L0j40rJ79Q1l05P9L7J83q0j16n7
4719e4k2m8K77l43K33j83J60j48q7K07k64L27L0j15N3Q5r5O6O4l46O8J22j58N1
4743a20L13k71qJ77R2j56J30k31j03K06J65j93N7j50M1k15L93M1n7r9P6n4N0L9
$$ plain form
4767 123 312 -19 -85 68 -191 -6 -130 -250 -130 -158 168 1 -102 23 164 12 43 -44 96 -190 15
4788 15 -21 175 -14 -285 -26 -60 45 -36 171 -92 198 3 -164 198 5 157 -21 -108 114 -12 -138 -55
4810 -55 -311 89 -70 -12 204 -119 -28 2 22 -116 -134 -32 33 -359 52 108 -28 102 -23 31 -29 94 177 -49
4834 -49 91 -207 56 37 3 -241 -183 -55 71 24 -46 266 55 31 -61 191 -21 -167 228 374 -9 -9 240
4857 240 -87 -262 -72 44 -81 -132 44 43 101 2 -261 109 -319 -61 -68 -242 -114 31 141 -203 49 322
4879 322 -75 67 -142 -76 80 -113 219 127 -48 34 77 -304 -227 -120 169 -116 -334 117 52 -17 53 -141 9
4902 9 99 -281 -72 -89 -44 -1 -47 25 201 49 221 -133 -142 25 -13 -147 -63 12 -247 8 122 136 -89 43 77
4927 77 -13 204 -150 -105 -19 -85 -162 103 -123 215 14 149 -113 -45 152 184 52 -17 167 -53 -96 10 54 -77
$$ packed form
4767A23J89l31o6J53k59J85j24j20J20k8L26j67j03J25J41j52L1q7J40k86K05
4788A5l6J96j89k71K59l4J05q1K07k63K90j95j67L62j93J52j78q7K22j26j26Q3
4810e5k56M00j59N8K16l23R1L0K0j38j8J02O5l92M11N6j36J30j25N4o0J23Q3k26
4834d9J40k98K63j9l4k44N8J28J26m7p0L12k11k4r2K52k12j46L95J46l83%K49
4857B40l27j75J90J16j25n1J76jN8r9k63L70m28K58pj74J28J45J10l44K52K73
4879C22l97J42k09O6J56j93L32r2j75Q2M3l81P7J07K89k85k18M51o5o9P0j94J50
4902IR0l80K09j7M5M3m6P2J76j52J72l54rJ67l8j34Q4P5k59K55J14J4k25J32L4
4927G7r0K17l54M5Q6o6p7K65k26L38k01J35k62O8J97L2j32o9J84k20m3J06M4j31
$$ plain form
4951 -77 24 39 77 -56 103 109 185 254 234 246 118 104 -49 -361 -64 -53 -49 128 19 -90 89 -61 -101 101 -39
4976 -39 359 89 -148 132 323 -243 -154 32 -181 17 263 -40 -49 -5 56 -87 162 150 -189 6 -175 99
4998 99 99 32 -326 171 -122 -315 -31 -69 -49 -9 207 64 307 266 3 -119 -36 -23 -251 -94 -288 -27 74
5021 74 -59 281 96 -6 242 6 -184 251 -16 22 -345 153 37 211 60 94 21 -130 18 -207 202
5042 202 -136 -111 -160 -112 38 -68 67 -69 59 -89 -114 335 181 -160 51 -250 65 25 -229 58 -51 125
5064 125 -124 -55 55 14 -177 85 -60 -361 167 122 222 67 -100 50 -206 216 -9 28 21 343 114 208
5086 208 -19 66 454 67 9 63 113 -225 -242 -35 -23 71 100 -354 116 193 -135 127 274 115 200 27 -112
5109 -112 234 153 171 -223 -133 -124 -33 -61 -66 -174 -52 -94 268 -188 -133 -33 -16 -115 -9 -63 -91 -321 -240 249 126
$$ packed form
4951g7J01J5L8j33J59OP6O9k0J2j28j4j53l12K97J1MJ77j09j09J79j50m0K02j40
4976c9L98k70k37K80J91n66Q9J86k13J98K46l03rM4O1j43K49j2l39J95j81K74
4998I9%o7l58M97k93j93K84l8K0M0K16j43K43m1k63j22Q3J3k28J57j94K61J01
5021G4j33L40j85j02K48k36j90M35k67L8l67M98j16J74j51L4p3j51J48k25M09
5042B02l38K5m9M8J50j06J35j36J28j48k5M49j54l41K11l01L15m0k54K87j09J76
5064A25k49O9J10m1j91K62j45l01N28m5J00j55j67J50k56M22k25L7pL22k29R4
5086B08k27Q5L88l87n8N4N0l38j7K07J2R4K9m54M70P7l28K62J47j59Q5j73j39
5109a12L46q1J8l94R0RR1k8nj08J22m2L62m56N5J00J7r9J06n4k8k30Q1M89j23
$$ plain form
5134 126 42 108 34 31 68 38 -24 33 -15 -24 -111 86 69 53 28 -228 -184 18 15 -101 -88 -325 -148 211 -140 167 -255
5161 -255 212 5 149 194 -106 214 -77 86 -138 -57 -190 27 156 56 -13 -80 -128 42 -30 171 -59 83
5183 83 -134 142 -86 229 -163 9 116 76 -374 -290 113 -103 -137 -134 62 100 -35 -460 14 -15 178 9 -297
5206 -297 187 -92 12 254 212 71 47 52 -44 106 18 -196 -123 98 -422 -316 87 -39 -149 -92 56 82 120
5229 120 85 -82 93 193 67 237 -58 63 -3 -14 -98 -66 39 -119 -122 -32 66 0 101 -21 98 -160 312
5252 312 3 -259 -33 -126 -121 -63 86 -144 55 3 -132 -285 321 -16 -6 8 -80 -72 70 -9 -184 47 155 -12
5276 -12 17 -248 -60 -89 146 258 12 230 -48 97 208 -199 246 29 -59 82 148 -15 -201 -122 -52 84
5298 84 -119 167 -114 -51 106 151 193 55 22 113 179 117 287 91 -48 -114 176 93 107 -159 308 -51 -138 109
$$ packed form
5134A26q4O6p4lL7l0o2N7m8rq7J97j7j6k5k56M4K02lj16J3k37J77L59l51L07m22
5161b55M67k07J44M5l00L20k91J63k24Q1j33K17J29j00o9o7m8J70p2K01k30J42
5183H3k17K76k28L15l92J72J07m0m50Q4M03k16l4LJ96L8j35m25M74k9J93j69l06
5206b97M84k79J04K42m2j41k4Nr6J50q8k14P3K21n20J06M03j26j10N7J48K6L8
5229A20l5j67J75J00j26J70k95J21o6j1q4L2J05j58lR0R8o6J01j22J19k58M72
5252C12l09k62K26r3NN8J49k30J99n2j35j53O06l37J0J4q8QJ42p9j75K31J08j67
5276a2K9k65J88k9K35J12k46K18k78J45J11m07M45k17q8J41O6j63j86P9P0J36
5298H4k03K86k81O3J57M5M2j38l3R1O6o2J70j96j39o6K90q3J4k66M67l59q7K47
$$ plain form
5322 109 42 145 144 185 130 -169 60 -177 -98 10 -125 104 -234 27 -130 -1 196 -316 -203 65 110 -328
5344 -328 -82 180 210 -172 138 105 -175 -281 120 -76 43 305 8 207 300 -337 135 82 -56 28 -4 -180
5366 -180 -150 -47 -64 -4 108 128 114 67 -235 -194 -164 -70 70 -6 31 -53 -242 51 143 -142 273 1 -56 107 10
5391 10 8 233 66 7 172 -67 -137 -115 136 -159 126 5 152 48 -212 78 97 -15 -27 -184 45 -175 22
5414 22 231 32 69 114 -10 -276 -170 91 -154 32 -333 -122 147 104 70 89 -159 21 -139 -78 72 21 144
5437 144 59 -27 4 -119 -220 234 -240 34 -61 130 -307 201 -240 -259 123 55 -130 170 17 59 57 -262 -103
5460 -103 -19 17 -23 296 -6 176 33 -55 70 -66 235 134 -114 20 151 -14 -247 -116 94 258 -223
5481 -223 -27 -304 -111 -74 334 228 152 -39 -59 -152 58 139 -250 -76 122 78 -99 -198 -25 112 176 60 73
$$ packed form
5322A09o7J03jM1n5k99K29k37P9J08j35K29l38K61j57J29J97n12J13K68M5m38
5344c28K46K62L0l82L10l3k80j06M01j96J19K62k97J99R3o37M72n3j38Q4l2j76
5366a80L0J03j7O0J12K0j4m7l02M1L0R4J40p6L7q4j89K93R2k85M15k72n7J63r7
5391A0kK25j67n9J65k39p0K2K51k95K85j21J47j04k60K90J9j12j2j57K29k20J97
5414B2K09j99L7M5j24k66J06K61k45J86l65K11K69m3l4J9k48J80j60O1J50n1J23
5437A44q5q6L1j23j01M54m74K74r5J91m37N08m41j9L82o8j85L00j53M2kl19J59
5460a03Q4L6m0L19l02J82j43q8J25j36L01j01k48J34J31j65k33J31K10J64m81
5481b23J96k77J93L7M08j06p6j91k0r3K10Q1l89J74J98m4j77r9J73J37O4j16J3
$$ plain form
5504 73 78 -206 -174 -124 -46 -8 -29 21 27 -10 -23 20 -226 242 116 196 59 17 330 -127 8 313 -142 -36 121
5529 121 -185 -9 -257 -182 -82 252 -52 -31 62 181 -184 -8 191 -98 -233 87 19 -43 53 218 -72 148
5551 148 123 106 68 -18 63 202 41 -162 -196 16 -23 -97 -119 -87 -90 -16 25 116 123 269 -5 115 -139 6 -20 -152
5577 -152 92 121 -167 49 28 221 -99 -217 91 70 -211 -453 191 218 40 80 -170 -189 -310 -42 -11 48 50
5600 50 290 27 87 14 120 -100 101 -28 153 -14 68 79 -25 168 133 73 -60 -28 64 156 -114 74 -4 86
5624 86 -13 7 -130 -210 -165 6 -180 51 -125 -70 -65 69 72 99 -247 -127 8 -112 1 -217 156 109 269 -47
5648 -47 186 -43 86 -8 -193 -49 122 158 -88 -163 105 21 -303 82 127 -68 135 -295 -73 116 -191 -164
5670 -164 209 184 -73 133 -48 125 138 43 -92 -104 73 71 120 147 -229 121 55 -375 -96 8 67 -163 219
$$ packed form
5504G3Nk84L2N0P8L8k1N0Ol7j3M3k46M68j26Q0j37m2L13m57J35L05m55J06J57
5529A21l06J76k48P5J00L34l04K1R3J19l65J76J99k89j35L20o8o2R6J65k90K20
5551A48k5j7l8q6Q1J39j61k03l4K12l9p4k2L2lP4M1R1PJ46k74J20k54J45k6j32
5577a52K44K9k88K16k1J93l20j18L08k1k81k42O44K7j78M0k50j9j21K68L1N9K
5600E0K40k63O0p3J06k20K01j29J81j67Q2J1j04J93l5o0j33L2R2R2k70J88p8R0
5624H6r9K0j37q0M5J71j86K31j76N5NJ34LK7l46J20J35j20J13k18L73m7J60l16
5648d7K33k29J29r4j85J44J71L6k46p5K68q4l24L85M5j95K03m30K22J89l07K7
5670a64L73k5k57K06j81J73J3r5j35j2J77kM9K7l76L50o6m30K79J04N9k30L82
$$ plain form
5693 219 -100 94 -38 107 117 40 297 100 103 -22 182 302 -3 110 -28 -52 144 -21 -49 -23 -98 56 37
5716 37 -109 62 92 163 -19 57 25 -21 22 -1 59 187 -30 12 -52 13 -117 -213 -299 247 76 189 116 -111 -17
5741 -17 41 -139 -41 -39 -34 -94 166 -186 -380 -146 212 -51 -235 -42 -239 52 52 -60 -96 107 -311 42 -55 237
5765 237 67 -10 -23 -131 -49 84 27 -134 -77 110 185 31 -26 -33 -40 454 -321 66 55 10 -135 157 -5 -243
5789 -243 72 -135 -23 -55 192 -129 110 31 -193 120 -102 -128 -230 -129 136 -294 -97 87 -156 134 170
5810 170 -69 -102 24 -165 187 -34 127 24 191 55 -45 -26 98 34 82 -204 150 -259 30 -212 8
5831 8 -285 -24 170 74 -11 -78 120 -149 -140 34 49 -225 192 -1 154 -200 22 -121 103 -315 23 -61 -147
5854 -147 202 53 98 91 277 21 134 183 -154 -201 -147 -130 -69 -114 -106 85 26 -178 9 22 -76 10 33 41 -4 -272
$$ packed form
5693B19l19J94j32J45J0p7K57j97Lj25K04J20l05J13j38k4J96j65k8K6p5J54j9
5716C7j46J71L0P1j82P6l2m6M3k3O0J28k17M2o4O5j30r6q6N46j71J13p3k27R4
5741a7N8j80R8KNo0K60l52j94K34L58k63j84J93j97K91%j12l6K03m18L53r7K92
5765B37j70p7j3j08Q2J33n7j61N7J87P5j54n7ppM94p75L87j1m5j45K92j62k38
5789b43L15k07J12l2K47l21K39p9k24L13k22k6j02J01K65m30J97J84k43K90L6
5810A70k39l3J26j89L52k21J61j03J67j36j00J9J24o4M8k86L54m09K89k42K20
5831Hk93K61J94r6q5o7J98k69RJ74J5k74M17j93J55l54K22j43K24m18L38q4q6
5854a47L49j49M5pJ86k56J13M9l37m7N4J7O1m5QJ91n9k04J87J3r8Q6K3Qm5k68
$$ plain form
5880 -272 97 30 226 -46 83 145 146 -121 -83 115 -224 52 58 -63 222 -23 151 -125 -14 319 -114 -48 175
5903 175 199 195 -251 -16 -147 166 87 -79 21 -200 -220 -99 -53 -63 7 -124 60 -121 228 244 -121 -197 10
5926 10 8 -70 43 -290 -97 215 -13 83 -218 -164 -119 100 91 -92 138 -238 206 -120 46 160 -238 -206 117
5949 117 84 26 101 -394 299 -51 76 -68 122 187 -78 50 129 4 -136 65 -157 -195 157 -213 -23 149
5971 149 89 294 24 -11 31 -69 11 -67 -128 -136 -75 53 151 92 -141 -70 104 205 -82 -36 -114 -138 8 -55 200
5996 200 35 31 -52 -85 -117 -114 72 181 58 -70 -362 5 -49 174 -67 153 -129 122 -30 199 212 22 410
6019 410 -305 -71 -181 -110 -96 -15 79 74 200 45 206 308 -113 -178 175 -73 178 -3 4 -67 129 -98 -102 -144
6043 -144 0 -9 187 123 -84 335 -273 -171 -85 187 147 316 -97 47 -131 305 -75 126 -106 51 160 79
$$ packed form
5880b72L69o7J96k72J29O2Jk67L8J98l39K76Oj21K85k45J74k76J11L33m33O6K23
5903A75K4mm46K35j31L13p9j66J00k21k0J21M6j0P0j31J84j81L49J6l65p6K07
5926A0kp8J13l33J93L12k28R6l01N4M5K19rj83K30l76M44l26J66J14l98L2L23
5949A17l3n8P5m95O93l50J27j44J90O5k65J28P9j25j40K01k22l8L52l70J90J72
5971A49o0K05k70l5M2j00Q0p8o1qO1J28R8n9k33P1J74J01k87M6p8k4J46o3K55
5996B00j65mq3l3l2LJ86J09j23j28k92L67n4K23k41K20k82K51j52K29J3j90L88
6019D10p15K34j10P1J4Q1R4nJ26j55J61J02m21o5L53k48K51j81Pp1J96k27mm2
6043a44J44rJ96o4k07M19o08J02Q6K72m0J69m13J44j78M36l80K01k32J57J09q1
$$ plain form
6065 79 -118 -241 -55 14 -281 150 35 -186 33 -4 -108 -206 -66 130 110 -53 -29 62 -17 297 -61 40 199
6088 199 81 -13 132 88 -29 -88 108 8 108 209 -36 104 -23 -80 -208 -50 30 62 97 28 73 -47 -83
6111 -83 -83 82 77 -101 -173 110 -72 143 73 -62 -239 15 165 -249 -180 -85 53 -263 -154 61 -106 263 41
6134 41 -124 34 131 -245 -34 -172 50 142 155 -5 28 -139 106 50 174 78 11 63 -167 -153 -62 -134 -76 47
6158 47 -97 125 129 -41 -23 -219 -34 148 103 -26 116 -22 61 83 -247 51 -129 -64 44 -53 -60 240 42 -59
6182 -59 52 -117 122 -260 -37 309 100 103 -210 -24 62 -75 -33 -15 388 -134 38 -35 12 22 108 -58 -153 -258
6206 -258 40 27 91 14 -8 41 104 173 -49 -37 53 51 -3 -21 -42 178 85 -87 92 -59 -77 114 -246 -168 -62 253
6232 253 148 -11 72 209 -89 -141 38 40 167 28 -197 -177 -63 79 -84 76 142 282 4 41 188 31
$$ packed form
6065G9j97j23J86O9k95M31j15k21K19l7j04r8J40J96k0j63K4R1p9L14l58J01J59
6088A99j18r4J45m4j17n9J96j00J00J01k45J40j27n7j28J58Q0L2L5o9M5j20l6
6111h3%J65nj78p2K83j82K15p0j35j77K54J50m14O9R5J38l16J09K15j67L69k22
6134D1j65J58R7l76K11j38K22R2J3j60L3j67K45n6J24r6o7N2k30J4R1p2N8J23
6158D7j44K22Mj70J8j96J85J82m5j29J42j38Q3K2l30K98j80O5J08r7pL00j98j01
6182e9J11j69K39l82K23L46k09Ll13J86Q6j37M2J8M03n22J72p3M7J0Q6j66r5j05
6206b58K98j3O4p7k2M9O3O9k22J2R0kn4j8k1K20r3j72J79j51j8J91l60P8J06L15
6232B53j05j59Q3J37k98n2J79KJ27j39k25K0J14J42j63J60O6J40k78L7J47j57
$$ plain form
6254 31 63 -226 263 143 -129 -49 30 -97 -112 55 -159 -45 -82 62 -36 147 100 -135 -83 -30 -36 131 -139 -223
6278 -223 -28 -76 185 -77 -187 166 -77 -31 -28 -5 101 -84 -118 -3 22 13 189 154 91 71 -177 139 84 -248
6302 -248 -208 -45 -74 -270 -103 -178 -171 -60 -76 -284 211 -17 120 16 146 314 12 79 159 91 -159 22 267
6325 267 -53 -36 10 8 214 -89 85 -72 -260 73 -229 -48 57 -30 100 115 195 53 107 354 150 -50 -186
6348 -186 38 -83 127 187 156 88 -177 196 231 12 -86 59 -16 40 11 47 51 -174 129 106 109 141 53 288 -35
6373 -35 109 -131 -25 -222 145 112 -278 -69 124 -92 -4 50 -47 105 -275 230 -39 -83 -192 -148 -54 -449 139
6396 139 -24 -67 -116 88 -127 80 20 174 152 -11 -230 -10 31 -124 401 58 -139 179 -53 38 -112 -2
6418 -2 -1 75 -86 -24 -209 -127 -161 91 18 41 21 -10 -83 -28 72 146 -61 62 -6 340 -115 181 -167 172 82 -286
$$ packed form
6254C1L2k89M89j20k72Q0P9j27j5J67k14J14l7J44r8J83m7k35N2N3oJ67k70q4
6278b23J95m8K61k62j10L53k43M6LK3J06j85l4J15K5rJ76l5o3k0k48L16n5l32
6302b48M0J63k9j96J67p5PJ11j6k08M95k28J37j04J30J68l02O7Q0o8k50J81K45
6325B67l20J7M6kK06l03J74j57j88L33l02J81J05q7J30J5Q0j42N4K47k04k00j36
6348a86K24j21K10O0l1o8k65L73L5k19r8J45p5N6k9L6Mk25L03k3LL2q8K35l23
6373c5J44k40J06j97L67l3l90K09J93k16Q8N4r7J52l80N05k69m4j09M4R4l95N88
6396A39j63m3m9K04k15K07o0J54k2j63k19K20M1j55N25l43j97L18k32R1j50J10
6418bJP6j61O2j85Q2l4K52p3K3k0l1p3N5J00P4k07J23o8L46m55K96l48L39r0l68
$$ plain form
6444 -286 -71 -143 -97 13 -171 143 32 23 -15 -167 37 -416 109 257 -43 -109 97 -162 170 130 30 1 161
6467 161 -191 -163 48 149 315 -368 -192 -141 18 -95 -257 123 -142 139 62 224 229 15 -204 -176 131 -90
6489 -90 -180 -81 7 226 -271 -106 172 -54 140 -70 -31 -169 -99 22 -12 -41 286 103 26 -147 -55 76 -138
6512 -138 350 -172 -22 223 1 -370 161 47 -37 207 154 154 -99 -27 -3 -209 -230 -73 -206 -164 84 -204 121
6535 121 25 -73 -171 45 64 -51 -23 123 -71 95 -213 -20 94 -59 252 -110 208 -124 226 12 -316 -34
6557 -34 62 -137 -100 307 137 115 275 -199 -142 -10 13 -200 -178 66 -73 21 -98 -102 -208 230 -13 -142 -29
6580 -29 -202 -85 232 127 -45 90 -279 89 326 175 -92 -275 352 -57 124 153 -46 134 48 159 66
6601 66 110 288 21 -26 119 -66 162 -65 -363 -105 -121 -133 33 -107 -157 -93 202 -83 189 185 -32 36 90 -79
$$ packed form
6444b86K15p2M6J10j84L14j11rl8j52K04m53N25J48l00o6K06k59L32m0j00k9J60
6467A61l52K8K11J01J66o83J76N1J59j13j62L80k65K81p7J62Nk14k19K8L07k21
6489i0r0R9Q8K19m97J65K78k26J94k10L9j38P0J21l4k9L27j83p7j73R2J31k14
6512a38M88n22J50K45k22l71N31j14q4K44n3%k53P2K4k06k1J57j33M2K48k88L25
6535A21r6r8r8K16J9j15K8J46j94J66l08J93J14j53L11l62L18l32L50k14l28K82
6557c4R6j99L7M07j70k2J60m74N7J32K3k13K2K44j39R4j19mj06M38k43j29J13
6580b9j73J17L17j05j72J35l69L68K37j51k67j83O27m09J81K9j99J80q6J11r3
6601F6M4J78k67m7J45j85K28k27k98K58j6j2J66j40n0O4K95k85K72mk17O8N4j69
$$ plain form
6625 -79 -137 199 -50 310 -64 207 133 -209 167 -336 -88 -126 61 83 79 -89 60 -173 -7 -3 -22 35 -108 8
6649 8 -153 134 -110 137 -387 -64 -18 181 -70 -69 16 49 -59 -73 -82 172 196 -9 -131 -16 -280 -22 44 -206
6673 -206 130 -99 29 22 220 -188 284 -18 -183 -42 -68 123 110 217 298 -3 -212 -14 80 -119 151 134
6695 134 184 76 -181 81 -43 -359 5 -187 -213 198 174 -5 -224 184 46 -271 108 176 -182 15 -19 -5
6717 -5 -207 -45 -85 -180 83 -44 69 -207 174 -5 -89 -103 78 168 150 -137 -201 -154 -266 -79 -224 -132 92 233
6741 233 -90 7 140 -27 -158 -222 -78 -16 -121 401 -282 -176 -159 -193 47 -13 -61 44 34 -51 -3 294 -48
6764 -48 241 -169 -108 -69 -316 -128 135 67 -67 -221 -54 -87 -113 257 -50 108 203 -267 -73 70 -197 -109 -37
6787 -37 -185 -120 -68 33 182 151 17 -128 148 50 2 177 4 19 -212 14 95 21 115 -227 119 -22 -175
$$ packed form
6625g9n8L36k49L60l74K71p4l42L76n03K48l8J87K2mj68J49k33J66Mj9N7j43J16
6649Hj61K87k44K47n24L23M6J99k51JQ5L3j08j4rK54K4k05j22J15k64K58O6k50
6673b06L36k29J28pJ98m08M72l02j65J41k6J91j3J07Q1l01k09J98R4j99K70j7
6695A34N0j08k57K62j24l16L64j92k6M11k4j79k19M08j38l17L79O8l58J97l4J4
6717ek02J62m0r5K63j27J13k76L81j79q4j4J81R0j8k87o4M7j12J87j45R2K24J41
6741B33l23R7J33j67j31o4J44O2j05N22o83J06J7l4K40o0m8J05j0q5M8K97l42
6764d8K89m10O1L9k47J88K63o8j34j54J67l3k6L70l07J58R5m70J94J43k67Q8P2
6787c7j48O5N2J01J49l1j34j45K76r8m8J75j73J5k31K26Q1p4R4l42L46j41j53
$$ plain form
6810 -175 -125 -128 19 -8 -202 56 -48 -7 -91 10 189 -110 9 48 -79 -105 -20 -160 -90 217 15 -108 83
6833 83 -25 2 259 246 174 -19 -79 101 149 166 -108 48 302 206 8 130 243 24 -188 -50 -43 273 105
6856 105 35 -219 -59 331 -151 40 -280 -14 -120 -177 90 -22 -156 180 157 94 -273 368 12 -54 27 182
6878 182 18 90 5 -60 -48 -44 159 -160 27 -61 -166 114 69 -141 -99 20 -24 21 197 284 140 -92 -25 -11 200
6903 200 50 175 274 186 300 -126 -192 -285 1 176 -153 -261 -134 20 -190 110 -39 183 174 106 149 182 -16
6926 -16 -25 5 128 -136 75 -9 -81 3 135 60 -139 -96 -171 -25 -39 -287 -236 -12 37 207 -47 62 -313 106
6950 106 116 51 -222 -151 120 -44 -89 -252 -40 107 5 51 51 -154 135 105 155 144 -222 -159 -124 29 101 147 -83
6975 -83 52 -129 -104 71 -40 48 96 48 457 -41 -47 -20 -74 -215 25 -6 -152 91 -97 -150 -43 -2 49 130 -206
$$ packed form
6810a75N0lJ47k7j94K58j04M1q4J01J79k99J19L9j27k6Q5j40P0L07k02j23J91
6833H3j08K7K57j3p2j93o0J80M8J7k74J56K54r6j98J22J13k19k12J38PL16j68
6856A05p0k54J60L90m82J91l20K66j06n7K67j12j34L36k3o3l67O41l56o6Q1J55
6878A82j64P2q5o5J2MK03l19J87q8j05K80m5k10M2J19m4M5J76Q7j44k32O7J4K11
6903B00j50J25R9q8J14m26o6r3K86J75l29j08J27J54k10L00j49K22ro8M3L3j98
6926a6rL0J23k64K11q4p2Q4J32p5j99M3p5J46j4k48N1K24M9J70k54J09l75M19
6950A06J0o5k73P1K71j64m5j63K12J47j02M6%k05K89l0N0j1l66O3L5J53P2M6k30
6975h3J35j81K5J75j11Q8M8m8M09m98oK7n4j41K40l1j46K43j88n3J07M1N1Q1l36
$$ plain form
7000 -206 -270 88 95 -362 147 212 54 -202 -141 47 -52 117 170 151 144 8 274 336 36 13 295 -74 145 47
7024 47 -42 156 166 104 42 -254 -21 98 74 166 176 -76 224 -91 210 11 -117 -78 -38 215 174 100 239 -16
7048 -16 -58 26 -25 -4 -112 5 55 0 23 -65 -84 -129 -125 -43 -3 295 -72 59 136 -130 -45 66 -135 -69 -82 380
7074 380 51 -173 -98 -11 191 -79 5 -38 171 56 -21 32 9 -187 -73 -280 -79 7 52 6 8 61 309 -125
7098 -125 148 290 126 -130 -59 56 128 202 217 85 -116 -232 182 214 294 195 31 121 -35 145 -14 -63 -144
7121 -144 -3 -125 249 -172 32 90 -185 44 -476 225 -154 7 -26 -81 92 -15 -26 -146 166 50 144 5
7143 5 92 47 -199 161 346 1 -18 489 209 -70 23 -11 238 397 219 150 122 -223 -111 82 -66 -123 -46 96
7167 96 70 146 68 -54 -111 -113 -266 43 66 -108 -200 120 -1 168 -85 -11 233 4 3 -148 -4 -4 -35 163 89
$$ packed form
7000b06o4L58Pm57N09O5j58k56O1J88r9J69N3j9pj36K66O2l00k3K82l69K19r8
7024D7q9J98J0o2o2k96K33J19k4R2J0k52L00l15L01j99j28L9M0K53m1p4J39k55
7048a6m2Q4n1K1j08J17N0n5K3q8j9m5MQ2M0K98l67J31P7k66Q5J11k01O6j3M62
7074C80l29k24P5Q7K02k70Q4m3K09j15p7N3k3j96J14k07K01Q6M5m6KN3K48m34
7098a25K73J42j64k56P1J15P2P4J5j32k01j16M14L2Q0r9j64R0j56J80j59m9q1
7121a44J41j22L74m21K04N8k75K29n20P01l79J61l3n5J73j07j1j20L12j16R4j39
7143EQ7m5k46L60J85l45j9N07k80k79R3l4K49J59j78o9k8l45J12J93j48n7P7J42
7167I6k6P6p8j22n7kj53L09K3j74r2L20j21J69k53P4K44k29jj51J44%l1J98p4
$$ plain form
7192 89 -134 -193 -15 103 -3 -7 72 34 -134 -13 34 153 -42 31 91 -133 -107 -66 220 50 -123 150 -37 61
7216 61 66 6 -60 74 -85 161 -122 207 -29 -146 -113 60 -65 219 93 43 -42 -77 -46 161 81 -135 -207 153
7240 153 -29 233 81 -170 21 52 -281 -6 155 -43 23 -85 59 -103 -16 64 183 -253 129 -90 75
7261 75 48 -220 6 -39 -65 74 -74 6 160 22 -79 -247 -32 160 -72 19 -54 111 -79 -105 -27 106 -17
7284 -17 60 -42 -180 218 48 142 -75 -9 -161 101 260 -148 153 -93 -100 -157 -224 -52 95 -207 199 -107 -89
7307 -89 -170 26 35 -201 -87 293 255 -44 71 -251 -73 -66 132 24 208 -73 67 -147 43 -25 124 -43 -115
7330 -115 -96 -33 127 183 162 -131 -97 -7 76 -93 -177 -21 79 7 -47 -6 -55 71 87 -187 3 57 179 -86 -15
7355 -15 -96 115 -130 -291 -109 265 55 168 -96 88 -32 -81 -49 11 -123 23 -234 -50 71 22 66 199
$$ packed form
7192H9k23n9J78J18j06mP9l8j68J21M7J19j95P3O0k24K6M1K86j70j73K73j87R8
7216F1No0o6J34j59K46k83L29k36j17L3J73j25K84j26n0q5l5L1K07q0k16p2L60
7240A53j82K62j52k51J91L1l33K75J61j98O6j08J44j62Q7Q0J19m36L82k19J65
7261G5k7k68K26m5k6J39j48Q0J54j38j01j68K15J92k32R1p3J65j90k6P8J33j23
7284a7P7j02j38L98j70R4k17O6j52K62J59m08L01k46pn7o7J72J47l02M06l06J8
7307h9q1J96Rk36J14L80l8k99J15l22J78PJ98j08J84k81J40k14J90o8J49j67p2
7330a15J9O3J60N6k1k93L4R0Q3j69q4J56J00p2n4M1m9J26J6k74J90N4J22k65P1
7355a5q1K11k45j61J82L74k10J13k64J84j20m9L2O0j34J46k57J84J21m9M4J33
$$ plain form
7377 199 -72 137 -250 -10 -237 -32 2 -82 80 39 -286 197 139 11 109 205 -54 86 -59 155 74 -77
7399 -77 -35 -131 -319 115 -78 -153 -76 -131 -60 -114 -148 -244 22 100 122 -163 178 -212 -104 -98 -37 -182 -118 68 72 -54
7425 -54 208 -55 30 -405 -29 228 -191 -76 -115 -80 5 -15 294 -89 162 108 -64 -86 1 74 45 297 -191 -196
7449 -196 -99 107 14 24 -243 138 212 64 -157 -117 -191 -6 -94 175 81 -41 123 -249 -39 -172 -125 -90 12
7472 12 64 106 102 -226 -35 -151 -55 -71 -104 67 121 -166 -92 123 22 32 -29 143 166 112 -25 -33 -46 1 19 -45 152
7499 152 96 -46 81 131 -83 -21 -75 -20 59 86 -310 73 26 107 201 -146 -39 122 54 137 -123 -81 92 60 -153
7524 -153 81 55 -227 -114 -217 -67 -59 17 -177 91 23 -84 -273 -216 27 202 -164 -182 -54 -90 3 -272 45
7547 45 -61 -58 -66 239 -15 -71 7 43 -21 358 20 -55 35 146 -55 133 16 107 30 -85 41 206 78 161 207
$$ packed form
7377A99k71K09l87K40k27K05L4q4J62m1l25M83n8j28R8R6k59J40j45K14q1j51
7399g7M2r6j88M34j93p5P7n5P1n4l4r6K66P8K2k85L41l90J08OO1j45O4J86Mj26
7425e4K62k63Q5m35L76K57m19J15l9L5Q5k0L09l83K51n4j72k2Q7P3k9K52m88n
7449a96R7K06r3J0k67L81P4j48k21M0p4J85q8K69r4j22J64l72K10j33M7L5J02
7472A2N2M2ml28J91j16R6j6l3J71N4k87P4K15j01J0o1J72K3n4j37qj3M7J8o4J97
7499A52n6j42J27N0k14O2n4N5P9K7l96L83m7Q1R4l47J07J61o8Q3k60M2J73l2k13
7524a53K34k6k82J13j03J50QP6j94K68o8j07j89N7K43J75l66j8J28l6R3k75L17
7547D5j06LqL05k54n6P8L6o4L79l38p5R0J11k01J88j17R1p7j15J26J65j28Q3M6
$$ plain form
7572 207 167 5 139 -27 120 104 404 80 -74 -226 -20 45 109 235 0 -239 135 117 -23 -60 196 -2
7594 -2 -116 75 384 42 75 -141 186 460 -13 42 -46 98 51 41 -20 -55 32 -71 29 126 254 237 40 0
7618 0 -63 29 168 185 -140 -92 64 -86 98 11 -120 -27 -285 138 30 -57 82 -340 -54 58 -288 -113 53
7641 53 65 -79 134 90 71 9 -425 -144 -127 165 108 331 66 149 -150 119 14 -112 -57 -122 2 -395 56
7664 56 23 153 -160 79 -114 -89 113 106 159 24 88 -94 20 10 -50 -97 -222 14 117 156 219 122 -14 -158
7688 -158 -2 -64 -311 -111 -78 -22 108 15 17 -193 56 -329 -337 142 65 15 9 -68 156 -126 364 113 142 216 109
7713 109 -73 40 1 -58 -43 16 37 174 -39 -245 63 -39 119 -94 -117 208 -174 220 214 9 24 10 331
7736 331 -48 -41 89 130 -200 65 -183 63 -138 -251 -104 196 70 -22 56 -64 -55 15 120 -266 255 80 -108
$$ packed form
7572B07m0j62J34j66J47j6L00l24j54j52K06O5O4J26k35k39L74j8j40l7K56j98
7594bj14J91L09l42L3k16L27K74m73N5q8J44m7j0o1l5Q7j03J00R7J28j7j97m0
7618@o3R2J39J7l25M8J56j50J84q7j31R3k58M23j08q7J39m22K86J12l46J75J66
7641E3J2j44K13m4j9o2m34K81J7K92n7K23k65Q3k99K69j05j26N5o5J24l97M51
7664E6l3J30l13K39j93K5K02pN3j35O4j82J14j0o0m7j25K36J03L9O3r7j36j44
7688a58J56o2k47K00L3N6J30r3Kk10K49l85qM79p7n0op7K24k82M90k51K9P4j07
7713A09j82J13l9n9J5N9K1J37k13k06L08j02J58k13k3L25l82L94ok05J5j4L21
7736C31l79PJ30M1l30K65k48K46k01j13J47L00j26r2P8j20RP0J05l86N21j75j88
$$ plain form
7759 -108 -214 -184 -24 -50 199 171 41 -46 322 78 3 -150 15 113 88 93 77 -50 92 -35 -365 60 120 123
7783 123 25 77 195 -144 249 166 12 49 -140 35 83 -76 285 63 -67 -232 267 38 -211 -38 197 14
7805 14 -336 234 -130 -97 -68 -114 -17 10 110 -59 3 102 55 174 191 -106 -27 138 -63 157 -64 100 -255 318
7829 318 -130 -41 -67 35 57 142 112 213 -47 163 -186 -253 73 -59 14 81 123 -73 8 -9 -111 -95 78 181
7853 181 72 220 -45 202 -212 -127 157 -238 195 -60 183 -5 -117 -92 18 -213 182 -27 -41 20 -189
7874 -189 226 140 70 59 336 -269 29 -23 36 243 43 114 -95 66 161 -93 -152 127 -178 -262 336 -80 14
7897 14 -154 -107 359 282 81 238 -208 -209 362 -38 72 199 45 -24 -108 472 252 57 187 83 -233 38
7919 38 148 9 2 109 53 112 -144 -410 -53 2 -81 -74 -254 40 -389 -46 162 44 -156 -205 -145 -9 210 -24
$$ packed form
7759a08j06L0J60k6K49k8j30q7L68k44p5j53J65R8k5Nj6j27J42j27l30M25O0L
7783A23r8N2J18l39L93q3j54L7j89J75M8j59L61k22j30j65M99k29k49J73K35j83
7805A4l50N70l64L3K9m6R7K7J00j69O2R9m7J19J7k97P9J65k01K20k21J64l55N73
7829C18m48Q9k6J02K2Q5l0J01k60K10l49o7L26j32P3O7M2j96Q1j7j02J6J73J03
7853A81j09J48k65K47m14Q5K84l95M33k55K43j88j12K5J10k31L95k09j4O1k09
7874a89M15q6p0j1K77o05K98n2N9K07k00P1k09J61R5k54n9K79l05q4N98m16R4
7897A4j68M7M66p7k01J57m46jN71m00J10J27j54o9q4N80k20j95J30j04l16K71
7919C8J10j39pJ07n6N9k56k66L57N5q3Pj80K94m29L43K08j18k00m9O0J36K19k34
$$ plain form
7943 -24 -78 -269 548 -24 -196 -172 14 26 75 -54 57 28 -31 -26 -44 156 -17 -40 81 -65 147 307 28 225
7967 225 -46 -30 52 231 206 42 -198 -102 91 110 82 -75 66 11 176 288 -31 197 -45 -234 -74 40
7989 40 -177 55 105 69 -341 233 48 111 -132 133 -319 30 230 137 -126 -265 -22 -69 -39 48 166 -16 126
8012 126 96 -119 188 -31 49 171 10 -29 -13 71 -210 107 -92 86 -44 45 72 113 5 -185 -146 -152 -98 37
8036 37 158 -102 -10 -122 -210 -14 -52 -107 -128 -29 -191 -169 337 59 302 -14 -99 -85 49 -151 83 107 -66 -54
8060 -54 -89 -258 -97 -86 337 -139 67 -75 -72 85 154 37 -186 -95 45 246 79 105 16 -410 -23 121 -48
8083 -48 79 -2 122 95 156 -211 44 -121 -106 -29 -185 2 96 -43 60 125 -35 -133 164 19 -79 28 48 -58
8107 -58 28 224 38 -58 79 -73 -180 89 239 205 -263 49 206 28 126 73 -80 69 -146 -38 36 118 -64
$$ packed form
7943b4n4j91Q17n72j72K4J86J2M9j29J11k9n9Nj8K00j73k3J21j46K12J60k79J97
7967B25k71J6Q2J79k5j64k40R6J93J9k8j57J41n5J65J12l19K28k42j89J60J14
7989D0k17K32N0l6m10N74j85O3k43K65m52L49K00r3k63j39K43m7L0Q7J18j82J42
8012A26l0k15L07k19Q0J22j61l9J6Q4k81L17j99J78j30Q9K7M1j08j90L9oN4J35
8036C7J21k60R2j12q8J96l8n5k1R9j62K2N06k78K43l16q5J4J34k00K34K4j73J2
8060e4l5j69J61J1M23m76K06j42LJ57O9j17k23R1J40K01j67K6q9m26L87J44j69
8083d8J27q1J24k7O1l67K55j65J5P7j56J87R4j39J03O5j60r8K97j45r8J07K0j06
8107e8Q6J96j86r6J37j52j07K69J50l4m68L12J57j78R8n3j53J49k15J08P4Q2j82
$$ plain form
8130 -64 110 90 255 12 1 92 31 52 -256 14 145 -229 48 -142 264 -60 -98 127 -136 80 78 -21 13 184
8154 184 -210 -6 29 93 -159 76 -90 -21 -58 328 -107 -7 21 -33 -32 61 89 -226 1 -44 -272 173 52 32
8178 32 87 38 -50 -159 -165 -121 -153 -117 111 -104 -100 42 136
$$ packed form
8130f4J74k0J65k43j1R1o1K1l08K70J31l74K77j90M06l24l8K25k63K16kr9L4J71
8154A84l94K04L5O4k52K35j66O9l7L86m35J00K8n4JR3K8l15K27m5k28M45j21k0
8178C2N5m9q8j09oM4l2L6K28k15MJ42R4
8191A36
$$ Imaginary data points
##PAGE= N=2
##DATA TABLE= (X++(I..I)), XYDATA
$$ plain form
0 0 0 0 0 0 0 0 0 0 0 0 0 -3 8 -8 8 -8 11 -16 16 -24 25 -32 40 -42 52 -60 71 -81 95 -108 123 -140 159 -180
34 -180 204 -230 258 -290 323 -360 401 -445 494 -548 605 -668 739 -814 897 -987 1091 -1200
52 -1200 1322 -1461 1613 -1785 1984 -2209 2474 -2785 3160 -3620 4202 -4967 6013 -7551 10044
67 10044 -14772 27072 -136812 -276512 -150541 -88592 14017 74553 129963 126342 114429 84792
79 84792 69186 44500 28531 -15278 -70278 -127533 -158461 -173058 -152732 -99392 -9773 73579
91 73579 126296 139138 118862 65370 9743 -31074 -47283 -48332 -34823 -13986 -2720 -20654
103 -20654 -46895 -56990 -45044 -17692 21378 63159 95163 101695 79859 35012 -17213 -47904
115 -47904 -43077 -26493 -10272 8425 26553 26746 2895 -21196 -19812 2873 34540 64947 82264
$$ packed form
0@%%%%%%%%%%%lJ1j6J6j6J9k7L2m0M9n7P2q2R4j12J31j52J76k03K31k63K99l39
34a80L84m34M88n48O13o83P61q46R39j042J153j273J407j553J711j884K078k291
52a200K522k783L074l398L769m193M683n259N945o780P822r169J0980j3564J7595
67A0044k4816M1844j63884j39700J25971O1949J02609O0536N5410l621j1913k9637
79H4792j5606k4686j5969m3809n5000n7255l0928j4597K0326N3340Q9619Q3352
91G3579N2717J2842k0276n3492n5627m0817j6209j049J3509K0837J1266j7934
103b0654k6241j0095J1946K7352L9070M1781L2004O532k1836m4847n2225l0691
115d7904M827J6584J6221J8697J8128J93k3851k4091J384K2685L1667L0407J7317
$$ plain form
128 82264 78371 52804 11065 -33835 -64855 -65669 -33411 9657 42549 62580 65011 46602 16012
141 16012 -10607 -21531 -16691 -2531 15645 21897 7203 -13490 -24761 -24447 -15130 6490 40965
154 40965 70450 71273 43661 291 -44804 -73388 -79889 -66735 -37294 2956 37670 46718 26857
167 26857 2405 -9119 -13667 -12892 -3533 10557 18350 6895 -20555 -47766 -64146 -60906 -38328
180 -38328 -9199 17112 34064 34157 15904 -14122 -40074 -46056 -33888 -12863 11094 24302 19565
193 19565 2534 -20527 -41615 -53151 -45674 -15664 16438 31028 29709 19242 1652 -17496
205 -17496 -30877 -27594 -8032 15486 29520 23981 2733 -17137 -29501 -35961 -29998 -6471 27339
218 27339 51371 50795 33204 12097 -8037 -20652 -19827 -6895 13627 29429 31724 18042 -5531
$$ packed form
128H2264l893k5567m1739m4900l1020q14L2258M3068L2892K0031K431j8409l0590
141A6012k6619j0924M840J4160J8176O252j4694k0693j1271L14R317K1620L4475
154D0965K9485Q23k7612m3370m5095k8584o501J3154K9441M0250L4714R048j9861
167B6857k4452j1524m548P75R359J4090P793j1455k7450k7211j6380L240K2578
180c8328K9129K6311J6952R3j8253l0026k5952n982J2168K1025K3957J3208m737
193A9565j7031k3061k1088j1536P477L0010L2102J4590j319j0467j7590j9148
205a7496j3381L283J9562K3518J4034n539k1248j9870j2364o460N963K3527L3810
218B7339K4032n76j7591k1107k0134j2615Q25J2932K0522J5802K295j3682k3573
$$ plain form
231 -5531 -25321 -29111 -19322 1303 27947 50610 59753 51049 28337 2146 -18112 -22275 -10421
244 -10421 3900 11912 14936 12437 1292 -14911 -22662 -9749 16611 40268 53216 50579 33562
257 33562 7961 -22994 -48459 -53783 -36358 -5426 20244 31251 33086 26609 11021 -6640 -16014
270 -16014 -11285 1486 8958 6782 -5072 -22455 -37235 -41948 -35256 -16514 10720 34985 45911
283 45911 35877 10879 -16722 -38338 -47172 -40230 -24758 -6234 9527 14629 3864 -15057 -28103
296 -28103 -25359 -14136 -2286 9662 18640 16903 1214 -23011 -39956 -40130 -26279 -5857 11189
309 11189 21600 24082 14817 -6160 -25459 -32239 -21096 -2613 11618 20405 19987 8247 -9517
322 -9517 -25946 -31733 -22155 -1801 20818 36481 36648 25442 9048 -8147 -19776 -19920 -9023
$$ packed form
231e531j9790l790R789K0625K6644K2663R143q704k2712k6191k0258m163J1854
244a0421J4321Q012L024k499j1145j6203p751J2913K6360K3657J2948k637j7017
257C3562k5601l0955k5465n324J7425L0932K5670J1007J835o477j5588j7661r374
270a6014M729J2771P472k176j1854j7383j4780m713O692J8742K7234K4265J0926
283D5911j0034k4998k7601k1616q834O942J5472J8524J5761N102j0765j8921j3046
296b8103K744J1223J1850J1948Q978j737j5689k4225j6945j74J3851K0422J7046
309A1189J0411K482r265k0977j9299o780J1143J8483J4231Q787m18j1740j7764
322i517j6429n787R578K0354K2619J5663J67j1206j6394j7195j1629j44J0897
$$ plain form
335 -9023 7885 21373 22908 13250 -714 -9726 -9183 -3216 8613 26233 40505 39383 20699 -5063
349 -5063 -22217 -27735 -22907 -7794 13808 35735 46893 40160 20268 263 -11746 -13183 -8900
362 -8900 -1703 8362 13942 8710 -4550 -16660 -17985 -8106 8577 26394 38868 38435 26773 6393
376 6393 -18265 -36482 -40209 -28988 -9035 7118 15058 14421 5837 -4652 -13654 -16811 -8067 8368
390 8368 20847 20993 7641 -9910 -24628 -36826 -41542 -32244 -11491 10219 21172 16935 6318
403 6318 -5139 -14254 -17873 -14630 -4778 8215 12253 3030 -14562 -31426 -38889 -37007 -25856 -5525
417 -5525 15971 29777 31392 20167 2287 -13660 -21065 -17569 -8240 489 6489 6408 -1735 -14852
431 -14852 -25944 -27215 -14335 4028 20102 28920 29035 21935 8888 -7167 -16207 -10583 3830
$$ packed form
335i023J6908J3488J535r658j3964r012N43N967J1829J7620J4272j122j8684k5762
349e063j7154n518M828J5113K1602K1927J1158o733j9892k0005j2009j437M283
362h900P197J0065N580n232j3260j2110j325R879J6683J7817J2474m33j1662k0380
376F393k4658j8217l727J1221J9953J6153P940o37q584j0489r002l157Q744J6435
390H368J2479J46j3352j7551j4718j2198m716R298K0753K1710J0953m237j0617
403F318j1457r115l619L243R852J2993M038r223j7592j6864p463J882J1151K0331
417e525K1496J3806J615j1225j7880j5947p405L496R329Q729O000q1q143j3117
431a4852j1092j271J2880J8363J6074Q818J15p100j3047j6055r040N624J4413
$$ plain form
444 3830 16981 19878 14281 4763 -8654 -22636 -28603 -21022 106 23211 38219 41865 34870 22703
458 22703 8484 -5472 -11575 -6687 1977 7667 6078 -1411 -9876 -14824 -12639 -781 15451 31891
472 31891 43671 43468 29104 5740 -17209 -29672 -29698 -21751 -8083 7160 17634 19287 10218 -2999
486 -2999 -9239 -5799 2799 10551 14641 15365 10719 -3713 -20383 -29242 -24647 -10927 2828 11654
500 11654 14840 9979 -1972 -17693 -29312 -28790 -16159 435 13486 19129 15840 6762 -7204
513 -7204 -19086 -23330 -18972 -8437 2147 5699 577 -10353 -21249 -25970 -25485 -17436 -2680 13750
527 13750 23605 21385 9258 -3624 -11252 -13624 -11580 -4684 3636 9254 4691 -10094 -25583 -32259
541 -32259 -27425 -14686 1407 20896 37297 41374 32123 14840 -1957 -11607 -14735 -13827 -9837 -6221
$$ packed form
444C830J3151K897n597r518j3417j3982n967P581K1128K3105J5008L646o995j2167
458B2703j4219j3956o103M888Q664N690j589p489q465m948K185J1858J6232J6440
472C1891J1780k03j4364k3364k2949j2463k6P947J3668J5243J0474J653r069j3217
486b999o240L440Q598P752M090P24m646j4432j6670q859M595J3720J3755Q826
500A1654L186m861j1951j5721j1619N22J2631J6594J3051N643l289r078j3966
513g204j1882m244M358J0535J0584L552n122j0930j0896m721M85Q049J4756J6430
527A3750R855k220j2127j2882p628k372K044O896Q320N618m563j4785j5489o676
541c2259M834J2739J6093J9489J6401M077r251j7283j6797r650l128R08L990L616
$$ plain form
555 -6221 -4515 -6670 -11849 -12767 -4452 10613 28941 43459 47080 40562 23473 1210 -19876 -34857
569 -34857 -36970 -25303 -7771 7932 16249 18611 18236 15649 11694 11954 17532 24620 26386 16268
583 16268 -73 -15564 -26448 -30322 -26820 -14326 6086 23218 28960 23723 13004 2800 -3772
596 -3772 -6231 -3227 4365 10795 11393 3171 -9873 -20611 -24092 -20204 -10149 2446 13326 18988
610 18988 15145 4327 -8661 -18145 -18682 -11705 -2988 4209 5644 2868 -3866 -14085 -21561 -19495
624 -19495 -8992 4515 12225 12394 7675 -1845 -14309 -25011 -28203 -19673 -4473 7336 11924 10281
638 10281 4245 -3663 -11819 -15951 -11514 -685 8269 10864 5907 -2929 -11119 -17129 -17157 -10430 839
653 839 13395 20130 17441 7725 -4075 -12670 -14214 -9717 -1406 8793 16006 17043 10307 -1520
$$ packed form
555f221J706k155n179r18Q315J5065J8328J4518L621o518j7089k2263k1086j4981
569c4857k113J1667J7532J5703Q317K362l75k587l955K60N578P088J766j0118
583A6268j6341j5491j0884l874L502J2494K0412J7132N742n237j0719j0204o572
596c772k459L004P592O430N98q222j3044j0738l481L888J0055J2595J0880N662
610A8988l843j0818j2988r484n37O977Q717P197J435k776o734j0219p476K066
624a9495J0503J3507P710J69m719r520j2464j0702l192Q530J5200J1809M588j643
638A0281o036p908q156m132M437J0829Q954K595m957q836q190o010k8O727J1269
653H39J2556O735k689r716j1800q595j544M497Q311J0199P213J037o736j1827
$$ plain form
667 -1520 -9882 -10653 -4161 4605 12477 18262 20093 13651 1153 -9444 -12630 -6471 2715 10179 15085
682 15085 16141 12000 2495 -7765 -11544 -5041 6486 15975 21088 20121 14649 4157 -7501 -14511
696 -14511 -13076 -5038 5294 11745 12387 8021 267 -6440 -9953 -8025 -589 10082 17420 17732 9946
711 9946 -1720 -11276 -15905 -15963 -11158 -2152 7042 11229 6167 -3716 -11279 -13718 -10739 -5723 1965
726 1965 9616 12630 7468 -4760 -17088 -21931 -18971 -12496 -3417 5385 11118 10768 2202 -8388 -14402
741 -14402 -14351 -9231 -2218 2184 3877 1262 -6137 -13765 -18824 -17032 -8081 4267 13538 16792 13345
756 13345 5244 -4227 -13163 -17263 -13890 -5420 4719 9154 6076 1237 -3972 -7593 -8056 -4735 4211
771 4211 14532 18175 13784 4187 -4945 -9818 -11316 -8164 -124 10546 17416 17108 9350 -115 -5199
$$ packed form
667a520q362p71O492Q766P872N785J831o442j2498j0597l186O159R186P464M906
682A5085J056m141r505j0260l779O503J1527R489N113r67n472j0492j1658p010
696a4511J435Q038J0332O451O42m366p754o707l513J928P436J0671P338L12p786
711I946j1666r556m629n8M805R006R194M187n062r883p563k439K979N016P688
726A965P651L014n162j2228j2328m843K960O475R079Q802N733l50q566j0590o014
741a4402N1N120P013M402J693k615p399p628n059J792Q951J2348R271L254l447
756A3345q101r471q936m100L373Q470J0139M435l078m839n209l621m63L321Q946
771D211J0321L643m391r597r132m873j498L152Q040J0670O870l08p758r465n084
$$ plain form
786 -5199 -6845 -4019 2141 9682 15312 15179 8332 -847 -8021 -9268 -4515 3126 11008 16399 16653 12304
802 12304 3729 -5429 -9116 -6243 1468 8412 11588 10352 6609 -609 -8660 -12964 -10468 -668 9107
817 9107 13554 12822 8346 1831 -5558 -11981 -12210 -4785 4000 9347 8515 2671 -4047 -9981 -14326 -13797
833 -13797 -7540 1957 9173 9733 4975 -2908 -9892 -13656 -12984 -8746 -1417 5098 7425 3960 -4254
848 -4254 -12309 -15217 -13400 -7358 36 5943 9606 7549 -381 -10103 -16013 -15053 -9110 -2922 2190
863 2190 5735 5294 664 -6626 -11740 -9546 -1952 6179 11299 12150 9242 3138 -6470 -14831 -16375 -11527
879 -11527 -2802 5383 8610 8558 5842 779 -3045 -3604 547 8607 14344 16269 11920 3639 -4839 -10741
895 -10741 -12585 -9606 -2470 6607 13847 14342 9462 3400 -544 -711 1841 5609 10601 13940 12140
$$ packed form
786e199j646K826O160P541N630j33o847r179p174j247M753P641P882N391K54m349
802A2304q575r158l687K873P711O944L176j236l743p218q051m304K496R800R775
817I107M447p32m476o515p389o423k29P425Q785N347q32n844o718n934m345N29
833a3797O257R497P216N60m758p883o984l764O72M238P329O515K327l465q214
848d254q055k908J817O042P394N907L663k057p930r722n910R60N943O188N112
863B190L545m41m630p290n114K194P594Q131N120Q51k908o104r608q361j544M848
879a1527Q725Q185L227n2k716n063l824n59M151Q060N737J925m349q281q478n902
895a0741j844K979P136R077P240M95m880o062l944j67K552L768M992L339j800
$$ plain form
910 12140 4488 -5408 -11455 -11304 -6676 -345 6975 13471 15753 12127 3319 -3663 -5576 -3177 1368
925 1368 5328 7622 7580 3095 -4974 -11640 -14210 -9739 -1917 5760 10681 11553 8040 1903 -4757 -9572
941 -9572 -9053 -4705 1826 5562 3666 -1328 -7020 -12171 -14865 -13949 -7950 1633 8810 10079 5856 -791
957 -791 -5904 -8804 -9748 -7379 -835 4796 5311 262 -7492 -12701 -14456 -13125 -8620 -1411 6105 9825
973 9825 7494 1022 -5167 -8599 -7181 -3558 1371 5903 7649 5405 -998 -8257 -12611 -11728 -6007
988 -6007 1593 7347 9806 9493 5568 -509 -5588 -6866 -2113 4679 9100 9925 7255 3006 -2499 -7413
1004 -7413 -8793 -4137 3958 11463 13482 11003 6693 1735 -3107 -5699 -3468 2861 9378 11779 9034
1019 9034 3901 -1196 -5243 -6230 -4015 1976 8842 12806 12118 6797 -93 -4547 -6042 -4033 522
$$ packed form
910A2140p652r896o047J51M628O331P320O496K282l626q808o982j913K399M545
925A368L960K294m2m485q069o666k570M471P822P677M921Q72l513o137o660m815
941i572N19M348O531L736j896m994n692n151k694R16N999R583P177J269m223o647
957g91n113k900r44K369O544N631N15n049p754n209j755J331M505P209P516L720
973I825k331o472o189l432J418L623M929M532J746k244o403p259m354Q83N721
988f007P600N754K459l13l925o077n079j278M753O792M421Q25k670m249n505m914
1004g413j380M656Q095P505K019k479m310m958m842k592K231O329O517K401k745
1019I034n133n097m047r87K215N991O866L964o88n321o890m454j495K009M555
$$ plain form
1034 522 5039 8410 8717 3734 -3160 -8659 -10012 -6254 -961 4063 8223 9264 6274 534 -6297
1049 -6297 -9067 -5934 -1003 3100 5003 4336 1403 -4595 -10998 -14256 -11630 -5199 1539 5163 5762
1064 5762 3503 -572 -5746 -9196 -8545 -3389 2487 5543 4726 266 -5515 -10164 -13412 -12546 -7835 -1358
1080 -1358 4631 6680 4168 -755 -4858 -6885 -5479 -3052 1401 6198 7586 3846 -2749 -9336 -10919
1095 -10919 -8724 -5164 692 6085 9811 9060 3611 -2753 -5498 -4368 -1050 2523 5814 7800 6871
1110 6871 1878 -4167 -7781 -6442 -1431 4451 9364 11613 10646 6731 1245 -3892 -5230 -1888 3060
1125 3060 7316 8553 6687 2658 -1862 -5314 -6156 -3506 3059 9809 12204 10947 5975 1498 -2105
1140 -2105 -4212 -3938 142 5029 7947 6236 326 -4598 -7090 -7311 -5156 -433 5380 10220 9672 4614
$$ packed form
1034E22M517L371L07m983o894n499j353L758N293N024M160J041k990n740o831
1049f297k770L133M931M103J903o67k933n998o403l258K626O431O738L624N99
1064E762k259m075n174l450O51N156N876L056q17m460n781m649l248Q66M711O477
1080a358N989K049k512m923m103k027J406K427M453M797J388l740o595o587j583
1095a0919K195L560N856N393L726p51n449o364k745J130L318L573L291J986r29
1110F871m993o045l614J339N011N882M913K249r67l915n486n137j338L342M948
1125C060M256J237j866m029m520l452q42K650O565O750K395j257m972m477l603
1140b105k107K74M080M887K918j711n910m924k492k21K155M723N813M840n48n058
$$ plain form
1156 4614 -1356 -5785 -6756 -5647 -2713 1078 4547 4632 1433 -4339 -8951 -9560 -7164 -2692 2025 4653
1172 4653 5321 2907 -2732 -7794 -10232 -8839 -3563 1100 3422 3406 1574 -2470 -6609 -10117 -8786 -3933
1188 -3933 2056 4966 4330 1176 -2414 -6279 -9180 -9322 -5334 1093 5469 5319 2940 -1022 -4404 -5978
1204 -5978 -5851 -2627 2644 6839 7332 4285 -1160 -5114 -6758 -6622 -3620 1466 5798 8335 7104 2668
1220 2668 -1786 -4089 -3144 120 3678 6908 8749 7757 3413 -1856 -5480 -4611 -684 3701 6876 7983
1236 7983 7516 4624 -778 -4653 -4498 -1241 3868 6695 7723 6963 4403 57 -3722 -5002 -2339 3070
1252 3070 6879 7990 6351 2730 -1260 -4779 -6576 -4564 -162 4309 6957 5255 2026 -2066 -4787
1267 -4787 -5817 -4348 -824 3502 6619 5945 1783 -3446 -7099 -7163 -5821 -3145 941 3608 4338 1053
$$ packed form
1156D614n970m429r71J109K934L791L469Q5l199n772m612o09K396M472M717K628
1172D653O68k414n639n062k438J393N276M663K322j6j832m044m139l508J331M853
1188c933N989K910o36l154l590l865k901j42L988O427M376j50k379l962l382j574
1204e978J27L224N271M195M93l047n445l954j644J36L002N086M332K537j231m436
1220B668m454k303R45L264L558L230J841r92m344n269l624Q69L927M385L175J107
1236G983m67k892n402l875J55L257N109K827J028p60k560m346l779j280K663N409
1252C070L809J111j639l621l990l519j797K012M402M471K648j702l229m092k721
1267d787j030J469L524M326L117o74m162n229l653o4J342K676M086K667P30l285
$$ plain form
1283 1053 -4305 -7870 -8130 -5785 -2450 603 3382 4461 1955 -3086 -7167 -8522 -6106 -2453 605
1298 605 2984 3558 1573 -2316 -6573 -8678 -6765 -2791 1278 3945 3706 2079 -1366 -4657 -7068 -5892
1314 -5892 -2445 2869 5667 5820 3528 230 -2890 -5174 -5243 -2837 1789 5197 6180 3434 -507 -3179
1330 -3179 -4262 -3934 -1288 2812 7530 9324 6901 2581 -1119 -2783 -2230 -828 2211 5591 6842
1345 6842 5295 1055 -2903 -4566 -3095 -182 3263 6746 8334 7753 4216 -585 -3574 -3679 -1319
1360 -1319 2100 4667 6008 5141 2490 -891 -4339 -4871 -2231 2189 5205 5900 4217 1655 -1613 -5106
1376 -5106 -6146 -4535 -413 3914 4991 3502 590 -2025 -4446 -5539 -4691 -1047 3140 4788 3412
1391 3412 -239 -3981 -6331 -7006 -6204 -3336 344 3147 3416 459 -3386 -5471 -6150 -4433 -1828 1095
$$ packed form
1283A053n358l565k60K345L335L053K779J079k506n041m081j355K416L653L058
1298F05K379N74j985l889m257k105J913L974M069K667k39j627l445l291k411J176
1314e892L447N314K798J53k292l298l120k284o9K406M626L408R83k746l941k672
1330c179j083L28K646M100M718J794k423m320l700j664N53J402L039L380J251
1345F842j547m240l958j663J471K913L445L483J588n81l537m801k989j05K360
1360a319L419K567J341q67k651l381l448n32K640M420L016O95j683k562l268l493
1376e106j040J611M122M327J077j489k912k615k421j093Q48L644M187J648j376
1391C412l651l742k350o75Q02K868L680K803K69k957l845k085o79J717K605K923
$$ plain form
1407 1095 3470 3525 1199 -2714 -6572 -7256 -5637 -2314 537 2280 2884 1580 -1770 -5927 -7114 -4954
1423 -4954 -1603 2398 4237 4565 3960 1228 -2037 -4462 -4152 -741 2510 3638 3289 1326 -909 -3614
1439 -3614 -4887 -4466 -720 3895 7180 7432 5147 2381 -389 -2176 -2656 -896 2185 5474 5908 3934
1455 3934 1135 -1886 -2980 -2277 -445 2317 5499 7342 6179 2861 -1154 -2362 -2001 47 1965
1470 1965 3745 5582 4768 1265 -2710 -4555 -3398 -455 2227 4392 6178 5883 3609 -579 -4215
1485 -4215 -4542 -2854 -388 1230 1896 907 -462 -2791 -5005 -4811 -2259 1813 4994 5821 4402 1686
1501 1686 -2076 -4544 -6705 -6626 -3900 -870 601 -305 -2264 -3966 -4515 -4613 -2795 -80 3522 6021
1517 6021 5260 1314 -2396 -4972 -6349 -6257 -4988 -2123 646 1085 -548 -2911 -4321 -3498 -1438 998
$$ packed form
1407A095K375N5k326l913l858o84J619L323K851J743O04j304l350m157j187K160
1423d954L351M001J839L28o05k732l265k425L10L411L251J128l49j963k235k705
1439c614j273M21L746M615L285K52k285k766k770j787m80J760L081L289M34j974
1455C934k799l021j094P03J832K762L182J843j163l318m015j208L61K048J918
1470A965J780J837q14l503l975j845J157K943K682K165J786k95k274m188l636
1485d215l27J688K466J618O66r89j369k329k214J94K552M072L181Q27j419k716
1501A686l762k468k161P9K726L030J471r06j959j702n49r8J818K715L602K499
1517F021p61l946l710k576j377R2J269K865K769M39j633k363j410Q23K060K436
$$ plain form
1533 998 3314 5321 5470 3047 -1486 -5038 -5949 -4898 -2316 -4 2295 3466 2823 305 -1453 -3152
1549 -3152 -1763 1140 3594 4888 4767 3211 1130 -1779 -3964 -3662 -764 2507 4702 4295 3132 1673
1565 1673 -121 -1442 -1539 712 4329 6543 6027 4300 1102 -1215 -2817 -3620 -2419 738 3670 5046
1581 5046 3624 1138 -563 -1104 -696 606 3085 4687 5575 4040 687 -2620 -4956 -4555 -3201 -1130
1597 -1130 922 2336 2599 959 -1390 -2688 -2143 24 2389 3485 3632 2671 399 -2969 -6582 -7280
1613 -7280 -5517 -2106 297 1341 1781 1284 -37 -2276 -3487 -2237 -333 1772 1532 -517 -2225 -4433
1629 -4433 -5394 -5928 -4148 -1024 2600 4704 3810 1670 -1124 -3059 -4330 -4644 -3205 -1048 1067 1459
1645 1459 132 -2031 -2779 -2209 -949 744 2466 3874 4400 2216 -928 -3363 -3982 -2607 -778 810
$$ packed form
1533I98K316K007J49k423m533l552r11J051K582K312K299J171o43k518j758j699
1549c152J389K903K454J294j21j556k081k909k185L02K898L271K195m07j163j459
1565A673j794j321r7K251L617K214n16j727l198k317j602q03J201L157K932J376
1581E046j422k486j701n41M08J302K479J602Q88j535l353l307k336M01J354K071
1597a130K052J414K63j640k349j298N45K167K365J096J47r61k272l368l613o98
1613g280J763L411K403J044M40m97j321k239j211J250J904K105k40k049j708k208
1629d433r61n34J780L124L624K104q94k140k794j935j271l14J439K157K115L92
1645A459j327k163p48N70J260J693J722J408N26k184l144k435o19J375J829J588
$$ plain form
1661 810 2415 3601 2752 648 -1970 -2675 -1005 1071 3091 3923 4105 3457 1286 -1057 -2511 -1898 170
1678 170 2481 3802 3868 3091 1726 -273 -1524 -1340 140 2415 3766 3697 2162 375 -1183 -2102 -2060
1695 -2060 -457 2335 4790 5422 3356 1014 -1399 -2453 -2909 -2471 -534 1575 2730 1846 -104 -2137
1711 -2137 -2726 -1948 -928 514 1946 2946 2736 -11 -2727 -3850 -3111 -1662 -203 969 1952 1503
1727 1503 -194 -2694 -4593 -4584 -2802 -797 944 1539 1331 245 -1420 -3694 -4079 -3029 -1461 915
1743 915 1315 667 -384 -1527 -2955 -3338 -2842 -588 1908 2367 1089 -842 -2263 -3377 -4081 -3290 -965
1760 -965 2056 3631 3717 1960 110 -1097 -1516 -1263 -753 1198 2218 1932 586 -1512 -2600 -2282 -850
1777 -850 316 2353 3900 4386 3186 1155 -1079 -1627 -884 438 1592 2221 2910 2364 419 -1359 -2089
$$ packed form
1661H10J605J186q49k104k618p05J670K076K020Q32J82o48k171k343j454O13K068
1678A70K311J321O6p77j365j999j251J84J480K275J351o9j535j787j558r19M2
1695b060J603K792K455O32k066k342k413j054m56M38J937K109J155q84j950k033
1711b137n89P78J020J442J432J000k10k747k716j123P39J449J459J172R83m49
1727A503j697k500j899RJ782K005J741N95k08j086j665k274l85J050J568K376
1743I15M00o48j051j143j428l83M96K254K496M59j278j931j421j114p04P91K325
1760i65L021J575Q6j757j850j207m19K53N10J951J020k86j346k098j088L18J432
1777h50J166K037J547M86j200k031k234n48P43J322J154O29O89n46j945j778p30
$$ plain form
1794 -2089 -503 1541 3292 4226 3949 3065 1118 -1176 -3166 -3045 -1066 693 1881 2494 2215 1976 1042
1811 1042 192 319 1082 2847 3080 1873 -337 -2655 -4348 -4820 -4444 -2320 623 3310 4598 4438 2339
1828 2339 282 -1340 -2155 -2207 -2459 -1436 -595 -909 -2222 -3484 -3066 -1458 61 1388 2675 3204 2348
1845 2348 -16 -3148 -5280 -4972 -3600 -2067 -831 383 975 838 -1012 -2236 -1737 -426 1236 1914
1861 1914 1902 965 -345 -2237 -4211 -4779 -3803 -1518 138 1131 1458 932 530 -39 -84 471 1642 3326
1879 3326 3505 1725 -452 -2331 -3663 -3999 -3540 -1723 882 3484 4250 3652 2130 1240 977 479 349
1896 349 1085 1288 1378 -9 -2049 -2106 -1566 -11 1775 3279 4095 4271 2892 1041 -1385 -2445 -1638 -875
1914 -875 697 1590 2393 2168 1330 -178 -680 -533 686 2018 2139 1762 941 58 -1213 -2363 -2031 -749
$$ packed form
1794b089J586K044J751R34k77q84j947k294j990J21J979J759J188O13k79k39r34
1811A042q50J27P63J765K33j207k210k318j693m72L76K124K943K687J288j60k099
1828B339k057j622q15n2k52J023Q41l14j313j262M18J608J519J327J287N29q56
1845B348k364l132k132L08J372J533J236J214N92j37j850j224M99J311J662O78
1861A914j2r37j310j892j974n68R76K285J656R93L27n26m02n69m5N55J171J684
1879C326J79j780k177j879j332l36M59J817K605K602P66n98j522q90k63m98j30
1896C49P36K03R0j387k040n7N40J555J786J504Q16J76j379j851k426j060Q07P63
1914h75J572Q93Q03k25q38j508n02J47J219J332J21l77q21q83j271j150L32J282
$$ plain form
1932 -749 1171 2152 1572 619 -655 -1477 -2536 -2598 -1678 111 1739 2039 855 -622 -1100 -1966 -1945 -1659
1950 -1659 -531 1009 1679 265 -1329 -2616 -3025 -2699 -2356 -1058 253 1027 824 -429 -1486 -2151 -1244
1967 -1244 -133 869 1468 1733 1058 -480 -2738 -4251 -4435 -3060 -1318 -209 719 1629 1489 1129 29
1984 29 -173 653 1658 1955 1552 175 -1150 -2021 -2865 -3850 -2345 -299 2151 3093 3176 2627 2033 1127 -69
2003 -69 -353 27 476 885 418 -885 -1771 -1655 -927 131 1564 3411 4573 4693 3107 1015 -691 -1547
2021 -1547 -1299 -1630 -815 444 1042 918 224 -570 -109 1315 1880 2604 2800 2648 1720 -156 -1851 -2578
2039 -2578 -2430 -898 188 896 1083 856 446 -640 -1372 -1562 -266 1176 1154 1137 648 -523 -1167 -1915
2057 -1915 -2287 -1260 -35 895 972 -195 -821 -1657 -2215 -1642 -1422 -435 936 1178 297 -994 -1892 -2040
$$ packed form
1932g49J920R81n80r53j274q22j059o2R20J789J628L00j184j477m78q66K1K86
1950a659J128J540O70j414j594j287m09L26L43J298J311P74k03j253j057o65R07
1967a244J111J002N99K65o75j538k258j513j84J375J742J109R28R10j40l60j100
1984B9k02Q26J005K97m03j377j325q71q44r85J505K046K450R42Q3n49n94r06j196
2003f9k84L80M49M09m67j303q86J16P28J058J433J847J162J20j586k092j706q56
2021a547K48l31Q15J259N98j24o94p94M61J424N65P24J96j52r28j876j695p27
2039b578J48J532J086P08J87k27m10j086p32j90J296J442k2j7m89j171o44p48
2057a915l72J027J225R30P7j167o26q36n58N73K20R87J371K42q81j291q98j48
$$ plain form
2075 -2040 -1554 -1454 -315 986 1466 868 -378 -1405 -1849 -1732 -1408 -791 199 885 610 334 -834 -1509
2093 -1509 -779 -154 226 594 1284 909 104 -1237 -1668 -1222 125 1214 2039 2347 1786 1194 266 -1105
2111 -1105 -2038 -1715 -572 536 904 1008 860 881 655 305 661 1611 2474 2379 1397 156 -908 -1275 -1743
2130 -1743 -1348 -44 1641 2592 2786 1557 426 -125 -415 -474 -580 374 1094 1050 770 -449 -645 -592 308
2149 308 623 1307 1510 1395 906 -561 -1599 -2367 -1723 -1058 118 573 746 806 209 -957 -1528 -1144 154
2168 154 768 1088 712 278 -485 -1367 -2353 -2574 -1407 -153 278 82 -276 -646 -629 -1211 -1374 -827 386
2187 386 719 678 -50 -864 -1382 -1846 -1726 -1142 -109 958 1666 566 -327 -1447 -1555 -1063 -870 -706 490
2206 490 1303 759 216 -661 -837 -672 -192 555 673 1200 1301 682 -485 -747 -769 -226 686 863 973 1162
$$ packed form
2075b040M86J00J139J301M80n98j246j027m44J17L24O17R90O86k75k76j168o75
2093a509P30O25L80L68O90l75q05j341m31M46J347J089Q25L08n61n92r28j371
2111a105r33L23J143J108L68J04j48K1k26l50L56R50Q63r5r82j241j064l67m68
2130a743L95J304J685R51J94j229j131n51k90n9j06R54P20m4k80j219j96N3R00
2149C08L15O84K03j15m89j467j038p68O44O65J176M55J73O0n97j166n71L84J298
2168A54O14L20l76m34p63q82r86k21J167J254M31j96l58l70J7n82j63N47J213
2187C86L33m1p28q14n18m64J20N84J033J067P08j100q93j120j08M92J93J64J196
2206D90Q13n44n43q77j76J65M80P47J18N27J01o19j167k62k2N43R12J77J10J89
$$ plain form
2226 1162 279 -428 -1110 -1288 -71 1368 1975 2161 2203 1671 1020 14 -701 -555 185 771 915 600 204
2245 204 -150 -351 -272 79 703 1605 2209 1594 654 -259 -823 -756 -852 -455 638 1226 1563 811 -320 -670
2265 -670 -476 -590 -222 188 555 963 74 -957 -1523 -1521 -1141 -543 113 838 786 776 67 -782 -963 -563 79
2286 79 426 207 -491 -729 -1509 -2350 -2447 -2128 -700 723 1231 1178 1384 806 -32 -672 -1833 -1469 -796 -352
2306 -352 -701 -1031 -816 -854 -437 -221 478 1302 1994 1532 525 -776 -1617 -1997 -2351 -1808 -640 483 1496
2325 1496 1912 1378 1158 881 699 668 379 175 -24 -274 -951 -2144 -1861 -1291 145 1249 1778 2415 2472
2344 2472 1898 1191 29 -469 217 150 169 279 -97 -142 -396 -1008 -727 268 1019 2055 2186 1847 1210 822
2364 822 -297 -843 -1044 -358 -16 -196 49 -546 -721 -103 -26 387 1133 2025 2202 1496 374 -691 -1628
$$ packed form
2226A162q83p07o82j78J217J439O07J86M2n32o51j006p15J46P40N86J44l15l96
2245B04l54k01P9L51O24R02O04o15r40r13n64O7r6L97J093N88L37p52j131l50
2265f70J94j14L68M10L67M08q89j031n66KL80N98O56P25n2j0p09q49j81M00O42
2286G9L47k19o98k38p80q41r7L19J428J423N08n3K06n78q38o40j161L64O73M44
2306c52l49l30K15l8M17K16O99Q24O92m62j007j301q41l80l54N43J168J123J013
2325A496M16n34k20k77j82l1k89k04j99k50o77j193K83N70J436J104N29O37N7
2344B472n74p07j162m98O86o7J9J10l76m5k54o12K81R95P51J036J31l39o37l88
2364H22j119n46k01O86L42j80K45n95j75O18P7M13P46Q92J77p06j122j065r37
$$ plain form
2383 -1628 -2344 -2353 -2198 -1470 -302 416 493 519 444 930 1126 1002 795 579 -25 -605 -2147 -3200 -2724 -2320
2403 -2320 -1210 -387 643 1175 1620 1033 541 -424 -368 -90 -451 -652 -611 -912 -957 -1346 -1690 -1006 -213 924
2423 924 1504 1158 890 546 -120 -845 -1309 -776 -440 94 310 47 -340 -94 70 334 134 1011 1791 1726
2443 1726 640 -147 -314 -882 -905 -1139 -460 189 858 891 473 510 441 764 1041 1585 1412 1177 888 423 -963
2464 -963 -1396 -1068 -466 286 439 1050 1502 1471 556 30 25 -108 490 169 35 -134 -357 -489 -1006 -711 18
2485 18 968 1390 1623 1128 674 400 -481 -1101 -1797 -1144 -461 1 -73 -275 -387 -57 76 -2 176 1121 1037
2506 1037 755 -233 -829 -1474 -1521 -1622 -1212 -779 -221 716 52 -113 -446 -270 -90 131 178 -30 243 -35
2526 -35 -433 -1407 -1438 -591 -475 -123 299 386 710 203 -246 -815 -570 -194 416 153 56 -44 -84 -283 -781 -667
$$ packed form
2383a628p16rJ55P28J168P18P7K6p5M86J96j24k07k16o04n80j542j053M76M04
2403b320J110Q23J030N32M45n87m92r65N6K78l61k01M1l01m5l89l44O84P93J137
2423I24N80l46k68l44o66p25m64N33L36N34K16k63l87K46J64K64k00Q77P80o5
2443A726j086p87j67n68k3k34O79O49O69L3m18L7o9L23K77N44j73k35k89m65j386
2464i63m33L28O02P52J53O11M52l1r15n26nj33N98l21j34j69k23j32n17K95P29
2485A8R50M22K33m95m54k74q81o20o96O53O83M62p4k02j12L30J33p8J78R45q4
2506A037k82r88n96o45m7j01M10M33N58R37o64j65l33J76J80K21M7k08K73k78
2526c5l98r74l1Q47J16L52M22Q7L24n07m49n69K45L76O10k63r7j00m0j99m98J14
$$ plain form
2548 -667 -5 552 1222 1402 718 279 276 -143 -540 -319 -181 334 322 -121 -250 72 -192 -42 605 701 1209
$$ packed form
2548f67O62N57O70J80o84m39lm19l97K21J38N15j2m43j29L22k64J50O47R6N08
$$ [...]
8191A00
##END NTUPLES=NMR FID
##END=
