##TITLE=1H_Pr T-3
 DMSO, 8 sc, 
 26.08.2021
##JCAMPDX= 6.0         $$ Bruker NMR JCAMP-DX V2.0
##DATA TYPE= NMR FID
##DATA CLASS= NTUPLES
##ORIGIN= UXNMR, Bruker Analytische Messtechnik GmbH
##OWNER= root
$$ XWIN-NMR		Version 3.5
$$ Thu Aug 26 12:08:56 2021 Russian Standard Time (UT+4h)  she@DPX200
##.OBSERVE FREQUENCY= 200.131506
##.OBSERVE NUCLEUS= ^1H
##.DELAY= (6, 6)
##.ACQUISITION MODE= SIMULTANEOUS
##.ACQUISITION SCHEME= undefined
##.AVERAGES= 8
##.DIGITISER RES= 18
##SPECTROMETER/DATA SYSTEM= spect
##.PULSE SEQUENCE= zg30
##.SOLVENT NAME= DMSO
##.SHIFT REFERENCE= (INTERNAL, DMSO, 0, 15.7039)
##AUDIT TRAIL= $$ (NUMBER, WHEN, WHO, WHERE, WHAT)
$$ ##TITLE= Audit trail, XWIN-NMR		Version 3.5
$$ ##JCAMPDX= 5.01
$$ ##ORIGIN= Bruker BioSpin GmbH
$$ ##OWNER= she
$$ F:/spectra/data/she/nmr/H-F/1/audita.txt
$$ ##AUDIT TRAIL=  $$ (NUMBER, WHEN, WHO, WHERE, WHAT)
(   1,<2021-08-26 12:07:46.79 +0400>,<she>,<DPX200>,
      <created by zg, POWCHK disabled, PULCHK disabled
       configuration hash MD5:
       00 E9 B6 7A A2 85 ED C7 34 08 36 98 17 FE 4E 26
       data hash MD5: 16K
       CB 1D 20 0F 8D 9E 18 83 C6 01 AD 0C B8 DC 13 02>)
$$ ##END=
$$ 
$$ hash MD5
$$ E0 74 0E 9D 39 8F C6 AE 9F 1E A3 CF 40 81 6A D0
##$RELAX= 
##$RELAX= 
##$RELAX= 
##$RELAX= 
##$RELAX= 
##$RELAX= 
$$ Bruker specific parameters
$$ --------------------------
##$DU= <F:/spectra>
##$EXPNO= 1
##$NAME= <H-F>
##$PROCNO= 1
##$TYPE= <nmr>
##$USER= <she>
##$AMP= (0..31)
100 100 100 100 100 100 100 100 100 100 100 100 100 100 100 100 100 100 
100 100 100 100 100 100 100 100 100 100 100 100 100 100 
##$AQSEQ= 0
##$AQ_mod= 1
##$AUNM= <au_zg>
##$AUTOPOS= <>
##$BF1= 200.13
##$BF2= 200.13
##$BF3= 200.13
##$BF4= 200.13
##$BF5= 200.13
##$BF6= 200.13
##$BF7= 200.13
##$BF8= 200.13
##$BYTORDA= 1
##$CFDGTYP= 0
##$CFRGTYP= 5
##$CHEMSTR= <none>
##$CNST= (0..31)
1 1 145 1 1 1 1 1 1 1 1 1 1 1 1 1 1 1 1 1 1 1 1 1 1 1 1 1 1 1 1 1 
##$CPDPRG= <>
##$CPDPRG1= <>
##$CPDPRG2= <>
##$CPDPRG3= <>
##$CPDPRG4= <mlev>
##$CPDPRG5= <mlev>
##$CPDPRG6= <mlev>
##$CPDPRG7= <mlev>
##$CPDPRG8= <mlev>
##$CPDPRGB= <>
##$CPDPRGT= <>
##$D= (0..31)
0 1.2 0 0 0 0 0 0 0 0.06 0 0.03 0 0 0 0 0.0002 0 0 0 0 0 0 0 0 0 0 0 0 
0 0 0 
##$DATE= 1629965266
##$DBL= (0..7)
120 120 120 120 120 120 120 120 
##$DBP= (0..7)
150 150 150 150 150 150 150 150 
##$DBP07= 0
##$DBPNAM0= <>
##$DBPNAM1= <>
##$DBPNAM2= <>
##$DBPNAM3= <>
##$DBPNAM4= <>
##$DBPNAM5= <>
##$DBPNAM6= <>
##$DBPNAM7= <>
##$DBPOAL= (0..7)
0.5 0.5 0.5 0.5 0.5 0.5 0.5 0.5 
##$DBPOFFS= (0..7)
0 0 0 0 0 0 0 0 
##$DE= 6
##$DECBNUC= <off>
##$DECIM= 32
##$DECNUC= <off>
##$DECSTAT= 4
##$DIGMOD= 1
##$DIGTYP= 9
##$DL= (0..7)
0 120 120 120 120 120 120 120 
##$DP= (0..7)
150 150 150 150 150 150 150 150 
##$DP07= 0
##$DPNAME0= <>
##$DPNAME1= <>
##$DPNAME2= <>
##$DPNAME3= <>
##$DPNAME4= <>
##$DPNAME5= <>
##$DPNAME6= <>
##$DPNAME7= <>
##$DPOAL= (0..7)
0.5 0.5 0.5 0.5 0.5 0.5 0.5 0.5 
##$DPOFFS= (0..7)
0 0 0 0 0 0 0 0 
##$DQDMODE= 0
##$DR= 18
##$DS= 0
##$DSLIST= <SSSSSSSSSSSSSSS>
$$ [...]
##$SUBNAM2= <"">
##$SUBNAM3= <"">
##$SUBNAM4= <"">
##$SUBNAM5= <"">
##$SUBNAM6= <"">
##$SUBNAM7= <"">
##$SUBNAM8= <"">
##$SUBNAM9= <"">
##$SW= 20.0188882624521
##$SWIBOX= (0..15)
0 0 2 0 0 0 0 0 0 0 0 0 0 0 0 0 
##$SW_h= 4006.41025641026
##$TD= 16384
##$TD0= 1
##$TE= 0
##$TE2= 300
##$TE3= 300
##$TEG= 300
##$TL= (0..7)
0 120 120 120 120 120 120 120 
##$TP= (0..7)
150 150 150 150 150 150 150 150 
##$TP07= 0
##$TPNAME0= <>
##$TPNAME1= <>
##$TPNAME2= <>
##$TPNAME3= <>
##$TPNAME4= <>
##$TPNAME5= <>
##$TPNAME6= <>
##$TPNAME7= <>
##$TPOAL= (0..7)
0.5 0.5 0.5 0.5 0.5 0.5 0.5 0.5 
##$TPOFFS= (0..7)
0 0 0 0 0 0 0 0 
##$TUNHIN= 0
##$TUNHOUT= 0
##$TUNXOUT= 0
##$USERA1= <user>
##$USERA2= <user>
##$USERA3= <user>
##$USERA4= <user>
##$USERA5= <user>
##$V9= 5
##$VALIST= <valist>
##$VCLIST= <CCCCCCCCCCCCCCC>
##$VD= 0
##$VDLIST= <DDDDDDDDDDDDDDD>
##$VPLIST= <PPPPPPPPPPPPPPP>
##$VTLIST= <TTTTTTTTTTTTTTT>
##$WBST= 1024
##$WBSW= 4
##$XGAIN= (0..3)
0 0 0 0 
##$XL= 0
##$YL= 0
##$YMAX_a= 165383
##$YMIN_a= -173638
##$ZGOPTNS= <>
##$ZL1= 120
##$ZL2= 120
##$ZL3= 120
##$ZL4= 120
##$ABSF1= 10
##$ABSF2= 0
##$ABSG= 5
##$ABSL= 3
##$ALPHA= 0
##$AQORDER= 0
##$ASSFAC= 0
##$ASSFACI= 0
##$ASSFACX= 0
##$ASSWID= 0
##$AUNMP= <proc_1d>
##$AZFE= 0.1
##$AZFW= 0.1
##$BCFW= 1
##$BC_mod= 2
##$BYTORDP= 1
##$COROFFS= 0
##$CY= 11.3945322036743
##$DATMOD= 1
##$DC= 2
##$DFILT= <>
##$DTYPP= 0
##$F1P= 2.36226072786647
##$F2P= -0.459571619588291
##$FCOR= 0.5
##$FTSIZE= 0
##$FT_mod= 4
##$GAMMA= 1
##$GB= 0.15
##$INTBC= 1
##$INTSCL= 1
##$ISEN= 128
##$LB= 0.24
##$LEV0= 0
##$LPBIN= 0
##$MAXI= 10000
##$MC2= 0
##$MEAN= 0
##$ME_mod= 0
##$MI= 1.114404
##$NCOEF= 0
##$NC_proc= 0
##$NLEV= 6
##$NOISF1= 3.799351
##$NOISF2= 2.8
##$NSP= 1
##$NTH_PI= 0
##$NZP= 0
##$OFFSET= 15.70392
##$PC= 1
##$PHC0= -13356.12
##$PHC1= 11.20099
##$PH_mod= 1
##$PKNL= yes
##$PPARMOD= 0
##$PSCAL= 0
##$PSIGN= 0
##$REVERSE= no
##$SF= 200.130013532006
##$SI= 16384
##$SIGF1= 3
##$SIGF2= 2
##$SINO= 400
##$SIOLD= 16384
##$SREGLST= <1H.CDCl3>
##$SSB= 0
##$STSI= 0
##$STSR= 0
##$SW_p= 3612.71676300578
##$SYMM= 0
##$S_DEV= 0
##$TDeff= 0
##$TDoff= 0
##$TI= <>
##$TILT= no
##$TM1= 0
##$TM2= 0
##$TOPLEV= 0
##$USERP1= <user>
##$USERP2= <user>
##$USERP3= <user>
##$USERP4= <user>
##$USERP5= <user>
##$WDW= 1
##$XDIM= 8192
##$YMAX_p= 0
##$YMIN_p= 0
$$ End of Bruker specific parameters
$$ ---------------------------------
##NTUPLES= NMR FID
##VAR_NAME=  TIME,          FID/REAL,        FID/IMAG
##SYMBOL=    X,             R,               I
##VAR_TYPE=  INDEPENDENT,   DEPENDENT,       DEPENDENT
##VAR_FORM=  AFFN,          ASDF,            ASDF
##VAR_DIM=   8192,          8192,            8192
##UNITS=     SECONDS,       ARBITRARY UNITS, ARBITRARY UNITS
##FACTOR=    0.0002496,     1,               1
##FIRST=     0,             0,               0
##LAST=      2.0444736,     0,               0
##MIN=       0,             -173638,         0
##MAX=       2.0444736,     165383,          0
$$ Real data points
##PAGE= N=1
##DATA TABLE= (X++(R..R)), XYDATA
$$ plain form
0 0 0 0 0 0 0 0 0 0 0 0 0 0 -8 8 -8 8 -8 16 -16 24 -24 32 -34 40 -48 56 -66 79 -89 104 -119 135 -153 174
34 174 -195 221 -248 279 -311 346 -386 429 -475 527 -583 644 -711 783 -864 951 -1048 1154
52 1154 -1273 1403 -1553 1717 -1907 2121 -2373 2666 -3018 3449 -3989 4690 -5640 7007 -9147
67 -9147 13027 -22289 96537 11462 -103413 137726 165383 3076 -55393 94073 107660
78 107660 -1189 -10246 34660 18588 27891 -1165 -34480 -14988 21300 -853 -60640 -42763
90 -42763 28719 -17698 -61407 -19452 -2895 -17314 -22862 -22921 -13670 -10998 4538 -15877 -40626
103 -40626 14980 19486 -49176 -24385 25877 -8191 -52749 -18026 25111 -33706 -62025 9437
115 9437 -196 -53491 -27891 -737 -14786 -29677 -14386 -2202 -18558 5389 13693 -30839 4166
$$ packed form
0@%%%%%%%%%%%%qJ6j6J6j6K4l2M0m8N6o6P4q8J04j22J45j68J93k23K54k88L27
34A74l69M16m69N27n90O57p32Q15r04J002j110J227j355J494j647J815j999K202
52A154k427K676k956L270l624M028m494N039n684O467p438Q679j0330J2647j6154
67i147K2174l5316J18826q5075j14875K41139K7657j62307n8469J49466J3587
78A07660j08849r057M4906j6072R303k9056l3315J9492L6288k2153n9787J7877
90d2763P1482m6417m3709M1955J6557j4419n548n9R251K672J5536k0415k4749
103d0626N5606M506o8662K4791N0262l4068m4558L4723M3137n8817k8319P1462
115I437r633n3295K5600K7154j4049j4891J5291J2184j6356K3947Q304m4532L5005
$$ plain form
128 4166 54812 2057 -34092 28505 74323 -1270 -48403 51734 74401 -30397 -30885 44878
140 44878 37747 -25237 -30034 18944 7945 -25189 -15343 -22523 -17019 4559 -26729 -45279 -11910
153 -11910 9409 -17085 -47691 -8038 23944 -15606 -23877 3077 10830 14625 838 -6400 13251
166 13251 29943 22336 -14537 -2359 56260 23310 -34182 7316 52028 14380 -33011 3937
178 3937 48242 -1170 -26156 17504 19457 -1838 -869 6226 9883 5335 10510 7643 -2819 20090
192 20090 19698 -8048 9154 24400 7050 -3264 8037 20114 -1798 -11738 15220 2914 -17724
205 -17724 -1352 -81 -12686 -15333 -7754 -6980 -23678 -12710 -57 -25133 -19414 2582 -10650
218 -10650 -20254 -9473 5409 -2836 -18391 1884 10478 -4486 1001 2300 3180 12676 3409 -2981
$$ packed form
128D166N0646n2755l6149O2597M5818p5593m7133J00137K2667j04798m88P5763
140D4878p131o2984m797M8978j0999l3134R846p180N504K1578l1288j8550L3369
153a1910K1319k6494l0606L9653L1982l9550q271K6954P753L795j3787p238J9651
166A3251J6692p607l6873J2178N8619l2950n7492M1498M4712l7648m7391L6948
178C937M4305m9412k4986M3660J953k1295R69P095L657m548N175k867j0462K2909
192B0090l92k7746J7202J5246j7350j0314J1301J2077k1912r940K6958j2306k0638
205a7724J6372J271j2605k647P579P74j6698J0968J2653k5076N719K1996j3232
218a0650r604J0781J4882q245j5555K0275Q594j4964N487J299Q80R496r267o390
$$ plain form
232 -2981 4090 14452 10578 -14257 -1831 25517 -897 -20311 2641 15882 -2014 -21717 -921
245 -921 15427 -11453 -14360 2449 -673 -3033 -6038 -4732 777 -1319 1176 -4931 -6362 9878
259 9878 873 -10607 3990 5440 -1340 -3823 -136 6526 -4520 -3157 6422 -5639 -2812 5714
273 5714 -3140 -4759 -66 4739 -59 -9505 5597 8621 -8265 -276 8181 2442 -67 -4 8092
288 8092 4664 -2045 6951 3930 1117 8067 764 726 6822 3385 1215 -1640 4757 6684 -7231
303 -7231 -465 8441 -2970 -3630 411 1733 -502 -6337 1524 1810 -6559 1441 67 -5278 1200
318 1200 -296 -1353 -2286 -1317 4518 -3035 -4085 6545 -498 -2301 2866 1301 2733 -330 812
333 812 4441 -1533 2332 3292 -3497 3108 2691 -2906 -27 -359 1026 -2861 -6308 3188 -2405 -8361
$$ packed form
232b981P071J0362l874k4835J2426K7348k6414j9414K2952J3241j7896j9703K0796
245i21J6348k6880k907J6809l122k360l005J306N509k096K495o107j431J6240
259I878r005j1480J4597J450o780k483L687O662j1046J363R579j2061K827Q526
273E714q854j619M693M805m798r446J5102L024j6886P989Q457n739k509O3Q096
288H092l428o709Q996l021k813O950p303l8O096l437k170k855O397J927j3915
303g231O766Q906j1411o60M041J322k235n835P861K86q369Q000j374n345O478
318A200j496j057r33R69N835p553j050J0630p043j803N167j565J432l063J142
333H12L629n974L865R60o789O605m17n597K879l32J385l887l447R496n593n956
$$ plain form
349 -8361 -835 -2488 -4729 -4577 -4836 -355 -5288 -5576 1069 -4612 -2983 1100 -3225 227 39 -172
365 -172 2334 -901 3001 3751 -1351 4458 3300 -397 4216 1948 1866 1656 -328 4080 -213 -2061
381 -2061 4458 -519 -1902 1681 -121 934 -1645 -302 4134 -1891 -584 3902 -279 1848 1285
396 1285 650 3934 97 1138 2549 -787 2679 -1145 -3198 2803 -1532 -4272 -2216 -2942 -1112 -6366
412 -6366 -6676 294 -4811 -6245 -2938 -3760 -543 -3032 -3649 1744 -544 995 2515 -153 5603 5393
428 5393 2175 5671 5131 6774 6562 2489 7087 6416 3057 5080 1556 2241 3779 -1143 -320 -817 -1674
445 -1674 -33 -5052 -3820 -444 -4616 -3877 -3563 -3841 -597 -4584 -3305 -447 -2797 -386 -1618 -2264
461 -2264 2028 -957 -1021 858 -1599 1116 -941 -2609 997 -2633 -2453 83 -3409 -2625 -2323 -2011 -352
$$ packed form
349h361P526j653k241J52k59M481m933k88O645n681J629M083m325L452j88k11
365a72K506l235L902P50n102N809j158l697M613k268q2k10j984M408m293j848
381b061O519m977j383L583j802J055k579J343M436o025J307M486m181K127n63
396A285o35L284l837J041J411l336L466l824k053O001m335k740K056p26J830n254
412f366l10O970n105j434L307q22L217k489o17N393k288J539J520k668N756k10
428E393l218L496n40J643k12m073M598o71l359K023l524O85J538m922Q23m97q57
445a674J641n019J232L376m172P39L14k78L244l987J279K858k350K411j232o46
461b264M292k985o4J879k457K715k057j668L606l630J80K536l492P84L02L12J659
$$ plain form
478 -352 -4439 -2158 2067 -2210 -840 527 1303 4741 490 1940 5807 4466 5420 4140 3488 8879
494 8879 5164 3435 4736 3795 6161 2011 -1591 3228 2116 -1307 -2984 -4263 478 -3017 -8362
509 -8362 -4538 -3253 -3607 -6157 -8396 -1785 -1847 -6656 -3507 -1710 -496 -129 -3315 725 2036 1054
525 1054 1853 -335 2138 5242 628 508 1849 2478 3224 -1726 -609 4104 317 -856 -516 182 2217
542 2217 -1925 -931 2503 -260 1670 1620 356 3213 2108 2316 3376 1349 4077 3905 1399 3064
558 3064 1513 2075 2528 -1498 818 34 -2530 -658 -3130 -4329 -2609 -3930 -3818 -6283 -6360 -1388 -4610
575 -4610 -7113 -3772 -2068 -1010 -4608 -4485 3091 1373 -2609 72 3003 4646 1133 275 5411 4078
591 4078 2662 2954 1266 4353 4354 308 1373 1357 2869 1577 -3187 160 2501 -570 -1830 -2345 1290
$$ packed form
478c52m087K281M225m277J370J367P76L438m251J450L867j341R54j280o52N391
494H879l715j729J301r41K366m150l602M819j112l423j677j279M741l495n345
509h362L824J285l54k550k239O611o2m809L149J797J214L67l186M040J311r82
525A054P99k188K473L104m614j20J341O29P46m950J117M713l787j173L40O98K035
542B217m142R94L434k763J930n0j264K857j105K08J060k027K728j72k506J665
558C064j551N62M53m026K316p84k564J872k472j199J720j321J12k465p7M972l222
575d610k503L341J704J058l598J23P576j718l982K681K931J643l513q58N136j333
591D078j416K92j688L087Jm046J065j6J512j292m764L347K341l071j260n15L635
$$ plain form
608 1290 2019 -3953 -1465 1747 55 -227 -1675 742 3041 -1111 -350 1048 534 1598 -1589 -816
624 -816 1436 -1263 -963 -1354 -2892 -199 -1924 -3655 -2160 -2205 -1143 -3097 -3939 296 -1598 -2817 -218
641 -218 -645 235 257 114 3060 741 878 4017 2029 2013 2843 3095 4069 1174 1597 4131 982 1547 1134
660 1134 -10 2067 -78 -1096 -308 -1251 91 -1343 -3432 -496 -909 -1665 -1945 -2535 484 -161 -3159
677 -3159 -919 260 202 -474 -2595 1342 1788 -1537 -376 -39 921 666 -2779 190 1206 -1163 -331
694 -331 -1255 -435 801 -1471 -683 -343 -394 1010 -1667 -855 2214 -23 -105 851 615 2202 192 427
712 427 2371 809 1187 1604 5 1946 390 -23 1178 -350 717 -20 -1501 249 -613 -1568 -307
729 -307 -1322 -459 -913 -1789 -91 -1125 -1479 -47 -1718 -99 44 -1158 556 189 -125 611 -456
$$ packed form
608A290P29n972K488L212j692k82j448K417K299m152P61J398n14J064l187P73
624h16K252k699L00l91j538K693j725j731J495m5J062j954q42M235j894j219K599
641b18m27Q80K2j43K946k319J37L139j988j6Q30K52R74k895M23K534l149N65m13
660A134j144K077k145j018P88r43J342j434k089K936m13p56k80n90L019o45k998
677c159K240J179n8o76k121L937M46l325J161L37R60k55l445K969J016k369Q32
694c31r24Q20J236k272P88L40n1J404k677Q12L069k237q2R56k36J587k010K35
712D27J944j562L78M17j599J941j556m13J201j528J067p37j481J750q62r55J261
729c07j015Q63m54q76J698j034l54J432j671J619J43j202J714l67l14P36j067
$$ plain form
746 -456 998 790 -695 1465 425 -53 768 47 833 529 -873 1243 119 -347 564 -352 468 143
764 143 -992 517 -59 -192 878 -1114 55 689 -583 78 -274 83 588 -840 145 521 -576 882
782 882 -617 -657 923 -503 -222 159 -197 771 -785 -603 898 -235 10 225 -321 811 -442 -430
800 -430 1069 -395 143 206 -774 342 154 -631 580 -303 139 64 -662 684 46 -418 1082 -419 205
819 205 365 -394 503 -221 -369 667 -958 -28 313 -868 247 -252 -815 306 -1116 -327 232 -1169
837 -1169 90 -320 -361 544 -725 57 585 -425 636 -18 117 1081 43 629 1136 295 1066 461 630
856 630 1410 -54 532 777 -395 304 71 -408 275 -722 -483 -213 -1193 -273 -722 -1295 -32 -968 -602
875 -602 -292 -1242 115 -543 -651 347 -521 123 416 -480 644 266 -101 750 -104 326 798 -360 798
$$ packed form
746d56J454k08j485K160j040m78Q21p21P86l04j402K116j124m66R11r16Q20l25
764A43j135J509n76j33J070j992J169O34j272O61l52L57N05j428R85L76j097J458
782H82j499m0J580j426K81L81l56R68j556J82J501j133K45K15n46J132j253J2
800d30J499j464N38O3r80J116j88p85J211q83M42p5p26J346o38m64J500j501O24
819B05J60p59Q97p24j48J036j625R30L41j181J115m99n63J121j422P89N59j401
837a169J259m10m1R05j269P82N28j010J061o54J35R64j038N86N07q41P71o05J69
856F30P80j464N86K45j172O99k33m79O83r97K39K70r80R20m49n73J263r36L66
875f02L10r50J357o58j08R98q68O44K93q96J124l78l67Q51q54M30M72j158J158
$$ plain form
894 798 -7 -281 576 -606 152 279 -410 519 38 -610 589 -147 196 690 -51 1001 70 193 920
913 920 -165 603 866 8 953 198 35 807 -393 150 258 -947 58 -538 -1070 -410 -1093 -824 -580
932 -580 -1556 -563 -1067 -1370 -169 -1110 -668 -164 -782 252 -34 -123 986 -20 268 1200 210 1194 585
951 585 422 1097 509 637 579 -49 958 335 -244 824 -112 -58 289 -536 514 -139 -506 280 -484 51
971 51 258 -319 606 45 -197 379 -55 151 632 -656 217 278 -259 397 -767 -344 -57 -1187 -267 -676
991 -676 -949 -458 -937 -894 -400 -1382 -551 -799 -749 1 -453 -155 550 -114 619 825 100 1266 492 1007 1171
1012 1171 513 1357 909 420 922 323 639 1017 -357 501 107 161 179 -721 -537 18 -1025 -458 -525 -606
1032 -606 129 -759 -563 -7 -558 50 -281 -320 455 -362 -48 -14 -41 668 146 -573 286 -203 -3 -177 -516
$$ packed form
894G98q05k74Q57j182P58J27o89R29m81o48J199p36L43M94p41J052r31J23P27
913I20j085P68K63q58R45p55j63P72j200N43J08j205J005n96n32O60o83K69K44
932e80r76R93n04l03J201r41M42N04o18J034k86q9J109j006K88R32r90R84o09
951E85j63O75n88J28n8o28J007o23n79J068r36N4L47q25J050o53l67P86p64N35
971E1K07n77R25n61k42N76m34K06M81j288Q73O1n37O56j164M23K87j130R20m09
991f76k73M91m79M3M94r82Q31k48N0P50m54K98P05o64P33K06p25J166p74N15J64
1012A171o58Q44m48m89N02n99L16L78j374Q58l94N4J8r00J84N55j043N67o7q1
1032f06P35q88J96N56n51O08l31l9P75q17L14L4k7P09n22p19Q59m89K00j74l39
$$ plain form
1053 -516 285 -169 -639 17 -525 141 51 -697 318 252 -29 410 -390 365 759 -125 791 760 483 1163 625
1074 625 257 888 333 646 406 45 594 -153 -55 333 -469 226 -158 -447 -240 -437 -305 -413 -845 -406
1094 -406 -235 -526 -138 -794 -209 -45 -564 266 157 -447 262 135 152 579 -80 250 126 -123 657 -284
1114 -284 95 599 -115 271 47 -313 304 -63 -232 390 -328 665 10 -61 540 -118 273 217 -6 583 544
1135 544 -427 633 53 228 323 -316 247 167 -167 217 -149 -261 383 -835 54 -143 -635 167 -340 -453
1155 -453 244 -725 -231 -49 -642 448 -439 -99 313 -316 179 140 203 759 -41 161 377 -16 427 93
1175 93 -204 467 -270 54 502 -262 196 270 -216 381 -347 149 373 -602 -62 -269 -433 364 -446 -247 226
1196 226 -256 162 27 -149 260 -172 -172 301 -137 52 -14 -199 564 -24 -206 217 -362 377 135 -212 560
$$ packed form
1053e16Q01m54m70O56n42O66r0p48J015o6k81M39q00P55L94q84R16l1k77O80n38
1074F25l68O31n55L13k40l61N49p47R8L88q02O95l84k89K07j97J32j08m32M39
1094d06J71k91L88o56N85J64n19Q30j09o04P09j27J7M27o59L30j24k49P80r41
1114b84L79N04p14L86k24l60O17l67j69O22p18R93o55p1O01o58L91n6k23N89l9
1135E44r71J060n80J75R5o39N63q0l34L84l66j12O44j218Q89j97m92Q02n07j13
1155d53O97r69M94J82n93J090q87L40M12o29M95l9O3N56q00K02K16l93M43l34
1175I3k97O71p37L24M48p64M58P4m86N97p28M96K24r75N40k07j64P97q10J99M73
1196B26m82M18j35j76M09m32%M73m38J89o6j85P63n88j82M23n79P39k42l47P72
$$ plain form
1217 560 188 -68 202 -146 193 -69 -123 227 -162 -220 -36 -252 -30 170 -141 230 -373 -48 240 -616 147
1238 147 121 -283 341 -252 -178 -4 -432 -2 -41 -313 92 114 174 121 -387 61 -190 -54 370 -286 -257 110
1260 110 -278 -84 190 -102 292 -54 -241 176 117 143 233 -194 343 -131 15 195 -87 257 -172 -237 588
1281 588 -17 -191 187 -422 123 -132 -339 -91 -350 -490 -133 -540 -164 -226 -445 -86 -523 -283 -226 -197 26
1302 26 -50 -333 125 -120 -5 196 30 471 342 -106 529 13 160 365 -31 343 306 -176 183 -117 -142
1323 -142 17 -146 410 -219 -155 106 -113 84 258 12 255 -11 78 317 -18 122 335 -11 -139 -83 -134
1344 -134 371 67 -70 24 -421 -284 -330 -244 48 -302 -265 23 -679 -199 -156 -157 79 -193 -145 31 67 210 270
1367 270 -33 80 266 12 335 351 315 300 -163 515 -61 376 222 134 124 244 -5 140 -121 -269 0 -435
$$ packed form
1217E60l72k56K70l48L39k62n4L50l89n8J84k16K22K00l11L71o03L25K88q56P63
1238A47k6m04O24n93P4J74m28M30l9k72M05K2O0n3n08M48k51J36M24o56K9L67
1260A10l88J94K74k92L94l46j87M17n9K6R0m27N37m74J46J80k82L44m29o5Q25
1281E88o05j74L78o09N45k55k07K48k59j40L57m07L76o2k19L59m37K40N7K9K23
1302B6p6k83M58k45J15K01j66M41j29m48O35n16J47K05l96L74l7m82L59l00k5
1323a42J59j63N56o29O4K61k19J97J74k46K43k66Q9K39l35J40K13l46j28N6n1
1344a34N05l04j37R4m45J37m6Q6K92l50L7K88p02M80M3jK36k72M8J76L6J43O0
1367B70l03J13J86k54L23J6l6j5m63O78n76M37j54q8j0J20k49J45k61j48K69m35
$$ plain form
1389 -435 129 -279 -382 217 -326 -110 79 -271 -116 -68 -269 37 -149 -35 155 -205 -56 203 65 34 -147
1410 -147 -373 13 -341 -118 -102 -307 12 29 -249 -73 -338 -325 -175 -394 163 119 15 304 169 132 322 252
1432 252 574 471 275 384 198 96 464 -230 -9 221 -13 14 50 75 -38 -346 -143 7 -368 41 -244
1453 -244 -182 -411 -373 149 -168 -389 250 -169 74 -108 -223 137 33 -97 209 204 129 173 -111 109 208 -123
1475 -123 247 -101 212 99 -172 119 142 -207 146 -152 -42 -47 -231 86 42 219 209 42 80 275 112 74
1497 74 222 -149 141 -41 122 205 -339 -176 -34 -297 -81 -155 -128 -172 -378 -478 -376 -505 -124 -130 -178 246 -65
1520 -65 -201 -160 -173 50 -87 160 -14 -27 47 13 182 401 11 406 407 18 314 244 130 342 -39 187 -33
1543 -33 99 -147 -189 -149 167 33 -125 -306 -65 67 104 166 209 81 164 142 -201 226 -148 -38 94 -82 -116
$$ packed form
1389d35N64m08j03N99n43K16J89l50J55M8k01L06j86J14J90l60J49K59j38l1j81
1410a47k26L86l54K23J6k05L19J7k78J76k65J3J50k19N57m4j04K89j35l7J90p0
1432B52L22j03j96J09j86j02L68o94K21K30k34K7L6K5j13l08K03J50l75M09k85
1453b44O2k29L8N22l17k21O39m19K43j82j15L60j04j30L06np5M4k84K20R9l31
1475a23L70l48L13j13k71K91K3l49L53k98J10nj84L17m4J77j0j67L8J95j63l8
1497G4J48l71K90j82J63Q3n44J63J42k63K16p4K7m4k06j00J02j29L81om8M24l11
1520f5j36M1j3K23j37K47j74j3P4l4J69K19l90L95Jl89K96p0j14K12l81K26k20
1543c3J32k46m2M0L16j34j58j81K41J32L7O2M3j28Q3k2l43M27l74J10J32j76l4
$$ plain form
1566 -116 135 76 -114 -84 46 148 -15 -109 -59 -103 -95 108 -54 -133 -15 -255 12 -347 -54 124 130 303 -155
1589 -155 -94 184 -129 318 -141 171 -13 -3 20 113 100 273 201 141 312 -325 10 138 -165 74 11 -88 9
1612 9 -220 -283 -178 -336 -111 -174 -480 -15 -185 -91 66 -226 174 -298 -153 101 -6 86 -102 -41 92 49 -38
1635 -38 -48 4 195 186 -91 461 25 -261 319 61 111 176 -40 116 42 213 -40 -10 -100 56 -279 213 -82
1658 -82 -125 6 -57 4 255 -34 84 -134 -213 169 282 -173 253 55 236 -47 -65 50 -73 3 58 98 27
1681 27 -31 191 179 42 105 170 -20 44 171 72 121 -255 194 312 -55 -33 -166 -246 367 -83 95 38 -304 246
1705 246 59 -240 1 47 -99 8 77 -119 112 -31 -168 -32 -154 265 -278 -99 -302 12 242 36 -198
1726 -198 -52 -160 -4 35 5 36 9 183 244 -50 129 344 -13 31 137 -28 345 -34 -128 -125 37 195 -157
$$ packed form
1566a16K51n9j90L0J30J02j63r4N0m4QK03j62p9J18k40K67l59K93J78OJ73m58
1589a55O1K78l13M47m59L12j84J0K3R3j3J73p2o0J71o37L35J28l03K39o3r9R7
1612Ik29o3J05j58K25o3l06M65j70R4J57k92M00m72J45K54j07R2j88O1J33m3q7
1635c8j0N2J91rk77N52m36k86N80k58N0O5k16J56p4J71k53L0r0J56l35M92k95
1658h2m3J31o3O1K51k89J18k18p9L82J13m55M26j98J81k83j8J15j23P6N5M0p1
1681B7n8K22j2j37O3O5j90O4J27r9M9l76M49J18l67K2j33q0O13m50J78n7l42N50
1705B46j87k99K41M6j46J07O9j96K31j43j37J36j22M19n43J79k03L14K30k06k34
1726a98J46j08J56L9l0L1k7J74O1k94J79K15l57M4J06j65L73l79r4LJ62J58l52
$$ plain form
1749 -157 -87 26 -53 -204 -233 -88 93 -35 -186 -116 100 72 141 28 241 -58 -122 -220 -17 -219 113 -16 237
1772 237 197 -148 136 -122 -129 -274 -254 16 -191 102 -178 -41 129 98 187 -67 -193 -31 360 45 256 -102
1794 -102 -56 263 -305 -18 -1 -66 336 19 70 -9 12 -120 28 -152 -203 -187 128 -262 -162 -102 -3 -299 31
1817 31 -69 -127 -25 -96 189 -117 -22 -13 -10 -17 -27 32 -160 -48 104 252 180 229 -128 -184 -60 -105 -143 -143 -116 65 366
1844 366 16 122 79 177 290 120 40 107 290 -23 90 148 185 18 2 0 409 -50 -148 139 88 -41 -221 13
1868 13 -39 -107 343 -527 -33 -114 -309 -47 -152 -123 -134 -27 224 -268 -132 -130 -41 -277 -23 72 -102 -21 129 67
1892 67 250 180 171 380 -6 241 144 93 31 -57 201 -185 363 -70 -322 158 -167 -75 -110 -145 104 -192 -146 163
1916 163 46 -25 195 53 8 38 -50 110 -302 -143 126 -101 -219 -95 -185 -34 -327 -91 -181 -46 -55 -36 -127
$$ packed form
1749a57P0J13p9j51k9J45J81j28j51P0K16k8O9j13K13k99o4r8K03k02L32j29K53
1772B37m0l45K84k58pj45K0K70k07K93k80J37J70l1Q9k54j26J62L91l15K11l58
1794a02M6L19n68K87J7o5M02l17N1p9K1j32J48j80n1J6L15l90J00O0R9k96L30
1817C1j00n8J02p1K85l06R5RLpj0N9j92J12J52J48p2M9l57n6J24m5l8%K7J81L01
1844C66l50J06m3R8J13j70q0O7J83l13J13N8L7j67j6kM09m59r8K87n1j29j80K34
1868A3n2o8M50q70M94q1j95K62j05K9j1J07K51m92J36KQ9k36K54R5j74Q1J50o2
1892F7J83p0rK09l86K47r7n1o2q8K58l86N48m33k52M80l25R2l5l5K49k96M6L09
1916A63j17p1K20j42m5L0q8J60m12J59K69k27j18J24r0J51k93K36r0J35rJ9r1
$$ plain form
1939 -127 -68 -314 -190 66 -34 -96 -44 -48 31 -6 -68 30 237 149 19 -3 170 60 -332 -12 125 273 -179 38
1963 38 -89 204 86 116 84 -34 2 -43 87 -142 186 -205 -24 -67 -213 99 123 -84 -37 -31 -57 42 193 -274
1987 -274 -236 171 -37 20 247 -299 18 80 116 -20 -122 128 -143 241 -131 97 -232 159 -143 11 -121
2008 -121 148 -156 -2 -135 -71 -52 -80 -56 232 140 30 267 200 165 -189 106 -142 65 -394 20 108 -47 -85
2031 -85 -159 -115 -127 -29 -185 -138 158 84 -10 -43 139 -133 107 -49 123 160 -196 181 93 -313 -109 304 14 36
2055 36 -26 -300 95 17 183 -68 -162 128 104 213 323 270 511 117 110 -92 87 -41 -21 90 103 -50 -104 -93
2079 -93 -295 -12 69 -156 -89 44 -118 238 -36 -87 -149 16 -80 146 -27 -158 436 51 -17 -58 -216 -309 57
2102 57 325 -39 -119 34 -114 165 211 -207 342 -83 79 319 -116 -43 98 -315 -8 -127 158 -82 44
$$ packed form
1939a27N9k46J24K56j00o2N2mP9l7o2R8K07q8j30k2J73j10l92L20J37J48m52K17
1963C8j27K93j18L0l2j18L6m5J30k29L28l91J81m3j46L12K4k07M7Ok6R9J51m67
1987b74L8M07k08N7K27n46L17O2L6j36j02K50k71L84l72K28l29L91l02J54j32
2008a21K69l04J54j33O4J9k8K4K88r2j10K37o7l5l54K95k48K07m59M14Q8j55l8
2031h5p4M4j2R8j56M7K96p4r4l3J82k72K40j56J72L7l56L77q8m06K04M13k90K2
2055C6o2k74L95p8J66k51r4K90k4J09J10n3K41l94pk02J79j28K0J11J3j53n4J1
2079i3k02K83Q1k25O7J33j62L56k74n1o2J65r6K26j73j31N94l85o8m1j58r3L66
2102E7K68l64q0J53j48K79M6m18N49m25J62K40m35P3J41m13L07j19K85k40J26
$$ plain form
2123 44 120 -18 136 234 -87 -377 45 -32 -90 -71 -7 -5 -265 -163 -234 145 154 -338 -4 -129 -19 -114 30 -38 71
2148 71 -57 -164 -59 114 25 -177 -81 211 -62 -37 -37 -150 -282 185 66 459 -19 -139 55 -141 205 -143
2170 -143 28 -243 109 -207 -175 -98 -52 -82 3 -113 -28 -154 125 73 -57 -78 74 -118 104 -47 -141 -166 -132 234
2194 234 -261 46 -108 383 179 34 11 158 -143 53 -166 105 218 -172 91 -118 132 65 -234 -214 77
2215 77 -9 174 -13 -34 -172 -66 201 110 88 271 31 67 -151 142 28 152 222 -107 -59 -9 -124 103 -110
2238 -110 -261 6 53 -264 -189 -39 13 45 -87 -172 -69 -50 106 39 -91 38 -135 97 -71 80 -23 120
2260 120 157 -56 70 -380 62 -175 -155 10 -103 235 58 101 -134 -2 131 -157 -176 -168 -74 68 159 -36 -133
2283 -133 -70 -40 -196 121 31 70 -94 -36 -130 -38 -96 117 -63 -279 -323 -33 234 -21 33 -203 -263 -91 190 -142
$$ packed form
2123D4P6j38J54R8l21k90M22p7n8J9O4Kk60J02p1L79Rm92L34j25J10r5J44o8J09
2148G1j28j07J05J73q9k02R6K92k73K5%j13j32M67j19L93m78j20J94j96L46l48
2170a43J71k71L52l16L2P7M6l0Q5j16Q5j26K79n2j30k1J52j92K22j51r4k5L4L66
2194B34m95L07j54M91k04j45k3J47l01J96k19K71J13l90K63k09K50o7k99K0K91
2215G7q6J83j87k1j38J06K67r1k2J83k40L6k18K93j14J24P0l29M8N0j15K27k13
2238a10j51K67M7l17P5J50N2L2j32q5J03J9J56o7j30J29j73K32j68J51j03J43
2260A20L7k13J26m50M42k37K0J65j13L38j77M3k35J32J33k88j9QR4J42R1j95r7
2283a33O3L0j56L17r0L9j64N8r4R2n8K13j80k16m4K90K67k55N4k36o0J72K81l32
$$ plain form
2307 -142 42 24 176 -60 36 17 -136 225 144 2 159 100 99 45 90 -121 183 98 260 108 -199 193 -333
2330 -333 89 106 50 -265 -120 -66 86 -159 -49 -76 -103 -2 216 -343 189 274 -58 -49 -30 81 -17 -52 -55 67
2354 67 43 -39 43 -271 -181 119 -139 -113 34 -67 -28 -36 -9 -181 -38 119 85 42 174 34 -86 153 -50 -232
2378 -232 58 -37 100 325 135 -233 182 -175 52 45 17 108 -130 -30 -26 56 -210 31 8 -206 -49 17 -60 130
2402 130 39 -52 -322 -173 -20 -43 262 -108 108 96 -91 -223 -86 4 77 -16 -369 -110 -50 310 -84 -21 7
2425 7 240 51 153 92 33 13 -115 2 -170 131 -108 87 124 -54 -212 171 -7 -100 28 -5 73 -149 -206
2448 -206 245 172 -69 62 -87 167 176 130 105 277 15 127 -206 223 67 213 -145 -192 -166 66 33 -12 -2
2471 -2 -17 -64 -249 128 -70 116 -129 171 -182 -112 64 146 76 76 228 9 203 125 77 1 -84 -224 -150 -108 101
$$ packed form
2307a42J84j8J52k36R6j9j53L61q1j42J57n9jn4M5k11L04q5J62j52l07L92n26
2330c33M22J7n6l15J45N4J52k45J10k7k7J01K18n59N32Q5l32RJ9J11r8l5lJ22
2354F7k4q2Q2l14R0L00k58K6J47j01L9qK7j72J43J57l4m3J32j40j20K39k03j82
2378b32K90r5J37K25j90l68M15l57K27pk8R1k38J00MQ2k66K41k3k14J57O6p7J90
2402A30r1r1k70J49J53k3L05l70K16j2j87j32J37R0P3r3l53K59O0L60l94O3K8
2425GK33j89J02o1n9k0j28J17j72L01k39J95L7j78j58L83j78r3J28l3P8k22n7
2448b06M51p3k41J31j49K54Rm6k5J72k62J12l33M29j56J46l58m7K6K32l3m5J0
2471bj5m7j85L77j98J86k45L00l53P0J76Q2p0%J52k19J94p8m8p6q5j40P4M2K09
$$ plain form
2496 101 46 91 -215 -151 28 31 160 -27 -47 5 -112 -48 -141 -235 -6 181 -105 140 29 -152 113 -78 131
2519 131 57 135 -165 12 -238 50 -136 -58 137 244 -14 -18 -49 120 66 -245 -74 10 29 -77 -238 31 179
2542 179 -67 74 58 14 -63 -132 94 -15 87 171 12 119 243 -32 2 -112 -120 -194 32 -31 1 135 -159 -379
2566 -379 -76 103 45 83 17 225 -7 117 143 275 -87 256 -42 -47 -248 -105 -125 -21 -83 -51 -81 71 -63
2589 -63 -26 -80 -245 202 57 284 15 -195 -60 -88 -93 134 -128 -58 70 172 -9 49 108 227 20 -55 323
2612 323 -164 216 293 -112 73 184 -212 7 -397 -11 -13 181 -118 109 136 109 -342 -184 77 -235 13 12
2634 12 -108 -226 -40 103 -16 -111 -421 -9 -17 -146 -56 155 176 250 214 -33 67 34 -263 -60 -37 -23 -131 220
2658 220 -91 -37 -27 -44 -105 -86 -16 -226 60 -169 122 -161 -142 -130 -126 -40 129 42 75 -100 51 -164 73 -1 187
$$ packed form
2496A01n5M5l06O4J79LJ29j87k0N2j17O4r3r4K29J87k86K45j11j81K65j91K09
2519A31p4P8l00J77k50K88j86P8J95J07k58ml1J69n4l11J71Q4J9j06j61K69J48
2542A79k46J41j6m4p7o9K26j09J02Q4j59J07J24k75L4j14qp4K26o3L2J34k94k20
2566c79L03J79n8L8o6K08k32J24K6J32l62L43k98nk01J43k0J04o2L2l0J52j34
2589f3L7n4j65M47j45K27k69k10J35k8nK27k62P0J28J02j81N8N9J19k07p5L78
2612C23m87L80P7m05J85J11l96K19m04L86kJ94k99K27K7k7m51J58K61l12K48j
2634A2j20j18J86J43j19r5l10M12qj29R0K11K1P4l6k47J00l3k97K03K3J4j08L51
2658B20l11N4J0j7o1J9P0k10K86k29K91k83J9J2MQ6J69q7L3j75J51k15K37p4J88
$$ plain form
2683 187 35 -203 5 232 14 93 -137 -115 -11 -100 47 122 -173 40 -243 -145 105 75 139 -148 -6 -93 -79
2706 -79 -30 23 102 56 -131 87 154 49 67 176 -17 158 255 -5 271 -102 67 -83 168 117 -101 3 -67
2729 -67 0 108 24 286 37 265 101 362 107 -60 97 -110 -67 -166 -101 115 -62 -82 159 250 1 -44 -76
2752 -76 30 70 224 52 -133 -50 -13 -21 -190 22 -24 48 -99 256 1 -58 -192 87 197 -53 23 -8 53 -166
2776 -166 152 -54 136 -42 -187 55 40 241 -11 220 6 121 -153 56 -145 7 119 -144 -161 -218 -93
2797 -93 -70 -1 102 -107 -193 -2 -267 -64 115 121 6 -164 9 -17 -16 -49 -208 134 -553 -284 38 31 82 -158
2821 -158 -131 -204 -273 101 -50 -77 -52 -105 113 -65 -142 -171 -44 234 163 39 40 36 -146 82 17 -156 191 192 -364
2846 -364 61 -84 133 251 250 130 45 -38 -36 76 143 33 240 221 -121 120 39 41 -259 181 269 -152 110 11
$$ packed form
2683A87j52k38K08K27k18P9k30K2J04q9J47P5k95K13k83R8K50l0O4k87J42q7J4
2706g9M9N3P9m6j87K18O7j05J8J09j93J75R7k60K76l73J69j50K51n1k18J04p0
2729f7O7J08q4K62k49K28j64K61k55j67J57k07M3r9O5K16j77k0K41R1k49m5l2
2752g6J06M0J54j72j85Q3L7qj69K12m6P2j47L55k55n9j34K79J10k50P6l1O1k19
2776a66L18k06J90j78j45K42j5K01k52K31k14J15k74K09k01J52J12k63j7n7J25
2797i3K3O9J03k09q6J91k65K03J79Oj15j70J73k6Jl3j59L42o87K69L22pN1k40
2821a58K7p3o9L74j51k7K5n3K18j78p7k9J27K78p1j24Jmj82K28o5j73L47Jn56
2846c64M25j45K17J18jj20q5q3KJ12O7j10K07j9l42K41q1Kl00M40Q8m21K62r9
$$ plain form
2870 11 130 97 81 13 -284 -59 12 -107 95 87 -57 132 88 -35 -53 182 367 -79 -134 11 91 -131 -34 -16
2894 -16 38 11 68 6 141 195 18 46 36 43 -1 -68 -159 -15 -51 217 93 223 -250 121 322 -165 116 -216 -249
2919 -249 -182 6 198 -27 173 -40 77 -29 -17 235 -70 -208 108 -333 9 -43 290 101 141 -126 -83 -22
2941 -22 -54 150 61 -15 -167 155 -203 -46 77 -101 -141 -72 -302 -94 -27 -104 -229 -144 102 193 179 -272 56 62
2965 62 -91 -236 -104 10 -78 75 -47 -60 16 -75 -40 -81 99 -12 167 66 -47 100 116 -45 -32 -158 16
2988 16 -88 -60 -22 -64 200 72 -65 -158 -63 160 176 17 83 -291 -14 -20 121 80 -136 -167 -300 261 318 167
3012 167 11 -25 4 -176 -196 179 -120 129 190 226 285 6 -58 172 -210 -47 73 44 -33 -242 106 19 132
3035 132 15 -20 73 -153 -39 -137 145 194 -98 29 101 76 110 -232 -142 -95 -61 105 -122 153 51 26 44 126
$$ packed form
2870A1J19l3j6o8k97K25P1j19K02qj44J89m4j23j8K35J85m46n5J45Q0k22R7J8
2894a6N4k7N7o2J35N4j77K8j0Pm4o7r1J44l6K68j24J30m73L71K01m87K81l32l3
2919b49O7J88J92k25K00k13J17j06J2K52l05j38L16m41L42n2L33j89M0k67M3O1
2941b2l2K04q9p6j52L22l58J57J23j78m0O9k30K08O7p7j25Q5K46R1j4m51L28O
2965F2j53j45J32J14q8J53j22j3P6r1L5m1J80j11J79j01j13J47J6j61J3j26J74
2988A6j04K8L8m2K64j28j37r3R5K23J6j59O6l74K77oJ41m1k16l1j33N61N7j51
3012A67j56l6K9j80k0L75k99K49O1L6N9k79o4K30l82J63J20k9p7k09L48q7J13
3035A32j17l5R3k26J14r8K82M9k92J27P2k5L4l42R0M7L4J66k27K75j02k5J8Q2
$$ plain form
3059 126 173 -146 168 16 163 174 -90 34 -177 -152 146 49 25 -38 -237 -224 132 66 -233 -180 40 115 -334
3082 -334 -93 -116 27 84 -193 79 46 121 30 -28 -21 -67 203 -97 111 52 -345 -62 -39 45 142 -48 -167 171
3106 171 149 -64 143 156 -29 30 -53 -127 -40 -33 -312 -267 10 -36 -247 289 129 107 -44 101 71 65 248 -21 -113
3131 -113 41 8 -70 -26 -185 167 -70 217 -48 221 -100 -13 99 87 -203 139 -292 191 -51 -26 -15 146
3153 146 113 81 -2 53 2 16 57 209 -81 -65 -77 -62 8 83 128 -19 15 98 -56 -20 -103 -1 -39 97 133 51 9
3180 9 -212 197 309 -83 -4 139 -108 -159 -26 200 -145 -183 80 -189 68 -130 -264 11 -329 167 277 39
3202 39 -217 218 -116 -60 -108 -97 95 212 -88 145 -18 -126 -168 27 102 -29 233 -9 230 144 196 -119 150
3225 150 225 -111 -140 212 190 128 25 -138 -129 -61 -92 -30 255 94 -21 -252 -322 33 -159 -95 -67 57 -230 -154
$$ packed form
3059A26M7l19L14j52J47J1k64J24k11K5K98r7k4o3j99J3L56o6k99N3K20P5m49
3082c34K41k3J43N7k77K72l3P5r1n8Pm6K70l00K08n9l97K83K3Q4R7j90j19L38
3106A71k2k13K07J3j85N9q3p4Q7Pk79M5K77m6k11N36j60k2j51J45l0oJ83k69r2
3131a13J54l3p8M4j59L52k37K87k65K69l21Q7J12j2k90L42m31M83k42K5J1J61
3153A46l3l2q3N5n1J4M1J52k90J6j2J5P0P5M5j47L4Q3j54L6q3J02l8J36L6q2m2
3180Ik21M09J12l92P9J43k47n1J33K26l45l8K63k69K57j98j34K75l40M96J10k38
3202C9k56M35l34N6m8J1J92J17l00K33j63j08m2J95P5j31K62k42K39q6N2l15K69
3225A50P5l36k9L52k2o2j03j63RO8l1O2K85j61j15k31p0L55j92O4K8J24k87P6
$$ plain form
3249 -154 75 -3 31 -131 -86 -39 164 137 -134 37 -5 -162 156 -4 170 3 126 146 160 218 -41 152 12
3272 12 -117 -102 16 -129 -161 -128 65 -94 139 243 -21 -207 -28 106 -33 16 287 -137 16 50 -201 128
3294 128 -112 36 -189 -5 2 -49 65 363 201 -103 -49 -123 -452 -26 36 171 249 -21 129 -38 148 77 -401
3317 -401 31 -22 430 174 6 130 -259 -125 14 -45 -214 74 92 -380 87 0 6 139 -229 -122 -59 -155 -27
3340 -27 -53 422 58 79 258 -215 -120 61 97 -106 -7 228 328 169 50 -87 -89 -32 -250 381 -9 -33 288
3363 288 138 -204 85 -13 -299 11 -77 42 110 -109 -7 -71 -107 -124 215 -85 101 -62 -69 35 31 -14 159 -58
3387 -58 -139 118 28 9 70 41 -100 7 94 154 122 -8 -136 30 17 126 40 129 -20 47 91 -311 -47 114 -179
3412 -179 -175 -15 -174 -4 -10 146 -131 21 -104 -81 40 -15 -32 -259 -56 -27 206 64 369 51 -66 -188 84
$$ packed form
3249a54K29p8L4j62M5M7K03k7k71J71m2j57L18j60J74j67J23K0J4N8k59J93j40
3272A2j29J5J18j45l2L3J93j59K33J04k64j86J79J34j39M9K71m24J53L4k51L29
3294A28k40J48k25J84Pn1J14K98j62l04N4p4l29M26O2J35P8k70J50j67J86p1m78
3317d01M32n3M52k56j68J24l89J34J39n9j69K88J8m72M67q7OJ33l68J07O3r6J28
3340b7k6M75l64K1J79m73R5J81L6k03R9K35J00j59j19j37kN7k18O31l90k4L21
3363B88j50l42K89r8k86L10q8J19O8k19J02o4l6j7L39l00J86j63pJ04mm5J73k17
3387e8q1K57r0j9O1k9j41J07Q7O0l2j30j28J66j3J09q6Q9j49O7M4m02K64J61k93
3412a79MJ60j59J70oJ56k77J52j25K3J21n5j7k27K03K9K33j42L05l18j17j22K72
$$ plain form
3435 84 91 -70 -56 365 -39 -162 54 48 -32 164 233 108 -116 142 86 65 -97 -155 113 -39 -33 -190 -101 -18 47
3460 47 -105 -38 48 -146 243 -114 -103 -171 -83 208 -4 143 -143 -60 -195 424 -34 -102 229 59 -93 158 -230
3483 -230 110 -3 -46 -124 60 39 71 17 89 190 64 -9 -188 -148 70 40 -331 -122 -56 -140 90 32 141 99
3507 99 -98 -91 -36 -506 118 260 125 80 -246 60 204 228 -19 -12 -67 32 142 -46 3 84 106 36 -168 57 19
3532 19 -13 -218 214 -165 4 -1 32 -106 37 -174 -299 287 84 -38 96 -66 60 104 -2 117 -59 -19
3554 -19 60 -141 6 -229 -152 113 -66 -87 4 -135 -184 -124 -187 -43 -164 -298 168 -261 -29 -21 231 -83 49
3577 49 -83 -127 -36 136 -93 -55 -117 48 -76 102 55 148 -350 47 -317 41 175 70 -39 12 -43 -66 147
3600 147 -12 -47 -323 124 -266 170 -73 9 -21 209 11 77 -166 -87 24 -337 -155 182 -39 62 33 135
$$ packed form
3435H4Pj61J4M21m04j23K16oq0J96O9j25k24K58n6k1j62n8K68j52Oj57Q9Q3O5
3460D7j52O7Q6j94L89l57J1o8Q8K91k12J47k86Q3j35O19m58o8L31j70j52K51l88
3483b30L40j13m3p8J84k1L2n4P2J01j26p3j79M0K18l0l71K09O6q4K30n8J09m2
3507I9j97PN5m70O24J42j35m5l26L06J44K4k47Pn5R9J10j88M9Q1K2p0k04K25l8
3532A9l2k05M32l79J69nL3j38J43k11j25N86k03j22J34j62J26M4j06J19j76M0
3554a9P9k01J47k35P7K65j79k1R1j39m9O0o3J44j21j34M66m29K32QK52l14J32
3577D9j32m4R1J72k29L8o2J65j24J78m7R3m98L97l64L58J34j05j09N1n5k3K13
3600A47j59l5k76M47l90M36k43Q2l0K30j98O6k43P9J11l61J82L37k21J01k9J02
$$ plain form
3622 135 -119 16 -21 4 -12 -24 -102 78 -65 -128 162 -22 212 103 76 -33 -112 134 -127 24 52 21 26 99
3646 99 103 -72 -43 -79 138 135 -233 67 126 12 -48 -65 175 -231 -194 -138 122 -248 69 -77 -51 245 -208 -71
3670 -71 107 110 -154 157 -129 -264 160 7 -262 49 -213 2 26 -95 -261 -104 -5 26 258 -141 -10 25
3692 25 79 91 75 59 -8 20 0 -160 -126 -140 43 129 -161 -172 -43 -23 -79 -191 169 -37 9 -129 47 37 -14 -100
3718 -100 -69 -176 128 108 104 -7 123 129 -182 11 126 -347 -24 -9 57 -28 -72 288 110 -221 -311 -65 -39 89
3742 89 -67 235 176 -60 153 3 -261 -25 -185 103 -232 106 -11 -59 -37 214 129 -131 -111 229 39 136
3764 136 28 14 55 39 9 220 -161 -56 -71 176 74 2 -153 -253 11 176 19 -15 -221 -214 62 -8 117
3787 117 65 -204 -37 18 -93 -307 86 60 -252 -164 76 -3 45 161 144 -24 187 118 90 -103 -2 24 -25 -71
$$ packed form
3622A35k54J35l7K5j6j2p8J80j43o3K90j84K34j09k7j09p9K46k61J51K8l1NP3
3646I9Mj75K9l6K17ll68L00N9j14o0j7K40m06L7N6K60l70L17j46K6K96m53J37
3670g1J78Lk64L11k86j35M24j53k69L11k62K15K4j21j66J57R9L1K32l99J31L5
3692B5N4J2j6j6o7K8k0j60L4j4J83Q6k90j1J29K0n6j12L60k06M6j38J76j0n1q6
3718a00L1j07L04k0mj11J30Ol11J93J15m73L23J5O6q5m4L60j78l31r0K46K6J28
3742H9j56L02n9k36K13j50k64K36j60K88l35L38j17m8K2K51q5k60K0L40j90R7
3764A36j08j4M1j6l0K11l81J05j5K47j02p2j55j00K64J65j57l4k06PK76p0J25
3787A17n2k69J67N5j11k14L93k6l12Q8K40p9M8J16j7j68K11o9k8j93J01K6m9m6
$$ plain form
3811 -71 136 -45 94 -64 -25 88 -83 -259 -113 164 -103 -212 -74 -7 78 -42 -48 -327 29 136 -174 -85
3833 -85 29 104 83 -261 27 -11 53 431 -163 12 -29 -123 -268 346 -97 38 -150 -182 -131 -37 -85 65 -103 1
3857 1 -277 -78 17 62 -175 -136 1 105 15 290 248 -101 45 43 81 -24 -102 135 358 220 185 -26 193 -142
3881 -142 -69 -49 -94 -15 -7 221 67 -46 132 149 2 229 -13 161 92 203 5 51 131 -73 298 36 9 49
3905 49 -184 -191 136 -110 -21 -91 -136 -62 -47 -290 -228 -97 85 -137 223 16 191 154 156 -101 -6 -177 60 -114
3929 -114 160 -143 -51 246 135 -116 -214 -43 -146 65 -230 146 8 -126 26 104 -241 35 -110 -241 -37
3950 -37 -87 -133 -301 -14 108 -230 -39 -99 -51 151 -302 -44 74 -324 182 33 -97 114 344 15 -87 116
3972 116 -286 122 298 94 -71 -68 271 -64 13 -6 -167 -75 123 -43 -15 46 -22 -84 -209 -20 99 206 -88
$$ packed form
3811g1K07j81J39j58L9J13j71j76J46K77k67j09J38O7Q5j20ok79L56J07l10Q9
3833h5J14P5k1l44K88l8O4L78n94J75m1r4j45O14m43J35j88l2N1R4m8J50j68J04
3857Ak78J99R5M5k37L9J37J04r0K75m2l49J46kL8j05p8K37K23j38l5k11K19l35
3881a42P3K0m5P9QK28j54j13J78J7j47K27k42J74o9J11j98M6Q0k04L71k62k7M0
3905D9k33pL27k46Q9p0m5P4J5k43O2J31J82k22L60k07J75l7Kk57R5j71K37j74
3929a14K74l03R2K97j11k51r8J71j03K11k95L76j38j34J52P8l45K76j45j31K04
3950c7n0m6j68K87J22l38J91o0M8K02m53K58J18l98N06j49j30K11K30l29j02K03
3972A16m02M08J76k04j65LL39l35P7j9j61R2J98j66K8O1o8o2j25J89J19J07k94
$$ plain form
3995 -88 -74 -188 -179 41 -102 -331 -107 12 -124 -131 -133 -11 200 67 -129 19 -86 -89 216 62 90 68 -45 -181
4019 -181 -144 -12 28 -92 -207 107 104 80 52 31 -175 -169 257 -86 -93 -25 72 25 -152 -156 -168 -39 -158 63 -71 26
4045 26 -98 -42 17 80 -40 82 166 -162 -191 88 -144 108 319 -150 23 -53 -168 -18 53 -91 235 26 -76
4068 -76 169 -21 -122 0 219 21 -104 78 64 47 -65 247 84 -69 57 -178 303 156 -167 20 -123
4089 -123 -28 125 -93 -155 79 -258 -36 -179 -76 0 -43 322 -67 -217 -2 -48 -45 145 -18 180 -114 406
4111 406 -4 2 -40 14 -183 -89 21 39 7 -28 -149 -72 170 42 82 243 -58 -5 -137 66 405 -11 -113 236
4135 236 17 -153 -40 6 155 103 -56 24 26 -57 197 43 29 -70 -180 10 -75 63 148 2 -232 -13 -191
4158 -191 -90 191 -2 179 -98 99 -67 65 119 184 120 327 64 69 72 -11 -278 -180 -153 18 169 -11 94
$$ packed form
3995h8J4j14RK20j43k29K24J19j36pkJ22K11j33j96J48j05lL05j54K8k2j13j36
4019a81L7J32M0j20j15L14lk4k8k1k06OM26l43pO8R7m7j77mj2J29j19K21j34R7
4045B6j24N6N9O3j20J22Q4l28k9K79k32K52K11m69J73p6j15J50P1j44L26k09j02
4068g6K45j90j01J22K19j98j25J82j4j7j12L12j63j53J26k35M81j47l23J87j43
4089a23R5J53k18o2K34l37K22j43J03P6m3L65l89j50K15m6LJ90j63J98k94N20
4111D06m10Om2N4j97R4J10J8l2l5j21P7K42j28M0J61l01N3j32K03L39m16j02L49
4135B36k19j70J13M6J49n2j59Q0Kq3K54j54j4r9j10J90q5J38Q5j46k34K19j78
4158a91J01K81j93J81k77J97j66J32N4O5o4K07k63NLq3k67R8K7J71J51j80J05
$$ plain form
4181 94 134 -444 66 167 106 138 257 49 291 57 -13 68 -5 -45 56 -67 -41 330 170 54 -51 56 -206
4204 -206 80 59 -136 108 -56 -214 -103 -229 46 27 -10 137 -82 -202 112 185 -100 -52 88 100 248 -54
4226 -54 -81 187 22 138 -7 -93 -420 101 -34 178 87 -42 42 -27 -203 -56 88 -34 -102 50 -23 -97 -82
4249 -82 127 -157 -184 136 8 -27 -107 -49 107 -197 18 177 148 -131 -179 -67 -120 248 -19 125 -169 -4 106
4272 106 -115 71 -28 -92 -27 42 -148 111 -169 -67 30 53 194 37 -86 -34 109 -218 171 315 -22 -239
4294 -239 -178 317 -32 -10 175 -129 -248 -110 -70 59 190 -21 -18 61 -45 5 120 15 -295 105 -87 81
4316 81 -5 169 153 -88 82 266 176 -150 -32 7 51 -126 39 -155 15 91 -130 -129 211 74 -49 308 -138
4339 -138 -167 -104 -336 -76 -58 -94 -76 13 -6 -174 146 -22 -61 -147 -152 71 5 -169 42 -230 -62 -227 -110 37
$$ packed form
4181I4M0n78N10J01o1L2J19k08K42k34p0Q1p3m0J01j23K6L71j60j16j05J07k62
4204b06K86k1j95K44j64j58J11j26K75j9l7J47k19j20L14P3k85M8J40J2J48l02
4226e4k7K68j65J16j45q6l27N21j35K12r1j29Q4o9j76J47J44j22o8J52p3p4J5
4249h2K09k84k7L20j28l5q0N8J56l04K15J59k9k79m8J12n3L68k67J44k94J65J10
4272A06k21J86r9o4O5O9j90K59k80J02R7K3J41j57j23N2J43l27L89J44l37k17
4294b39O1M95l49K2J85l04j19J38M0J29J31k11LP9j06N0J15j05l10M00j92J68
4316H1q6J74j6k41J70J84r0l26J18L9M4j77J65j94J70P6k21JL40j37j23L57m46
4339a38k9O3k32K60J8l6J8Q9j9j68L20j68l9q6nK23o6j74K11k72J68j65J17J47
$$ plain form
4363 37 14 54 -4 67 45 -34 -77 14 -24 32 -250 -139 271 -10 56 -338 -160 152 56 -24 -54 254 110 -21 -107
4388 -107 -21 20 -124 -10 20 -74 39 -10 34 -272 185 -18 -104 -173 126 189 133 -135 21 256 88 -39 -148
4411 -148 -55 104 -310 125 -63 -31 153 -19 -79 19 60 -245 21 9 -44 104 220 -107 -89 99 -252 -14 -34
4434 -34 159 -2 -98 14 -66 25 -145 -129 -136 -122 0 300 159 -94 76 23 77 233 -72 22 -291 32 -90 96
4458 96 -22 86 -145 -24 77 -148 -92 78 103 16 -143 -114 -137 111 -188 235 150 69 81 -158 -19 -153 -348
4481 -348 12 4 313 -6 108 -35 7 271 57 188 -11 40 157 146 -127 212 -5 -253 55 211 -141 29
4503 29 -157 213 -95 -224 25 47 -89 13 32 -29 -213 -168 193 -24 21 -87 48 -179 39 -206 -17 -299
4525 -299 25 69 -141 -167 57 -230 -29 -173 -71 282 -152 174 -194 62 -221 11 -10 -70 -172 -39 151
$$ packed form
4363C7k3M0n8P1k2p9m3R1l8N6k82J11M10k81O6l94J78L12r6q0l0L08j44j31q6
4388a07Q6M1j44J14L0r4J13m9M4l06M57k03q6o9K99O3n6k68J56K35j68j27j09
4411a48R3J59m14M35j88L2J84j72o0R8M1l05K66j2n3J48J16l27J8J88l51K38k0
4434c4J93j61r6J12q0R1j70J6pJ4J22L00j41k53J70n3N4J56l05R4l13L23j22J86
4458I6j18J08k31J21J01k25N6J70K5q7j59K9k3K48k99M23q5q1J2k39J39j34j95
4481c48L60qL09l19J14j43M2K64k14J31j99N1J17j1k73L39k17k48L08J56l52J70
4503B9j86L70l08j29K49K2j36J02J9o1j84M5L61k17M5j08J35k27K18k45J89k82
4525b99L24M4k10k6K24k87K01j44J02L53m34L26l68K56k83K32k1o0j02J33J90
$$ plain form
4546 151 -116 110 -84 151 78 -138 -380 -203 6 24 -143 -69 197 -173 -47 -73 -16 -85 -40 -108 139 89 -298
4569 -298 45 63 -23 -98 -127 -93 35 -146 -64 71 -138 -172 -138 82 -161 175 -115 -48 -94 129 -122 149 -95
4592 -95 39 -34 -177 -29 -225 -316 7 134 -15 196 -210 -88 -86 21 -143 -153 -319 -148 121 -32 43 -87
4614 -87 -176 -23 54 -44 -203 -162 -40 -108 296 -17 -13 245 -114 6 -55 157 121 147 257 -170 39 -55 74 42
4638 42 21 7 65 44 -20 -157 317 109 125 69 306 90 -56 142 68 46 -146 -99 3 172 -320 134 58 -74
4662 -74 -187 -136 -4 22 104 -293 -198 -74 45 64 142 -29 -214 -95 -1 -6 48 164 11 20 -142 -186 -179 -89 21 36
4688 36 -243 -69 27 407 -46 105 -196 -4 213 52 -8 -177 188 -29 -40 110 -134 -154 -39 64 -394 -168
4710 -168 -41 172 -191 107 38 52 -29 -267 -49 -286 97 79 144 -22 -90 -151 225 -101 -16 86 16 62 179
$$ packed form
4546A51k67K26j94K35p3k16k42J77K09J8j67P4K66l70J26k6N7o9M5o8K47n0l87
4569b98L43J8q6p5k9L4J28j81Q2J35k09l4L4K20k43L36k90O7m6K23k51K71k44
4592i5J34p3j43J48j96r1L23J27j49K11m06J22KJ07j64j0j66J71K69j53P5j30
4614h7q9J53P7r8j59M1J22o8M04l13MK58l59J20o1K12l6K6J10m27K09r4J29l2
4638D2k1j4N8k1o4j37M74k08J6n6K37k16j46J98p4k2j92M7J02J69m92M54p6j32
4662g4j13N1J32K6Q2l97R5J24J19J9P8j71j85J19R4nN4J16j53Rj62m4PR0J10J5
4688C6k79J74R6L80m53J51l01J92K17j61o0j69L65k17j1J50k44k0J15J03m58K26
4710a68J27K13l63K98o9J4q1k38K18k37L83j8O5j66o8o1L76l26Q5J02p0M6J17
$$ plain form
4733 179 75 -31 -31 41 -244 1 4 -233 -144 -16 -55 9 -110 -56 -111 -24 -58 -72 -128 41 -8 229 28 -129 110
4758 110 -228 190 54 12 -15 41 -42 -63 -200 139 10 33 191 -243 -317 69 -111 -118 96 241 -54 131 99
4781 99 142 -67 40 224 -140 -28 126 -123 128 -214 -10 -52 53 -78 37 -71 33 -222 -225 -153 -187 224
4803 224 -67 -73 -32 79 68 -5 -247 78 180 -90 62 -184 -46 80 142 -105 -11 225 59 -228 -81 76
4825 76 -110 -147 -76 1 -319 8 -22 61 141 -7 -232 2 -100 -16 92 66 -45 -236 64 122 19 112 40 -186
4849 -186 224 197 -82 -34 -208 80 182 128 -41 314 141 -116 -143 111 -100 131 151 100 -181 -10 -40 -85 263
4872 263 -197 -68 185 133 47 28 -177 -79 97 -14 13 -140 194 -55 -136 -42 -163 103 -14 139 220 124 105
4895 105 24 126 -104 323 -7 -87 -23 262 58 -26 -24 -16 322 -52 55 430 -2 93 -8 -270 -27 6 -26 -165
$$ packed form
4733A79j04j06%P2k85K45Lk37Q9J28l9O4j19N4n5Q7l4j4n6J69m9K37k01j57K39
4758A10l38M18j36m2k7N6q3k1j37L39j29K3J58m34p4L86j80pK14J45k95J85l2
4781I9M3k09J07J84l64J12J54k49K51l42K04m2J05j31J15j08J04k55lP2l4M11
4803B24k91oM1J11j1p3k42L25J02k70J52k46J38J26O2k47R4K36j66k87J47J57
4825G6j86l7P1P7l20L27l0Q3Q0j48k25K34j02Q4J08k6j11j91L00N8j03R3p2k26
4849a86M10k7k79M8j74K88J02n4j69L55j73k57k7K54k11K31K0n1k81J71l0m5L48
4872B63m60J29K53n2q6j9k05R8J76j11K7j53L34k49q1R4j21K66j17J53Q1r6j9
4895A05q1J02k30M27l30q0O4K85k04q4KQL38l74J07L75m32R5j01k62K43L3l2j39
$$ plain form
4919 -165 -18 -236 134 -19 -203 36 221 72 -284 18 -32 105 -91 30 41 -280 -103 -51 288 109 5
4940 5 118 91 -65 338 -41 -87 288 -151 81 -12 6 283 28 65 61 24 -44 101 62 -133 125 170 -54 -197
4964 -197 -5 224 -197 -165 128 -417 48 -23 109 -14 95 96 91 99 9 6 -179 -252 174 -124 36 18 -132 -45 28
4989 28 -36 237 -56 30 -1 -40 279 -144 128 -9 -13 -106 -130 267 59 60 -106 18 187 271 4 -204 172 -65
5013 -65 -48 41 203 -35 250 -160 -224 230 -96 150 122 -107 130 189 193 -60 125 178 160 -137 -187 214 141 92
5037 92 45 -173 83 89 158 15 -92 -17 102 -25 64 -351 -113 133 295 -48 -44 95 -223 -250 115 -192 -174 1
5061 1 88 127 43 -118 115 232 -183 -124 -5 -38 62 34 -83 -105 -336 33 159 -267 100 48 -63 -161 191 123
5085 123 65 -161 -32 -382 -240 -82 -6 12 300 -159 63 -214 96 -254 94 -47 -87 -24 -64 221 95 164
$$ packed form
4919a65J47k18L70j53j84K39J85j49l56L02n0J37j96J21J1l21J77N2L39j79j04
4940EJ13k7j56M03l79m6L75m39K32r3J8K77k55L7ml7o8J45l9j95K58M5k24j43
4964a97J92K29m21L2K93n45M65p1J32j23J09JnQr0lj85p3M26k98J60j8j50Q7P3
4989B8o4K73k93Q6l1l9L19m23K72j37mr3k4L97k08Jj66J24J69Q4k67k08L76k37
5013f5J7Q9J62k38K85m10o4M54l26K46k8k29K37N9Mk53J85N3j8k97n0M01p3m9
5037I2m7k18K56OO9j43j07P5J19j27Q9m15K38K46J62l43MJ39l18k7L65l07J8J75
5061AQ7L9q4j61K33J17m15N9J19l3J00k8j17k2k31L69J26m26L67n2j11r8L52o8
5085A23n8k26J29l50J42J58P6J8K88m59K22k77L10l50L48j41m0O3m0K85j26O9
$$ plain form
5107 164 80 235 -163 -189 -156 -42 139 30 128 56 -25 61 -242 23 73 176 72 93 128 -28 -102 30 -18 1
5131 1 -362 -18 -129 121 76 -276 95 -18 2 -62 -202 -299 57 235 150 -376 -7 4 11 89 -20 104 164 82
5155 82 -145 29 43 -60 -91 -141 -66 304 -117 207 -59 -165 -17 -112 231 -49 -251 -41 -181 -20 211 283
5177 283 53 -61 107 3 -20 -86 105 -186 -188 -99 253 -162 -5 -90 43 111 -9 39 -161 196 -38 -81 -42
5200 -42 -265 218 92 -2 -110 -155 33 199 -106 -114 -149 56 336 -136 184 -22 -43 -134 50 61 167 -44 -148
5223 -148 94 -209 -340 -10 -151 -308 -52 166 138 1 97 69 141 142 -27 -242 -138 -185 -88 21 -279 -70 -33
5246 -33 -13 -64 6 36 -23 173 -91 -39 143 -214 -69 -267 -73 96 -96 240 -34 25 -79 157 93 -17 79
5269 79 -154 -313 97 71 198 176 -91 9 -2 -103 -143 -68 -29 -30 -169 -108 -24 67 -125 -152 37 166 -160 2
$$ packed form
5107A64q4J55l98k6L3J14J81j09R8p2q1Q6l03K65N0J03j04K1L5j56p4J32m8J9
5131Al63L44j11K50m5l52L71j13K0o4j40r7L56J78q5n26L69J1PP8j09J24O0q2
5155H2k27J74J4j03l1n0P5L70m21L24k66j06J48r5L43k80k02K10j40J61K31P2
5177B83k30j14J68j04k3o6J91k91kQ9L52m15J57q5J33O8j20M8k00L57k34m3L9
5200d2k23M83j26r4j08m5J88J66l05ql5K05K80m72L20k06k1r1J84J1J06k11j04
5223a48K42l03j31L30j41j57K56K18k8j37R6k8P2Jj69k15J04m7R7J09l00K09L7
5246c3K0n1P0L0n9J96k64N2J82l57J45j98J94J69j92L36k74N9j04K36o4j10R6
5269G9k33j59M10k6J27k2k67J00j1j01m0P5L9jj39O1Q4R1j92k7J89J29l26J62
$$ plain form
5293 2 55 -178 -285 101 162 398 -132 144 -77 17 8 -167 75 51 -13 -105 -137 105 -41 125 93 -69 88 -354
5317 -354 -56 219 104 -100 -194 20 -99 308 -135 -163 -106 -287 -1 -64 -58 -146 -2 -51 103 293 65 -104 224
5340 224 156 192 30 319 -204 -122 -32 -104 -44 -45 -190 -131 -114 17 155 30 211 -41 161 -83 25 -275 -30
5363 -30 -59 57 221 190 -23 -444 22 -153 -31 143 -144 153 -270 -69 55 120 -12 -329 -17 -2 157 141
5385 141 66 -102 -62 60 -69 194 130 -14 -84 150 -79 229 -103 149 -49 -6 86 -187 251 -65 92 -84
5407 -84 -73 149 -86 -24 197 -4 104 148 -54 81 93 -22 -316 -143 -35 295 227 -114 96 17 217 94
5429 94 -24 -23 99 -18 216 119 -17 178 215 -144 -196 -27 164 -84 -227 79 292 179 -42 69 -10 -54 0
5452 0 -109 -151 -205 233 -33 -213 -29 53 114 -217 57 8 8 88 -50 -101 -144 -14 -245 83 -105 -110 -24 -14 -22 223
$$ packed form
5293BN3k33j07L86O1K36n30K76k21R4rj75K42k4o4r2l2K42j46J66l2j62J57m42
5317c54K98K75j15k04r4K14j19M07m43k8N7j81K86o3Oq8J44m9J54J90k28j69L28
5340B24o8L6j62K89n23Q2R0p2O0jj45N9J7J31J38j25J81k52K02k44J08l00K45
5363c0k9J16J64l1k13m21M66j75J22J74k87K97m23K01J24O5j32l17L12J5J59j6
5385A41p5j68M0J22j29K63o4j44p0K34k29L08l32K52j98M3R2k73M38l16J57j76
5407h4J1K22k35O2K21k01J08M4k02J35J2j15k94J73J08L30o8l41K10p9K00j23
5429I4j18JJ22j17K34r7j36J95L7l59n2J69J91k48j43L06K13j13k21J11p9m4N4
5452@j09m2n4M38k66j80J84Q2O1l31K74m9%Q0j38n1m3J30k31L28j88nQ6J0qK45
$$ plain form
5478 223 -187 -104 -52 81 221 81 194 -137 317 -23 -296 198 -69 46 -29 38 366 21 310 -50 1 58
5500 58 -10 -65 -9 80 109 -126 1 96 -203 26 57 19 122 -42 83 -174 29 171 100 -22 -290 -266 -78 -36
5524 -36 -76 39 -53 84 -47 -118 -165 -31 -135 -1 -45 282 57 -8 193 -91 130 70 180 122 53 133 -195 28
5548 28 -103 -59 -87 -124 -191 70 172 -38 -5 -163 -240 -74 -1 48 23 101 -100 66 -183 -231 -131 93 295 -109
5572 -109 100 161 44 192 -135 -130 208 80 -292 246 71 113 -16 154 138 35 -75 -218 -16 11 -103 -154
5594 -154 69 86 -242 -189 205 47 212 -158 -176 -214 -79 123 105 41 -187 224 -46 75 -102 -364 3 -1 394
5617 394 67 126 -145 154 -135 -22 -60 -161 202 -178 -157 -67 -25 76 8 109 -153 -207 3 -139 194 -251
5639 -251 -244 452 87 174 -94 -202 128 -66 85 172 -1 4 186 -113 106 39 11 -177 -198 253 -64 -244 24
$$ packed form
5478B23m10Q3N2J33J40j40J13l31M54l40k73M94k67J15p5O7L28l45K89l60N1N7
5500E8o8n5N6Q9K9k35J27R5k99K29L1l8J03j64J25k57K03J42p1j22k68K4J88M2
5524c6m0J15r2J37j31p1m7J34j04J34m4L27k25o5K01k84K21o0J10n8o9Q0l28K23
5548B8j31M4k8l7o7K61J02k10L3j58p7J66P3M9k5P8k01J66k49m8J00K24K02m04
5572a09K09O1j17J48l27NL38j28l72N38j75M2j29J70j6j03j10j43K02K7j14n1
5594a54K23J7l28N3L94j58J65l70j8l8J35K02j8o4k28M11k70J21j77k62L67mL95
5617C94l27N9k71K99k89J13l8j01L63l80K1R0M2J01o8J01k62n4K10j42L33m45
5639b51PO96l65Q7k68j08L30j94J51Q7j73NJ82k99K19o7k8j88k1M51l17j80K68
$$ plain form
5662 24 68 42 -71 33 102 -15 -174 297 -57 -67 -153 35 -131 -98 119 16 -45 -91 -255 -344 162 -149 78
5685 78 -186 94 -207 67 -129 -207 52 -79 -146 -49 -117 148 -296 -80 85 136 -27 398 44 -328 84 -24
5707 -24 -28 -131 -218 -396 171 -51 148 136 21 -68 257 -326 -157 229 -340 74 -209 -10 219 -175 -138 87
5729 87 70 26 171 14 36 8 56 43 -75 48 -21 155 65 -7 66 -34 0 -69 9 155 142 -65 -236 48 31
5754 31 61 11 0 -45 123 93 241 -102 -78 74 -69 -263 -74 -61 48 145 42 -210 1 10 84 92 -233 -24 -12
5779 -12 -264 -49 -52 -24 74 -204 -308 -317 -62 43 121 136 87 30 43 -136 192 -29 188 -107 -206 36 -58 107 -199
5804 -199 -187 333 -316 150 9 183 -9 -205 -130 -24 -49 0 -101 81 -2 -52 1 -145 196 68 -28 208 156
5827 156 -5 -110 102 -162 -28 -190 -235 63 53 71 70 151 -29 39 -262 -158 21 -166 152 -85 -215 135
$$ packed form
5662B4M4k6j13J04O9j17j59M71l54j0q6J88j66L3K17j03o1m6j64q9N06l11K27
5685G8k64K80l01K74j96p8K59j31o7R7o8K65m44K16J65N1j63M25l54l72M12j08
5707b4mj03q7j78N67k22J99j2j15q9L25n83J69L86n69M14k83J99K29l94L7K25
5729H7j7m4J45j57K2k8M8j3j18J23o9J76r0p2P3j00L4o9P8J46j3k07j71K84j7
5754C1L0n0j1m5J68l0J48l43K4J52j43j94J89J3J09R7j03k52K11RP4Ql25K09J2
5779a2k52K15lK8R8k78j04rK55J05P8J5m9n7J3j79L28k21K17k95r9K42r4J65l06
5804a99J2N20o49M66j41J74j92j96P5J06k5M9j01J82q3n0N3j46L41j28r6K36n2
5827A56j61j05K12k64J34j62m5K98j0J8jQ1j80O8l01J04J79j87L18k37j30L50
$$ plain form
5849 135 62 -141 341 -216 316 5 44 141 -135 105 101 -109 -43 129 -269 118 23 -223 -233 88 23 222 -45
5872 -45 -64 225 -5 23 -190 108 -14 -15 -196 -21 71 292 -19 -97 5 -61 2 57 -88 36 64 -91 183 79
5896 79 -64 -96 -196 -304 -106 -54 -153 -99 -226 270 199 -226 -203 69 35 -157 222 -13 12 -92 45 40 -120 -32
5920 -32 121 223 21 70 -61 6 -189 2 70 -185 19 -100 526 -63 181 -153 168 242 252 -44 -154 -268
5942 -268 -282 -367 -65 -25 36 -59 -24 97 -17 212 -101 140 10 196 30 -71 147 256 88 -205 107 150
5964 150 -60 150 -139 -254 23 -25 152 192 -39 161 -166 320 -110 -31 89 -85 -179 50 -27 132 -376 -35
5986 -35 346 230 41 136 87 16 84 152 210 113 -81 -9 -154 -154 -248 4 -66 -255 134 -136 143 -204 17 -280
6010 -280 -136 -114 -65 37 -108 28 43 90 57 174 -2 145 6 -110 -71 36 28 -99 58 15 372 108 -136
$$ packed form
5849A35p3k03M82n57N32l11L9R7k76K40mk10O6J72l98L87r5k46j0L21o5J99k67
5872d5j9K89k30K8k13K98j22jj81J75R2K21l11p8J02o6O3N5j45J24K8j55K74j04
5896G9j43l2j00j08J98N2r9N4j27M96p1m25K3K72l4j92L79k35K5j04J37nj60Q8
5920c2J53J02k02M9j31O7j95J91O8k55K04j19O26n89K44l34L21P4J0k96j10j14
5942b68j4q5L02M0O1r5L5J21j14K29l13K41j30J86j66j01K18J09j68k93L12M3
5964A50k10K10k89j15K77m8J77M0k31K00l27M86m30P9J20j74r4K29p7J59n08L41
5986c5L81j16j89R5m9p1O8O8N8r7j94P2j45%r4K52p0j89L89k70K79l47K21k97
6010b80J44K2M9J02j45J36J5M7l3J17j76J47j39j16L9J07qj27J57m3L57k64k44
$$ plain form
6033 -136 -140 -68 130 38 -57 102 141 180 127 -147 -209 -81 56 -288 315 -12 20 -143 -19 -131 96 281 -22
6056 -22 307 6 -14 -84 85 -88 89 -182 81 38 171 -32 83 -167 87 120 -67 -50 87 268 -7 0 151
6079 151 180 226 139 203 26 148 68 -285 173 270 233 20 -114 -22 -25 -148 43 -11 -101 84 100 -125 -183 -83 132
6104 132 121 137 296 137 -86 -105 169 -119 -33 48 -157 49 29 -341 146 -198 244 -72 45 206 91 -183
6126 -183 203 211 -167 -84 -110 66 226 256 45 -126 -37 -86 -130 -191 157 -29 134 25 106 153 4 22 194 87
6150 87 -122 -80 9 -281 103 -148 -90 -1 130 1 104 -279 -92 -8 -280 15 -37 -52 44 43 125 203 149 -67 127
6175 127 -85 176 -51 -114 -116 -349 -35 -38 316 50 56 -105 -42 -170 -44 140 -87 -28 344 90 331 -166 232
6198 232 -83 50 -9 -101 46 89 29 109 -38 166 42 -69 75 -12 85 28 -71 -113 161 6 7 -234 -131 -1
$$ packed form
6033a36mP2J98r2r5J59L9L9n3k74o2J28J37l44O03l27L2j63J24j12K27J85l03
6056b2L29l01k0p0J69j73J77k71K63m3J33k03J15k50K54L3j87J7J37J81k75PJ51
6079A51K9M6q7O4j77J22q0l53M58R7l7k13j34R2lj23J91n4r0J85J6k25n8J00K15
6104A32j1J6J59j59k23j9K74k88Q6Q1k05K06k0l70M87l44M42l16J17J61j15k74
6126a83L86Ql78Q3k6J76J60L0k11j71Q9m9m4o1L48j86J63j09Q1M7j49J8J72j07
6150H7k09M2Q9k90L84k51N8Q9J31j29J03l83J87Q4k72K95n2j5R6jQ2P8n4k16J94
6175A27k12K61k27o3kk33L14lL54k66Oj61O3j28J26J84k27N9L72k54K41m97L98
6198B32l15J33n9r2J47M3o0Q0j47K04j24j11J44q7R7n7r9m2K74j55Jk41J03J30
$$ plain form
6222 -1 129 -39 65 -126 142 -126 33 -24 151 124 127 -278 -92 -80 -134 -13 -80 61 260 -66 361 -90 105
6245 105 -27 -35 88 -62 -144 -27 50 60 -23 77 111 122 121 -20 -9 -33 125 -61 190 119 -54 53 106 185 -152
6270 -152 -91 172 187 44 -66 216 -102 76 -22 180 91 125 47 -253 93 267 157 105 277 -45 -34 -52 -402
6293 -402 -32 -170 126 198 110 93 104 74 151 -42 124 -42 121 29 107 -39 75 -173 -113 -6 230 -1 -123
6316 -123 48 -268 -79 -143 13 -110 425 65 -196 139 -17 -209 -19 -88 276 -8 -211 324 119 97 119
6337 119 -304 24 -27 -239 118 -37 -77 -167 130 18 -84 396 1 31 78 -129 399 -42 -100 112 15 -17 -165
6360 -165 60 134 -4 -169 25 -33 135 79 223 -140 -12 -70 -99 63 76 -147 47 -59 45 156 -120 -64
6382 -64 -288 122 47 -82 -228 -56 -1 -13 72 -39 -30 15 -229 313 43 69 19 91 -66 -279 -150 -17 240 -5
$$ packed form
6222aJ30j68J04j91K68k68J59n7J75k7Lm05J86J2n4J21o7J41J99l26M27m51J95
6245A05j32qJ23j50q2J17P7J0q3J00L4J1jj41J1k4J58j86K51p1j73J07N3P9l37
6270a52O1K63J5j43j10K82l18J78r8K02q9L4p8l00L46J74j10n2J72l22J1j8l50
6293d02L70j38K96P2q8j7J1l0P7j93J66j66J63r2P8j46J14k48O0J07K36k31j22
6316a23J71l16J89o4J56j23N35l60k61L35j56j92J90o9L64k84k03N35k05k2K2
6337A19m23L28n1k12L57j55m0r0K97j12j02M80l95L0M7k07N28m41n8K12r7l2j48
6360a65K25P4j38j65J94n8J68n6J44l63J28n8k9J62J3k23J94j06J04J11k76N6
6382f4k24M10p5j29j46J72N5j2Q5j11RM5k44N42k70K6n0P2j57k13J29J33K57k45
$$ plain form
6406 -5 -89 -77 97 -75 288 -30 -66 61 57 9 228 95 127 -10 -26 -49 242 -16 70 -167 -79 -31 107 0 -123
6431 -123 -53 -208 -11 -156 -59 -244 44 236 123 -110 -86 205 244 70 28 -225 154 -128 -49 -63 84 -166
6453 -166 -21 290 -28 -39 46 73 -4 249 -109 66 -9 -146 -29 135 -22 -34 19 -153 79 -91 39 60 85
6476 85 85 -162 62 88 -149 -373 -44 -128 -125 -191 -200 -187 -137 247 50 18 73 -295 75 -173 -17 -38 -11 107 -88
6501 -88 22 -113 297 10 -361 -3 -33 -14 143 47 153 5 77 -192 42 31 -33 -50 10 73 -254 -100 22
6524 22 -205 -26 140 -91 -100 338 -74 32 13 131 193 -32 -195 101 130 49 -76 143 -281 28 84 -223 -181
6547 -181 51 376 70 283 108 52 85 -137 -37 68 -89 92 -326 86 67 -143 191 -26 174 210 -73
6568 -73 216 99 -149 178 55 161 -130 125 -300 39 70 31 113 -84 100 -152 146 131 106 -55 -5 -224
$$ packed form
6406eq4J2J74j72L63l18l6J27mm8K19j33L2j37j6k3K91k58Q6k37Q8M8J38j07j23
6431a23P0j55J97j45R7j85K88J92j13k33K4K91L9j74m2k53L79k82P9j4J47k50
6453a66J45L11l18j1Q5K7p7K53l58J75p5j37J17J64j57j2N3j72K32j70J30K1K5
6476H5%k47K24K6k37k24L29q4Lo6rJ3N0L84j97l2N5l68L70k48J56k1K7J18j95
6501h8J10j35M10k87l71L58l0J9J57r6J06j48P2k69K34j1o4j7O0O3l27J54J22
6524B2k27J79J66k31rM38m12J06j9J18O2k25j63K96K9q1j25K19m24L09N6l07M2
6547a81K32L25l06K13j75n6L3k22J00J05j57J81m18M12j9k10L34k17K00L6k83
6568g3K89j17k48L27j23J06k91K55m25L39L1l9Q2j97J84k52K98j5k5j61N0k19
$$ plain form
6590 -224 66 263 -128 -86 -68 76 79 165 114 92 14 122 84 81 157 126 -94 -21 -212 -15 -154 -187 71 -47 -15
6615 -15 81 36 308 54 38 -33 181 59 58 -55 -26 -76 105 -57 84 202 -29 110 133 305 113 170 -2 -193
6639 -193 -29 154 99 -76 -209 21 90 -15 8 -29 -49 35 -228 -298 -284 62 7 -19 -17 204 112 77 -154 231 150
6664 150 -65 -18 13 -224 69 -243 -47 -152 -154 67 -11 160 4 -290 47 85 44 10 92 87 -43 370 -47 40
6688 40 -54 308 -17 -132 -171 -152 -32 155 148 166 84 -13 189 56 95 -118 33 19 165 -24 -71 43 -17 156
6712 156 -4 -139 229 -5 -26 -161 -83 61 -157 -157 116 -186 -258 -75 92 -204 33 -64 200 156 -69 156
6734 156 -113 62 277 -154 -111 -233 37 135 -50 244 -2 18 -121 -258 -137 -58 57 -114 110 -22 -63 118
6756 118 36 -49 -237 43 112 22 17 -172 283 -14 57 -162 76 63 -99 33 134 -116 192 153 -51 -105 171
$$ packed form
6590b24K90J97l91M2J8J44LQ6n1k2p8J08l8lP6l1k20P3j91J97j39l3K58j18L2
6615a5R6m5K72k54j6p1K14j22jj13K9n0J81j62J41J18k31J39K3J72j92N7j72j91
6639a93J64J83n5j75j33K30O9j05K3l7k0Q4k63p0J4L46n5k6KK21r2l5k31L85q1
6664A50k15M7L1k37K93l12J96j05kK21p8J71j56k94L37L8m1l4Q2nj30M13m17Q7
6688D0r4L62l25j15l9J9J20J87pJ8q2r7K02j33L9k13J51j4J46j89m7J14o0J73
6712A56j60j35L68k34k1j35P8J44k18%K73l02p2J83J67k96K37r7K64m4k25K25
6734A56k69J75K15m31M3j22K70R8j85K94k46K0j39j37J21P9J15j71K24j32m1J81
6756A18q2q5j88K80O9r0nj89M55k97P1k19K38j3j62J32J01k50L08l9k04n4K76
$$ plain form
6779 171 150 199 -208 -113 -30 -15 -203 228 -77 25 -31 36 182 53 -117 96 106 -7 -321 -151 122 59 -133
6802 -133 87 -209 202 10 -394 360 -7 182 29 22 -69 -19 52 -68 -16 54 76 58 137 -89 -70 67 50 106
6826 106 44 144 -341 74 -118 42 -182 -227 -83 166 103 -177 -145 -8 -70 -160 -228 -78 166 252 194 37 191
6849 191 243 305 31 89 71 -262 173 -69 85 -17 238 230 107 67 19 -346 -12 -82 -204 154 178 -58 -125 16
6873 16 -32 145 -37 151 70 81 65 -104 -163 -98 -98 187 -86 39 38 40 229 1 21 -199 259 -138 -70 -34 -374
6898 -374 143 139 -15 -60 76 146 -137 -178 -181 23 136 202 66 473 54 227 -186 -101 321 70 -253 331 158
6921 158 -249 -133 -198 43 -31 118 36 245 97 75 -275 153 -202 -212 -44 84 -43 -229 236 -42 -78 -75 -202
6944 -202 -46 -235 -331 108 -19 -47 6 25 -121 76 -149 95 -247 56 -12 -354 213 -180 89 -79 -64 -105
$$ packed form
6779A71k1M9m07R5Q3J5j88M31l05J02n6O7J46j29j70K13J0j13l14J70K73o3j92
6802a33K20k96M11j92m04P54l67J89j53pr1N0P1j20N2P0K2j8P9k26J9J37j7N6
6826A06o2J00m85M15j92J60k24m5J44K49o3k80L2J37o2r0o8J50K44Q6n8j57J54
6849A91N2O2k74N8j8l33M35k42J54j02K55qj23m0m8l65L34p0j22L58K4k36o7J41
6873A6m8J77j82J88q1J1j6j69n9O5%K85k73J25jKJ89k28K0k20M58l97O8L6l40
6898c74N17mj54m5J36P0k83m1lK04J13O6j36M07m19J73m13Q5M22k51l23N84j73
6921A58m07J16o5K41p4J49q2K09j48k2l50M28l55j0J68J28j27j86M65k78l6Lj27
6944b02J56j89r6M39j27k8N3J9j46J97k25K44l42L03o8l42N67l93K69j68J5m1
$$ plain form
6966 -105 -25 69 45 -39 23 -16 -151 198 129 86 -25 171 -162 -184 132 -152 -135 -38 297 -221 -213 -62 28 31 119 -154
6992 -154 6 36 100 233 -106 112 2 -169 -182 -25 -54 145 -71 85 -165 -8 151 217 50 16 -173 -121
7014 -121 197 -28 -48 150 89 121 113 -221 -6 103 148 -196 -45 175 -78 48 39 -97 15 143 134 -73 -70 57
7038 57 -90 -74 161 -126 -64 -20 12 -122 -36 -78 164 -189 -1 116 11 -124 189 -71 224 63 -115 -85 -41
7061 -41 356 -39 79 15 -113 188 210 53 -27 -286 -113 -46 197 -104 -25 -126 -60 27 -120 -7 -47 158 -63
7084 -63 -22 118 -55 196 150 70 -446 12 -32 -81 -289 -73 7 84 -199 13 -72 101 237 -144 3 30 -3 -164
7108 -164 -13 222 13 84 -146 105 25 89 41 -151 -166 225 -43 109 -48 -335 -121 -11 178 130 0 -41
7130 -41 316 -129 102 54 20 153 45 -116 123 -64 106 -162 87 -40 184 24 -189 -377 46 85 -54
$$ packed form
6966a05Q0R4k4q4O2l9j35L49o9m3j11J96l33k2L16k84J7R7L35n18QJ51R0LQ8k73
6992a54J60L0O4J33l39K18j10j71j3J57k9J99k16J56k50J57J59O6j67l4j89N2
7014a21L18k25k0J98o1L2ql34K15J09M5l44J51K20k53J26rj36J12J28rk07LJ27
7038E7j47J6K35k87O2M4L2j34Q6m2K42l53J88J17j05j35L13k60K95j61j78L0M4
7061d1L97l95J18o4j28L01K2j57q0k59J73O7K43l01P9j01O6Q7j47J13m0K05k21
7084f3M1J40j73K51m6q0n16M58m4m9k08K16Q0P7k83K12q5J73J36l81J47K7l3j61
7108a64J51K35k09P1k30K51q0O4m8j92j5L91k68J52j57k87K14J10J89m8j30m1
7130d1L57m45K31m8l4J33j08j61K39j87J70k68K49j27K24j60k13j88M23L9j39
$$ plain form
7151 -54 -61 -18 258 -139 18 -189 -24 -264 79 -25 -31 -31 24 392 -110 -142 158 210 76 83 75 -16 -35 -151 82 -48
7177 -48 38 -257 -100 -115 211 73 -73 34 198 -49 67 107 226 -95 -88 233 67 -186 139 29 -146 42
7199 42 25 130 39 24 -127 174 266 48 -221 -117 -23 -79 148 -56 -3 70 111 -21 118 -171 -99 103 84 -12
7223 -12 -20 116 -43 127 -324 -125 -2 -167 -127 -104 -38 155 -51 269 -79 -181 128 -21 184 -46 50 -17 -132
7246 -132 -73 35 57 66 48 130 69 -115 196 73 65 338 -387 -231 146 -228 63 210 171 182 -40 207 80 -309
7270 -309 -130 -137 -26 -79 -165 -2 -48 165 159 27 -76 -185 -59 -107 -14 247 -354 -99 53 200 34 38 95 108
7294 108 71 44 -269 14 0 -18 43 -250 135 -65 14 -29 -23 124 25 132 -118 120 29 75 116 -165 88 -177
7318 -177 -50 -235 -23 -107 134 -143 56 -9 32 59 142 -71 -298 143 -260 21 226 431 -30 -11 22 304
$$ packed form
7151e4pM3K76l97J57k07J65k40L43j04o%N5L68n02l2L00N2j34Pqr1j9j16K33j30
7177d8Q6k95J57j5L26j38j46J07J64k47J16M0J19l21PL21j66k53L25j10j75J88
7199D2j7J05r1j5j51L01R2k18k69J04R4n6K27k04N3P3M1j32J39k89P2K02j9r6
7223a2qJ36j59J70m51J99J23j65M0K3O6J93k06L20l48j02L09j49K05k30R6o7j15
7246a32N9J08K2Rj8Q2o1j84L11j23qK73p25J56L77l74K91J47l9J1k22K47j27l89
7270c09J79pJ11n3q6J63m6K13oj32j03j09J26m8R3K61o01K55J52J47j66MN7J3
7294A08l7k7l13K83j4j8O1k93L85k00P9m3OJ47r9J07k50K38r1M6M1k81K53k65
7318a77J27j85K12q4K41k77J99o5M1K7Q3k13k27M41m03K81K05K05m61J9L3K82
$$ plain form
7340 304 -38 156 53 -137 -8 124 -74 -175 92 -202 -276 191 -143 116 -61 75 27 121 138 125 -19 -10
7362 -10 -53 -443 100 -87 0 -81 -74 -64 46 89 -52 -4 -15 -29 -157 5 224 135 -62 -130 77 28 -224 -73 -212
7387 -212 -12 -19 -128 141 -10 93 124 -155 -63 91 -190 -225 161 230 115 187 -38 128 103 48 113 243 -10
7410 -10 -67 86 -129 16 -45 -25 31 -87 109 -266 55 38 -42 -146 99 155 -120 -2 -8 -280 -24 -229 42
7433 42 8 72 -117 -231 145 128 67 -59 -146 172 -163 -9 -113 -26 91 94 -138 -218 -24 -81 97 -85 15 -35
7457 -35 -143 -65 309 122 -28 23 49 -305 -221 -66 -159 60 43 3 -152 165 -75 281 49 -98 -88 5 101 339
7481 339 146 6 187 -148 140 -182 -6 57 283 150 -110 129 -38 -84 73 -245 139 -93 -48 16 -175
7502 -175 -150 -6 93 -156 12 -77 191 -139 -205 164 180 -96 9 -108 191 -112 115 364 105 -4 -274 73
$$ packed form
7340C04l42J94j03j90J29J32j98j01K67k94p4M67l34K59j77J36m8R4J7j3j44R
7362a0m3l90N43j87Q7q1PJ0J10M3j41M8j1j4j28J62K19q9j97o8K07m9k52J51j39
7387b12K00pj09K69j51J03L1k79R2J54k81l5L86O9j15P2k25J66k5n5O5J30k53
7410a0n7J53k15J45o1K0N6j18J96l75L21j7q0j04K45N6k75J18ok72K56k05K71
7433D2l4O4j89j14L76j7o1j26q7L18l35J54j04Q7J17Lk32q0J94n7J78j82J00n0
7457c5j08P8L74j87j50N1K6l54Q4J55r3K19j7m0j55L17k40L56k32j47J0R3R6K38
7481C39j93j40J81l35K88l22J76O3K26j33k60K39j67m6J57l18L84k32M5O4j91
7502a75K5J44R9k49J68q9K68l30o6L69J6k76J05j17K99l03K27K49k59j09k70L47
$$ plain form
7524 73 119 -169 186 -138 203 349 92 -130 161 107 -52 124 -143 -75 166 137 -10 -88 -268 32 98 182 -178
7547 -178 -139 -10 -143 -118 -117 91 -232 305 90 24 -83 17 4 68 -47 -233 -105 14 -15 16 32 -138 -235 -23
7571 -23 -107 -326 -244 143 -91 34 -57 -11 -22 26 89 -320 1 -94 118 -140 -24 142 121 -94 -15 -122 -113 72
7595 72 23 40 97 55 -89 81 23 -96 -25 79 -3 313 -135 -108 383 -305 191 95 35 135 -181 111 234 -36
7619 -36 -121 179 130 -55 22 -130 160 44 10 -128 70 166 -87 5 127 362 114 48 56 49 198 221 -113 -40 67
7644 67 82 -65 55 -150 54 -70 -106 -1 -85 -20 -62 255 218 89 -72 -66 -191 -172 -303 351 -128 -174 -258 -3
7668 -3 148 -125 4 -240 10 31 34 -78 26 37 -10 -199 181 115 160 -52 123 114 38 -7 -144 74 12 119 -99
7693 -99 93 127 -37 -14 26 195 -32 -198 52 -65 164 -154 -133 -126 -22 59 -54 -87 -88 91 -192 -180 -34 27
$$ packed form
7524G3M6k88L55l24L41J46k57k22K91n4j59J76k67O8K41k9j47p8j80L00O6Q4l60
7547a78L9J29j33K5JK08l23N37k15o6j07J00j3O4j15j86J28J19k9L1J6j70r7K12
7571b3q4k19Q2L87k34J25r1M6j1M8O3m09L21r5K12k58J16J66k1k15P9j07RJ85
7595G2m9J7N7m2j44J70n8j19P1J04q2L16m48K7M91o88M96r6o0J00l16K92J23k70
7619c6q5L00m9j85P7j52K90j16l4j38J98R6k53R2J22K35k48o6QpJ49K3l34P3J07
7644F7J5j47J20k05K04j24l6J05q4O5m2L17l7j29j61Oj25J9j31O54m79m6q4K55
7668cJ51k73J29k44K50K1Lj12J04J1m7j89L80o6M5k12J75rp6m5j37K18o2J07k18
7693i9J92L4j64K3M0J69k27j66K50j17K29l18K1PJ04Q1j13l3jJ79k83J2J46O1
$$ plain form
7717 27 142 19 264 75 -200 -87 -85 -75 -46 12 -40 -2 67 -110 -34 -18 17 -17 76 -56 -341 -108 -155 36 -27
7742 -27 -309 175 231 -161 -10 24 33 -60 252 87 29 -233 133 -200 190 94 -212 72 -100 -29 -236 177 -33
7765 -33 236 64 -57 -66 10 -127 -231 -161 110 163 -281 74 55 -120 292 -168 -83 12 91 -19 -108 -83 -17 13 91
7790 91 299 -43 -86 -45 -113 151 -51 -231 -144 -302 -141 -61 -148 514 -20 -172 -203 10 -123 -7 -314 15 61
7813 61 -298 -55 -18 470 -91 12 -35 -278 -287 -249 -46 -54 40 -332 -167 169 76 -7 -133 224 169 -169 150 -94
7837 -94 94 116 -124 -164 60 26 -278 -10 159 152 -24 145 -153 176 -65 3 95 67 205 -14 106 222 -96
7860 -96 -220 29 101 37 -57 29 297 -150 -130 22 -7 -153 -104 -9 -277 -127 -136 -104 197 -88 -144 -150 49 136 -11
7885 -11 -78 -151 -1 -79 28 43 -24 77 10 -102 -147 -111 47 -164 241 -101 32 -92 -57 156 61 104 -42 129
$$ packed form
7717B7J15j23K45j89k75J13KJ0K9N8n2L8O9j77P6J6L5l4R3j32k85K33m7J91o3
7742b7k82M84N6l92J51L4Rr3L12j65n8k62L66l33L90r6l06K84j72P1k07M13k10
7765c3K69j72j21rP6j37j04P0K71N3m44L55j9j75M12m60Q5R5P9j10q9K5O6L0P8
7790I1K08l42m3M1o8K64k02j80Q7j58J61Q0q7O62n34j52l1K13j33J16l07L29M6
7813F1l59K43L7M88n61J03m7k43rL8K03qR4l72J65L36r3q3j26L57n5l38L19k44
7837i4J88K2k40m0K24l4l04K68J69pj76J69k98L29k41O8R2k8J38k19J20J16l18
7860i6j24K49P2o4r4Q6K68m47K0J52k9j46M9R5k68J50rL2L01k85n6oJ99Q7j47
7885a1o7p3J50p8J07J5o7J01o7j12m5L6J58k11M05l42J33j24L5K13r5M3j46J71
$$ plain form
7909 129 -26 173 -208 -62 97 -68 3 -179 -97 -92 106 -149 -57 -319 131 355 102 71 106 -36 30 62 -112
7932 -112 129 13 -173 -89 65 -147 2 209 1 -240 -61 -46 245 20 275 -303 78 87 -120 -51 31 85
7954 85 -168 173 -78 -228 -182 -97 -187 353 31 102 154 -167 -166 -110 239 23 -25 -82 -96 250 -228 111 -185 -156
7978 -156 -96 -100 -24 -69 60 107 -13 -188 162 48 -89 -20 -103 -75 71 54 113 94 -123 -379 -125 -90 -1 -94 -197
8003 -197 35 -139 -99 183 -107 254 -11 -119 -25 82 80 -31 21 38 -138 -101 4 -157 -134 74 -85 219 -88
8026 -88 -33 21 62 -42 -42 63 -40 -163 -166 -216 107 -426 -190 195 -175 52 15 -6 37 -210 76 -141 -85 -142 -324
8051 -324 108 15 -167 -150 124 94 94 -6 77 -15 -50 114 -89 -59 -119 -43 -116 -116 26 124 107 207 57 17 -116 -78
8077 -78 174 -82 190 25 3 24 54 20 -77 -13 61 -122 -425 217 -127 117 6 -115 101 27 -79 211 -3
$$ packed form
7909A29j55J99l81J46J59j65P1j82Q2NJ98k55R2k62M50K24k53l1L5j42O6L2j74
7932a12K41j16j86Q4J54k12J49K07k08k41J79J5K91k25K55n78L81Rk07O9Q2N4
7954H5k53L41k51j50M6Q5r0N40l22P1N2l21JN6L49k16m8n7j4L46m78L39k96K9
7978a56O0mP6m5J29M7j20j75L50j14j37O9q3K8J46j7N9j9k17k56K54L5Q9r3j03
8003a97K32j74M0K82k90L61k65j08R4J07kj11N2J7j76L7J05j61K3K08j59L04l07
8026h8N5N4M1j04%J05j03j23ln0L23n33K36L85l70K27l7k1M3k47K86k17N6n7j82
8051c24M32r3j82J7K74l0%j00Q3r2l5J64k03L0o0P6p3%J42R8j7J00j50m0j33L8
8077g8K52k56K72j65k2K1L0l4r7O4P4j83l03O42l44K44j11j21K16p4j06K90k14
$$ plain form
8100 -3 213 -100 119 -117 114 -110 -18 -93 6 -36 126 144 -11 256 -100 -237 -201 -80 -225 113 -260 103 76
8123 76 302 -107 32 -200 -92 -155 156 -206 97 258 -140 -9 -164 232 96 144 92 -16 0 154 -36 49
8145 49 -246 -11 -166 3 101 -58 238 -14 -289 28 -98 -6 101 88 -174 -10 63 -232 114 -37 39 225
8167 225 73 -215 -43 -70 -6 110 118 163 60 -70 -109 7 192 6 -242 156 229 -302 -130 26 -42 115 -41
8190 -41 6
$$ packed form
8100cK16l13K19k36K31k24R2p5R9m2J62J8j55K67l56j37L6J21j45L38l73L63k7
8123G6K26m09J39k32J08o3L11l62L03J61l98J31j55L96j36M8n2j08J6J54j90Q5
8145D9k95K35j55J69R8j59K96k52k75L17j26R2J07j3k62J64P3k95L46j51P6J86
8167B25j52k88J72k7O4J16QM5j03j30l9J16J85j86k48L98P3n31J72J56o8J57j56
8190d1M7
8191F
$$ Imaginary data points
##PAGE= N=2
##DATA TABLE= (X++(I..I)), XYDATA
$$ plain form
0 0 0 0 0 0 0 0 0 0 0 0 0 0 0 0 8 -8 8 -8 8 -8 16 -16 16 -24 24 -32 35 -40 48 -56 63 -71 80 -90 101 -115
36 -115 128 -144 161 -178 198 -221 245 -270 298 -329 362 -400 441 -485 535 -591 651 -719 794
55 794 -881 980 -1094 1229 -1387 1580 -1820 2129 -2539 3111 -3972 5399 -8185 15600 -75095
70 -75095 -173638 66756 95676 -67006 -94630 48826 78382 -21390 -30315 30975 25816 35596
82 35596 15682 -26477 11745 54418 10902 -44486 -16437 50170 -4558 -64952 -6071 11373
94 11373 -32003 -30039 -20106 -22832 -24925 -10158 -16832 -49937 -5674 25247 -45468 -37979 32646
107 32646 7495 -45092 -12992 40665 -5141 -53287 17557 31695 -41118 -25749 16728 -3340
119 -3340 -30686 -20935 -68 -18724 -20695 -1705 -33378 -22244 27870 -12004 -49001 9019 52469
$$ packed form
0@%%%%%%%%%%%%%%Qj6J6j6J6j6K4l2L2m0M8n6O7p5Q8j04J19j34J51j70J91k16
36a15K43k72L05l39L76m19M66n15N68o27O91p62Q41r26J020j126J242j370J513
55G94j675J861k074K323k616K967l400L949m668N650p083R371j3584K3785r0695
70g5095r8543K40394K8920j62682k7624J43456K9556r9772q925O1290n159R780
82C5596j9914m2159L8222M2673m3516n5388K8049O6607n4728o0394N8881J7444
94A1373m3376J964R933k726k093J4767o674l3105M4263L0921p0715P489P0625
107C2646k5151n2587L2100N3657m5806m8146P0844J4138p2813J5369M2477k0068
119c340k7346R751K0867j8656j971J8990l1673J1134N0114l9874l6997N8020M3450
$$ plain form
132 52469 -5388 -50791 38920 82637 -16709 -25364 67284 67121 2827 487 56717 57861 11488
145 11488 20028 31856 25479 38050 12744 -10243 20850 32030 -674 -27956 -290 29287
157 29287 -14426 -35373 -1602 2036 -6573 -16230 -24357 -3904 9090 -3093 -27520 -17924 34781
170 34781 12815 -46997 -4874 46145 4754 -39329 -2986 43589 -1709 -38464 10216 20375
182 20375 -14439 -12438 -1846 -1019 -6401 -7158 -4536 -14503 -248 8124 -19517 -8477 16392 -1719
196 -1719 -11283 3466 16542 2758 -10512 17193 17134 -9640 7394 16988 1263 -767 6321 7831
210 7831 -6517 -5355 10323 -10940 -17172 6334 -6668 -22952 -12087 -1612 -9201 -26193 -12281
223 -12281 2400 -16708 -15848 -5670 -8346 -906 -4894 -11950 -457 8095 5068 -10761 -3194 25779
$$ packed form
132E2469n7857m5403Q9711M3717r9346q655R2648j63o4294k340N6230J144m6373
145A1488Q540J1828o377J2571k5306k2987L1093J1180l2704k7282K7666K9577
157B9287m3713k0947L3771L638q609r657q127K0453J2994j2183k4427R596N2705
170C4781k1966n9812M2123N1019m1391m4083L6343M6575m5298l6755M8680J0159
182B0375l4814K001J0592Q27n382p57K622r967J4255Q372k7641J1040K4869j8111
196a719r564J4749J3076j3784j3270K7705n9k6774J7034R594j5725k030P088J510
210G831j4348J162J5678k1263o232K3506j3002j6284J0865J0475p589j6992J3912
223a2281J4681j9108Q60J0178k676P440l988p056J1493Q552l027j5829P567K8973
$$ plain form
237 25779 6319 -16967 9701 24365 4707 -11681 5997 25575 -502 -10613 12478 9154
249 9154 78 722 163 5743 3092 1348 827 -3430 9264 6143 -9448 4478 10301 -766 -860
264 -860 2818 8387 1403 -2551 9091 1329 -2844 8848 900 -4223 2808 3911 343 -8344 1191
279 1191 8532 -9439 -6436 6577 -1750 -5604 -3411 1418 1275 -7473 186 2484 -4807 2518 -34
294 -34 -3786 4312 1817 -1723 -485 2595 6444 -4374 -2934 9940 -582 -5089 3008 2599 388
309 388 -4338 124 4155 -5813 -1304 2229 -5881 -1058 -39 -4626 -3081 -3201 662 -3354 -8027 2537
325 2537 -1210 -7692 -217 -1055 -1900 -1604 -2705 2195 -1726 -1578 4099 -2268 1433 5226 -1485 1655
341 1655 4107 2909 2403 -877 5943 5305 -3773 3731 4767 -1266 655 -213 1875 -308 -4692 2006
$$ packed form
237B5779j9460k3286K6668J4664j9658j6388J7678J9578k6077j0111K3091l324
249I154r076O44n59N580k651j744n21m257J2694l121j5591J3926N823j1067r4
264h60L678N569o984l954J1642p762m173J1692p948n123P031J103l568q687R535
279A191P341j7971L003J3013q327l854K193M829j43q748P659K298p291P325k552
294c4l752Q098k495l540J238L080L849j0818J440J2874j0522m507Q097m09k211
309C88m726M462M031r968M509L533q110M823J019m587J545j20L863m016m673J0564
325B537l747o482P475q38q45K96j101M900l921J48N677o367L701L793o711L140
341A655K452j198n06l280O820o38r078P504J036o033J921q68K088k183m384O698
$$ plain form
357 2006 -1451 -5041 651 -3527 -3581 -1080 -4095 -1261 -3323 -2570 1059 -4172 -583 2531 -2823 1219
373 1219 2194 -291 2248 322 3341 2454 -1772 5102 2693 -2199 3365 1839 673 387 -1017 3904
389 3904 -800 -2662 3719 -464 -1080 1681 -430 3016 979 -332 4149 1589 2906 3553 54 5498
405 5498 4156 -408 3457 3084 2685 278 -2732 3574 80 -5318 -1023 -2654 -3255 -4261 -7889 -3287
421 -3287 -4694 -7462 -4655 -7234 -4625 -2813 -7336 -3445 -2021 -2192 -90 -2820 717 4246 66
436 66 3479 3522 3022 6645 3313 3605 5944 4048 5336 2432 1509 6034 1625 -141 1970 -438 1605
453 1605 -1062 -3106 1432 -1374 -1517 -709 -3375 390 -69 -2871 549 -421 115 1147 -1695 2032
469 2032 958 -1441 2505 -345 -1671 486 -1203 -183 -3266 -4385 697 -4025 -5575 -2750 -3983
$$ packed form
357B006l457l590N692m178n4K501l015K834k062P53L629n231L589L114n354M042
373A219R75k485K539j926L019q87m226O874k409m892N564j526j166k86j404M921
389C904m704j862O381m183o16K761k111L446k037j311M481k560J317O47l499N444
405E498j342m564L865l73l99k407l010O306l494n398M295j631o01j006l628M602
421c287j407k768K807k579K609J812m523L891J424j71K102k730L537L529m180
436F6L413M3n00L623l332K92K339j896J288k904r23M525m409j766K111k408K043
453A605k667k044M538k806j43Q08k666L765m59k802L420r70N36J032k842L727
469B032j074k399L946k850j326K157j689J020l083j119N082m722j550K825j233
$$ plain form
484 -3983 -2231 -4873 -5943 -800 -2632 -2868 -1348 -2043 2835 1623 -1026 3332 3827 5455 5056 1554
500 1554 7486 8618 4233 4673 4732 7577 6487 -94 3148 5670 1976 68 -3015 948 1915 -5706
516 -5706 -4169 -1168 -2690 -3118 -6184 -3977 -1177 -4184 -3505 -3729 -2903 1339 -2513 -3482 515 381 1218
533 1218 -1510 -1787 3627 670 -2199 101 265 1584 -1743 -2897 1143 -1426 -2104 -545 -2866 -472
549 -472 -239 -1947 271 -1060 625 2356 -225 1742 2731 2140 4407 2431 3272 5721 2831 4478
565 4478 4201 1862 4382 3085 1832 1242 -514 2550 128 -4761 -1806 -760 -2280 -5185 -6642 -803
581 -803 -1957 -8124 -5107 -1959 -1932 -4283 -5731 -81 167 -3158 -852 -855 1012 3050 -786 589 3051
598 3051 2994 3277 -301 1619 4998 978 -561 662 2401 3503 -2048 -1352 3270 581 -1026 -1015 171
$$ packed form
484c983J752k642j070N143j832k36J520o95M878j212k649M358M95J628l99l502
500A554N932J132m385M40N9K845j090o581L242K522l694j908l083L963R67p621
516e706J537L001j522m28l066K207K800l007O79k24Q26M242l852r69L997j34Q37
533A218k728k77N414k957k869K300J64J319l327j154M040k569o78J559k321K394
549d72K33j708K218j331J685J731k581J967R89n91K267j976Q41K449k890J647
565D478k77k339K520j297j253n90j756L064k422m889K955J046j520k905j457N839
581h03j154o167L017L148K7k351j448N650K48l325K306lJ867K038l836J375K462
598C051n7K83l578J920L379m020j539J223J739J102n551O96M622k689j607J1J186
$$ plain form
615 171 2736 -783 -1293 1758 1137 1692 469 -107 3245 1478 445 2056 298 2178 1622 -1116 775
632 775 307 30 -904 -2962 -35 -1199 -4268 -1773 -2061 -3108 -2507 -3637 -1994 -2561 -3939 -735 -1473
649 -1473 -2458 -894 -785 672 -395 -569 3106 1335 472 2509 1741 2824 2585 899 2556 1938 1941 2271
667 2271 -542 1865 1898 -549 293 -360 392 1161 -2815 -1206 1210 -409 -974 -2500 111 1840 -2034
684 -2034 -1451 937 451 578 -1633 -305 2284 -796 -678 230 -458 1183 -807 -1331 255 -808 -279
701 -279 -1419 -2303 1176 -733 -2451 -179 -777 90 -611 -1364 906 117 -609 993 -218 1453 1360 -247
719 -247 1760 1245 1039 1772 362 1840 1961 -179 1339 865 444 608 -635 756 63 -1171 287
736 287 -786 -985 348 -1584 -370 -65 -1382 -290 -736 -495 88 -1592 359 388 -1137 91 -63
$$ packed form
615A71K565l519n10L051o21N55j223n76L352j767j033J611j758J880n56k738J891
632G75m68k77r34k058K927j164l069K495k88j047O01j130J643n67j378L204p38
649a473r85J564J09J457j067j74L675j771q63K037p68J083k39j686J657o18LL30
667B271k813K407L3k447Q42o53P52P69l976J609K416j619n65j526K611J729l874
684b034N83K388m86J27k211J328K589l080J18R08o88J641j990n24J586j063N29
701b79j140q84L479j909j718K272n98Q67p01p53K270p89p26J602j211J671r3j607
719b47K007n15k06P33j410J478J21k140J518m74m21J64j243J391o93j234J458
736B87j073j99J333j932J214L05j317J092m46K41N83j680J951K9j525J228j54
$$ plain form
753 -63 137 346 -1001 655 953 -672 633 267 -115 926 -460 168 269 -618 741 -574 -588 1250
771 1250 -375 -179 7 -499 745 -442 -236 863 -605 40 297 -813 727 11 -729 516 -283
788 -283 167 5 -942 733 -168 -808 306 -339 356 199 -609 1060 -79 -544 801 -661 90 543
806 543 -698 327 -243 -109 515 -498 374 264 -926 843 122 -374 883 -343 326 349 -582 912
824 912 34 -387 1025 -474 199 249 -264 524 -300 -279 943 -876 -205 136 -1003 0 -718 -1018 -77
843 -77 -1125 -592 114 -1139 -19 -533 -823 610 -386 135 332 -368 831 303 114 1248 367 288 1115
862 1115 200 909 480 122 1157 -76 566 866 -321 655 -14 -735 322 -620 -375 223 -1131 -40
880 -40 -615 -862 169 -830 -319 -83 -648 104 -668 -355 476 -668 -35 625 -756 316 59 -413 857
$$ packed form
753f3K00K09j347J656K98j625J305l66l82J041j386O28J01q87J359j315j4J838
771A250j625J96J86n06J244j187K06J099j468O45K57j110J540p16p40J245p99
788b83M50j62r47J675r01o40J114o45O95j57q08J669j139m65J345j462P51M53
806E43j241J025n70J34O24j013Q72j10j190J769p21m96J257j226O69K3r31J494
824I12q78m21J412j499O73N0n13P88q24K1J222j819O71L41j139J003p18l00R41
843g7j048N33P06j253J120n14k90J433r96N21J97p00J199n28j89J134q81p9Q27
862A115r15P09m29l58J035j233O42L00j187R76o69p21J057r42K45N98j354J091
880d0n75k47J031r99N11K36n65P52p72L13Q31j144O33O60j381J072k57m72J270
$$ plain form
899 857 -669 -26 346 -653 85 -203 -582 183 -618 -398 234 -883 290 114 -130 927 -94 561 867
918 867 245 1213 629 422 1296 541 1094 1109 168 1140 599 190 802 -351 140 290 -915 -131 -583 -1036
938 -1036 -480 -990 -780 -705 -1242 -445 -768 -1082 -297 -955 -504 -493 -783 303 -206 -213 531 -260 454 833 -440
959 -440 751 603 -19 621 -188 531 205 -407 520 -163 -160 421 -537 268 240 -622 518 75 92 853 -394
980 -394 474 720 -188 580 543 301 995 255 411 537 -60 573 -1 -489 171 -486 -299 -153 -949 -466 -795
1001 -795 -1075 -252 -1314 -926 -253 -1017 -325 -578 -480 -28 -582 46 517 -87 464 490 373 1340 287 556
1021 556 1117 496 1118 428 224 982 318 71 351 -21 699 50 -8 237 -231 -175 9 -809 -73 -77 -670
1042 -670 252 -307 -86 -91 -476 439 389 -229 138 -149 209 256 -520 -49 43 -308 79 -542 -293 -220 -878 -302
$$ packed form
899H57j526O43L72r99P38k88l79P65q01K20O32j117J173j76k44J057j021O55L06
918H67o22R68n84k07Q74p55N53J5r41R72n41m09O12j153M91J50j205P84m52m53
938a036N56n10K10P5n37P97l23l14P85o58M51J1k90J086n09pP44p91P14L79j273
959d40J191j48o22O40q09P19l26o12R27o83LN81r58Q05k8q62J140m43J7P61j247
980c94Q68K46r08P68l7k42O94p40J56J26n97O33n74m88O60o57J87J46p96M83l29
1001g95k80Q23j062L88O73p64O92k53R8M52n54O28M71o04N51K6j17R67j053K69
1021E56N61o21O22o90k04P58o64k47K80l72P20o49n8K45m68N6J84q18P36mn93
1042f70R22n59K21nl85R15n0o18L67k87L58M7p76M71R2l51L87o21K49P3o58N76
$$ plain form
1064 -302 -391 -781 71 -990 -624 136 -683 92 -285 -245 291 61 264 566 246 718 570 475 1033 342 855
1085 855 785 351 702 650 209 508 7 -252 318 -476 -63 -487 -307 176 -507 -387 125 -773 -294 -234 -862
1106 -862 161 -272 -226 115 -414 126 -265 -296 479 -147 -127 142 26 501 40 -437 749 -255 -472 8
1126 8 -556 -157 -83 -525 178 -53 59 607 -450 292 240 209 421 -4 54 481 305 371 489 492 716 -148 194
1149 194 692 -207 30 189 -81 233 -363 -40 193 -586 -68 -88 -621 -81 -457 -261 -189 -607 -5 -274 -596
1170 -596 26 -65 -101 123 -144 220 67 75 289 -146 -70 327 1 502 304 164 336 -61 -280 290 -152 137
1192 137 13 -113 476 -28 -251 -24 -208 120 -96 -438 27 -187 -105 293 -279 160 -220 -4 446 -474
1212 -474 -71 339 -468 -5 387 -26 233 -92 202 206 -209 390 334 -240 284 -168 -190 659 -456 76 347
$$ packed form
1064c02q9l90Q52j061L66P60q19P75l77M0N36k30K03L02l20M72j48r5N58o91N13
1085H55p0m34L51n2m41K99n01k59N70p94M13m24J80M83o83J20N12q98M79O0o28
1106h62J023m33M6L41n29N40l91l1P75o26K0K69j16M75m61m77J186j004k17M80
1126Hn64L99P4m42P03k31J12N48j057P42n2l1K12m25N8M27j76O6J18LK24q64L42
1149A94M98q99K37J59k70L14n96L23K33p79N18k0n33N40l76J96P2m18O02k69l22
1170e96O22r1l6K24k67L64j53QK14m35P6L97l26N01j98j40J72l97k19N70m42K89
1192A37j24j26N89n04k23K27j84L28k16l42M65k14Q2L98n72M39l80K16M50r20
1212d74M03M10q07M63L92m13K59l25K94Mm15N99n6n74N24m52k2Q49j115N32K71
$$ plain form
1233 347 -277 160 92 -225 303 20 31 -81 14 491 -50 -110 371 137 -193 110 10 310 56 -28 236 -561
1255 -561 109 29 -324 212 -126 -349 355 -122 -207 92 -518 -184 -330 -141 2 -368 89 -120 -53 241 -202
1276 -202 88 77 53 246 398 88 211 83 78 301 85 219 372 5 228 -251 161 185 -97 -176 162 -385
1298 -385 131 -169 -243 -292 -351 -124 -144 -423 94 -101 -198 -15 -330 -83 34 -129 287 -34 -135 381 -181 60
1320 60 -99 163 165 -232 -24 201 -259 0 -189 -235 66 -114 27 117 -283 254 -91 -157 180 45 -118 98
1342 98 71 132 273 -197 484 36 -171 296 -14 104 201 -94 7 -68 7 77 -503 -146 -124 -580 -461 -494 -395
1365 -395 -44 -245 67 -59 -516 -94 -187 -26 245 283 -62 531 21 597 301 350 671 185 138 427 136
1386 136 332 -12 3 -111 -284 -32 460 -72 286 -49 70 220 -244 93 60 -342 153 238 -190 -60 123
$$ packed form
1233C47o24M37o8l17N28k83J1j12R5M77n41o0M81k34l30L03j00L00k54q4K64p97
1255e61O70q0l53N36l38k23P04m77q5K99o10L34j46J89J43l70M57k09O7K94m43
1276b02K90j1k4J93J52l10J23j28nK23k16J34J53l67K23m79M12K4k82p9L38n47
1298c85N16l00p4m9n9K27k0k79N17j95r7J83l15K47J17j63M16l21j01N16n62K41
1320F0j59K62Kl97K08K25m60K59j89m6L01j80J41R0m00N37l45o6L37j35j63K16
1342I8k7O1J41m70O81m48k07M67l10J18R7k95J01p5P5P0n80L57K2m56J19l3R9
1365c95L51k01L12j26m57M22r3J61K71L8l45N93n10N76k96M9L21m86m7K89k91
1386A36J96l44J5j14j73K52M92n32L58l35J19J50m64L37l3m02M95Q5m28J30J83
$$ plain form
1407 123 161 177 171 222 -21 23 67 -70 102 216 -116 1 -180 -151 60 -394 -44 75 -453 -13 -250 -540 9
1430 9 -484 -156 -108 -318 286 156 -50 220 192 395 247 134 323 245 406 621 67 280 247 34 195 88
1452 88 119 154 -209 59 -42 -86 26 -129 -302 -66 -425 190 -181 -296 56 -334 28 88 -179 -103 101 39
1474 39 404 -53 88 376 46 30 -97 -403 -162 -89 -308 135 -32 -188 -65 216 -153 120 -80 107 -56
1495 -56 8 42 109 330 27 234 381 341 354 386 63 286 306 70 260 26 78 82 88 -3 -199 -470 -30 -357 -249
1520 -249 -45 -585 326 -142 -124 131 -415 -160 147 -416 90 -172 81 158 -56 107 249 -170 131 304 296
1541 296 126 -24 126 182 -160 196 18 -43 47 -203 194 100 85 188 -76 -203 15 105 -138 199 -82 95
1563 95 152 -47 221 -86 75 28 -100 203 -173 -92 40 -127 57 -75 -278 294 -120 -38 -224 -154 40 212
$$ packed form
1407A23L8J6oN1k43M4M4j37J72J14l32J17j81K9K11m54L50J19n28M40k37k90N49
1430Im93L28M8k10O04j30k06K70k8K03j48j13J89p8J61K15n54K13l3k13J61j07
1452H8L1L5l63K68j01m4J12j55j73K36l59O15l71j15L52l90L62O0k67P6K04o2
1474C9L65m57J41K88l30j6j27l06K41P3k19M43j67j56J23K81l69K73k00J87j63
1495e6O4L4O7K21l03K07J47m0J3L2l23K23K0k36J90k34N2MOr1j96k71M40l27J08
1520b49K04n40R11m68J8K55n46K55L07n63N06k62K53P7k14J63J42m19L01J73q
1541B96j70j50J50N6l42L56j78o1R0k50L97r4j5J03k64j27K18R0k43L37k81J77
1563I5N7j99K68l07J61m7j28L03l76Q1J32j67J84j32k03N72m14Q2j86P0J94J72
$$ plain form
1585 212 -161 -174 -39 -335 30 -288 5 -137 -310 121 27 -28 240 35 108 71 20 194 -49 -59 105 18 156
1608 156 47 -140 164 7 107 209 201 -95 -212 62 167 -165 195 202 -185 -97 10 -479 18 -189 -94 -43
1630 -43 -47 -17 4 67 334 98 -172 56 -287 226 69 87 -193 -28 -284 -65 -174 -167 39 -114 231 -2 -75
1653 -75 2 -19 -63 371 221 -142 80 -155 286 -146 286 293 70 151 75 -230 -254 13 8 108 -90 153 65 335
1677 335 114 -236 -166 -196 -234 159 -24 119 -48 -56 -95 81 -22 286 -45 -150 -251 -55 -129 14 215 -65
1699 -65 71 133 -38 182 139 149 2 57 270 220 122 86 163 -1 -90 244 54 -96 167 101 -220 14 -196 -149
1723 -149 -190 47 -32 -257 -143 -191 106 75 -124 0 156 -120 138 98 -40 199 -33 195 185 104 241 -57
1745 -57 48 174 57 32 44 13 65 79 48 -9 24 333 20 85 88 -22 272 224 46 25 229 -122 -45 -21 115
$$ packed form
1585B12l73j3J35k96L65l18K93j42j73M31r4n5K68k05P3l7n1J74k43j0J64q7J38
1608A56j09j87L04j57J00J02qk96j17K74J05l32L60Pl87Q8J07m89M97k07R5N1
1630d3mL0K1O3K67k36k70K28l43N13j57J8k80J65k56K19j09PK06j53L45k33p3
1653g5P7k1m4M34j50l63K22k35M41m32M32Pk23Q1p6l05k4K67nJ00j98K43q8K70
1677C35k21l50P0l0l8L93j83J43j67ql9J76j03L08l31j05j01J96p4J43K01k80
1699f5J36O2j71K20m3J0j47N5K13n0r8l6P7j64q9L34j90j50K63o6l21K34k10M7
1723a49m1K37p9k25J14m8K97l1j99J24J56k76K58m0j38K39k32K28j0q1J37k98
1745e7J05J26j17k5J2l1N2J4l1n7L3L09l13O5Lj10K94m8j78k1K04l51P7K4J36
$$ plain form
1770 115 -59 -75 246 -102 103 -128 123 80 167 -48 -90 -221 94 -263 -78 -152 -398 -153 -253 -274 -285 -88
1792 -88 -72 -95 -18 -89 130 -113 252 91 197 -57 86 71 241 339 172 -202 144 160 243 102 -16 79 -225
1815 -225 132 41 -305 -67 228 -122 1 -235 -9 -79 -6 -13 -110 -46 112 -304 73 31 44 237 222 -204 -34
1838 -34 138 -82 -1 -5 243 -115 43 -106 -238 -161 107 -112 81 -8 -249 -22 -282 5 -13 7 212 181 49
1861 49 32 11 -9 -4 81 277 279 41 408 17 120 90 -148 309 163 -173 -65 -67 -28 -219 -94 17 -131 -151 -144
1886 -144 -401 -169 132 48 50 131 -329 16 269 -26 -11 168 241 241 322 -140 -53 -140 -171 -38 203 -99 -22 34 -11
1911 -11 59 -1 -164 192 181 12 251 -121 0 14 -103 4 -69 21 45 29 105 17 48 228 -45 98 143 -86
1935 -86 -119 4 -24 113 -61 -11 -30 75 -155 50 -288 -173 -123 -239 -147 -11 159 -432 -62 -296 84 -57
$$ packed form
1770A15j74j6L21l48K05k31K51m3Q7k15m2j31L15l57J85p4k46K45j00k1j1J97
1792h8J6k3P7p1K19k43L65j61J06k54J43j5J70R8j67l74L46J6Q3j41j18R5l04
1815b25L57r1l46K38K95l50J23k36K26p0P3pr7O4J58m16L77m2J3J93j5m26J70
1838c4J72k20Q1mK48l58J58j49j32P7K68k19J93q9k41K27k60K87j8K0K05l1j32
1861D9j7k1k0NQ5J96Kk38L67l91J03l0k38M57j46l36J08kL9j91J25J11j48k0P
1886a44k57K32L01q4KQ1m60L45K53k95J5J79P3%Q1m62Q7q7l1J33K41l02P7N6m5
1911a1P0o0j63L56j1j69K39l72J21J4j17J07p3R0K4j6P6q8L1J80k73J43M5k29
1935h6l3J23k8J37j74N0j9J05k30K05l38J15N0j16R2J36J70n91L70k34L80j41
$$ plain form
1957 -57 184 60 20 -52 11 89 -145 -88 274 84 -18 182 -11 -67 28 281 -196 -12 25 22 -274 -98 -125 -158
1981 -158 -230 142 -192 53 -20 -154 23 -237 -89 27 -2 -52 -121 -8 -2 -98 106 51 114 -102 -348 -104 91
2004 91 -206 19 115 -175 232 -91 -119 -38 -117 159 -115 -7 -16 18 -106 -172 -197 161 98 -81 246 -78 63 419
2028 419 -62 235 53 114 10 -114 84 -110 153 -72 137 -304 -251 -206 -17 73 -188 119 -9 -253 -237 -81
2050 -81 -28 -49 -53 70 -101 18 300 128 59 151 -187 79 43 90 119 157 126 -8 188 -85 -167 5 100 135 -3
2075 -3 -266 -58 86 -88 185 -38 164 58 -42 10 -128 121 -72 -18 -173 -34 -203 226 150 -134 119 -21
2097 -21 -45 236 -111 -102 41 170 -184 133 -39 -321 -292 -168 -236 -159 -101 9 -133 -7 30 -124 141 -10 153
2120 153 -149 -92 180 60 -46 30 -33 237 337 -34 31 267 30 339 -141 92 -36 49 335 161 -56 59
$$ packed form
1957e7K41j24m0p2O3P8k34N7L62j90j02K00j93n6R5K53m77J84L7lk96J76k7l3
1981a58p2L72l34K45p3j34J77k60J48J16k9n0o9J13Or6K04n5O3k16k46K44J95
2004I1k97K25R6k90M07l23k8Q1p9K76k74J08rL4j24o6k5L58o3j79L27l24J41L56
2028D19m81K97j82O1j04j24J98j94K63k25K09m41N3M5J89R0k61L07j28k44J6J56
2050h1N3k1mJ23j71J19K82j72o9R2l38K66l6M7K9L8l1j34J96k73q2J72R5L5j38
2075ck63K08J44j74K73k23K02j06j00N2j38K49j93N4j55J39j69M29p6k84K53j40
2097b1k4K81l47RJ43J29l54L17j72k82K9J24o8P7N8J10j42J26L7j54K65j51J63
2120A53l02N7K72j20j06P6o3K70J00l71O5K36k37L09m80K33j28Q5K86j74k17J15
$$ plain form
2142 59 -66 -168 -12 -101 100 -17 -150 -16 -94 -56 -130 -66 34 -200 195 -152 159 -89 165 -65 42 33 407
2165 407 79 55 119 235 9 94 52 -95 -126 49 -124 -271 20 62 6 -7 51 -100 42 -84 -34 -106 153 -195
2189 -195 -18 53 139 -69 -24 34 93 91 37 120 -190 40 30 141 -136 -81 1 -278 -18 -102 -80 9 -23 6 144 -102
2215 -102 -81 -96 54 259 94 221 157 202 119 -22 124 166 21 -82 -22 46 -104 40 -43 -33 -51 -169 -72 38
2239 38 -63 24 -171 370 -145 -26 76 -286 254 5 -43 -9 -139 -121 118 -312 -87 -136 114 -21 -35 -55 67
2262 67 173 -113 -292 -247 48 -95 -152 15 61 255 -213 -202 219 101 -50 199 -120 5 -124 -31 65 82 17
2285 17 206 94 39 76 155 2 47 66 42 137 76 -242 -203 -25 93 -95 61 -41 -133 -128 -116 7 -33 -80 119
2310 119 -26 -24 20 -74 334 50 -79 -185 -133 158 255 -70 182 -177 -7 -128 -68 -6 17 -319 265 194 106 237
$$ packed form
2142E9j25j02J56q9K01j17j33J34p8L8p4O4J00k34L95l47L11k48K54k30J07rL74
2165D07l28k4O4J16k26Q5m2j47l1J75j73j47K91M2n6j3N8j51J42j26N0p2K59l48
2189a95J77P1Q6k08M5N8N9kn4Q3l10K30j0J11k77N5Q2k79K60q4K2Q9l2K9J38k46
2215a02K1j5J50K05j65J27o4M5q3j41J46M2j45j03O0O8j50J44q3J0j8j18R7J10
2239C8j01Q7j95N41n15J19J02l62N40k49m8L4j30J8K39m30K25m9K50j35j4k0J22
2262F7J06k86j79M5K95j43n7J67M6J94m68J1M21j18j51K49l19J25j29R3R6J7o5
2285A7J89j12n5L7P9j53M5J9k4R5o1l18L9J78J18j88J56j02r2NJ2J23m0m7J99
2310A19j45KM4r4M08k84j29j06N2K91R7l25K52l59J70j21O0O2K3l36N84p1q8J31
$$ plain form
2334 237 310 52 9 -137 -74 46 -118 -172 -64 122 -85 200 -59 -146 -31 292 -61 197 95 23 66 89 197
2357 197 87 -11 -26 24 -120 -22 -44 -63 287 169 -24 -106 168 -33 -57 -258 -189 45 -61 258 -226 -88 -141
2380 -141 -14 181 -200 236 142 -248 -69 117 -151 41 87 -75 366 168 132 33 -136 -42 -239 -33 -149 -389
2402 -389 -113 346 -29 39 -153 -54 37 -333 -25 -132 -33 41 -4 239 144 -124 -91 2 187 -62 -339 -47 24
2425 24 -22 -12 161 -165 -305 22 109 -36 76 -19 85 133 -56 27 -76 17 -76 62 -30 142 -39 -123 -106 234
2449 234 83 308 123 -13 -68 -272 -106 308 97 -77 155 -53 -100 -130 108 -296 -36 -116 -25 135 -110 -106
2471 -106 8 -210 -122 -190 132 -8 29 158 39 19 -225 72 167 -38 -81 65 -11 -29 33 -230 224 149 13
2494 13 -318 -223 186 41 -108 61 -65 -197 -62 156 67 69 -98 -56 -72 45 -41 -28 121 -113 6 -94 -81
$$ packed form
2334B37P3k58m3j46O3J20j64n4J08J86k07K85k59q7J15L23l53K58j02p2M3K3J08
2357A97j10r8j5N0j44R8k2j9L50j18j93q2K74k01k4k01O9K34j06L19m84J38n3
2380a41J27J95l81M36r4l90J79J86k68J92M6j62M41j98l6r9j69R4j97K06j16k40
2402c89K76M59l75O8j92R9R1l70L08j07R9P4m5K43r5k68L3R3J85k49k77K92P1
2425B4m6J0J73l26j40L27Q7j45J12r5J04M8j89Q3j03R3r3J38r2J72j81q4J7L40
2449B34j51K25j85j36n5k04J66M14k11j74K32k08m7l0K38m04K60q0R1J60k45M
2471a06J14k18Q8o8L22j40L7J29j19k0k44K97R5k05m3J46p6j8O2k63M54p5j36
2494A3l31R5M09j45j49J69j26j32J35K18q9Kj67M2j6J17q6J3J49k34J19j00J3
$$ plain form
2517 -81 4 -12 -130 -89 -180 40 7 -117 -103 -27 -6 -71 99 -34 -44 3 161 -20 -24 -80 93 196 338 147 -62
2542 -62 40 -85 111 81 -54 -37 -26 -84 207 53 34 112 -27 56 15 -202 -46 53 76 -179 68 16 -73 60
2566 60 283 49 -255 -110 -21 120 -160 5 -33 -192 82 -8 -38 134 117 149 -125 -247 -267 -63 163 138 -190
2589 -190 -144 63 72 4 -27 237 -133 115 102 39 -66 52 -260 -57 241 -170 67 -21 138 48 153 -41 -70
2612 -70 -20 104 -39 182 -70 -230 258 17 -96 -94 -320 -91 -27 -195 -268 160 39 7 105 113 155 -64 -5 5
2636 5 25 -52 -81 -89 53 74 -108 -116 -263 18 -48 234 -179 40 -168 15 21 -171 -38 -34 -76 27 140 126 -52 9
2662 9 -269 -118 -45 -8 -65 1 -104 103 -231 140 266 -55 -133 173 212 15 5 23 173 -141 -25 -44 -63 -97
2686 -97 -118 19 197 176 13 -154 -192 121 9 255 14 86 -2 -275 -11 -66 -12 -43 159 -45 -141 141 -101
$$ packed form
2517h1Q5j6j18M1r1K20l3j24J4P6K1o5J70j33j0M7J58j81mn6J73J03J42j91k09
2542f2J02j25J96l0j35J7J1n8K91j54j9P8j39Q3m1k17J56R9K3k55K47n2q9J33
2566F0K23k34l04J45Q9J41k80J65l8j59K74r0l0J72j7L2k74j22k0K04K26k5l28
2589a90M6K07Ro8l1K64l70K48j3o3j05J18l12K03K98m11K37q8J59r0J05j94k9
2612g0N0J24j43K21k52j60M88k41j13Kk26K29O4j68p3M28j21l2R8QM2k19N9J0
2636EK0p7k9qJ42K1j82qj47K81o6K82m13K19k08J83Oj92J33Mm2J03J13j4j78O1
2662Ik78J51P3L7n7O6j05K07l34L71J26l21p8L06L9j97j0J8J50l14J16j9j9l4
2686i7k1J37J78k1j63j67l8L13j12K46k41P2q8k73K64n5N4l1K02k04r6K82k42
$$ plain form
2709 -101 86 -272 8 92 222 239 175 -99 -104 -41 -286 71 -132 -155 -230 87 186 300 252 150 112 -21 -226 -156
2733 -156 -131 -49 -98 -194 205 253 147 -158 -121 -37 -31 121 -110 -43 152 -127 -147 52 101 12 -165 229 239 3 -58
2758 -58 -278 -55 -198 140 -91 -254 75 57 125 -88 -73 64 -213 -13 -146 -108 39 -175 124 -133 -50 -290
2780 -290 -90 -244 65 -58 -204 -79 95 -63 13 18 -286 -63 76 -40 -270 26 -27 62 -227 85 -64 74
2802 74 182 -50 -189 66 131 -243 208 -31 -32 20 -260 -19 -153 133 18 -320 103 -37 295 -59 210 13
2824 13 -37 100 273 19 20 35 -102 -146 172 88 -196 152 94 106 -239 90 -133 31 -46 273 -376 -11 -5 -66
2848 -66 99 159 -60 128 67 -64 -72 163 265 54 19 -41 386 -15 -33 64 42 -116 47 124 -53 -84 76 101
2872 101 189 -167 -53 78 -208 15 -34 227 173 16 420 12 185 181 -19 -76 110 -156 -29 5 83 -80 107
$$ packed form
2709a01J87l58K80Q4J30J7o4k74nO3k45L57k03k3p5L17R9J14m8j02l8j33k05P0
2733a56K5Q2m9r6L99M8j06l05L7Q4OJ52k31O7J95k79k0J99M9q9j77L94J0k36o1
2758e8k20K23j43L38k31j63L29j8O8k13J5J37k77K00j33L8J47k14K99k57Q3k40
2780b90K00j54L09j23j46J25J74j58P6Nl04K23J39j16k30K96n3Q9k89L12j49J38
2802G4J08k32j39K55O5l74M51k39jN2k80K41j34K86j15l38M23j40L32l54K69j97
2824A3n0J37J73k54JJ5j37m4L18q4k84L48n8J2l45L29k23J64p7L19o49L65Oo1
2848f6J65O0k19J88o1j31qK35J02k11l5o0M27m01j8R7k2j58J63P7j77l1J60K5
2872A01Q8l56J14J31k86K23m9K61n4j57M04m08J73mk00n7J86k66J27L4P8j63J87
$$ plain form
2895 107 -2 238 30 -198 126 79 -11 122 -239 77 -81 84 -5 57 66 112 -28 115 361 -189 66 13 -15
2918 -15 15 -42 -18 0 -53 251 491 134 -40 147 -299 -70 341 -265 16 146 -22 13 22 -372 61 59 -92 166
2942 166 22 -47 38 110 -317 -132 -221 -27 80 109 61 -341 184 -164 50 -131 -60 -118 16 136 -76 -123 96
2965 96 -176 96 -95 -43 -88 66 45 195 -309 -276 284 -85 128 70 88 105 124 -43 138 63 192 -129 103
2988 103 13 -58 35 -36 279 -199 -153 -102 -61 -80 114 -98 66 188 -276 213 44 -148 31 75 -47 88 100
3011 100 -16 199 20 -12 -141 152 -89 -147 7 95 92 -38 121 73 -155 -172 187 68 -170 -404 179 32
3033 32 -55 82 -114 -1 -76 -10 415 -6 58 -166 -164 -53 55 69 2 -179 -119 -151 -80 -69 -22 -240 -2 69 249
3058 249 -40 97 126 -110 -127 64 332 -42 -192 44 84 -111 145 -49 70 -212 -80 19 -8 -283 -290 123
$$ packed form
2895A07j09K40k08k28L24m7r0J33l61L16j58J65q9O2RM6j40J43K46n50K55n3k8
2918a5L0n7K4J8n3L04K40l57j74J87m46K29M11o06K81J30j68L5Rl94M33kj51K58
2942A66j44o9Q5P2m27J85q9J94J07K9m8m02N25l48K14j81P1n8J34J20k12m7K19
2965I6k72K72j91N2m5J54k1J50n04L3N60l69K13n8J8J7J9j67J81p5J29l21K32
2988A03r0p1R3p1L15m78M6N1M1j9J94k12J64J22m64M89j69j92J79M4j22J35J2
3011A00j16K15j79l2j29K93k41n8J54Q8lj30J59m8k28j7L59j19k38k34N83j47
3033C2q7J37j96J13p5O6M25m21O4k24KJ11J08J4o7j81O0l2P1J1M7k18K38P1J80
3058B49k89J37K9k36j7J91K68l74j50K36M0j95K56j94J19k82J32R9k7k75pM13
$$ plain form
3080 123 273 -20 206 124 -62 -52 18 -99 -132 91 108 165 -43 85 -28 42 -101 20 -108 282 103 -182
3102 -182 -109 6 164 -6 2 -56 295 -50 134 -105 -78 -64 104 -256 67 -77 -160 -284 -87 138 -77 36
3124 36 -83 186 -131 -157 -285 -250 -174 134 -107 -402 -228 -27 -47 179 33 16 109 194 252 -3 -31 -235 -176 -3
3148 -3 24 11 -50 -96 44 180 -195 299 -133 173 149 264 225 141 177 -23 46 -14 138 -35 332 174 154 -182
3172 -182 61 182 -10 -156 219 95 -233 -51 -9 -238 -121 76 -59 81 -177 125 -72 42 51 -65 86
3193 86 36 48 31 295 -126 -7 -72 63 -175 69 222 -290 122 -243 157 20 -20 91 -139 150 119 -311
3215 -311 18 -429 -187 -54 29 -109 -99 -122 -207 -185 -85 151 -77 115 -188 -324 -24 -10 -166 51 -61 277
3237 277 148 -88 22 -30 -48 -233 -56 -62 -141 69 37 175 112 -11 -113 -154 20 -167 75 41 -69 -38 -99 -93
$$ packed form
3080A23J50k93K26q2j86J0P0j17l3K23J7N7k08J28j13P0j43J21j28L90j79k85
3102a82P3J15J58j70Qn8L51l45J84k39K7J4J68l60L23j44q3j24J97K25k15J13
3124C6j19K69l17k6j28L5P6L08k41k95J74K01k0K26j46j7R3Q5N8k55k8k04N9J73
3148cK7j3o1m6J40J36l75M94m32L06k4J15l9q4L6k00O9o0J52j73L67j58k0l36
3172a82K43J21j92j46L75j24l28J82M2k29J17J97j35J40k58L02j97J14Rj16J51
3193H6n0J2j7K64m21J19o5J35k38K44J53n12M12l65M00j37m0J11k30K89l1m30
3215c11L29m47K42J33Q3j38J0k3q5K2J00K36k28J92l03j36L00J4j56K17j12L38
3237B77j29k36J10n2j8j85J77op9K10l2J38o3j23j02m1J74j87K42l4j10L1o1O
$$ plain form
3261 -93 -18 -234 -31 -103 189 -202 -98 -293 68 108 36 266 234 -126 225 40 -279 90 -362 102 -111 -36
3283 -36 -1 -40 -99 121 -34 14 215 185 57 -203 173 152 12 29 120 22 126 -140 -12 144 36 -114 -8
3306 -8 104 112 -33 167 -10 -80 -24 109 -55 -171 -32 -37 -41 20 36 -51 -103 -137 -142 96 -42 222 146 -151 -192 -40
3332 -40 27 -5 113 -35 -30 36 228 32 314 -75 -130 -125 199 -64 0 -23 111 44 -113 46 218 -98 -35 -26 -162
3357 -162 28 64 125 221 139 -226 -136 311 57 161 312 -357 103 180 -313 121 5 -157 -76 -192 -13 90
3379 90 37 28 -42 161 -150 -127 385 190 -12 -127 34 -78 52 3 -72 -11 160 -3 -138 61 -201 25 15
3402 15 -161 26 -203 169 112 66 32 -184 -73 -447 149 -71 -70 136 -326 129 -57 -14 99 107 -53 -213 186
3425 186 212 -113 119 -145 -81 -109 40 -153 -69 -193 93 -109 153 -52 31 208 116 -39 -120 72 41 146 137
$$ packed form
3261i3P5k16K03p2K92l91J04j95L61M0p2K30l2l60L51j85l19L69m52M64k13P5
3283c6L5l9n9K20j55M8K01l0j28k60L76k1j40J7R1r8J04k66J28J56j08j50J06
3306hJ12Qj45K00j77p0N6J33j64j16J39nmO1J6q7n2l4nK38j38K64p6k97m1J52
3332d0O7l2J18j48NO6J92j96K82l89n5NL24k63O4k3J34o7j57J59J72l16O3Rj36
3357a62J90L6O1R6q2l65R0M47k54J04J51o69M60P7m93M34j16j62Q1j16J79J03
3379I0n3rp0K03l11K3N12j95k02j15J61j12J30m9p5O1J71j63j35J99k62K26j0
3402A5j76J87k29L72n7m6l4k16J11l74N96k20JK06m62M55j86M3J13Qj60j60L99
3425A86K6l25K32k64O4k8J49j93Q4j24K86k02K62k05Q3J77r2j55q1J92l1J05r
$$ plain form
3448 137 128 85 101 91 -53 65 -16 -18 153 151 -146 -62 -107 131 -3 -135 -217 310 307 -171 101 -200 -72 -272 103
3473 103 62 98 116 8 90 71 -170 164 245 -208 165 -226 -16 134 -246 135 -176 -9 -48 151 -88 -100 -132
3496 -132 -47 190 -109 -3 -300 10 -6 -170 151 -38 27 54 44 -28 -135 -72 -33 102 39 -122 -226 -208 -110 -100
3520 -100 18 -70 -99 41 -293 -151 110 -125 120 25 -13 -84 -106 195 151 -15 86 -72 -76 -86 262 -223 123
3543 123 150 25 63 -157 -158 227 -8 -117 79 -158 -28 -132 -41 181 31 -143 139 -83 -57 141 455 233
3565 233 130 27 105 54 -146 -50 -57 114 -30 -83 58 -189 20 221 -123 236 382 142 158 127 177 -88 -114
3588 -114 38 -109 -21 -80 132 117 347 -238 -73 -118 157 53 21 -38 82 208 -128 -42 -188 121 135 -181 -231
3611 -231 60 175 336 114 -93 -130 -297 -92 -105 92 -19 -54 77 179 -99 -59 65 35 230 95 -157 27
$$ packed form
3448A37rm3J6j0j44J18q1kJ71kk97Q4m5K38j34j32q2N27lm78K72l01J28k00L75
3473A03m1L6J8j08Q2j9k41L34Q1m53L73l91K10J50l80L81l11J67l9J99k39j2l2
3496a32Q5K37k99J06k97L10j6j64L21j89O5K7j0p2j07O3L9J35o3j61j04J8R8J0
3520a00J18q8k9J40l34J42K61k35K45r5l8p1k2L01m4j66J01j58mj0L48m85L46
3543A23K7j25L8k20jL85k35j09J96k37J30j04R1K22j50j74K82k22K6J98L14k22
3565B33j03j03P8n1k00R6pJ71j44n3J41k47K09K01l44L59J46k40J6l1N0k65k6
3588a14J52j47Q8n9K12j5K30n85J65m5K75j04l2n9J20J26l36Q6j46L09J4l16n0
3611b31K91J15J61k22k07l7j67K05j3J97j11l5J31J02k78M0J24l0J95j35k52J84
$$ plain form
3633 27 -41 -166 -43 -21 -166 1 -104 -10 -42 -46 -97 -16 -51 102 45 335 -56 -68 45 -62 1 43 -216 -61 -137
3658 -137 -73 -39 -245 -149 -166 25 62 -27 -182 -171 -328 345 -108 -57 -184 212 63 172 -299 -288 -9 12 -77 -61
3682 -61 -84 -60 -3 160 70 62 -30 -100 -339 26 -9 -133 -32 366 24 111 230 175 -36 184 114 183 274 -196 -155
3707 -155 64 -137 -323 153 -116 -77 30 -85 100 -5 -23 -124 111 -93 -79 37 -74 119 -99 -113 -24 -153
3729 -153 139 -261 110 -34 -284 49 165 -43 -149 -13 45 71 85 24 109 -17 -140 -33 -32 -123 -27 19 -19 57
3753 57 -48 11 40 -72 -163 -51 -113 -191 -61 -136 -1 97 67 -170 -164 -109 -28 -128 -38 -63 174 68 -120 78 -8
3778 -8 -188 171 -109 196 7 115 179 -137 206 122 247 150 -176 75 12 -67 27 -160 -11 351 -230 -366 103
3801 103 153 -55 193 -25 -64 256 24 -62 -105 19 -158 -150 -121 -179 -209 -131 -203 -106 -213 214 30 -139 -80 74
$$ packed form
3633B7o8j25J23K2j45J67j05R4l2mn1Q1l5J53n7K90l91j2J13j07O3M2k59J55p6
3658a37O4L4k06R6j7J91L7q9j55J1j57O73m53N1j27L96j49J09m71J1K79K1q9J6
3682f1k3K4N7J63r0qr2p0k39L65l5j24J01L98l42Q7J19n5k11K20p0O9R1m70M1
3707a55K19k01j86M76k69L9J07j15J85j05j8j01K35k04J4J16j11J93k18j4Q9j29
3729a53K92m00L71j44k50L33J16k08j06J36N8K6J4o1Q5j26j23J07Jr1R6M6l8P6
3753E7j05N9K9j12r1J12o2p8J30p5J35R8l0k37ON5Q1j00R0k5K37j06j88J98q6
3778hj80L59k80L05j89J08O4l16L43q4J25r7l26K51o3p9R4j87J49L62n81j36M69
3801A03N0k08K48k18l9L20k32q6m3J24j77QK9n8l0P8p2R7j07M27j84j69N9J54
$$ plain form
3825 74 -18 105 -194 -212 -67 -219 -39 -37 -39 -88 -125 -32 -7 8 -66 -70 -39 169 -74 -63 -160 70 43 -156 122 -67
3851 -67 -258 -132 -105 317 141 -218 -48 -133 -122 -28 30 -172 -19 25 2 -40 130 -27 229 -4 299 -8 -170
3874 -170 -26 252 109 -215 -78 -138 25 113 -71 20 -126 -36 -142 -184 -216 -84 -241 31 147 -296 -176 120
3896 120 -13 -24 228 357 -93 251 73 -218 65 149 -338 177 17 -10 -71 89 145 -85 -67 -139 -53 119 209
3919 209 151 -158 118 -243 -204 58 278 -63 -37 213 122 191 20 -133 -258 -20 -117 210 -75 186 -139 -47
3941 -47 227 -131 -43 -87 -143 50 -96 34 154 -141 -93 97 -52 142 -57 -41 -6 23 106 222 104 -67 -37
3964 -37 -107 59 142 45 161 77 -28 -3 -314 39 -50 -3 48 -23 -210 -38 13 89 38 -164 -104 -256 -9 -133 29
$$ packed form
3825G4r2J23k99j8J45j52J80Kkm9l7R3K5J5p4mL1K08k43J1r7K30k7j99K78j89
3851f7j91J26K7M22j76l59J70q5J1R4N8k02J53M4k3m2J70j57K56k33L03l07j62
3874a70J44K78j43l24J37o0J63Q8j84R1j46R0j06m2l2J32j57K72J16m43J20K96
3896A20j33j1K52J29m50L44j78k91K83Q4m87N15j60k7o1J60N6k30J8p2Q6J72R0
3919B09n8l09K76l61L9K62K20l41K6K50r1O9j71j53j25K38r7L27k85K61l25R2
3941d7K74l58Q8m4n6J93j46J30J20k95M8J90j49J94j99J6L5K9Q3J16j18j71L0
3964c7p0J66Q3r7J16q4j05K5l11L53q9M7N1p1j87J72N1P6n1k02O0j52K47j24J62
$$ [...]
8191A5
##END NTUPLES=NMR FID
##END=
