##TITLE=1H_Pr T-2
 CDCl3, 8 sc, 
 26.08.2021
##JCAMPDX= 6.0         $$ Bruker NMR JCAMP-DX V2.0
##DATA TYPE= NMR FID
##DATA CLASS= NTUPLES
##ORIGIN= UXNMR, Bruker Analytische Messtechnik GmbH
##OWNER= root
$$ XWIN-NMR		Version 3.5
$$ Thu Aug 26 12:01:14 2021 Russian Standard Time (UT+4h)  she@DPX200
##.OBSERVE FREQUENCY= 200.131506
##.OBSERVE NUCLEUS= ^1H
##.DELAY= (6, 6)
##.ACQUISITION MODE= SIMULTANEOUS
##.ACQUISITION SCHEME= undefined
##.AVERAGES= 8
##.DIGITISER RES= 18
##SPECTROMETER/DATA SYSTEM= spect
##.PULSE SEQUENCE= zg30
##.SOLVENT NAME= DMSO
##.SHIFT REFERENCE= (INTERNAL, DMSO, 0, 15.7039)
##AUDIT TRAIL= $$ (NUMBER, WHEN, WHO, WHERE, WHAT)
$$ ##TITLE= Audit trail, XWIN-NMR		Version 3.5
$$ ##JCAMPDX= 5.01
$$ ##ORIGIN= Bruker BioSpin GmbH
$$ ##OWNER= she
$$ F:/spectra/data/she/nmr/H-F/1/audita.txt
$$ ##AUDIT TRAIL=  $$ (NUMBER, WHEN, WHO, WHERE, WHAT)
(   1,<2021-08-26 12:00:01.12 +0400>,<she>,<DPX200>,
      <created by zg, POWCHK disabled, PULCHK disabled
       configuration hash MD5:
       00 E9 B6 7A A2 85 ED C7 34 08 36 98 17 FE 4E 26
       data hash MD5: 16K
       41 33 7A 1F 73 E9 8E 61 58 B1 17 68 02 4B 61 E3>)
$$ ##END=
$$ 
$$ hash MD5
$$ 7C 5C 79 AB 4D 1D 07 0E 7B FE B7 B1 40 90 68 0A
##$RELAX= 
##$RELAX= 
##$RELAX= 
##$RELAX= 
##$RELAX= 
##$RELAX= 
$$ Bruker specific parameters
$$ --------------------------
##$DU= <F:/spectra>
##$EXPNO= 1
##$NAME= <H-F>
##$PROCNO= 1
##$TYPE= <nmr>
##$USER= <she>
##$AMP= (0..31)
100 100 100 100 100 100 100 100 100 100 100 100 100 100 100 100 100 100 
100 100 100 100 100 100 100 100 100 100 100 100 100 100 
##$AQSEQ= 0
##$AQ_mod= 1
##$AUNM= <au_zg>
##$AUTOPOS= <>
##$BF1= 200.13
##$BF2= 200.13
##$BF3= 200.13
##$BF4= 200.13
##$BF5= 200.13
##$BF6= 200.13
##$BF7= 200.13
##$BF8= 200.13
##$BYTORDA= 1
##$CFDGTYP= 0
##$CFRGTYP= 5
##$CHEMSTR= <none>
##$CNST= (0..31)
1 1 145 1 1 1 1 1 1 1 1 1 1 1 1 1 1 1 1 1 1 1 1 1 1 1 1 1 1 1 1 1 
##$CPDPRG= <>
##$CPDPRG1= <>
##$CPDPRG2= <>
##$CPDPRG3= <>
##$CPDPRG4= <mlev>
##$CPDPRG5= <mlev>
##$CPDPRG6= <mlev>
##$CPDPRG7= <mlev>
##$CPDPRG8= <mlev>
##$CPDPRGB= <>
##$CPDPRGT= <>
##$D= (0..31)
0 1.2 0 0 0 0 0 0 0 0.06 0 0.03 0 0 0 0 0.0002 0 0 0 0 0 0 0 0 0 0 0 0 
0 0 0 
##$DATE= 1629964800
##$DBL= (0..7)
120 120 120 120 120 120 120 120 
##$DBP= (0..7)
150 150 150 150 150 150 150 150 
##$DBP07= 0
##$DBPNAM0= <>
##$DBPNAM1= <>
##$DBPNAM2= <>
##$DBPNAM3= <>
##$DBPNAM4= <>
##$DBPNAM5= <>
##$DBPNAM6= <>
##$DBPNAM7= <>
##$DBPOAL= (0..7)
0.5 0.5 0.5 0.5 0.5 0.5 0.5 0.5 
##$DBPOFFS= (0..7)
0 0 0 0 0 0 0 0 
##$DE= 6
##$DECBNUC= <off>
##$DECIM= 32
##$DECNUC= <off>
##$DECSTAT= 4
##$DIGMOD= 1
##$DIGTYP= 9
##$DL= (0..7)
0 120 120 120 120 120 120 120 
##$DP= (0..7)
150 150 150 150 150 150 150 150 
##$DP07= 0
##$DPNAME0= <>
##$DPNAME1= <>
##$DPNAME2= <>
##$DPNAME3= <>
##$DPNAME4= <>
##$DPNAME5= <>
##$DPNAME6= <>
##$DPNAME7= <>
##$DPOAL= (0..7)
0.5 0.5 0.5 0.5 0.5 0.5 0.5 0.5 
##$DPOFFS= (0..7)
0 0 0 0 0 0 0 0 
##$DQDMODE= 0
##$DR= 18
##$DS= 0
##$DSLIST= <SSSSSSSSSSSSSSS>
$$ [...]
##$SUBNAM2= <"">
##$SUBNAM3= <"">
##$SUBNAM4= <"">
##$SUBNAM5= <"">
##$SUBNAM6= <"">
##$SUBNAM7= <"">
##$SUBNAM8= <"">
##$SUBNAM9= <"">
##$SW= 20.0188882624521
##$SWIBOX= (0..15)
0 0 2 0 0 0 0 0 0 0 0 0 0 0 0 0 
##$SW_h= 4006.41025641026
##$TD= 16384
##$TD0= 1
##$TE= 0
##$TE2= 300
##$TE3= 300
##$TEG= 300
##$TL= (0..7)
0 120 120 120 120 120 120 120 
##$TP= (0..7)
150 150 150 150 150 150 150 150 
##$TP07= 0
##$TPNAME0= <>
##$TPNAME1= <>
##$TPNAME2= <>
##$TPNAME3= <>
##$TPNAME4= <>
##$TPNAME5= <>
##$TPNAME6= <>
##$TPNAME7= <>
##$TPOAL= (0..7)
0.5 0.5 0.5 0.5 0.5 0.5 0.5 0.5 
##$TPOFFS= (0..7)
0 0 0 0 0 0 0 0 
##$TUNHIN= 0
##$TUNHOUT= 0
##$TUNXOUT= 0
##$USERA1= <user>
##$USERA2= <user>
##$USERA3= <user>
##$USERA4= <user>
##$USERA5= <user>
##$V9= 5
##$VALIST= <valist>
##$VCLIST= <CCCCCCCCCCCCCCC>
##$VD= 0
##$VDLIST= <DDDDDDDDDDDDDDD>
##$VPLIST= <PPPPPPPPPPPPPPP>
##$VTLIST= <TTTTTTTTTTTTTTT>
##$WBST= 1024
##$WBSW= 4
##$XGAIN= (0..3)
0 0 0 0 
##$XL= 0
##$YL= 0
##$YMAX_a= 115115
##$YMIN_a= -122856
##$ZGOPTNS= <>
##$ZL1= 120
##$ZL2= 120
##$ZL3= 120
##$ZL4= 120
##$ABSF1= 10
##$ABSF2= 0
##$ABSG= 5
##$ABSL= 3
##$ALPHA= 0
##$AQORDER= 0
##$ASSFAC= 0
##$ASSFACI= 0
##$ASSFACX= 0
##$ASSWID= 0
##$AUNMP= <proc_1d>
##$AZFE= 0.1
##$AZFW= 0.1
##$BCFW= 1
##$BC_mod= 2
##$BYTORDP= 1
##$COROFFS= 0
##$CY= 11.3945322036743
##$DATMOD= 1
##$DC= 2
##$DFILT= <>
##$DTYPP= 0
##$F1P= 2.36226072786647
##$F2P= -0.459571619588291
##$FCOR= 0.5
##$FTSIZE= 0
##$FT_mod= 4
##$GAMMA= 1
##$GB= 0.15
##$INTBC= 1
##$INTSCL= 1
##$ISEN= 128
##$LB= 0.24
##$LEV0= 0
##$LPBIN= 0
##$MAXI= 10000
##$MC2= 0
##$MEAN= 0
##$ME_mod= 0
##$MI= 1.114404
##$NCOEF= 0
##$NC_proc= 0
##$NLEV= 6
##$NOISF1= 3.799351
##$NOISF2= 2.8
##$NSP= 1
##$NTH_PI= 0
##$NZP= 0
##$OFFSET= 15.70392
##$PC= 1
##$PHC0= -13356.59
##$PHC1= 12.40099
##$PH_mod= 1
##$PKNL= yes
##$PPARMOD= 0
##$PSCAL= 0
##$PSIGN= 0
##$REVERSE= no
##$SF= 200.130013532006
##$SI= 16384
##$SIGF1= 3
##$SIGF2= 2
##$SINO= 400
##$SIOLD= 16384
##$SREGLST= <1H.CDCl3>
##$SSB= 0
##$STSI= 0
##$STSR= 0
##$SW_p= 3612.71676300578
##$SYMM= 0
##$S_DEV= 0
##$TDeff= 0
##$TDoff= 0
##$TI= <>
##$TILT= no
##$TM1= 0
##$TM2= 0
##$TOPLEV= 0
##$USERP1= <user>
##$USERP2= <user>
##$USERP3= <user>
##$USERP4= <user>
##$USERP5= <user>
##$WDW= 1
##$XDIM= 8192
##$YMAX_p= 0
##$YMIN_p= 0
$$ End of Bruker specific parameters
$$ ---------------------------------
##NTUPLES= NMR FID
##VAR_NAME=  TIME,          FID/REAL,        FID/IMAG
##SYMBOL=    X,             R,               I
##VAR_TYPE=  INDEPENDENT,   DEPENDENT,       DEPENDENT
##VAR_FORM=  AFFN,          ASDF,            ASDF
##VAR_DIM=   8192,          8192,            8192
##UNITS=     SECONDS,       ARBITRARY UNITS, ARBITRARY UNITS
##FACTOR=    0.0002496,     1,               1
##FIRST=     0,             0,               0
##LAST=      2.0444736,     0,               0
##MIN=       0,             -122856,         0
##MAX=       2.0444736,     115115,          0
$$ Real data points
##PAGE= N=1
##DATA TABLE= (X++(R..R)), XYDATA
$$ [...]
$$ plain form
1889 245 57 14 109 125 131 166 140 322 137 -13 161 -75 53 -58 -99 109 65 -121 -6 -55 -244 125 -175
1912 -175 -74 -226 -26 -23 193 228 -189 -341 139 8 -59 211 -64 37 -30 -241 -193 2 -188 -21 -230 -83
1934 -83 -107 -10 -281 -151 18 24 219 23 -54 195 29 -60 -114 -148 3 126 6 -30 216 54 -11 117 -15 -62
1958 -62 12 -31 105 75 72 51 126 135 115 64 -91 -98 -132 24 -290 107 29 -14 33 231 -64 -93 -19 315 -227 130 -1
1985 -1 35 -108 -338 -170 -189 85 -208 -204 110 107 -86 -144 148 60 -49 124 145 -173 -71 -67 94 -29 117 241
2009 241 -119 -60 219 6 -82 -66 -23 -67 -201 6 -84 -8 -116 91 -97 -285 42 -74 88 48 41 -36 98 -121
2033 -121 -63 -107 293 -44 -149 55 -23 -46 -10 -147 12 204 34 80 38 -23 -79 58 13 177 -251 -63 129
2056 129 24 62 103 -13 50 -261 -39 -136 -4 -71 94 54 205 113 192 -20 58 69 -177 20 -108 -281 -65
$$ packed form
1889B45j88m3R5J6OL5k6J82j85j50J74k36J28j11m1K08m4j86J15m9j89L69l00
1912a75J01j52K00LK16L5m17j52M80j31o7K70k75J01o7k11M8J95j90J67k09J47
1934h3k4R7k71J30J69OJ95j96p7K49j66q9n4l4J51J23j20l6K46j62o5J28j32m7
1958f2P4m3J36l0lk1P5Rk0n1j55pl4J56l14L97p8m3M7J98k95k9P4L34n42L57j31
1985aL6j43k30J68j9K74k93ML14lj93n8K92q8j09J73K1l18J02MJ61j23J46J24
2009B41l60N9K79k13q8J6M3m4j34K07r0P6j08K07j88j88L27j16J62m0pp7J34k19
2033a21N8m4M00l37j05K04p8k3L6j37J59J92j70M6m2o1n6J37m5J64m28J88J92
2056A29j05L8M1j16O3l11K22r7J32o7J65m0J51r2P9k12P8J1k46J97j28j73K16
$$ plain form
2079 -65 6 -145 -18 -180 -84 -274 -208 -186 60 87 -185 -222 315 181 224 -35 -1 -42 -40 -51 21 101 -358 -176 -103
2104 -103 -121 -137 -23 -298 152 395 -168 -243 159 -23 -175 15 -203 14 189 -115 -245 -121 -20 38 135 -57
2126 -57 10 89 95 219 -10 104 -240 -10 324 8 -120 39 28 -70 57 -123 67 75 -5 105 77 45 -2 -33 131
2151 131 8 -62 -109 9 -199 226 -32 275 69 188 107 66 182 238 -75 88 40 169 -46 153 4 -273
2173 -273 -85 -237 -44 113 -18 -87 -33 -32 45 -347 33 179 172 21 132 281 -98 -108 228 16 -109 -256 32
2196 32 -227 94 -60 -104 87 -169 -168 181 -61 75 -230 155 55 -73 -51 -65 268 60 -214 118 48 324
2218 324 138 47 -66 -178 362 150 -83 -19 -303 -221 40 31 352 -126 -260 70 -217 0 160 22 -16 73
2240 73 -49 -141 150 -5 -134 -19 190 -90 249 115 -256 125 349 173 -141 118 -75 209 -42 292 125
$$ packed form
2079f5P1j51J27j62R6j90O6K2K46K7k72l7N37j34M3k59L4m1Kj1P2Q0m59J82P3
2104a03j8j6J14k75M50K43n63p5M02j82j52J90k18K17J75l04j30J24J01N8R7j92
2126e7O7P9OJ24k29J14l44K30L34l16j28J59j1r8J27j80J90Qq0J10k8l2m7l1J64
2151A31j23p0m7J18k08M25k58L07k06J19q1m1J16N6l13J63m8J29k15J99j49k77
2173b73J88j52J93J57j31o9N4JP7l92L80J46pj51J11J49l79j0L36k12j25j47K88
2196C2k59L21j54m4J91k56JL49k42J36l05L85j00j28K2j4L33k08k74L32p0K76
2218C24j86r1j13j12N40k12k33O4k84Q2K61rL21m78j34L30k87K17J60j38l8Q9
2240G3j22r2K91j55j29J15K09k80L39j34l71L81K24j76l14K59j93K84k51L34j67
$$ plain form
2261 125 -201 -1 60 245 -192 145 -60 46 187 65 16 145 327 -268 -112 249 69 16 68 -18 -123 87
2283 87 -184 -251 259 -89 10 -75 -13 51 76 -168 -245 188 -117 -7 119 -183 8 60 125 14 -34 105 173 -49
2307 -49 -17 2 143 206 27 269 68 178 164 151 163 177 136 80 60 -132 41 -33 46 -164 8 -3 -207 -185 -87
2332 -87 65 -133 -46 -80 -59 65 -79 -48 99 -3 -10 -9 13 147 -181 190 -364 -109 -40 154 -7 32 -94 53
2356 53 146 -74 -63 -109 168 121 -138 -108 61 -229 -194 35 -156 178 59 165 71 -134 -32 -16 -158 56 -29
2379 -29 -125 176 193 107 -337 -14 314 76 -8 -160 45 13 -306 -189 -146 185 -149 180 -58 153 146 -70 -86
2402 -86 -30 117 25 -20 184 147 -28 170 77 93 105 211 191 -117 -273 -85 -194 127 -20 -11 -162 -86 -123 172
2426 172 -81 -65 -198 -7 33 -142 -131 -281 19 19 74 -46 181 -107 167 -70 -497 148 -118 -83 260 -44
$$ packed form
2261A25l26K00O1J85m37L37k05J06J41j22m9J29J82n95J56L61j80n3N2q6j05K10
2283H7k71o7N10l48R9q5O2O4K5k44p7M33l05J10J26l02J91N2O5j11m8J39O8k22
2307d9L2J9J41O3j79K42k01J10j4j3J2J4m1n6k0j92J73p4P9k10J72j1k04K2R8
2332h7J52j98Q7l4K1J24j44L1J47j02pJK2J34l28L71n54K55O9J94j61L9j26J47
2356E3R3k20J1m6K77m7k59L0J69k90L5K29j91L34j19J06r4k05J02J6j42K14q5
2379b9r6L01J7q6m44L23L28k38q4j52K05l2l19J17M3L31l34L29k38K11pk16j6
2402h6N6J47r2m5K04l7j75J98r3J6J2J06k0l08j56J88j09L21j47Rj51P6l7K95
2426A72k53J6j33J91M0j75J1j50L00%N5j20K27k88K74k37m27O45k66L5L43l04
$$ plain form
2448 -44 14 -168 96 277 148 -80 141 174 67 165 82 -64 11 -25 -164 -81 28 30 54 48 5 -113 -91 84 191
2473 191 144 34 28 177 26 -56 -33 -56 355 -113 -210 51 91 -218 -226 -26 18 63 177 165 -37 25 52 -124 -169
2498 -169 -12 120 71 63 -111 70 91 170 -115 -161 -63 -137 -64 -32 -200 -30 -306 -239 -391 -181 140 50 -199 69
2522 69 -180 25 230 152 90 145 -56 235 -170 -152 97 -112 12 160 -413 18 26 -299 -12 78 -5 92 -135
2545 -135 133 147 -131 -141 106 189 -22 -41 -41 65 -156 19 252 -214 -76 110 -86 251 239 71 -178 192
2567 192 -28 -54 55 -22 31 97 20 1 -173 -88 30 118 -152 259 49 -154 89 -83 114 -87 66 -49 180
2590 180 -101 -109 225 235 -137 65 -37 -84 308 98 -78 444 23 -92 62 -111 174 36 -55 263 205 -178
2612 -178 -133 78 -26 -30 -124 223 82 19 11 -150 72 124 19 127 56 -142 199 24 -10 99 140 -357 43 86
$$ packed form
2448d4N8j82K64J81j29k28K21L3j07R8q3j46P5l6j39Q3J09KK4om3j18K2J75J07
2473A91m7j10oJ49j51q2K3k3M11m68r7K61M0l09qK00M4M5J14j2k02O2K7j76m5
2498a69J57J32m9qj74J81K1P9k85m6R8p4P3L2j68J70k76O7j52K10L21r0k49K68
2522F9k49K05K05p8o2N5k01K91m05J8K49k09J24J48n73M31Ql25K87R0q3R7k27
2545a35K68J4k78j0K47Q3k11j9%J06k21J75K33m66J38J86j96L37j2j68k49L70
2567A92k20k6J09p7N3O6p7j9j74Q5J18Q8k70M11k10k03K43j72J97k01J53j15K29
2590A80k81qL34J0l72K02j02m7L92k10j76N22m21j15J54j73K85j38r1L18n8l83
2612a78M5K11j04mr4L47j41o3qj61K22N2j05J08p1j98L41j75l4J09M1m97M00M3
$$ plain form
2636 86 217 25 -280 -181 55 85 49 129 6 -25 -70 230 143 -124 -48 -176 75 -167 133 -97 78 245 -74
2659 -74 181 -19 38 288 56 104 13 -138 71 167 -23 -113 139 -83 21 -132 -61 36 49 -9 -46 -46 -85 24 -89
2684 -89 -295 143 17 -74 131 40 53 31 -45 -224 0 71 117 3 -235 -12 -230 -38 -199 71 -190 46 20
2707 20 154 290 -139 183 66 -438 95 199 -30 -15 34 88 -126 63 79 -101 -294 130 97 -184 -11 -52
2729 -52 183 -351 33 -3 -18 217 -279 -60 24 66 -70 -98 173 15 -139 89 0 -8 -84 398 -63 -81 -63 -145
2753 -145 -133 -45 -23 73 -106 155 -21 -41 15 36 250 132 121 -141 -28 -71 -12 -112 -109 70 -33 -182 -78 -282
2777 -282 -96 -176 54 163 63 96 107 -101 -1 -123 -75 -52 63 32 124 -102 -30 253 -10 -38 111 119 261 9
2801 9 -26 12 -2 28 227 -97 -18 -3 -19 67 95 92 -28 191 84 -36 20 -158 129 278 -16 -72 165 44 -55
$$ packed form
2636H6J31j92l05R9K36L0l6Q0j23l1m5L00q7k67P6j28K51k42L00k30J75J67l19
2659g4K55k00N7K50k32M8r1j51K09R6j90r0K52k22J04j53P1R7J3n8l7%l9J09j13
2684h9k06M38j26r1K05r1J3k2p6j79K24P1M6j14k38K23k18J92j61K70k61K36k6
2707B0J34J36m29L22j17n04N33J04k29J5M9N4k14J89J6j80j93M24l3k81J73m1
2729e2K35n34L84l6j5K35m96K19Q4M2j36k8K71j58j54K28q9qp6M82m61j8J8q2
2753a45J2Q8K2R6j79K61j76k0N6K1K14j18j1k62J13m3N9j00LJ79j03j49J04k04
2777b82J86q0K30J09j00L3J1k08J00j22M8K3J15l1R2k26P2K83k63k8J49QJ42k52
2801Il5L8j4L0J99l24P9J5j6Q6K8lj20K19j07j20N6j78K87J49k94n6K37j21r9
$$ plain form
2826 -55 299 97 179 -41 -66 -38 -103 263 169 -24 -173 11 30 -76 175 -38 -143 5 -49 28 38 73 -91 -89
2850 -89 0 -127 -266 125 -200 150 -264 103 -118 -114 -25 254 -221 128 -249 57 -222 164 -73 -88 -140 -8
2872 -8 177 -59 222 74 88 -205 154 148 -108 79 -1 -33 61 92 -25 355 312 184 37 250 282 14 -40 47
2896 47 -16 68 147 -85 69 -145 -91 -136 116 40 -116 -31 13 -87 27 -288 -91 -134 -81 138 76 134 -43 -110 33
2921 33 -286 12 44 -83 -79 -59 -88 -67 5 89 152 -91 -49 -182 254 -31 -128 -110 9 40 -186 -104 106 99 -28 -20
2947 -20 32 70 131 -46 -55 146 31 -5 72 300 -59 -24 -120 244 41 170 -110 -18 -88 111 99 19 165 75 -295
2972 -295 14 -132 -86 31 -117 -187 53 118 48 52 -159 -141 -58 -403 -241 55 -15 -165 69 -204 -55 -160 100
2995 100 -7 15 -155 -101 179 -165 52 27 216 -115 53 39 42 192 81 -179 157 112 -80 -10 75 -151 -315
$$ packed form
2826e5L54k02Q2k20k5K8o5L66r4j93j49J84J9j06K51k13j05J48n4P7J0L5j64K
2850h9Q9j27j39L91l25L50m14L67k21MQ9K79m75L49l77L06k79L86k37j5n2J32
2872hJ85k36K81j48J4k93L59ok56J87q0l2R4L1j17L80m3j28j47K13L2k68n4Q7
2896D7o3Q4P9k32J54k14N4m5K52p6j56Q5M4j00J14l15J97m3N3K19o2N8j77o7J43
2921C3l19K98L2j27MK0k9K1P2Q4O3k43M2j33M36k85r7J8J19L1k26Q2K10pj27Q
2947b0N2L8O1j77rK01j15l6P7K28l59L5r6L64k03J29k80R2p0J99j2q0J46r0l70
2972b95L09j46M6J17j48p0K40O5p0Mk11J8Q3l45J62K96p0j50K34k73J49j05K60
2995A00j07K2j70N4K80l44K17k5J89l31J68j4LJ50j11k60L36m5j92P0Q5k26j64
$$ plain form
3018 -315 132 -75 207 313 358 143 39 -66 -106 -145 77 28 81 83 -118 -37 -159 -28 -72 111 5 233 0
3041 0 -46 91 -10 -119 137 -91 85 -64 -22 287 333 76 -110 -221 74 178 -261 18 -238 84 211 -344
3063 -344 9 -220 221 26 150 167 -87 116 -64 70 147 16 72 -85 73 90 42 -106 -84 247 -51 226
3085 226 -316 -181 -82 -154 31 14 -140 2 -14 -43 -58 -94 -93 -296 -150 -71 199 96 -12 31 113 8 123 -306
3109 -306 40 99 39 51 183 -106 48 -35 -31 -117 399 -70 37 -84 102 35 85 -18 -71 110 -82 -38 105 -93
3133 -93 332 93 61 129 39 -105 275 304 72 -32 265 21 -20 -68 -88 -150 52 -102 56 8 -188 -125 66 211
3157 211 136 -49 -31 53 -5 234 126 -12 -39 12 -19 180 -29 -93 -230 51 -46 243 143 7 78 119 -124 -104
3181 -104 40 -77 -94 196 151 267 463 59 -113 91 -340 -121 221 -144 -95 84 19 -51 185 -94 -84 67
$$ packed form
3018c15M47k07K82J06M5k15j04j05m0l9K22m9N3Kk01Q1j22J31m4J83j06K28k33
3041@m6J37j01j09K56k28J76j49M2L09M6k57j86j11K95J04m39K79k56L22J27n55
3063c44L53k29M41j95J24J7k54K03j80J34P7j31N6j57J58J7m8j48K2L31k98K77
3085B26n42J35R9p2J85j7j54J42j6k9j5l6Jk03J46P9K70j03j08M3Q2j05J15m29
3109c06L46N9o0J2J32k89J54q3Mq6N16m69J07j21J86o7N0j03n3J81j92M4J43j98
3133i3M25k39l2O8r0j44L80K9k32j04K97k44m1m8k0o2K02j54J58m8j96O3J91J45
3157B11p5j85J8Q4n8K39j08j38k7N1l1J99k09o4j37K81r7K89j00j36P1M1k43K0
3181a04J44j17j7K90m5J16J96m04j72K04m31K19L42l65M9J79o5p0K36k79J0J51
$$ plain form
3203 67 0 -134 -119 55 14 7 -275 -214 -386 11 3 -69 -7 -73 48 129 55 108 -44 147 116 57 317 -156 103 362
3229 362 -224 -23 -119 120 125 259 -4 -102 -102 278 -254 -52 223 167 133 111 127 -17 251 25 7 -15 -9 -17 99
3254 99 -113 48 -64 -99 56 -191 -208 -67 23 -22 200 6 88 56 41 -74 110 -132 53 -55 34 13 114
3277 114 111 117 26 48 -10 -54 -175 -39 -71 102 144 51 27 224 139 -69 -28 -222 59 382 -188 79 52 78 17 37
3303 37 -14 -260 17 207 -201 -164 30 -46 -51 183 -39 147 44 -187 117 30 294 -23 13 -70 -139 57 26 194
3327 194 -129 -102 -84 -104 -155 -66 -29 -229 -30 -202 -73 38 -57 23 -108 -99 -66 -96 -378 -78 -123 -63 -98 161 197
3352 197 -47 -84 131 -127 -63 -187 173 59 97 58 -119 165 -13 -100 37 -152 45 -193 6 203 -194 168
3374 168 -63 -72 -9 15 85 137 -44 199 -302 6 -87 257 17 -326 276 -63 102 -65 -186 -53 60 160
$$ packed form
3203F7o7j34J5J74m1pk82O1j72L97qp2O2o6J21Q1p4N3j52J91l1n9K60m73K59K59
3229C62n86K01r6K39NJ34k63r8%L80n32K02K75n6l4k2J6j44K68k26j8k2OqJ16
3254I9k12J61j12l5J55k47j7J41R0m5K22j94Q2l2j5j15J84k42J85j08Q9k1J01
3277A14lOr1K2n8m4j21J36l2J73M2r3k4J97q5k08M1j94K81L23n70K67k7K6o1K0
3303C7n1k46K77J90m08L7J94p6nK34k22J86j03k31L04q7K64l17L6q3o9J96l1J68
3327A94l23K7J8k0n1Q9L7k00J99j72J29J11r5Q0j31RL3l0k82L00m5O0l5K59L6
3352A97k44l7K15k58O4j24L60j14L8l9j77K84j78q7J37j89J97k38J99J97l97L62
3374A68k31rO3K4P0N2j81K43n01L08r3L44k40l43O02l39J65j67j21J33J13J00
$$ plain form
3396 160 84 -116 73 -64 31 50 -104 33 -91 -61 -132 95 -154 169 -107 34 111 61 -80 105 265 141
3418 141 66 17 78 274 -171 -84 62 -115 97 -23 50 138 -102 144 18 -271 171 -204 46 0 -23 -83 -146
3441 -146 77 -19 74 183 -150 254 118 -268 -28 21 40 -3 -96 -114 -40 -88 179 137 -82 -71 17 22 -106 65 -115
3466 -115 -57 91 -303 165 137 -79 -239 54 -147 44 -44 -81 107 -17 74 3 -214 -126 24 -23 159 -131 34
3489 34 232 -157 -14 -245 162 81 -209 -238 -102 7 30 -65 2 -206 55 128 64 83 79 -54 68 172 228 98
3513 98 15 30 -125 -162 39 -81 -131 -78 -119 -15 39 59 -38 -4 136 59 -107 30 -274 -116 18 -5 35 9 -60
3538 -60 159 283 71 255 8 -176 213 -28 186 72 195 -193 -57 -58 376 233 101 -191 125 -78 64
3559 64 -158 -77 154 -64 5 -76 192 56 -197 27 -36 25 94 66 29 38 15 152 95 -194 165 50 186 1
$$ packed form
3396A60p6k00J89j37R5J9j54J37j24L0p1K27k49L23k76J41P7n0j41J85J60j24
3418A41p5m9O1J96m45Q7J46j77K12j20P3Q8k40K46j26k89M42l75K50m6k3o0o3
3441a46K23r6R3J09l33M04j36l86K40M9J9m3r3j8P4m8K67m2k19J1Q8Nj28J71j80
3466a15N8J48l94M68k8k16j60K93k01J91q8l7J88j24R1p1k17Q8J50m7J82k90J65
3489C4J98l89J43k31M07q1k90k9J36J09K3r5O7k08K61P3o4J9mj33J22J04N6j30
3513I8q3J5j55l7K01j20n0N3m1J04N4K0r7L4J40p7j66J37l04J58J34k3M0k6o9
3538f0K19J24k12J84k47j84L89k41K14j14J23l88J36jM34j43j32k92L16k03J42
3559F4k22Q1K31k18O9q1K68j36k53K24o3O1O9k8l7Rk3J37n7k89L59j15J36j85
$$ plain form
3583 1 -100 34 -19 277 7 275 -47 -277 97 27 334 -86 -145 256 -13 146 -109 -99 -69 -63 27 -299 57
3606 57 80 -61 -174 -20 240 175 -166 82 -47 -137 249 63 -66 128 132 112 108 5 -181 60 63 277 -1 -10
3630 -10 44 76 -117 52 -119 -66 294 13 -186 -196 45 207 191 -55 179 93 -255 223 -45 -70 49 -83 -37
3653 -37 -136 -193 -101 208 -131 130 -9 -35 106 232 -29 69 -51 -113 -20 0 -141 140 -283 -196 -240 121 -45 -106
3677 -106 39 113 -12 -23 113 -62 268 40 41 -46 92 -182 5 20 100 13 -40 -207 -93 62 -122 136 -6
3700 -6 -111 145 213 74 19 135 80 -179 -127 -29 -50 44 -52 -84 -127 62 -156 23 -26 -10 -117 116 -159 58 106
3725 106 -13 172 108 153 74 -71 -53 489 -174 359 -62 66 -22 -102 -120 -109 142 -62 14 19 6 19 158 99 -27
3750 -27 144 -17 135 228 -205 -103 -135 -81 58 -172 30 73 224 270 265 -113 -117 99 88 -81 -261 156 -10 -92
$$ packed form
3583Aj01J34n3K96k70K68l22k30L74p0L07m20n9M01k69J59k55J0L0OR0l26L56
3606E7K3j41j13J54K60o5l41K48j29r0L86j86j29J94Mk0mj03j86K41LK14k78r
3630a0N4L2j93J69j71N3L60k81j99j0K41J62j6k46K34q6l48M78k68k5J19j32M6
3653c7r9n7R2L09l39K61j39k6J41J26k61R8j20o2R3K0j41K81m23Q7m4L61j66o1
3677a06J45P4j25j1J36j75L30k28Jq7J38k74J87J5Q0q7n3j67J14J55j84K58j42
3700fj05K56O8j39n5J16n5k59N2R8k1R4r6l2m3J89k18J79m9J6j07K33k75K17M8
3725A06j19J85o4M5p9j45J8N42o63N33m21J28q8q0j8J1K51k04P6Nj3J3J39n9j26
3750b7J71j61J52R3m33J02l2N4J39k30K02M3J51M6nl78mK16j1j69j80M17j66q2
$$ plain form
3774 -92 -141 -44 165 18 91 14 42 -8 -48 -63 86 12 285 224 77 -33 -109 80 -114 -136 147 -5 195 173 37
3799 37 -83 120 48 71 -243 -13 62 -250 65 -203 -314 20 -114 250 -79 13 -93 -121 98 -149 26 327
3821 327 240 -29 40 27 -150 -65 -69 -185 120 -159 221 239 165 23 105 52 222 92 -102 -147 114 326 -75 32
3845 32 109 22 159 -134 -213 -234 -160 165 -172 -216 74 99 -62 63 136 8 93 -116 -109 156 -63 24 -331 86
3869 86 199 172 -23 -111 107 119 -80 -168 58 -143 141 -130 -9 308 59 70 127 -61 58 -191 -163 69 81
3892 81 0 -298 -171 30 -56 -229 96 -30 -16 -27 -74 285 78 -7 -215 204 33 94 -103 12 14 -46 -65 -62 -153
3917 -153 107 -141 75 227 14 130 162 95 -19 10 285 -244 -126 -59 -344 135 156 203 -147 8 -243 -30
3939 -30 -202 -77 -66 -49 -41 -198 215 67 86 54 25 -39 -206 303 182 348 322 -174 11 -190 15 200 273 155
$$ packed form
3774i2m9R7K09j47P3p7K8n0m0j5J49p4K73o1j47j10p6J89j94k2K83j52K00k2j36
3799C7j20K03p2K3l14K30P5l12L15k68j11L34j34L64l29R2j06k8K19k47J75L01
3821C27q7k69O9j3j77Q5mj16L05k79L80J8p4j42Q2n3J70j30j94m5K61K12m01J07
3845C2P7q7J37k93p9k1P4L25l37m4K90K5j61J25P3j28Q5k09PK65k19Q7l55M17
3869H6J13k7j95q8K18J2j99q8K26k01K84k71J21L17k49J1N7j88J19k49K8K32J2
3892H1q1k98J27K01q6j73L25j26J4j1m7L59k07q5k08M19j71O1j97J15Ko0j9Lr1
3917a53K60k48K16J52k13J16L2o7j14K9K75n29J18O7k85M79K1M7l50J55k51K13
3939c0j72J25J1J7Qj57M13j48J9l2k9o4j67N09j21J66k6m96J85k01K05J85P3j18
$$ plain form
3963 155 -81 298 -30 49 2 103 -418 333 90 -150 -76 -86 -109 -31 -23 36 118 -209 160 104 -22 130 43 -262
3987 -262 305 -23 8 -196 -227 -286 89 -203 82 -71 -314 163 53 -7 -27 147 46 185 175 247 183 414 41
4010 41 14 91 -296 48 193 17 -67 -180 76 -45 48 -13 -209 -4 -120 -127 147 133 -94 99 -126 -28 -21 -97
4034 -97 12 14 -105 -173 120 124 43 -37 -178 153 -241 -23 -219 67 -93 -439 69 91 -167 -54 -29 -10 -132 -120
4058 -120 -335 -131 -3 88 110 41 255 -239 -223 124 -147 -75 311 -11 66 -33 -173 219 117 24 -167 40 -22
4081 -22 -192 -76 -168 -340 109 117 232 15 -201 -67 249 67 -23 66 -63 78 74 -193 70 6 140 -104 51
4104 51 -110 16 95 -43 -92 51 -53 -43 108 -21 -25 -126 143 -15 -137 -92 -80 -93 -56 -247 -198 2 129 -56
4128 -56 58 -62 39 199 -44 182 302 349 154 192 59 66 -20 32 -134 39 -2 -119 264 -106 -25 -46 77
$$ packed form
3963A55k36L79l28P9m7J01n21P51k43k40P4j0k3P8QN9Q2l27L69n6j26J52q7l05
3987b62N67l28L1k04l1n9L75k92K85j53k43M77j10o0k0J74j01J39j0P2o4K31l73
4010D1k7P7l87L44J45j76q4j13K56j21R3o1j96K05j16pK74j4k27J93k25R8Pp6
4034i7J09Kj19o8K93Mq1q0j41L31l94K18j96K86j60l46N08K2k58J13K5J9j22J2
4058a20k15K04J28R1K2o9K14m94J6L47k71P2L86l22P7r9j40L92j02r3j91K07o2
4081b2j70J16r2j72M49QJ15k17k16J34L16j82r0Q9j29J41mk67K63o4J34k44J55
4104E1j61J26P9j38m9J43j04J0J51j29mj01K69j58j22M5J2j3L7j91M9K00J27j85
4128e6J14j20J01J60k43K26J20M7j95L8j33Pq6N2j66J73m1j17L83l70Q1k1J23
$$ plain form
4151 77 -77 -125 44 -21 -17 232 -33 123 274 102 -94 202 97 -169 74 39 45 -4 -419 29 46 1 7 -358
4175 -358 -154 -45 -49 115 -65 -20 7 7 99 77 47 288 149 108 184 -67 257 95 112 -68 91 -37 68 106
4199 106 122 50 63 33 11 -22 -125 -27 -112 113 -117 168 18 -155 -39 -34 -226 175 116 38 -187 278 -81 28
4223 28 -68 82 202 -34 -202 225 18 136 -229 -78 -108 352 153 39 102 -263 -253 -73 -69 90 152 11 -54
4246 -54 170 -150 -289 -19 186 62 -228 215 -69 129 45 -138 320 49 -286 -6 -62 62 -146 -231 -35
4267 -35 -15 -155 -104 19 -176 80 63 -377 210 -66 26 -161 -144 59 -8 -104 -33 45 -85 44 117 -144 -41 44
4291 44 25 -166 -90 184 45 -13 -144 -134 52 47 237 -139 -29 41 -13 177 88 -150 335 -234 -172 42 106 58
4315 58 55 -15 21 -17 -104 84 223 137 16 38 -156 -84 168 -25 -229 17 26 -66 -138 26 -28 -116 -137 -132 52 -34 50
$$ packed form
4151G7j54m8J69o5MK49k65J56J51j72j96K96j05k66K43l5Om9m15M48J7m5Ol65
4175c58K04J09mJ64j80M5K7%R2k2l0K41j39m1P6k51L24j62J7j80J59j28J05L8
4199A06J6p2J3l0k2l3j03R8q5K25k30K85j50j73J16Nj92M01n9p8k25M65l59J09
4223B8r6J50J20k36j68M27k07J18l65J51l0M60j99j14O3l65J0J80MJ59O2j41o5
4246e4K24l20j39K70K05j24k90M43k84J98q4j83M58k71l35K80n6J24k08q5J96
4267c5K0j40N1J23j95K56j7m40N87k76R2j87J7K03o7r6P1P8j30J29P3k61J03Q5
4291D4j9j91P6K74j39n8j31J0J86nJ90l76J10P0n4J90q9k38M85n69O2K14O4m8
4315E8lp0L6l8q7J88J39q6j21K2j94P2K52j93k04K46Rr2p2J64n4q8k1NJ84q6Q4
$$ plain form
4342 50 194 -122 26 -173 -47 -219 -336 -133 72 64 92 -223 103 -37 80 -40 -87 56 8 -38 45 -135 -123
4365 -123 51 -118 46 -150 -31 -59 228 184 -270 -7 -174 -14 113 219 -31 -313 -150 293 -77 94 27
4386 27 56 -45 -25 70 153 -22 -180 239 36 -64 154 149 -31 -87 234 10 80 37 -213 -258 124 98 -201 179
4410 179 -139 -113 59 295 -143 60 3 243 33 -69 -7 -70 -157 241 -113 -41 -22 50 -102 -448 174 81 -316
4433 -316 -22 -114 159 -137 -254 189 -212 -342 -92 -130 231 198 -78 -89 -96 91 -109 12 -71 -108 100 50 -94
4456 -94 -72 -28 -54 248 69 -52 -186 162 158 -23 76 -34 -120 68 149 -108 271 -75 -300 -1 60 124 11 10
4480 10 -100 -19 -161 126 -39 -81 -7 -22 -54 55 73 -190 -288 -261 109 -19 -35 -174 74 -49 -280 -24 -236
4503 -236 113 220 265 109 -178 43 -41 124 -156 85 164 -37 -30 -93 128 -81 150 -37 107 183 -200 120
$$ packed form
4342E0J44l16J48j99J26j72j17K03K05qK8l15L26j40J17j20m7J43m8m6Q3j80J2
4365a23J74j69J64j96J19k8K87m4m54K63j67J60J27J06k50k82J63M43l70J71o7
4386B7K9j01K0R5Q3j75j58M19k03j00K18nj80n6L21k24P0m3k50m5L82k6k99L80
4410A79l18K6J72K36m38K03n7K40k10j02O2o3q7L98l54P2J9P2j52l46O22r3l97
4433c16K94r2K73k96j17M43m01j30K50l8L61l3k76j1pJ87k00J21q3l7K08n0j44
4456i4K2M4k6L02j79j21j34L48mj81R9j10q6J88Q1k57L79l46k25K99O1O4j13j
4480A0j10Q1j42K87j65m2P4j5l2J09J8k63r8K7L70j28j6j39K48j23k31K56k12
4503b36L49J07M5j56k87K21q4J65k80K41P9k01Po3K21k09K31j87J44P6l83L20
$$ plain form
4525 120 -128 53 -27 25 -241 235 113 -179 40 -81 -9 -122 -108 20 -132 -46 196 69 -30 55 -365 168
4547 168 160 192 -209 50 -277 -182 -106 -104 167 -156 126 -84 -241 346 -102 237 58 -70 -6 -164 -27 -275 87
4570 87 23 7 33 -171 21 123 223 -170 187 154 9 236 157 -5 -47 -77 -41 184 -165 59 -39 -154 -7
4593 -7 -121 18 78 -36 150 -41 -70 6 -56 -50 201 -69 247 -3 87 -13 -177 -134 -12 -24 -150 248 56 -74
4617 -74 -76 194 -16 95 102 -56 -196 61 54 -177 -71 -71 -32 22 10 4 3 237 50 78 -128 -30 -57 -179 -199 -174 109
4644 109 71 -2 87 -32 -55 18 105 -121 5 124 22 234 23 132 185 -108 244 -45 178 196 -123 -94 -12
4667 -12 168 -67 -193 12 -51 -84 196 84 70 247 -53 -1 -39 -83 -175 49 149 -16 21 -18 48 -95 210 -227
4691 -227 -87 62 -222 118 72 -36 -156 -37 -155 35 -38 -68 -341 -72 45 -44 236 28 -4 48 217 -38
$$ packed form
4525A20k48J81q0N2k66M76j22k92K19j21P2j13J4J28j52Q6K42j27r9Q5m20N33
4547A68qL2m01K59l27R5P6KK71l23K82k10j57N87m48L39j79j28O4j58J37k48L62
4570H7o4j6K6k04J92J02J00l93L57l3j45K27p9j62m2l0L6K25l49K24r8j15J47
4593gj14J39O0j14J86j91k9P6o2OK51k70L16k50R0j00j64M3J22j2j26L98j92j30
4617g4kK70k10J11Pj58j40K57pk31J06%L9N4j2ojK34j87K8k06R8k7j22k0K5K83
4644A09l8p3Q9j19k3P3Q7k26J26J19j02K12k11J09N3k93L52k89K23J8l19K9Q2
4667a2J80k35j26K05o3l3K80j12j4J77l00N2l8m4r2K24J00j65L7l9O6j43L05m37
4691b27J40J49k84L40m6j08j20J19j18J90p3l0k73K69J17q9K80k08l2N2J69k55
$$ plain form
4713 -38 -6 157 -40 -256 141 -198 -92 -68 -66 55 -19 109 -75 -67 7 232 27 124 111 -81 -191 -118 -36 -73 -369
4738 -369 24 -120 179 -332 62 -72 93 134 -63 65 144 -159 65 -119 31 80 -208 268 130 -14 -189
4759 -189 -54 -203 145 -86 -282 -133 -59 1 -95 90 89 209 275 7 -200 -160 138 -68 -266 -109 -11 -64 -68 52
4783 52 132 -195 -97 -80 29 -239 63 -38 -165 57 -21 237 -52 38 -110 -29 -96 17 220 33 -7 -24 228
4806 228 16 -59 -2 80 143 15 -102 -121 -289 7 -113 -233 100 161 242 200 -188 57 -123 27 5 11 -112 117
4830 117 -189 -70 209 -11 171 121 164 -179 -67 -165 -139 -282 116 -71 -202 -49 -102 68 -425 4 -144 216
4852 216 129 -166 89 -59 65 126 79 71 152 -32 -191 -59 176 64 179 98 -90 98 -56 8 142 164 295
4875 295 -8 52 -33 -36 161 -26 147 -285 19 -27 -274 -190 66 31 -55 1 -289 -113 -203 -32 -8 145 -68 -178
$$ packed form
4713c8L2J63j97k16L97l39J06K4KJ21p4J28j84QP4K25k05R7j3j92j10P3Q2l7k96
4738c69L93j44K99n11L94j34J65M1j97J28P9l03K24j84J50M9k88M76j38j44j75
4759a89J35j49L48k31j96J49P4O0r6J85jJ20O6k68k07M0K98k06j98J57R8n3mJ20
4783E2Q0l27R8J7J09k68L02j01j27K22p8K58k89R0j48Q1o7J13K03j87m0j7K52
4806B28k12p5N7Q2O3j28j17j9j68K96j20j20L33O1Q1m2l88K45j80J50k2Oj23K29
4830A17l06J19K79k20J82n0M3l43J12r8K6j43L98j87j31J53n3J70m93M29j48L60
4852B16q7k95K55j48J24O1m7qQ1j84j59J32K35j12J15q1j88J88j54O4J34K2J31
4875B95l03O0q5lJ97j87J73m32L04m6k47Q4K56l5q6N6k90J76r0J71K4J53k13j10
$$ plain form
4899 -178 63 -11 -119 -167 118 213 59 -36 -24 1 -18 -43 146 81 -30 -107 -70 57 191 -144 262 -135 -103 -69
4923 -69 81 7 67 301 -24 287 86 -9 -154 -257 -68 121 129 297 -42 8 -43 -75 24 11 -100 -86 260 200
4947 200 -144 29 82 -165 87 -163 -50 138 29 141 20 -70 -69 155 70 9 214 -11 91 -23 6 -158
4969 -158 17 -96 -39 140 -127 -20 159 -69 -3 -81 -65 72 167 -295 214 66 -2 37 132 134 -81 -26 217 188
4993 188 -250 -71 209 214 106 -41 -186 178 -337 87 -104 231 103 22 -11 105 -308 -57 -241 63 139 159
5015 159 311 -59 -111 -3 91 -126 -19 170 99 -174 -104 123 -63 -69 -3 -208 -45 77 -42 200 -4 86 44
5038 44 127 -43 -9 49 -279 -234 -98 -31 -14 178 -31 270 123 40 124 241 160 17 -13 17 -116 -17 185 77
5062 77 79 -4 -169 60 -51 187 -2 75 -228 -100 -83 -11 -92 -149 -31 -114 87 -137 -132 -182 78 -231 211 108
$$ packed form
4899a78K41p4j08m8K85R5j54r5J2K5j9k5J89o5j11p7L7J27J34l35M06l97L2L4
4923f9J50p4O0K34l25L11k01r5j45j03J89J89QJ68l39N0n1l2R9j3j11J4L46o0
4947B00l44J73N3k47K52k50J13J88j09J12j21r0JK24q5o1K05k25J02j14K9j64
4969a58J75j13N7J79k67J07J79k28O6p8J6J37R5m62N09j48o8L9R5Kk15N5K43k9
4993A88m38J79K80Nj08j47j45L64n15M24j91L35j28q1l3J16m13K51j84L04P6K0
5015A59J52l70n2J08R4k17J07J89p1k73P0K27j86oO6k05J63J22j19K42k04R0m2
5038D4Q3j70L4N8l28M5J36O7J7J92k09L01j47q3Q4J17q1j43l0L0j33R9K02j08
5062G7Kq3j65K29j11K38j89P7l03J28J7P2q1n7J18q3K01k24Nn0K60l09M42j03
$$ plain form
5086 108 -87 -26 228 50 -179 165 -35 -294 -71 0 -26 -4 105 -234 95 -88 -107 -54 -132 14 122 85 454
5109 454 44 -214 -155 -285 -44 -78 35 272 -36 107 23 -34 28 -184 47 -86 -75 -75 37 -9 19 255 -312
5132 -312 140 85 -138 -128 281 5 -130 -239 -245 165 -143 -38 -37 -23 -194 -150 212 -181 194 101 -320 -107 -52
5155 -52 159 -16 132 -116 87 -119 -163 162 -27 15 136 -197 -199 -121 54 -16 10 -313 -92 -60 -117 -49 51 344
5179 344 70 -34 19 -16 58 -14 73 26 43 243 0 179 -89 -217 -113 20 -58 -37 263 -173 -50 -106 -247
5202 -247 104 -19 63 -26 -63 -35 -146 150 -69 -279 222 -322 56 -17 -177 42 -55 103 -14 -296 -71 -149
5224 -149 -113 -200 -156 -123 12 178 131 -47 -32 -63 49 -89 -9 -168 -177 58 76 -122 27 212 -2 117 -7 -119
5248 -119 -125 -14 227 -63 277 -104 -54 44 -153 129 213 -69 81 216 -263 161 -60 -9 58 -155 145 22
$$ packed form
5086A08j95O1K54j78k29L44k00k59K23P1k6K2J09l39L29j83j9N3p8J46J08l7L69
5109D54m10k58N9j30K41l4J13K37l08J43q4n7O2k12K31j33J1%J12m6K8K36n67
5132c12M52n5k23J0M09k76j35j09oM10l08J05JJ4j71M4L62l93L75r3m21K13N5
5155e2K11j75J48k48K03k06m4L25j89M2J21l33kP8J75p0K6l23K21L2n7O8J00K93
5179C44k74j04N3l5P4p2Q7m7J7K00k43J79k68j28J04J33p8K1L00m36J23n6j41
5202b47L51j23Q2q9l7K8j11K96k19k10N01n44L78p3j60K19r7J58j17k82K25p8
5224a49L6q7M4L3J35J66m7j78J5l1J12j38Q0j59rK35J8j98J49J85k14J19j24j12
5248a19oJ11K41k90L40l81N0R8j97K82Q4k82J50J35m79M24k21N1O7k13L00j23
$$ plain form
5270 22 90 -63 116 63 -181 38 -51 -251 146 163 167 -53 112 -46 155 154 5 235 -110 168 91 -12 -13 -156
5294 -156 -43 -66 -281 -56 -25 -4 -155 -327 48 -125 16 -362 -20 67 -156 153 -130 -127 38 -139 -173 -277
5316 -277 -96 37 -86 -92 -63 7 36 180 -79 -19 235 261 -132 128 193 -95 -5 -52 52 177 -250 -140 35
5339 35 193 35 83 46 165 17 -70 -68 -42 64 -74 -192 -121 291 126 -113 216 16 -105 -244 92 -87 16
5362 16 39 -89 -29 130 113 -138 -183 -79 58 56 30 -34 30 -15 63 -66 243 -327 -190 123 115 100 248 -101 -1
5387 -1 77 113 -191 -140 -49 100 118 253 -20 111 -66 -120 -201 -34 -75 168 59 -57 71 7 93 -105 240 105
5411 105 171 -1 -5 39 264 -151 340 46 56 120 31 196 -21 197 -88 -95 96 -350 65 -79 16 341 9
5434 9 -27 126 109 26 -71 4 -105 129 142 -225 -36 20 -179 150 -246 -253 -4 -129 128 -71 37 -357 134 -100
$$ packed form
5270B2O8j53J79n3k44K19q9k00L97J7Mk20J65j58K01jj49K30l45K78p7j03jj43
5294a56J13k3k15K25L1K1j51j72L75j73J41l78L42Q7k23L09k83LJ65j77l4j04
5316b77J81J33j23oK9P0K9J44k59O0K54K6l93K60O5k88R0m7J04J25m27J10J75
5339C5J58j58M8l7J19j48q7KK6J06j38j18P1M12j65k39L29k00j21j39L36j79J03
5362A6K3j28O0J59j7k51m5J04J37kk6o4O4m5P8j29L09n70J37L13qj5J48l49J00
5387aP8L6l04N1R1J49J8J35k73J31j77n4q1J67m1K43j09j16J28o4Q6j98L45j35
5411A05O6j72mM4K25m15M91k94J0O4q9J65k17K18k85pJ91m46M15j44R5L25l32
5434Il6J53j7q3r7P5j09K34J3l67J89N6j99L29l96pK49j25K57j99J08l94M91k34
$$ plain form
5458 -100 -34 85 -234 143 -63 98 109 -122 47 -34 85 -107 -2 -92 137 23 -1 -150 -51 31 -30 -21 -59 -47
5482 -47 -96 37 76 -85 -194 -274 1 164 -181 102 -68 214 -131 -91 148 -69 2 23 -119 -179 52 -151 -90
5505 -90 61 -167 73 26 -23 2 63 124 -46 -95 -301 -297 -65 37 330 -97 -268 -234 -107 -5 -93 -198 -89 106
5529 106 -154 218 -45 146 79 34 -128 -116 -57 -198 18 170 86 67 -113 -237 31 70 53 187 -204 320 38
5552 38 46 -162 -82 -68 -29 -61 -97 236 -108 -141 -351 -49 -203 206 98 27 75 -22 76 -58 39 -141 -158 -69 -85 -142
5578 -142 -19 14 -221 -234 71 -11 -125 49 -15 -107 130 -108 -145 45 -315 145 63 -56 -152 -3 82 -38 234
5601 234 243 94 80 -256 52 317 -23 73 11 21 -116 -209 68 -56 -50 11 51 150 41 -81 -76 -338 -71 -20 -280
5626 -280 242 -168 165 71 102 -19 -207 271 -161 207 -130 80 84 -15 114 -16 39 198 107 -115 -109 -113 -250 228
$$ packed form
5458a00O6J19l19L77k06J61J1k31J69q1J19j92J05r0K29j14k4j49R9Q2o1Rl8J2
5482d7m9J33L9j61j09q0K75J63l45K83j70K82l45M0K39k17P1K1j42o0K31k03O1
5505i0J51k28K40m7m9K5O1O1j70m9k06MK32J02K93m27j71L4J27J02q8j05J09J95
5529A06k60L72k63J91o7m5j62J2N9j41K16J52q4j9j80j24K68L9j7J34l91N24k82
5552C8Qk08Q0J4L9l2l6L33l44l3k10L02j54M09j08p1M8r7R8j34R7j80j7Q9j6n7
5578a42J23L3k35j3L05q2j14J74o4r2K37k38l7J90l60M60q2j19r6J49Q5j20K72
5601B34Rj49j4l36L08K65l40R6o2J0j37r3K77j24OO1M0R9j09j22Nk62K67N1k60
5626b80N22m10L33r4L1j21j88M78m32L68l37K10Mr9J29j30N5J59r1k22Omj37M78
$$ plain form
5650 228 32 -26 31 202 -16 -90 246 -134 88 8 153 233 95 181 258 153 -133 157 0 350 -137 -82 -83
5673 -83 -267 336 22 -104 51 210 133 256 304 85 -131 -87 20 -134 81 91 10 -120 -92 99 127 -234 90
5696 90 -90 -182 257 -46 47 -202 -14 119 246 -137 217 346 159 41 -61 78 -236 73 19 83 122 166
5718 166 -132 -96 -3 -61 -179 -130 -187 -143 -277 229 -14 115 -50 -76 -33 79 25 -121 72 73 -279 61 58 -47
5742 -47 -244 -214 -220 -262 24 -37 222 107 146 -107 -108 -22 -88 -23 -217 155 -106 -108 100 -20 240 63 85 197 123
5767 123 -56 72 55 18 -29 -88 312 -47 15 -140 -34 -41 141 -247 170 -23 -145 80 -184 -5 -144 53
5789 53 20 261 15 -123 6 83 -65 -249 -124 -109 -80 267 -21 58 105 -255 1 104 134 130 6 41 -155 -231
5813 -231 -80 -125 -155 130 -243 -69 -59 189 -157 -150 -146 -79 286 7 -36 -189 -29 114 -34 -127 -49 266 17 125
$$ packed form
5650B28j96n8N7J71k18p4L36l80K22q0J45Q0j38Q6P7j05k86K90j57L50m87N5j
5673h3j84O03l14j26J55J59p7J23M8k19k16M4J07j54K15J0q1j30K8J91K8l61L24
5696I0j80r2M39l03R3k49J88J33J27l83L54J29j87j18j02J39l14L09n4O4L9M4
5718A66k98L6R3n8j18M9n7M4j34N06k43J29j65k6M3J12n4j46J93Jl52L40lj05
5742d7j97L0om2K86o1K59j15L9k53jQ6o6O5j94L72k61kK08j20K60j77K2J12p4
5767A23j79J28j7l7m7n9M00l59O2j55J06pJ82l88M17j93j22K25k64J79j39J97
5789E3l3K41k46j38J29P7j48j84J25J5K9L47k88P9M7l60K56J03L0mj24L5j96p6
5813b31J51m5l0K85l73J74J0K48l46PMO7L65k79m3j53J60J43j48r3P8L15k49J08
$$ plain form
5837 125 -190 -65 152 -250 -115 -143 13 -75 69 -199 189 -44 81 -128 -1 35 -150 -62 -107 -189 -218 14
5859 14 72 -91 152 -71 -125 168 -44 75 143 -116 69 149 39 -65 -100 -65 -336 105 -71 3 3 -19 -9 57
5883 57 -196 -236 154 -13 295 -91 -131 172 29 82 -32 134 -59 -241 18 -121 -71 -51 25 79 -163 -146 179
5906 179 86 133 -212 8 -82 154 20 42 95 25 -50 -46 -47 -10 36 -376 47 -36 84 21 -176 140 148 57 36 -157
5932 -157 -196 196 102 -83 129 -17 126 -85 64 1 13 -15 34 187 219 207 -96 222 130 203 40 -23 3 -270
5956 -270 454 -98 -37 -209 82 -114 40 -46 -168 -141 13 110 -180 0 115 74 123 60 -184 130 31 304 -46
5979 -46 29 37 -113 202 140 8 -11 -189 116 -84 -89 -5 -32 18 -316 -14 -135 248 6 61 229 114 183 -108
6003 -108 -47 -147 4 -112 -32 -114 -80 25 -116 210 -11 35 -94 27 302 -197 3 43 -245 -177 93 -44
$$ packed form
5837A25l15J25K17m02J35k8J56q8J44k68L88k33J25k09J27L6j85Q8m5q2k9K32
5859A4N8j63K43k23n4K93k12J19O8k59J85Q0j10j04l5L5k71M41j76P4%k2J0O6
5883E7k53m0L90j67L08l86m0L03j43N3j14J66j93j82K59j39N0K0P6N4k42J7L25
5906A79r3M7l45K20r0K36j34K2N3p0p5MjL7M6m12M23q3J20o3j97L16Qr1k1j93
5932a57l9L92r4j85K12j46J43k11J49o3J2k8M9J53L2j2l03L18r2P3j63o3K6k73
5956b70P24n52O1j72K91j96J54q6j22K7J54R7k90J80J15m1M9o3k44L14r9K73l50
5979d6P5Qj50L15o2j32j9j78L05k00nQ4k7N0l34L02j21L83k42N5J68j15O9k91
6003a08O1j00J51j16Q0q2L4J05j41L26k21M6j29J21K75m99K00M0k88O8K70j37
$$ plain form
6025 -44 153 55 98 -115 -79 0 182 51 51 -243 -11 -45 -222 60 27 -112 -60 -92 -127 -51 172 433 -177 -125 -12
6050 -12 -143 -126 19 148 -163 -180 313 -42 133 -72 -79 -57 -93 29 18 183 -182 -60 -9 136 -270 151 237
6073 237 62 -38 -238 15 -254 85 91 252 74 -179 -18 -93 -59 195 -212 -45 -63 -28 -62 84 -270 -29
6095 -29 -107 268 -3 245 56 3 -154 -278 -144 -179 -34 4 207 -253 -15 128 -64 -169 285 -11 257 18
6117 18 135 -120 -8 -52 -4 18 -134 53 -230 51 94 -155 129 205 157 -108 11 23 132 129 175 -60 62 -313
6141 -313 -36 182 -25 233 102 205 184 -94 -77 80 -150 -323 -15 103 206 46 26 118 39 26 9 12 -28
6164 -28 -115 -101 -39 -189 -18 126 61 -242 41 -109 174 -218 202 -149 63 156 -194 -339 -3 13 15 -1 116
6187 116 38 43 -132 18 193 93 -185 215 298 -130 35 -118 -155 -106 185 14 -141 -137 -162 106 -25 148 16
$$ packed form
6025d4J97r8M3k13L6P9J82j31%k94K32l4j77K82l3j39N2l2l5P6K23K61o10N2J13
6050a2j31J7J45J29l11j7M93l55J75k05pK2l6J22j1J65l65J22N1J45m06M21Q6
6073B37j75j00k00K53k69L39OJ61j78k53J61p5L4K54m07J67j8L5l4J46l54K41
6095b9p8L75k71K48j89n3j57j24J34l5J45L8K03m60K38J43j92j05M54k96K68k39
6117A8J17k55J12m4M8K2j52J87k83K81M3k49K84P6m8k65J19J2J09lM6k35J22l75
6141c13K77K18k07K58j31J03k1k78J7J57k30j73L08J18J03j60k0R2p9j3j7Lm0
6164b8q7J4O2j50J71J44o5l03K83j50K83l92M20l51K12R3l50j45L36J6Kj6J17
6187A16p8Nj75J50J75j00k78M00Q3m28J65j53l7M9K91j71j55Mk5K68j31J73j32
$$ plain form
6210 16 -172 84 -65 219 -248 -130 21 -216 168 -229 -109 83 -147 57 -70 119 325 -182 7 114
6230 114 141 -207 -143 -191 -41 238 -144 -317 -128 -31 -215 31 -6 22 -10 -80 -18 218 32 -119 -155 -175 282 -83
6254 -83 -47 2 147 -114 -168 73 -66 40 -40 -41 -21 179 -6 32 -88 45 175 91 42 -52 -27 -233 85 -54
6278 -54 -25 30 -45 0 -382 277 -19 245 313 -53 22 40 232 49 -284 -84 -173 -80 193 -106 89 -78 73
6301 73 -58 -132 111 -29 157 177 -206 -174 42 18 -406 -225 27 186 -265 -152 -223 -49 -232 18 256 -113
6323 -113 -129 31 16 67 117 90 35 -293 11 -135 -205 -75 -10 241 8 91 -155 -60 -302 -119 4 41 -132 -62
6347 -62 218 81 67 -89 49 232 275 -27 -192 -269 43 147 -31 1 156 43 -242 33 93 -18 71 -157
6369 -157 -224 116 64 -51 158 -45 51 -15 -55 371 29 70 51 -218 15 90 -191 -33 168 40 -13 -124 14
$$ packed form
6210A6j88K56j49K84m67J18J51k37L84l97J20J92k30K04j27J89K06n07J89J07
6230A14K7l48O4m8J50K79l82j73J89R7j84K46l7K8l2p0O2K36j86j51l6k0M57l65
6254h3L6M9J45k61n4K41j39J06q0jK0K00j85L8j20J33J30q4m9r4K5k06L18j39
6278e4K9N5p5M5l82O59k96K64O8l66P5J8J92j83l33K00q9R3K73k99J95j67J51
6301G3j31p4K43j40J86K0l83L2K16k4m24J81K52J59m51J13p1J74j83K50K38l69
6323a13j6J60j5N1N0k7n5l28L04j46p0J30O5K51k33Q3k46R5k42J83J23L7j73P0
6347f2K80j37j4j56J38J83M3l02j65p7L12J04j78L2J55j13k85K75O0j11Q9k28
6369a57o7L40n2j15K09k03R6o6m0M26l42M1j9k69K33P5k81J58K01j28n3j11J38
$$ plain form
6392 14 422 36 -32 -120 -224 140 137 66 -14 45 -6 -135 -85 -159 82 12 114 13 33 4 -15 -32 50 -177 86 -65
6418 -65 -61 377 -82 -172 78 -29 2 163 -76 27 -303 -222 71 -102 -193 -22 -36 111 -108 -46 146 176 8
6441 8 -53 -199 -70 -2 142 -47 251 -28 -21 -28 55 -40 219 -204 213 -324 -332 -59 -147 -136 -34 -132 213 216 87 -21
6467 -21 63 164 -64 -206 2 313 88 -48 -166 -49 7 48 149 -196 -52 20 206 -121 84 260 -96 -37
6489 -37 -60 87 370 -11 -35 7 186 86 -18 139 -98 135 -287 -165 -65 8 221 134 -89 257 162 -118
6511 -118 52 -78 81 -10 -406 -10 35 161 -57 -95 189 -58 -34 -19 -54 -166 185 108 -246 32 36 -163 152
6534 152 -350 -2 22 -94 243 -4 55 12 211 -31 16 -49 212 100 -121 -24 -201 30 20 -15 -19 118 22 -57
6558 -57 -56 56 -88 -12 -62 -41 211 6 10 -153 182 25 52 -110 108 -271 -149 -32 55 104 55 -74 -66 159 10
$$ packed form
6392A4M08l86o8q8j04L64lp1q0N9n1j29N0p4K41p0J02j01K0k9j9j7Q2k27K63j51
6418f5MM38m59r0K50j07L1J61k39J03l30Q1K93j73r1J71j4J47k19O2J92L0j68
6441Ho1j46J29O8J44j89K98k79PpQ3r5K59m23M17n37qK73q8J1J02r8L45Lj29j08
6467b1Q4J01k28j42K08L11k25j36j18J17N6M1J01l45J44P2J86l27K05J76l56N9
6489c7k3J47K83l81k4M2J79j00j04J57k37K33m22J22J00P3K13q7k23L46r5k80
6511a18J70j30J59r1l96L96M5J26k18l8K84k47K4J5l5j12L51p7l54K78Mj99L15
6534A52n02L48K4j16L37k47N9m3J99k42M7o5K61j12k21R7j77K31j0l5mJ37r6p9
6558e7JJ12j44P6n0K1K52k05Mj63L35j57K7j62K18l79J22J17Q7M9m9j29QK25j49
$$ plain form
6583 10 0 175 79 -26 13 -51 46 229 121 125 -129 -167 144 301 -139 -264 84 143 128 -116 -58 89 -90 -332
6607 -332 54 -187 117 124 85 58 -22 59 79 -79 245 -112 168 -18 169 224 -145 223 -75 39 125 69 6 -205
6631 -205 -21 -182 -38 -223 80 103 -92 -26 -60 2 -66 -51 -85 128 -242 -143 -39 -297 -101 -138 -27 -46 350
6654 350 15 -70 -211 -53 248 -74 60 46 52 106 74 -61 -61 223 95 -101 -63 37 42 116 139 37 -67 -78 -142
6679 -142 -245 -14 42 -174 23 31 -122 71 -18 -148 -32 -128 12 -172 -129 -140 37 -183 150 -333 -12 -268
6701 -268 47 143 86 -94 201 -90 6 139 -164 -4 -40 173 260 -291 -305 -28 -40 115 81 167 -199 -233 123
6724 123 -174 210 57 31 33 -9 323 -122 -140 107 6 -153 204 119 -164 115 155 -44 -115 -104 -28 -249 110
6747 110 5 165 -219 33 56 147 -21 19 -207 -91 76 -277 83 234 -209 -328 -225 87 -79 64 -9
$$ packed form
6583A0j0J75r6j05L9o4R7J83j08Mk54l8L11J57m40j25L48N9j5k44N8J47j79k42
6607c32L86k41L04Pl9k7q0Q1K0j58L24l57K80j86J87N5l69L68k98J14Q6n6o3k11
6631b05J84j61J44j85L03K3j95O6l4O2o8J5l4K13l70R9J04k58J96l7J11j9L96
6654C50l35q5j41J58L01l22J34j4ON4l2j35%K84j28j96L8J00NP4K3j02j04j1o4
6679a42j03K31N6k16J97Qj53J93q9j30J16r6J40j84M3j1J77k20L33m83L21k56
6701b68L15R6n7j80K95k91R6J33l03J60l6K13Q7n51j4K77j2J55l4Q6l66l4L56
6724A23k97L84j53k6Km2L32m45j8K47j01j59L57q5k83K79M0j99p1J1P6k21L59
6747A10j05J60l84K52K3R1j68M0k26J16J67l53L60J51m43j19J03L12j66J43p3
$$ plain form
6768 -9 -75 -133 -80 -70 52 145 -222 56 15 14 168 174 2 -97 -52 220 228 -203 65 -131 -187 121 -50 -24 -23 2 150
6795 150 -226 102 -219 -13 169 -26 164 -67 -254 -78 -45 -85 -92 -84 50 75 96 -362 -109 76 -148 -185 5
6818 5 -47 88 199 129 -226 26 -217 -169 9 86 -222 70 -223 -103 263 121 -53 -88 -359 39 -264 -184 50
6841 50 297 -259 112 -53 -156 108 -281 -8 -81 -66 154 18 28 -111 108 137 -7 -78 -41 -125 118 -129 23
6864 23 -238 45 106 -291 -59 -206 54 218 15 -59 -45 -189 -82 135 5 -35 80 26 16 63 177 89 -117
6887 -117 295 -277 118 39 -33 -10 129 74 -1 119 85 -12 133 -44 122 62 -3 64 -65 -182 -73 80 -5 187
6911 187 11 58 -25 -49 197 105 -3 -42 -116 159 -127 78 22 42 125 37 -56 -87 -230 112 -9 -58 -90 -131 -134 -204
6937 -204 2 -44 90 -74 11 134 -131 7 127 91 131 170 122 122 339 168 -96 22 32 -62 94 -23 -38 67
$$ packed form
6768io6n8N3J0J22R3l67K78m1jJ54Oj72r9M5K72Qm31K68j96n6L08j71K6JK5J48
6795A50l76L28l21K06J82j95J90k31j87J76L3m0pQJ34K5K1m58K53J85k24l7J90
6818En2J35J11p0l55K52k43M8J78P7l08K92k93J20L66j42j74l5k71L98l03Q0K34
6841E0K47n56L71j65j03K64l89K73p3J5K20j36J0j39K19K9j44p1L7q4K43k47J52
6864B3k61K83O1l97K32j47K60J64k03p4J4j44J07K17j30m0J15n4j0M7J14q8k06
6887a17M12n72L95p9p2K3J39n5p5J20l4r7J45j77J66o0o5O7j29j17J09J53q5J92
6911A87j76M7q3k4K46r2j08l9p4K75k86K05n6K0Q3q8r3l1j43L42j21m9l2m1lp0
6937b04K06m6J34j64Q5J23k65J38J20l6M0L9m8%K17j71k64J18J0r4J56j17j5J05
$$ plain form
6961 67 -132 138 76 82 89 -294 -30 -104 -104 87 60 -15 99 -156 -410 364 79 -91 123 -19 82 -176 111 -192
6985 -192 -72 8 -188 -11 -61 40 66 -99 -61 36 -152 -140 -98 -209 -328 269 69 187 159 -97 71 -156 -51
7008 -51 286 59 78 -194 173 -23 -37 95 149 -11 46 323 27 -109 -9 -180 1 -185 37 -117 -136 -44
7030 -44 -93 131 129 19 -120 12 225 53 -161 171 -35 -205 -54 -125 -205 -10 65 125 7 -58 -235 -150 -137 114
7054 114 70 -107 60 -156 -20 118 139 -36 -97 -58 240 63 -151 103 166 -176 -85 -133 60 -85 -97 197 135
7077 135 -242 49 24 -37 27 14 -13 221 -26 31 -113 31 10 -114 -94 -146 185 45 184 -183 -12 -238 98
7100 98 -26 91 -111 320 -30 4 88 -78 101 6 -7 -190 -81 -90 -133 13 -145 150 141 13 -67 125 8 75
7124 75 241 -34 7 -67 212 -7 -139 45 57 -114 89 137 71 -157 -18 -39 -390 53 -14 74 184 -157 -23
$$ packed form
6961F7j99K70o2OPl83K64p4%J91k7p5J14k55k54P74k85j70K14j42J01k58K87l03
6985a92J20Q0j96J77n0J01K6j65L8R7j88J2M2j11j19N97k00J18k8k56J68k27J05
7008e1L37k27J9k72L67j96j4J32N4j60N7K77k96j36J00j71J81j86K22j54j9R2
7030d4m9K24kj10j39J32K13j72k14L32k06j70J51p1q0J95P5O0j18o5j77Q5J3K51
7054A14m4j77J67k16J36J38K1j75o1L9K98j77k14K54O3l42R1m8J93j45j2K94o2
7077A35l77K91k5o1O4j3k7K34k47N7j44J44k1j24K0n2L31j40J39l67J71k26L36
7100I8j24J17k02M31l50L4Q4j66J79r5j3j83J09rm3J46j58K95rj28q0J92j17O7
7124G5J66k75M1p4K79k19j32J84J2j71K03M8o6k28J39k1l51M43o7Q8J10l41J34
$$ plain form
7147 -23 -184 -55 -228 281 -116 -2 94 -33 -269 -37 -79 84 59 -201 1 -93 -37 217 -232 -25 128 -45
7169 -45 -90 -199 -34 -92 11 -164 -147 -23 109 -181 107 -102 167 -172 48 -23 -114 -94 -253 -65 -37 57 151
7192 151 51 175 -34 -301 -169 -85 80 -132 -27 -78 -41 222 -104 52 -130 -11 30 185 -29 -166 -101 -62
7214 -62 -9 -9 -229 -92 -18 -20 5 282 -37 127 -2 -128 216 -77 398 72 308 110 -1 65 -56 -129 -2
7237 -2 197 125 22 -226 -173 365 207 55 200 60 -58 166 22 230 58 152 198 107 -7 130 49 46 -132
7260 -132 93 -48 -126 -182 -236 139 -96 69 -13 4 -222 46 65 17 8 -41 -203 -63 57 -12 104 -247 265 -290
7284 -290 265 -40 42 105 20 102 -264 91 83 155 -144 134 -165 18 0 181 -115 -64 74 -153 107 197 133 -146
7308 -146 56 97 117 71 -189 -42 -216 -73 -68 -55 89 67 -204 -29 167 -34 148 52 -173 -15 69 214 189
$$ packed form
7147b3j61J29j73N09l97J14R6j27k36K32m2J63k5k60K02r4N6K54m49K07J53j73
7169d5m5j09J65n8J03j75J7J24J32k90K88k09K69l39K20p1r1K0j59J88K8R4R4
7192A51j00J24k09k67J32Q4J65k12J05n1L7K63l26J56j82J19M1J55k14j37O5L9
7214f2N3%k20J37P4kK5K77l19J64j29j26L44k93M75l26K36j98j11O6j21p3J27
7237bJ99p2j03k48N3N38j58j52J45j40j18K24j44K08j72R4M6r1j14J37q1lj78
7260a32K25j41p8n6n4L75k35J65q2J7k26K68J9m8rm9j62J40J20o9J16l51N12n55
7284b90N55l05Q2O3q5Q2l66L55qP2k99K78k99J83j8J81k96N1J38k27K60R0o4k79
7308a46K02M1K0m6k60J47j74J43NJ3J44k2k71J75J96k01J82r6k25J58Q4J45k5
$$ plain form
7331 189 -241 -25 130 -218 -54 144 78 108 47 285 -52 22 -129 -6 -41 -226 261 -152 20 83 208 106
7353 106 13 190 -17 -137 35 110 188 115 75 -323 -125 323 -122 -114 -19 135 79 -12 -169 -14 64 -39 1 -381
7377 -381 -120 62 -237 62 -147 -105 12 -241 -149 -52 71 -171 90 4 -63 -3 138 -5 111 -252 -169 -109 39
7400 39 -33 -191 59 -8 83 135 -22 33 -68 -155 -98 3 111 -52 -25 17 -4 -56 -442 -15 130 94 125 105 -58
7425 -58 16 2 5 308 187 -3 -42 398 -178 104 -64 137 95 -272 30 -49 -148 90 -11 16 265 -124 -3
7448 -3 -57 -48 -33 71 -27 -82 60 57 110 -80 -152 -184 -56 -50 -56 102 213 -49 154 -258 75 302 192 86 118 216
7474 216 -19 23 -233 -43 -68 109 -13 -229 236 -35 -319 41 237 8 -37 43 336 -11 22 -29 -171 -232
7496 -232 83 338 35 191 106 11 -56 -128 -244 72 158 82 409 -103 -191 100 1 53 -82 18 149 49 32
$$ packed form
7331A89m30K16J55l48J64J98o6L0o1K38l37P4j51J23l5j85M87m13J72O3J25j02
7353A06r3J77k07j20J72P5P8p3m0l98J98M48m45QR5J54n6r1j57J55P8j03M0l82
7377c81K61J82k99K99k09M2J17k53R2R7J23k42K61q6o7O0J41j43J16l63Q3O0J48
7400C9p2j58K50o7R1N2j57N5j01q7N7J01J08j63K7M2k1n2l86M27J45l6L1k0j63
7425e8P4j4LL03j21j90l9M40n76K82j68K01m2l67L02p9r9K38j01K7K49l89J21
7448cn4RJ5J04r8n5J42lN3j90p2l2J28OoJ58J11k62K03m12L33K27j10j06L2R8
7474B16k35M2k56J90k5J77j22k16M65k71k84L60J96k29m5Q0K93l47L3n1j42o1
7496b32L15K55l03J56q5r5o7p2j16L16Q6p6L27n12q8K91r9N2j35J00J31j00j7
$$ plain form
7519 32 295 -50 -51 -10 -123 1 43 111 -2 -65 61 49 -113 -30 113 -13 -99 46 -143 35 -238 -8 96
7542 96 -197 73 8 -109 116 -229 -59 -314 -260 -24 -104 55 34 -194 104 112 -19 54 3 -106 -58 51 -278
7565 -278 -143 -150 -14 204 -122 -198 -116 -110 21 102 105 43 -50 -101 -200 60 33 -183 -120 -45 -148 -83 -132 -20 -246 45
7591 45 305 57 96 -151 85 -128 -16 -91 -142 128 95 -66 -9 -133 92 189 -13 123 -134 -294 70 248
7613 248 -175 -134 178 211 -170 49 -102 -182 82 -8 164 190 112 7 -180 95 1 425 228 -103 -120 -73 135
7636 135 -136 9 -133 62 17 -66 44 -141 -282 183 69 54 -60 -24 170 -41 65 -101 157 99 74 -6
7658 -6 106 -40 -211 28 -133 166 -165 -108 100 12 0 -55 -112 42 -27 -202 131 -106 121 153 -99 -61 -73 132
7682 132 -10 -59 129 -6 -232 -6 209 89 207 197 131 -20 -316 -23 92 -65 -67 6 -80 150 127 29 119
$$ packed form
7519C2K63l45jM1j13J24M2O8j13o3J26j2j62Q3J43j26q6J45j89J78k73K30J04
7542I6k93K70o5j17K25l45J70k55N4K36q0J59k1k28K98Qj31P3n1j09M8J09l29
7565b78J35pJ36K18l26p6Q2OJ31Q1Lo2r3n1r9K60k7k16O3P5j03O5m9J12k26K91
7591D5K60k48L9k47K36k13J12p5n1K70l3j61N7j24K25R7k02J36k57j60L64J78
7613B48m23M1L12L3l81K19j51q0K64r0J72K6p8j05j87K75r4M24j97l31j7M7K08
7636A35k71J45j42J95m5q3J10j85j41M65j14j5j14L6J94k11J06j66K58n8k5q0
7658fJ12j46j71K39j61K99l31N7K08q8j2n5n7J54o9j75L33k37K27L2k52L8j2K05
7682A32j42m9J88j35k26K26K15j20J18j0o6j51k96K93J15j57kP3q6K30k3r8R0
$$ plain form
7705 119 -261 144 -86 123 -59 40 -2 73 -224 238 102 116 -70 -108 -172 -52 -156 115 -128 -30 96 -67
7727 -67 -37 -229 -127 169 -16 135 239 -153 57 -74 86 -40 -11 -152 -38 -45 -72 72 -10 266 -114 81
7749 81 -39 -74 234 221 -44 88 -119 -57 -119 -64 269 -26 -62 -281 51 79 -4 -78 58 -43 64 113 -266 -237
7773 -237 -17 8 166 -29 -15 -158 -5 4 -169 -167 213 -236 117 129 197 30 -20 26 -331 18 -95 36 -289
7796 -289 -68 371 106 65 -114 -34 -65 -128 51 -241 180 89 114 -31 15 -259 -85 4 58 -179 68 74 101 162
7820 162 109 -38 -177 -11 -202 -57 -245 22 126 52 33 -108 -71 -231 276 -111 -49 21 -187 21 -111 109
7842 109 206 63 91 163 150 -85 -36 68 195 224 -246 -9 -80 -195 270 -67 104 54 -151 92 67 12 -180
7865 -180 -98 -49 -47 10 159 -107 -371 179 36 227 -125 -56 47 -9 -28 114 75 -59 154 48 -106 168 45
$$ packed form
7705A19l80M05k30K09j82R9m2P5k97M62j36J4j86l8o4J20j04K71k43R8J26j63
7727f7L0j92J02K96j85J51J04l92K10j31J60j26K9j41J14pk7J44q2K76l80J95
7749H1j20l5L08j3k65J32k07O2o2N5L33k95l6k19L32K8q3p4J36j01J07M9l79K9
7773b37K20K5J58j95J4j43J53Rj73KL80m49L53J2O8j67n0M6l57L49j13J31l25
7796b89K21M39k65m1j79Q0l1o3J79k92M21r1K5j45M6k74J74Q9N4k37K47OK7O1
7820A62n3j47j39J66j91J45j88K67J04p4j9j41L7j60N07l87O2P0k08K08j32K20
7842A09R7j43K8P2j3k35M9J04J27K9m70K37p1j15M65l37J71n0k05K43k5n5j92
7865a80Q2M9KN7J49k66k64N50j43J91l52O9J03n6j9J42l9j34K13j06j54K74j23
$$ plain form
7888 45 -90 50 29 -62 19 34 -235 -133 173 123 135 -26 79 204 127 -16 -51 -72 -20 133 -190 140 39 94
7912 94 62 -275 -101 177 122 121 281 -318 276 107 175 -280 59 220 116 37 127 -26 135 46 -139 -107 -275
7935 -275 -172 -69 -199 182 -3 -162 203 26 -78 -40 -182 -44 122 65 124 -144 -109 -97 38 -74 -110 159
7957 159 -37 97 130 49 2 205 238 12 115 -247 100 104 245 -142 -74 87 -86 109 -50 27 -126 191 -16
7980 -16 112 41 7 -30 20 -63 -77 -22 2 82 -39 -268 218 16 -112 89 -249 -234 141 -83 131 -35 127 31
8004 31 -20 -118 310 -10 -13 -172 8 -14 11 351 -8 -217 -96 -51 112 -170 -89 62 -174 161 28 11 35 158
8028 158 60 79 207 65 -213 95 253 12 -200 -143 -8 153 75 -118 -8 85 -107 -91 0 -153 0 230
8050 230 310 -163 1 111 122 -211 230 -181 -173 120 -165 -4 -105 -117 -17 29 -40 72 -52 -1 17 -225 -5
$$ packed form
7888D5j35J40k1r1Q1J5k69J02L06n0J2j61J05J25p7j43l5k1N2J53l23L30j01N5
7912I4l2l37J74K78n5jJ60n99N94j69O8m55L39J61j04p9R0j53J61q9j85L2j68
7935b75J03J03j30L81j85j59L65j77j04L8j42J38J66n7N9k68L5J2J35j12l6K69
7957A59j96J34L3q1m7K03L3k26J03l62L47MJ41l87O8J61j73J95j59P7j53L17k07
7980a6J28p1l4l7N0q3j4N5K4Q0j21k29M86k02j28K01l38J5L75k24K14j66J62r6
8004C1n1r8M28l20lj59J80k2K5L40l59k09J21M5J63k82Q1J51k36L35j33j7K4J23
8028A58r8J9J28j42k78L08J58k41k12N7J35J61p8j93J10R3j92J6R1j53J53K30
8050B30Q0m73J64J10J1l33M41m11QK93k85J61j01j2J00M6o9J12j24N1J8k42K20
$$ plain form
8073 -5 15 77 -242 -150 -189 60 23 144 -119 191 134 -94 92 110 46 20 114 -163 61 -59 2 -169 -186 187 -73
8098 -73 21 -74 -102 -150 14 -9 27 -235 -130 -105 -32 -4 -126 79 -239 86 -88 -231 -40 -15 11 100 -204 155
8122 155 -42 88 40 -43 -3 44 64 11 113 -214 83 -67 -50 -233 45 -44 -38 -14 -131 119 12 6 35 -83 92
8147 92 -227 42 275 -9 213 56 100 -31 27 7 -167 227 282 171 -79 -99 -267 182 -8 193 -21 1
8169 1 55 127 17 90 -103 27 -60 -35 -65 40 11 -187 135 -100 25 -134 23 -210 103 164 27 -13
$$ packed form
8073eK0O2l19R2l9K49l7J21k63L10n7k28J86J8o4k6R4k77K24j20O1j71j7L73k60
8098g3R4r5k8m8J64k3L6k62J05K5P3K8j22K05l18L25j74j43J91K5K6Q9l04L59
8122A55j97J30m8q3M0M7K0n3J02l27K97j50J7j83K78q9OK4j17K50j07oK9j18J75
8147I2l19K69K33k84K22j57M4j31N8k0j74L94N5j11k50k0j68M49j90K01k14K2
8169AN4P2j10P3j93J30q7K5l0J05k9j98L22k35J25j59J57k33L13O1j37m0
8191a3
$$ Imaginary data points
##PAGE= N=2
##DATA TABLE= (X++(I..I)), XYDATA
$$ plain form
0 0 0 0 0 0 0 0 0 0 0 0 0 0 0 0 0 -4 8 -8 8 -8 8 -14 16 -16 21 -24 25 -32 36 -40 48 -53 61 -69 77 -86 98
37 98 -109 123 -136 150 -167 186 -205 226 -250 276 -304 335 -369 407 -449 496 -548 605 -671 744
57 744 -832 933 -1053 1201 -1381 1613 -1921 2352 -2994 4063 -6136 11634 -56878 -122856 48578
72 48578 63983 -50613 -63106 39003 51243 -19247 -19521 27346 19300 19612 8522 -14173 10483
85 10483 36361 5283 -33893 -9873 40105 -6410 -54332 -2448 14780 -27661 -28416 -12435 -15316
98 -15316 -20251 -9315 -15534 -35993 -1388 15782 -38224 -27717 26715 5607 -35629 -12970 30038
111 30038 475 -40499 5987 25180 -26033 -22470 10368 -1140 -24492 -15746 1529 -15881
123 -15881 -16388 1320 -24254 -17570 22190 -8389 -36483 10324 39997 -6151 -34387 33110 61847
$$ packed form
0@%%%%%%%%%%%%%%%mJ2j6J6j6J6k2L0l2L7m5M9n7O8p6Q8j01J14j30J46j63J84
37I8k07K32k59K86l17L53l91M31m76N26n80O39p04P76q56R45j044J153j276J415
57G44j576J765j986K254k582K994l534M273n346P057j0199J7770o8512o5978J71434
72D8578J5405j14596j2493J02109J2240p0490k74M6867q046L12j1090k2695K4656
85A0483K5878l1078l9176K4020M9978m6515m7922N1884J7228m2441p55J5981k881
98a5316m935J0936o219k0459L4605J7170n4006J0507N4432k1108m1236K2659M3008
111C0038k9563m0974M6486J9193n1213L563L2838j1508k3352Q746J7275j7410
123a5881n07J7708k5574O684L9760l0579k8094M6807K9673m6148k8236O7497K8737
$$ plain form
136 61847 -11484 -16949 52980 53750 2879 -452 45078 47044 8364 14191 25850 20459 29549 10550
150 10550 -9931 15688 27474 -1717 -23633 1271 23148 -11511 -26952 -1295 1942 -4367
162 -4367 -11395 -18760 -3058 8421 -1191 -20723 -14087 27248 13773 -36151 -6564 38699 7055
175 7055 -31962 -2875 35664 -171 -30518 7806 17122 -10888 -10027 -1883 -641 -3994 -6408 -4255
189 -4255 -9565 -1004 5950 -13333 -7721 11910 451 -9840 1017 13574 2085 -10431 12664
202 12664 14481 -9202 3320 13512 -1218 -2750 3691 3172 -6417 -5399 4190 -10407 -14596 1921
216 1921 -7222 -19286 -10921 -3287 -7967 -21408 -11631 2129 -12861 -14415 -3723 -6192 -1735 -2603
230 -2603 -8218 -1296 7507 5783 -8197 -2440 21813 6513 -13962 8035 20443 4160 -8485
$$ packed form
136F1847p3331n465O9929P70n0871l331M5530J966l8680N827J1659n391R090j8999
150A0550k0481K5619J1786k9191k1916K4904K1877l4659j5441K5657L237o309
162d367p028p365J5702J1479r612j9532O636M1335j3475m9924K9587M5263l1644
175G055l9017K9087L8539l5835l0347L8324R316k8010Q61Q144J242l353k414K153
189d255n310Q561O954j9283N612J9631j1459j0291J0857J2557j1489j2516K3095
202A2664J817k3683J2522J0192j4730j532O441n19r589J018R589j4597m189J6517
216A921r143j2064Q365P634m680j3441R777J3760j4990j554J0692k469M457q68
230b603n615O922Q803j724j3980N757K4253j5300k0475K1997J2408j6283j2645
$$ plain form
243 -8485 4653 20284 1619 -8499 9321 8795 197 477 1322 4331 2750 1907 1133 -2568 7616
258 7616 5965 -7309 3480 9909 -114 -854 3341 6896 1807 -1593 7392 2287 -2192 6560 1645
273 1645 -2677 2245 3510 1123 -5930 978 7771 -6910 -5643 6659 -347 -5285 -1955 1739 1124
288 1124 -4907 221 2711 -2835 2149 479 -2828 4041 1128 -1872 524 1964 4397 -2814 -3194
303 -3194 7220 177 -5305 1658 1954 -785 -3955 -806 2537 -5355 -2229 1771 -5647 -2273 -446
318 -446 -4519 -3294 -2958 -704 -2776 -6422 565 -266 -6272 -938 -546 -1936 -1518 -2466 1444 -963 -1715
335 -1715 3184 -1700 53 4708 -857 533 3495 2364 1715 -774 4030 4184 -3213 2006 3952 -1245
351 -1245 -408 -273 914 -175 -4124 996 -701 -4457 -120 -2456 -3033 -703 -2730 -1321 -1817 -1396
$$ packed form
243h485J3138J5631j8665j0118J7820n26q598K80Q45L009j581q43p74l701J0184
258G616j651j3274J0789O429j0023p40M195L555n089l400Q985n105m479Q752m915
273A645m322M922J265k387p053O908O793j4681J267J2302p006m938L330L694o15
288A124o031N128K490n546M984j670l307O869k913l000K396J440K433p211l80
303c194J0414p043n482O963K96k739l170L149L343p892L126M000p418L374J827
318d46m073J225L36K254k072l646O987q31o006N334L92j390M18r48L910k407p52
335a715M899m884J753M655n565J390K962j131o49k489M804J54p397N219J946n197
351a245Q37J35J187j089l949N120j697l756M337k336n77K330k027J409m96M21
$$ plain form
367 -1396 1157 -2458 7 3339 -1671 1200 2950 621 2445 1490 2841 2897 -674 4011 3485 -1280
383 -1280 2920 2228 748 1096 -192 2939 245 -2033 3171 505 -1054 1950 168 1822 1344 -347
399 -347 3121 1460 2055 2784 95 3889 3351 -985 2215 2234 1300 -264 -2542 1645 -47 -5092 -1904
416 -1904 -2253 -3631 -3800 -6602 -3494 -3622 -6272 -4111 -5608 -4328 -1820 -5744 -3416 -504 -1267 -23
432 -23 -1429 1333 4134 272 2570 3898 2747 5469 3264 2798 5385 3216 3894 2052 912 4302
448 4302 1013 -1083 1194 -145 667 -1233 -3065 275 -1744 -2518 -787 -3115 -411 -6 -2598 345
464 345 -84 -409 473 -1419 1306 547 -1433 1692 -523 -1385 526 -1275 -659 -2457 -3360 443 -2400
481 -2400 -4729 -1468 -2634 -2227 -2854 -4108 6 -650 -1709 -156 -414 3128 2686 221 3651 4378 5118
$$ packed form
367a396K553l615K465L332n010K871J750k329J824r55J351N6l571M685n26m765
383a280M200o92j480L48j288L131k694k278N204k666j559L004j782J654m78j691
399c47L468j661N95P29k689L794n38m336L200J9r34j564k278M187j692n045L188
416a904l49j378j69k802L108j28k650K161j497J280K508l924K328K912p63J244
432b3j406K762K801l862K298J328j151K722k205m66K587k169O78j842j140L390
448D302l289k096K277j339Q12j900j832L340k019p74J731k328K704M05k592K943
464C45m29l25Q82j892K725p59j980L125k215q62J911j801O16j798r03L803k843
481b400k329L261j166M07o27j254M114o56j059J553k58L542m42k465L430P27P40
$$ plain form
498 5118 4767 2121 6138 8049 3292 3409 4368 5776 4770 -503 1460 3930 1276 -1442 -2913 135
514 135 840 -5256 -4736 -1248 -3021 -3358 -5532 -4174 -846 -3478 -3687 -3028 -2279 760 -1522 -2550 646
531 646 853 924 -1208 -1398 3826 1328 -2290 677 942 794 -680 -2081 734 -316 -1491 -387 -1386
548 -1386 -107 72 -1212 899 -110 405 2650 29 1225 3327 1921 3127 2267 2643 4021 2195
564 2195 2937 2982 1291 2728 1692 421 259 -1694 623 -288 -4884 -2543 -870 -2970 -4986 -5476 -1580
581 -1580 -1740 -6477 -4572 -1011 -1426 -3320 -3961 498 1279 -2020 261 564 1252 3307 257 944 3488
598 3488 2986 2312 542 1599 4627 1284 -717 759 2432 2673 -1763 -1790 3241 500 -1184 -586 4
615 4 2072 128 -1708 1503 1561 895 317 109 2265 1290 278 939 -51 1756 1254 -1817 53 493
$$ packed form
498E118l51k646M017J911m757J17R59J408j006n273J963K470k654k718j471L048
514A35P05o096N20L488j773l37k174J358L328k632k09O59P49L039k282j028L196
531F46K07P1k132j90N224k498l618K967K65j48j474j401K815j050j175J104r99
548a386J279J79j284K111j009N15K245k621J196K102j406J206q60L76J378j826
564B195P42M5j691J437j036j271j62j953K317r11m596K341J673k100k016m90L896
581a580j60m737J905L561m15j894o41M459P81l299K281L03O88K055l050O87K544
598C488n02o74j770J057L028l343k001J476J673K41m436k7N031k741j684N98N90
615DK068j944j836L211N8o66n78k08K156r75j012O61r90J807n02l071J870M40
$$ plain form
633 493 -1268 -1079 -2110 -1192 -851 -3858 -1993 -1584 -2636 -2402 -2712 -975 -1656 -3159 106 -741 -2289
650 -2289 460 459 613 981 181 2336 2007 597 2114 1987 2508 2084 851 1989 1738 1414 1810 -538
668 -538 761 1880 -966 -460 -171 -16 354 -2063 -1510 867 -384 -1254 -1770 22 1100 -2257 -1585
685 -1585 820 486 -170 -1356 -769 1842 -415 -1082 571 -212 384 -376 -1067 -6 -476 -382 -1300 -1672
703 -1672 877 -408 -2217 175 -258 -165 -178 -998 969 1002 -227 676 536 1018 972 366 1535 1173 1001
722 1001 1459 -4 1283 1828 -374 799 982 -56 478 -204 -34 20 -923 -255 -721 -877 -509 -1306 -529
741 -529 -182 -1495 -231 -222 -712 30 -1110 -596 945 -766 -45 354 77 289 -502 422 924 -695 403
760 403 484 -247 1310 -294 -336 713 -285 352 -19 -683 982 74 -706 106 -76 436 -616 -584 716
$$ packed form
633D93j761J89j031R18L41l007J865M09j052K34l10J737o81j503L265q47j548
650b289K749jJ54L68q00K155l29j410J517j27N21m24j233J138k51l24L96k348
668e38J299J119k846N06K89J55L70k417N53K377j251q70n16J792J078l357O72
685a585K405l34o56j186N87K611k257o67J653p83N96p60o91J061m70R4r18l72
703a672K549j285j809K392m33R3j3q20J967L3j229R03j40M82m6o06J169l62j72
722A001M58j463J287N45k202J173J83j038N34o82J70N4r43O68m66j56L68p97P77
741e29L47j313J264Rm90P42j140N14J541j711P21L99k77K12p91R24N02j619J098
760D03Q1p31J557j604m2J049r98O37l71o64J665r08p80Q12j82N12j052L2J300
$$ plain form
779 716 -646 -281 245 -702 418 243 -1314 483 77 -478 181 -679 235 138 -752 344 40 42 184 -594
799 -594 808 47 -919 748 -368 -406 923 -509 28 226 -325 318 -377 233 287 -744 413 147 -487
818 -487 664 -162 -4 769 -521 296 315 -480 611 -81 -338 518 -57 73 -176 -398 260 -847 -284
837 -284 382 -896 27 -314 -767 183 -352 -558 12 -473 50 10 -584 305 -116 -141 717 173 656 587 63
858 63 1305 96 317 1116 269 708 726 33 823 269 -31 515 -429 114 105 -498 150 -492 -330 161 -1261
879 -1261 -385 -566 -1054 -169 -671 -639 35 -591 -70 -355 -363 394 -454 0 748 -445 17 315 -193 406 -495
900 -495 -192 591 -315 31 128 -375 120 -19 -98 243 -278 108 52 -444 808 -8 -58 1102 180 698 804
921 804 575 1007 362 469 1012 199 569 435 -152 280 -462 -305 104 -899 -235 -611 -1191 -538 -1028 -1382
$$ packed form
779G16j362L65N26r47J120j75j557J797m06n55O59q60R14r7q90J096l04KJ42p78
799e94J402p61r66J667j116l8J329j432N37J98n51O43o95O10N4j031J157k66o34
818d87J151q26J58P73j290Q17J9p95J091o92k57Q56n75J30k49k22O58j107N63
837b84O66j278R23l41m53R50n35k06N70m85N23m0n94Q89m21k5Q58n44M83o9n24
858F3J242j209K21P99q47M39J8o93P90n54l00N46r44N43ro03O48o42J62M91j422
879a261Q76j81m88Q85n02L2O74o26N21k85qP57q48M54P48j193M62K98n08N99r01
900d95L03P83r06L46R7n03M95j39p9L41n21L86n6m96J252q16n0J160r22N18J06
921H04k29M32o45J07N43q13L70j34n87M32p42J57M09j003O64l76n80O53m90l54
$$ plain form
941 -1382 -678 -817 -536 -740 -892 -126 -408 -455 -30 -449 11 264 -12 737 253 192 889 119 640 712 -103
962 -103 502 296 262 478 -138 184 109 -297 187 121 -333 290 -329 79 249 -57 279 -156 -218 622 -300 271
984 271 635 2 552 58 -59 402 -454 51 -15 -753 -75 -265 -565 -526 -947 -621 -857 -972 -822 -700 -843
1005 -843 -328 -798 -408 -294 -347 157 -108 -57 510 128 369 577 242 707 898 408 879 574 503 596 63
1026 63 925 186 -234 446 -288 2 -228 -694 24 -322 -335 -43 -546 -36 183 -827 -67 -8 -157 -63 -449
1047 -449 69 382 -548 -63 114 186 95 -500 -33 196 -229 80 -405 -368 121 -415 -579 35 -426 -158 -336
1068 -336 -197 102 -225 -193 90 -8 167 -17 46 575 202 692 556 211 713 543 308 756 1 283 263
1089 263 -35 -56 -48 -372 222 -608 -450 -117 -640 -391 -550 -772 -316 -361 -344 -266 -510 193 -30 -78 216 -93
$$ packed form
941a382P04j39K81k04j52P66k82m7M25m19M60K53k76P49m84o1O97p70N21P2q15
962a03O05k06l4K16o16L22p5m06M84o6m54O23o19M08J70l06L36m35o2Q40r22N71
984B71L64o33N50m94j17M61q56N05o6p38O78j90l00L9m21L26k36j15J50J22j43
1005h43N15m70L90J14n3N04k65N1N67l82K41K08l35M65J91m90M71l05p1R3n33
1026F3Q62p39m20O80p34K90k30m66P18l46j3K92n03N10K19j010P60N9j49R4l86
1047d49N18L13r30M85J77P2r1n95M67K29m25L09m85L7M89n36j64O14m61K68j78
1068c36J39K99l27L2K83r8J75j84O3N29l73M90j36l45N02j70k35M48p55K82k0
1089B63k98k1Ql24N94q30J58L33n23K49j59k22M56m5J7P8k44P03k23m8K94l09
$$ plain form
1111 -93 39 68 -533 346 179 122 393 109 366 215 -277 154 12 -258 40 -144 165 241 -86 19 -211
1132 -211 -43 178 -92 210 49 -80 312 105 -115 526 244 122 316 298 345 -328 252 352 -83 220 63
1153 63 -2 -34 -260 -261 99 -593 -170 -119 -301 -209 -208 -528 -210 -143 -37 70 -543 225 -33 -95 453 356 -38 141
1177 141 -143 268 110 155 432 -18 234 233 85 152 30 91 243 -190 30 194 -427 -96 266 -201 -17 -22
1199 -22 36 207 -317 436 64 -148 -81 -371 -62 110 -147 130 -271 -232 138 -383 -99 437 -214 -12 -71 -8
1221 -8 77 -383 118 87 -173 46 161 -266 200 -196 44 37 -160 60 113 -370 369 -27 -191 244 -120 176
1243 176 103 -12 465 -161 -67 50 -290 -199 62 -146 169 -14 -92 -46 -117 25 -42 -389 -50 213 -129 205
1265 205 -157 67 122 -383 -117 -444 -60 153 -58 52 146 164 199 -48 41 383 -17 457 202 -173 408 -73
$$ packed form
1111i3J32K9o01Q79j67n7K71k84K57j51m92M31j42k70K98j84L09P6l27J05k30
1132b11J68K21k70L02j61j29L92k07k20O41k82j22J94j8M7o73N80J00m35L03j57
1153F3o5l2k26jL60o92M23N1j82R2Jl20L18O7J06J07o13P68k58o2N48r7l94J79
1177A41k84M11j58M5K77m50K52jj48O7j22O1J52m33K20J64o21L31L62m67J84n
1199b2N8J71n24P53l72k12O7k90L09J72k57K77m01L9L70n21K84N36o51K02n9O3
1221hQ5m60N01l1k60K19J15m27M66l96K40pj97K20N3m83P39l96j64M35l64K96
1243A76p3j15M77o26R4J17l40R1K61k08L15j83p8M6p1J42o7l47L39K63l42L34
1265B05l62K24N5n05K66l27L84K13k11J10R4J8L5k47Q9L42m00M74k55l75N81m81
$$ plain form
1287 -73 -64 296 -259 276 168 -211 173 -244 -224 -6 -223 1 -299 -176 -329 -671 -86 -51 -401 -116 -16 -438
1309 -438 81 -302 -10 159 16 199 56 -86 145 -124 200 285 -257 109 85 -53 333 113 13 118 -158
1330 -158 152 -27 -236 96 -175 14 176 -13 339 -40 -146 252 -175 64 -101 149 348 3 -103 307
1350 307 247 -367 8 57 78 -110 -183 -144 -334 -36 -70 -166 -51 -265 -181 178 -254 -261 -46 -250 -165 63 -83 71
1374 71 96 101 380 186 317 -67 253 589 71 275 116 160 378 209 -28 158 -107 282 -25 -255 87 -217
1396 -217 -326 -24 -392 -25 -163 -263 -112 -132 -140 105 67 177 43 -180 -292 16 -149 344 -265 -13 -90 -46
1418 -46 245 -512 -365 183 -33 -294 38 -368 -148 -334 -160 -79 -184 -190 -156 -396 313 97 34 156 18 115
1440 115 232 145 313 85 184 363 76 178 221 144 -35 -109 83 123 -91 -250 -187 -150 -95 -63 84 -163 -148 -275
$$ packed form
1287g3RL60n55N35j08l79L84m17K0K18k17K24l00J23j53l42N85L5l50K85J00m22
1309d38N19l83K92J69j43J83j43j42K31k69L24Q5n42L66k4j38L86k20j00J05k76
1330a58L10j79k09L32k71J89J62j89L52l79j06L98m27K39j65K50J99l45j06M10
1350C07o0o14L75M9K1j88p3L9j90K98l4r6J15k14Q4L59m32pK15k04Q5K28j46J54
1374G1K5NK79j94J31l84L20L36n18K04j59M4K18j69k37J86k65L89l07k30L42l04
1396b17j09L02l68L67j38j00J51k0qK45l8J10j34k23j12L08j65M93o09K52p7M4
1418d6K91p57J47N48k16k61L32m06K20j86J74Q1j05oL4k40P09k16o3J22j38R7
1440A15J17q7J68k28R9J79k87J02M3p7j79p4J92M0k14j59O3L7N5L2J47k47J5j27
$$ plain form
1464 -275 -65 -201 -21 -165 -180 -146 -31 -97 88 25 -45 82 -78 230 -50 219 93 87 117 -54 34 12 258
1487 258 27 -79 0 102 265 -75 121 -108 73 155 312 275 113 291 281 63 219 230 56 32 319 144
1509 144 119 123 228 247 -271 -46 349 -93 4 -9 -125 -87 -270 -187 -237 -179 -178 -407 -10 -28 -84 -47 -84 134 172 325
1535 325 215 129 -148 150 29 101 97 -63 10 -48 -186 139 40 211 116 -133 413 -189 -325 16 -251 -227 25
1558 25 -199 -59 169 49 88 179 -111 -3 49 56 -72 -207 -104 -104 -53 123 -76 214 109 -184 113 -232 -35
1581 -35 59 -209 -192 -41 -345 15 80 -143 -164 -13 -67 -263 -180 228 157 109 177 67 37 369 -31 67 77 177
1605 177 85 -65 28 138 22 31 195 159 48 274 -187 237 -189 24 -24 -1 17 1 -197 -133 -135 131 -62 -66 232
1630 232 -101 -105 280 -315 -52 118 -113 97 -200 83 36 -51 -10 241 -70 92 13 -28 32 -67 1 163 142 72
$$ packed form
1464b75K10j36J80j44j5L4J15o6J85o3p0J27j60L08k80K69j26oL0j71Q8k2K46
1487B58k31j06P9J02J63l40J96k29J81Q2J57l7j62J78j0k18J56J1j74k4K87j75
1509A44k5MJ05J9n18K25L95m42R7j3j16L8j83Q3n0N8Jk29L97j8n6L7l7K18L8J53
1535C25j10q6k77K98j21P2mj60P3n8j38L25r9J71r5k49N46o02j36L41k67K4K52
1558B5k24J40K28j20L9R1k90J08N2Pj28j35J03%N1J76j99K90j05k93K97l45J97
1581c5R4k68J7J51l04L60O5k23k1J51n4j96Q3M08p1m8O8j10l0L32m00R8J0J00
1605A77r2j50R3J10j16RJ64l6j11K26m61M24m26K13m8K3J8j6j98O4kK66j93mK98
1630B32l33mL85n95K63J70k31K10k97K83m7q7M1K51l11J62p9m1O0r9O8J62k1p0
$$ plain form
1654 72 25 77 -77 33 86 25 -55 -90 258 238 29 -234 15 -174 21 -53 -113 255 51 -48 -76 30 -3 30 33
1679 33 118 30 -46 96 33 -320 -167 -70 36 -34 115 70 85 -139 217 67 160 -53 100 258 340 8 169 -20
1703 -20 33 -147 -109 -5 -1 -131 257 -270 -192 105 -178 -129 65 27 253 118 -39 37 -256 -31 -166 -95 -60 -333
1727 -333 78 -108 -205 172 4 -272 -143 -9 -18 -46 5 25 165 97 95 257 178 345 9 -49 -51 -59 127 230 -94
1752 -94 39 -7 238 68 -6 150 13 -47 216 92 -45 -251 -95 -112 -55 -72 163 160 73 23 -20 -112 33 45 174
1777 174 -13 -252 49 -56 -164 -356 -48 -103 -73 -240 71 -65 -123 11 -6 68 -58 127 165 131 168 84 78 86
1801 86 44 279 140 303 73 -75 124 263 28 45 257 345 -41 284 -156 -146 100 -200 -126 -141 -138 -33 -230
1824 -230 -241 -368 -102 145 -101 98 -222 14 -109 9 -157 278 30 -79 297 336 210 -47 -135 137 -85
$$ packed form
1654G2m7N2j54J10N3o1q0l5L48k0k09k63K49j89J95p4o0L68k04r9k8J06l3L3L
1679C3Q5q8p6J42o3l53J53R7J06p0J49m5J5k24L56j50R3k13J53J58Q2l32J61j89
1703b0N3j80L8J04Mj30L88n27P8K97k83M9J94l8K26j35j57P6k93K25j35P1L5k73
1727c33M11j86r7L77j68k76J29J34rk8N1K0J40o8kJ62p9J67l36n8kqJ86J03l24
1752i4J33m6K45j70p4J56j37o0K63j24j37k06J56j7N7j7K35lq7n0m3r2J45J2J29
1777A74j87k39L01j05j08j92L08n5L0j67L11j36n8J34j7P4j26J85L8l4L7q4oQ
1801H6m2K35j39J63k30j48J99J39k35J7K12Q8l86L25m40J0K46l00P4j5LJ05j97
1824b30j1j27K66K47k46J99l20K36j23J18j66M35k48j09L76L9j26k57q8K72k22
$$ plain form
1845 -85 221 130 57 -160 -13 128 31 252 -91 134 25 129 203 -51 13 -91 216 152 147 58 -83 142 84 202
1869 202 19 191 -39 34 -40 -79 171 -44 -53 210 61 3 139 -5 -56 110 122 -196 -229 -236 183 -149 56 -32
1893 -32 211 -126 -58 138 11 347 -168 124 50 172 3 69 -136 173 149 -117 70 106 -18 34 -170 99
1915 99 -8 179 7 -101 -46 135 68 150 176 159 170 -153 117 -31 -5 -70 -227 -7 421 163 -41 -278 -85
1938 -85 -122 160 -25 53 -14 -53 -1 -10 187 67 -218 64 139 -266 68 -20 167 -107 -117 -71 -42 -13 -69 25 322
1963 322 -42 -14 -50 171 46 103 -40 -152 -58 94 -198 9 22 -235 -8 -22 183 -68 -78 -42 91 -71 -53
1986 -53 114 154 160 68 -185 -41 50 -224 116 125 -220 85 -124 -116 95 12 -288 -165 53 229 -201 -68 -172 168
2010 168 -99 17 -216 -48 -112 182 217 5 -139 117 -43 23 -6 29 216 -34 246 9 78 -4 85 269 18
$$ packed form
1845h5L06r1p3k17J47J41r7K21l43K25j09J04P4k54O4j04L07o4nq9j41K25n8J18
1869B02j83J72k30P3p4l9K50k15rK63j49n8J36j44n1J66J2l18l3pM19l32K05q8
1893c2K43l37O8J96j27L36n15K92p4J22j69O6k05L09k4k66J87L6j24N2k04K69
1915I9j07J87j72j08N5J81o7Q2K6j7J1l23K70j48K6o5j57K20M28k58k04k37J93
1938h5l7K82j85P8o7l9N2rJ97j20k85K82P5m05L34q8J87k74j0M6K9K9n6R4K97
1963C22l64K8l6K21j25N7j43j12R4J52k92K07J3k57K27j4K05k51j0L6J33j62J8
1986e3J67M0Or2k53J44R1k74L40Rl45L05k09QK11q3l00J23K18J76m30J33j04L40
2010A68k67J16k33J68o4K94L5k12j44K56j60O6k9L5J87k50K80k37O9q2Q9J84k51
$$ plain form
2033 18 -65 175 72 -120 -337 2 29 -7 110 212 -81 -251 12 -120 -64 -80 -54 -20 -126 -61 -254 -89 -76
2056 -76 -263 174 190 -147 -20 110 240 -29 128 155 -81 -9 185 131 -251 -173 -89 -291 168 -132 -275 161
2078 161 -26 -37 248 18 -184 115 -198 -186 49 42 -48 -145 210 -102 -302 -9 -5 107 -106 -1 181 82 -245
2101 -245 -184 132 189 43 129 -178 -83 67 125 -189 -359 14 22 30 79 -9 265 55 10 134 76 57 79 139 28
2126 28 -68 3 498 139 -111 26 209 -209 142 53 4 -9 67 -108 -41 266 -279 65 -267 51 39 87 -143
2149 -143 -56 -23 13 -73 56 -29 10 2 129 -83 33 -59 -43 -4 78 203 3 -297 192 125 -27 21 89 78 -118
2174 -118 303 -123 -16 -305 -106 -64 -44 54 144 17 -281 11 -12 -119 -113 88 -235 -120 7 -250 173 -119
2196 -119 -157 155 -132 -235 -200 22 -35 -99 -9 -106 9 144 -83 -25 350 -144 225 42 177 252 44 30 -154
$$ packed form
2033A8q3K40j03j92k17L39K7l6J17J02k93j70K63j32N6j6K6L4j06O5j93J65J3
2056g6j87M37J6l37J27J30J30k69J57K7k36P2J94n4l82P8Q4k02M59l00j43M36
2078A61j87j1K85k30k02K99l13J2K35pr0r7L55l12k00K93MJ12k13J05J82r9l27
2101b45O1L16N7j46Q6l07R5J50N8l14j70L73QQM9q8K74k10m5J24n8j9K2O0j11
2126B8r6P1M95l59k50J37J83m18L51q9m9j3P6j75O7L07n45L44l32L18j2M8k30
2149a43Q7L3L6q6J29q5L9qJ27k12J16r2J6L9Q2J25k00l00M89o7j52M8O8j1j96
2174a18M21m26J07k89J99M2K0R8R0j27k98K92k3j07OK01l23J15J27k57M23k92
2196a19l8L12k87j03L5K22n7o4R0r7J15J35k27N8L75m94L69j83J35P5k08j4j84
$$ plain form
2219 -154 -176 64 -20 -132 101 188 -24 194 -13 13 213 350 -195 86 -101 107 -150 103 -213 202 11
2240 11 66 95 -32 -108 -37 4 8 -71 -34 10 16 -222 -110 -102 188 46 -38 80 46 35 29 345 66 -168 17 -80 -184
2267 -184 173 -21 98 -70 162 187 -240 366 13 160 -7 -162 -111 -59 7 -217 -132 190 46 -56 106 7
2289 7 -19 -57 -156 -175 -73 -359 -60 45 -245 -18 -57 110 242 27 -153 45 -333 61 156 -86 -91 -115 -488 36
2313 36 -155 133 165 103 200 -139 120 -231 18 -11 293 -130 8 295 -91 202 -48 24 71 148 -38 1 103
2336 103 -110 -244 56 -224 10 -116 -179 -101 346 -18 -131 14 -79 49 78 112 26 16 -45 129 -38 150 90
2359 90 35 160 -277 234 -123 -29 205 -273 44 198 -88 -85 -20 78 76 53 -68 24 72 -259 -236 245 154 11 57
2384 57 62 192 -8 73 86 113 -9 -79 148 -99 -42 211 -114 117 99 -270 -3 -16 -147 -388 -81 -194 -117 -90
$$ packed form
2219a54k2K40q4j12K33Q7k12K18k07K6K00J37n45K81j87K08k57K53l16M15j91
2240A1N5K9j27p6P1M1Mp9L7M4Ok38J12QK90j42q4J18l4j1oL16k79k34J85r7j04
2267a84L57j94J19j68K32K5m27O06l53J47j67j55N1N2O6k24Q5L22j44j02J62r9
2289Gk6l8r9j9J02k86K99J05k90K27l9J67J32k15j80J98l78L94R5k42nk4l73N24
2313C6j91K88L2o2R7l39K59l51K49k9L04m23J38K87l86K93k50P2M7P7j86L9J02
2336A03k13j34L00k80K34j26o3P8M47l64j13J45r3J28K9L4q6j0o1J74j67J88o0
2359I0n5J25m37N11l57R4K34m78L17J54k86LO5R8kk3j21R2M8l31K3M81r1j43M6
2384E7NJ30k00Q1J3K7j22p0K27k47N7K53l25K31j8l69K67j3j31k41L07j13P7K7
$$ plain form
2408 -90 33 275 -29 -49 -92 -151 -41 -237 -120 19 150 275 39 -28 108 8 -60 69 -166 87 -71 -63 243
2431 243 -91 -237 3 -3 -277 -131 291 209 -80 92 -72 -205 -101 180 17 160 59 117 157 -182 5 -71
2453 -71 141 -54 -27 -131 -1 -215 -182 -83 -72 -183 -90 225 -107 26 -16 -161 -26 -115 143 -178 186 -9 -75
2476 -75 -105 -101 -34 9 229 30 -110 -22 -141 73 24 -42 172 -59 -16 132 196 -163 -29 -151 166 -15 179 19
2500 19 -111 -140 -18 64 -201 -93 -53 93 293 13 49 -171 -114 -43 136 168 -153 -89 -11 -82 102 108 -44 259
2524 259 -109 -142 -200 -75 -37 -270 8 89 202 -156 -137 86 70 5 -60 242 74 12 34 -107 -214 -19 148
2547 148 -41 60 85 15 -56 -203 227 86 -99 -28 15 -193 69 104 50 -125 291 193 -200 148 -232 56 106
2570 106 -104 101 -17 -55 42 11 139 8 -10 274 -76 -1 228 -78 -29 1 79 372 12 42 -59 105 141
$$ packed form
2408i0J23K42l04k0m3n9J10j96J17J39J31J25k36o7J36j00o8J29k35K53j58QL06
2431B43l34j46K40ok74J46M22q2k89J72j64j33J04K81j63J43j01N8M0l39J87p6
2453g1K12j95K7j04J30k14L3R9J1j11R3L15l32J33m2j45J35q9K58l21L64j95o6
2476g5l0MO7M3K20j99j40Q8j19K14m9o6K14k31M3J48O4l59J34j22L17j81J94j60
2500A9j30k9J22Q2k65J08M0J46K00k80L6k20N7P1J79L2l21O4P8p1J84Oj52L03
2524B59l68l3n8J25L8k33K78Q1J13l58J9K23j6o5o5L02j68o2K2j41j07J95J67
2547A48j89J01K5p0p1j47M30j41j85P1M3k08K62L5n4j75M16r8l93L48l80K88N0
2570A06k10K05j18l8R7l1J28j31j8K84l50P5K29l06M9L0P8K93l60L0j01J64L6
$$ plain form
2593 141 -62 168 -38 -180 -132 114 203 303 100 -88 88 -180 -233 69 -146 -40 -69 -19 189 104 184 154 -4
2616 -4 72 68 -25 77 73 212 8 -35 -42 -7 -41 110 -54 146 -22 -34 215 -87 130 15 129 -59 147 -201 172
2641 172 -2 192 238 197 182 218 203 170 108 -103 169 182 -137 -61 -25 -86 -266 111 -88 102 -257 -80 172 -127
2665 -127 -33 40 146 -106 -128 -76 -176 246 46 -141 90 -7 -165 357 -132 9 127 -62 27 -85 113 1
2687 1 5 211 -36 31 126 57 168 174 -121 91 144 -24 -143 -83 -436 -171 -127 157 197 63 67 68 13 -34 -46 83 257
2714 257 99 -83 54 21 187 266 -261 136 -9 -212 122 170 -64 -155 52 -26 39 165 207 21 47 194 205
2737 205 -8 162 -155 228 -104 -95 37 58 -41 -58 99 -140 -193 -250 -318 -160 -347 87 -233 -26 -190 -103 -121
2760 -121 -31 -24 -520 137 -33 253 157 -20 -137 99 -114 200 0 26 22 118 -256 71 73 -217 -189 197 114 -146
$$ packed form
2593A41k03K30k06j42M8K46Q9J00k03j88J76k68n3L02k15J06k9N0K08q5Q0l0j58
2616dP6mr3J02mJ39k04m3pL5l4J51j64K00j68j2K49l02K17j15J14j88K06l48L73
2641A72j74J94M6m1j5L6j5l3o2k11K72J3l19P6L6o1j80L77j99J90l59J77K52k99
2665a27R4P3J06k52k2N2j00M22k00j87K31r7j58N22m89J41J18j89Q9j12J98j12
2687AMK06k47O7R5o9J11Ok95K12N3j68j19O0l53K65M4K84M0j34MJn5m7j2J29J74
2714B57j58j82J37l3J66P9n27L97j45k03L34M8k34r1K07p8O5J26M2j86K6J47J1
2737B05k13J70l17L83l32RJ32K1r9j7J57k39n3n7o8J58j87M34l20K07j64Q7j8
2760a21R0Pm96O57j70K86r6j77j17K36k13L14k00K6mR6l74L27Kk90K8L86q3k60
$$ plain form
2784 -146 -26 -65 -55 72 -21 -4 -100 -16 136 -90 68 -68 -204 -61 57 -17 109 36 13 132 219 -91 -43 1
2808 1 -51 149 -71 78 83 -213 39 73 211 30 -43 -99 171 -229 -192 80 -144 94 104 280 -37 -86 34 29
2832 29 -13 171 30 -101 -30 88 196 -203 208 -29 -4 227 -78 101 7 -20 103 -132 -3 93 257 -200
2854 -200 -100 -296 50 26 -114 -48 -5 107 164 259 48 -6 207 46 133 -164 -4 -8 -111 256 56 -28 79
2877 79 -78 261 -27 34 -18 -150 -74 -227 -281 -181 -244 178 243 -342 30 170 -97 134 -402 -67 80 220
2899 220 -231 230 8 43 -41 122 -105 -210 34 -105 -40 71 85 -43 197 38 96 -1 184 -1 26 -147
2921 -147 103 81 -10 199 -158 -79 1 -90 -164 -131 -85 149 34 -209 71 39 19 51 129 -165 50 211 139 -333
2945 -333 -36 -19 105 209 40 -56 241 45 -50 -91 -152 -94 -141 89 34 164 58 -340 -287 -29 -126 -32 91 48
$$ packed form
2784a46J20l9J0J27r3J7r6Q4J52k26J58j36j36J43J18p4J26p3k3J19Q7l10M8M4
2808An2K00k20J49Nk96K52L4J38j81p3n6K70m00L7K72k24K38J0J76l17m9J20n
2832B9m2J84j41j31P1J18J08l99M11k37K5K31l05J79r4k7J23k35J29R6J64m57
2854b00J00j96L46k4j40O6M3J12N7R5k11n4K13j61Q7k97J60mj03L67k00q4J07
2877G9j57L39k88O1n2j32P6j53n4J00o3M22O5n85L72J40k67K31n36L35J47J40
2899B20m51M61k22L5q4J63k27j05K44j39O5J11J4j28K40j59N8r7J85j85K7j73
2921a47K50k2r1K09l57P9Q0r1p4L3M6K34j15k43K80l2k0L2P8k94K15J61p2m72
2945c33K97J7J24J04j69r6K97j96r5m1o1N8m7K30n5J30j06l98N3K58r7R4J23m3
$$ plain form
2969 48 -28 -158 -150 1 129 50 -194 -61 88 2 -22 3 -133 -60 -35 -165 -50 -299 27 -8 -60 136 24 91
2993 91 91 19 7 94 -87 86 43 117 -17 -362 46 -29 141 265 2 105 -248 15 -24 -68 -27 128 46 -19 -109
3018 -109 134 38 55 -48 8 -12 -228 23 138 -67 302 9 59 141 -158 10 -106 -114 87 -187 -156 -86 43
3041 43 -101 -122 186 -23 -28 -133 71 -127 -115 129 -15 -49 -94 -232 157 180 35 162 -64 10 -94 169 82
3064 82 -4 66 -16 -31 -1 -50 -104 -123 136 -169 -293 -224 -60 156 28 -294 65 143 -136 -220 28 169 -85 17
3088 17 -80 -28 187 29 -192 269 4 89 -193 54 -162 157 -257 -206 73 222 5 -81 43 62 -2 76 -117
3111 -117 -133 62 200 206 -45 81 -304 96 131 -141 26 64 52 152 -122 -5 207 -193 -212 -37 -47 -131 58
3134 58 153 -80 36 100 -152 -6 114 -85 41 81 -53 65 -151 -39 139 -101 -190 211 -150 72 73 91 110
$$ packed form
2969D8p6j30QJ51J28p9k44J33J49q6k4K5j36P3K5j30J15k49L26l5n2J96j12O7
2993I1%p2j2Q7j81J73m3P4j34l45M08p5J70J24k63J03l53K63l9m4M1J55q2o5r0
3018a09K43r6J7j03N6k0k16K51J15k05L69k93N0Q2k99J68j16qK01k74L1P0J29
3041D3j44k1L08k09nj05K04j98J2K44j44l4m5j38L89K3j45J27k26P4j04K63q7
3064H2q6P0q2j5L0m9n4j9K59l05j24O9J64K16j28l22L59P8k79q4K48J41k54J02
3088A7r7N2K15j58k21M61k65Q5k82K47k16L19m14N1K79J49k17q6J24J9o4P8j93
3111a17j6J95J38Ok51J26l85M00L5k72J67L8j2J00k74J17K12m00j9J75j0q4J89
3134E8R5k33J16O4k52J46J20j99J26M0j34J18k16J12J78k40q9M01l61K22JJ8J9
$$ plain form
3157 110 114 153 -238 1 -160 29 -164 -1 -111 192 169 -224 -35 -174 187 -254 27 206 17 0 164 31
3179 31 13 -83 -169 -162 6 -241 84 32 -9 112 106 185 -8 125 280 -85 -6 120 56 -261 159 52 -94 -30 -17
3204 -17 97 -9 254 -184 59 -21 262 123 16 276 1 -100 -111 -178 -236 104 68 -10 195 70 -140 -130 31
3227 31 -133 -29 -85 -38 210 163 -291 -290 65 12 97 50 20 211 -217 218 203 25 -215 0 -125 -127 64 188
3251 188 217 151 199 43 -86 -362 4 5 10 197 -99 -12 37 313 37 90 -337 -79 20 5 106 1 -147 66
3275 66 128 111 -48 -22 251 -13 -179 -294 -67 -35 332 273 -27 57 124 -117 -59 66 96 -136 -259 173 344
3298 344 188 163 257 -103 -138 -40 -150 310 181 154 5 141 92 -24 43 -58 4 29 -121 209 -272 -37 -178
3321 -178 -28 -19 -74 -128 -56 -45 -302 -48 189 -36 -26 -42 52 78 -43 -204 -10 181 67 136 -31 -31 20 -338 -168
$$ packed form
3157A10ML9l91K39j61J89j93J63j10L03k3l93J89j39L61m41K81J79j89j7J64j33
3179C1j8r6q6PJ68k47L25n2m1J21oP9j93J33J55l65P9J26o4l17M20j07j46O4J3
3204a7J14j06K63m38K43q0K83j39j07K60k75j01j1o7n8L40l6p8K05j25k10J0J61
3227C1j64J04n6M7K48m7m54JL55n3Q5m7l0J91m28M35j5j78k40K15j25kJ91J24
3251A88K9o6M8j56j29k76L66JNJ87k96Q7M9K76k76N3m27K58R9j5J01j05j48K13
3275F6O2j7j59K6K73k64j66j15K27L2L67n9l00Q4O7k41N8J25L0k32j23M32J71
3298C44j56k5R4l60l5R8j10M60j29k7j49J36m9j16O7j01O2K5j50L30m81K35j41
3321a78J50Rn5n4P2J1k57K54K37k25J0j6R4K6j21j61J94J91j14O9j67%N1l58J70
$$ plain form
3346 -168 127 -125 -242 161 248 -26 -2 -89 -66 -198 -39 -106 -15 -83 204 49 -106 -139 193 -182 -194 -139 -121 88
3370 88 77 -179 119 233 23 185 -262 87 -191 130 13 367 136 -254 225 -228 -158 44 123 -160 9
3391 9 182 -85 132 -88 236 -113 -72 146 -44 -83 -23 51 -224 -37 71 -94 -258 50 190 123 -107 144
3413 144 67 128 429 45 -165 352 -122 -203 -66 -29 -44 57 -69 -156 259 80 -133 31 14 -65 -47 286 121
3436 121 247 -62 9 -72 178 94 -125 309 103 96 68 183 -34 -94 -36 86 221 -28 -168 -56 97 216 21
3459 21 22 76 -132 -169 26 -30 3 -86 -122 144 49 -46 180 -107 -34 265 -81 51 88 -304 11 347 68 -138
3483 -138 109 -44 -191 257 -221 -77 12 -78 -10 -45 -142 84 30 -70 129 38 -142 152 155 353 -90 80 -311
3506 -311 75 -94 -115 64 -272 -120 -11 136 -179 -58 128 -9 16 -21 73 19 49 78 51 -32 4 38 -58 -30
$$ packed form
3346a68K95k52j17M03Q7k74K4q7K3j32J59o7R1o8K87j55j55l3L32l75j2N5J8K09
3370H8j1k56K98J14k10J62m47L49k78L21j17L54k31l90M79m53P0K02P9k83J69
3391IJ73k67K17k20L24l49M1K18j90l9O0P4k75J87J08j65j64L08J40o7k30K51
3413A44p7O1L01l84k10N17m74q1J37L7j5J01j26q7M15j79k13J64j7p9J8L33j65
3436A21J26l09P1q1K50q4k19M34k06pk8J15k17o0N8J22J35k49j40J12J53J19j95
3459B1JN4k08l7J95n6L3q9l6K66r5r5K26k87P3K99l46J32L7l92L15L36k79k06
3483a38K47j53j47M48m78J44Q9r0O8l5r7K26n4j00J99r1j80K94LJ98m43J70l91
3506c11L86j69k1J79l36J52J09J47l15J21J86j37K5l7R4n4L0K9k7q3L6L4r6K8
$$ plain form
3530 -30 4 100 70 20 -6 -3 114 61 -384 176 -120 -63 -67 154 -1 56 -209 157 -92 342 -36 14 214 -134 200
3555 200 102 -84 156 -174 -92 -235 -29 280 221 311 -40 66 -16 -121 79 101 -39 99 -50 -66 -137 55 -52
3578 -52 225 -149 -153 -48 -153 108 233 204 196 -239 172 -253 14 131 83 -108 -252 132 -88 152 63 -52 -197
3601 -197 -38 -173 -224 5 -408 177 31 120 4 79 -341 96 -149 -160 178 270 -120 108 -28 117 -24 51
3623 51 120 -176 -309 -66 78 159 -294 -268 190 -243 27 38 15 24 -200 -166 74 72 -2 -10 94 235 -124 -383 106
3648 106 -280 78 -182 -297 -202 -33 78 -99 74 41 -43 13 306 165 271 -116 -223 -2 55 -105 -69 -299
3670 -299 161 77 36 -96 192 221 -10 95 143 -79 -14 -255 45 -59 18 34 -40 -105 -45 -5 -28 359 -22 -134
3694 -134 -353 177 -80 39 4 23 378 116 19 5 -37 -234 -305 -59 -20 381 -243 -122 -142 104 153 50 249
$$ packed form
3530c0L4R6l0n0k6LJ17n3m45N60k96N7mK21j55N7k65L66k49M34l78N0K00l48L34
3555B00r8j86K40l30Q2j43K06L09n9R0l51J06q2j05K00K2j40J38j49j6p1J92j07
3578e2K77l74mJ05j05K61J25k9qm35M11m25K67J17m8j91j44L84k20K40q9j15j45
3601a97J59j35n1K29m13N85j46Q9j16P5m20M37k45j1L38R2l90K28j36J45j41P5
3623E1O9k96j33K43J44Q1m53K6M58m33K70J1k3Rk24L4K40kp4qJ04J41l59k59M89
3648A06l86L58k60j15R5J69J11j77J73l3q4N6K93j41J06l87j07K21N7j60L6k30
3670b99M60q4m1j32K88K9k31J05M8k22O5k41L00j04P7J6p4o5O0M0k3L87l81j12
3694a34k19N30k57J19l5J9L55k62r7j4m2j97p1K46L9M01o24J21k0K46M9j03J99
$$ plain form
3717 249 389 308 166 -217 -132 -186 145 -159 -26 -35 18 -102 -149 23 -2 -166 -175 -108 -136 -43 95 -62 -258 86
3741 86 -124 -67 372 -147 192 93 292 49 -119 -56 4 114 -87 -54 -238 -111 147 -280 24 -3 9 98 19
3764 19 203 -80 327 -125 30 81 -160 107 -76 18 -132 43 170 -4 -223 -124 -256 -68 75 38 144 -154
3786 -154 -10 -107 -68 -14 -150 43 18 81 -67 132 144 -192 76 -78 -221 -123 -464 78 47 156 156 372 -23
3809 -23 -52 -17 -133 -33 -10 435 -138 91 -148 45 -21 44 104 -7 210 -113 -72 -241 18 195 -74 -103 12
3832 12 19 -118 55 -234 -61 142 185 67 -9 -23 177 -237 15 28 -41 -77 -180 4 -129 37 26 2 -82 108
3856 108 -148 26 -93 1 -86 -153 433 139 -170 44 141 -49 10 58 66 117 -94 25 -82 -171 -135 -132 -186 -229 -353
3881 -353 -95 -20 210 127 -14 46 136 113 -109 134 -61 229 81 -86 98 -116 48 186 -142 -83 174 -149
$$ packed form
3717B49J40q1j42l83Q5n4L31l04J33rN3j20m7J72k5j64rO7k8R3J38j57j96L44
3741H6k10N7M39n19L39r9J99k43j68O3O0J10k01L3j84J27K58m27L04k7J2Q9p9
3764A9J84k83M07m52J55N1k41K67j83R4j50J75J27j74k19R9j32J88J43l7J06k98
3786a54J44r7L9N4j36J93k5O3j48J99J2l36K68j54j43R8l41N42l1J09%K16l95
3809b3k9L5j16J00K3M45n73K29k39J93o6O5O0j11K17l23M1j69K59J77k69k9J15
3832A2Pj37J73k89J73K03M3j18p6j4K00m14K52J3o9l6j03J84j33J66j1k4q4J90
3856A08k56J74j19R4q7o7N86k94l09K14R7j90N9M8QN1k11J19j07q9L6Ln4m3j24
3881c53K58P5K30q3j41O0R0k3k22K43j95K90j48j67J84k14J64J38l28N9K57l23
$$ plain form
3903 -149 85 -236 182 120 -33 95 30 59 225 155 22 28 117 114 -468 190 240 -64 -18 -5 -27 20 -121 -126 69
3928 69 -131 -145 235 -63 -198 41 -13 -56 173 131 -188 34 76 -158 -60 40 120 -73 -169 44 -97 142 -205
3951 -205 42 68 88 145 -98 20 -110 52 -90 -143 9 35 -46 -53 122 -215 89 9 -174 -28 -45 -42 251 282
3975 282 -285 -196 62 245 43 -94 -222 297 256 259 150 22 170 303 -36 -74 -3 -100 49 66 34 -89 214
3998 214 -56 64 -93 64 -203 -143 -92 -9 -154 -23 -27 -288 -207 14 287 -28 -3 225 160 65 106 14 -139 -49
4022 -49 -103 -215 -26 65 232 -182 -113 -41 -50 18 -153 -34 45 226 85 -66 -81 -76 -42 -306 -23 -150 123 139 39
4047 39 -67 49 133 -1 41 128 104 -138 -38 -57 -108 80 2 -7 -110 5 168 147 140 -8 -40 -110 350 -69 64
4072 64 -145 70 288 230 -73 53 17 92 127 140 236 -51 239 -51 19 36 5 180 -158 27 59 -183 -129 94
$$ packed form
3903a49K34l21M18o2j53J28o5K9J66p0j33OQ9ln82O58N0l04M6J3k2M7j41nJ95
3928F9k00j4L80k98j35K39n4m3K29m2l19K22M2k34R8J00Q0j93r6K13j41K39l47
3951b05K47K6K0N7k43J18j30J62j42n3J52K6q1pJ75l37L04q0j83J46j7LK93L1
3975B82n67Q9K58J83k02j37j28N19m1Lj09j28J48J33l39l8P1r7J49J7l2j23L03
3998B14k70J20j57J57k67O0N1Q3j45J31mk61Q1K21K73l15K5K28o5r5M1r2j53R0
4022d9n4j12J89R1J67m14O9P2rO8j71J19P9J81j41j51j5NL4k64K83j27K73J6j00
4047C9j06J16Q4j34M2Q7k4k42J00j9n1J88p8rj03J15J63k1pj48l2p0M60m19J33
4072F4k09K15K18n8l03J26l6P5L5J3R6k87K90k90P0J7l1J75l38J85L2k42N4K23
$$ plain form
4096 94 162 -89 -66 1 195 151 -295 70 113 204 270 181 196 271 -212 -80 -207 -58 -289 -98 129 -435 131 127
4120 127 48 27 -271 -30 25 20 -378 170 -165 -315 -82 402 21 20 -305 60 -91 -278 -31 396 62 -60
4142 -60 -45 -24 49 158 239 13 -2 -111 -149 224 -8 51 209 -324 128 -199 141 -34 -60 -95 76 -36 -303
4165 -303 -70 -37 349 -27 88 26 81 -21 -153 -214 -87 -28 -229 212 -191 -235 181 -96 -99 -228 -64 144 -92
4188 -92 134 25 178 28 9 355 -23 71 53 -48 94 69 204 -105 -84 -118 -44 111 86 -26 -72 -207 88
4211 88 154 -143 128 62 -170 -287 -77 26 12 205 17 20 -75 145 144 -185 47 150 -13 -104 -55 -181 41 52
4235 52 -101 19 122 -326 -195 -5 -18 -144 3 -119 -59 149 59 -134 -195 -89 5 -74 101 150 34 -20 88
4258 88 -44 -44 349 64 154 -18 14 -124 3 -45 55 5 -196 82 146 -66 -132 -98 3 120 -194 -66 -144 -124
$$ packed form
4096I4O8k51K3O7J94m4m46L65M3R1O6q9J5P5m83J32j27J49k31J91K27n64N66m
4120A27p9k1k98K41N5nl98N48l35j50K33M84l81jl25L65j51j87K47M27l34j22
4142f0J5K1P3J09Q1k26j5j09l8L73k32N9J58n33M52l27L40j75k6l5J71j12k67
4165c03K33L3L86l76J15o2N5j02j32o1J27N9k01M41m03m4M16k77lj29J64K08k36
4188i2K26j09J53j50j9L46l78R4j8j01J42k5J35l09K1l4P4J55k5j12m6j35K95
4211H8O6k97K71o6k32j17K10J03j4J93j88Lr5K20jl29K32J03j63r1M9j26K22J1
4235E2j53J20J03m48J31J90j3j26J47j22O0K08r0j93o1J06R4p9J75M9j16n4J08
4258H8j32%L93k85R0j72L2j38J27m8J00n0k01K78O4k12o6L4J01J17l14J28p8K0
$$ plain form
4282 -124 -114 -55 -55 59 -136 187 -52 249 -38 72 41 85 70 -38 60 1 75 -148 167 2 332 103 -122
4305 -122 57 3 222 -11 -111 -94 54 0 -86 -135 -59 54 -34 -161 101 -10 -132 -15 -84 -14 -120 49 197
4328 197 -243 48 122 -156 -367 61 -294 20 92 153 268 -123 -4 111 75 -95 0 -272 68 -305 112 -130
4350 -130 225 -167 133 97 -81 -63 30 -105 57 -54 147 33 62 94 2 176 -121 -250 -241 -227 -124 14 2
4373 2 33 36 -18 43 -127 -47 -81 -211 250 85 -2 -210 -109 99 104 135 37 -255 209 -62 -156 -199 -205 -47 -66 -100 34
4400 34 -213 317 248 -43 -45 -35 -231 -214 215 -97 150 -15 -73 1 -59 257 -304 -23 -228 -155 94 -53 -117 -243
4424 -243 -114 -56 24 -207 70 114 23 27 -263 166 29 -13 -29 85 65 -26 -16 218 37 -89 37 -208 -160 78
4448 78 -110 -149 109 105 87 -173 121 95 77 145 148 212 -93 355 240 57 -36 -60 -95 -172 103 109 37 176 -83 44
$$ packed form
4282a24J0N9%J14j95L23k39L01k87J10l1M4j5j08R8n9P4k23L15j65L30k29k25
4305a22J79n4K19k33j00J7J48n4q6m9P6J13q8j27K62j11j22J17o9P0j06J69J48
4328A97m40K91P4k78k11M28l55L14P2O1J15l91J19J15l6j70R5k72L40l73M17k42
4350a30L55l92L00l6j78J8R3j35J62j11K01j14K9L2r2J74k97j29RJ4J03J38j2
4373BL1Ln4O1j70Q0l4j30M61j65q7k08J01K08NL1r8k92M64k71r4m3oJ58j9l4J34
4400C4k47N30o9k91kJ0j96J7M29l12K47j65n8P4o0L16n61K81k05P3K49j47o4j26
4424b43J29N8Q0k31K77M4r1Mk90M29j37m2j6J14k0r1J0K34j81j26J26k45M8K38
4448G8j88l9K58mj8k60K94k6j8O8LO4l05M48j15j83r3k4l5p7K75Op2J39k59J27
$$ plain form
4474 44 139 -207 -67 -269 -128 -90 145 -57 33 -150 -166 61 9 -10 -158 0 -115 68 -121 -26 -133 334 127
4497 127 -310 -67 57 173 157 -19 -73 310 -179 -11 -101 198 -63 9 -83 188 -114 -14 149 106 -96 68
4519 68 60 42 72 113 -68 -172 53 132 -57 31 -208 -102 -116 -436 -78 -121 161 -52 152 31 219 56 -75
4542 -75 40 -171 -105 39 -36 164 375 -97 15 -39 194 -78 -194 53 43 7 120 -99 135 -87 89 30
4564 30 172 -186 161 -106 -61 43 5 4 218 206 88 66 -157 -27 69 228 38 -124 190 255 -85 -108 -74 -48
4588 -48 17 -115 -21 -13 -157 -216 -18 -327 -15 -210 27 -72 -39 -179 303 -95 -22 43 105 -70 54 114 -260 188
4612 188 177 90 -209 -7 121 225 126 102 -18 -138 17 109 140 121 52 -135 -80 92 -43 -60 -41 51 11 -196
4636 -196 121 151 62 -98 267 5 46 83 113 124 53 -25 5 106 -14 -120 7 4 -106 139 26 -176 26 -31
$$ packed form
4474D4R5l46J40k02J41L8K35k02R0j83j6K27n2j9j48J58j15J83j89R5j07M67k07
4497A27m37K43J24J16j6j76n4L83m89J68r0K99k61P2r2K71l02J00J63m3k02J64
4519F8qj8L0M1j81j04K25P9j89Q8k39J06j4l20L58m3K82k13K04j21J88j63j31
4542g5J15k11O6J44p5K00K11m72J12n4K33k72j16K47j0l6J13k19K34k22J76n9
4564C0J42l58L47k67M5J04l8jK14j2j18k2k23J30R6J59j90j62L14O5l40k3L4K6
4588d8O5j32R4Qj44n9J98l09L12j95K37r9L3j40M82l98P3O5O2j75J24O0l74M48
4612A88j1q7k99K02J28J04r9k4j20j20J55R2L1j9o9j87N5J72j35j7J9R2m0k07
4636a96L17L0q9j60L65k62M1L7L0J1p1p8L0J01j20j06J27lj10K45j13k02K02n7
$$ plain form
4660 -31 -93 135 174 38 -4 -179 136 -76 -22 -99 -117 -61 195 -42 17 -185 -45 144 -190 63 23 34 -229 -54
4684 -54 168 -100 119 -257 -197 -109 91 215 195 208 -66 -13 -86 174 -274 288 -42 16 37 141 -51 -138 -105 -190
4708 -190 246 155 -149 250 -117 95 -49 -126 257 -31 -39 -175 100 -17 46 142 8 204 -45 283 157 23
4730 23 106 -81 88 6 114 50 -99 -202 45 -68 265 -165 -53 170 1 9 -210 113 27 -96 95 106 308
4753 308 -243 126 -20 57 -25 -193 -180 176 3 71 -122 50 -53 -332 43 42 -208 -221 -57 136 -14 -276
4775 -276 -77 96 108 -140 167 -151 -12 -121 30 -48 79 110 -132 -209 -116 -78 -20 122 -50 35 112 -139 -10
4798 -10 146 -210 -122 90 -73 17 220 89 -83 -202 -150 288 138 -167 -254 126 98 96 0 115 77 83 -162 62
4822 62 104 69 12 177 -250 260 -27 64 -88 -98 -7 60 33 94 -88 -116 -116 145 184 -162 -251 14 -326 57 -12
$$ packed form
4660c1o2K28L9j36m2j75L15k12N4p7j8N6K56k37N9k02J40J89l34K53m0J1k63J75
4684e4K22k68K19l76O0Q8K00J24k0J3k74N3p3K60m48N62l30N8K1J04j92q7L3q5
4708a90M36r1l04L99l67K12j44p7L83k88qj36K75j17O3R6j34J96k49L28j26j34
4730B3Q3j87J69q2J08o4j49j03K47j13L33m30J12K23j69Qk19L23q6j23J91J1K02
4753C08n51L69j46P7q2j68J3L56j73O8j93J72j03k79L75jk50j3J64J93j50k62
4775b76J99J73J2k48L07l18J39j09J51p8J27L1k42p7R3L8N8J42j72Q5P7k51J29
4798a0J56l56Q8K12j63R0K03j31j72j19N2M38j50l05q7L80k8kr6J15l8Ok45K24
4822F2M2l5n7J65m27N10k87R1j52j0R1O7k7O1j82k8%K61L9l46q9K65l40L83o9
$$ plain form
4847 -12 -194 -79 -33 -125 -65 113 -151 -137 77 228 -61 -24 -13 31 265 -167 6 -138 -65 -125 44 169 -55
4870 -55 77 -10 69 6 -213 -18 -109 191 7 -11 121 219 155 -26 -114 -244 89 63 -84 27 225 70 -241
4893 -241 -26 -52 22 -8 222 -40 -281 36 92 127 217 -2 58 -103 116 189 -119 -73 27 11 78 87 -178 39
4917 39 90 101 54 250 129 218 -67 -1 5 -63 191 -52 92 92 164 67 218 242 77 -100 -159 402 -122 -200 175
4942 175 -150 -329 -115 31 136 -110 53 56 -137 107 -39 -53 313 -119 -36 6 3 -137 9 -83 -419 7 -41
4965 -41 146 -18 117 222 -81 160 -24 -133 -102 23 16 52 27 242 22 -5 -26 -19 135 44 -126 37 -16 175
4989 175 -48 -88 292 -27 -34 -35 -51 129 96 -67 45 -101 -77 413 218 111 68 -75 -31 53 143 -123 -323 254
5013 254 15 -141 116 192 41 135 -23 -92 42 -109 -104 149 -39 202 126 -113 117 25 104 -78 -326 -174 -77
$$ packed form
4847a2j82J15M6r2O0J78k64J4K14J51k89L7J1M4K34m32J73j44P3o0J69J25k24
4870e5J32q7P9o3k19J95r1L00j84j8J32R8o4j81q8j30L33k6j47J11J98j55l11
4893b41K15k6P4l0K30k62k41L17N6L5R0k19O0j61K19P3l08M6J00j6O7Rk65K17
4917C9N1J1m7J96j21Q9k85O6Oo8K54k43J44%P2r7J51K4j65j77n9N61n24p8L75
4942A75l25j79K14J46J05k46J63Lj93K44j46j4L66m32Q3M2lj40J46r2l36M26m8
4965d1J87j64J35J05l03K41j84j09L1J25pL6k5K15k20k7k1PJ54r1j70J63n3J91
4989A75k23m0L80l19pjj6J80l3j63J12j46K4M90j95j07m3j43M4Q4R0k66k00N77
5013B54k39j56K57P6j51R4j58o9J34j51NK53j88K41p6k39K30r2P9j82k48J52R7
$$ plain form
5036 -77 115 -34 40 205 -158 -166 20 -82 -5 178 -5 26 126 -85 -246 -216 278 304 -45 92 -112 -2 -49
5059 -49 -130 -228 -21 -78 -14 -119 -44 10 9 -37 214 -247 -138 51 -83 40 -308 6 242 -89 -34 255 117 -84
5083 -84 64 29 -33 13 -100 -205 114 230 -82 -265 -181 28 -89 -35 372 83 186 193 33 -243 83 59 -14
5106 -14 106 -79 262 168 210 70 -58 -9 199 -214 -146 91 90 2 69 -161 24 80 12 80 -141 14 -38 -97 104
5131 104 162 93 -293 44 27 -65 -95 -51 37 -83 -65 297 -145 -198 -108 -56 111 -56 -13 72 32 -36 287 -144 -176
5156 -176 29 98 8 -380 -89 -15 -35 3 -235 -148 -34 16 -47 -177 39 -74 -201 -95 -257 -88 -55 77 -59
5179 -59 -92 -36 -223 369 112 31 -92 -162 -170 105 111 5 -23 58 32 19 65 47 -152 -182 -112 -81 -18 -44 -64 -103 90
5206 90 -75 -145 -3 27 -99 66 -128 -74 -1 303 84 10 -76 334 110 -23 -118 44 -11 91 -18 -130 -58
$$ packed form
5036g7J92j49P4J65l63qJ86j02P7J83j83L1J00k11j61L0M94K6l49J37k04J10m7
5059d9q1r8K07n7O4j05P5N4jm6K51m61J09J89j34J23l48L14K36l31N5K89j38k01
5083h4J48l5o2M6j13j05L19J16l12j83Q4K09j17N4M07k89J03Pj60k76L26k4p3
5106a4J20j85L41r4M2j40j28M9K08m13O8K37jq8O7k30J85N6o8O8k21J55n2n9K01
5131A04N8o9l86L37j7r2l0M4Q8j20J8L62m42n3R0N2J67j67M3Q5m0o8L23m31l2
5156a76K05O9r0l88K91P4k0L8k38Q7J14N0o3j30K16j13j27J06j62J69L3J32j36
5179e9l3N6j87N92k57q1j23p0qK75Oj06k8Q1k6j3M6j8j99l0P0L1O3k6k0l9J93
5206I0j65p0J42L0j26J65j94N4P3L04k19p4q6M10k24j33r5J62n5J02j09j12P2
$$ plain form
5229 -58 44 -80 163 -86 159 12 -231 -24 76 5 -193 -106 425 -194 -44 -54 -109 -251 -84 140 84 -219
5251 -219 -171 137 -134 177 -161 -52 -181 -35 23 8 58 -317 -69 -85 3 52 -284 39 -255 36 -165 -410
5273 -410 129 -20 57 -147 -42 76 12 286 148 -235 -72 242 122 -214 -245 60 -148 115 80 161 41 -273
5295 -273 130 192 -347 58 -128 313 149 -75 26 -179 150 104 108 243 -106 -188 52 14 -29 -91 145 6 -20
5318 -20 -24 -225 39 -2 -15 194 -14 -51 -99 175 -218 140 -25 46 76 203 332 -117 37 96 -94 65 36 129
5342 129 103 -19 56 114 -40 52 -76 16 1 145 137 -28 142 -18 1 -7 87 164 25 -153 72 63 -24 -403 179
5367 179 -79 -35 83 4 -98 -147 357 225 72 52 -20 -17 -63 21 134 129 17 52 -42 -45 20 -106 -103 -35 -42 24 -184
5394 -184 0 517 185 101 0 147 -26 -61 30 69 60 166 258 109 -196 -8 260 155 30 241 20 -8 18
$$ packed form
5229e8J02j24K43k49K45j47k43K07J00p1j98Q7N31o19J50j0n5j42J67K24n6l03
5251b19M8L08k71L11l38J09j29J46N8j5N0l75K48j6Q8M9l36L23k94K91k01k45
5273d10N39j49P7k04J05J18o4K74j38l83J63L14j20l36l1L05k08K63l5Q1j20l14
5295b73M03O2n39M05j86M41j64k24J01k05L29m6MJ35l49q2K40l8m3o2K36j39k6
5318b0mk01K64m1j3K09k08l7m8K74l93L58j65P1L0J27J29m49J54N9j90J59k9R3
5342A29k6j22P5N8j54R2j28R2j5J44qj65J70j60J9qR4P7j39j78K25rq7l79N82
5367A79k58M4J18p9j02m9N04j32j53k0p2Lm6Q4J13nj12L5r4lO5j26LO8pO6k08
5394a84J84N17l32q4j01J47j73l5R1L9rJ06R2j49l05J88K68j05j25K11k21k8K6
$$ plain form
5417 18 -269 -26 67 8 113 1 15 141 89 -120 -42 -59 -48 -2 7 203 213 102 -107 -11 -44 -15 137 -157 -275
5442 -275 103 92 155 -86 93 89 127 46 -5 88 76 -117 -36 -290 157 -210 23 157 9 217 12 2 2 -294
5466 -294 -34 120 95 -5 36 178 -16 114 190 -174 -163 -126 59 128 -18 -52 20 93 162 -136 77 -20 -300 -57
5490 -57 229 58 90 62 103 -225 53 103 144 176 -151 -380 -120 75 147 -59 -156 109 -62 359 236 147 285
5513 285 -178 139 -166 -58 96 -135 135 275 -139 181 -222 148 1 309 -38 157 248 210 -135 134 -46
5534 -46 -2 65 48 -10 85 53 -59 -25 -13 -21 31 -238 -93 -9 25 -164 -60 249 -212 124 -32 210 -34 67 -21
5559 -21 -97 -31 64 -14 -26 -47 -157 136 -3 -154 58 -165 -25 42 112 -41 -9 -81 -248 287 47 -22 -89 -183 181
5584 181 406 -103 -123 272 -153 311 192 32 -160 26 84 58 -87 72 -75 47 -81 91 -31 218 74
$$ packed form
5417A8k87K43R3n9J05j12J4J26n2k09P8j7J1M6RJ96J0j11k09R6l3K9J52k94j18
5442b75L78j1O3k41J79mL8q1n1R3j2j93Q1k54M47l67K33J34j48K08k05j0%k96
5466b94K60J54k5j00M1J42j94J30P6l64J1L7J85O9j46l4P2P3O9k98K13r7k80K43
5490e7K86j71L2k8M1l28K78N0M1L2l27k29K60J95P2k06r7K65j71M21j23q9J38
5513B85m63L17l05J08J54k31K70J40m14L20m03L70j47L08l47J95R1l8l45K69j80
5534d6M4O7j7n8R5l2j12L4J2qN2k69J45Q4L4j89J04L09m61L36j56K42k44J01q8
5559b1p6O6R5p8j2k1j10K93j39j51K12k23J40O7P0j53L2p2j67N35k40o9o7r4L64
5584A81K25n09k0L95m25M64j19j60j92J86N8k6j45J59j47J22j28J72j22K49j44
$$ plain form
5605 74 75 -142 15 234 88 200 135 -257 -289 -84 56 82 31 149 -131 -167 -138 -65 -89 -9 104 -41 -402 -42
5629 -42 -172 -131 -9 -225 74 169 -20 18 -140 71 -175 -9 376 -96 120 61 144 -52 79 33 -229 -3
5651 -3 217 -37 -138 101 7 -53 33 -128 -237 -41 -35 -57 -246 20 -79 -173 2 232 209 -153 -17 133 360 40
5675 40 -73 125 182 418 -12 -397 243 -73 191 -66 94 146 -50 -131 -78 197 322 -56 -221 -58 -16 108
5697 108 -175 103 205 159 89 36 -243 94 -198 79 181 -145 -313 136 221 -92 -217 176 7 96 35 52
5719 52 -11 -94 27 -94 60 72 324 -86 -120 216 34 140 -121 -243 -9 -60 113 65 106 -68 53 26 -273
5742 -273 -27 166 75 30 29 -233 101 163 -47 -7 34 -97 67 81 41 107 163 365 -315 -87 -88 -62 -78 -105 -3
5767 -3 91 224 37 295 79 51 46 61 271 -286 102 -28 -30 -179 119 -83 93 145 -108 -72 -179 -26 -90 -130
$$ packed form
5605G4Jk17J57K19j46J12o5l92l2K05J40K6n1J18k80l6K9P3k4Q0J13j45l61L60
5629d2j30M1J22k16K99R5j89L8j58K11k46J66L85m72K16n9Q3j96J31m6k62K26
5651cK20k54j01K39r4o0Q6j61j09J96Ok2j89K66r9r4J75K30k3l62J36J50K27l20
5675D0j13J98N7K36m30l85O40l16K64k57J60N2j96q1N3K75J25l78j65J63M2J24
5697A08k83K78J02m6p0n3k79L37k92K77J02l26j68M49Q5l13j25L93j69Q9o1J7
5719E2o3q3J21j21J54J2K52m10l4L36j82J06k61j22K34n1J73m8M1j74J21k7k99
5742b73K46J93r1m5jk62L34O2k10M0M1j31J64J4m0O6N6K02o80K28jK6j6k7J02
5767cR4J33j87K58k16k8nJ5K10n57L88j30kj49K98k02J76N2k53L6j07J53o4m0
$$ plain form
5791 -130 219 -124 -102 -54 -53 9 -97 240 -152 -419 146 -49 59 -140 62 -58 136 -81 -177 275 -121 -301
5813 -301 -237 -302 -66 73 91 88 14 190 148 -49 90 -33 32 110 42 -255 -96 154 135 -292 -13 63 -250 -48
5837 -48 -211 -167 74 25 0 -45 -51 158 -107 -27 12 -97 -74 125 14 225 -52 294 56 127 -142 5 8 -216
5861 -216 -16 -7 -60 70 -145 -211 -177 -28 -20 336 199 68 -18 78 19 -91 71 2 191 -192 310 -52 -45 -188
5885 -188 -251 59 -30 -126 91 136 162 157 102 193 -74 -32 137 -25 57 25 -97 4 178 -43 -73 13 -369 -191 -203
5910 -203 -22 358 53 -101 84 -18 60 -25 53 -35 -70 -236 55 -109 -368 -98 -89 202 0 118 -36 40 -67
5933 -67 296 75 89 15 -80 -23 5 -212 -53 -191 294 -22 -8 -97 -119 140 -39 -195 -219 -30 135 126 -161 139
5957 139 -128 1 -158 36 0 -33 -12 161 85 121 -43 -447 -4 -37 155 159 -135 -227 -24 80 -169 -10 -116
$$ packed form
5791a30L49l43K2M8JO2j06L37l92k67N65j95J08j99K02j20J94k17r6M52l96j80
5813c01O4o5K36J39J8lp4J76m2j97J39j23O5P8o8k97J59K50j9m27K79P6l13K02
5837d8j63M4K41m9k5m5oK09k65Q0L9j09K3J99j11K11k77L46k38P1k69J47Lk24
5861b16K00Rn3J30k15o6L4J49QL56j37j31q6R6n9j10J62o9J89l83N02l62Pj43
5885a88o3L10q9r6K17M5K6nn5R1k67M2J69j62Q2l2j22J01J74k21l0Q6l82J78j2
5910b03J81L80l05j54J85j02P8q5P8q8l5j66K91j64k59K70RK91k02J18j54P6j07
5933f7L63k21J4p4r5N7K8k17J59j38M85l16J4q9k2K59j79j56k4J89J65rk87L00
5957A39k67J29j59J94l6l3K1J73p6L6j64m04M43l3J92Mk94r2K03J04k49J59j06
$$ plain form
5980 -116 -113 -151 98 -131 -37 -325 -44 74 -20 202 132 -9 -375 230 78 -69 266 -313 98 16 215 -62
6002 -62 85 310 13 197 48 -10 -74 182 81 -81 -94 -140 195 -123 27 -125 158 31 -44 16 241 95
6024 95 66 -55 -93 -163 -52 -297 -106 169 -40 -63 174 -29 76 -15 -155 -27 8 12 240 -207 -21 -41 -237
6047 -237 121 24 197 53 -109 -90 -28 189 49 -33 317 5 -146 -91 -11 -160 -9 -202 -180 -9 20 70 -242
6070 -242 -147 56 25 -96 -58 -193 -94 26 79 96 114 -61 142 112 6 104 68 -168 -22 -33 -8 -45 -233 -34
6094 -34 -95 -266 -4 108 110 -101 87 250 58 189 42 46 35 65 114 307 154 -165 100 -290 56 39 -265
6117 -265 -165 -137 -70 -24 21 17 -78 7 26 -21 77 -48 -56 76 36 -110 -212 -138 71 253 33 95 136 78 91 315
6143 315 244 36 113 -79 90 128 -184 -68 188 155 86 -177 67 -352 -169 93 -88 -252 -203 -165 -45 15 153
$$ packed form
5980a16Ll8K49k29R4k88K81J18r4K22p0j41l66O05j52j47L35n79M11q2J99k77
6002f2J47K25k97J84j49n8o4K56j01j62j3m6L35l18J50j52K83j27p5O0K25j46
6024I5k9j21l8p0J11k45J91K75k09k3K37k03J05r1j40J28L5MK28m47J86k0j96
6047b37L58r7J73j44j62J9O2K17j40q2L50l12j51N5Q0j49J51j93K2J71K9N0l12
6070b42R5K03l1j21L8j35R9J20N3J7J8j75K03l0j06R8l6k36J46j1K5l7j88J99
6094c4o1j71K62J12Kk11J88J63j92J31j47Mj1L0M9J93j53l19K65l90L46j7l04
6117b65J00K8O7M6M5mr5Q5J9m7R8j25qJ32m0j46j02P4K09J82k20O2M1n8J3K24
6143C15p1k08P7j92J69L8l12J16K56l3o9k63K44m19J83K62j81j64M9L8J20O0J38
$$ plain form
6166 153 -137 -113 1 89 11 -153 154 162 -175 145 29 -22 40 9 -44 16 -76 240 118 98 -97 28 27 -71 41
6191 41 43 -49 245 78 6 -23 41 52 -274 397 -143 -130 291 76 -42 157 109 18 -10 -6 -156 3 -71 14 -71 -132
6217 -132 -99 -135 -172 12 280 -54 13 -7 49 -97 3 -48 -191 -166 153 -21 24 122 87 175 -126 58 16 161
6241 161 -133 -43 65 188 47 285 54 -214 -290 -286 -45 -138 38 112 -136 -9 -78 -16 -250 219 -243 -121 -118
6264 -118 37 85 -18 165 -60 -166 -137 180 -95 -96 224 220 -243 66 -56 254 15 28 64 4 -31 -20 -93 -85 -307
6289 -307 10 -60 -89 219 104 218 -12 97 134 47 -62 -269 -14 0 44 -4 -214 35 -168 57 -45 -10 138
6312 138 -47 48 -132 18 66 -34 108 -103 100 -153 -74 -22 -148 -105 -104 -144 129 -93 -169 131 42 16 15 145
6336 145 -47 80 126 -6 27 -13 -24 -113 -138 0 -7 -140 -71 -165 -39 -136 22 -60 -128 -288 24 157 -2 -29 -55
$$ packed form
6166A53k90K4J14Q8p8j64L07Ql37L20j16n1O2l1n3O0r2L16j22k0j95J25jr8J12
6191D1Kr2K94j67p2k9O4J1l26O71n40J3M21k15j18J99m8r1k8Mj50J59p4Q5q5o1
6217a32L3l6l7J84K68l34O7k0N6j46J00n1j43K5L19j74M5R8l5Q8l01J84m2J45
6241A61k94R0J08J23j41K38k31k68p6MK41r3J76P4k48J27o9O2k34M69m62J22L
6264a18J55M8j03J83k25j06K9L17k75jL20mm63L09j22L10k39J3L6o0l5J1p3Qk22
6289c07L17p0k9L08j15J14k30J09L7q7j09k07K55J4M4m8k10K49k03K25j02L5J48
6312A38j85R5j80J50M8j00J42k11K03k53P9N2j26M3Jm0K73k22p6L00q9k6jJ30
6336A45j92J27M6j32L3m0j1q9k5J38pj33O9r4J26r7J58q2o8j60L12J33j59k7k6
$$ plain form
6361 -55 -71 -64 47 132 28 -51 -70 -35 -88 -46 -105 263 -161 -134 71 55 102 -186 -14 -44 20 -9 -70 12 28 -73 16
6388 16 -114 -19 99 196 128 107 -61 47 191 -193 107 -317 140 84 -313 -26 137 75 255 -108 -1 -127
$$ packed form
6361e5j6PJ11Q5j04p9j9L5n3M2n9L68m24K7K05j6M7k88J72l0O4k9o1Q2J6j01Q9
6388A6j30R5J18R7o8k1j68J08J44l84L00m24M57n6l97K87J63o2J80l63J07j26
$$ [...]
8191E1
##END NTUPLES=NMR FID
##END=
