##TITLE=1H_Pr T-164
 CDCl3
 8 sc, 
 2.06.2022
##JCAMPDX= 6.0         $$ Bruker NMR JCAMP-DX V2.0
##DATA TYPE= NMR FID
##DATA CLASS= NTUPLES
##ORIGIN= UXNMR, Bruker Analytische Messtechnik GmbH
##OWNER= root
$$ XWIN-NMR		Version 3.5
$$ Thu Jun  2 14:12:32 2022 Russian Standard Time (UT+4h)  she@DPX200
##.OBSERVE FREQUENCY= 200.13135
##.OBSERVE NUCLEUS= ^1H
##.DELAY= (6, 6)
##.ACQUISITION MODE= SIMULTANEOUS
##.ACQUISITION SCHEME= undefined
##.AVERAGES= 8
##.DIGITISER RES= 18
##SPECTROMETER/DATA SYSTEM= spect
##.PULSE SEQUENCE= zg30
##.SOLVENT NAME= DMSO
##.SHIFT REFERENCE= (INTERNAL, DMSO, 0, 15.7039)
##AUDIT TRAIL= $$ (NUMBER, WHEN, WHO, WHERE, WHAT)
$$ ##TITLE= Audit trail, XWIN-NMR		Version 3.5
$$ ##JCAMPDX= 5.01
$$ ##ORIGIN= Bruker BioSpin GmbH
$$ ##OWNER= she
$$ F:/spectra/data/she/nmr/H-F/1/audita.txt
$$ ##AUDIT TRAIL=  $$ (NUMBER, WHEN, WHO, WHERE, WHAT)
(   1,<2022-06-02 14:11:29.50 +0400>,<she>,<DPX200>,
      <created by zg, POWCHK disabled, PULCHK disabled
       configuration hash MD5:
       00 E9 B6 7A A2 85 ED C7 34 08 36 98 17 FE 4E 26
       data hash MD5: 16K
       0E 8F FB 92 2A 9E 98 B1 16 18 53 1E C6 47 0A 37>)
$$ ##END=
$$ 
$$ hash MD5
$$ AB A7 56 93 D0 BB 3A B5 26 48 3A 3B 56 54 1B 45
##$RELAX= 
##$RELAX= 
##$RELAX= 
##$RELAX= 
##$RELAX= 
##$RELAX= 
$$ Bruker specific parameters
$$ --------------------------
##$DU= <F:/spectra>
##$EXPNO= 1
##$NAME= <H-F>
##$PROCNO= 1
##$TYPE= <nmr>
##$USER= <she>
##$AMP= (0..31)
100 100 100 100 100 100 100 100 100 100 100 100 100 100 100 100 100 100 
100 100 100 100 100 100 100 100 100 100 100 100 100 100 
##$AQSEQ= 0
##$AQ_mod= 1
##$AUNM= <au_zg>
##$AUTOPOS= <>
##$BF1= 200.13
##$BF2= 200.13
##$BF3= 200.13
##$BF4= 200.13
##$BF5= 200.13
##$BF6= 200.13
##$BF7= 200.13
##$BF8= 200.13
##$BYTORDA= 1
##$CFDGTYP= 0
##$CFRGTYP= 5
##$CHEMSTR= <none>
##$CNST= (0..31)
1 1 145 1 1 1 1 1 1 1 1 1 1 1 1 1 1 1 1 1 1 1 1 1 1 1 1 1 1 1 1 1 
##$CPDPRG= <>
##$CPDPRG1= <>
##$CPDPRG2= <>
##$CPDPRG3= <>
##$CPDPRG4= <mlev>
##$CPDPRG5= <mlev>
##$CPDPRG6= <mlev>
##$CPDPRG7= <mlev>
##$CPDPRG8= <mlev>
##$CPDPRGB= <>
##$CPDPRGT= <>
##$D= (0..31)
0 1.2 0 0 0 0 0 0 0 0.06 0 0.03 0 0 0 0 0.0002 0 0 0 0 0 0 0 0 0 0 0 0 
0 0 0 
##$DATE= 1654164688
##$DBL= (0..7)
120 120 120 120 120 120 120 120 
##$DBP= (0..7)
150 150 150 150 150 150 150 150 
##$DBP07= 0
##$DBPNAM0= <>
##$DBPNAM1= <>
##$DBPNAM2= <>
##$DBPNAM3= <>
##$DBPNAM4= <>
##$DBPNAM5= <>
##$DBPNAM6= <>
##$DBPNAM7= <>
##$DBPOAL= (0..7)
0.5 0.5 0.5 0.5 0.5 0.5 0.5 0.5 
##$DBPOFFS= (0..7)
0 0 0 0 0 0 0 0 
##$DE= 6
##$DECBNUC= <off>
##$DECIM= 32
##$DECNUC= <off>
##$DECSTAT= 4
##$DIGMOD= 1
##$DIGTYP= 9
##$DL= (0..7)
0 120 120 120 120 120 120 120 
##$DP= (0..7)
150 150 150 150 150 150 150 150 
##$DP07= 0
##$DPNAME0= <>
##$DPNAME1= <>
##$DPNAME2= <>
##$DPNAME3= <>
##$DPNAME4= <>
##$DPNAME5= <>
##$DPNAME6= <>
##$DPNAME7= <>
##$DPOAL= (0..7)
0.5 0.5 0.5 0.5 0.5 0.5 0.5 0.5 
##$DPOFFS= (0..7)
0 0 0 0 0 0 0 0 
##$DQDMODE= 0
##$DR= 18
##$DS= 0
##$DSLIST= <SSSSSSSSSSSSSSS>
$$ [...]
##$SUBNAM2= <"">
##$SUBNAM3= <"">
##$SUBNAM4= <"">
##$SUBNAM5= <"">
##$SUBNAM6= <"">
##$SUBNAM7= <"">
##$SUBNAM8= <"">
##$SUBNAM9= <"">
##$SW= 18.05172834244
##$SWIBOX= (0..15)
0 0 2 0 0 0 0 0 0 0 0 0 0 0 0 0 
##$SW_h= 3612.71676300578
##$TD= 16384
##$TD0= 1
##$TE= 0
##$TE2= 300
##$TE3= 300
##$TEG= 300
##$TL= (0..7)
0 120 120 120 120 120 120 120 
##$TP= (0..7)
150 150 150 150 150 150 150 150 
##$TP07= 0
##$TPNAME0= <>
##$TPNAME1= <>
##$TPNAME2= <>
##$TPNAME3= <>
##$TPNAME4= <>
##$TPNAME5= <>
##$TPNAME6= <>
##$TPNAME7= <>
##$TPOAL= (0..7)
0.5 0.5 0.5 0.5 0.5 0.5 0.5 0.5 
##$TPOFFS= (0..7)
0 0 0 0 0 0 0 0 
##$TUNHIN= 0
##$TUNHOUT= 0
##$TUNXOUT= 0
##$USERA1= <user>
##$USERA2= <user>
##$USERA3= <user>
##$USERA4= <user>
##$USERA5= <user>
##$V9= 5
##$VALIST= <valist>
##$VCLIST= <CCCCCCCCCCCCCCC>
##$VD= 0
##$VDLIST= <DDDDDDDDDDDDDDD>
##$VPLIST= <PPPPPPPPPPPPPPP>
##$VTLIST= <TTTTTTTTTTTTTTT>
##$WBST= 1024
##$WBSW= 4
##$XGAIN= (0..3)
0 0 0 0 
##$XL= 0
##$YL= 0
##$YMAX_a= 75855
##$YMIN_a= -106719
##$ZGOPTNS= <>
##$ZL1= 120
##$ZL2= 120
##$ZL3= 120
##$ZL4= 120
##$ABSF1= 10
##$ABSF2= 0
##$ABSG= 5
##$ABSL= 3
##$ALPHA= 0
##$AQORDER= 0
##$ASSFAC= 0
##$ASSFACI= 0
##$ASSFACX= 0
##$ASSWID= 0
##$AUNMP= <proc_1d>
##$AZFE= 0.1
##$AZFW= 0.1
##$BCFW= 1
##$BC_mod= 2
##$BYTORDP= 1
##$COROFFS= 0
##$CY= 11.3945322036743
##$DATMOD= 1
##$DC= 2
##$DFILT= <>
##$DTYPP= 0
##$F1P= 2.36226072786647
##$F2P= -0.459571619588291
##$FCOR= 0.5
##$FTSIZE= 0
##$FT_mod= 4
##$GAMMA= 1
##$GB= 0.15
##$INTBC= 1
##$INTSCL= 1
##$ISEN= 128
##$LB= 0.24
##$LEV0= 0
##$LPBIN= 0
##$MAXI= 10000
##$MC2= 0
##$MEAN= 0
##$ME_mod= 0
##$MI= 1.114404
##$NCOEF= 0
##$NC_proc= 0
##$NLEV= 6
##$NOISF1= 3.799351
##$NOISF2= 2.8
##$NSP= 1
##$NTH_PI= 0
##$NZP= 0
##$OFFSET= 15.70392
##$PC= 1
##$PHC0= -18047.46
##$PHC1= 21.40074
##$PH_mod= 1
##$PKNL= yes
##$PPARMOD= 0
##$PSCAL= 0
##$PSIGN= 0
##$REVERSE= no
##$SF= 200.130013532006
##$SI= 16384
##$SIGF1= 3
##$SIGF2= 2
##$SINO= 400
##$SIOLD= 16384
##$SREGLST= <1H.CDCl3>
##$SSB= 0
##$STSI= 0
##$STSR= 0
##$SW_p= 3612.71676300578
##$SYMM= 0
##$S_DEV= 0
##$TDeff= 0
##$TDoff= 0
##$TI= <>
##$TILT= no
##$TM1= 0
##$TM2= 0
##$TOPLEV= 0
##$USERP1= <user>
##$USERP2= <user>
##$USERP3= <user>
##$USERP4= <user>
##$USERP5= <user>
##$WDW= 1
##$XDIM= 8192
##$YMAX_p= 0
##$YMIN_p= 0
$$ End of Bruker specific parameters
$$ ---------------------------------
##NTUPLES= NMR FID
##VAR_NAME=  TIME,          FID/REAL,        FID/IMAG
##SYMBOL=    X,             R,               I
##VAR_TYPE=  INDEPENDENT,   DEPENDENT,       DEPENDENT
##VAR_FORM=  AFFN,          ASDF,            ASDF
##VAR_DIM=   8192,          8192,            8192
##UNITS=     SECONDS,       ARBITRARY UNITS, ARBITRARY UNITS
##FACTOR=    0.0002768,     1,               1
##FIRST=     0,             0,               0
##LAST=      2.2672688,     0,               0
##MIN=       0,             -106719,         0
##MAX=       2.2672688,     75855,           0
$$ Real data points
##PAGE= N=1
##DATA TABLE= (X++(R..R)), XYDATA
0 0 0 0 0 0 0 0 0 0 0 0 0 0 0 0 -8 8 -8 8 -8 16 -16 16 -24 24 -32 32 -40 48 -56 64 -72 80 -95 104 -120 136
36 136 -152 168 -191 209 -234 263 -288 320 -354 391 -432 479 -527 578 -639 704 -776 855 -944
55 -944 1046 -1160 1291 -1443 1621 -1836 2097 -2424 2849 -3422 4247 -5538 7857 -13360 59235
70 59235 -8075 -73752 66087 56412 -2229 8618 1224 -54952 2696 59340 -26237 -85698
82 -85698 4626 30399 -13006 -3307 -4603 -38252 7120 51122 -10935 -56941 5222 20960 -17166
95 -17166 8291 9532 -44522 -333 70886 14696 -42965 19500 47554 -3510 12514 32266
107 32266 -39505 -35523 54497 20390 -72373 -31151 34039 -4358 -20273 14424 -16973 -32363
119 -32363 39218 39805 -42917 -32958 30647 11900 -18132 1302 -10718 -24827 23944 33841 -20689
132 -20689 -14324 31735 17146 3353 26894 -812 -34112 19489 42313 -31066 -48972 11190
144 11190 11745 -23013 -5055 -441 -28265 3654 40469 -6863 -33357 13966 25022 -6901 -920
157 -920 5442 -20682 -3146 35273 280 -35347 7899 31472 -74 -3257 9623 -7618 -3735
170 -3735 24276 -394 -36865 -4753 19253 -14814 -19181 6610 -4724 -12816 16305 16241 -14077
183 -14077 -1481 24598 5480 -6316 9301 -234 -13254 6598 8175 -17634 -12764 9447 -281
196 -281 -9108 5967 1182 -11090 8863 14815 -11140 -9702 12516 2499 -10437 5152 5227 -12563
210 -12563 1858 20724 -2204 -14280 11392 15928 -6176 -4518 5950 -4195 -8001 2104 -3903
223 -3903 -14472 -4317 2416 -5505 -3808 1712 -1112 2074 9226 3130 -1612 6382 7929 -25 2278
238 2278 4961 -4095 -1823 9177 -634 -10587 2341 8642 -5466 -8171 5036 1356 -9640 -1465
252 -1465 3809 -7516 -7809 2893 774 -6525 -1902 4615 1590 -1232 3946 4748 2229 3059 3599 3259
268 3259 2237 524 1477 1442 -1557 -1833 1145 704 -3943 -2992 3062 -561 -6497 -1090 3272 -2609 -5566
285 -5566 588 1617 -4035 -2859 2676 -183 -3268 1094 3396 -138 -925 2909 4266 197 426 3918
301 3918 2754 67 1182 2623 158 -1983 10 1620 -3011 -3880 -374 39 -3568 -3435 287 577
317 577 -2855 -1381 1878 124 -2163 244 1761 -703 -1627 1153 1840 -1435 27 3374 1775 11
333 11 1953 3497 2208 139 1196 1422 -468 -1335 -700 -969 -2431 -2998 -643 214 -2684 -1676 1965
350 1965 944 -2376 -350 2601 -773 -3904 356 694 -4081 -2411 1771 -372 -1832 2292 4385
365 4385 1477 2571 5637 3155 1695 3322 1822 -681 -233 -1144 -2326 -1785 -2285 -4392 -2590 991
381 991 -2198 -4271 1481 952 -5293 -1132 2889 -3988 -5806 2672 2238 -5176 182 6994 994 1091
397 1091 9416 5991 98 6412 8733 -409 -2089 3008 -1623 -6217 -1826 -3703 -9408 -2780 134
412 134 -6994 -4868 2536 -1473 -3873 3794 1772 -6374 1399 7675 -4663 -4917 8540 4230 -4712
427 -4712 6018 10869 -895 920 13020 3776 -6049 5146 4648 -9437 -5157 2173 -9197 -11371
441 -11371 1020 -2193 -11199 -891 4771 -5254 -556 9262 -1349 -4183 9460 4870 -8168
454 -8168 2314 9327 -4480 -3057 11325 1107 -6658 10282 10231 -7904 356 12926 -4121 -11330
468 -11330 5493 465 -16177 -4018 4734 -11928 -9560 7950 -1020 -9564 7221 9572 -5524
481 -5524 1285 12562 -978 -4174 9802 1327 -10160 6071 7947 -10279 -2078 13344 -1833
494 -1833 -8982 10411 6622 -12509 403 11421 -10019 -12084 7961 -2406 -15901 2443 7243
507 7243 -11595 -3795 14927 255 -7449 11970 7993 -8102 5756 11782 -9996 -7429 12111
520 12111 -314 -14414 3156 6822 -9520 642 11373 -7620 -7415 14532 4060 -14634 1931
533 1931 9268 -10466 -5478 10770 -5975 -13569 11788 10279 -12536 -312 15461 -2022 -6007
546 -6007 11962 1248 -14187 3939 9596 -12443 -9516 7702 -3430 -8105 8684 2211 -12336
559 -12336 6445 16376 -6482 -7547 12574 2259 -9274 7609 4733 -15648 -678 16499 -5208
572 -5208 -14588 8322 7718 -8497 2883 7612 -11506 -4719 13929 -3165 -16762 2521 6453
585 6453 -9674 -1536 8871 -6692 -5542 15892 7119 -10003 4607 12203 -2911 -126 9003
598 9003 -6243 -10038 10242 5219 -15213 -3431 9306 -5310 -4740 8386 -3931 -12084 8368
611 8368 10049 -13056 -8527 9354 -414 -7533 5351 776 -9561 6867 14076 -5043 -5320 11598
625 11598 6417 -3523 5314 2787 -8889 2214 9637 -8345 -11438 5001 1811 -8609 602 2822
639 2822 -9805 -2098 11664 -2530 -12071 3906 6436 -5585 -251 5095 -5115 -2637 11313
652 11313 3694 -8210 3424 10547 -632 -452 6094 -2342 -4063 6796 2028 -10313 -3282 4504
666 4504 -3905 -5240 1837 -4079 -6098 5059 3416 -8240 -2022 7145 -444 -3833 4265 975 -5110
681 -5110 4070 7192 -4167 -2798 7463 3258 -2541 3162 2995 -3703 1129 5859 -3058 -6214 2426
696 2426 1056 -4687 -974 -231 -4433 -745 3659 -2518 -4716 2366 2974 -3066 620 2666 -2740 -300
712 -300 5089 83 -4012 2172 4560 -997 -606 3199 -76 -1257 3563 1622 -3373 -167 2700 -876
728 -876 -2847 866 -370 -2215 218 -46 -2998 -1529 1221 -1143 -1482 288 -391 -1235 1071 1381 -1322
745 -1322 170 3017 453 -1069 2252 1461 -638 1098 2426 87 -664 1889 1232 -1348 347 1025
761 1025 -1427 -1486 128 -1105 -2393 -1654 -786 -1755 -1945 -1011 -967 -515 178 137 606 1292 1307 906 1716 1565
781 1565 745 1069 1827 972 -175 807 1009 -204 77 869 -40 -888 -568 -605 -1557 -1918 -933 -1782 -2483 -1827
801 -1827 -1120 -1248 -910 -28 616 608 637 1634 1890 1778 1372 1513 1803 746 112 790 349 -208 -219 175 -34
822 -34 -714 -93 452 -713 -1283 -394 -1368 -2039 -1180 -1442 -1588 -1927 -622 22 -417 690 1567 1035 1771 2251
842 2251 1554 1503 1268 773 204 271 -176 -828 -575 448 -1596 -1106 898 -230 -1020 321 596 -1132 -1251
861 -1251 437 -787 -2614 -194 267 -1762 -600 1679 116 17 2325 2320 -53 902 2472 160 -625
878 -625 939 -1172 -1897 396 -127 -2304 -532 1318 -552 -602 2252 331 -1450 2034 1801 -2683 -1344
895 -1344 1564 -1178 -2381 838 292 -2755 874 3054 -1452 -1898 3290 1474 -1333 933 633 -2669
911 -2669 -615 2648 -2068 -3563 2056 1813 -1600 1417 2450 -1384 1075 5101 236 -3520 1654
926 1654 2084 -3344 -1460 1180 -3909 -2723 3545 -206 -5262 634 4025 -1519 -1011 3133 -1203 -2761
942 -2761 4164 2142 -5213 -896 4468 -324 -1484 3373 716 -1871 4935 4983 -3942 -1398 4962 -358
958 -358 -3562 1065 -2046 -5764 1126 2763 -6703 -4893 4615 1366 -4065 2213 2145 -3488 2359 6256
974 6256 -2723 -4713 4896 3846 -2994 828 3122 -2727 1119 7438 -919 -5397 4020 4276 -3997
989 -3997 -1781 1120 -5014 -3630 4279 -2255 -9342 511 4605 -3470 -1855 3772 -1257 -1371 7187
1004 7187 2669 -6800 1231 7967 -1466 -3091 4199 -389 -3348 5398 3879 -6516 -1663 7382 -395
1019 -395 -5214 1796 -331 -5720 1791 2318 -7889 -4949 5079 152 -5447 1743 1710 -3833 3493
1034 3493 7303 -4082 -3669 7884 3619 -4438 1438 3469 -4044 289 6596 -2804 -6793 4966
1048 4966 4659 -4879 -1423 2895 -3422 -2392 4892 -2180 -8155 1812 4387 -4898 -2833 3754 -1859
1063 -1859 -2161 6133 1300 -5713 2448 7162 -2178 -2660 4501 -487 -3381 5110 2245 -6901 -137
1078 -137 6496 -1585 -4296 3358 757 -4666 2605 3722 -6305 -3021 5702 -422 -5469 1582 1628
1093 1628 -4130 1090 4313 -3485 -2802 5774 1779 -4339 1657 3156 -2782 653 4727 -2408 -4053
1108 -4053 4388 2811 -4411 604 3754 -2812 -1540 4318 -1353 -5033 2515 3056 -4511 -1800 3166
1123 3166 -2360 -3234 3231 -102 -4903 1513 4087 -2646 -1653 3508 -61 -2162 3507 2378 -3291
1138 -3291 1155 4758 -1338 -2138 3376 667 -2692 1592 2080 -3437 -1338 3219 -1341 -3563 1723
1153 1723 674 -4023 58 1877 -2779 -2184 2617 -35 -3257 1222 2262 -2070 389 3387 -160
1168 -160 -1083 3391 1506 -1491 1267 2456 -1567 -1008 2268 -678 -2706 1163 501 -3042 -649 1670
1184 1670 -1706 -2148 1626 298 -2875 469 1407 -2102 -920 2111 -478 -1263 1832 1459 -696 1019
1200 1019 2496 139 -122 2354 646 -1184 875 352 -2018 -796 597 -1437 -1701 475 16 -1766
1216 -1766 345 1145 -987 -601 1219 -142 -898 732 652 -1131 -244 1137 -73 -347 1389 830 -166
1233 -166 1001 1392 91 -309 903 -217 -1176 -300 -272 -1317 -710 -149 -736 -205 616 491 73 656 778
1252 778 -241 121 600 -688 -840 -81 -463 -1154 -484 355 -134 -219 791 839 373 485 892 -187 -316
1271 -316 211 -95 -700 -515 63 -337 -343 516 469 485 786 485 49 245 -78 -580 -659 -939 -1172 -1290 -784 -733
1293 -733 -679 -72 331 284 869 1159 951 848 818 883 374 -36 330 -111 -262 411 263 -16 352 214 -15
1314 -15 194 -41 -406 -748 -779 -898 -1513 -1300 -1027 -1564 -930 -323 -132 136 995 1513 936 1642 1938 1050 810
1335 810 1270 264 -117 -214 261 -500 -496 284 -275 -510 211 -91 -791 -678 -928 -1423 -1407 -982 -1343 -1485 -739
1356 -739 -139 -468 380 1546 626 1339 2499 2007 816 1609 1594 95 -321 564 -807 -1229 109 -230
1374 -230 -1703 -715 397 -946 -1180 39 -476 -1497 -164 64 -1967 -1126 555 -738 -656 780 790
1391 790 233 1821 2535 803 818 2578 1184 -501 869 613 -1903 -428 471 -1997 -2486 405 310
1408 310 -1950 -129 785 -1225 -223 1669 -824 -2148 689 1202 -1290 -160 1256 -792 -212 2786
1424 2786 888 -1150 1684 2883 -165 258 1534 -718 -1186 1526 -132 -3354 -770 1547 -1328
1439 -1328 -1645 1032 -748 -1469 2037 1623 -2791 -936 2700 33 -1828 917 207 -1844 1567 1882
1455 1882 -1836 -964 3184 1304 -1424 1022 971 -1719 1313 2528 -2514 -2621 2401 1064 -2341 -238
1471 -238 1089 -1718 377 2989 -1494 -2820 2103 1985 -2055 -823 684 -1836 -752 3059 -1032
1486 -1032 -3604 1558 3246 -1378 -993 2027 -666 -488 3237 421 -3378 647 3438 -883 -2092
1501 -2092 1027 -779 -1581 2531 744 -4114 -465 3434 -602 -2458 556 -23 -2201 1875 1594 -4036
1517 -4036 -1594 3849 563 -2607 777 928 -1141 2068 2650 -2607 -1975 3748 1945 -2234 87 1137
1533 1137 -1498 605 2451 -2665 -3587 2514 1953 -3150 -1521 1133 -1701 -39 2840 -1949 -3981
1548 -3981 2270 3405 -1936 -1353 1881 -438 -128 3555 -358 -3327 1703 4140 -1214 -1594 1692 156
1564 156 -977 2169 55 -4197 -220 3064 -1463 -2913 406 -219 -1230 2155 1158 -3507 -274 4262
1580 4262 269 -2559 1011 988 -1145 1336 1534 -2966 -1442 3737 856 -2586 476 1349 -897 855
1596 855 1966 -2059 -2120 2705 1359 -2857 -954 1055 -1035 -375 1862 -1450 -2466 2345 2496 -2017
1612 -2017 -874 1405 -270 -622 1239 -794 -2848 1068 2320 -1746 -1352 1421 169 -592 1895 770
1628 770 -1927 1169 2908 -915 -2013 1161 270 -1366 714 37 -2424 57 2466 -390 -1752 915
1644 915 906 -1006 286 563 -2370 -1117 1603 -446 -1814 197 1131 -604 954 1747 -187 57 2758
1661 2758 1605 -1027 244 1161 -557 -586 325 -1441 -1860 811 493 -1537 -649 594 -292 -488 602
1678 602 -420 -1338 266 434 -1403 -1064 778 207 -197 1356 1326 -19 1754 2278 603 243 1208 546
1696 546 -778 -95 -498 -1797 -1036 3 -1343 -1534 -264 72 -830 -283 618 -503 -279 883 -392
1713 -392 -728 301 419 -118 522 1257 485 941 1655 1333 328 1031 1046 -87 -96 -43 -808 -1404 -887 -1124
1733 -1124 -1658 -1363 -222 -760 -456 235 89 40 518 645 283 376 498 380 71 588 689 -77 740 979
1753 979 657 889 1221 580 50 44 -225 -768 -926 -710 -1388 -1597 -787 -878 -861 -331 255 34 486 825 1003
1774 1003 259 808 777 73 233 554 -119 169 252 234 214 589 582 350 264 165 -126 -473 -773 -732 -948 -1015 -674
1797 -674 -746 -569 -104 34 282 348 799 505 785 659 336 33 78 214 -379 -322 -301 -262 -301 421 180 107 472
1820 472 246 84 90 104 -255 -451 -136 -563 -631 -328 -100 -377 -200 453 298 249 612 568 159 318 166 -493
1842 -493 -588 -169 -575 -628 48 24 -379 295 549 529 322 785 516 11 105 228 -471 -307 113 -447 -765 -160
1864 -160 107 -555 73 511 -228 -178 583 -177 -880 37 107 -655 -700 36 -290 -500 669 711 -24 908 1123
1885 1123 266 404 814 260 -545 470 307 -1107 -329 409 -888 -667 470 26 -967 171 379 -710
1903 -710 -555 610 -23 -955 616 -97 -873 428 1126 116 -388 1419 959 -591 918 1122 -593
1920 -593 -103 1019 -511 -925 432 -223 -1340 -374 521 -1054 -798 829 -364 -1383 411 641 -978
1937 -978 180 852 -442 -498 1041 673 -892 700 1352 -289 -132 1393 160 -786 887 601 -1061
1954 -1061 -275 1087 -789 -989 687 -164 -1679 374 443 -1137 -244 1172 -589 -1140 1085 704 -1338
1971 -1338 271 1289 -778 -287 1618 116 -864 1019 1045 -1033 97 1321 -484 -905 1300 137
1987 137 -1486 408 1143 -1240 -904 1119 -415 -1456 708 556 -1886 -229 1339 -723 -895 1174
2003 1174 147 -971 870 1092 -1063 -112 1712 80 -1020 875 637 -1043 692 1358 -917 -559
2019 -559 1748 316 -1558 635 700 -1299 -414 1073 -1113 -1610 853 209 -1738 -41 993 -854
2035 -854 -267 1881 -78 -1130 1351 1370 -1236 -133 1248 -233 -545 1389 133 -1281 741 1642
2051 1642 -977 -576 1145 -378 -892 681 -76 -2317 -274 719 -1073 -1353 629 4 -820 846 1115
2068 1115 -1025 45 1702 234 -1005 1114 650 -711 745 1034 -891 -518 1860 357 -1190 281
2084 281 929 -821 -182 623 -1325 -1584 523 -341 -1872 -467 581 -989 -225 966 -314 -681 1452
2101 1452 1498 -556 232 1436 156 56 1163 70 -966 457 989 -919 -600 666 -16 -812 628
2118 628 -312 -1476 40 590 -1135 -1469 363 -139 -996 225 493 -835 250 1771 369 -236 1165
2135 1165 1078 -293 538 596 -777 -447 926 -241 -900 149 238 -727 86 409 -833 -679 887 59
2153 59 -1194 -368 402 -543 -255 262 -509 -348 1083 762 -363 336 890 190 53 516 -216 -549 118
2172 118 81 -759 -749 282 -37 -454 420 482 -488 126 599 -401 -46 40 223 -473 82 -32 -352 14 603
2193 603 -23 -248 839 310 -155 205 299 -80 -253 214 -426 -703 -186 -70 -367 -262 442 62 253 750
2213 750 266 113 207 595 -51 -255 44 -418 -669 198 -68 -597 -71 39 128 -187 182 191 -255 -64 135
2234 135 -222 -275 124 -350 -145 231 344 -61 251 665 309 173 924 70 56 15 -289 -401 -393 -248 -761 -691
2256 -691 -198 -193 -192 -74 127 277 191 377 92 293 159 167 5 17 207 273 522 236 434 309 198 529 -36
2279 -36 -185 127 137 -741 -343 -508 -655 -731 -414 -547 -563 -37 -32 -4 -20 414 349 281 315 245 186 397 213 372
2303 372 479 -20 109 193 395 -33 -213 119 27 -208 -138 -497 -366 -612 -510 -353 -442 -71 -34 -359 -194 444
2325 444 294 343 418 570 255 580 586 219 127 282 213 75 146 143 66 263 -32 -426 -374 -52 -261 -513 -264 -236
2349 -236 -830 -311 -181 -425 -439 68 186 -7 237 336 209 238 649 240 -156 370 521 -39 130 350 -259
2370 -259 -284 231 123 -620 -159 297 -525 -255 56 -418 -665 -6 -59 -590 -186 376 130 6 320 211 -240
2391 -240 663 512 -244 -243 551 126 17 341 5 -412 292 569 -362 -344 347 278 -392 338 24 -852 -149
2412 -149 563 -390 -616 108 221 -333 70 503 -192 0 778 48 -662 447 667 -68 290 467 -90 -191
2432 -191 756 213 -423 135 745 -146 -127 180 -158 -802 403 422 -937 -419 211 -88 -204 114 -478 -675
2452 -675 508 616 -663 -210 779 -71 -128 492 202 -449 403 962 -583 -383 895 267 -475 543 62
2471 62 -839 -21 968 -492 -986 303 164 -699 293 155 -1103 -220 843 -124 -1034 243 580 -414 283
2490 283 753 -265 -123 1110 304 -675 382 688 -226 -227 312 -463 -587 667 170 -1281 -299 474 -552
2509 -552 -569 292 -535 -679 663 312 -848 -221 787 -108 -350 500 -9 -387 634 826 -413 -279 1063
2528 1063 260 -216 368 405 -877 212 881 -802 -733 491 42 -733 357 518 -707 -48 921 -284
2546 -284 -910 304 146 -676 -10 361 -424 -290 966 -31 -458 589 822 -347 -62 510 -514 -360
2564 -360 659 48 -845 49 694 -263 -454 714 -249 -470 373 431 -687 -162 433 -61 -555 133 -11
2583 -11 -351 36 354 -687 -248 846 284 -338 355 121 -76 147 483 -311 -386 642 -11 -333 217 129
2603 129 -329 -23 637 -389 -512 260 274 -485 -219 232 -717 -252 321 -321 -512 164 524 -462 40 754
2623 754 136 230 881 324 -245 51 404 -169 -389 377 -124 -578 299 -50 -426 -126 250 -432 -575 157
2643 157 -139 -439 -18 152 -617 -339 419 -105 -224 161 472 20 355 890 27 71 299 298 -143 100 194
2664 194 -135 -126 89 -156 -513 85 -69 -582 80 -159 -588 -254 -171 24 -631 129 219 -199 -124 386 263 -34
2686 -34 532 270 388 189 613 41 -177 282 -85 -213 -61 145 -424 -170 31 -167 -274 119 47 66 1
2707 1 -47 -263 9 33 -53 -83 27 343 129 194 604 335 266 568 111 43 -20 123 -321 89 189 -19 -82 89
2731 89 -292 -125 44 -116 90 -225 260 -23 -132 67 296 -338 -228 77 8 -200 207 321 62 -81 194
2752 194 -132 46 -20 -99 99 160 48 -71 -413 -242 127 -301 -28 -182 -149 20 -112 -350 -147 141 -97
2773 -97 -48 63 -43 -134 -43 80 -213 37 296 196 167 176 349 292 157 228 16 -55 253 -35 -244 -17 121
2796 121 -211 -97 178 -189 72 -389 -148 -242 -189 -407 -28 -91 -40 -160 169 181 197 -139 90 218 62 -3
2818 -3 299 184 73 94 582 -19 -211 -17 -209 -68 15 -2 -300 -165 -117 -322 -294 -204 -154 -392 -5 -146 -79
2841 -79 64 322 -22 -58 201 31 -259 243 264 88 305 358 289 -120 159 42 -80 -243 295 -273 -178 -334
2863 -334 -200 -543 -153 6 -113 -207 135 -55 -138 330 166 111 -12 178 -18 -204 45 -41 -103 380 180 -213
2885 -213 -338 208 90 -229 75 -139 -322 -275 -115 -291 -469 93 -85 -107 -78 -17 -229 26 94 -113 -117 249
2907 249 183 7 56 137 -320 -177 470 76 -324 362 316 38 75 316 -153 -273 286 100 -677 -168 -114 -204
2929 -204 -343 341 -229 -674 498 68 -278 -346 353 -79 -241 -9 -184 -303 308 342 -402 -97 627 37
2949 37 -155 368 -89 14 523 378 -313 -397 185 -213 -239 124 -78 -209 -124 555 -278 -518 179 85 -371 -49
2971 -49 54 -350 -104 520 -411 -217 260 561 -23 63 541 -14 221 611 -7 -428 290 276 -365 -176 -75
2992 -75 -339 -102 48 -284 -618 -203 156 -112 15 195 -121 -395 492 25 -470 243 346 236 70 126 93
3013 93 79 793 744 -113 -155 458 -133 -625 -193 20 -419 -146 12 -491 -623 -66 23 -408 -23 -48 -266 176
3035 176 532 116 -510 434 449 -214 272 296 -72 8 619 -152 -279 515 444 -38 -340 231 -268 -406 -13
3056 -13 -521 -538 119 -8 -237 -328 192 -172 -145 650 167 -584 46 639 225 -336 82 53 -90 325 665 -344
3078 -344 123 645 197 -135 -10 105 -275 44 172 -427 -439 248 129 -294 -123 -34 -448 182 195 -232 -294
3099 -294 71 161 -269 120 210 -306 -141 349 -194 -340 198 370 -225 353 128 215 -55 160 19 -335 -59
3120 -59 242 -109 -168 134 -95 79 277 -2 -408 -147 191 65 -242 -172 -173 -120 206 308 -287 -40 339 392
3142 392 -54 213 -55 132 206 123 -245 -263 338 -19 -74 -209 -199 35 -155 127 -80 -231 512 180 -261 44
3164 44 406 21 200 279 43 -177 339 294 39 158 326 31 61 -81 142 28 14 27 -80 71 18 70 -120
3187 -120 126 -154 -15 -14 -82 -71 -312 -75 84 20 75 110 -48 -2 180 35 241 28 206 -23 250 33 -88
3210 -88 -92 -61 -226 -304 25 107 -128 38 63 -295 -383 62 -275 -188 -33 94 -157 -65 -187 81 185 -60 202
3233 202 -9 102 -4 96 -135 134 59 -62 47 -95 -20 -133 -84 283 -212 106 223 -273 -207 -144 -303 224
3255 224 -1 -145 -52 -109 202 -167 21 12 84 163 270 371 -120 287 97 -195 -199 -1 40 62 50 73 54 -117
3279 -117 142 336 -198 46 -85 -22 -273 4 -303 -129 -185 -89 90 245 74 -50 96 -26 86 90 206 80
3301 80 -44 -37 -119 147 -55 220 193 8 -218 80 114 -29 -99 1 13 -290 -79 -128 -196 -116 -352 -409 -134 25
3325 25 -274 147 178 -1 211 241 -10 218 -61 112 104 90 -249 109 312 119 60 -16 111 267 -149 -186 35
3348 35 -29 -236 -273 -156 -84 -120 -83 -170 18 -40 110 321 241 319 34 205 -62 -90 184 159 -297 -93 -51 82
3372 82 -20 -86 51 -113 -286 90 -239 -147 -83 -149 -295 -97 -159 -176 -247 155 -185 -132 192 108 12 68 412 65
3396 65 193 170 34 -265 14 123 144 -227 41 -43 -108 316 122 -248 -44 -105 -139 -209 -237 -180 -344 -113 139
3419 139 -35 -74 394 160 -109 200 278 -92 42 553 195 -217 364 -136 -189 330 -23 -204 -29 -162 -31
3440 -31 -59 116 169 -219 62 57 -310 -216 176 36 -299 -37 314 -197 75 447 -60 71 408 216 -293 66
3462 66 -42 -148 -78 318 -83 -302 117 -120 -473 -177 277 -51 7 -138 -294 -120 141 311 -341 -148 113
3483 113 -313 -233 63 56 91 280 284 -61 -72 144 -108 -213 101 115 -265 -12 254 -33 -233 138 -2 -91 -58
3506 -58 142 -190 -223 265 -170 -543 -104 -91 -456 38 99 -262 -92 180 172 -172 174 173 218 -29 211 107 -128
3529 -128 368 189 -18 335 293 -126 -165 373 -125 -86 64 80 -151 -351 -10 -274 -217 -31 -242 -275 52 33
3551 33 -22 -124 309 -51 201 197 262 -47 -76 93 161 -228 343 132 -227 224 289 -271 -20 165 49 -61 -97
3574 -97 -103 -64 -151 144 -305 -171 22 56 -178 18 321 21 47 334 104 -83 240 151 -107 360 174 181 -174
3597 -174 -12 196 -256 19 78 -398 -92 71 73 62 189 19 -138 200 120 -143 -172 425 -178 -103 218 89
3619 89 -313 -27 149 40 7 227 279 211 -73 32 -87 -212 40 176 -287 -90 92 -165 -283 -204 168 -179
3641 -179 183 -203 -124 136 -86 -155 -69 238 38 -54 50 116 -227 -54 167 -42 46 133 -138 -73 297 -35 -185
3664 -185 -49 14 -123 -198 -97 -141 -136 -134 -80 -72 -319 144 -104 -185 -7 18 -286 124 201 -107 41 116 187 -18 51
3689 51 277 84 95 62 33 59 -134 -4 -71 173 -237 -47 -41 59 0 -135 -14 -184 -75 74 123 -101 -162 -17
3713 -17 -136 136 -22 162 316 129 180 -17 -20 -204 56 150 157 -98 -28 -184 196 -104 -265 -99 -274 -99 46
3736 46 -187 -277 -17 184 -100 -113 159 27 -17 -219 253 173 23 285 193 277 62 345 161 -228 213 -178
3758 -178 -60 67 167 -480 -2 179 -83 -23 -313 116 23 42 157 -123 -50 47 -18 -12 59 -135 -44 237 120
3781 120 104 35 280 4 97 64 282 -133 22 -58 79 -259 -95 -217 -16 -112 -89 -88 -37 -117 -62 -95 -125 -47 -118
3806 -118 43 -293 89 155 79 56 2 203 256 284 -85 116 -8 88 -94 -130 -149 -15 57 129 -140 22 -45 -75
3830 -75 -295 208 -126 14 25 -189 -107 50 153 -126 -34 249 48 -190 231 373 -85 222 226 -35 11 181
3852 181 -21 -97 13 23 69 -95 1 -193 -244 270 148 -255 -54 -41 194 186 -281 -163 -56 35 -175 -442 56
3875 56 -5 36 -71 21 -215 102 190 242 134 238 180 -34 -198 -114 -115 -200 90 172 -208 -133 252 24 -217 62
3899 62 -201 -158 -43 214 -179 -114 19 -110 -3 -38 -68 -110 -162 166 55 19 160 -6 60 162 53 -168 -44
3922 -44 195 298 -291 120 -452 -66 -105 -32 -270 -361 111 64 -225 -114 13 -47 -4 274 -107 -57 210 139 107
3945 107 227 -78 5 292 75 -42 -50 56 193 -244 -121 93 76 -197 35 -58 -148 -238 -54 -94 -147 -12 -200
3968 -200 197 -17 166 -228 90 -70 36 243 2 146 189 165 162 228 -173 210 2 -266 169 80 -130 137
3990 137 -22 -197 -181 119 -143 43 -133 -43 -383 104 -111 -234 -200 111 -27 -52 162 56 -12 -290 14 110
4012 110 14 202 128 103 237 19 -160 14 45 -58 -280 201 -142 140 -206 -84 113 -2 -75 -33 -141 17
4034 17 101 -106 -76 145 21 -271 70 73 68 162 174 87 -125 -321 -50 -42 -229 -39 169 -112 185 -62 36 -100
4058 -100 -13 -119 -69 283 -62 114 19 -197 61 -251 199 -80 122 126 -13 -324 313 -94 -162 -28 -59 237
4080 237 -115 264 -207 -25 -9 116 67 -72 -101 68 75 142 64 -188 -106 40 -176 -216 -77 72 -102 -4 90 43
4104 43 -183 15 259 111 108 -27 -240 11 156 -98 -134 90 -61 -90 -109 -148 -159 -27 -8 -268 -187 107 11 -23
4128 -23 -22 114 -11 -214 -132 -94 35 1 -121 83 162 289 79 33 -90 189 140 -75 -352 -226 297 -29 -17
4151 -17 -139 -378 -221 67 -213 -298 -177 90 -128 -108 -35 27 141 -161 -25 161 118 142 23 93 67 -70 110
4174 110 -116 -39 -259 51 109 -27 22 -155 -126 -243 10 -48 -91 -102 -30 -83 -14 -138 69 247 -157 -127 42 168
4198 168 -275 136 101 37 -321 81 197 118 143 -128 -111 80 -102 201 -47 152 90 106 16 -57 -83 -56 -103 68
4222 68 -16 -95 212 184 108 -91 -1 -6 262 -125 -85 43 -102 73 32 -25 -166 214 168 57 76 -25 66 -38 7
4247 7 -159 189 -49 -94 -120 -89 -59 -74 154 -84 -54 82 -170 125 -9 -237 145 -90 309 27 -270 -15 -20
4270 -20 -39 27 132 -106 174 247 -124 -53 -65 75 17 -168 69 92 -34 -135 -123 -151 -27 32 -262 -56 -27 -130
4294 -130 72 -49 -13 77 -20 73 192 -27 23 -105 -29 -107 -181 107 71 130 -89 111 171 -109 -102 -186 -74 -80 -140 -36
4320 -36 -7 -12 39 5 -311 118 -28 2 251 24 -248 -118 -63 186 9 -322 4 45 177 97 -78 -52 135 198
4344 198 27 4 -177 -125 -18 56 -255 154 -271 -76 53 -201 220 136 -30 18 328 -182 -275 -39 110 -59
4366 -59 49 290 107 -63 163 -64 45 36 -194 31 -169 -144 110 126 -103 -132 -115 -38 -104 -13 102 55 176 -30
4390 -30 -61 129 118 12 128 119 4 70 -15 55 -37 92 -47 229 100 -337 10 18 -82 4 21 -37 -177 -110 -7
4415 -7 -150 -119 -197 25 -73 -228 -117 144 82 57 53 -85 -116 -141 -148 180 216 5 18 104 -62 30 -46 168 37 50
4441 50 -17 -27 -249 92 -61 -104 107 -47 -32 51 -86 -47 -112 -34 132 -123 -247 -35 -64 201 381 43 -17 2
4465 2 -79 -17 183 18 92 -23 90 -167 250 -10 -137 -131 -76 37 -51 -32 -84 -216 -53 129 -117 13 -41 88
4489 88 45 98 32 96 51 174 233 50 44 149 176 36 173 -35 23 -5 -53 116 -1 -2 -27 -121 -271 -211 -116 19
4515 19 52 -180 -164 -147 121 240 -240 145 -24 -75 194 -122 99 31 120 -70 18 -40 22 -182 38 -88 30
4538 30 152 12 32 143 62 -286 -211 167 -5 -113 6 142 -28 -95 -6 0 82 -14 -38 80 -146 -42 59 49
4562 49 30 -7 -117 24 150 -214 103 104 80 -167 200 -41 -252 -115 -144 -72 -134 -250 105 61 2 -188 -248 -108
4586 -108 76 -3 124 -139 84 -56 65 73 -13 -82 130 165 72 126 -68 151 39 -92 -255 -111 111 -75 20
4609 20 31 -66 -274 -120 35 -14 -332 223 17 -234 229 38 -65 59 209 -115 162 -112 113 -213 -13
4630 -13 203 86 -176 140 75 144 94 -127 0 46 74 25 -304 -17 -6 -139 -25 -7 98 -63 -16 -246 -135
4653 -135 345 22 24 -148 -95 183 -86 -1 -86 -117 152 63 59 -79 89 99 122 10 169 210 -191 143 -112 12
4677 12 174 140 -216 -76 241 146 -285 110 263 -1 290 -8 244 22 -47 117 -54 -136 -3 139 141 229 -100
4700 -100 -170 148 -200 -9 -28 102 75 -128 34 -225 -57 65 -54 -6 100 -121 -98 74 -154 41 39 180
4722 180 158 -20 99 238 -12 152 -1 -237 172 38 143 -246 -102 116 -240 94 -42 -124 105 -13 132
4743 132 181 -171 100 96 -77 -80 -164 -3 69 129 58 72 -80 153 248 133 -127 44 -64 -209 67 104 -136 190
4767 190 -63 -65 -10 97 -150 -8 -152 19 116 -155 9 -131 -123 1 179 -38 95 131 52 -71 47 -229 -60
4790 -60 -55 95 162 -12 41 -121 -32 -128 37 141 12 129 107 -185 -70 36 130 -221 -262 -105 -78 209 -32 122
4814 122 -499 -124 208 34 239 -66 -219 -97 -84 47 -17 11 -36 353 -225 49 -58 -141 -152 -224 103 -41
4836 -41 -17 -30 160 -118 79 205 58 168 -108 33 23 -124 151 -101 -188 57 72 -3 147 -32 128 116 -387
4859 -387 -129 -62 -68 192 -95 -67 113 -73 24 -24 31 137 62 280 35 116 263 -3 144 251 -45 49 -64
4882 -64 -37 186 114 79 -312 -15 78 -258 2 -129 -65 -95 -95 -141 -192 329 -159 0 46 267 -80 -133 -108 -73 -116
4907 -116 -295 -29 -100 42 169 231 -146 -84 89 -26 -211 95 282 288 -284 -144 -117 -138 119 -38 -47 -221 -49
4930 -49 -159 267 -198 46 91 -49 -117 11 25 23 88 -44 -246 -32 71 204 -39 4 229 60 -145 191 3
4953 3 -56 191 113 91 -38 15 85 146 141 -216 60 115 -251 -50 14 122 87 47 -13 93 113 -31 253 126 -93
4978 -93 155 204 -98 158 -202 89 75 91 174 110 -155 -126 453 180 116 -67 -79 34 -24 160 157 11 -218 -147
5002 -147 38 -45 20 -27 177 -73 140 184 131 -64 80 147 -41 -85 33 141 -68 0 79 -7 -183 -284 -9
5025 -9 136 -25 -23 -189 -101 -196 82 -27 -138 152 -159 -3 313 -106 108 18 23 156 -51 -91 1 178 203 -15
5049 -15 25 -196 1 -48 45 -83 -197 -176 -129 88 88 -112 55 -13 144 -117 -84 255 -217 -44 -115 77 -79 41
5073 41 -70 -157 -134 73 284 104 -10 125 211 -167 -124 84 -233 -107 -219 -7 -34 17 137 -107 -280 -99
5095 -99 -108 28 -240 -57 -78 -299 -4 144 -81 285 14 -33 -5 114 -291 82 243 180 173 -29 253 -26 4
5118 4 94 -83 -229 -139 -28 -92 -93 18 -353 -58 -77 -33 53 57 -56 155 232 -63 7 88 -100 -152 171 57 -194
5143 -194 95 -113 14 -21 65 -51 -39 138 -55 80 -212 -46 102 -208 -42 119 -223 -83 -163 -193 -28 -222
5165 -222 151 57 -7 -146 -55 207 -21 84 29 -48 -20 144 33 222 27 72 -27 50 -55 41 29 21 60 -110 222
5190 222 -5 114 18 17 -31 39 36 94 -133 84 98 -175 128 -102 -57 252 -183 228 258 66 68 14 22 -203 -177 -86
5216 -86 -155 151 -165 74 -13 34 30 -90 -265 -133 274 -249 16 -344 63 -39 79 -159 31 5 98 -37 181
5239 181 132 192 208 40 91 -110 -87 -20 27 73 100 138 121 -101 -122 -68 46 245 53 71 162 -155 -16 250 17
5264 17 189 -46 68 68 -1 -93 -120 24 -145 -328 25 16 171 193 21 -128 260 -333 -334 -103 109 -14 -93 -83
5288 -83 103 -83 -11 121 123 -161 -122 -46 48 -210 -137 148 43 38 -90 20 18 27 -74 2 30 62 -110 -161 -113 222
5314 222 -88 -96 -136 -181 -166 19 -298 64 139 -310 84 7 34 -25 20 -184 -196 270 192 -47 -60 40 -123 70
5338 70 -40 47 -36 -136 3 -165 165 260 206 -22 148 -91 -200 -137 -151 110 214 -96 83 -123 112 -47
5360 -47 45 43 -62 -29 152 -117 -100 96 104 -114 137 214 -75 -135 92 65 -63 -161 227 -58 -147 11 136 -34
5384 -34 -153 -128 217 125 5 -103 -239 80 180 205 167 -2 -121 -97 57 14 68 -20 40 175 52 108 81 9
5408 9 76 -172 33 43 -141 87 -37 -150 -67 -8 -119 -84 -203 144 -63 -126 -56 -263 156 -96 -239 223 159
5431 159 -73 89 58 -6 -25 69 116 95 -140 127 -110 -18 60 -116 -48 -27 63 93 62 76 7 -154 24 130 -34
5456 -34 295 132 175 156 -3 4 -68 -175 -44 -94 43 40 -3 125 -55 88 -198 -129 23 -7 -45 109 -157 34
5480 34 50 194 -228 35 59 303 238 -165 -68 113 -13 14 -152 0 -121 -196 25 -33 185 -89 -325 -194 -62
5503 -62 -206 7 69 -115 -20 173 -23 -77 -7 -286 380 12 159 51 -76 152 -102 204 -120 140 -54 -73
5525 -73 -36 153 132 179 280 9 -22 -153 -103 162 46 79 195 -166 125 -159 -30 -89 -114 112 -123 -53 160
5548 160 -24 -130 -191 149 144 29 12 93 19 -13 -50 -129 85 45 125 220 -157 -35 -18 137 -170 -161 96 95 10 38
5574 38 -142 -77 -15 -45 171 -126 -20 -102 27 -215 -283 45 125 41 21 -15 -56 114 -94 -101 -189 170 -221 -332 56
5599 56 196 134 136 -51 32 -10 -157 54 -125 -96 122 -74 -124 52 -24 -66 -185 -71 -102 88 -17 209 93 40
5623 40 -3 104 -161 -26 173 92 220 -119 -143 16 -79 -266 13 -406 17 -210 -118 -163 0 -272 173 9
5645 9 -141 -42 -99 66 -48 144 128 114 81 -132 30 139 -263 -34 -35 119 -108 -120 98 93 51 -13 42 76 51 -4
5671 -4 -92 -72 -60 133 -107 -71 170 167 -76 -223 -78 -75 36 -43 137 -30 -113 -228 -223 -61 200 350 -45 183 132
5696 132 -85 16 -49 -21 217 262 253 277 -194 -191 225 216 -44 46 -251 -37 -64 53 23 -130 -110 182 -264 175 95
5721 95 -140 -131 241 14 34 -63 97 24 -12 15 -69 14 -167 157 -88 164 -47 -133 -92 -14 -291 -66 32 187 -49
5746 -49 -45 263 78 -13 -113 1 -106 -38 195 282 -243 -85 -186 -47 182 -206 -102 -111 86 84 -114 -148 248 174
5770 174 -60 117 -207 329 -9 -14 115 106 260 -84 117 -73 32 -80 -37 -29 110 93 186 45 -91 -58 118
5793 118 -66 -21 -166 -201 -194 -208 -196 -141 -91 -20 -65 -150 -103 -62 8 137 46 148 2 -132 94 -157 135 154 122 49
5819 49 167 93 -77 97 -150 259 9 -80 -107 88 159 177 49 -164 -34 13 -31 169 41 -37 65 -22 73 39
5843 39 338 -48 -115 4 47 -179 71 120 23 64 -44 -55 -140 73 -85 93 -277 -79 -88 379 -29 -218 -85
5866 -85 -4 -86 110 1 184 1 -42 -25 171 -2 93 -98 -37 268 -137 -143 -155 -115 -156 130 283 173 3 -365
5890 -365 -115 -151 -55 328 212 65 -108 -43 -210 -2 -186 -124 15 -68 -33 156 6 125 45 55 -74 64 3
5913 3 31 52 -48 121 152 76 110 360 -208 26 -191 52 148 -17 -120 85 -62 35 115 56 -268 -9 124 -155
5937 -155 12 112 -44 82 119 131 -167 -52 -31 -48 87 88 60 59 -51 20 -61 -221 133 51 -119 200 118 157 206
5962 206 -82 -142 82 210 -284 42 -17 -5 -209 62 -112 -50 111 -111 -100 -165 -12 19 21 -36 -21 -152 -317 -28
5986 -28 -53 173 101 73 95 10 -2 235 216 -409 36 82 78 34 -33 117 -52 -16 -67 -58 107 -28 -7 230 83 -57
6012 -57 23 -88 -29 24 9 -137 50 13 -196 -9 -216 -52 -13 -149 79 -151 132 -59 -183 -99 246 87 316
6035 316 45 86 -57 -32 29 111 113 -205 226 108 203 100 188 114 23 19 -29 204 90 45 -15 93 35 -50 -88 210
6061 210 -104 -11 93 -273 -185 192 185 166 97 78 206 130 -59 121 78 18 157 325 15 -30 27 179 -66 -197
6085 -197 29 251 -91 -147 158 74 -32 -180 77 -150 151 -50 -56 212 -37 -131 -94 -130 80 -233 133 -152
6107 -152 142 115 -34 -174 0 -26 96 177 -15 34 329 164 14 -219 -94 -5 80 -105 -148 183 -70 181
6129 181 -95 -101 44 -52 91 -63 -258 14 -45 116 43 -169 12 102 -101 11 -18 -45 232 -46 -84 -10 -100 -132
6153 -132 -122 30 -11 67 29 76 -164 118 -15 -94 -194 -283 33 -1 -106 159 155 196 -68 -140 153 -53 56 -89
6177 -89 211 -68 -87 76 -15 -205 -207 -22 -22 -46 69 -223 -335 -52 4 112 154 8 -123 -68 104 51 180 162
6201 162 18 -73 120 72 97 -140 43 222 198 47 -191 -7 -71 99 211 18 -123 -80 -286 15 -133 35
6223 35 -175 32 -92 145 -226 40 -104 78 -101 144 -153 111 -113 64 2 -57 -51 -67 -93 -132 -80 143 86
6246 86 153 12 -70 -53 132 -210 -161 80 43 167 -86 191 -45 112 88 129 -132 54 -147 19 146 215 136
6269 136 60 237 45 1 41 163 40 117 -46 232 186 -98 -112 -115 49 97 -211 7 -244 -107 83 37 -143
6292 -143 -29 -15 -52 -154 -11 -210 119 160 95 -78 -101 55 -102 -54 -14 165 169 -95 -76 -93 -52 109 -257 79
6316 79 48 -209 -104 -171 -223 -214 33 -206 -134 -139 7 -77 92 -184 111 50 -19 206 -143 10 159 74 87 -50 -86
6341 -86 65 -363 103 89 72 190 -143 57 -67 -302 30 -43 65 -82 25 -112 -46 -163 48 -4 -184 21
6363 21 -4 -9 122 -153 -9 48 -273 146 12 -453 136 -78 111 77 -82 -128 -55 157 45 68 -27 -191 -76
6386 -76 -53 -38 156 -200 126 26 72 39 -3 -160 65 -61 7 55 -75 -123 -128 -51 10 -397 253 -121 -35 104 -166
6411 -166 -4 42 275 -13 -9 131 -255 30 -40 69 -131 -215 161 -95 101 103 -13 -109 259 -52 132 252 41
6434 41 54 107 164 -2 -57 149 -25 11 -174 130 -54 215 -191 -209 -92 -181 65 -138 103 -137 -4 76 263
6457 263 33 30 -50 -45 33 -151 112 -95 420 191 -94 233 50 -13 -108 145 129 177 -10 -5 72 -155 85 -45
6481 -45 -50 -55 -113 -116 -16 208 118 -126 130 -234 52 289 265 132 -74 -7 -105 7 -214 -54 -106 -118 -8 197 -222
6506 -222 -119 46 -172 63 47 -16 -152 -12 51 -39 -29 -25 197 110 0 110 31 -87 -88 -48 -140 -65 14 -345 -233
6531 -233 -172 166 195 99 9 25 58 106 -89 -204 -146 159 226 187 -234 21 159 -216 -95 -151 -100 -23 6 -107 -104
6556 -104 80 100 -73 149 126 15 206 4 -9 -113 -223 -6 -158 -42 124 289 48 -90 125 -123 -11
6577 -11 -286 104 37 198 -204 -71 94 38 102 110 -78 206 61 -76 -263 32 52 -24 104 95 284 196 156 29
6601 29 -16 26 -52 115 363 97 -46 -167 76 59 -3 -93 -22 -67 -146 89 257 -162 192 120 -76 -73 -61 81 -12
6626 -12 -2 21 -113 2 32 -7 219 43 169 52 15 118 -56 118 -93 -2 -6 131 24 -373 190 147 126 138
6650 138 102 191 -318 -109 -175 24 -168 -89 -75 182 -54 108 55 -221 42 -200 217 136 147 101 -130 -104 -186 345
6674 345 -181 -103 -139 171 -8 -31 95 87 181 -26 119 -34 174 -134 -56 -135 -161 197 75 -24 44 51 68 121 -52
6699 -52 66 -38 -149 -3 156 153 27 -82 -144 -158 -165 99 -257 -109 143 115 -105 100 -46 -15 67 120 90 22
6723 22 127 21 32 13 -395 93 -9 -44 157 -91 21 141 -156 4 78 40 32 -347 -17 -82 -87 -14 -83 -61 18
6748 18 -39 213 55 -149 -99 59 -215 -187 -103 -7 158 -32 -20 1 263 -174 -65 -18 47 88 -15 -128 -58 -82
6772 -82 -88 71 42 91 -200 132 -130 -32 161 88 -202 -50 -32 -47 147 -113 -75 -30 67 9 43 138 93 -16 -180
6797 -180 27 -5 176 -129 -11 1 237 -53 -124 -193 75 -151 -166 167 280 194 60 -161 27 39 8 101 -11
6820 -11 157 -9 -41 268 123 -201 -266 -15 112 3 79 -47 -84 -31 113 137 -40 58 96 -239 -201 -306 -136
6843 -136 220 -132 -59 5 -46 -20 -38 25 -38 152 -117 97 -102 157 -133 -107 -65 79 -7 73 28 -76 38 26
6867 26 10 -178 -153 -51 120 -81 -117 58 103 -87 58 36 -118 -138 70 17 112 269 177 86 -29 -371 43 -134
6891 -134 -36 -37 285 131 137 -23 -3 16 253 -173 66 307 -69 -138 165 -252 104 -34 -48 218 -106 32 282
6914 282 131 28 -5 112 56 22 115 114 -377 -39 145 -128 20 67 -38 -135 -58 212 -110 -50 181 128 99 10
6938 10 -92 -297 -26 106 -6 151 115 -82 -120 0 37 -72 205 129 86 90 -67 -84 120 90 19 122 36 183
6962 183 44 -108 -191 124 2 224 8 -40 -70 -62 -177 -75 46 142 92 -133 -3 160 185 -37 24 322 -375
6985 -375 197 183 -31 -72 -210 212 -180 177 -20 250 -143 41 68 185 -21 -35 -163 -112 -80 20 -205 -107
7007 -107 -36 -35 54 -107 112 128 -67 -175 -52 44 -81 -120 -75 -20 129 -8 191 136 -74 28 -186 -174 -185 210
7031 210 0 419 263 239 -104 -147 -261 -186 -65 54 254 138 -55 -110 -61 -23 -155 -233 146 44 -153 -32
7053 -32 -114 154 58 64 85 -229 11 2 -7 20 -9 -49 -73 109 -133 290 -43 -70 72 -1 191 -83 128 165 33 142
7079 142 -144 109 -74 48 8 27 132 -81 -14 14 -182 262 47 54 -45 -142 64 122 168 77 98 152 142 36 41
7104 41 59 76 18 9 18 68 25 81 -27 168 -63 184 -122 -200 319 53 -116 -110 15 -106 139 -43 49 -117 -61
7129 -61 -33 -100 -180 -307 143 183 -91 -173 62 -118 -144 217 -14 -8 135 -135 -96 381 161 76 27 72 -72 3 -156
7154 -156 -72 -59 254 73 -25 -174 131 -7 -59 -55 -212 208 -131 81 -20 350 41 97 77 -26 122 -167 97
7177 97 123 78 46 79 -390 -54 -158 222 -61 -206 31 -6 100 69 149 133 52 -49 -168 -86 272 116 311 -208
7201 -208 -38 200 -213 195 174 6 -78 -67 -135 -6 -83 -86 -72 -127 -105 77 327 -55 241 118 -437 -246 41
7224 41 -56 -22 -9 -4 -28 40 -87 168 24 -60 153 99 -183 -134 -167 -55 167 189 101 254 16 213 104 17 -72
7249 -72 -35 241 159 -253 -49 -175 -217 -231 -12 98 169 224 58 -222 -153 -59 -300 171 -126 -64 80 -99 -119 8
7273 8 -124 -40 57 -48 236 104 127 80 149 48 4 204 212 23 262 77 136 113 -5 -274 -181 -111 99 -425 19
7298 19 105 -163 166 52 66 94 161 -345 -98 18 244 -161 143 -17 -54 -76 144 15 -53 -82 -162 -61 -202
7321 -202 -54 -12 82 14 39 -316 -266 -91 -27 -191 -95 -227 85 32 88 133 28 268 -247 -95 -20 -44 -224 -60
7345 -60 156 113 -69 -224 116 -19 -171 -29 155 41 -64 -53 -158 -72 59 -165 -149 161 46 6 98 -84
7367 -84 -192 13 20 166 37 18 -76 14 196 98 -132 -160 -7 142 134 -163 19 -80 -79 -124 -63 -136 -105 -33 -102 217
7393 217 162 -33 149 -111 -79 -12 -94 135 116 -75 229 78 129 69 -12 20 -145 1 -310 -15 -241 -223 -256 75
7417 75 134 208 -87 105 136 -252 -271 -366 33 74 61 -16 -5 -161 -58 174 -68 -10 -45 50 -153 -144 -64 -110 1 192
7443 192 317 210 -174 106 85 152 -7 142 77 0 -6 71 77 175 -12 -54 -161 117 -54 -51 -7 -29 22 -13 47 -258
7469 -258 80 22 -202 28 -85 7 139 -150 30 -2 -327 -26 -80 116 -100 -86 34 -64 -158 115 19 -139 110
7492 110 56 -40 158 134 81 164 -7 -131 -139 84 -88 8 45 64 14 55 71 -286 -141 -54 -382 -66 107 -153 -186
7517 -186 -108 -192 -106 -130 150 -31 -44 30 -114 65 -120 -127 -2 26 -95 135 65 25 51 201 -7 278 173 -249
7541 -249 -156 -191 55 -47 2 295 6 23 -26 -33 -167 267 -114 -234 38 202 -205 72 5 6 -82 25 -69 -130
7565 -130 -164 314 -179 -75 144 -16 -115 -198 397 -344 109 1 -8 97 187 73 -170 4 -138 -48 35 -11 187
7588 187 109 4 265 147 -46 181 151 131 159 -145 -50 -22 128 141 -100 -331 116 -187 146 -105 103 -161
7610 -161 39 -6 -161 207 -101 108 18 -81 37 117 123 -93 -133 127 -65 82 165 50 106 188 24 -41 59 16
7634 16 142 201 -72 -79 -53 -2 -145 -139 -221 102 46 -165 -138 -180 -232 -420 73 -23 -384 13 28 -73 -53 241 -82
7659 -82 79 15 -41 38 88 184 -34 -61 73 23 -172 3 146 -116 -17 41 79 -260 -60 -203 -76 -154 120 -59
7683 -59 -87 -216 -142 26 95 -193 -204 115 33 -380 -58 129 -89 33 -24 121 -105 -60 110 -79 -174 59 73
7706 73 -50 44 23 16 235 -23 -54 -44 37 -107 61 159 -43 254 -108 61 -23 19 -146 -140 12 -56 -13 35 -86
7731 -86 -54 48 26 120 -244 56 24 -4 -48 -85 -105 43 -175 -150 149 6 -32 56 -46 138 263 223 -301 152
7755 152 16 67 -95 189 10 -97 134 222 -123 62 93 126 84 -161 -19 -100 -6 121 -28 8 259 -61 -158
7778 -158 123 -185 -48 -223 -215 181 -63 144 -52 85 -61 24 -19 -26 -95 15 60 -5 186 -59 70 -68 183
7801 183 -13 137 35 -87 -180 150 -97 -71 -15 -69 179 -155 -201 45 19 140 9 72 -51 -38 240 -186 242
7824 242 162 -267 -43 122 126 -141 1 -190 -15 -160 -286 -8 -157 117 -324 -103 -124 -56 41 35 -348 -240 -251
7847 -251 154 -103 -5 -114 -95 183 -62 -12 -31 -226 -262 89 117 -124 -26 73 25 -67 54 -44 -97 128 52 -139
7871 -139 43 -67 -210 -75 66 17 128 103 151 9 -62 -233 -42 -137 -185 73 -216 99 -85 -116 -101 -39 154
7894 154 225 -129 90 -78 97 239 -93 62 -199 9 -196 -111 -317 90 260 -26 -18 9 140 1 -19 138
7916 138 120 -20 -47 -97 264 -56 170 -61 -83 -37 123 -48 -23 32 -82 181 -178 -155 125 -261 29 -18 180
7939 180 226 -91 -35 -47 -79 -42 -318 -13 86 31 260 80 -12 159 -96 -20 202 -10 -47 1 5 -86 -69 -12 -152
7964 -152 -296 -131 32 93 185 171 -207 -346 -228 0 55 -98 -176 -284 52 282 41 372 109 -23 -285 -8
7986 -8 56 269 49 -210 20 27 68 -94 144 -89 141 -97 4 -386 87 65 -189 125 -56 -122 14 -165 -57
8009 -57 -218 -77 4 65 -106 -115 -91 133 -20 -277 -18 295 47 -82 -265 -142 -76 -71 52 32 85 27 -96 207
8033 207 -65 -43 -35 -122 182 -193 -148 -60 240 -107 -6 -133 -77 -4 29 -384 -6 -92 -1 238 -167 281 75 82
8057 82 210 222 -182 14 280 -61 -259 -43 -44 -163 166 -63 -58 20 68 -26 -39 70 82 65 134 -9 32 -109 -69
8082 -69 137 229 20 -93 140 198 65 66 -223 76 163 171 45 -303 -1 -169 4 5 -102 161 293 88 162 105
8106 105 -66 -165 156 37 -45 93 5 1 -37 -126 25 -21 17 49 -29 -51 -31 10 -34 98 7 90 -26 2 20 -320
8132 -320 -126 22 176 -107 -33 -29 -148 -37 -190 -10 130 83 69 332 -131 -203 -71 43 -14 -107 -7 122 18
8155 18 -99 -138 -23 -93 -33 51 161 240 -75 -109 -40 -1 -162 145 219 84 -4 -56 86 85 115 95 60 29 17 -33 -195
8182 -195 1 92 -96 -25 5 151 -88 -41 -31
8191c1
$$ Imaginary data points
##PAGE= N=2
##DATA TABLE= (X++(I..I)), XYDATA
0 0 0 0 0 0 0 0 0 0 0 0 0 0 0 0 0 0 8 -8 8 -8 8 -9 16 -16 16 -24 24 -32 32 -40 43 -49 56 -64 73 -82 91 -101
38 -101 114 -127 141 -157 174 -192 214 -236 260 -286 314 -346 382 -421 463 -513 566 -629 697 -779
58 -779 873 -986 1122 -1290 1507 -1794 2193 -2789 3773 -5680 10723 -53463 -106719 50815
72 50815 63647 -26299 -9845 35488 -16032 12479 75855 3584 -61511 16111 53823 -1524
84 -1524 -13147 3132 -24186 6627 58882 -4967 -62572 6626 39084 -13760 -23112 -9643 -44238
97 -44238 -22282 39282 -14066 -76292 666 48640 -8721 -6379 38396 -352 -12397 66676
109 66676 51069 -48090 -16443 56673 9737 -29675 2776 -11760 -35890 20685 33906 -48008
121 -48008 -44839 37441 23882 -26314 -9824 -4293 -18081 12522 21103 -32555 -32494 26438 18101
134 18101 -13074 13677 10743 -16473 25767 52111 -12524 -36717 25665 31304 -22312 -15389 1878
147 1878 -25874 -9507 26557 -12484 -42866 7950 32855 -5781 -8753 11074 -6906 -1043 31028
160 31028 -694 -40471 174 31125 -6976 -20895 5023 650 -2695 22390 7865 -25057
172 -25057 3838 32213 -4225 -20823 7514 2095 -17232 4676 9602 -20470 -11501 20239 6119
185 6119 -11297 7506 9085 -6284 8865 14274 -12738 -12348 11252 2114 -14551 -2074 1247
198 1247 -10993 2881 14192 -8595 -9989 15670 9149 -9636 2674 7861 -10427 -4463 14323
211 14323 -4848 -20504 5961 15763 -7648 -6944 10083 4696 -1658 8021 5681 -7091 -182 7701
225 7701 -3709 -7844 -1163 -4066 -4680 1194 -2693 -7435 488 5151 -2322 -1793 4575 -1739 -2151 8142
241 8142 1743 -9126 2401 11384 -2194 -6217 8263 7849 -4062 1772 9605 -1368 -4725 4743
255 4743 2147 -7732 -5484 607 -3581 -8342 -3572 -1625 -4164 -2845 -280 470 437 964 2497 3773
271 3773 2083 1627 4849 4801 612 332 5899 3193 -3604 524 4830 -1433 -5033 296 1487 -4561
287 -4561 -5114 -28 -1367 -6346 -2162 1071 -2618 -3452 684 2279 -1344 -1333 3264 2699 -219 1799
303 1799 4089 2359 296 2415 3789 117 -1703 1877 1748 -2408 -2596 521 657 -3029 -2543 1481
319 1481 225 -2350 152 1757 -43 -1542 795 1186 -2560 -2220 797 -885 -3274 -1654 550 -47
335 -47 -1086 884 3019 1311 1310 2595 2635 1474 208 1623 1689 -1378 -1445 1509 963 -2193 -691 2639
353 2639 380 -2614 686 2062 -3533 -3358 446 -2478 -6038 -2641 -648 -3344 -3185 1382 1064 247
369 247 3950 4768 2701 4211 4591 3066 2932 2401 -500 -684 1874 -941 -4583 437 1660 -4217 -1952
386 -1952 3364 -2201 -5550 1270 1234 -7506 -5013 1715 -4414 -7403 1314 843 -5041 2245 8364 1765
402 1765 689 8705 7154 1575 4790 5018 -1814 792 3625 -4515 -5824 1429 -1688 -6372 134
417 134 1029 -6771 -1657 5938 -5121 -9042 3925 1355 -10902 -2831 4893 -5415 -5308 8777 4871
432 4871 -4816 7232 13233 633 2418 12130 2465 -4072 5837 2957 -9443 -4081 2970 -8138
446 -8138 -8175 2793 -4124 -9456 4245 3725 -9427 -1717 8339 -4382 -7893 7048 757 -10015
460 -10015 4523 9882 -7260 -1342 16154 3771 -5690 11165 11794 -6779 77 11376 -5720
473 -5720 -11348 5173 -1517 -15812 -2095 4904 -10887 -7240 8119 -931 -7333 7839 5480 -8130
487 -8130 3908 10046 -7985 -5586 11964 -290 -11447 7443 10154 -9384 295 16422 -1366
500 -1366 -8683 11587 5922 -13308 168 8132 -12134 -10995 8595 -2467 -15442 3948 7820
513 7820 -9228 1242 13703 -4278 -6280 14698 5860 -12865 1543 9996 -8677 -4995 9168
526 9168 -5523 -10745 12239 7318 -13280 970 14542 -4452 -7091 10753 -1358 -14513 6326
539 6326 9201 -15658 -7569 13079 -1071 -9746 9597 6752 -10065 4972 15790 -6784 -9145
552 -9145 9996 1626 -10592 2793 1495 -13987 -448 13095 -7575 -12314 11183 7436 -8697
565 -8697 5447 9216 -10646 -2021 16684 -2848 -17209 6165 10693 -8896 -2060 9193 -6027
578 -6027 -4113 15435 2774 -14892 3317 11620 -8575 -7204 5813 -7264 -11766 8294 3365
591 3365 -15583 -1589 12324 -2056 -3196 9760 561 -6207 11673 10148 -11945 -3800 12697
604 12697 -1045 -7588 6593 240 -10402 6648 12005 -10875 -9777 11198 3240 -10608 408
617 408 1121 -11221 -420 9040 -8974 -12096 8089 7004 -5490 2336 6745 -3025 3944 13966
631 13966 -2065 -8704 8496 7963 -7021 -1177 4523 -6707 -4037 9540 -1557 -13411 2401
644 2401 8553 -6405 -4991 3831 -4607 -6175 6527 1098 -12199 -1069 9461 -1840 -4131 5948
658 5948 1966 -1935 8381 6669 -5987 -38 9537 976 -4972 2685 -456 -5632 3125 3401 -8977
673 -8977 -4615 6221 -349 -6783 1242 1566 -5886 669 5410 -5346 -6421 5687 2794 -4696 826
688 826 3862 -1895 1103 6901 -120 -4161 4974 5476 -2669 -792 2235 -2163 -1029 3225 -2113 -5772
704 -5772 1356 2772 -3838 -2264 1886 -2332 -2370 3261 -411 -5351 441 3958 -1756 -2633 2551 807
720 807 -1795 2907 2438 -2654 576 4487 773 -1524 1580 1892 -844 867 1618 -1788 -1321 1492
736 1492 -802 -2175 -271 -589 -1917 -229 81 -2660 -1530 1486 -401 -2441 713 1274 -1211 58
752 58 1870 -34 -756 1932 2238 -587 729 2741 885 196 2032 1432 -434 526 1080 14 -1238
769 -1238 -503 -896 -1450 -1417 -1819 -1690 -813 -1413 -1260 -410 -122 -412 100 773 431 -192 833 1772 148 416
789 416 1542 1509 643 1350 1604 1039 596 1346 683 -686 -59 -215 -1361 -2083 -2039 -1677 -1719 -2244 -1137 -919
809 -919 -767 -493 232 586 486 627 1405 1378 627 568 1181 1213 405 438 1334 1118 449 1292 854 -124 135 209
831 209 -716 -1478 -964 -889 -2274 -2191 -1388 -1852 -1354 -611 -67 151 1001 1260 1352 1451 1022 689 525 1442 -12
852 -12 -347 899 236 -917 353 1177 -111 -325 1524 653 -1474 -148 926 -1575 -1708 -76 -1485
869 -1485 -2300 -106 54 -1307 -311 2286 814 -208 2006 1155 -298 1579 1203 -2038 -889 1037
885 1037 -662 -1753 508 199 -1528 1381 2639 -1402 -846 3016 921 -1793 665 681 -2853 -784
901 -784 2039 -2142 -3420 2312 2108 -1884 513 2016 -934 -6 3047 -493 -3522 1131 1566 -3261
917 -3261 -1609 1292 -1837 -518 4094 559 -2855 2854 4915 -492 -528 3257 -568 -1959 3040 212
933 212 -5952 -721 3553 -2246 -3289 1802 -368 -2994 2954 2455 -5106 -1960 4649 -991 -4392 632
949 632 144 -2754 2334 4125 -3569 -1291 6813 3017 -2167 2731 2807 -2282 2416 4210 -4850 -5507
965 -5507 4039 1004 -6812 -1737 1822 -4209 -886 4840 -2768 -5923 3923 4107 -4468 -1972 3080
980 3080 -2226 -1075 5173 -259 -5036 4176 7473 -1563 -814 5118 107 -874 5803 485 -7831 163
996 163 5301 -4704 -5936 1323 -2171 -4514 3184 1419 -7430 -963 8014 -1003 -5197 3404 1705
1011 1705 -3207 3634 4285 -5857 -2077 8541 2105 -4855 2927 4197 -2484 2594 4789 -5249
1025 -5249 -4453 5479 643 -7319 -1176 1425 -5346 -994 4636 -4773 -6348 6153 4660 -5740 -761
1040 -761 5121 -1868 -901 6297 -1006 -6488 4692 6888 -4331 -2254 5339 -186 -1576 5118 523
1055 523 -6293 2262 6186 -4684 -5202 2877 -1187 -4523 2820 247 -7233 49 6625 -2254 -4294
1070 -4294 4127 1945 -3401 3460 3455 -5683 -696 7472 -360 -5191 2832 3355 -3672 1685 5155 -3959
1086 -3959 -2983 6536 1193 -6028 596 3071 -3438 -1204 3233 -3426 -4638 4095 2185 -5881 -410
1101 -410 3732 -2510 -1080 4222 -1275 -4041 3695 3790 -4388 -690 4752 -1171 -2334 4175 566 -4640
1117 -4640 2429 4383 -3451 -2332 4243 -151 -3529 2467 1070 -4895 -55 3805 -3143 -3663 2927
1132 2927 156 -3742 1384 2075 -3930 -843 4405 -861 -2878 3198 1940 -2490 1392 3259 -2054
1147 -2054 -1003 4507 553 -3065 1983 2568 -2728 -346 2793 -1919 -2809 2453 346 -4195 -244
1162 -244 1803 -2896 -2006 1991 -946 -2796 1720 1593 -2345 262 3214 -267 -520 3084 1152 -1691
1178 -1691 1765 2261 -2022 -627 2171 -535 -2050 1320 820 -2526 98 1544 -1735 -1839 1351 -463
1194 -463 -2380 213 755 -1806 -1133 1465 -288 -944 1990 1468 -890 1457 1900 -200 435 1932 132
1211 132 -930 582 513 -1683 -669 1085 -1438 -1347 1106 355 -1176 356 898 -1109 -759 982 -442
1228 -442 -1599 189 413 -1155 112 919 -16 27 1375 1147 132 669 1087 -188 -476 178 -565 -1099
1246 -1099 -309 -502 -998 47 384 -151 171 861 569 -84 897 441 -761 -215 101 -935 -1000 -451 -264
1265 -264 -784 183 749 -154 184 826 589 246 81 159 -296 -328 -38 -283 -535 215 299 498 728 800 749 924
1287 924 1045 302 -116 -256 -462 -1264 -893 -780 -1352 -1153 -589 -848 -468 286 309 362 203 632 670 -77 287
1308 287 337 -56 192 115 368 586 669 914 904 1046 974 192 53 -195 -723 -925 -1185 -1823 -1653 -1776 -1374 -1202
1330 -1202 -759 227 281 23 1181 1100 500 827 965 606 460 608 528 -247 402 1148 50 313 996 273
1350 273 241 364 -255 -1013 -830 -777 -1937 -1825 -1277 -1766 -1622 -254 124 -689 715 1615 1023 1065 2191 1238
1370 1238 361 1250 1191 -340 -113 1366 -227 -626 525 324 -761 307 646 -1238 -1278 273 -834
1387 -834 -2165 -864 -841 -2173 -736 223 -1117 -810 1447 1401 -2 1519 2244 500 978 2550 37
1404 37 -1207 1421 904 -1409 -491 836 -829 -703 1295 -184 -2089 737 1437 -1622 -1206 322 -1064
1421 -1064 -1816 818 -228 -2647 321 2258 -130 -547 1983 810 -177 2644 1738 -2008 19 2609
1437 2609 -307 -2389 716 -159 -1828 713 1073 -2085 -1058 2681 612 -2332 189 816 -1878 394
1453 394 1540 -2451 -2158 2393 1185 -2598 -38 1181 -883 844 2851 -982 -2217 2792 1856 -2161
1469 -2161 -631 1591 -1369 -538 2449 -1029 -3078 2053 2788 -2291 -1209 1675 -496 -882 2193 -770
1485 -770 -3615 415 2830 -1953 -2839 1307 59 -1509 2460 537 -3111 305 3917 -338 -2593
1500 -2593 1574 919 -1221 1870 1305 -3482 -615 4249 86 -3148 649 1186 -1567 966 1791 -3413
1516 -3413 -2129 3577 691 -3800 -692 1374 -1332 224 1929 -2412 -2404 3716 2294 -3045 -91 2544
1532 2544 -41 630 2491 -1201 -2549 3019 3087 -2932 -1845 1827 -620 -1164 1656 -1246 -3924 1604
1548 1604 3372 -2816 -2903 1856 317 -1341 1702 61 -3608 1050 3978 -1345 -2910 1469 1566 -660
1564 -660 2015 1125 -2844 278 4243 -86 -3133 1083 1128 -1468 291 264 -3230 -1358 3576 -91
1580 -91 -3530 307 1939 -1137 363 1582 -2072 -1507 3121 1266 -3525 -686 2064 -708 -245 1548
1596 1548 -1253 -1682 3123 2333 -2348 -914 2394 -110 -1224 1152 -956 -2688 1408 2010 -2287 -1389
1612 -1389 2089 856 -523 1545 -96 -2225 1123 2364 -1902 -2482 1040 127 -1558 423 209 -2256
1628 -2256 341 2809 -628 -1784 1746 1598 -879 258 586 -1661 -434 2176 -532 -2082 819
1643 819 1528 -495 228 1316 -703 -708 2047 113 -2412 -580 716 -1717 -1211 73 -1253 -1520 1406
1660 1406 1127 -1255 599 2351 484 213 1464 364 -693 1245 891 -1675 -557 1153 -163 -950
1676 -950 430 95 -988 406 874 -1104 -1208 394 -627 -1413 -341 -635 -1652 -299 1049 -508
1692 -508 -306 1622 1867 483 1340 1644 355 420 1620 -105 -1093 186 353 -791 -556 -195 -860 -549
1710 -549 321 -385 -1206 -295 86 -956 -895 -391 -684 -811 218 344 -180 587 1584 941 1218 2073 1022
1729 1022 821 1102 990 -420 -511 339 -865 -1225 -619 -665 -1169 -549 -302 -472 -555 -13 66 -409 -446 -126 -616
1750 -616 -269 66 -160 238 658 1038 700 1037 1298 1060 1039 1185 441 177 -132 -505 -1066 -938 -934 -889 -1175
1771 -1175 -560 -316 -614 18 285 -106 71 317 39 205 -46 78 -15 176 481 386 420 742 815 510 779
1792 779 668 544 151 58 -461 -353 -520 -834 -1510 -689 -497 -727 -387 292 404 147 655 658 278 248 59
1813 59 41 -309 -174 -53 -542 -7 105 -75 347 353 535 187 289 117 -215 -220 41 -623 -638 -492 -436 -523 189
1836 189 120 -107 518 672 170 119 472 -12 -356 -78 -343 -608 -215 -44 -416 -782 174 500 -232 312 532
1857 532 192 214 745 83 -394 129 -52 -310 -185 142 -386 -365 549 287 -406 45 781 -435 -323 189
1877 189 -475 -1003 -50 -156 -1280 -482 506 -231 -298 643 788 -1 784 981 -86 182 736 10 -447 521
1897 521 215 -827 -207 652 -708 -495 518 144 -776 147 362 -946 -516 308 -612 -1119 434 289
1915 289 -732 432 975 -474 124 1692 345 -608 981 940 -458 -61 983 -528 -594 670 113
1932 113 -1032 190 601 -1200 -511 698 -496 -1117 701 315 -1411 -245 747 -675 -651 1390 361
1949 361 -781 713 1259 -439 99 1383 -210 -740 1141 811 -1225 165 1000 -1024 -624 1011 -510
1966 -510 -1314 440 469 -1303 -458 1071 -844 -994 1063 117 -1477 307 1232 -771 -364 1546 112
1983 112 -1052 1212 1076 -1215 165 1769 -690 -617 1374 298 -1065 463 731 -1440 -392 1150
1999 1150 -366 -1770 679 372 -1651 -155 996 -1115 -993 1564 94 -1597 720 1181 -962 -128
2015 -128 1383 -679 -959 1392 818 -1243 422 1520 -669 -113 1648 -61 -943 1037 776 -1591
2031 -1591 -659 827 -800 -892 681 -320 -1677 635 1139 -1145 -654 1399 -197 -983 1000 458 -1113
2048 -1113 306 1664 -669 -557 1769 742 -748 876 1146 -1088 -108 1676 -520 -1680 516 186
2064 186 -1527 -303 639 -1824 -772 1327 -35 -1500 512 1059 -804 57 1251 -672 -595 1664
2080 1664 537 -926 358 1633 -104 152 1546 162 -606 1728 870 -1374 -416 710 -793 -1369
2096 -1369 3 -1012 -1456 198 765 -1342 -812 1190 283 -557 1152 473 -575 687 1539 -453 -642
2113 -642 1064 663 -595 854 761 -607 388 1502 -397 -1023 479 401 -1007 -308 -171 -1388 -1006 732
2131 732 -609 -1373 362 758 -152 372 840 -375 -30 1353 506 -911 143 774 -277 -124 446 -123
2149 -123 -214 674 606 -777 -98 525 -181 -338 78 -493 -1082 116 -24 -1000 -589 586 -8 -176 832
2168 832 370 -30 874 782 -180 -83 834 -107 -671 -52 234 -355 -3 489 -206 -194 587 286 -266 109 -80
2189 -80 -475 -252 117 -358 -696 -132 216 -356 -99 460 283 172 678 264 -235 222 131 -296 -469 -118 -443
2210 -443 -296 87 150 -220 233 445 277 324 498 221 2 333 89 -574 -98 -70 -126 -163 -238 -66 -415 196
2232 196 353 -185 -3 173 103 -299 -283 -99 -324 -177 296 -70 -127 419 515 309 487 621 655 316 -11 113
2254 113 -250 -27 -175 -308 -487 -283 -393 -371 -304 -138 -135 -24 -112 -212 -213 -14 -264 -195 -1 -93 105 261 534
2277 534 365 401 266 773 394 509 438 224 -123 -92 -306 -377 -320 -489 -472 -505 -526 -287 -346 -185 -206 -23 137
2300 137 75 244 218 -28 -24 157 234 96 104 459 584 91 158 658 392 73 93 63 -388 -288 -197 -658 -723 -378
2324 -378 -500 -338 -186 -9 -191 -4 121 79 -108 517 308 170 171 300 113 168 428 179 -43 350 325 -61
2346 -61 334 194 49 -115 -70 -166 -917 -242 -336 -541 -272 -297 -235 -494 299 124 -285 321 253 -20 -57 118 -175
2369 -175 -59 533 374 -230 97 362 258 -44 347 -31 -378 -16 149 -332 -424 180 -394 -399 -95 -262 -569
2390 -569 31 639 -338 -299 593 158 -110 309 288 3 62 724 -276 -360 621 437 -83 365 355 -353 129
2411 129 452 -11 -665 184 366 -585 -295 416 -700 -394 535 46 -924 -105 831 -315 -284 409 -214 -187
2431 -187 803 81 -822 10 822 144 -56 318 -43 -362 651 661 -610 -143 976 -143 -607 331 -179
2450 -179 -695 165 392 -1053 -873 525 -68 -753 -13 157 -747 191 777 -162 -682 736 979 -247 220
2469 220 579 -204 275 1047 -196 -650 628 965 -453 -225 238 -470 -331 898 -332 -1123 187 453
2487 453 -779 -430 212 -459 -525 662 325 -1171 398 1353 122 -290 418 373 -156 971 338 -1116
2505 -1116 -77 908 -163 -635 358 77 -623 338 542 -655 -503 718 -299 -913 153 -16 -786 -143
2523 -143 636 -667 -575 780 429 -637 334 608 -164 428 803 -305 -821 503 468 -559 -173 111 -433
2542 -433 -196 711 -114 -848 580 662 -682 -383 235 -515 -450 514 -33 -998 -231 636 -363 -280 694 -44
2562 -44 -247 711 462 -811 -113 828 -289 -497 531 60 -268 577 495 -528 -17 940 166 -607 222
2581 222 77 -803 -155 299 -919 -590 577 -278 -635 112 58 -448 298 844 -371 -246 633 588 -497
2600 -497 -135 425 -175 -85 672 40 -466 297 706 -333 99 621 94 -303 93 -273 -779 -111 34 -646
2620 -646 -470 233 -327 -543 401 286 -359 173 628 -35 -52 414 381 -378 623 462 -178 -28 518 179
2640 179 -70 438 186 -255 43 347 -622 -237 -58 -323 -841 -332 -111 -532 -154 329 -121 77 489 341
2660 341 70 223 440 -101 193 648 -141 -48 345 -7 -274 -251 621 85 -177 162 -31 -324 -133 -141 -401
2681 -401 -408 -159 -350 -236 1 35 -253 42 255 226 293 617 260 198 250 400 -47 67 331 -14 -172 245
2703 245 70 -326 -9 237 -20 -197 -226 -135 -313 -191 263 -216 -301 215 -256 -100 370 208 136 253 133
2724 133 234 28 128 145 173 303 297 -34 268 138 -212 -93 -342 -199 -116 -135 213 86 -243 -19 -263 -114
2746 -114 286 -164 -286 -131 262 -182 -13 116 116 233 262 248 -44 -63 58 -155 202 -58 20 -142 -196 51
2768 51 101 57 18 -67 -58 -146 -37 -232 -141 -303 267 -161 92 72 -154 -128 -77 157 198 241 34 -110 -83 29 104
2793 104 -144 350 -43 -68 156 182 36 -92 21 55 -74 -80 -126 -60 -70 -114 -159 -424 32 -285 -217 -11 -163 -256
2817 -256 -10 -205 -17 -88 112 21 -102 121 -63 -25 288 261 -84 162 -31 -64 -74 -13 -61 -532 -180 54 -393
2840 -393 -331 -11 -4 -94 -123 69 11 -66 137 -28 80 230 108 -396 392 203 -9 71 105 127 -74 287 -121
2863 -121 -225 -81 95 -93 50 -29 -67 -196 -65 -67 -459 -236 202 -125 -326 123 37 -288 -86 296 57 -201
2885 -201 301 126 -174 186 306 -44 -24 324 76 -182 138 339 -88 -55 188 -329 -211 106 -40 -308 -160
2906 -160 243 -324 82 -72 -139 -310 273 14 -333 -61 372 -13 155 384 21 -145 431 269 -241 48
2926 48 392 126 -327 239 -182 -328 148 121 -573 37 521 -251 -458 176 62 -194 107 151 -503 -546 274
2947 274 -64 -572 -11 152 43 202 411 -1 -161 459 512 -247 95 387 -108 -194 571 -304 -543 415 363
2968 363 -578 -265 -27 -440 -345 241 -63 -831 75 484 -172 -537 -2 -88 166 390 153 -243 233 881 104
2989 104 -164 361 104 -144 148 72 -708 -135 295 22 -541 193 46 -355 197 152 -430 -283 226 -73 -243
3010 -243 -37 253 -266 435 566 -311 15 549 544 116 525 392 -95 376 378 -157 -471 420 10 -671 -566
3031 -566 75 -95 -107 454 -442 -635 -24 201 -345 -296 199 -81 47 276 49 -544 317 523 28 -33 347
3052 347 389 153 483 2 -748 97 357 -153 -485 131 -265 -229 -37 28 -650 133 615 -101 -409 14 64
3073 64 -397 62 126 -431 -277 552 270 -269 103 429 54 213 471 -183 -279 386 80 -469 -147 168 -521
3094 -521 -385 225 -244 -397 -43 421 -310 -184 297 40 -76 450 -102 -280 231 284 -249 49 362 -29
3114 -29 12 521 66 0 -27 624 7 -141 226 -26 -151 54 -66 -177 -205 336 -67 -295 34 71 -124 1
3136 1 143 -304 -96 45 82 -413 11 223 18 25 355 3 74 461 163 -150 -74 384 62 -66 183 -258
3158 -258 -281 196 135 -232 -226 125 -199 -232 -44 -142 -256 194 1 -326 -120 108 -2 -125 218 200 14 151
3180 151 364 -23 187 66 284 -158 -116 -52 -336 151 119 -50 -59 -96 -264 -321 -223 -302 -262 -24 -84 -170 -146 -235 -59
3205 -59 -20 317 62 24 -62 -62 -52 -275 68 130 -86 -248 139 -132 -197 160 -135 -80 -45 -134 123 -319 -133 72
3229 72 -206 -223 112 -108 179 133 18 -80 305 153 -216 180 142 96 -79 -16 135 5 -120 22 -41 -148 40
3252 40 97 213 81 162 -125 -204 -40 -241 -195 -127 -118 -61 184 52 225 -97 141 35 42 183 301 131 32 -16
3276 -16 227 -135 217 -57 -97 191 211 192 99 112 161 260 -110 -178 -118 -140 -175 -313 96 154 -101 -103 -71 3 -111 233
3302 233 382 86 -59 263 -161 -120 -91 126 202 80 32 118 260 13 156 102 130 1 -120 49 41 -132 -45
3325 -45 -89 -133 -203 19 31 75 -36 -162 -173 191 242 43 -113 93 -16 50 -140 28 143 79 352 107 129 111
3349 111 241 266 -243 -234 -213 -202 -188 -216 -13 -138 -180 -147 -314 40 61 48 47 485 -63 -94 72 189 109 -109 -33
3374 -33 -36 244 49 77 2 95 164 -116 -31 210 -70 -517 -221 57 -468 -194 -97 -323 -342 20 1 -34 246 -52
3398 -52 -4 75 199 -121 74 181 45 -212 418 167 -10 197 342 28 -61 176 80 112 -113 164 -243 -121
3420 -121 89 -309 -453 116 -174 -228 -232 152 10 -81 206 276 -85 -153 282 -206 -33 23 176 -180 -39 63
3442 63 -464 152 193 -27 -98 206 74 -357 -156 -23 -267 -245 76 -5 11 -151 40 -33 -109 492 -102 112 339
3465 339 224 -44 173 105 -122 -8 131 -203 -188 253 9 5 -25 138 -45 3 146 -181 -435 217 -32 -305
3487 -305 54 53 42 -199 14 6 -222 -19 290 -191 -199 408 111 -410 310 106 -318 144 308 -94 -364 264
3509 264 155 -329 187 44 -410 -23 18 -72 -396 76 -31 -423 -139 338 -138 -135 105 278 -341 -81 81
3530 81 -153 97 183 -20 -8 223 25 -316 263 221 -21 -108 127 138 -140 159 110 -532 -45 -12 26 -191 -9
3553 -9 -176 -325 -125 -24 -285 247 331 -5 -198 264 179 -134 147 115 -129 -100 284 246 -109 181 479 -114
3575 -114 165 96 -250 -209 280 75 -267 -170 -23 -99 -237 -77 11 -344 162 206 -273 -156 -48 163 303 -40
3597 -40 20 -192 233 271 -59 -26 96 -91 -38 163 119 -63 -52 225 278 -196 317 -128 -116 73 -55 -255 74
3620 74 385 93 -179 -142 265 -184 -126 88 -263 397 160 5 -88 -86 146 -16 -290 15 -150 37 314 178
3642 178 -198 31 -25 -117 -135 -32 18 -130 -52 30 -21 -41 6 -38 -47 -83 -37 -58 -110 149 -58 58 120 218 103 170
3668 170 255 75 74 15 -178 -138 -15 136 25 24 141 79 -405 71 62 -13 -109 -53 -81 -23 -181 -113 26 298 31
3693 31 22 33 49 103 70 120 -72 -34 -235 190 85 -274 1 -253 228 30 -86 79 -130 -312 -334 -69 -105 -222
3717 -222 -47 38 -156 -105 217 9 65 119 51 378 -190 85 343 73 106 70 3 210 -62 139 -93 149 62
3740 62 -47 27 -48 -34 58 -351 113 28 16 -142 105 -250 -204 -81 -7 7 106 180 79 30 110 37 -13 60 80 -255
3766 -255 62 40 -125 26 -4 -95 67 -90 22 -69 28 -90 -84 203 49 -279 -113 149 32 62 -199 -41 117
3789 117 294 280 39 -17 348 154 102 111 -166 34 94 -64 -79 80 -375 -82 51 -232 -307 -53 37 56 -198
3812 -198 -51 -89 -93 -105 131 65 -192 117 183 211 20 194 289 93 38 -42 -62 -265 146 -275 -73 169 27 -116
3836 -116 -31 -23 -172 -59 25 -53 -73 -146 103 71 14 241 -198 -53 239 120 156 116 275 328 14 -125 121 -10
3860 -10 -23 -44 197 98 50 -232 -56 -189 -82 -146 172 201 -62 5 115 -158 -116 -19 -270 -103 53 208 -59
3883 -59 -24 -37 -46 -232 163 197 45 -170 289 -177 -127 -105 36 -104 -183 152 -30 -107 198 178 -164 111 -100 20
3907 20 148 44 -33 -41 193 68 -24 176 109 -75 38 19 20 -109 95 195 -73 -256 333 54 -19 72 -202 85
3931 85 267 -246 -122 -13 96 -19 -343 186 -92 -191 317 -18 -109 -463 -164 -69 -85 33 66 -99 73 173
3953 173 410 24 250 -52 -32 -106 257 -109 -11 -30 -147 -139 -198 -51 -202 141 -140 -345 105 -17 -182 -12
3975 -12 -63 9 -118 -40 66 -287 -74 -12 193 -33 107 83 134 183 54 43 -58 122 142 -118 -162 -64 33 -22 127
4000 127 -201 4 -123 205 -224 -86 -184 -157 -95 -215 101 -105 -93 231 -35 -74 182 251 -60 43 85 96 67
4023 67 210 -148 -100 391 -331 17 168 19 234 -202 119 -233 -177 120 -46 -52 -272 142 -134 -21 87 -96
4045 -96 -130 126 33 138 -70 93 13 27 91 126 -12 -122 -134 136 -130 124 -87 -188 -97 -239 163 56 266
4068 266 -83 -280 74 18 -141 72 145 -161 -109 181 -103 -149 -102 51 -152 -17 278 290 -103 -27 110 14 -39
4091 -39 161 -191 -385 115 -92 -258 168 182 17 -64 -121 -162 -137 85 159 -133 54 282 54 -53 158 99 74
4114 74 -27 -75 -140 -81 106 89 -65 -130 5 46 247 108 -75 -150 -154 -37 -5 -237 283 -130 -142 60 -96 -200
4138 -200 219 -107 133 245 -97 51 -20 -175 35 67 132 -51 229 100 44 50 28 76 -13 -10 181 -11 -103 123
4162 123 -67 -70 -52 -95 15 -126 -143 23 -123 -213 221 72 -89 -152 70 -15 146 171 86 -27 -62 -122 180 55
4186 55 251 -19 91 -82 -29 -127 -135 -50 -146 -107 8 0 -182 132 -222 -28 -10 -43 88 -193 -206 91 -54 7 82
4211 82 -108 -47 172 -167 -9 70 -130 -50 -31 -117 -104 71 -222 -25 -135 -95 2 -264 58 210 -102 114 116 -67
4235 -67 -52 24 113 -48 -166 115 -35 124 -37 -3 -37 29 251 61 39 13 151 -37 -133 -77 -64 161 34 -174
4259 -174 -146 200 -45 -401 198 -137 48 -9 -109 -58 -85 16 190 93 -77 45 -20 240 363 123 -93 98
4281 98 -11 298 -47 105 142 -173 254 -203 -162 -57 276 -141 -114 -194 60 83 20 160 -104 -52 -41 30 11 41
4305 41 193 225 -156 -30 -97 32 3 -21 -33 128 221 36 -51 32 -117 101 -124 -8 -19 -8 223 237 -115 -109 154
4330 154 163 103 -144 5 52 172 45 208 236 -9 98 387 323 56 -197 142 -149 17 155 -21 86 32
4352 32 -102 -160 -171 -87 51 -256 110 143 -62 66 149 -137 42 227 3 -83 109 36 -135 39 155 1 -227
4375 -227 -33 16 83 -1 96 -143 107 -135 -164 31 82 28 67 -4 120 -203 -73 -62 29 -166 41 207 171 -112
4399 -112 -29 -93 89 -160 -152 86 -20 128 -114 160 217 36 -44 33 207 -62 -67 -23 -51 118 -60 92 -307 46
4423 46 -41 -33 -297 9 112 -183 141 -56 -183 112 -84 113 -43 137 -92 39 71 -126 -32 91 43 -88
4445 -88 -103 173 88 -115 47 22 -231 -56 86 -21 -78 -137 -9 39 56 -144 -192 60 307 -6 -370 -18 -120
4468 -120 87 -100 69 39 97 187 -7 -139 -13 191 -3 -289 -23 27 36 -161 147 -125 -157 107 -137 -38 153
4491 153 87 -199 57 -2 -250 12 168 -8 126 28 -237 71 33 58 136 -127 136 -56 -57 -94 5 -124 27
4514 27 174 -114 -164 -126 -51 -88 -94 85 172 21 -97 -237 -47 121 130 -34 -119 -12 67 42 -123 103 -2 -43 186
4539 186 -68 205 193 -66 -91 103 -65 -84 -205 205 -7 -149 41 -304 -70 -279 -26 -349 -131 117 196
4560 196 49 82 205 27 -52 -98 128 -22 123 180 -79 55 305 136 -33 -5 157 21 27 -58 -264 -132 -151
4583 -151 -86 191 -50 -69 -49 -28 -119 -192 -46 75 -29 -134 33 -157 -65 5 372 61 109 280 83 43 -39 15
4607 15 129 -18 -51 86 34 -257 53 -147 195 209 -14 -57 6 -29 177 42 -180 -328 30 268 -22 -59 -101
4630 -101 27 -99 -92 -66 64 -4 16 -126 -70 472 394 -43 -284 4 224 67 -17 -90 -44 86 27 -59 82 266
4654 266 152 -21 -22 -22 223 -136 -91 -17 187 77 -1 -48 -121 104 119 -172 276 130 -175 71 -32 -218 -21
4677 -21 -66 48 -97 105 69 -117 -97 -195 69 3 39 -19 -92 87 305 3 111 -7 12 92 40 -83 164 5
4701 5 -97 -56 66 -18 -183 -48 -108 -413 137 -169 47 -148 8 21 -19 -55 8 -152 -143 89 229 -94 -288 66
4725 66 64 -3 344 38 91 -60 149 -282 56 -6 20 79 310 -273 -231 80 -54 34 -287 -111 105 151 32 16
4749 16 -186 45 189 -121 47 -100 120 12 -242 -102 215 162 160 277 28 205 -16 -173 -133 164 12 67
4771 67 121 -24 -244 26 -49 54 45 -3 -272 54 65 45 186 44 -169 -97 -193 -105 -28 44 -59 -22 249 14 4
4796 4 175 -22 28 71 -106 -107 -157 -55 -26 -161 -36 48 -53 -80 -132 -260 -327 166 75 -238 -32 7 138 -65 99
4821 99 113 226 148 16 27 176 -64 -184 148 174 13 81 -91 250 96 -158 -12 -110 226 -67 -253 -167 156
4844 156 -38 -111 26 -143 156 -8 -82 120 -10 17 -128 166 164 5 -101 183 26 -29 113 64 47 -20 0
4867 0 -85 21 6 -334 -200 38 -107 255 41 -317 -4 68 -27 -318 212 -74 -212 -129 -239 13 84 73 219
4890 219 44 192 225 27 -94 -3 157 -120 -8 -15 -49 -74 -80 92 88 93 -99 60 234 -163 -59 -178 -91 45
4914 45 196 -85 -324 394 187 -1 23 -58 211 17 75 50 -126 189 268 -77 69 149 -279 -224 32 -266 291
4937 291 -46 75 177 111 132 -191 -515 127 -271 -228 10 109 93 160 -7 -473 16 -15 40 -41 98 -109 -112 1
4961 1 186 209 102 -98 -48 47 53 -45 -110 -53 114 -301 -217 22 -19 -194 -161 40 -108 156 -160 103 114 115 73 -82
4987 -82 -3 180 13 -104 104 156 -103 124 130 -130 -36 -18 -58 -169 -25 151 7 158 -106 -51 -64 -296 -86
5010 -86 -34 -248 163 74 138 241 -7 -126 250 -59 -8 -128 -12 -86 -76 177 147 -68 -212 83 -151 -44 155
5033 155 -62 -9 126 -125 -93 -7 -9 57 140 -57 -96 -68 15 197 -8 36 -149 227 -20 -39 224 -153 172 11
5057 11 69 -192 -185 142 -36 72 66 -4 -203 230 -265 205 44 -141 17 -334 -147 -208 -62 174 252 87 88 -110
5081 -110 -39 142 174 166 182 -17 125 22 161 38 38 -80 -75 -143 -119 -44 60 -92 -209 34 -96 -24 -136 62
5105 62 -85 84 102 -101 -108 -43 -57 115 189 -136 102 48 126 -152 117 100 129 81 -152 29 67 -279 -235 10 58
5130 58 208 74 -92 -164 -84 20 -109 183 69 36 -24 59 188 -8 -95 -141 -53 59 -24 179 -8 117 441
5153 441 114 -80 191 -4 9 -215 -25 121 -67 6 -117 15 -147 44 108 -156 29 -77 -176 58 232
5174 232 -84 115 11 -142 8 -104 209 39 269 -225 98 99 50 -315 90 148 -27 136 -256 97 88 29
5196 29 -54 -87 -263 -175 -117 -1 116 -45 -147 -177 -20 -26 22 30 -100 -72 43 60 -81 56 -203 182 -175 -43
5220 -43 95 48 -118 -42 49 65 -98 -17 -257 0 -12 -27 -13 119 -49 114 -113 -36 208 -122 442 234 360
5243 360 111 31 -59 -34 118 -113 -71 9 120 177 -218 208 279 -62 17 26 4 -23 -155 20 -176 177 -151 165
5267 165 -29 41 19 -101 -108 82 -147 -25 -108 150 -57 84 35 -57 19 29 -394 -67 94 71 -18 -81 35 -291
5291 -291 9 34 33 69 -10 204 -205 -43 63 33 77 -21 22 -104 29 29 296 -207 -41 25 -119 227 41 -44
5315 -44 259 309 -66 -40 61 -9 -19 30 -329 134 -143 -73 -42 152 219 131 70 -150 93 16 -100 -216 1 -132
5339 -132 -79 44 83 287 -91 168 151 61 -11 -161 23 -38 74 -77 -227 -134 21 -33 -161 121 -44 66 38
5362 38 -36 -157 -110 13 -54 -213 4 -23 -83 -20 -10 -391 -103 -7 173 -16 -164 33 156 197 101 75 142 -212
5386 -212 -136 -19 -161 62 -104 157 -17 101 4 48 -75 -162 33 -176 144 0 -136 59 103 23 64 1 -283
5409 -283 33 107 171 109 110 -142 240 -62 96 26 -141 62 18 -57 -222 67 39 -35 -107 -192 -52 -139 -64 67 138
5434 138 236 42 58 -169 366 29 -181 292 50 -222 15 -60 -72 -3 -437 14 -1 -5 33 163 -73 30 107
5457 107 91 142 -177 432 154 38 196 127 -232 36 -114 -215 118 125 -343 13 -24 304 76 180 -273 -106
5479 -106 54 -48 180 62 87 -191 -259 -29 -88 159 -47 125 -144 63 170 -159 -137 -35 -106 105 162 -153
5501 -153 -144 -40 85 -122 171 164 93 24 53 138 -148 -9 -77 -64 -167 28 -198 -74 -77 -302 54 -42 -13 -61 196
5526 196 -22 228 -139 -51 2 26 -60 219 -60 75 372 238 89 64 183 -94 32 86 -97 -60 92 -17
5548 -17 94 117 -50 62 -31 -185 -41 114 -160 -143 -8 -87 -251 243 -123 -57 137 236 154 158 104 -120 42 107
5572 107 4 -51 180 157 62 -153 -93 -1 -225 11 119 -87 -207 -91 45 -21 45 -106 -56 -40 -55 -75 52 -65
5596 -65 64 -230 -155 -173 169 -8 168 -43 -67 -31 90 125 129 115 9 -130 -48 21 -67 -285 -75 8 -53 51 26
5621 26 33 -64 39 87 -175 -54 17 32 21 28 192 89 -88 98 -80 -140 -132 120 -114 66 35 -98 -128 -128 -9 -33
5647 -33 246 -82 219 -122 -121 -37 -80 -21 -110 304 216 52 136 -75 -13 -154 -123 -40 -237 -348 -115 -150 142 163 101
5672 101 10 -13 -162 -121 178 112 -300 -3 123 -111 -115 4 -52 -174 -271 -26 25 -10 225 461 0 -58 -117 -50
5696 -50 339 -39 -9 20 98 86 -2 -125 134 -77 -66 -214 -145 -169 79 -132 -71 230 -230 -178 -22 58 254 128
5720 128 34 -49 231 7 126 -227 -32 -91 132 -25 124 6 288 -268 -11 91 -72 -27 -142 91 -59
5741 -59 -78 112 4 16 -247 -19 -11 86 -9 108 -150 -67 81 96 -175 -33 -38 19 9 -62 45 -247 151 -4 -26
5766 -26 -64 138 75 116 127 -185 -129 -39 -124 39 -162 -277 54 3 -227 118 80 -67 -155 31 87 -163 -172 81 128
5791 128 73 -138 -98 -32 209 6 11 -26 4 -161 -202 -138 167 12 167 182 126 253 -54 184 25 -177 -13 298
5815 298 27 58 -82 -99 21 -54 43 -64 -7 132 204 -48 82 -72 -59 53 -161 -115 8 15 -44 57 39 -29
5839 -29 258 108 -16 44 142 93 -72 70 178 45 -216 81 90 318 -154 175 245 43 26 -20 -53 178 58
5862 58 9 30 -173 150 121 -182 -35 -147 -53 -108 -74 -106 -109 135 244 -247 -260 -15 -1 -141 -30 -126 -76 130 18
5887 18 -209 -148 138 106 218 -76 167 108 -161 -244 245 -109 -194 -153 57 -109 -233 131 -17 12 -45 -92 -204
5910 -204 -239 178 47 -148 107 -164 -227 44 -74 -127 -164 -231 -55 -55 42 154 15 -46 -21 205 41 87 127 113
5934 113 -129 -172 -122 79 63 -7 137 -38 197 129 75 -64 66 37 42 135 110 6 -44 4 135 92 52 140 133 137 -167
5961 -167 -26 -31 62 84 227 19 109 224 39 -57 -31 -240 59 -62 -73 98 114 -41 -5 201 117 76 -135 -92
5985 -92 56 -83 -202 -65 -167 -273 -114 184 13 10 -8 -253 -31 8 -172 180 -95 -393 -225 125 78 127
6007 127 118 4 -31 -174 139 -62 -74 -173 -90 -78 -169 269 401 -298 -58 126 -45 -138 19 174 -16 -43 263
6030 263 140 334 -48 -83 234 -5 80 -109 -106 173 -31 -80 77 -79 -69 -90 84 173 -15 -51 100 83 -190
6053 -190 -62 -128 17 265 -56 5 150 12 10 -149 -147 186 -32 -45 -38 -119 16 39 61 -228 -91 246 137 -127
6077 -127 27 -11 54 136 64 67 -57 35 98 -75 -60 -63 141 24 -108 -9 -115 -121 48 5 2 -108 -149 89 83 51 81
6104 81 -117 54 27 -35 16 110 -61 -36 49 -152 -178 -159 103 -78 -67 105 177 158 50 60 266 200 -219 -163 14
6129 14 30 45 -151 -295 65 -199 71 -36 -196 33 -130 232 -153 -5 -96 -208 86 7 -21 132 -51 167
6151 167 -101 82 196 154 -99 -143 -16 218 -217 -27 -150 -233 -145 -134 52 -335 22 -18 150 -123 -279 33
6173 33 -70 250 76 -28 -139 -100 26 80 -163 39 18 88 -28 274 -157 -170 116 194 -14 -119 32 164
6195 164 -111 -192 15 -158 -24 -35 -163 -75 11 -110 -12 254 -174 -46 -258 -119 1 -150 195 76 -47 197
6217 197 49 -121 148 226 -4 100 170 171 1 1 160 14 159 64 92 12 51 -57 107 -260 35 -34 -236 242
6241 242 -36 237 60 -31 47 -4 32 -13 -10 -250 -270 29 -25 8 -103 77 70 70 147 -162 -180 119 45 109 39 -136
6267 -136 193 4 343 28 -12 195 97 -91 -133 -68 72 -14 43 159 -57 -186 159 -367 -181 24 -258 49
6289 49 -380 2 191 -40 84 154 29 37 57 -126 -121 3 149 -77 -212 -167 87 115 -81 -44 4 -115 85 253
6313 253 126 121 -161 -46 -41 -20 -183 -53 18 -121 -68 97 136 -72 37 -198 -159 84 -30 -21 31 -73 -179 199
6337 199 -46 353 -130 9 -135 22 380 -229 22 -49 125 -6 137 -44 -139 163 -20 43 15 -65 -170 11
6359 11 -5 41 -112 -57 94 -40 174 -212 -344 -41 -33 -257 -75 -24 62 -138 -187 -138 15 -247 -132 120 -200
6382 -200 68 13 162 193 -38 -252 -50 -106 2 92 -74 -266 -7 -9 -143 23 -6 -37 195 88 226 131 -84
6405 -84 21 -66 -235 17 280 165 -11 61 62 -279 -100 20 -264 -87 -132 -207 -40 118 -116 -101 -101 50 -75
6428 -75 -45 31 11 196 -15 -185 -274 60 51 104 -148 125 81 203 20 -263 -93 45 86 306 36 12 -120 109
6452 109 -35 104 -115 -56 -189 -48 -90 107 20 -146 119 -223 -193 57 -47 -190 137 -114 -71 173 77 62
6474 62 25 110 -270 -63 43 19 30 -55 90 156 -157 -19 91 -170 171 109 -53 -296 -75 28 -143 -33 -14
6497 -14 34 -138 152 -139 -12 174 -98 -45 -291 -43 123 226 241 29 -113 -95 -80 83 -107 49 -15 -226
6519 -226 -66 7 -29 -45 44 31 73 15 4 49 -180 157 -42 -47 -119 -88 -71 -131 59 69 159 106 -240 10 106 132 94
6546 94 92 -37 19 -196 -23 -180 61 8 -68 -37 -48 -171 13 -21 41 26 -131 12 109 -167 148 -146 -107 30
6570 30 -46 135 178 130 162 81 257 186 -123 88 183 -76 93 90 -230 -85 -97 172 -168 -21 66 161 -112 120
6594 120 145 -10 -54 -98 -88 -45 -78 -69 112 -98 123 -81 -150 5 -10 -12 196 95 138 1 -55 44 85 124 -4 117
6620 117 29 37 231 216 109 17 -69 -78 105 114 -184 36 -301 177 -15 -57 -201 170 -35 87 -80 -86 -150 147 56
6645 56 -126 -40 -145 -140 -3 -205 -87 98 -45 -35 -128 -66 58 11 -57 1 -109 87 202 30 -183 -6 116
6668 116 -38 -67 -4 -42 52 -66 4 -168 155 -35 -265 -65 72 -68 185 117 -188 -27 -105 -249 99 -142
6690 -142 -116 -32 123 97 -36 133 -70 109 -172 -48 -51 47 96 -257 38 -54 -19 -30 70 199 49 6 -65 -1
6714 -1 174 101 -272 -140 248 -118 -9 -181 -395 -59 275 -11 -105 44 -38 71 -138 77 16 -130 -129 253 -80
6737 -80 43 28 -38 -136 50 100 232 -13 35 -96 133 174 74 -129 -143 -116 -314 212 -308 -265 -68 119 -159
6760 -159 -197 -56 -142 194 -79 -290 -110 41 26 96 -8 86 178 -250 56 21 -167 514 -245 115 171 -60 239
6783 239 -80 -78 -133 -151 -70 19 115 7 -31 369 187 34 -38 -117 37 189 -148 24 143 -19 -47 -174 -214 132
6807 132 59 -39 -60 -116 53 -204 -219 190 90 -81 23 79 -7 77 156 29 -87 133 63 25 -29 18 -10 46 272
6832 272 -95 -55 -8 -29 -55 -251 -153 -86 161 114 -298 -247 16 -68 20 -53 109 -143 68 222 96 -198 121 -12
6856 -12 311 69 -104 -12 -80 44 100 282 287 27 45 -105 -16 22 -136 -110 110 79 -113 -107 17 -6 75 30 11 -19
6882 -19 125 -46 -84 -210 -229 -188 46 -194 -36 -44 -54 -141 -126 -11 66 111 -95 111 198 -30 89 108 -112 162
6906 162 -83 87 126 52 80 -67 139 -126 158 19 225 129 -101 -91 -12 140 18 -143 -96 80 137 -51 -69
6929 -69 -40 -3 -5 128 -54 46 -14 112 0 265 19 80 205 47 63 -19 50 -97 -21 -119 -98 -93 -28 -106 74 189
6955 189 -66 36 157 93 -76 -190 -37 60 -104 -2 -6 258 199 89 131 89 125 -17 -160 -174 -20 10 -83 -101
6979 -101 96 45 93 60 28 175 48 164 -63 17 2 -41 -37 45 60 34 4 130 -295 76 70 123 54 98 -146 49
7005 49 8 -116 80 47 -185 -282 343 69 -120 33 163 170 -97 -4 -102 -92 76 100 57 110 65 -52 -26 -97 50
7030 50 -176 36 46 -231 -184 -199 209 40 -294 140 -100 -15 95 50 60 51 176 -96 -178 25 -52 69 72 135 -23
7055 -23 29 55 21 -108 250 138 -201 48 62 73 -116 -24 -103 -42 -114 65 229 -176 -35 23 -185 128 -45 271
7079 271 117 -59 20 13 28 69 -13 130 -20 -22 -93 21 -181 -89 -25 94 -13 -71 -86 0 67 -329 -227 -129 173
7104 173 -90 -125 -26 -190 98 -127 -2 -26 -104 230 45 57 191 16 44 41 -134 220 170 71 -68 72 40 21
7128 21 -74 146 235 -102 153 -218 22 -78 59 94 -7 -86 -99 -73 -3 4 188 -22 46 4 79 -117 157 222 76
7153 76 100 157 172 -47 -233 -37 110 -39 -130 -44 200 -221 11 -37 119 -131 -26 -59 -9 28 -8 8 -127 -153
7177 -153 117 198 179 177 -29 51 291 347 -74 -143 148 96 -97 79 -36 -195 40 -9 3 283 -30 -41 -71 -20
7201 -20 -12 -227 -20 18 -225 92 140 70 -31 -175 34 328 119 -108 -104 85 201 54 -3 -111 -61 56 -4 -105
7225 -105 68 -122 -205 -38 -84 -123 101 -170 -4 20 -125 65 112 -84 -152 -56 77 25 226 255 20 -101 127
7248 127 -84 30 -102 -321 86 118 221 -3 -148 108 58 1 205 -129 -273 -40 -217 -185 -28 -107 -39 -45 -161
7271 -161 9 -9 -16 -159 -131 -110 -216 153 -67 -22 67 -11 36 157 -92 14 105 4 -77 -274 72 123 -26 40
7295 40 76 4 -254 100 47 -129 -32 -134 -53 107 -15 -167 9 99 121 6 -95 192 -60 123 -85 75 -186
7318 -186 14 -108 -25 -69 62 93 -5 -158 133 46 293 -5 -32 173 3 -34 -46 -85 -117 276 178 29 -50 -88
7342 -88 20 93 134 83 30 116 -40 -305 -257 308 -90 88 -102 147 -119 4 131 27 -116 -277 -7 23 -15
7365 -15 -96 -41 -137 -188 -208 142 74 -41 152 37 153 -191 67 417 109 399 -79 -48 -256 -113 10 112 -13
7388 -13 -41 -204 -41 -80 -81 138 31 -145 64 -189 19 68 -38 258 -78 114 -125 -44 -46 -43 86 -206 188 -88
7412 -88 244 9 -241 -266 -46 -85 -192 108 -89 29 -149 -54 -222 129 -34 -92 -135 -36 109 -76 -127 3 -79
7435 -79 -226 -1 -19 -111 134 36 -71 -12 156 -312 -120 221 252 -151 -61 37 0 244 73 -85 126 -45 11
7458 11 -27 -16 -22 -91 123 -130 70 -84 -67 92 175 79 60 168 -33 -115 30 -13 53 76 -75 -31 206 -115 18
7483 18 -160 -16 -104 -47 128 -122 -231 -29 41 -176 51 -31 -47 34 -59 -8 -110 -45 -24 132 -135 139 72 99
7507 99 40 38 136 45 107 -50 -13 -46 -174 -104 -48 18 16 -161 -14 -29 -219 216 -71 28 200 -74 -167 -5 -62 -290
7533 -290 -79 151 -116 -66 18 14 2 203 -167 51 -21 -361 47 -10 -157 85 256 -42 253 -103 -111 -22 456
7556 456 54 -96 -119 -20 -208 -121 -8 -124 -121 -35 66 17 -129 125 89 125 19 88 -178 18 -6 -77 41 72
7580 72 -126 -48 86 32 82 22 -128 -60 18 -153 153 254 -96 -184 -261 85 56 133 32 198 268 -146 -105 -67 69
7605 69 -54 93 -130 284 76 74 72 -122 -34 191 184 -121 23 91 -258 158 -65 117 -224 237 72 -16 108
7628 108 34 80 83 122 -138 89 38 43 -175 -17 -62 -11 215 43 -52 89 -38 122 -38 157 -12 -1 1 185 46
7653 46 -100 -6 -213 26 -30 -121 -146 -10 -72 101 -182 45 -85 -327 -14 -106 -7 131 -198 33 44 -27 15 -222
7677 -222 228 -110 -4 82 51 -79 -173 -13 -106 22 -71 174 120 134 119 168 74 328 94 47 -128 -263 -5 2
7701 2 100 68 -56 16 -61 24 -212 -104 -8 -74 160 -20 -154 -271 135 21 -91 15 -41 -29 6 -11 65 -84 -2
7726 -2 -209 -28 61 -8 -170 70 -163 -313 51 42 8 -103 -139 -36 -81 236 -5 -59 25 -244 -66 83 23 274
7750 274 57 -22 -35 189 94 25 -135 -53 -246 61 5 120 203 -117 84 113 5 -192 -15 5 40 87 120 170
7774 170 -4 10 -146 77 31 16 8 -158 -45 -19 -76 19 -197 89 -15 -194 24 -62 22 280 191 24 -173 82
7798 82 7 -205 76 -48 59 27 -40 220 73 -103 1 -16 -144 -154 -244 140 213 -7 110 112 -54 -95 -13 36
7822 36 303 -19 -52 -74 -56 115 -142 166 -44 93 102 -164 135 -42 -69 96 6 -53 149 98 -65 -388 -70
7845 -70 -380 -99 -9 -106 -84 141 205 -260 -1 -70 140 480 151 -74 -149 14 33 124 67 105 -33 -127 -50 -251
7869 -251 -73 -19 -110 -98 -69 59 72 -114 -28 92 -139 147 -37 45 2 340 259 127 137 -51 -164 -32 -204
7892 -204 -55 49 -183 -334 26 9 64 147 300 -131 72 71 51 -140 52 96 179 -122 -4 -131 -109 -87 102
7915 102 -114 -133 -29 82 269 -174 -100 5 9 48 -112 104 -130 -172 28 -154 -28 -176 82 -141 3 312
7937 312 -186 -107 -332 -307 231 -256 -359 -114 -59 -295 -84 -186 -32 -96 123 128 128 45 -131 -4 22 199 125 -24
7961 -24 198 -2 -180 -16 208 -56 92 -243 -241 127 1 195 41 70 -157 158 78 -72 153 167 -72 -266
7983 -266 -78 -39 86 -155 -155 -98 -1 -35 107 67 -83 180 -21 31 259 37 48 65 119 -13 106 -30 11 -323
8007 -323 -177 -262 167 26 -141 -191 -101 7 -2 32 -49 122 289 200 43 -24 363 95 31 -10 24 149 -157 -173
8031 -173 213 -109 -182 -45 95 109 35 -62 179 -115 187 212 -164 3 -9 -190 -182 -78 -56 -149 -142 34 160 15
8055 15 -82 56 -267 137 -172 -117 150 -112 10 21 -2 38 -94 -63 38 -50 -150 -79 77 -49 20 -141 -14
8078 -14 -52 91 -104 173 5 7 -9 -183 47 -53 194 32 36 86 -90 -45 -121 155 -86 55 15 8 -176 -136 -152
8103 -152 39 -153 3 -97 260 137 -67 -94 -69 160 129 -71 36 156 330 -222 76 51 -145 -188 -149 293
8125 293 42 39 118 135 50 131 39 173 269 -35 -255 80 -79 -15 15 181 120 98 51 -109 72 309 111 -134
8149 -134 49 -117 72 -49 -217 -109 10 -49 21 -295 2 46 66 -127 -44 171 37 18 -16 -87 -39 -87 -88 275
8173 275 95 -47 -128 -54 -126 -152 112 327 120 371 122 88 2 -85 152 -21 -65 96
8191I6
##END NTUPLES=NMR FID
##END=
