##TITLE=1H_Pr T-151
 CDCl3
 8 sc, 
 16.12.2021
##JCAMPDX= 6.0         $$ Bruker NMR JCAMP-DX V2.0
##DATA TYPE= NMR FID
##DATA CLASS= NTUPLES
##ORIGIN= UXNMR, Bruker Analytische Messtechnik GmbH
##OWNER= root
$$ XWIN-NMR		Version 3.5
$$ Thu Dec 16 11:38:55 2021 Russian Standard Time (UT+4h)  she@DPX200
##.OBSERVE FREQUENCY= 200.131346
##.OBSERVE NUCLEUS= ^1H
##.DELAY= (6, 6)
##.ACQUISITION MODE= SIMULTANEOUS
##.ACQUISITION SCHEME= undefined
##.AVERAGES= 8
##.DIGITISER RES= 18
##SPECTROMETER/DATA SYSTEM= spect
##.PULSE SEQUENCE= zg30
##.SOLVENT NAME= CDCl3
##.SHIFT REFERENCE= (INTERNAL, CDCl3, 0, 15.7039)
##AUDIT TRAIL= $$ (NUMBER, WHEN, WHO, WHERE, WHAT)
$$ ##TITLE= Audit trail, XWIN-NMR		Version 3.5
$$ ##JCAMPDX= 5.01
$$ ##ORIGIN= Bruker BioSpin GmbH
$$ ##OWNER= she
$$ F:/spectra/data/she/nmr/H-F/1/audita.txt
$$ ##AUDIT TRAIL=  $$ (NUMBER, WHEN, WHO, WHERE, WHAT)
(   1,<2021-12-16 11:37:28.50 +0400>,<she>,<DPX200>,
      <created by zg, POWCHK disabled, PULCHK disabled
       configuration hash MD5:
       00 E9 B6 7A A2 85 ED C7 34 08 36 98 17 FE 4E 26
       data hash MD5: 16K
       61 CE 25 A5 55 C0 A9 CF C1 C5 F7 69 ED 25 E0 65>)
$$ ##END=
$$ 
$$ hash MD5
$$ A4 4F 59 74 24 A0 A2 BD 3D B2 48 20 71 54 89 8A
##$RELAX= 
##$RELAX= 
##$RELAX= 
##$RELAX= 
##$RELAX= 
##$RELAX= 
$$ Bruker specific parameters
$$ --------------------------
##$DU= <F:/spectra>
##$EXPNO= 1
##$NAME= <H-F>
##$PROCNO= 1
##$TYPE= <nmr>
##$USER= <she>
##$AMP= (0..31)
100 100 100 100 100 100 100 100 100 100 100 100 100 100 100 100 100 100 
100 100 100 100 100 100 100 100 100 100 100 100 100 100 
##$AQSEQ= 0
##$AQ_mod= 1
##$AUNM= <au_zg>
##$AUTOPOS= <>
##$BF1= 200.13
##$BF2= 200.13
##$BF3= 200.13
##$BF4= 200.13
##$BF5= 200.13
##$BF6= 200.13
##$BF7= 200.13
##$BF8= 200.13
##$BYTORDA= 1
##$CFDGTYP= 0
##$CFRGTYP= 5
##$CHEMSTR= <none>
##$CNST= (0..31)
1 1 145 1 1 1 1 1 1 1 1 1 1 1 1 1 1 1 1 1 1 1 1 1 1 1 1 1 1 1 1 1 
##$CPDPRG= <>
##$CPDPRG1= <>
##$CPDPRG2= <>
##$CPDPRG3= <>
##$CPDPRG4= <mlev>
##$CPDPRG5= <mlev>
##$CPDPRG6= <mlev>
##$CPDPRG7= <mlev>
##$CPDPRG8= <mlev>
##$CPDPRGB= <>
##$CPDPRGT= <>
##$D= (0..31)
0 1.2 0 0 0 0 0 0 0 0.06 0 0.03 0 0 0 0 0.0002 0 0 0 0 0 0 0 0 0 0 0 0 
0 0 0 
##$DATE= 1639640247
##$DBL= (0..7)
120 120 120 120 120 120 120 120 
##$DBP= (0..7)
150 150 150 150 150 150 150 150 
##$DBP07= 0
##$DBPNAM0= <>
##$DBPNAM1= <>
##$DBPNAM2= <>
##$DBPNAM3= <>
##$DBPNAM4= <>
##$DBPNAM5= <>
##$DBPNAM6= <>
##$DBPNAM7= <>
##$DBPOAL= (0..7)
0.5 0.5 0.5 0.5 0.5 0.5 0.5 0.5 
##$DBPOFFS= (0..7)
0 0 0 0 0 0 0 0 
##$DE= 6
##$DECBNUC= <off>
##$DECIM= 32
##$DECNUC= <off>
##$DECSTAT= 4
##$DIGMOD= 1
##$DIGTYP= 9
##$DL= (0..7)
0 120 120 120 120 120 120 120 
##$DP= (0..7)
150 150 150 150 150 150 150 150 
##$DP07= 0
##$DPNAME0= <>
##$DPNAME1= <>
##$DPNAME2= <>
##$DPNAME3= <>
##$DPNAME4= <>
##$DPNAME5= <>
##$DPNAME6= <>
##$DPNAME7= <>
##$DPOAL= (0..7)
0.5 0.5 0.5 0.5 0.5 0.5 0.5 0.5 
##$DPOFFS= (0..7)
0 0 0 0 0 0 0 0 
##$DQDMODE= 0
##$DR= 18
##$DS= 0
##$DSLIST= <SSSSSSSSSSSSSSS>
$$ [...]
##$SUBNAM2= <"">
##$SUBNAM3= <"">
##$SUBNAM4= <"">
##$SUBNAM5= <"">
##$SUBNAM6= <"">
##$SUBNAM7= <"">
##$SUBNAM8= <"">
##$SUBNAM9= <"">
##$SW= 18.0517287032376
##$SWIBOX= (0..15)
0 0 2 0 0 0 0 0 0 0 0 0 0 0 0 0 
##$SW_h= 3612.71676300578
##$TD= 16384
##$TD0= 1
##$TE= 0
##$TE2= 300
##$TE3= 300
##$TEG= 300
##$TL= (0..7)
0 120 120 120 120 120 120 120 
##$TP= (0..7)
150 150 150 150 150 150 150 150 
##$TP07= 0
##$TPNAME0= <>
##$TPNAME1= <>
##$TPNAME2= <>
##$TPNAME3= <>
##$TPNAME4= <>
##$TPNAME5= <>
##$TPNAME6= <>
##$TPNAME7= <>
##$TPOAL= (0..7)
0.5 0.5 0.5 0.5 0.5 0.5 0.5 0.5 
##$TPOFFS= (0..7)
0 0 0 0 0 0 0 0 
##$TUNHIN= 0
##$TUNHOUT= 0
##$TUNXOUT= 0
##$USERA1= <user>
##$USERA2= <user>
##$USERA3= <user>
##$USERA4= <user>
##$USERA5= <user>
##$V9= 5
##$VALIST= <valist>
##$VCLIST= <CCCCCCCCCCCCCCC>
##$VD= 0
##$VDLIST= <DDDDDDDDDDDDDDD>
##$VPLIST= <PPPPPPPPPPPPPPP>
##$VTLIST= <TTTTTTTTTTTTTTT>
##$WBST= 1024
##$WBSW= 4
##$XGAIN= (0..3)
0 0 0 0 
##$XL= 0
##$YL= 0
##$YMAX_a= 288231
##$YMIN_a= -285905
##$ZGOPTNS= <>
##$ZL1= 120
##$ZL2= 120
##$ZL3= 120
##$ZL4= 120
##$ABSF1= 10
##$ABSF2= 0
##$ABSG= 5
##$ABSL= 3
##$ALPHA= 0
##$AQORDER= 0
##$ASSFAC= 0
##$ASSFACI= 0
##$ASSFACX= 0
##$ASSWID= 0
##$AUNMP= <proc_1d>
##$AZFE= 0.1
##$AZFW= 0.1
##$BCFW= 1
##$BC_mod= 2
##$BYTORDP= 1
##$COROFFS= 0
##$CY= 11.3945322036743
##$DATMOD= 1
##$DC= 2
##$DFILT= <>
##$DTYPP= 0
##$F1P= 2.36226072786647
##$F2P= -0.459571619588291
##$FCOR= 0.5
##$FTSIZE= 0
##$FT_mod= 4
##$GAMMA= 1
##$GB= 0.15
##$INTBC= 1
##$INTSCL= 1
##$ISEN= 128
##$LB= 0.24
##$LEV0= 0
##$LPBIN= 0
##$MAXI= 10000
##$MC2= 0
##$MEAN= 0
##$ME_mod= 0
##$MI= 1.114404
##$NCOEF= 0
##$NC_proc= 0
##$NLEV= 6
##$NOISF1= 3.799351
##$NOISF2= 2.8
##$NSP= 1
##$NTH_PI= 0
##$NZP= 0
##$OFFSET= 15.70392
##$PC= 1
##$PHC0= -15871.91
##$PHC1= 13.40079
##$PH_mod= 1
##$PKNL= yes
##$PPARMOD= 0
##$PSCAL= 0
##$PSIGN= 0
##$REVERSE= no
##$SF= 200.130013532006
##$SI= 16384
##$SIGF1= 3
##$SIGF2= 2
##$SINO= 400
##$SIOLD= 16384
##$SREGLST= <1H.CDCl3>
##$SSB= 0
##$STSI= 0
##$STSR= 0
##$SW_p= 3612.71676300578
##$SYMM= 0
##$S_DEV= 0
##$TDeff= 0
##$TDoff= 0
##$TI= <>
##$TILT= no
##$TM1= 0
##$TM2= 0
##$TOPLEV= 0
##$USERP1= <user>
##$USERP2= <user>
##$USERP3= <user>
##$USERP4= <user>
##$USERP5= <user>
##$WDW= 1
##$XDIM= 8192
##$YMAX_p= 0
##$YMIN_p= 0
$$ End of Bruker specific parameters
$$ ---------------------------------
##NTUPLES= NMR FID
##VAR_NAME=  TIME,          FID/REAL,        FID/IMAG
##SYMBOL=    X,             R,               I
##VAR_TYPE=  INDEPENDENT,   DEPENDENT,       DEPENDENT
##VAR_FORM=  AFFN,          ASDF,            ASDF
##VAR_DIM=   8192,          8192,            8192
##UNITS=     SECONDS,       ARBITRARY UNITS, ARBITRARY UNITS
##FACTOR=    0.0002768,     1,               1
##FIRST=     0,             0,               0
##LAST=      2.2672688,     0,               0
##MIN=       0,             -285905,         0
##MAX=       2.2672688,     288231,          0
$$ Real data points
##PAGE= N=1
##DATA TABLE= (X++(R..R)), XYDATA
$$ [...]
$$ plain form
1972 248 -467 254 -24 -698 664 731 -476 -137 798 314 -538 -42 443 -579 89 995 -557 -703 792
1991 792 237 -522 -227 285 -507 -369 783 -210 -960 391 746 -718 -209 554 -16 -76 545 440 -915
2010 -915 380 873 -368 -360 727 319 -114 439 208 -718 -130 881 -249 -869 308 256 -324 341 242
2029 242 -734 -345 953 118 -690 213 695 -638 243 651 -308 -414 968 228 -842 40 657 -323 -384
2048 -384 442 69 -650 588 410 -929 -192 545 -92 -780 194 199 -976 284 815 -752 -738 563 96
2067 96 -423 319 394 -225 -73 628 -14 -688 735 584 -586 -110 242 -436 -221 543 -228 -815 126 560
2087 560 -675 -540 670 -553 -180 382 34 -704 139 843 -10 -540 547 313 -643 439 495 -639
2105 -639 -244 664 -1 -681 -5 406 -288 258 464 -415 -177 664 107 -1020 29 204 -269 -401 387
$$ packed form
1972B48p15P21k78o74J362O7j207L39R35m84q52M96M85j022O68R06j552j46J495
1991G92n55p59K95N12p92J38J152r93p50J351L55j464N09P63n70o0O21j05j355
2010i15J295M93j241QJ087m08m33N53k31r26N88J011j130o20J177n2n80O65r9
2029B42r76L89J298q35q08R03M82j333Q81M08r59j06J382p40j070Q82O17r80o1
2048c84Q26l73p19J238j78j339P37P37o37o88R74Nj175J260N31j567J4J301m67
2067I6n19P42P5o19J52P01o42o74J423j51j170M76L52o78K15P64p71n87R41M34
2087E60j235J35J210j223L73N62l48p38Q43P04q53n30J087k34r56J082N6j134
2105f39L95R08o65o80O76M11o94N46K06q79K38Q41n57j127J049J75m73j32P88
$$ plain form
2124 387 -39 -437 708 236 -427 149 589 -73 -503 597 324 -347 415 604 -553 -214 776 31 -67
2143 -67 475 235 -518 -20 489 -388 -529 364 224 -630 115 247 -575 -257 194 -285 -359 58 523 -576
2163 -576 -90 478 -389 29 584 -180 -276 381 365 -46 -224 274 48 -325 451 -55 -476 -33 157 -391 -381
2184 -381 218 -6 -265 -58 170 -395 -23 454 -205 -236 369 51 -135 -57 357 13 -101 347 25 -180 217
2205 217 210 -101 -171 36 -19 -398 58 142 -206 100 340 -92 -259 -178 108 -258 -238 -22 8 -261 179 255 -89
2228 -89 319 252 -202 -14 -9 44 -7 161 257 -297 85 195 -35 -65 110 -237 -206 -8 -32 -215 -429 187 88 -166
2252 -166 -10 90 -64 59 95 -9 -57 -32 122 -3 -69 446 -39 139 130 89 14 155 -72 101 -78 150 1
2275 1 -397 35 -216 -260 54 -48 66 106 50 60 -157 -164 329 -140 179 220 -153 290 133 -136 68 113 5
$$ packed form
2124C87m26l98J145m72o63N76M40o62m30J100k73o71P62J89j157L39R90p45r8
2143f7N42k40p53M98N09q77j41Q93j40q54P45J32q22L18M51m79p4M17M65j099
2163e76M86N68q67M18N55p64r6O57j6m11j78M98k26l73P76n06m21M43J90n48J0
2184c81N99k24k59K07K28n65L72M77o59l1O05l18j86P8M14l44j14M48l22k05L97
2205B17pl11p0K07n5l79M56Q4l48L06K40m32j67Q1K86l66K0K16L0k69M40P6l44
2228h9M08o7m54J88NN3n1J68R6n54L82J10k30l0J75l47L1J98k4j83k14O16r9k54
2252a66J56J00j54J23L6j04m8K5J54j25o6N15m85J78rm1p5J41k27J73j79K28j49
2275Al98M32k51m4L14j02J14M0n6J0k17pM93m69L19M1l73M43j57k69K04M5j08
$$ plain form
2298 5 224 3 59 47 -79 -154 -123 -6 89 -186 -233 -245 -125 176 -269 95 155 -65 197 -69 117 -32 173
2321 173 -165 98 -2 310 54 -325 298 243 -89 314 -393 -410 184 15 -41 -242 92 97 -609 117 55 -217
2343 -217 72 215 -203 -179 130 122 7 -2 281 -116 -29 510 168 251 301 332 -315 -85 263 168 -390 424 262
2366 262 -449 -45 248 -451 -47 65 96 -386 -153 303 -90 -114 355 -68 -135 212 -68 -135 376 453 -256 -239
2388 -239 349 302 -304 361 402 23 268 508 -324 -295 289 133 -393 -118 507 -579 -92 258 -234 -434 516
2409 516 77 -528 -126 221 -122 -162 330 274 -592 337 559 -556 -307 474 -85 -307 358 235 -349 151
2429 151 604 -672 -343 520 -191 -687 270 258 -440 -94 653 -173 -761 361 584 -935 -119 665 -117
2448 -117 -360 791 159 -444 9 681 -714 -402 888 -379 -597 439 199 -545 -134 366 -309 -529
$$ packed form
2298EK19k21N6j2j26p5L1J17R5k75m7j2J20L01m45L64O0k20K62k66J86j49K05
2321A73l38K63j00L12k56l79O23n5l32M03p07j7N94j69n6k01L34Np06P26o2k72
2343b17K89J43m18K4L09qj15rK83l97Q7N39l42Q3N0L1o47K30L48r5n58Q14j62
2366B62p11M04K93o99M04J12L1m82K33M56l93k4M69m23o7L47k80o7N11P7p09J7
2388b39N88m7o06O65M1l79K45K40q32K9N84j56n26K75O25j086M87L50m92k00R50
2409E16m39o05M02L47l43m0M92n6q66R29K22j115K49P81n59k22O65j23n84N00
2429A51M53j276L29Q63p11m96R57j2o98L46P47q26n88J122K23j519Q16P84p82
2448a17k43J151o32o03M53O72j395L12J290j267k18J036k40p44M11N00o75k20
$$ plain form
2466 -529 567 5 -853 338 40 -783 -265 614 -367 -609 344 573 -670 -295 811 -598 -558 857
2484 857 82 -440 397 492 -492 -299 753 -308 -721 593 421 -882 -61 783 -468 -603 593 -12
2502 -12 -804 435 706 -430 -377 691 -345 -531 819 160 -628 384 958 -396 -635 751 468 -683
2520 -683 433 561 -845 -119 655 -166 -764 244 470 -804 45 863 -754 -456 840 3 -852 401
2538 401 502 -843 -569 1011 42 -614 809 340 -1142 250 591 -466 -622 716 222 -546 220 843
2556 843 -874 -258 941 -491 -921 492 485 -717 -2 812 -419 -314 981 245 -642 119 699 -596
2574 -596 195 693 -199 -615 554 596 -813 -134 736 -502 -434 774 16 -466 345 618 -412 -403 853
2593 853 -244 -669 341 532 -581 334 316 -445 -423 312 370 -641 328 606 -285 -123 698 -284 -465 652
$$ packed form
2466e29J096n62q58J191k98q23N18Q79r81k42R53K29j243L75J106j409M0J415
2484H57p75n22Q37R5r84J93J052j061m13J314j72j303Q21Q44j251j35J196o05
2502a2p92J239K71j136N3J068j036j86J350o59p88J012N74j354k39J386k83j151
2520f83J116J28j406P26P74q21n98J008K26j274Q49Q18j617K98J296q37q55J253
2538D01J01j345K74J580r69o56J423m69j482J392L41j057j56J338m94p68P66O23
2556H43j717O16J199j432m30J413pj202P15Q14j231J05J295p36q87P61N80j295
2574e96P91M98q92m16J169M2j409O79Q70j238O8J208p58m82Q11K73j030RJ256
2593H53j097m25J010J91j113R15j8p61K2P35N8j011R69K78q91J62Q21r82j81J117
$$ plain form
2613 652 250 -82 -66 472 -485 -425 766 35 -655 255 392 -530 -121 436 -167 -582 446 202 -524 29
2633 29 834 -265 -366 226 91 -335 299 313 -407 -224 413 -75 -563 527 -88 -539 -59 381 -268 -301
2653 -301 393 -64 -448 78 299 -698 -404 386 -166 -177 387 236 -304 -50 309 -134 -354 351 -66 -532
2673 -532 272 250 -163 28 253 130 -319 79 130 -426 -3 260 -652 -367 206 -61 -184 13 229 -115 95
2694 95 163 -49 -185 290 351 -290 327 259 -245 171 251 211 -309 24 267 -325 -183 179 20 -190 108 319
2716 319 -193 -64 -37 -151 -408 170 146 -216 131 -54 -196 -93 214 -76 -78 -98 288 -140 -64 235 34 -17
2738 -17 -8 -225 -71 -9 190 144 -42 290 -232 -187 133 16 -128 -93 -382 112 -197 -36 72 -86 -88 101 -27
2761 -27 59 699 149 -13 273 -55 98 -59 257 63 -33 -9 -275 -224 37 -244 -259 -175 -374 81 -374 175
$$ packed form
2613F52m02l32J6N38r57O0J191p31o90R10J37r22M09N57o03m15J028k44p26N53
2633B9Q05j099j01N92j35m26O34J4p20J83O37m88m88J090o15m51M80M40o49l3
2653c01O94m57l84N26K21r97K94P90n52j1N64j51n40K54L59m43k20P05m17m66
2673e32Q04k2m13J91K25j23m49L98N1n56M23K63r12K85N73k67j23J97K16l44K10
2694I5O8k12j36M75O1o41O17o8n04M16Q0m0n20L33K43n92J42L62j59k10K98K11
2716C19n12J29K7j14k57N78k4l62L47j85j42J03L07k90kk0L86m28P6K99k01n1
2738a7Rk17J54O2J99m6j86L32n22M5L20j17j44L5k89M94l09J61J08j58kJ89j28
2761b7Q6O40n50j62K86l28J53j57L16j94r6K4k66N1K61k81j5Q4j99M55m55N49
$$ plain form
2783 175 35 -398 -126 438 -17 218 -33 -13 -2 153 136 207 -64 107 2 -124 281 -25 -230 -36 103
2804 103 38 -141 -118 197 -170 -141 109 -77 -73 196 -115 124 -62 -354 -129 9 157 88 -220 121 250 -111
2826 -111 56 126 -187 13 -135 212 -86 223 102 -419 -75 191 -208 -160 55 77 -233 -59 317 -197 -308
2847 -308 234 -106 -356 503 -38 -365 296 62 -51 -155 18 -76 -263 104 415 -331 -2 457 -137 -185 -101
2868 -101 109 -216 28 476 -26 -2 -15 124 -331 165 -18 -394 15 57 35 -409 252 414 -355 57 599
2889 599 -256 27 504 -113 -301 67 -187 -270 -105 305 -214 -541 553 246 -509 9 -53 -307 -240 138 92
2910 92 -488 356 275 -668 160 419 -205 -335 350 -83 -520 81 380 -277 -368 431 366 -546 315 144 -612
2931 -612 18 367 -159 -349 169 397 -588 121 251 -772 -142 444 -2 -163 294 506 -262 -36 886 -131
$$ packed form
2783A75j40m33K72N64m55K35k51K0J1J55j7P1k71J71j05j26M05l06k05J94J39
2804A03o5j79K3L15l67K9K50j86MK69l11K39j86k92K25J38J48o9l08L41J29l61
2826a11J67P0l13K00j48L47k98L09j21n21L44K66l99M8K15K2l10J74L76n14j11
2847c08N42l40k50Q59n41l27O61k34j13j04J73r4j87L67L11p46L29M59n94m8Q4
2868a01K10l25K44M48n02K4j3J39m55M96j83l76M09M2k2m44O61J62p69M12N42
2889E99q55K83M77o17j88L68k54q3J65M10n19l27J094l07p55N18o2k54O7L78m6
2910I2n80Q44q1r43Q28K59o24j30O85m33m37O01K99o57r1P99o5r12Q61j71p56
2931f12O30L49n26j90N18K28r85P09J30j023O30N86m46j61M57K12p68K26R22j017
$$ plain form
2951 -131 -209 636 157 -581 -1 454 -252 87 384 -48 -390 251 313 -716 44 596 -249 -591 225 129 -542
2972 -542 98 543 -453 -238 560 136 -479 478 170 -406 -92 673 -19 -283 263 290 -737 44 562 -543
2992 -543 -232 637 -182 -478 252 513 -430 -227 576 -421 -496 524 -156 -823 58 360 -317 -300 518 -194
3012 -194 -626 559 365 -509 102 548 -368 -333 445 264 -585 -125 526 -311 -402 527 -313 -742 506 207
3032 207 -562 -120 524 -149 -470 451 57 -694 180 726 -471 -345 315 102 -478 380 689 -622 -296
3051 -296 952 -124 -509 654 108 -713 398 520 -154 -239 370 22 -763 478 113 -545 -120 650 -241
3070 -241 -282 464 494 -591 -266 463 -293 -215 558 -24 -750 197 318 -123 -415 124 -28 -368 531 320 -420
3091 -420 131 529 -431 3 281 -96 -70 235 287 -425 -104 762 70 -431 527 181 -281 102 261 -390 -310
$$ packed form
2951a31p8Q45m79p38N80M55p06L39K97m32l42O41O2j029P60N52q45l42Q16r6o71
2972e42O40M45r96K15P98m24o15R57l08n76L14P65o92k64N46K7j027P81N18j105
2992e43L11Q69q19k96P30K61r43K03Q03r97p5J020o80o67Q81L02o77J7Q18p12
3012a94m32J185j94q74O11M46r16L5P78j81q49M60O51q37r1R29q40m29J248k99
3032B07p69M42O44o73l21R21l94p51Q74N46j197J26O60k13n80Q58L09j311L26
3051b96J248j076l85J163n46q21J111J22o74q5O09l48p85J241l65o58M25P70q91
3070b41m1P46L0j085L25P29p56P8P73n82p26R47J21m41k92N39j52l40Q99k11p40
3091d20N51L98r60M34K78l77K6L05N2p12L21Q66o92n01R58l46m62L83J59o51Q0
$$ plain form
3112 -310 299 -91 -416 92 333 -443 -51 290 -326 -412 -72 -5 -290 5 580 -172 -237 281 -54 -235 53
3133 53 204 -346 -3 223 156 -204 420 555 -407 172 420 -211 -267 164 -72 -201 99 285 -476 -284 282
3154 282 -4 -215 272 248 -130 42 159 193 -198 64 220 -551 -61 337 -87 -152 333 -221 33 -134 23
3175 23 -185 -262 254 -204 -126 308 119 -3 184 27 -16 -155 95 -254 -444 -38 -81 -258 90 136 -154 -72
3197 -72 -62 -94 4 -59 264 -56 -356 344 -87 72 556 291 -128 74 30 242 -79 -185 -117 -294 -301 23 -219
3220 -219 -64 141 -3 -24 191 84 77 -197 55 69 -19 145 76 10 -58 -5 58 125 73 197 -176 -140 -41 -263 30
3245 30 -77 -134 115 36 -205 22 119 289 -4 -44 -92 -115 -64 323 21 -93 272 181 117 -180 -283 311 -189
3268 -189 -153 171 -259 72 78 -88 -40 -214 269 -53 46 100 58 25 64 -90 -157 39 54 79 95 -126 -182 -94 -7
$$ packed form
3112c10O09l90l25N08K41p76L92L41o16q6L40O7k85K95N75p52o5N18l35j81K88
3133E3J51n50L43K26o7l60O24J35r62N79K48o31n6M31k36j29L00J86p61J92N66
3154B82k86k11M87k4l78J72J17L4l91K62J56p71M90L98m24o5M85n54K54j67J57
3175B3k08p7N16m58P8M34j89j22J87j57m3j39K50l49j90M06m3j77L48M6k90Q2
3197g2J0l2R8o3L23l20l00P00m31J59M84k65m19K02m4K12l21j06O8j77pL24k42
3220b19J55K05j44k1K15j07pk74K52J4q8J64o9o6o8N3O3O7n2J24l73L6R9k22K93
3245C0j07n7K49p9k41K27R7J70k93m0m8k3N1L87l02j14L65r1o4k97j03N94n00
3268a89L6L24m30L31Oj66M8j74M83l22R9N4m2l3L9j54o7J96J5K5J6k21n6Q8Q7
$$ plain form
3293 -7 471 -84 48 180 -118 -72 155 148 -101 -154 500 218 -140 328 -29 -186 -4 142 -14 19 42 -145 -203
3316 -203 -183 34 -24 154 57 -309 -217 94 -128 89 390 -84 -86 -316 40 -235 100 71 -190 99 -65 -84 107
3339 107 -132 -79 10 -52 151 1 -79 -47 196 -65 -20 31 158 -124 -30 117 -251 -68 268 35 -297 410 51
3362 51 -14 -33 221 -99 93 -49 -54 -171 320 152 -363 110 -110 -120 -308 244 274 -320 -54 496 19 55 293
3385 293 4 47 290 107 -296 -144 275 145 -204 154 248 -123 81 301 -78 132 230 298 -118 157 225 -436
3407 -436 -84 480 -235 -274 419 311 -55 212 162 -5 -361 203 28 -165 480 186 -505 -165 324 -185 -315
3428 -315 263 312 -345 170 434 -196 -208 181 -90 -446 -10 497 -327 -43 343 -217 -252 33 229 -354 306
3449 306 336 -351 65 373 145 -201 95 257 -131 -239 538 -119 -154 570 -82 -301 -36 184 -213 -317 208
$$ packed form
3293gM78n55J32J32k98M6K27pk49n3O54k82l58M68l57j57J82J46j56L3K3j87n8
3316b03K0K17n8J78r7l66R2L11k22K17L01m74kk30L56k75L35k9k61K89j64j9J91
3339A07k39N3Q9o2K03j50q0L2K43k61M5N1J27k82R4J47l68J83L36k33l32P07l59
3362E1o5j9K54l20J92j42nj17M91j68n15M73k20j0j88N52L0n94K66N50m77L6K38
3385B93k89M3K43j83m03J52M19j30l49L58R4l71K04K20l79K10R8O8m16K75O8o61
3407d36L52N64p15l9O93j08l66K67n0j67l56N64j75j93O45k94o91L40M89n09j30
3428c15N78M9o57N15K64o30j2L89k71l56M36N07q24K84L86n60l5K85J96n83O60
3449C06L0o87M16L08k28l46K96J62l88j08P77o57l5P24o52k19K65K20l97j04N25
$$ plain form
3470 208 -16 -445 207 70 -289 -12 475 -40 -308 282 242 -313 87 288 -332 -205 332 -99 -383 325
3490 325 535 -103 -447 377 47 -274 470 74 -559 201 525 18 -230 238 -54 -232 136 182 -269 -77
3510 -77 426 -252 -345 363 138 -278 -242 588 -302 -105 117 322 -443 -70 232 -364 -116 119 -120 -349 266
3531 266 300 -127 45 557 -199 -467 319 -5 -393 200 189 -168 -231 507 -76 -58 301 173 -489 72 311
3552 311 -329 -7 387 94 -471 341 232 -477 154 399 -87 -181 159 93 -111 2 53 -70 -309 356 211
3573 211 -333 207 65 -630 6 142 -124 -199 423 158 -323 128 255 -90 -163 79 205 -262 329 262 -113
3594 -113 159 256 -6 -192 437 67 -255 -88 171 -207 -14 242 -42 -300 -118 136 -303 -265 664 -162 -82
3615 -82 127 79 -200 110 216 -167 -65 6 158 -232 78 -22 -85 33 433 42 -117 143 102 -116 148 298
$$ packed form
3470B08k24m29O52j37l59K77M87n15k68N90m0n55M00K01o20J27N37m31k84P08
3490C25K10o38l44Q24l30l21P44l96o33P60L24n07k48M68k92j78L68M6m51J92
3510g7N03o78r3P08k25m16L6Q30q90J97K22K05p65L73L02n96K48K35k39k29O15
3531B66L4m27J72N12p56k68P86l24l88N93j1l57o3P38n83J8L59j28o62N61K39
3552C11o40L22L94k93n65Q12j09p09O31K45m86r4L40o6k04J13N1j23k39O65j45
3573B11n44N40j42o95O36J36k66p5O22k65m81M51J27l45p3K42J26m67N91o7l75
3594a13K72R7k62j86O29l70l22J67K59l78J93K56k84k58J82K54m39L8R29q26Q0
3615h2K09m8k79L10J06l83J02P1J52l90L10j00o3J18M00l91j59K60m1k18K64J50
$$ plain form
3637 298 39 71 109 20 -171 83 228 -12 -164 77 227 -278 582 4 -229 3 49 -33 -81 -67 -62 -129 41
3660 41 173 41 -73 376 211 -343 6 6 -6 4 134 264 -97 14 40 -280 -176 70 39 -177 82 -74
3682 -74 -278 -159 204 -83 -109 250 -14 -176 232 98 -122 -33 29 46 -236 201 62 -53 105 69 -138 64
3704 64 300 -38 -62 120 104 25 -45 340 -71 -231 80 -91 -397 44 -124 23 282 153 -35 -220 84 -110
3726 -110 -80 147 37 10 34 -69 79 -167 146 349 99 -131 226 148 47 100 126 -54 -52 -154 -13 -150 55
3749 55 -265 41 90 108 -319 -244 357 8 -96 146 93 -105 -152 363 174 197 0 -304 -43 206 -301 16
3771 16 58 -219 144 60 207 99 -110 114 12 -34 -135 44 -118 -198 -256 -116 -63 189 101 -328 192 55 -15
3794 -15 304 -131 299 79 -75 99 93 -9 -105 136 -51 24 47 10 8 -235 152 -166 -59 210 -170 -35 213
$$ packed form
3637B98k59L2L8q9j91K54J45k40j52K41J50n05Q60n78k33K32M6q2m8J4No7J70
3660D1J32j32j14M49j65n54L49%j2J0J30J30l61J11K6l20J04K46l1k16K59j56
3682g4k04J19L63k87k6L59k64j62M08j34k20Q9O2J7k82M37j39j15J58l6k07K02
3704F4K36l38k4J82j6p9p0L85m11j60L11j71l06M41j68J47K59j29j88j85L04j94
3726a10L0K27j10k7K4j03J48k46L13K03k50k30L57p8j01N3K6j80Kj02J41j37K05
3749E5l20L06M9J8m27P5O01l49j04K42n3j98m7N15j89K3j97l04K61K49n07L17
3771A6M2k77L63q4J47j08k09K24j02m6j01J79j62q0n8J40N3K52q8m29N20j37p0
3794a5L19m35M30k20j54J74oj02r6K41j87P5K3l7kk43L87l18J07K69l80J35K48
$$ plain form
3817 213 -149 -66 -50 46 -106 -240 173 165 47 21 76 -359 209 70 50 116 147 151 -182 200 44 -143 -306 169
3841 169 -223 -137 109 -97 -137 -181 250 -46 -114 234 98 -230 225 -89 -218 112 57 -66 -296 -175 236 169
3863 169 8 -26 -206 -54 27 125 -88 -165 56 -81 -300 257 -155 -30 134 -303 -357 278 51 -50 -136 219
3885 219 109 28 142 137 -30 39 214 -150 -50 106 -61 10 -258 205 157 -29 92 -78 -50 89 -161 -286
3907 -286 37 229 -80 -202 -2 363 -111 125 366 -361 -375 415 -255 -204 146 263 -3 -225 371 -17 -142
3928 -142 243 -175 -215 6 89 -44 -216 111 40 -435 -78 -55 -277 38 343 -265 -310 268 -164 -152 79 225
3950 225 3 -277 301 101 -189 89 189 -182 215 126 -240 61 56 111 -355 39 197 -522 54 353 -187
3971 -187 -159 111 39 -253 -256 256 -31 -210 348 51 -197 68 80 18 -40 -8 88 -203 86 460 -247 -94 184
$$ packed form
3817B13l62Q3J6R6j52j34M13qj18k6N5m35N68j39k0O6L1Ml33L82j56j87j63M75
3841A69l92Q6K46k06m0m4M31k96o8L48j36l28M55l14j29L30n5j23k30J21M11o7
3863A69j61l4j80J52Q1R8k13p7K21j37k19N57m12J25J64m37n4O35k27j01q6L55
3885B19j10q1J14nj67O9J75l64J00J56j67P1k68M63m8j86J21j70K8J39k50j25
3907b86L23J92l09j22K00L65m74K36K41p27j4P90o70N1L50J17k66k22N96l88j25
3928a42L85m18m0K21Q3j33j72L27p1m75L57K3k22L15L05o08m5N78m32J2K31J46
3950B25k22k80N78k00k90K78J00l71L97q9l66L01nN5m66L94J58p19N76K99n40
3971a87K8K70p2k92lN12k87j79N58k97k48K65J2o2n8L2R6k91K89L74p07J53K78
$$ plain form
3994 184 -188 -136 300 62 -300 -40 147 -265 17 253 25 -311 -80 167 -370 -50 269 26 -271 30
4014 30 168 -412 129 542 -46 80 374 -178 -98 230 122 -483 197 213 -3 -208 339 252 -324 277 158
4035 158 -48 56 199 -137 -289 32 145 -233 95 277 -276 25 184 139 -218 24 280 -154 45 444
4055 444 -122 -223 55 323 -88 -225 61 -80 -283 61 278 -120 89 180 -335 -297 197 89 -96 50 15
4076 15 -202 -263 239 -158 -491 191 114 -257 -51 352 -112 2 199 112 -214 66 320 -128 138 78 16 122
4098 122 166 131 -82 90 217 -100 -228 226 -23 -103 -8 98 -285 154 462 -75 -237 -17 160 -138 51
4119 51 202 17 -18 302 100 69 -96 -175 -97 -79 101 -125 -229 335 170 -377 146 181 37 -33 162 52 -241
4142 -241 321 274 -82 -10 272 75 -56 177 165 7 -33 53 93 -291 143 -225 -254 -47 -84 -111 258 183 212 -313
$$ packed form
3994A84l72N2M36k38l62K60J87m12K82K36k28l36K31K47n37L20L19k43k97L01
4014C0J38n80N41M13n88J26K94n52Q0L28j08o05O80J6k16k05N47q7n76O01j19
4035A58k06J04J43l36j52L21J13l78L28J82n53L01J59m5l57K42K56m34J99L99
4055D44n66j01K78K68m11j37K86j41k03L44K17l98K09R1n15L8M94j08j85J46l5
4076A5k17o1N02l97l33O82p7l71K06M03m64J14J97q7l26K80K54m48K66o0o2J06
4098A22M4l5k13J72J27l17j28M54k49q0R5J06l83M39L08n37j62K20J77k98J89
4119E1J51j85l5L20k02l1j65p9P8J8J80k26j04N64j65n47N23L5j44p0J95j10k93
4142b41N62m7l56P2K82j97j31K33j2j58m0Q6M0l84M34l68k9K07l7k7L69p5K9n25
$$ plain form
4166 -313 73 -233 -86 19 116 -175 48 -19 -110 -179 -130 28 -192 96 158 9 -98 -64 386 -253 -15 10 92
4189 92 -116 180 310 -135 -126 47 -116 3 103 -235 204 69 -155 -93 215 84 -4 -288 77 -171 -132 184
4211 184 -41 124 86 73 93 -10 9 68 -46 304 34 84 -167 -51 -26 120 17 14 -101 -193 273 -199 -84
4234 -84 150 -66 -184 13 -111 53 30 190 200 12 -85 23 -215 256 -29 -143 91 -195 -32 10 -79 39
4256 39 59 -140 251 -167 -234 286 108 -166 -50 12 68 -5 92 -60 -47 -74 63 107 -8 84 101 -17 -342 113
4280 113 325 -26 253 44 -32 87 229 -172 -28 -59 75 187 -172 -91 -209 31 258 -75 166 256 -185
4301 -185 -188 -101 -157 -51 -244 14 -17 -129 -19 139 -1 84 139 -265 180 -66 184 11 84 187 -158 -172 174
4324 174 99 -108 376 -43 -141 42 -3 -205 -103 255 -268 -231 53 -202 3 360 313 283 -38 173 38 -52
$$ packed form
4166c13L86l06J47J05R7k91K23o7r1o9M9J58k20K88O2j49j07L4M50o39K38K5Q2
4189I2k08K96J30m45RJ73j63J19J00l38M39j35k24O2L08j31q8k84L65k48L9L16
4211A84k25J65l8j3K0j03J9N9j14L50k70N0k51J16K5J46j03lj15r2M66m72J15
4234h4K34k16j18J97j24J64k3J60J0j88r7J08k38M71k85j14K34k86J63M2q9J18
4256C9K0j99L91m18o7N20j78k74J16O2N6p3R7j52J3k7J37M4j15R2J7j18l25M55
4280A13K12l51K79k09p6J19J42m01J44l1J34J12l59Q1j18K40K27l33K41R0m41
4301a85lQ7n6J06j93K58l1j12J10J58j40Q5N5m04M45k46K50j73P3J03l45j4L46
4324A74p5k07M84m19r8J83m5k02J02L58n23L7K84k55K05L57m7l0l21K11j35r0
$$ plain form
4346 -52 1 82 -118 288 413 -161 -184 7 386 -46 -374 243 -135 -231 110 37 -281 92 -61 -81 -129 -15 6
4369 6 -433 151 -7 -141 -27 -14 -334 -48 0 -37 -140 -3 252 -155 -341 109 14 -181 295 196 49 115 20
4392 20 -140 -122 187 -87 -145 132 42 -8 142 309 -214 -219 92 378 -187 -215 40 -15 37 209 128 -150 204 124
4416 124 -214 -185 -21 -17 -213 159 191 -120 208 163 -89 -114 265 -31 -286 97 106 15 -35 311 112 -151 207
4439 207 -80 -36 -20 156 -21 -325 278 -26 -298 56 263 -360 55 227 -325 40 112 30 -354 -132 203
4460 203 -36 -103 318 -144 -83 187 10 -134 50 139 -114 -299 -18 270 -372 421 105 -268 -18 407 126
4481 126 -361 -41 419 -143 -151 315 -63 -74 300 243 -255 285 33 -112 -163 158 -51 -239 280 223 0 25
4503 25 326 -148 -287 391 -115 -112 -244 236 -209 -208 173 -95 -234 139 92 -192 93 301 75 -184 -81 223
$$ packed form
4346e2N3Q1k00M06J25n74k3J91L79m32l28O17l78r6L41p3l18L73j53k0m8J14K1
4369Fm39N84j58j34J14J3l20K86M8l7j03J37K55m07j86M50r5j95M76r9j47O6r5
4392B0j60J8L09k74n8K77r0n0J50J67n23nL11K86n65k8K55n5N2J72q1k78L54q0
4416A24l38K9J64Mj96L72L2l11L28m5k52k5L79k96k55L83Rr1n0L46j99k63L58
4439B07k87M4J6J76j77l04O03l04k72L54K07o23M15J72n52L65P2q2l84K22L35
4460B03k39o7M21m62O1K70j77j44J84Q9k53j85K81K88o42P93l16l73K50M25k81
4481A26m87L20M60n62qM66l78j1L74n7m98N40k52j45n1L21k09j88N19n7k23K5
4503B5L01m74j39O78n06Lj32M80m45JL81k68j39L73m7k84K85K08k26k59J03L04
$$ plain form
4525 223 -117 131 41 -320 43 244 -151 -149 -105 360 -24 -182 166 -181 -67 144 85 -246 -11 124 148 -274
4547 -274 186 124 -232 282 28 -274 -471 -30 125 -66 226 120 -140 -221 273 -69 -37 248 -56 -107 -43 85
4569 85 -222 80 53 15 91 308 293 -258 4 -1 -214 -91 134 15 -82 41 41 -158 -122 12 145 -41 34 -43
4593 -43 -137 90 69 85 -39 119 -60 -38 159 61 -26 -141 122 -77 -137 233 178 -146 -90 -37 -61 -112 43 -284
4617 -284 116 56 33 -187 50 139 -34 -410 86 75 -79 53 -223 -84 128 73 31 -50 54 222 -162 -80 73
4640 73 53 29 175 -64 -8 290 20 307 -32 114 -9 -159 289 252 -18 -58 172 45 -154 -243 31 -326
4662 -326 133 -68 -297 65 253 175 22 -26 28 -118 18 -40 -23 9 -45 78 52 71 6 -51 204 15 -53 -155
4686 -155 99 252 -54 -91 142 -81 39 -2 -206 88 -294 -82 -105 -230 46 44 -229 172 215 2 116 60
$$ packed form
4525B23l40K48r0l61L63K01l95KM4M65l84j58L48l47J14K11n9l31K35J35K4m22
4547b74M60o2l56N14k54l02j97M41J55j91K92j06k60q1M94l42L2K85l04n1O4J28
4569H5l07L02k7l8P6K17j5n51K62nk13J23K25j19r7J23%j99L6J34J33j86P5p7
4593d3r4K27k1J6j24J58j79K2J97r8q7j15K63j99o0L70n5l24N6N3k4n1J55l27
4617b84M00o0k3k20K37Q9j73l76M96j1j54J32k76J39K12n5m2q1J04J68l84Q2J53
4640G3k0k4J46k39N6K98k70K87l39J46j23j50M48l7k70m0K30j27j99q9K74l57
4662c26M59k01k29L62J88p8j53m8N4j46J36n8J7L2n4J23k6J9o5n7K55j89o8j02
4686a55K54J53l06l7K33k23J20m1k04K94l82K12k3j25K76kk73M01M3k13J14n6
$$ plain form
4708 60 101 -103 -98 393 -300 -184 351 183 38 218 67 83 -208 154 31 178 -26 -124 -165 99 -199 -34
4730 -34 107 -54 -12 -172 -193 -68 26 -134 220 -69 56 120 84 -60 20 -144 81 161 116 58 -52 106 -66
4753 -66 83 -18 125 97 97 170 6 -15 -26 321 196 -69 -115 172 -80 -117 -66 -96 218 96 113 -297 134 -60
4777 -60 -265 16 122 -74 269 89 -72 87 34 -153 41 272 254 263 48 17 90 147 179 6 -86 89 3 90
4801 90 -120 140 -149 -274 -113 -59 -140 257 44 154 109 133 -243 -254 -254 73 -128 116 66 -172 -114 -180 193 -103
4825 -103 -15 376 66 154 30 -30 52 363 15 71 -128 119 265 162 56 -171 -69 79 357 -56 -101 149
4847 149 104 173 -114 186 24 -204 185 137 -220 168 182 -289 -56 -153 -110 70 85 0 -19 65 188 -19 125
4870 125 289 -129 -120 -142 303 -28 -247 57 61 -207 176 -111 -61 -15 -103 33 -219 -141 -2 -162 -84 -254 89
$$ packed form
4708F0M1k04NM91o93J16N35j68j45J80j51J6k91L62j23J47k04r8m1K64k98J65
4730c4J41j61M2j60k1J25R4j60L54k89J25O4l6j44Q0j64K25Q0m5n8j10J58j72
4753f6J49j01J43k8%P3j64k1j1L47j25k65m6K87k52l7N1l0L14j22J7m10M31j94
4777f0k05K81J06j96L43j80j61J59n3j87J94K31j8Rk15l1P3N7L2j73r2J75q6Q7
4801I0k10K60k89j25J61N4q1L97k13J10m5K4l76j1%L27k01K44n0k38N8o6L73k96
4825a03Q8L91l10Q8j24o0Q2L11l48N6j99K47J46j03j06k27J02J48K78m13m5K50
4847A49m5O9k87L00j62k28L89m8l57L88J4m71K33r7M3J80J5q5j9Q4J23k07J44
4870A25J64m18Rk2M45l31k19L04Mk68L83k87N0M6q8J36k52P8J39j60P8j70L43
$$ plain form
4893 89 -125 240 65 161 95 -154 -108 -171 87 110 -9 104 148 -288 178 68 -53 -180 76 137 19 137 -158
4916 -158 -80 -54 185 -145 54 188 -86 -27 18 144 -442 20 207 -32 -196 71 -64 99 152 76 88 -179
4938 -179 120 -216 1 105 53 -207 19 343 -196 78 -58 27 108 207 66 35 11 148 41 97 -67 -1 -261
4961 -261 -136 -25 29 -327 26 146 -152 173 -32 17 258 88 -107 89 78 16 -75 75 46 -42 -165 30
4983 30 -26 -5 127 71 98 68 79 -30 109 320 76 -68 -204 113 -95 79 182 -11 -30 -36 138 -39 163
5006 163 359 165 -108 28 87 -25 29 -107 6 -79 139 116 -209 112 67 -38 -45 79 24 -76 72 -14 -283
5029 -283 94 219 -14 -207 -292 -43 -270 167 -100 77 -14 -60 -113 49 -60 129 48 -109 86 36 148 -67
5051 -67 -112 -21 113 6 -81 -251 198 2 13 136 -62 -28 139 -165 -1 -111 276 164 -172 60 -97 -128
$$ packed form
4893H9k14L65j75R6o6k49M6o3K58K3j19J13M4m36M66j10j21j27K56O1j18J18k95
4916a58P8K6K39l30J99J34k74N9M5J26n86M62J87k39j64K67j35J63N3p6J2k67
4938a79K99l36K17J04n2k60K26L24n39K74j36Q5Q1R9j41l1k4J37j07N6j64O6k60
4961b61J25J11N4l56L53J20k98L25k05M9K41j70j95J96j1o2r1J50k9q8j23J95
4983C0n6K1J32n6K7l0J1j09J39K11k44j44j36L17k08J74J03j93j9oJ74j77K02
5006A63J96j94k73J36N9j12N4j36J13q5K18k3l25L21m5j05pJ24n5j00J48q6k69
5029b83L77J25k33j93q5K49k27M37k67J77r1m6n3J62j09J89q1j57J95n0J12k15
5051f7m5R1J34j07q7j70M49j96J1J23j98L4J67l04J64j10L87j12l36K32j57l1
$$ plain form
5073 -128 28 -23 32 161 10 122 -234 116 32 -79 -199 77 87 -60 75 39 -22 239 -173 199 -259 58
5095 58 78 -69 264 57 -116 -43 4 -122 225 96 74 -110 -5 239 -29 -219 -97 -36 31 -43 253 242 222
5118 222 197 105 -32 4 -1 16 113 56 171 -68 284 -65 10 64 -168 167 -313 2 -104 -196 89 -199 -17 29
5142 29 -112 95 -61 -232 243 -187 -147 -48 -26 -10 100 179 -123 -94 -11 -186 -220 -57 -30 37 269 -84 45 -116
5166 -116 188 101 17 206 4 -251 -18 96 -374 -2 12 -81 -294 95 139 29 277 19 353 31 10 170
5188 170 23 -178 41 -97 -48 248 33 107 257 36 -57 163 206 3 -33 73 -71 47 -242 -149 -115 -159 120
5211 120 177 -55 -186 -6 -153 83 -86 -52 205 28 -20 271 -198 -163 160 -52 10 -75 -77 -160 -19 -250 -300
5234 -300 -58 243 154 70 -176 -100 -163 294 72 -150 -157 -79 -287 -29 3 -388 -135 421 210 38 80 68 50 -203
$$ packed form
5073a28J56n1N5J29j51J12l56L50q4j11j20K76J0j47J35l6o1K61m12L72m58L17
5095E8K0j47L33k07j73P3M7j26L47j29k2j84J05K44k68j90J22O1O7p4K96j1k0
5118B22k5r2j37L6nJ7R7n7J15k39L52l49P5N4k32L35m80L15j06r2K85k88J82M6
5142B9j41K07j56j71M75m30M0R9K2J6J10P9l02K9Q3j75l4J63K7O7K32l53J29j61
5166a16L04q7q4J89k02k55K33J14m70L72J4r3k13L89M4j10K48k58L34l22k1J60
5188A70j47k01K19j38M9K96k15P4J50k21r3K20M3k03l6J06j44J18k89R3L4m4K79
5211A20N7k32j31J80j47K36j69L4K57j77m8K91m69L5L23k12O2q5kq3J41k31n0
5234c00K42L01q9q4k46P6o3M57k22k22pP8k08K58L2l91K53N56k11j72M2j2j8k53
$$ plain form
5258 -203 -40 134 -88 18 175 46 -12 -1 -119 -77 13 17 -152 -162 57 5 -15 109 59 71 -50 63 50 -10
5282 -10 148 154 45 47 21 93 -117 124 -139 208 43 136 -36 151 118 -175 -214 228 -97 -2 59 210 -14 -77
5306 -77 272 62 -123 -157 114 -175 173 37 -74 218 10 59 7 -192 189 -172 -107 107 -170 -107 -72 205
5328 205 162 -159 -1 -229 -130 -149 0 -37 -128 -63 -13 149 256 46 -81 101 -106 165 49 70 -188 220 -67
5351 -67 -164 46 81 12 -116 -148 -150 279 2 -78 -127 -135 -8 157 105 -118 -46 -13 -87 118 -64 -70 -98 111 -175 421
5377 421 -63 3 -52 124 -87 -115 72 -71 36 16 -139 19 -154 87 121 -112 -230 -23 89 -70 -143 -62
5399 -62 -71 25 155 -43 73 0 -300 -32 -65 27 -22 -115 75 96 171 168 -39 -80 124 -19 -70 43 -47 -259 -110
5424 -110 131 35 -141 -85 114 -10 0 192 59 54 -193 122 -339 -168 309 97 -244 205 -110 235 -97 162
$$ packed form
5258b03J63J74k22J06J57j29n8J1j18M2R0Mj69j0K19n2k0J24n0J2j21J13j3o0
5282a0J58Oj09Kk6P2k10K41k63L47j65R3j72J87l3k93l9M42l25R5O1J51k24o3
5306g7L49k10j85l4K71k89L48j36j11K92k08M9n2j99L81l61O5K14k77O3L5K77
5328B05m3l21J58k28R9j9J49l7r1O5N0J62J07k10j27J82k07K71j16K1k58M08k87
5351f7r7K10L5o9j28l2kM29k77q0m9qJ27J65n2k23P2L3p4K05j82ok8K09k86N96
5377D21m84O6n5J76k11k8J87j43J07k0j55J58j73K41L4k33j18K07J12j59p3Q1
5399f2rR6J30j98J16p3l00K68l3R2m9r3J90K1P5lk07m1K04j43n1J13r0k12J49
5424a10K41r6j76N6J99j24J0J92j33nk47L15m61J71M77k12l41M49l15L45l32K59
$$ plain form
5446 162 -112 37 129 -91 117 61 -7 210 -77 -120 44 -119 -39 -22 164 -197 -161 -41 -168 -60 -182 -203 174
5469 174 187 -10 -44 127 -81 -69 28 114 31 344 26 40 -79 -24 40 121 14 127 89 170 90 270 -111 108
5493 108 75 -32 -39 -43 -72 -246 -5 -151 -123 -294 -260 5 -179 105 -129 75 -298 22 -66 -238 231 70 -207
5516 -207 207 15 -276 74 157 -195 90 -115 -271 166 -8 -402 -20 -28 75 47 -206 246 -79 -210 -28
5537 -28 -26 -117 144 -39 77 -171 93 8 123 -64 59 -95 -201 -250 6 -16 38 146 12 -51 102 79 142 127
5561 127 250 -73 166 174 -325 60 -372 22 -167 92 3 211 16 56 72 -39 -76 -76 -267 117 -50 -324 119
5584 119 223 -77 -152 -40 121 -207 -297 187 20 22 115 -248 -214 -65 94 -77 -192 219 42 -281 131 174
5606 174 -52 56 -37 83 43 -11 3 134 127 42 -82 171 28 106 18 -73 34 207 57 151 178 -31 -173 -136
$$ packed form
5446A62k74J49R2k20K08n6o8K17k87m3J64j63Q0J7J86l61L6J20j27J08j22k1L77
5469A74J3j97l4J71k08J2R7Q6q3L13l18J4j19N5O4Q1j07J13l8Q1q0J80l81K19
5493A08l3j07pmk9j74K41j46K8j71L4K65j84K84k34K04l73L20q8j72M69j61k77
5516b07M14j92k91L50Q3l52K85k05j56M37j74l94L82qJ03k8k53M52l25j31J82
5537b8Kr1K61j83J16k48K64q5J15j87J23j54j06m9K56k2N4J08j34o3J53k3O3j5
5561A27J23l23K39Qm99L85m32L94j89K59q9K08j95M0J6j11l7%j91L84j67k74M43
5584A19J04l00p5J12J61l28r0M84j67KR3l63L4J49J59j71j15M11j77l23M12M3
5606A74k26J08r3J20m0n4J4J31pq5j24K53j43P8q8r1J07J73j50R4K7k09j42L7
$$ plain form
5630 -136 22 -72 26 -101 21 -244 108 99 -104 316 -93 -170 66 130 -98 5 259 -2 102 -153 -4 -165
5652 -165 -109 6 -124 61 108 -5 62 220 32 116 7 -169 -196 -24 -93 -79 -87 -114 50 123 77 -166 104 41
5676 41 -175 -82 -93 82 -96 -123 -88 291 198 -38 -168 65 200 -151 333 -190 -178 -94 190 62 27 -298 -178
5699 -178 -87 -38 280 -213 -180 19 -194 71 41 304 76 -45 122 -303 5 153 231 82 63 -102 119 -165
5721 -165 -166 -4 102 -41 -316 -302 -96 51 -188 149 -135 -81 235 -152 -36 -150 -232 70 -207 85 142 -160
5743 -160 124 -46 -126 189 111 -67 158 72 158 246 -5 -2 34 -178 32 -21 73 -10 -141 -206 97 28 256 64
5767 64 5 125 9 -138 -91 -29 -17 -100 -50 -99 -110 61 329 -323 -198 160 -115 66 232 -140 5 132 238
5790 238 -13 39 183 -285 20 -48 -221 -61 58 77 54 -28 -98 0 -193 -161 -112 145 -84 -127 59 -36 0 299
$$ packed form
5630a36J58r4R8j27J22k65L52rk03M20m09p7K36O4k28J03K54k61J04k55J49j61
5652a65N6J15j30J85M7j13O7J58j88Q4j09j76k7J72o9J4qk7J64P3m6k43K70o3
5676D1k16R3j1J75j78k7L5L79r3k36j30K33J35l51M84n23J2Q4K84j28l5l25J20
5699a78R1M9L18m93L3J99k13K65l0K63k28j21J67m25L08J48P8j49j9j65K21k84
5721a65jJ62J06j43k75J4K06J47k39L37k84N4L16l87J16j14q2L02k77K92N7l02
5743a60K84j70q0L15p8j78K25q6Q6Q8k51LL6k12K10n3R4q3j31o5L03o9K28j92
5767F4n9J20j16j47M7O2J2q3N0m9j1J71K68o52J25L58k75J81J66l72J45J27J06
5790B38k51N2J44m68L05o8j73J60J19J9k3q2p0R8j93L2M9K57k29m3J86r5L6K99
$$ plain form
5814 299 -457 100 -11 -102 122 17 -89 -76 41 31 70 -122 180 123 -36 183 -143 -132 91 159 -15 90
5836 90 -1 160 -29 -53 25 94 347 347 89 -25 102 -190 -140 -75 -38 -102 -25 -28 353 -114 -255 -60 -65 -68 100 -395
5862 -395 -68 118 -136 24 88 -134 239 143 97 72 20 26 66 309 4 79 6 -176 274 -132 -242 79 89 60
5886 60 -4 66 -107 -115 55 -221 5 43 10 46 221 112 -292 -13 205 98 -138 9 57 -40 -221 -140 -120 3
5910 3 -125 39 -206 -182 62 108 -10 39 138 6 25 36 76 -100 115 -50 -155 -61 67 195 75 55 1 68
5934 68 75 34 58 11 76 -78 68 -263 5 -78 27 68 -117 149 206 -81 7 -104 58 -40 -184 -3 40 98 200
5959 200 -54 -8 -99 79 120 -23 -2 77 -153 195 109 -274 -119 -2 138 -40 105 190 13 146 215 -30 183
5982 183 -159 50 139 -72 50 -101 -243 98 101 256 164 -24 104 206 -32 -98 12 -18 -26 22 -38 134 -288
$$ packed form
5814B99p56N57j11r1K24j05j06J3J17j0L9j92L02n7j59K19l26J1K23O8j74J05
5836I0r1J61j89k4P8O9K53%k58j14J27k92N0O5L7o4P7lL81m67j41J95nlJ68m95
5862c95L27J86k54J60O4k22L73r6m6k5n2OM0K43l05P5p3j82M50m06j10L21J0k9
5886F0o4P0j73qJ70k76K26L8l3L6J75j09m04K79K18j07k36J47M8r7j81Q1K0J23
5910Cj28J64k45K4K44M6j18M9R9j32J9J1M0j76K15j65j05R4J28J28j20k0n4O7
5934F8Pm1K4m7O5j54J46l31K68q3J05M1j85K66N7k87Q8j11J62r8j44J81M3N8J02
5959B00k54M6r1J78M1j43K1P9k30L48q6l83J55J17J40j78J45Q5j77J33O9k45K13
5982A83l42K09Q9k11J22j51j42L41LJ55r2j88J28J02k38o6J10l0qM8o0J72m22
$$ plain form
6005 -288 -7 -71 -129 59 135 -12 61 63 248 -47 6 -67 136 -25 -125 -166 -64 183 155 -192 -136 42 29 -37
6029 -37 27 43 -174 58 -84 -73 -297 -12 -77 37 86 145 -29 -45 46 27 16 -407 -20 105 -230 4 -44 168
6053 168 -160 -65 -33 35 54 -9 -298 74 282 -45 84 138 266 -91 -21 -42 -100 184 217 -137 131 42 -190 31
6077 31 -58 -109 124 -151 99 -142 43 127 -37 -113 132 200 55 -284 -231 86 -7 268 77 -133 205 -70 -15
6100 -15 17 196 39 9 88 52 44 -220 -44 -43 -95 84 39 18 2 -74 -81 -82 27 -11 -287 122 -221 21 69 -197 89
6127 89 3 -3 445 219 108 273 151 89 235 143 -130 330 87 -149 315 37 -113 234 -48 -35 -134 -21 -178
6150 -178 -183 -236 15 -30 -60 -53 -84 44 81 173 41 23 14 -158 171 144 -19 131 -172 92 15 -37 113 139 218 -200
6176 -200 69 102 50 -164 122 118 -92 145 84 157 -135 -97 8 -7 -85 -59 -167 110 42 -79 -61 59 -178 -372
$$ packed form
6005b88K81o4n8J88P6j47P3KJ85k95N3p3K03j61j00m1J02K47k8l47N6J78j3o6
6029c7O4J6k17K32j42J1k24K85o5J14M9N9j74j6R1j9j1m23L87J25l35K34m8K12
6053A68l28R5L2O8J9o3k89L72K08l27J29N4J28l57P0k1n8K84L3l54K68q9k32K21
6077C1q9n1K33k75K50k41J85Q4j64p6K45O8j45l39N3L17r3K75j91k10L38k75N5
6100a5L2J79j57l0P9l6qk64J76Jn2J79m5k1j6p6pjJ09l8k76M09l43K42M8k66K86
6127H9q6oM48k26j11J65j22o2J46r2k73M60k43k36M64k78j50L47k82J3r9J13j57
6150a78nn3K51m5l0Pl1J28L7R2j32j8rj72L29k7j63J50l03K64p7n2J50K6P9m18
6176b00K69L3n2k14K86mk10K37o1P3k92L8J05j5p8K6j08K77o8j21J8J20k37j94
$$ plain form
6200 -372 12 -131 -22 -234 -96 -78 -144 94 -102 -75 96 58 -16 157 74 55 93 -22 113 237 -95 246 371
6223 371 119 -156 95 231 -48 155 -259 -173 -77 32 82 41 98 -181 -21 82 -13 -99 -127 48 63 -10 -207
6246 -207 -116 48 98 -140 80 80 85 128 -127 -140 -2 201 -6 131 77 67 16 -109 3 -85 171 254 -93 -196
6270 -196 -212 151 -3 -2 15 145 27 -1 65 33 -219 -50 -150 263 51 -36 -144 -97 215 135 42 -208 -65 -168
6294 -168 -251 -121 -6 -88 89 -9 150 218 84 166 -135 -113 13 101 55 -97 -43 -132 -157 -76 15 -219 22 -31 -120
6319 -120 -288 53 46 -324 152 113 35 -92 -4 -157 35 49 -39 -7 -4 115 -109 210 133 -213 21 128 189 -60
6343 -60 14 222 -104 42 138 -82 71 13 4 416 156 137 -50 -241 -122 138 116 -223 -213 -41 139 16 41
6366 41 -75 -172 -65 314 -17 -180 169 118 -224 28 77 67 -256 90 3 -157 15 -202 97 -22 74 276
$$ packed form
6200c72L84j43J09k12J38J8o6K38j96K7J71l8p4J73q3j9L8j15J35J24l32L41J25
6223C71k52k75K51J36k79K03m14Q6R6J09N0m1N7k79J60J03r5q6k8J75J5p3j97
6246b07R1J64N0k38K20%NM3k55j3J38K03k07J37n4j0n1j25J12q8K56Q3l47j03
6270a96j6L63j54JJ7J30j18k8O6l2k52J69j00M13k12q7j08M7L12q0r3k50J43j03
6294a68q3J30J15q2J77r8J59O8j34Q2l01K2J26Q8m6j52N4q9k5Q1R1k34K41n3q9
6319a20j68L41pl70M76l9p8j27Q8j53J92J4q8L2LJ19k24L19p7l46K34J07O1k49
6343f0P4K08l26J46R6k20J53n8rM12k60j9j87j91J19K60k2l39J0J72J80j23K5
6366D1j16r7J07L79l31j63L49n1l42K52M9j0l23L46q7j60J72k17K99j19R6K02
$$ plain form
6388 276 111 49 315 77 -57 -1 49 78 77 75 164 -195 132 155 216 -246 50 -171 -19 63 41 -51 -47 101 36 104
6414 104 55 213 67 -244 -37 -46 162 -71 -221 32 110 -167 -122 107 104 -43 244 -65 -6 175 -105 -26 -49
6437 -49 -24 306 51 -9 3 -66 89 -72 152 -103 12 -106 -112 126 -39 229 14 62 60 52 260 -96 -3 36 -73
6462 -73 7 -1 39 -54 -119 76 -8 287 -265 25 14 36 -105 -140 -54 -264 73 -69 -155 40 82 -115 171 -27 115
6487 115 9 -52 32 160 -21 240 -91 159 226 -151 -21 51 95 107 -150 101 17 -51 195 -47 -94 -34 333
6510 333 18 -223 -80 53 29 -166 -81 -61 -163 -128 -144 144 -36 -107 179 176 54 334 -149 -94 -35 -174 262
6533 262 -16 -32 -96 -133 2 -64 0 213 -148 -88 160 -186 10 -156 222 -256 -7 -204 -84 144 117 -16
6555 -16 -39 -3 -113 137 -144 -62 14 -78 -32 123 56 -149 109 -146 319 28 200 240 -101 228 206 -221 -127 167
$$ packed form
6388B76j65o2K66k38j34N6N0K9jkQ9l59L27K3O1m62K96k21J52Q2k2r2MJ48o5O8
6414A04m9J58j46l11K07rK08k33j50K53P8k77M5K29lj47K87l09N9J81k80P9k3
6437d9K5L30k55o0J2o9J55j61K24k55J15j18oK38j65K68k15M8kqK08l56R3L9j09
6462g3Q0qM0r3o5J95q4K95n52K90j1K2j41l5Q6k10L37j42q6J95M2j97K86j98J42
6487A15j06o1Q4J28j81K61l31K50O7l77J30P2M4J2k57K51q4o8K46k42m7O0L67
6510C33l15k41J43J33k4j95Q5K0j02L5j6K88j80p1K86lj22K80m83N5N9j39M36
6533B62k78j6o4l7J35o6O4K13l61O0K48l46J96j66L78m78K49j97J20K28k7j33
6555a6k3L6j10K50k81Q2P6r2M6J55o7k05K58k55M65k91J72M0l41L29k2m27R4K94
$$ plain form
6579 167 -18 207 110 110 124 12 137 -323 -68 -32 134 -72 14 -110 -170 -71 -93 -25 -146 -168 -154 -28 -62 -10 76
6604 76 48 4 146 72 -249 -174 78 96 -27 -55 142 -21 -76 252 128 -58 58 -62 -58 138 -25 92 108 156
6628 156 110 -116 -146 -72 14 -133 -34 -22 122 132 -86 252 -186 55 157 296 114 195 -123 -149 220 231 23
6651 23 -123 285 19 -180 -78 -1 46 -21 19 248 135 -47 -364 -98 160 197 69 -38 131 -54 -165 -237
6673 -237 1 -188 45 73 22 -94 61 70 -174 132 72 -74 137 17 -67 -91 -31 217 39 9 -163 -38 -46 -82
6697 -82 -189 63 -145 8 -223 -151 -4 34 7 -254 -152 47 123 -71 203 57 -296 -19 -156 -130 183 53
6719 53 266 -34 -92 0 120 45 58 -28 -10 117 16 -103 21 -141 151 -34 -13 220 39 30 -118 35 -179
6742 -179 18 156 340 -76 -74 11 -59 -11 -73 -45 108 -24 292 -51 -19 -83 69 -21 128 -23 52 285 91 3
$$ packed form
6579A67j85K25r7%J4j12J25m60K55L6J66k06Q6j24o0R9k2O8j21k2J4J26l4N2Q6
6604G6k8m4J42p4l21P5K52J8j23k8J97j63n5L28j24j86J16j20MJ96j63J17J6M8
6628A56m6k26l0P4Q6j47R9J2J44J0k18L38m38K41J02J39j82Q1l18k6L69J1k08
6651B3j46M08k66j99J02P7M7o7M0K29j13j82l17K66K58L7j28j07J69j85j11p2
6673b37K38j89K33K8n1j16J55Rk44L06o0j46K11j20q4k4O0K48j78l0j72J25ql6
6697h2j07K52k08J53k31P2J47L8k7k61J02J99P6j94K74j46l53K77j37K6L13j30
6719E3K13l00n8R2J20p5J3q6J8J27j01j19J24j62K92j85K1K33j81rj48J53k14
6742a79J97J38J84m16KQ5p0M8o2K8J53j32L16l43L2o4J52r0J49j51P5K33j94q8
$$ plain form
6766 3 -82 126 172 -93 -5 162 13 208 -470 20 76 195 -36 -98 -110 203 51 72 52 -183 446 109 -83
6789 -83 -50 2 -61 -135 55 -98 -11 30 -29 -57 -139 118 142 -222 61 -148 69 -59 41 0 -199 -51 -28 161
6813 161 114 209 -111 -97 106 -48 147 155 -20 86 101 120 152 -69 -66 -148 -30 20 152 -63 -62 95 122 9 -153
6838 -153 75 -159 -172 -30 -22 -62 -15 -87 40 296 -183 233 135 92 -146 113 -83 22 51 -19 -24 160 -270 -250
6862 -250 -205 29 -70 -31 -159 -100 -98 89 139 73 142 -120 183 101 141 145 -161 -53 -74 308 11 225 214 -94 182
6887 182 18 71 144 -160 -73 -45 -233 -246 69 165 97 -36 99 60 -39 48 88 99 -88 -64 180 -102 -136 98 -98
6912 -98 -207 83 -37 123 -111 -112 -8 -82 81 59 -80 162 22 -190 189 183 22 62 221 -78 -126 11 190
6935 190 -281 -199 -213 351 -30 53 -164 56 -150 18 -108 377 98 -29 16 -9 -140 -145 -98 -151 -37 191 -42
$$ packed form
6766Cq5K08M6k65Q8J67j49J95o78M90N6J19k31o2j2L13j52K1k0k35O29l37j92
6789h3L3N2o3p4J90j53Q7M1n9k8q2K57K4l64K83k09K17j28J00m1j99J48K3J89
6813A61m7R5l20J4K03j54J95Qj75J06J5J9L2k21Lq2J18N0J32k15JJ57K7j13j62
6838a53K28k34j3J42Qm0M7p2J27K56m79M16r8m3k38K59j96J05K9p0nJ84m30K0
6862b50M5K34r9L9j28N9KJ87N0o6O9k62L03q2M0Ml06J08k1L82k97K14j1l08K76
6887A82j64N3P3l04Q7K8j88j3L15R6o8j33J35l9r9Q7M0J1j87K4K44k82l4K34j96
6912i8j09K90j20J60k34jJ04p4J63k2j39K42j40k12L79oj61M0J59k99m8J37J79
6935A90m71Q2j4N64l81Q3k17K20k06J68j26M85k79j27M5k5j31nM7n3J14K28k33
$$ plain form
6958 -42 285 -210 150 16 -198 56 -107 -159 -287 -192 175 55 -183 125 79 6 -17 96 -266 -205 88 -303
6980 -303 -287 -251 -108 106 -39 -47 -60 -4 -40 6 -198 -125 -454 107 69 -26 164 -124 -77 -161 -108 265 82 42 139
7005 139 -79 -6 3 8 189 151 34 -34 119 -79 103 -226 122 111 111 -67 80 -70 -64 4 158 154 85 200 11
7030 11 341 -55 -96 -50 197 -3 -89 -85 -48 243 35 150 129 -85 169 -209 36 89 -203 -173 -20 -115 -225 -152
7054 -152 -147 175 -120 -90 20 121 40 -89 299 27 140 125 -10 -296 -129 393 61 -77 40 40 -166 37
7076 37 -129 -125 -125 115 -3 246 109 35 -34 -231 38 254 68 257 40 -223 137 245 -3 -14 -150 -172 -1
7099 -1 165 -161 97 100 -82 81 -297 -50 -1 26 56 15 2 85 -16 402 -319 -72 175 -121 24 9 -29 -76
7123 -76 -78 -140 -33 -3 -41 51 -234 22 104 172 -41 -83 -28 -20 176 187 36 -87 -36 102 153 128 -130 -139 -2 -220
$$ packed form
6958d2L27m95L60j34k14K54j63n2j28R5L67j20k38L08m6p3k3J13l62O1K93l91
6980c03J6L6J43K14j45qj3N6l6M6k04P3l29N61l8r5J90k88M7q4N3L73j83m0R7
7005A39k18P3RNJ81l8j17o8J53j98J82l29L48j1%j78J47j50OO8J54mo9J15j89
7030A1L30l96m1M6K47k00q6ML7K91k08J15k1k14K54l78K45N3k92L0J53r5j10P3
7054a52NL22k95L0J10J01q1j29L88k72J13j5j35k86J67N22l32j38J17%k06K03
7076C7j66M%K40j18K49j37p4o9j97K69K16j86J89k17k63L60J08k48j1j36k2J71
7099aJ66l26K58Lj82J63l78K47M9K7L0m1j3Q3j01M18p21K47K47k96J45j5l8m7
7123g6ko2J07L0l8R2k85K56Q2O8k13m2N5QJ96J1j51j23N1J38N1k5k58rJ37k18
$$ plain form
7149 -220 -412 50 -39 46 64 68 125 -62 206 -14 -120 133 -41 198 -100 27 -179 -22 -105 -69 59 -64 296
7172 296 -58 75 -153 39 -35 116 41 209 22 15 192 -116 421 -119 211 -47 -69 24 -27 -62 34 3 43 -114
7196 -114 -176 91 -99 -9 151 -109 -260 4 -110 -163 -54 117 -70 168 62 -217 -185 78 -56 66 -66
7217 -66 -124 27 86 -213 -191 -154 -38 -22 -176 -146 204 -15 68 140 276 -85 -18 -245 -297 -8 -66 35 -106 -209
7241 -209 178 -52 28 -154 -201 195 73 56 -79 1 -63 140 168 394 -28 -164 122 -34 40 263 133 -220
7263 -220 -45 123 -118 -173 191 17 147 40 -28 -29 -127 60 24 104 1 -227 -192 -23 -85 -180 -150 -130 143 -25
7287 -25 162 89 -11 155 17 52 -6 -7 60 75 -227 52 44 15 -165 -90 -12 68 69 9 -71 -266 -190 -3 -166 -79 93
7314 93 -54 -258 -188 -146 81 -93 98 131 -98 248 170 186 -81 106 185 34 -59 -69 -214 -45 -5 -121 63
$$ packed form
7149b20j92M62q9Q5J8MN7j87K68k20j06K53j74K39k98J27k06J57q3L6J28j23L60
7172B96l54J33k28J92p4J51p5J68j87pJ77l08N37n40L30k58k2R3n1l5R6l1M0j57
7196a14o2K67j90R0J60k60j51K64j14n3J09J71j87K38j06k79L2K63j34J22j32
7217f6n8J51N9k99K2L7J16J6j54L0L50k19Q3P2J36l61O7k27n2K89n8J01j41j03
7241b09L87k30Q0j82m7L96j22j7j35Q0o4K03K8K26m22j36K86j56P4K23j30l53
7263b20J75J68k41n5L64j74J30j07o8jr8J87l6Q0j03k28L5J69o2r5L0K0K73j68
7287b5J87p3j00J66j38L5n8jO7J5l02K79qk9j80P5P8Q0Jo0q0j95P6J87j63Q7J72
7314I3j47k04P0M2K27j74J91L3k29L46p8J6k67J87P9j51r3j0j45J69M0j16J84
$$ plain form
7337 63 90 -242 -111 -36 121 -15 92 57 -34 -14 32 62 58 89 36 142 244 -111 85 210 34 -65 -24 -142 10
7362 10 145 6 16 -19 68 -20 -284 185 -111 163 31 54 -105 -42 83 119 -82 -95 227 -172 -147 27 31 34 38
7387 38 -49 182 263 42 -115 -17 -212 114 22 95 -242 -176 59 0 79 74 -63 217 225 132 -183 57 91 146 135 -199
7413 -199 89 147 -179 -160 102 -16 -7 -84 141 1 -154 25 168 -77 -107 -141 102 193 180 -195 -134 -27 -77 -33
7437 -33 103 23 -201 -259 68 152 124 130 17 100 -210 -106 -107 77 288 -155 12 24 -34 -188 54 -147 -215 -43
7461 -43 -242 -70 -204 -141 -133 3 158 107 -210 -46 -186 45 203 -164 -236 -136 -19 -41 -56 -312 -172 -103 -123
7484 -123 -175 150 51 6 136 -125 59 -15 -104 -42 349 133 39 -85 -18 136 -41 -27 -306 270 -164 -138 46
7507 46 -53 -17 10 -80 -83 149 -154 -129 -246 460 2 7 -40 77 -3 -5 63 50 93 -292 -167 79 271 -97 -282 -110
$$ packed form
7337F3K7l32J31P5J57j36J07l5r1K0M6L0mL1n3J06J02l55J96J25j76r9M1j18J52
7362A0J35j39J0l5Q7q8k64M69k96K74j32K3j59O3J25L6k01j3L22l99K5J74MLM
7387C8q7K31Q1k21j57R8j95L26r2P3l37O6K35n9P9nj37K80Qr3l15K40L4N5j1l34
7413a99K88N8l26J9K62j18Rp7K25j40j55J79J43k45l0l4K43R1j3l75O1J07n0M4
7437c3J36q0k24n8L27Q4k8Oj13Q3l10J04jJ84K11m43J67J2n8j54K42k01o8J72
7461d3j99J72j34O3QJ36J55n1l17J64j40K31J58l67p2J00J17k2j5k56J40O9k0
7484a23n2L25r9m5J30k61J84p4q9O2L91k16r4j24O7J54j77J4k79N76m34K6J84
7507D6r9L6K7r0lK32l03K5j17P06m58Nm7J17q0kO8j3M3l85J25K46J92l68j85J72
$$ plain form
7533 -110 57 -66 49 133 -30 -166 -139 -148 138 -127 156 17 154 -57 -3 -39 16 119 -366 91 197 -306
7555 -306 -113 -94 82 -80 -37 4 -60 -118 -96 -40 152 32 -182 -70 138 -73 -171 35 140 29 -37 24 241
7578 241 -168 -272 -104 -42 14 -14 104 -141 27 288 28 -190 -103 95 141 -15 87 194 43 -244 -93 104
7600 104 104 -140 -178 -56 45 -58 -222 -221 -135 29 172 121 59 261 231 278 -10 -195 54 48 184 -37 11 46 181
7625 181 -104 65 -147 -13 18 -58 104 -19 80 270 0 -141 75 -94 -213 12 182 -14 72 -147 -28
7646 -28 178 -269 134 17 124 -67 40 59 45 127 24 -84 23 277 -13 221 -34 75 171 93 -88 -5
7668 -5 28 -58 54 3 152 72 51 -22 -153 28 -91 -27 78 -277 -137 28 -320 -3 54 -76 -87 143 -67 59
7692 59 -44 -98 4 148 218 -88 74 108 -73 -77 87 90 -13 -111 121 -99 49 152 -232 -119 -3 -23 240
$$ packed form
7533a10J67j23J15Q4j63j36K7rK86k65K83j39J37k11N4l6N5J03m85M57J06n03
7555c06J93J9J76j62M3M1o4n8K2N6J92j20k14J12K08k11r8K06J05j11o6O1K17
7578B41m09j04J68O2N6k8J18k45J68K61k60k18Q7J98M6j56J02J07j51k87J51J97
7600A04%k44l8J22J01j03j64JQ6J64J43n1o2K02l0M7k88j85K49oJ36k21M8L5J35
7625A81k85J69k12J34L1p6J62j23R9J90k70j41K16j69j19K25J70j96Q6k19J19
7646b8K06m47M03j17J07j91J07J9j4Q2j03j08J07K54k90K34k55J09R6p8j81Q3
7668eL3q6J12n1J49q0k1p3j31J81j19O4J05l55J40J65l48L17N7j30j1K30k10J26
7692E9j03n4J02J44P0l06J62L4j81mJ64Lj03r8K32k20J48J03l84J13J16k0K63
$$ plain form
7715 240 19 -21 91 -34 92 -3 -147 38 -8 -11 -39 239 -104 -242 30 -69 55 -50 -133 -137 19 -148 57
7738 57 -146 14 -141 193 -151 111 211 50 -80 -105 30 139 206 -9 -107 78 -100 -29 1 -85 101 172 -41
7761 -41 258 -166 56 36 28 -90 -199 -14 -77 -51 -203 -111 -216 88 -303 50 -14 -57 180 33 -111 69 -110
7784 -110 266 85 -19 83 -28 -184 -71 135 163 241 -229 82 -134 49 -86 38 139 112 135 -75 -41 176
7806 176 -117 102 -136 104 92 -79 125 17 34 -46 -47 106 -93 -209 -71 -27 112 -236 -184 -109 93 186 -15
7829 -15 -35 49 -125 20 -228 20 303 103 -90 -46 7 -5 -184 -28 70 -188 120 -232 -98 -145 -44 80 54
7852 54 38 -57 -75 165 45 243 -168 -131 -14 -240 125 -7 -106 5 -173 -213 6 -33 -156 1 -43 139 -30
7875 -30 -178 10 -14 18 65 51 119 -68 -134 299 50 231 252 -43 -20 -104 62 44 94 -103 -66 2 -80 224 -117
$$ packed form
7715B40k21m0J12j25J26r5j44J85m6lk8K78l43j38K72r9J24j05q3mJ56j67K05
7738E7k03J60j55L34l44K62J00j61j30k5J35J09O7k15r8J85j78P1L0q6J86P1k13
7761d1K99m24K22k0qj18j09J85o3K6j52R2j05L04l91L53o4m3K37j47j44J80j79
7784a10L76j81j04J02j11j56J13K06K8P8m70L11k16J83j35J24J01k7K3k10L4K17
7806A76k93K19k38K40j2j71K04j08J7q0jJ53j99j16J38M4J39l48N2P5K02R3k01
7829a5k0Q4j74J45k48K48K83k00j93M4N3j2j79J56R8k58L08l52J34m7J01J24k6
7852E4j6r5j8K40j20J98m11L7J17k26L65j32r9J11j78m0K19l9j23J57m4J82j69
7875c0j48J88k4L2M7j4O8j87o6M33k49J81K1k95K3q4J66j8N0j97L7O8q2L04l41
$$ plain form
7900 -117 66 -96 59 43 -223 -159 173 31 -202 33 102 -27 -19 -108 -133 -27 28 40 -89 5 66 310 -113 63
7924 63 166 -5 -114 -4 -163 -92 34 138 -111 88 -92 44 94 -49 271 -165 -3 117 134 245 336 -111
7946 -111 -301 -149 120 -168 -23 179 144 88 -10 -24 -50 9 12 176 -118 96 51 -7 126 11 43 -113 66 119
7970 119 -9 -51 -180 -147 113 -27 -81 -16 54 -235 189 -309 103 90 -161 5 29 -192 -222 -175 76 -9 -40 1
7994 1 -12 -41 -46 179 -43 221 -64 -78 146 -155 -137 25 -100 -67 243 -174 232 7 36 88 -160 -33 -75 109
8018 109 -40 34 -60 -170 -46 -32 -104 -3 122 -6 68 -193 34 138 45 -37 -5 108 23 -57 -133 -188 -64 -275
8042 -275 86 223 77 50 25 -56 146 -362 -77 182 9 -81 -169 77 -72 -51 46 299 -83 30 116 79 86 -95
8066 -95 261 61 32 -346 -125 184 74 -175 -41 53 327 -394 -90 -215 -157 83 -9 15 327 -105 -69 -139 129
$$ packed form
7900a17J83j62J55j6k66O4L32j42k33K35O9j29Qq9k5J06N5J2j29R4O1K44m23J76
7924F3J03j71j09J10j59P1J26J04k49J99j80J36N0j43L20m36J62J20J7J11R1m47
7946a11j90J52K69k88J45K02l5n6r8j4k6N9LJ64k94K14m5n8J33j15L2j56J79N3
7970A19j28m2j29L3K60j40n4O5P0k89M24m98M12j3k51J66K4k21l0M7K51q5l1M1
7994Aj3k9nK25k22K64k85j4K24l01J8J62j25L3L10m17M06k25K9N2k48J27m2J84
8018A09j49P4r4j10J24J4p2J01J25j28P4k61K27J04r3q2L2J13q5q0p6n5J24k11
8042b75L61J37j46k7k5q1K02n08K85K59j73r0q8K46j49K1R7K53l82J13Q6l7Pj81
8066i5L56k00k9l78K21L09j10k49J34R4K74p21L04j25N8K40r2K4L12m32L6p0K68
$$ plain form
8089 129 -64 15 -140 85 239 -163 23 191 -263 155 5 117 -134 77 23 51 121 -72 116 -70 -117 -350
8111 -350 146 -175 -81 79 49 184 95 32 134 -185 103 167 -42 -118 269 78 -30 37 -157 75 34 -202 152
8134 152 -5 -56 285 -36 264 252 -61 152 152 -82 39 0 -324 64 523 286 65 -26 38 224 -173 -16
8156 -16 -106 190 61 -125 -117 -106 -117 -109 -174 70 214 -156 101 73 18 6 -14 -53 -85 -326 159 -143 -37 216 26
8181 26 -5 215 -237 231 135 -144 121 -116 77 -1
$$ packed form
8089A29j93P9j55K25J54m02J86J68m54M18j50J12k51K11n4K8P0j93J88j86m7k33
8111c50M96l21R4J60l0J35q9o3J02l19K88O4k09p6L87j91j08O7j94K32m1k36L54
8134A52j57n1L41l21L00j2l13K13%k34J21l9l24L88M59k37k21r1O4J86l97J57
8156a6r0K96j29j86QJ1j1Qo5K44J44l70K57k8n5j2k0l9l2k41M85l02J06K53j90
8181B6l1K20m52M68r6k79K65k37J93p8
8191a
$$ Imaginary data points
##PAGE= N=2
##DATA TABLE= (X++(I..I)), XYDATA
$$ plain form
0 0 0 0 0 0 0 0 0 0 0 0 0 0 0 -6 8 -8 8 -8 8 -16 16 -24 24 -29 32 -40 47 -51 56 -68 77 -88 100 -111 125 -141
36 -141 157 -176 197 -220 244 -270 299 -331 365 -404 444 -489 539 -593 655 -721 797 -878 972
55 972 -1082 1203 -1343 1512 -1712 1956 -2263 2659 -3193 3947 -5100 7043 -10925 21492 -106599
70 -106599 -284161 119431 157188 -78071 -1487 35830 -149470 11526 261960 -34357 -285905
81 -285905 73895 211726 -72124 -51030 58618 -105668 -26663 219529 11462 -266685
91 -266685 3646 226651 -36967 -115547 55284 -48119 -62493 168757 47558 -230739
101 -230739 -40988 215067 18191 -141749 26788 21832 -67474 111993 89660 -187333 -77320
112 -77320 197134 58943 -142528 -14694 61606 -44747 40051 98508 -131040 -117457 163981
$$ packed form
0@%%%%%%%%%%%%%oJ4j6J6j6J6k4L2m0M8n3O1p2Q7r8J07j24J45j65J88k11K36k66
36a41K98l33L73m17M64n14N69o30O96p69Q48r33J028j132J248j376J518j675J850
55I72k054K285k546K855l224L668m219M922n852P140r047J2143j7968L2417j28091
70a06599j77562M03592L7757k35259P6584L7317j85300J60996K50434k96317k51548
81b85905L59800J37831k83850K1094J09648j64286P9005K46192k08067k78147
91b66685K70331K23005k63618p8580J70831j03403j4374K31250j21199k78297
101b30739J89751K56055j96876j59940J68537m956q9306J79467k2333k76993J10013
112g7320K74454j38191k01471J27834P6300j06353Q4798N8457k29548J3583K81438
$$ plain form
123 163981 91488 -138977 -50630 70834 -12392 -3755 74888 -67203 -123199 115121 120544
134 120544 -121627 -73059 83874 12289 -23484 54173 -21442 -103965 63259 131915 -82262
145 -82262 -101888 80770 39076 -43825 32049 1670 -86126 25162 114508 -45789 -116366
156 -116366 53780 66828 -54402 1454 26400 -67799 -1153 99092 -16146 -103683 26261
167 26261 81739 -34340 -25432 39959 -36157 -21827 85996 6159 -91260 9539 76101 -15596
179 -15596 -40381 27821 -8178 -35927 54728 23754 -82042 -8980 68259 -8835 -43735 14021
191 14021 7716 -29121 23532 34650 -54025 -25505 62361 7038 -41856 10562 16581 -16087
203 -16087 10786 29379 -25232 -30415 43195 23919 -40208 -1275 22761 -13339 -618 19145
$$ packed form
123A63981p2493k30465Q8347J21464q3226Q637P8643j42091n5996K38320N423
134A20544k42171M8568J56933p1585l5773P7657p5615q2523J67224O8656k14177
145h2262j9626J82658m1694q2901P5874l0379q7796J11288Q9346j60297p0577
156a16366J70146J3048j21230N5856K4946r4199O6646J00245j15238q7537J29944
167B6261N5478j16079Q908O5391p6116J4330J07823p9837r7419J00799O6562r1697
179a5596k4785O8202l5999k7749R0655l0974j05796P3062P7239p7094l4900N7756
191A4021o305l6837N2653J1118q8675K8520Q7866n5323m8894N2418O019l2668
203a6087K6873J8593n4611n183P3610j9276o4127L8933K4036l6100J2721J9763
$$ plain form
215 19145 -14339 -26443 18757 24360 -28498 -17145 22785 -6139 -12246 16742 -5737 -21547
227 -21547 11038 20412 -12057 -17840 16247 9208 -14170 10734 8469 -17865 6164 19311 -6887
240 -6887 -12860 7744 11218 -9602 -2848 11125 -11137 -6584 15768 -4576 -14076 4622 5597 -5226
254 -5226 -5525 5089 -456 -9003 8947 5276 -12535 3690 9369 -4114 -625 3931 1965 -2127
268 -2127 1878 6967 -5545 -2574 9329 -3281 -4742 4659 -1984 -2977 7 44 -1615 -5455 1917
283 1917 1227 -7172 2143 1382 -5444 1976 463 -1347 1328 -264 3152 164 -671 5284 -468 79
299 79 4609 -1330 1515 2244 -1642 2188 -841 -708 1221 -3445 112 -364 -4005 981 -2355 -2771 1661
316 1661 -3034 -782 851 -2574 1889 -770 -764 3244 -1377 1302 3119 -1070 2400 1657 181 2936
$$ packed form
215A9145l3484j2104M5200N603n2858J1353L9930k8924o107K8988k2479j5810
227b1547L2585R374l2469n783L4087p039k3378K4904k265k6334K4029J3147k6198
240f887n973K0604L474k0820O754J3973k2262M553K2352k0344r500J8698R75j0823
254e226k99J0614n545q547J7950l671j7811J6225N679j3483L489M556j966m092
268b127M005N089j2512K971J1903j2610j461R401o643r93K984L7j659l840P372
283A917o90q399R315p61o826P420j513j810K675j592L416k988q35N955n752N47
299G9M530n939K845P29l886L830l029J33J929m666L557m76l641M986l336m16M432
316A661m695K252J633l425M463k659OM008m621K679J817m189L470p43j476K755
$$ plain form
332 2936 -591 1416 1930 -2467 2341 251 -3426 1591 -1147 -1920 -496 -2430 -117 -2158 -1861 2107
348 2107 -4015 -1759 3684 -2761 -1230 2128 -469 264 385 2771 829 -2636 5681 2657 -4729 3772
364 3772 2985 -2839 1512 1763 -1562 -3039 1731 3821 -6540 -3153 5721 -4218 -3504 3908 -3490 -4788
380 -4788 2980 3969 -4194 -5352 6318 1814 -5823 5226 2416 -6945 5227 8331 -4488 -5105 6102
395 6102 5917 -5471 24 5714 -7675 -872 11777 -5582 -11295 5314 6179 -6018 -4520 4364
409 4364 -4082 -5693 11329 696 -16128 4659 13031 -5382 -5654 5514 585 -4369 9098 6526
423 6526 -15444 -1274 19386 -2279 -11632 6227 2477 -5759 5921 6600 -14210 -8799 18329
436 18329 3581 -19052 1127 7706 -8444 2732 8920 -12895 -11182 16976 10821 -18751 -4599
$$ packed form
332B936l527K007N14m397M808k090l677N017k738p73J424j934K313k041K97L968
348B107o122K256N443o445J531L358k597P33J21K386j942l465Q317l024p386Q501
364C772p87n824M351K51l325j477M770K090j0361L387Q874r939P14P412p398j298
380d788P768R89q163j158J1670m504p637J1049k810r361J2172L104j2819o17J1207
395F102j85j1388N495N690j3389O803J2649j7359n713J6609Q65j2197J498Q884
409D364q446j611J7022j0633j6824K0787Q372j8413k72J1168m929m954J3467k572
423F526k1970J4170K0660k1665r353J7859l750q236J1680O79k0810N411K7128
436A8329j4748k2633K0179O579j6150J1176O188k1815J713K8158o155k9572J4152
$$ plain form
449 -4599 15177 -3472 -2372 13315 -8367 -13971 17519 15655 -16991 -11311 15847 3304 -9027
462 -9027 9267 -2534 -19501 12138 20179 -17693 -18276 13725 8634 -11059 1537 2941 -17064
475 -17064 4399 25492 -12352 -24024 14311 16301 -9392 -2154 6491 -9946 -544 25008 -2556
488 -2556 -28590 9180 23402 -9078 -8834 6698 -6657 -5013 19126 2517 -29922 -1368 28054
501 28054 -5465 -17865 6767 -1108 -8090 15605 7304 -25908 -7784 29565 4970 -23012 3470
514 3470 8981 -8168 10977 12988 -21911 -12222 27977 12360 -23979 -5613 14504 -5047 814
527 814 14139 -17213 -19377 23640 16483 -23759 -13240 14930 1527 -5771 10948 -7288 -21894
540 -21894 17822 23915 -20013 -17269 16355 8415 -7119 6472 673 -18826 8838 28113 -13962
$$ packed form
449d599J9776j8649J100J5687k1682n604L1490j864l2646N680K7158j2543j2331
462i027J8294j1801j6967L1639Q041l7872n83L2001n091j9693J2596J404k0005
475a7064K1463K1093l7844j1672L8335J990k5693P238Q645j6437R402K5552k7564
488b556k6034L7770J4222l2480K44J5532j3355J644K4139j6609l2439K8554K9422
501B8054l3519j2400K4632p875o982K3695q301l3212J8124L7349k4595k7982K6482
514C470N511j7149J9145K011l4899R689M0199j5617l6339J8366K0117j9551N861
527H14J3325l1352k164M3017p157m0242J0519K8170j3403p298J6719j8236j4606
540b1894L9716O093m3928K744L3624p940j5534J3591n799j9499K7664J9275m2075
$$ plain form
553 -13962 -24193 14989 13318 -9650 700 2770 -15253 607 24820 -6445 -29222 8778
565 8778 19548 -10320 -5105 5860 -11005 -2545 21973 1181 -26824 2113 25254 -4421 -11549
578 -11549 8039 -3845 -5990 18839 5809 -23745 -3730 23597 1583 -16513 3336 2611 -8929
591 -8929 10693 8896 -21274 -9523 20671 5362 -17206 -2246 7369 -6175 3273 12315 -13647
604 -13647 -13108 18818 10966 -15189 -4675 9866 -577 -965 10434 -5856 -15160 13252 15523
617 15523 -14338 -9197 9805 744 -4619 5827 -1904 -14307 5256 16376 -10579 -14443 9395
630 9395 5101 -6306 3487 1647 -10818 1613 15809 -3526 -14893 7013 10519 -6376 91
643 91 4991 -7659 -1067 13284 312 -13897 1345 11838 -4159 -5410 5430 -4679 -5500 9685
$$ packed form
553a3962j0231L9182j671k2968J0350K070j8023J5860K4213l1265k2777L8000
565H778J0770k9868N215J0965j6865Q460K4518k0792k8005K8937K3141k9675p128
578a1549J9588j1884k145K4829j3030k9554K0015K7327k2014j8096J9849p25j1540
591h929J9622j797l0170J1751L0194j5309k2568J4960R615j3544R448R042k5962
604a3647N39L1926p852k6155J0514J4541j0443l88J1399j6290r304K8412K271
617A5523k9861N141J9002r061n363J0446p731j2403J9563J1120k6955l864K3838
630I395m294j1407R793j840j2465J2431J4196j9335j1367K1906L506j6895O467
643I1M900j2650O592J4351j2972j4209J5242J0493j5997j251J0840j0109q21J5185
$$ plain form
657 9685 2071 -12949 -1668 10175 -927 -7498 3501 693 -5793 6477 5943 -9992 -2708 10396
671 10396 1682 -6308 1666 3749 -3953 1966 7052 -6446 -6203 8990 2601 -7266 -509 3086 -2924
686 -2924 -1000 4584 -2945 -7610 4979 5157 -6758 -2167 4606 -1525 -1604 3763 -49 -4890 2432
701 2432 6854 -3222 -3505 5321 593 -2728 3463 1074 -3951 308 4335 -1355 -4865 2384 2076
716 2076 -4299 720 1824 -4482 -756 3061 -1125 -3587 679 2774 -1908 -982 3106 -1700 -1452 3987
732 3987 591 -2372 1349 2563 25 -546 2008 642 -1715 1888 1651 -2929 40 1898 -1175 -1029
748 -1029 336 -396 -1988 -406 1115 -1905 -1538 1702 -617 -1478 838 133 -72 282 552 505 -739
765 -739 1116 1467 -1065 893 1196 -555 695 526 -105 62 -234 585 -286 -1046 662 -766 -1132 234
$$ packed form
657I685p614j5020J1281J1843j1102o571J0999k808o486J2270n34j5935P284J3104
671A0396q714p990P974K083p702N919N086j3498K43J5193o389r867O757L595o010
686b924J924N584p529m665J2589J78j1915M591O773o131p9N367l812m841P322
701B432M422j0076k83Q826m728l321O191k389n025M259M027n690l510P249l08
716B076o375N019J104o306L726L817m186k462M266K095m682R26M088m806K48N439
732C987l396k963L721J214k538n71K554j366k357L603k37m580K969J858l073J46
748a029J365p32j592J582J521l020L67L240k319q61K316p05k05L54K70m7j244
765g39J855L51k532J958L03j751J250j69o31J67k96Q19q71p60J708j428l66J366
$$ plain form
783 234 -1101 -439 -219 -617 96 -488 10 918 -462 308 1019 -260 928 369 204 706 44 910 660
802 660 -326 941 23 -520 549 -427 -410 181 -656 -8 -566 -825 320 -1193 -288 555 -1110 231 36
821 36 -480 503 -131 292 625 -116 1232 267 192 1475 -72 -272 1147 -327 -236 76 -152 21 -746 35
841 35 51 -1327 -79 145 -1715 -39 -48 -737 -354 4 153 -435 124 1867 -606 -619 1875 138 -363
860 -363 1194 311 -550 367 1055 283 -1238 1013 891 -1789 459 898 -1929 -395 903 -769 -1959
877 -1959 -291 1273 -1703 -930 1619 -1397 -1211 2444 -21 -1813 846 2199 -185 -771 1708 319
893 319 -1684 2394 1857 -2905 427 2777 -890 -1677 904 521 -2249 362 2020 -3064 -2117 3335
909 3335 -426 -3059 889 805 -1843 139 2643 -1439 -2703 3623 2370 -3360 772 2796 -1822 31
$$ packed form
783B34j335O62K20l98P13n84M98R08j380P70P11j279J188n59j65N02o62Q66k50
802F60r86J267r18n43J069r76J7N91q37O48n58k59J145j513R05Q43j665J341j95
821C6n16R83o34M23L33p41J348r65p5J283j547k00J419j474R1L12k28J73p67P81
841C5J6j378J248K24j860J676ro89L83L58J49n88N59J743k473j3K494j737n01
860c63J557q83q61R17O88p72j521K251j22k680K248M39k827J534J298j672j190
877a959J668J564k976P73K549l016J86L655k465j792K659J353k384n86K479j389
893C19k003M078n37m762L332K350l667p87K581l83k770K611J658n084R47N452
909C335l761k633L948q4k648J982K504m082j264O326j253n730M132K024m618J853
$$ plain form
925 31 3556 -996 -3226 2379 3275 -3238 -1881 3509 -1348 -2017 2774 -686 -4317 1172 3519 -2917
941 -2917 -3835 3066 679 -3300 2123 1351 -4318 907 5416 -1716 -3715 2721 3039 -2440 557 3194
957 3194 -3480 -1186 5986 -579 -5454 2036 3377 -2581 -1200 2454 -2332 -3194 4750 951 -7133
972 -7133 415 4816 -2395 -2298 2366 -768 -2982 3680 3260 -5925 -1484 6803 -232 -3786 2988 498
988 498 -2816 3150 4015 -4653 -3588 5831 1622 -5490 753 2143 -3798 1031 4049 -4319 -4984 4777
1004 4777 3317 -5470 -1504 3748 -2483 -691 4770 -2434 -5281 4526 4869 -3851 -2475 3906 517
1019 517 -1878 4150 21 -6152 2965 6169 -3992 -4179 3078 1153 -3013 1662 1042 -5792 115
1034 115 6542 -2618 -6166 2768 2487 -2855 711 1792 -3500 -962 6522 443 -6159 1900 4865
$$ packed form
925C1L525m552k230N605Q96o513J357N390m857o69M791l460l631N489K347o436
941b917r18O901k387l979N423p72n669N225M509p132j999O436L18n479K997K637
957C194o674K294P172o565m875P490J341n958J381L654m786q62P944l799q084
972g133P548M401p211R7M664l134k214O662m20r185M441Q287p035l554O774k490
988D98l314N966Q65q668J065R419m209p112O243J390n941M829L018q368o65R761
1004D777j460q787L966N252o231J792N461p204k847R807L43q720J376O381l389
1019E17k395O028m129o173R117L204j0161j87P257j925m166M675o20o834N907
1034A15O427r160l548Q934k81n342L566J081n292K538P484o079o602Q059K965
$$ plain form
1049 4865 -2112 -656 2379 -2168 -1929 5263 1733 -6534 -826 5415 -1449 -2798 2247 -1413 -2854
1064 -2854 3535 2274 -5686 -2137 4774 517 -4018 1469 959 -3170 2587 3801 -4082 -2501 5134
1079 5134 2245 -3662 404 2254 -1846 632 4106 -2890 -3982 4169 2510 -3956 -1704 2219 -1052
1094 -1052 -1162 2805 -1351 -5139 2629 3719 -3459 -2272 2296 -26 -1286 2356 643 -3620 1258
1109 1258 4979 -1857 -3009 2466 1354 -1758 1374 1024 -2866 -40 3679 -518 -4433 796 2064
1124 2064 -2301 -36 967 -2682 -1239 3016 214 -3711 -25 2922 -1183 -1145 2203 -1172 -1306 3385
1140 3385 938 -2754 -293 3005 94 -1659 1201 360 -1560 1550 1492 -2756 -1169 2127 251 -1846
1156 -1846 100 492 -1605 -131 1702 -2188 -1670 1912 646 -1990 1 860 -483 93 1609 -44
$$ packed form
1049D865o977J456L035m547K39P192l530q267N708O241o864j349N045l660j441
1064b854O389j261p960L549O911m257m535N487n10m129N757J214p883J581P635
1079E134k889n907M066J850m100K478L474o996j092Q151j659o466K252L923l271
1094a052j10L967m156l788P768J090p178J187M568k322j260L642j713m263M878
1109A258L721o836j152N475j112l112L132l50l890K826L719m197l915N229J268
1124B064m365K265J003l649J443M255k802l925L686K947m105L8L348l375j34M691
1140C385k447l692K461L298k911j753K860q41j920L110n8m248J587L296j876k097
1156a846J946L92k097J474J833l890N18L582j266k636J991Q59j343N76J516j653
$$ plain form
1172 -44 -1605 1793 1792 -1169 -220 1151 -228 -283 702 -148 -1585 59 1976 -1108 -1363 960 -266 -1044
1190 -1044 496 -267 -1276 -270 1089 -200 -1368 526 781 -865 571 1062 -835 19 1163 435
1206 435 -726 411 1066 -354 -350 978 -642 -549 845 -305 -974 -93 351 -248 -868 157 154 -1011 266
1225 266 490 -1018 6 708 -72 -154 159 354 -106 -2 818 -101 -197 761 157 -407 342 229 -101 -141
1245 -141 64 -149 -585 146 292 -670 -169 -133 -407 -195 -272 -118 26 62 195 -118 -548 622 101 119 668
1266 668 32 106 327 378 456 11 186 434 -292 176 373 -208 62 -326 -419 -337 -572 -338 -141 -537 27 -243
1288 -243 -248 -52 -90 16 34 9 361 216 -44 397 23 321 435 46 437 245 137 4 -322 -68 211 -156
1310 -156 -7 -307 -613 -104 -493 -599 170 -329 -97 -49 -180 -56 -98 120 306 -385 275 398 61 397 540
$$ packed form
1172d4j561L398jk961R49J371j379n5R85q50j437J644J917l084k55K323j226p78
1190a044J540p63j009J006J359j289j168J894K55j646J436M91j897Q54J144p28
1206D35j161J137O55j420MJ328j620R3J394j150o69Q81M44n99o20J025lj165J277
1225B66K24j508J024P02p80q2L13J95m60J04Q20r19r6R58o04n64P49j13l30m0
1245a41K05k13m36P31J46r62N01L6k74K12p7J54J44L6J33l13m30J170n21J8N49
1266F68o36P4K21N1P8m45J75K48p26M68J97n81K70l88r3Q2k35K34J97l96N64k70
1288b43nJ96l8J06J8k5L52j45k60M41l74K98J14l89L91j92j08j33l26K54K79l67
1310a56J49l00l06N09l89j06P69m99K32M8j31J24m2K18J86o91O60J23l37L36J43
$$ plain form
1331 540 -89 189 -21 357 153 -97 502 -373 -326 191 -116 -287 -220 -294 -123 -194 -84 -45 -413 102 301 -359
1353 -359 63 466 -384 -110 236 317 -204 206 625 -13 -109 572 -134 -184 715 90 -574 -287 543 -209 -504
1374 -504 104 164 -846 133 269 -693 -239 337 -217 -365 3 -86 -312 139 786 -177 -242 971 206 -361
1394 -361 361 589 -60 -188 807 -112 -1022 722 355 -1256 -238 445 -638 -645 377 -226 -1073 195 853
1413 853 -900 -489 1113 14 -484 759 442 -613 24 1192 -117 -952 1102 746 -1040 640 941
1430 941 -918 -207 904 -395 -1160 444 736 -1062 -275 1003 -1023 -871 1221 -153 -1861 381
1446 381 976 -785 -594 1215 -209 -1014 1328 944 -1534 371 1801 -506 -707 943 375 -1319 682
1463 682 1111 -1648 -735 1902 -308 -1923 489 391 -1350 -90 1156 -1574 -1359 1556 585 -1841 671
$$ packed form
1331E40o29K78k10L78k04k50N99q75M7N17l07j71O7p4J71p1J10L9l68N15J99o60
1353c59M22M03q50K74L46Q1n21M10M19o38r6O81p06n0Q99o25o64K87Q30p52k95
1374e04O08O0j010R79J36r62M54N76n54j48L68q9k26M51O47r63o5J213p65n67
1394c61P22K28o49j28R95r19r10J744l67j611J018O83j083pJ022o03q47J268O58
1413H53j753M11J602j099m98J243l17j055O37J168j309q35K054l56j786J680L01
1430I41j859P11J111j299p65J604K92j798P87J278k026J52K092j374j708K242
1446C81N95j761J91J809j424q05K342l84k478J905J430k307k01J650n68j694K001
1463F82M29k759R13K637k210j615K412r8j741J260J246k730K15K915r71k426K512
$$ plain form
1480 671 1258 -1142 -161 1697 -614 -1387 1327 1551 -1551 -470 1864 -708 -980 1822 -74 -2000
1496 -2000 573 1343 -1481 -930 1696 115 -1607 850 457 -2111 156 1887 -1279 -1510 1243 651
1512 651 -1297 717 1553 -1697 -331 2288 -704 -1723 1599 1209 -1378 224 1409 -1159 -1193 2275
1528 2275 58 -2367 660 1323 -1607 -864 1264 -678 -1547 1269 554 -2154 -248 2222 -1106 -1271
1544 -1271 1843 78 -1247 1439 1624 -1574 -739 2146 -172 -1505 916 993 -1621 308 1490 -1546
1560 -1546 -1292 1648 273 -2145 101 871 -1500 -576 1883 -976 -1760 1410 730 -1825 -168 1619
1576 1619 -760 -953 1823 58 -1609 1372 1532 -1547 -112 1559 -259 -785 1111 473 -1797 157
1592 157 1844 -1278 -983 1340 98 -1176 620 830 -1404 -372 1755 -304 -1831 1053 707 -1131
$$ packed form
1480F71N87k400R81J858k311p73K714K24l102J081K334k572k72K802j896j926
1496b000K573P70k824N51K626j581j722K457l93k568K267J731l166k31K753n92
1512F51j948K014Q36l250J366K619k992j019L322l90k587J602J185k568l4L468
1528B275k217k425L027O63k930P43K128j942q69K816p15k708J906K470l328j65
1544a271L114j765j325K686J85l198Q35K885k318j333K421P7k614J929J182l036
1560a546K54K940j375k418K246P70k371R24K459k859p84L170o80k555J657J787
1576A619k379j93K776j765j667K981J60l079J435J671j818n26J896o38k270J954
1592A57J687l122K95K323j242j274J796K10k234J032K127k059j527K884l46j838
$$ plain form
1608 -1131 380 1086 -734 -507 1761 458 -1486 541 1313 -882 -398 1290 -712 -1186 1019 373
1624 373 -1416 -40 1109 -883 -840 1141 1 -1060 705 704 -908 -290 1135 -171 -863 947 406
1641 406 -977 536 1571 -762 -308 1406 169 -870 504 400 -712 -79 1206 -335 -986 870
1657 870 381 -1149 170 368 -670 -147 600 -268 -688 325 990 -695 58 786 -193 -291 643 253 -480
1676 -480 253 852 -259 -211 553 -163 -623 317 68 -704 -84 577 -298 -663 270 167 -902 -120 288 -563
1696 -563 0 403 149 -352 124 264 16 65 571 107 -220 390 118 -349 127 340 -63 -44 213 -106 -495
1717 -495 0 353 -405 -72 321 -275 -339 216 -339 -425 -147 281 -363 -359 427 220 -196 338 333 31 270 210
1739 210 164 -312 582 302 8 85 211 -360 -114 265 24 -197 -187 -300 -96 -207 225 -280 -95 102 -297
$$ packed form
1608a131J511P06j820K27K268j303j944K027P72k195M84J688k002m74K205o46
1624C73j789J376J149j992M3J981j140j061J765jj612O18J425j306o92J810n41
1641D06j383J513J035k333M54J714j237j039J374j04j112O33J285j541o51J856
1657H70m89j530J319J98j038N23P47q68m20J013O65j685P53P28r79r8R34l90p33
1676d80P33N99j111M8P64p16m60R40k49p72O20O61q75l65R33j03j069P82M08q51
1696e63N63M03k54n01M76J40k48M9N06m64l27O10k72m67M76K13m03J9K57l19l89
1717d95M95L53p58L33L93n96o4N55n55q6K78M28o44MP86k07m16N34nl02K39o0
1739B10m6m76Q94k80k94P7J26n71K46L79k41k21J0j13K04j11M32n05J85J97l99
$$ plain form
1760 -297 -312 -106 503 -22 -74 205 443 -187 201 196 12 157 196 48 236 10 61 59 44 91 78 20 -178 -65
1784 -65 -101 458 -236 -253 -17 -290 -4 56 -137 431 -112 -187 294 -78 42 296 107 178 -13 -84 157 -162
1806 -162 250 31 -137 56 114 -210 -19 -218 -402 -69 -37 -384 -380 -219 -168 -273 -91 215 128 33 212 55
1828 55 156 -90 248 182 131 385 224 -306 271 271 -100 91 130 -127 -213 -75 -75 -280 -38 267 -361 -117 -13
1851 -13 -276 -259 -293 141 -42 90 216 -197 -140 465 94 -356 337 357 -11 236 41 40 141 327 275 -394 -64
1874 -64 -22 -347 -376 16 -93 -371 -90 -328 -569 -287 325 43 -309 398 68 -440 296 469 -145 -322 546
1895 546 435 -252 162 294 -356 -52 229 -189 -195 24 -132 -337 -261 342 -528 -300 461 -236 -626 233 335
1916 335 -123 -337 102 312 -390 263 544 -388 141 831 -217 -232 218 237 -99 31 323 -444 -435 637 -274
$$ packed form
1760b97j5K06O09n25n2K79K38o30L88nj84J45L9j48J88k26N1kj5M7j3n8j98J13
1784f5l6N59o94j7K36k73K86O0j93N68n43p5M81l72J20K54j89P1j91p1K41l19
1806a62M12k19j68J93N8l24J91j99j84L33L2l47MJ61N1j05J82L06q7r5J79j57
1828E5J01k46L38o6n1K54j61n30N77%l71J91L9k57q6J38%k05K42L05o28K44J04
1851a3k63J7l4M34j83J32J26m13N7O05l71m50O93K0l68K47j95jJ01J86n2o69L30
1874f4M2l25k9L92j09k78K81k38k41K82O12k82l52P07l30n08P36J73o14j77Q68
1895E46j11o87M14J32o50L04K81m18oK19j56k05P6O03q70K28P61o97l90Q59J02
1916C35m58k14M39K10p02O53K81r32N29O90j048j5M50J9l36J30K92p67RJ072r11
$$ plain form
1937 -274 -557 55 115 -539 -66 266 -292 -447 393 -70 -807 77 621 -209 83 447 153 -173 665 442
1957 442 -647 -184 1003 -240 -513 611 195 -435 227 547 -488 -314 468 103 -848 136 136 -542 477
1976 477 717 -687 -330 568 166 -479 148 429 -329 112 830 -450 -676 735 510 -676 76 555 -243
1995 -243 -379 566 101 -1009 72 823 -614 -322 451 -238 -391 405 9 -638 -175 702 -73 -895 662
2014 662 259 -588 211 439 -546 -281 807 312 -808 207 660 -412 135 439 -335 -453 874 450
2032 450 -990 -249 461 -461 -407 483 -227 -645 451 398 -822 -479 746 -9 -596 578 226 -395 283
2051 283 906 -503 -518 768 399 -566 -39 281 -484 35 662 -588 -677 844 524 -899 61 254 -523
2070 -523 -307 523 -155 -977 415 565 -408 -394 768 -169 -333 756 353 -663 526 981 -324 -279 630
$$ packed form
1937b74k83O12O0o54M73L32n58j55Q40m63p37Q84N44q30K92L64k94l26Q38k23
1957D42j089M63J187j243k73J124m16o30O62L20j035J74P82l65r51R84%o78J019
1976D77K40j404L57Q98m02o45O27K81p58M41P18j280k26J411k25j186P52M79p98
1995b43j36R45m65j110J081P51j437K92P73o89j53P96l96o47M63Q77p75q22J557
2014F62m03q47P99K28r85K65J088m95j120J015M53j072N47L04p74j18J327m24
2032D50j440P41P10r22N4Q90p10m18J096n3j220L43J225p55n87J174l52o21O78
2051B83O23j409j5J286l69r65N27L20p65N19O27j250q9J521l20j423R60J93p77
2070e23K16Q30o78q22J392J50r73J4J162r37j64J089m03j016J189M55j305M5R09
$$ plain form
2089 630 94 -646 482 -50 -547 163 737 -16 -653 343 262 -674 44 227 -439 -406 604 211 -574 356
2109 356 397 -342 -76 762 -145 -419 410 238 -657 85 419 -294 -412 391 -28 -856 184 405 -712 -171
2129 -171 756 -52 -756 -27 260 -693 368 380 -632 -451 731 50 -254 298 59 -3 89 347 -77 -669
2149 -669 479 376 -819 55 459 -476 -33 233 -56 -347 -67 487 -622 -246 415 -238 -452 247 -36
2168 -36 -441 18 212 -142 -510 516 153 -370 569 44 -3 341 445 -36 -174 178 258 -288 -17 238 -260
2189 -260 -376 326 -210 -393 591 34 -444 -54 71 54 -355 -3 413 -302 322 91 -157 55 351 41
2209 41 -219 77 337 -265 -213 183 -18 -339 81 -95 -114 -127 145 54 -219 219 5 -295 114 -128 -342 98
2231 98 -5 -80 -169 45 115 0 -314 381 -219 -35 164 -156 -279 35 -15 -94 -41 20 131 -98 -85 264 -405
$$ packed form
2089F30n36p40J128n32m97P10N74p53o37R96q1r36P18J83o66L3J010l93p85R30
2109C56M1p39K66Q38r07k74Q29j72q95P42L34p13j18Q03m19q28J040K21j117N41
2129a71R27q08p04P29K87r53J061J2j012J81J182o81l04N52k39o2R2K58m24n92
2149f69J148j03j195Q74M04r35M43K66k89k91K80N54j109L76O61o53k14O99k83
2168c6m05M59J94l54l68J026l63n23R39n25m7L44J04m81j38L52Q0n46K71K55m98
2189b60j16P02n36j83R84n57m78L90J25j7m09L52M16p15O24k31k48K12K96l10
2209D1k60K96K60o02N2L96k01l21M20j76j9j3K72r1k73M38k14l00M09k42k14M40
2231I8j03p5q9K14P0j15l14O95o00J84J99l20j23L14n0p9N3O1J11k29J3L49o69
$$ plain form
2254 -405 179 -178 -401 64 -75 182 -306 20 -82 -214 88 353 -413 125 107 192 168 -58 147 309 -114
2275 -114 -228 -32 -82 148 -178 -5 36 -144 -152 -176 -334 -12 -242 -200 290 -291 8 164 -296 -129 52 208
2297 208 112 -104 70 -16 138 384 208 -202 315 95 299 62 -48 3 -114 -81 148 -274 -353 52 -293 -11
2319 -11 -136 -159 -13 -218 25 -87 -141 200 29 -324 241 44 118 76 86 31 6 -175 122 -136 -17 88 -308
2342 -308 -171 58 -514 -151 25 -58 -41 -252 158 84 -226 306 110 -258 200 9 -47 85 205 318 -113
2363 -113 263 345 -769 -52 520 -180 -147 241 -114 -79 -79 211 19 -390 339 -173 -127 186 121 -350 -86 201
2385 201 -6 -278 187 36 -688 -30 418 -464 53 442 -51 -279 226 275 -434 87 426 124 -509 388
2405 388 145 -623 341 203 -404 -107 505 -94 -224 99 221 -781 12 773 -628 -311 461 249 -520
$$ packed form
2254d05N84l57k23M65j39K57m88L26j02j32L02K65p66N38j8Q5k4k26K05J62m23
2275a14j14J96n0K30l26J73M1j80qk4j58L22k30M2M90n81K99J56m60J67J81J56
2297B08r6k16J74q6J54K46j76m10N17k20K04k37j10N1j17L3K29m22p9M05l45K82
2319a1j25k3J46k05K43j12n4L41j71l53N65j97P4m2J0n5k5j81K97k58J19J05l96
2342c08J37K29n72L63J76q3J7k11M10p4l10N32j96l68M58j91n6J32J20J13m31
2363a13L76Q2j114P17N72p00L3L88l55L5%K90j92m09P29n12M6L13o5m71K64K87
2385B01k07k72M65j51p24O58M48q82N17L89m93k28N05M9p09N21L39l02o33Q97
2405C88k43p68R64j38o07K97O12n99j30L23J22j002P93P61j401L17P72k12p69
$$ plain form
2424 -520 251 499 -530 -197 711 -70 -884 623 241 -570 150 279 -283 -111 600 296 -1093 293 647
2443 647 -841 -225 707 -467 -345 698 366 -550 -230 648 -218 -511 680 -88 -691 453 421 -550 -11
2462 -11 638 -59 -750 622 406 -725 -15 532 -517 -518 541 48 -806 63 598 -633 -249 1136 -376
2481 -376 -734 737 388 -675 81 690 -449 -381 603 -33 -753 618 539 -726 -159 681 -254 -425 315
2500 315 46 -848 18 584 -588 -867 939 -285 -800 496 577 -792 -204 647 -279 -553 560 666
2518 666 -599 263 785 -617 -194 1081 225 -866 285 751 -641 -452 568 -376 -691 674 369
2535 369 -1087 -53 662 -445 -817 577 269 -478 281 811 -764 -201 786 -267 -499 419 289 -405
2553 -405 251 878 -530 -442 966 -122 -784 290 452 -495 -240 407 -573 -923 637 250 -879 -6
$$ packed form
2424e20P71K48j029L33R08p81q14J507l82q11P20J29n62J72P11l04j389J386L54
2443F47j488O16R32j174J22J043l32r16L20Q78q66k93J191p68o03J144l2r71N39
2462a1O49o97o91J372k16j131P10N47j049jJ059m93q54Q69N35j231L84J385j512
2481c76l58J471l49j063P56O09j139O8R84o36p20J371p9j265N67Q40r35j71P40
2500C15k69q94Q66N66j172k79J806j224n15J296Q1j369N88Q51r26k74J113J06
2518F66j265Q62N22j402M23J275q56j091J151M66j392J89J020r44l15J365l05
2535C69j456J034P15j107l72J394l08p47P59N30j575N63R87j053k32R18j30o94
2553d05O56O27j408Q8J408j088o62J074J62r47K55O47r80l50J560l87j129Q73
$$ plain form
2571 -6 796 -746 -302 496 -13 -573 504 521 -657 -181 902 -225 -815 564 221 -615 488 626 -202
2590 -202 -449 624 93 -754 406 608 -798 -64 572 -284 -503 228 196 -621 251 848 -223 -152 727
2609 727 -76 -635 355 390 -378 230 741 -124 -208 434 363 -843 90 473 -583 -213 616 109 -449 272
2629 272 286 -423 -308 710 -407 -520 563 -50 -467 314 382 -342 -258 528 119 -380 468 658 -193 -88
2649 -88 466 -61 -179 437 361 -511 -125 456 -327 -260 266 -168 -295 268 -31 -402 -189 264 -40 -301 -17
2670 -17 14 -237 156 289 -339 -114 309 -162 -444 80 374 -79 -90 440 -51 -415 340 189 -176 153 -31
2691 -31 50 -158 -83 -35 -611 209 79 4 -55 -59 -242 -393 -122 44 -196 -99 471 -259 -131 440 129 -198 83
2714 83 -21 -123 -123 13 58 -311 -235 73 -176 36 -36 -266 104 174 -138 -97 -152 200 -112 -72 212 -121 167
$$ packed form
2571fQ02j542M44P98n09n60J077J7j178M76J083j127n90J379l43q36J103J38q28
2590b02k47J073n31q47J160K02j406P34O36q56k19P31l2q17Q72N97j071P1Q79
2609G27q03n59R90L5p68O08N11q65q4O42p1j206R33L83j056L70Q29n07n58P21
2629B72J4p09J15J018j117j13J083o13m17P81O8p24Q4P86m09m99Q48J90q51J05
2649h8N54n27j18O16p6q72L86N81p83O7N26m34j27N63k99l71K13M53l04k61K84
2670a7L1k51L93J33o28K25M23m71k82N24K94m53j1N30m91l64P55j51l65L29j84
2691c1Q1k08P5M8n76Q20j30p5n9mj83j51K71J66k40R7N70p30J28N71l11l27K81
2714H3j04j02%J36M5l69P6L08k49K12p2k30L70P0l12M1n5L52l12M0K84l33K88
$$ plain form
2737 167 237 106 64 179 167 152 -67 123 12 -300 51 352 -378 35 205 -29 -151 51 -55 -88 -192 -186
2759 -186 74 -116 229 4 -326 0 -56 53 -8 251 205 -37 58 92 -18 246 225 -37 295 54 163 198
2781 198 -352 436 -102 -145 21 -139 -45 16 33 -144 -194 -64 47 -150 30 20 -221 123 -47 -51 269 247 345
2804 345 161 99 162 -63 -191 367 127 -77 190 -96 15 60 -92 -140 -114 -10 200 -229 140 134 -400 19
2826 19 -150 -145 113 78 -36 -57 -144 434 -302 -49 287 -226 59 213 -111 -138 -23 58 -109 -448 207 84 -448
2849 -448 278 236 -91 86 240 -87 -87 -61 113 -319 17 527 -228 -236 268 -146 -80 221 74 -159 -54 -61 -285
2872 -285 -263 541 340 -382 406 283 -338 -148 221 -105 -463 137 126 -364 4 362 -532 -101 425 -172 -425
2893 -425 225 294 -362 -49 347 22 -233 236 460 -607 120 133 -391 -27 117 19 -543 -50 320 -459 62
$$ packed form
2737A67P0j31m2J15j2j5k19J90j11l12L51L01p30M13J70k34j22K02j06l3j04O
2759a86K60j90L45k25l30L26n6J09o1K59m6k42R5L4j10K64k1k62L32k41J09L5
2781A98n50P88n38m3J66j60R4O1J7j77n0J30J11j97J80j0k41L44j70mL20k2R8
2804C45j84o2O3k25j28N58k40k04K67k86J11M5j52m8K6J04K10m29L69on34M19
2826A9j69NK58l5j14k1q7N78p36K53L36n13K85J54l24k7J15Q1j67l39O55j23n32
2849d48P26m2l27J77J54l27%K6J74m32L36N10p55qN04m14O6L01j47k33J05pk24
2872b85K2Q04k01p22P88j23o21J90L69l26l58O00j1m90L68L58q94M31N26n97k53
2893d25O50O9o56L13L96l25k55M69K24j067P27J3n24L64J44r8n62M93L70p79N21
$$ plain form
2914 62 613 -196 -392 320 -63 -227 -26 324 -145 -349 214 273 -562 337 453 -319 -158 479 178 -553 241
2935 241 338 -453 79 656 -352 -412 774 1 -526 105 296 -316 -444 562 -84 -632 330 399 -898 61
2955 61 597 -330 -385 551 445 -432 50 498 -515 -407 814 -72 -188 509 171 -570 78 554 -407 -705
2975 -705 383 210 -649 194 442 -556 -97 528 15 -667 76 911 -528 -217 468 -135 -407 618 -71
2994 -71 -706 309 546 -320 -408 775 22 -583 489 300 -676 -46 553 -444 -617 248 125 -518 -206 658
3014 658 -673 -446 988 -101 -604 355 311 -568 -36 517 -113 -708 646 15 -653 113 500 -485 -112
3033 -112 399 41 -431 156 522 -894 103 587 -399 -586 370 239 -496 233 358 -541 -407 465 130 -494
3053 -494 297 409 -495 43 688 -333 -234 680 233 -677 239 472 -742 -124 698 36 -312 374 136 -615
$$ packed form
2914F2N51q09j96P12l83j64K01L50m69k04N63N9q35Q99J16p72J61O37l01p31P94
2935B41R7p91N32N77j008o0J186p73n27O31J91o12j28J006o46n48R62O9j297R59
2955F1N36r27n5R36j06q77M82M48j013J08J221q86j16O97l38p41O48M76r61k98
2975g05J088j73q59Q43K48r98M59O25n13o82P43Q35j439L11O85o03k72J025o89
2994g1o35J015K37q66q8J183p53o05J072j89r76O30N99r97j73Q65j23o43L12Q64
3014F58j331K27J434j089n03R59m4q79N32N53o30n95J354o31o68P66L87r85L73
3033a12N11l58m72N87L66j416R97M84r86j87R56j31p35P29J25q99J34Q72l35o24
3053d94P91J12r04N38O45j021R9R14m47r10R16K33j214O18Q22o62l48O86k38p51
$$ plain form
3073 -615 -45 312 -26 -351 306 333 -756 310 379 -65 -174 85 44 -587 397 486 -572 -65 380 -244
3093 -244 -622 258 45 -397 -17 340 -465 -237 525 -231 -522 264 177 -604 91 250 92 -282 94 330
3113 330 -335 39 562 -241 -135 419 -251 -333 457 438 -417 -83 219 -40 -229 346 242 -515 83 318 -291
3134 -291 -162 71 -144 -337 242 231 -173 61 400 -232 -392 364 256 -119 88 207 -316 -262 20 -281 -386
3155 -386 258 144 -385 -212 197 -51 -59 482 158 -185 -245 318 -244 -149 342 -356 -393 -222 259 86 -115 374
3177 374 90 -221 -148 77 -318 174 265 74 -26 220 108 -293 49 337 -321 -47 168 -218 -201 165 -2
3198 -2 -3 -195 239 -296 -117 157 -48 -215 -355 65 73 -11 189 79 -142 -175 -12 -403 -67 188 33 244 176
3221 176 -71 9 171 -15 -11 -153 56 -61 -113 191 -30 -120 -66 125 -138 -101 -142 250 -69 20 414 119 -56
$$ packed form
3073f15N70L57l38l25O57K7j089J066O9m44j09K59m1o31R84Q9j058N07M45o24
3093b44l78Q80k13m42L80L57q05K28P62p56k91P86q7p81O95J59j58l74L76K36
3113C30o65L74N23q03J06N54o70q2P90j9q55L34L02k59j89N75j04p57N98K35o09
3134b91J29K33k15j93N79j1m04K34L39o32j60P56j08l75K07J19n23N4K82l01j05
3155c86O44j14n29J73M09k48qN41l24l43o0N63n62R5M91o98l7J71M81j73k01M89
3177C74k84l11P3K25l95M92R1j91j00K46j12m01L42K88o58K74K15l86J7L66j67
3198bjj92M34n35J79K74k05j67j40M20Qq4K00j10k21l3J63l91L36K55j55K11o8
3221A76k47Q0J62j86Mj42K09j17n2L04k21r0N4J91k63L7m1L92l19Q9L94k95j75
$$ plain form
3244 -56 63 -89 -199 250 -287 88 199 10 50 -96 -102 35 -429 77 177 167 72 -323 -56 -61 -16 353 -228
3267 -228 -27 166 -91 39 34 -90 15 -269 98 -135 -202 -93 84 -243 431 -62 -288 55 -211 -76 83
3288 83 140 -143 -223 182 85 16 -185 72 -134 -335 167 8 131 -156 -132 24 -21 175 31 62 -62 -37 -34 -69
3312 -69 91 -184 -84 -109 6 -252 -1 1 -241 -189 -80 -111 -44 27 151 -192 -129 240 67 -157 334 191 15
3335 15 176 83 -50 84 -181 281 -263 188 366 -153 -1 166 -179 -96 -81 1 1 -8 -27 95 -147 390 406 -148
3359 -148 424 1 -180 -5 -30 251 -119 -3 244 -86 193 172 -361 -143 250 121 -222 0 203 -185 -158
3380 -158 290 -160 -225 58 -71 -164 23 -105 112 -41 248 -61 -244 228 275 30 -67 399 48 -180 381
3401 381 248 -16 267 310 -243 -366 416 -162 -381 245 38 -248 -254 22 -198 -570 165 334 -297 -89 323
$$ packed form
3244e6J19j52j10M49n37L75J11j89M0j46oJ37m64N06J00j0r5l95K67nM5L69n81
3267b28K01J93k57J30nj24J05k84L67k33o7J09J77l27O74m93k26L43k66J35J59
3288H3N7k83q0M05r7o9k01K57k06k01N02j59J23k87K4J56m5J96j44L1j24K5Ll5
3312f9J60k75J00k5J15k58K51Kk42N2J09l1O7P1J24l43O3L69j73k24M91j43j76
3335A5J61r3j33J34k65M62n44M51J78n19J52J67l45Q3J5Q2%rj9J22k42N37J6n54
3359a48N72m23j81J75k5K81l70J16K47l30K79k1n33K18L93j29l43K22K03l88K7
3380a58M48m50o5K83j29r3J87j28K17j53K89l09j83M72M7k45r7M66l51k28N61
3401C81j33k64K83M3n53j23P82n78k19O26k07k86oK76k20l72P35J69o31K08M12
$$ plain form
3422 323 -188 166 351 25 2 94 274 -319 -258 391 -209 -263 302 -136 -463 76 287 25 -61 72 138 -191
3444 -191 137 190 -650 199 432 -105 -333 169 122 -292 -38 174 -226 -187 581 -139 -286 549 326 -166 172
3465 172 537 -133 -611 276 170 -446 39 386 -233 -170 479 8 -552 175 201 -290 -216 720 -252 -556 619
3486 619 111 -561 25 305 -221 -307 380 29 -575 -71 348 -467 -15 242 -528 -267 275 -165 -363 -64
3506 -64 139 -236 -440 637 -70 -365 286 374 -318 -228 213 -189 -378 464 38 -484 95 267 -383 -327 -99
3527 -99 -167 -275 44 230 -177 -50 439 -30 12 305 -125 -652 158 -38 -11 -85 -77 109 -412 118 254 -373
3549 -373 4 408 -223 -22 249 149 -322 269 197 -112 -167 480 -20 -372 56 -58 -422 97 166 3 -454
3570 -454 162 -125 -411 109 238 -254 -243 312 18 -160 293 175 134 -308 245 -80 -113 374 -238 -292 141
$$ packed form
3422C23n11L54J85l26k3R2J80n93O1O49o00n4N65m38l27N39K11k62q6J33O6l29
3444a91L28N3q40Q49K33n37k28N02m7m14K54K12m00L9P68p20j47Q35k23m92L38
3465A72L65o70m78Q87j06o16M85L47o19O3O49m71n60P27K6m91P4R36r72l04J175
3486F19n08o72N86K80n26q6O87l51o04N04M19q15M52K57p70K61N42m40j98K99
3506f4K03l75k04J077p07k95O51Q8o92R0M41m02j89Q42m26n22N79J72o50N6K28
3527i9o8j08L19J86m07J27M89m69M2K93m30n27Q10j96K7p4QJ86n21N30J36o27
3549c73L77M04o31K01K71j00m71N91p2l09n5O47n00l52M28j14l64N19O9j63m57
3570d54O16k87k86N20J29m92J1N55k94j78M53j18m1m42N53l25l3M87o12n4M33
$$ plain form
3591 141 131 164 -120 177 142 -419 -19 343 -169 -183 194 -9 -383 158 201 -80 -116 158 -239 -326 272 -240
3613 -240 -298 33 233 -129 -254 325 -146 -368 165 59 20 199 431 -36 -237 -50 -82 -44 65 98 -108 -119
3635 -119 96 -201 -58 179 186 -217 -64 121 351 38 69 137 -142 207 18 -401 -47 197 -110 96 -112
3656 -112 151 -25 -1 283 15 -132 199 26 -4 28 44 -156 94 181 171 -343 60 301 -98 -108 189 -320
3678 -320 -45 -71 -79 -122 53 330 21 85 389 107 -136 256 -208 -200 -21 174 -159 -18 -38 201 61 -142 230
3701 230 -14 25 264 -116 -128 37 -66 -10 -157 -6 -1 -112 180 -87 -49 79 -56 279 194 -33 138 164 59
3724 59 58 -244 76 329 -224 -106 137 -165 74 -155 -30 -242 -123 150 47 -92 -124 76 121 200 -94 -111
3746 -111 -50 -219 164 -181 49 -189 -222 -125 -131 -110 318 -53 -127 118 -77 103 -106 -6 289 -140 -41 27 102
$$ packed form
3591A41j0L3k84K97l5n61M00L62n12j4L77k03l74N41M3k81l6K74l97q7N98n12
3613b40n8L31K00l62j25N79m71k22N33j06l9J79K32m67k01J87l2L8J09L3k06j1
3635a19K15k97J43K37Pm03J53J85K30l13L1O8k79L49j89m19L54K44l07K06k08
3656a12K63j76K4K84k68j47L31j73l0L2J6k00K50Q7j0n14M03K41l99j0K97n09
3678c20K75k6qm3J75K77l09O4L04k82k43L92m64QJ79J95l33J41k0K39j40k03L72
3701B30k44L9K39l80j2J65j03N6j47J51Nj11K92k67L8J28j35L35q5k27J71K6j05
3724E9jl02L20K53n53J18K43l02K39k29J25k12J19K73j03j39l2K00M5P9k94j7
3746a11O1j69L83l45K30k38l3R7oK1M28l71p4K45j95J80k09J00K95m29R9O8P5
$$ plain form
3769 102 191 153 -128 -140 -107 -452 -69 -42 -275 25 -106 75 -168 -321 -36 -184 144 -118 -34 193 -120 27
3791 27 178 -57 -30 -137 -131 -11 -208 248 217 -238 -86 177 -356 -5 -60 -23 68 -70 114 166 -43 30 15 25
3815 25 190 -275 -46 130 51 117 -100 -77 98 64 173 -7 -59 -74 -259 157 -166 74 179 47 17 38 -127
3838 -127 -50 151 -72 92 366 105 -128 270 44 175 -160 -175 -2 -184 113 89 -135 -183 153 11 -4 63
3860 63 262 -222 -221 119 -67 -98 161 -137 117 -108 77 -234 -156 14 189 -308 49 -16 -111 -98 118 -244 -141
3883 -141 249 -5 -254 74 51 -314 -98 347 118 -195 189 -143 -238 87 29 131 -248 61 -26 -292 166
3904 166 294 -292 25 -30 -216 -102 -147 364 -111 138 155 -274 -162 159 -23 -287 177 440 -24 -41 79
3925 79 -9 -318 198 227 -264 209 137 -321 -164 -76 100 -62 95 81 -209 -291 80 66 -253 127 6 -363 3
$$ packed form
3769A02Q9l8k81j2L3l45L83K7k33L00j31J81k43j53K85j48L28k62Q4K27l13J47
3791B7J51k35K7j07OJ20j97M56l1m55J52K63n33L51n5L7R1j38J84N2k09P3j5J0
3815B5J65m65K29J76p9O6k17K3J75l4J09j80n2j5j85M16l23K40J05j32l0K1j65
3838a27P7K01k23J64K74k61k33L98k26J31l35j5J73j82K97k4k24m8L36j42j5O7
3860F3J99m84JL40j86l1K59k98K54k25J85l11P8J70J75m97L57o5r5J3K16l62J03
3883a41L90k54k49L28k3l65K16M45k29l13L84l32r5L25n8J02l79L09q7k66M58
3904A66J28n86L17n5j86J14m5N11m75K49J7m29J12L21j82k64M64K63m64j7J20
3925G9q8l09N16K9m91M73p2m58J57Q8J76j62J57j4k90q2L71j4l19L80j21l69L66
$$ plain form
3948 3 348 -262 -192 128 271 -286 -31 283 -138 -314 238 -28 -315 255 370 -408 -59 271 107 -150 153
3969 153 -158 -241 27 392 -210 -306 377 -67 -529 216 108 -414 154 308 -103 -255 344 -50 -414 -35 305
3990 305 -213 22 100 -114 -265 98 125 -381 -68 -45 -16 -316 286 37 -230 -72 217 -411 -116 204 178 -353
4012 -353 -85 444 -233 -165 244 -233 -258 129 322 -352 -54 47 -67 -178 98 -38 -484 -111 130 -44 23
4033 23 277 -198 -141 -192 -139 -322 32 109 -315 -117 152 -85 -49 473 120 -160 296 100 -36 -134 113 333
4055 333 -310 211 200 -94 -41 326 17 -356 157 118 -132 -161 298 -13 -194 109 261 -306 -91 205 99
4076 99 -42 258 234 -143 -77 -116 -287 133 426 -194 -78 77 166 -90 -35 49 -220 -139 329 -235 -322 23 -6
4099 -6 -152 78 349 29 -98 158 197 -250 101 -30 -112 -198 -56 31 -395 120 462 -6 -72 210 -126 -242
$$ packed form
3948CL45o10P0L20J43n57K55L14m21j76N52k66k87N70J15p78L49L30j64k57L03
3969A53l11q3K68L65o02r6O83m44m62P45j08n22N68J54m11j52N99l94l64L79L40
3990C05n18K35P8k14j51L63K7n06L13K3K9l00O02k49k67J58K89o28K95L20k6n31
4012c53K68N29o77O8M09m77k5L87J93o74K98J01j14j11K76j36m46L73K41j74O7
4033B3K54m75N7n1N3j83L54P7m24J98K69k37L6N22l53k80M56j96j36r8K47K20
4055C33o43N21j1k94N3L67l09l73N13l9k50k9M59l11j81L03J52n67K15K96j06
4076I9j41L00k4l77O6l9j71M20K93o20J16J55Q9k56N5Q4k69Q1M68n64q7L45k9
4099fj46K30K71l20j27K56L9m47L51j31q2q6J42Q7m26N15L42m68o6K82l36j16
$$ plain form
4121 -242 143 -145 -310 133 117 119 -214 194 468 -80 203 327 -163 55 51 -75 -264 -146 176 -73 118 209
4143 209 -45 -19 177 151 -215 97 67 195 -68 -245 -17 -312 -9 -314 -309 354 39 69 174 -10 -42 -165
4165 -165 225 426 61 -17 103 -134 -48 -33 82 32 194 -77 -101 -253 181 102 -12 87 77 -236 76 -22 153
4188 153 -248 -77 40 -243 203 219 -175 175 117 -66 31 176 64 -197 58 238 309 -75 194 110 -93 -157
4210 -157 58 -74 59 -124 437 15 180 160 -30 -114 -58 24 -193 63 190 -68 -126 -30 121 85 3 102 -218
4233 -218 -70 117 -131 61 150 -42 -16 -199 198 -13 -159 167 -236 58 131 140 -141 -99 99 259 74 19
4255 19 34 -83 -98 182 104 65 64 -154 131 -225 159 87 26 97 64 -16 -9 -146 -292 153 -51 28 -76 98 142
4280 142 -43 -140 107 -154 -63 77 -118 -16 -102 -5 -180 -119 68 -173 -168 143 -99 -211 135 206 -193 164 -337
$$ packed form
4121b42L85k88j65M43j6Kl33M08K74n48K83J24m90K18mj26j89J18L22k49J91R1
4143B09k54K6J96k6l66L12l0J28k63j77K28k95L03l05NO63l15L0J05j84l2j23
4165a65L90K01l65p8J20k37Q6J5J15n0J62k71k4j52M34p9j14R9j0l13L12r8J75
4188A53m01J71J17k83M46J6l94L50n8j83R7J45j12k61K55J80P1l84K69q4k03o4
4210a57K15j32J33j83N61m22J65k0j90q4N6Q2k17K56J27k58n8R6J51l6q2R9l20
4233b18J48J87k48J92Q9j92K6j83L97k11j46L26m03K94P3Rk81M2J98J60j85n5
4255A9J5j17j5K80p8l9jk18K85l56L84p2o1P1l3q0Pj37j46M45k04P9j04J74M4
4280A42j85r7K47k61R1J40j95J02q6R7j75O1J87k41NL11k42j12L46P1l99L57n01
$$ plain form
4303 -337 -292 -10 251 88 -328 22 58 24 -29 -69 -247 36 -132 17 -85 264 289 -86 -268 -18 41 -242
4325 -242 -185 -148 158 236 -39 -90 -175 193 161 -220 169 -63 -158 128 -38 -45 -27 131 -168 -25 3 236 -39 -18
4349 -18 122 -201 -1 150 -9 -97 -322 57 53 -315 106 -50 -362 76 359 -136 -104 155 -263 -32 143 -112
4371 -112 -38 -125 148 -202 -278 24 -116 -265 -80 -138 -152 46 127 43 15 220 125 -26 71 20 -302 -100 60 33
4395 33 -138 96 -24 62 -150 250 39 331 89 208 -103 -213 181 -72 -204 191 -3 -448 55 -58 -192
4416 -192 -228 21 -74 -419 26 187 -343 -176 9 -326 -219 271 65 -210 169 195 112 -126 465 24 -304
4437 -304 204 -22 -112 46 214 -184 -164 -2 214 -474 39 251 -60 25 321 177 -344 -135 235 -89 -380
4458 -380 320 -278 -28 362 -23 -309 222 254 -351 -194 202 -34 -368 125 99 -334 276 243 -58 -34 208
$$ packed form
4303c37M5K82K61j63m16L50L6l4n3m0j78K83j68J49j02L49K5l75j82K50N9k83
4325b42N7L7L06P8k75n1q5L68l2l81L89k32r5K86j66pJ8J58k99J43K8K33k75K1
4349a8J40l23K00J51j59q8k25L79ml68M21j56l12M38K83m95L2K59m18K31J75k55
4371a12P4q7K73l50p6L02j40j49J85n8j4J98Q1q4k8K05r5j51R7n1l22K02J60k7
4395C3j71K34j20Q6k12M00k11K92k42J19l11j10L94k53j32L95j94m45N03j13j34
4416a92l6K49r5l45M45J61n30J67J85l35J07M90k06k75L79K6q3k38N91m41l28
4437c04N08k26r0J58J68l98K0J62K16o88N13K12l11Q5K96j44n21K09L70l24k91
4458c80P00n98K50L90l85k86N31L2o05J57L96k36l34M93k6m33O10l3l01K4K42
$$ plain form
4479 208 30 -29 45 85 108 -214 82 -5 -118 19 107 -99 180 277 -198 65 277 71 -136 307 180 -324
4501 -324 -34 467 -29 75 130 228 -2 -96 347 -68 -56 338 147 -227 74 290 -197 -10 90 145 -249 21
4523 21 -42 -92 -193 315 154 -460 289 -128 -278 -88 245 -145 -152 386 -44 -318 227 99 -91 -58 268 125
4545 125 -78 360 -58 -254 -21 -18 -93 7 166 -214 -483 195 -205 -98 -55 299 -65 -497 322 -44 -151
4566 -151 0 -38 -89 -61 168 10 -244 -79 95 -323 -109 200 -208 -184 265 -89 -23 194 280 -94 -146 72
4588 72 -12 -359 120 -40 -25 34 201 -99 -70 349 173 -216 -42 135 -205 211 302 -267 25 -5 275 -94
4610 -94 -34 2 36 -77 147 138 -34 80 199 -120 -39 183 71 -188 136 20 56 -356 228 -290 -50 238 -98
4633 -98 -193 -27 0 -81 -15 -97 -121 89 -97 183 -147 -10 220 -5 107 -29 0 -503 222 223 -25 101 142 18
$$ packed form
4479B08j78n9P4M0K3l22K96q7j13J37Q8k06K79R7m75K63K12k06k07M43j27n04
4501c24K90N01m96J04N5R8k30r4M43m15J2L94j91l74L01K16m87J87J00N5l94K70
4523B1o3n0j01N08j61o14P49m17j50J90L33l90pN38m30k74N45j28j90L3L26j43
4545A25k03M38m18j96K33Lp5J00J59l80k69O78m00J07M3L54l64m32Q19l66j07
4566a51J51l8n1K8K29j58k54J65J74m18K14L09m08K4M49l54O6K17Q6l74n2K18
4588G2q4l47M79j60J5N9J67l00K9M19j76l89J74J77l40M16R1n69K92l0K80l69
4610i4O0L6L4j13K24rj72J14J19l19Q1K22j12k59L24j16L6m12N84n18K40K88l36
4633i8r5J66K7q1O6q2k4K10j86K80l30J37K30k25J12j36K9n03P25Jk48J26M1j24
$$ plain form
4657 18 -76 7 76 -33 15 442 263 -40 -159 -74 -119 -34 -171 58 4 272 -36 -174 88 -14 85 79 -116 -10
4681 -10 -109 -23 201 -48 156 221 186 -111 180 -145 -151 298 128 -417 -214 117 4 84 -3 -29 -229 163 66 -161
4705 -161 59 -14 115 -284 -77 55 -223 -93 -16 -62 -63 -136 -227 -286 112 37 41 -143 -8 -40 -187 70 -9 -282
4729 -282 10 -33 220 8 18 -147 -1 -89 129 367 78 21 -76 -112 211 28 49 -350 -99 -68 72 204 76
4752 76 102 -105 5 -59 164 11 -270 -48 -21 -54 158 -75 179 48 -415 111 -79 -232 -88 209 -137 -68
4774 -68 126 30 -6 12 407 -353 143 -108 -24 35 142 84 -39 -174 -44 -275 41 128 30 -39 57 96 166 14
4798 14 -91 -56 59 186 192 -158 51 128 -89 184 -244 21 -79 -189 -22 -42 -132 329 14 -85 271 2 -79
4821 -79 232 -294 -148 -117 63 110 -1 26 -7 -39 91 344 -59 -54 47 59 -87 -89 87 -156 -8 -41 51 -83
$$ packed form
4657A8r4Q3O9j09M8M27j79l03j19Q5m5Q5j37K29n4K68l08j38K62j02R9oj95J06
4681a0r9Q6K24k49K04O5l5k97K91l25oM49j70n45K03L31j13Q0q7k6k00L92r7k27
4705a61K20p3J29l99K07J32k78J30P7m6jp3r1n9L98p5Mj84J35l2j47K57p9k73
4729b82K92m3K53k12J0j65J46q8K18K38k89n7r7l6L23j83K1l99K51L1J40J32j28
4752G6K6k07J10o4K23j53k81K22K7l3K12k33K54j31m63N26j90j53J44K97l46O9
4774f8J94r6l6J8L95p60M96k51Q4N9J07n8j23j35J30k31L16Q7r8o9R6L9P0j52
4798A4j05L5J15J27Ol50K09P7k17K73m28K65j00j10J67k0r0M61l15r9L56k69q1
4821g9L11n26J46L1J80M7j11K7l3l2J30K53m03NJ01J2j46kJ76k43J48l3R2j34
$$ plain form
4845 -83 191 256 -110 -190 52 -343 -62 61 99 -176 203 348 -140 -59 40 262 -164 20 9 -120 -196 218 -94
4868 -94 335 63 -1 -52 -77 -172 -96 -135 -102 -23 25 22 -58 -70 65 -286 -50 114 149 331 -410 10 47 -80 155
4893 155 26 -200 -115 -104 -19 -275 88 256 170 -238 -14 -17 -34 -8 273 -257 71 -170 81 -114 -65 -2 -89 -13
4917 -13 44 -260 -118 241 -190 47 -154 357 12 204 98 -4 -398 9 27 -158 47 139 -128 -246 70
4938 70 69 176 -107 -58 -139 4 -142 -212 -310 -44 -114 -305 4 82 -252 -372 -2 -37 -245 250 172 -93 -27 113
4962 113 -30 -155 -78 21 36 2 156 -433 248 103 113 -257 219 -44 -56 168 197 -33 -43 51 -68 -267 -19
4985 -19 -216 -145 -15 -195 -128 -259 158 150 -153 -229 23 164 18 90 23 85 12 -39 -9 -65 -15 46 -191 -15 20
5010 20 -198 142 102 -65 -62 102 189 43 94 71 -112 -161 88 -87 -16 127 247 -111 89 7 66 -324 133 -57
$$ packed form
4845h3K74O5l66q0K42l95K81J23L8k75L79J45m88Q1R9K22m26J84j1j29p6M14l12
4868i4M29k72o4n1k5r5P6l9L3P9M8lq0j2J35l51K36J64L5J82p41M20L7j27K35
4893A55j29k26Q5J1Q5k56L63J68q6m08K24lj7K6K81n30L28k41K51j95M9O3q7P6
4917a3N7l04J42L59m31K37k01N11l45J92j06j02l94M07J8j85K05R2k67j18L16
4938G0jJ07k83M9q1J43j46p0r8K66p0j91L09P8l34j20L70l5k08M95p8k65O6J40
4962A13j43j25P7R9J5l4J54n89O81j45J0l70M76k63j2K24K9k30j0R4j19j99K48
4985a9j97P1J30j80O7j31M17ql03p6K52J41j46P2o7O2p3n1L0n6N0O1k37J76L5
5010B0k18L40m0j67LJ64Q7j46N1k3j83m9K49j75P1J43J20l58K00q2N9l90M57j90
$$ plain form
5034 -57 -289 -204 91 88 -135 199 199 103 62 169 85 142 136 -275 -449 150 -63 -390 131 44 12 -247 205 250 -137
5059 -137 161 -31 6 -185 304 -98 -61 -49 66 -142 50 57 -156 -145 260 185 149 141 -35 -125 -250 242 43 -34
5083 -34 170 42 88 -45 -21 -66 -12 204 -160 -68 297 232 -86 -8 -73 110 -91 127 -174 -189 69 -149 -111 -72
5107 -72 -32 1 -109 -49 20 121 -101 163 -41 -5 -7 59 -7 -119 -71 -156 66 262 214 114 -193 123 196 -95 -102
5132 -102 -44 32 98 48 -169 -16 21 -94 -158 10 -33 92 -173 218 15 -27 127 -74 -43 -145 -29 -211 113
5155 113 -50 -221 -100 -5 183 38 213 -158 -118 -65 76 140 -65 -20 -2 -55 56 138 -142 86 -62 41 -134
5178 -134 -24 -256 2 -192 44 129 138 87 -76 -92 292 351 -214 22 -85 342 -165 -240 -3 -48 48 -113 76
5201 76 -20 -26 -155 13 -35 223 -87 197 -43 119 68 -55 -94 -212 -1 -178 22 -77 -204 73 328 24 62
$$ packed form
5034e7k32Q5K95lk23L34%r6m1J07q4N7om11j74N99k13l27N21q7l2k59M52M5l87
5059a37K98j92L7j91M89m02L7J2J15k08J92Pk13J1M05p5l6qj76r0j25M92j99p7
5083c4K04j28M6j33K4m5N4K16l64R2L65o5l18P8o5J83k01K18l01j5K58k18L8L9
5107g2M0L3j10O0O9J01k22K64k04L6kO6o6j12M8q5K22J96m8j00l07L16P3k91p
5132a02N8P6O6n0k17J53L7j15o4J68m3J25k65L91k03m2J54k01L1j02J16j82L24
5155A13j63j71J21R5J88j45J75l71M0N3J41O4k05M5J8n3J11Q2k80K28j48J03j75
5178a34J10k32K58j94K36Q5Rn1j63j6L84N9n65K36j07M27n07p5K37m5R6j61J89
5201G6r6oj29J68m8K58l10K84k40J62n1j23l9j18K11j77K00r9j27K77K55l04L8
$$ plain form
5224 62 -65 -155 42 -65 -55 -70 176 188 120 243 -102 60 24 -115 51 -24 1 -60 78 -191 -46 -94 -38 69
5248 69 162 46 44 91 -9 -170 -258 130 -195 -4 -13 -138 20 -91 -138 136 108 -84 -5 65 38 9 -100 -56 -51 -120
5274 -120 26 196 -192 -77 302 -167 65 129 104 -261 118 2 116 -41 178 -96 -34 73 -168 130 -171
5295 -171 -22 -101 -27 283 98 170 285 -155 -123 -71 200 250 -221 -66 131 237 329 -109 48 177 -109 -51 71
5318 71 -36 -139 24 88 51 73 -85 -85 -81 27 167 256 -23 -176 54 59 -220 -76 -143 -183 -5 23 -16 100 -130
5343 -130 166 -110 -84 -206 -51 36 178 -44 114 72 -49 -279 -172 236 -29 115 213 -113 -2 -184 -172 -55
5365 -55 -164 210 -12 -35 59 13 -53 -11 140 -306 300 -147 214 -193 -12 123 51 158 22 19 -3 119 -86
5388 -86 -11 -11 189 -174 -29 -30 173 -111 100 -37 100 33 11 4 -149 174 -56 -203 39 180 137 179 -28 35
$$ packed form
5224F2j27r0J97j07J0j5K46J2o8J23l45J62l6j39J66p5K5o1J38k69J45m8N6J07
5248F9R3j16kM7j00j61q8L88l25J91rj25J58j11m7K74k8j92P9P0k7k9j09M4No9
5274a20J46J70l88J15L79m69K32O4k5l65L79j16J14j57K19k74O2J07k41K98l01
5295a71J49p9P4L10j85P2J15m40L2N2K71N0m71J55J97J06R2m38J57J29k86N8J22
5318G1j07j03J63O4l7K2j58%MJ08J40Q9k79j53K30Nk79J44o7m0J78K8l9J16k30
5343a30K96k76K6j22J55Q7J42k22J58m2j21k30J07M08k65J44R8l26J11j82J2J17
5365e5j09L74k22k3R4m6o6M2J51m46O06m47L61m07J81J35p2J07j36lk2J22k05
5388h6P5%K00l63J45jK03k84K11j37J37o7k2pj53L23k30j47K42J41m3M2k07O3
$$ plain form
5412 35 -97 20 -52 -181 -53 113 -98 -184 3 174 -92 -152 -110 -45 7 180 -56 -111 79 -33 -23 69 -7 -97
5436 -97 -17 111 -13 -133 101 16 27 -29 -141 247 -91 -19 148 -336 -53 227 -97 -75 208 35 -100 -22 54
5459 54 52 -217 -54 -21 85 72 29 13 138 156 152 -59 -54 113 -163 46 157 -96 117 1 -63 -60 168 -60 106
5484 106 -219 249 240 -150 185 -51 130 286 -83 161 -17 118 -148 -148 14 -42 -90 161 239 72 60 -154 -64
5507 -64 88 25 154 -1 213 -1 -76 -154 6 278 -169 -4 120 50 83 110 103 184 157 155 -39 46 -146 -324 -50
5532 -50 56 169 -47 64 154 174 105 3 41 -82 95 120 75 151 80 177 72 -92 185 -82 95 98 51 61 -134
5557 -134 40 216 -109 -226 -19 94 41 79 -81 -90 -74 -200 396 177 89 95 -261 -106 -2 -87 150 67 80 -276
5581 -276 97 -24 178 94 97 -25 39 -136 -80 75 -181 -302 142 225 28 -244 181 -21 185 -466 110 -101
$$ packed form
5412C5j32J17p2j29J28J66k11q6J87J71k66o0M2O5N2J73k36n5J90j12J0R2p6r0
5436i7Q0J28j24j20K34q5J1n6j12L88l38P2J67m84K83K80l24K2K83j73j35P8P6
5459E4kk69J63L3J06j3m3j6J25J8mk11NJ67k76K09J11k53K13j16o4LK28k28J66
5484A06l25M68rl90L35k36J81J56l69K44j78J35k66%J62n6m8K51P8j67j2k14R0
5507f4J52o3J29j55K14k14p5p8J60K72m47J65J24p0L3K7pQ1k7kj94Q5j92j78K74
5532e0J06J13k16J11R0K0o9j02L8j23J77K5m5P6p1R7j05j64K77k67J77Lm7J0j95
5557a34J74J76l25j17K07J13n3L8j60rJ6j26N96k19q8Ol56J55J04q5K37q3J3l56
5581b76L73j21K02q4Lj22O4j75N6J55k56j21M44Q3j97k72M25k02K06o51N76k11
$$ plain form
5603 -101 -112 342 -217 179 -188 -113 17 -85 104 -403 249 63 230 -97 -58 -29 132 11 234 -35 36 49
5625 49 -142 18 205 -313 -230 -5 -94 -243 52 -29 233 9 -12 -7 -249 14 123 37 -68 -15 63 -5 -21 -102
5649 -102 187 -69 18 106 72 -79 184 -182 -93 74 -103 198 -91 317 -194 215 213 84 60 -138 -202 -14 -91
$$ packed form
5603a01j1M54n59L96l67P5J30j02J89n07O52j86J67l27L9K9J61j21K23k69P1J3
5625D9j91J60J87n18Q3K25q9j49K95q1K62k24k1Nk42K63J09q6j05N3P8o8j6q1
5649a02K89k56Q7Q8l4j51K63l66Q9J67j77L01k89M08n11M09kj29k4j98o4J88p7
$$ [...]
8191A82
##END NTUPLES=NMR FID
##END=
