##TITLE=1H_Pr T-150
 CDCl3
 8 sc, 
 15.12.2021
##JCAMPDX= 6.0         $$ Bruker NMR JCAMP-DX V2.0
##DATA TYPE= NMR FID
##DATA CLASS= NTUPLES
##ORIGIN= UXNMR, Bruker Analytische Messtechnik GmbH
##OWNER= root
$$ XWIN-NMR		Version 3.5
$$ Wed Dec 15 11:38:59 2021 Russian Standard Time (UT+4h)  she@DPX200
##.OBSERVE FREQUENCY= 200.131346
##.OBSERVE NUCLEUS= ^1H
##.DELAY= (6, 6)
##.ACQUISITION MODE= SIMULTANEOUS
##.ACQUISITION SCHEME= undefined
##.AVERAGES= 8
##.DIGITISER RES= 18
##SPECTROMETER/DATA SYSTEM= spect
##.PULSE SEQUENCE= zg30
##.SOLVENT NAME= CDCl3
##.SHIFT REFERENCE= (INTERNAL, CDCl3, 0, 15.7039)
##AUDIT TRAIL= $$ (NUMBER, WHEN, WHO, WHERE, WHAT)
$$ ##TITLE= Audit trail, XWIN-NMR		Version 3.5
$$ ##JCAMPDX= 5.01
$$ ##ORIGIN= Bruker BioSpin GmbH
$$ ##OWNER= she
$$ F:/spectra/data/she/nmr/H-F/1/audita.txt
$$ ##AUDIT TRAIL=  $$ (NUMBER, WHEN, WHO, WHERE, WHAT)
(   1,<2021-12-15 11:37:31.56 +0400>,<she>,<DPX200>,
      <created by zg, POWCHK disabled, PULCHK disabled
       configuration hash MD5:
       00 E9 B6 7A A2 85 ED C7 34 08 36 98 17 FE 4E 26
       data hash MD5: 16K
       4A 83 1B 56 F8 45 16 A7 BC DE 5F 80 E7 2B 7D AD>)
$$ ##END=
$$ 
$$ hash MD5
$$ C8 3A 6B 37 F4 D1 12 52 31 AC 4D F5 54 C1 73 25
##$RELAX= 
##$RELAX= 
##$RELAX= 
##$RELAX= 
##$RELAX= 
##$RELAX= 
$$ Bruker specific parameters
$$ --------------------------
##$DU= <F:/spectra>
##$EXPNO= 1
##$NAME= <H-F>
##$PROCNO= 1
##$TYPE= <nmr>
##$USER= <she>
##$AMP= (0..31)
100 100 100 100 100 100 100 100 100 100 100 100 100 100 100 100 100 100 
100 100 100 100 100 100 100 100 100 100 100 100 100 100 
##$AQSEQ= 0
##$AQ_mod= 1
##$AUNM= <au_zg>
##$AUTOPOS= <>
##$BF1= 200.13
##$BF2= 200.13
##$BF3= 200.13
##$BF4= 200.13
##$BF5= 200.13
##$BF6= 200.13
##$BF7= 200.13
##$BF8= 200.13
##$BYTORDA= 1
##$CFDGTYP= 0
##$CFRGTYP= 5
##$CHEMSTR= <none>
##$CNST= (0..31)
1 1 145 1 1 1 1 1 1 1 1 1 1 1 1 1 1 1 1 1 1 1 1 1 1 1 1 1 1 1 1 1 
##$CPDPRG= <>
##$CPDPRG1= <>
##$CPDPRG2= <>
##$CPDPRG3= <>
##$CPDPRG4= <mlev>
##$CPDPRG5= <mlev>
##$CPDPRG6= <mlev>
##$CPDPRG7= <mlev>
##$CPDPRG8= <mlev>
##$CPDPRGB= <>
##$CPDPRGT= <>
##$D= (0..31)
0 1.2 0 0 0 0 0 0 0 0.06 0 0.03 0 0 0 0 0.0002 0 0 0 0 0 0 0 0 0 0 0 0 
0 0 0 
##$DATE= 1639553851
##$DBL= (0..7)
120 120 120 120 120 120 120 120 
##$DBP= (0..7)
150 150 150 150 150 150 150 150 
##$DBP07= 0
##$DBPNAM0= <>
##$DBPNAM1= <>
##$DBPNAM2= <>
##$DBPNAM3= <>
##$DBPNAM4= <>
##$DBPNAM5= <>
##$DBPNAM6= <>
##$DBPNAM7= <>
##$DBPOAL= (0..7)
0.5 0.5 0.5 0.5 0.5 0.5 0.5 0.5 
##$DBPOFFS= (0..7)
0 0 0 0 0 0 0 0 
##$DE= 6
##$DECBNUC= <off>
##$DECIM= 32
##$DECNUC= <off>
##$DECSTAT= 4
##$DIGMOD= 1
##$DIGTYP= 9
##$DL= (0..7)
0 120 120 120 120 120 120 120 
##$DP= (0..7)
150 150 150 150 150 150 150 150 
##$DP07= 0
##$DPNAME0= <>
##$DPNAME1= <>
##$DPNAME2= <>
##$DPNAME3= <>
##$DPNAME4= <>
##$DPNAME5= <>
##$DPNAME6= <>
##$DPNAME7= <>
##$DPOAL= (0..7)
0.5 0.5 0.5 0.5 0.5 0.5 0.5 0.5 
##$DPOFFS= (0..7)
0 0 0 0 0 0 0 0 
##$DQDMODE= 0
##$DR= 18
##$DS= 0
##$DSLIST= <SSSSSSSSSSSSSSS>
$$ [...]
##$SUBNAM2= <"">
##$SUBNAM3= <"">
##$SUBNAM4= <"">
##$SUBNAM5= <"">
##$SUBNAM6= <"">
##$SUBNAM7= <"">
##$SUBNAM8= <"">
##$SUBNAM9= <"">
##$SW= 18.0517287032376
##$SWIBOX= (0..15)
0 0 2 0 0 0 0 0 0 0 0 0 0 0 0 0 
##$SW_h= 3612.71676300578
##$TD= 16384
##$TD0= 1
##$TE= 0
##$TE2= 300
##$TE3= 300
##$TEG= 300
##$TL= (0..7)
0 120 120 120 120 120 120 120 
##$TP= (0..7)
150 150 150 150 150 150 150 150 
##$TP07= 0
##$TPNAME0= <>
##$TPNAME1= <>
##$TPNAME2= <>
##$TPNAME3= <>
##$TPNAME4= <>
##$TPNAME5= <>
##$TPNAME6= <>
##$TPNAME7= <>
##$TPOAL= (0..7)
0.5 0.5 0.5 0.5 0.5 0.5 0.5 0.5 
##$TPOFFS= (0..7)
0 0 0 0 0 0 0 0 
##$TUNHIN= 0
##$TUNHOUT= 0
##$TUNXOUT= 0
##$USERA1= <user>
##$USERA2= <user>
##$USERA3= <user>
##$USERA4= <user>
##$USERA5= <user>
##$V9= 5
##$VALIST= <valist>
##$VCLIST= <CCCCCCCCCCCCCCC>
##$VD= 0
##$VDLIST= <DDDDDDDDDDDDDDD>
##$VPLIST= <PPPPPPPPPPPPPPP>
##$VTLIST= <TTTTTTTTTTTTTTT>
##$WBST= 1024
##$WBSW= 4
##$XGAIN= (0..3)
0 0 0 0 
##$XL= 0
##$YL= 0
##$YMAX_a= 187005
##$YMIN_a= -182274
##$ZGOPTNS= <>
##$ZL1= 120
##$ZL2= 120
##$ZL3= 120
##$ZL4= 120
##$ABSF1= 10
##$ABSF2= 0
##$ABSG= 5
##$ABSL= 3
##$ALPHA= 0
##$AQORDER= 0
##$ASSFAC= 0
##$ASSFACI= 0
##$ASSFACX= 0
##$ASSWID= 0
##$AUNMP= <proc_1d>
##$AZFE= 0.1
##$AZFW= 0.1
##$BCFW= 1
##$BC_mod= 2
##$BYTORDP= 1
##$COROFFS= 0
##$CY= 11.3945322036743
##$DATMOD= 1
##$DC= 2
##$DFILT= <>
##$DTYPP= 0
##$F1P= 2.36226072786647
##$F2P= -0.459571619588291
##$FCOR= 0.5
##$FTSIZE= 0
##$FT_mod= 4
##$GAMMA= 1
##$GB= 0.15
##$INTBC= 1
##$INTSCL= 1
##$ISEN= 128
##$LB= 0.24
##$LEV0= 0
##$LPBIN= 0
##$MAXI= 10000
##$MC2= 0
##$MEAN= 0
##$ME_mod= 0
##$MI= 1.114404
##$NCOEF= 0
##$NC_proc= 0
##$NLEV= 6
##$NOISF1= 3.799351
##$NOISF2= 2.8
##$NSP= 1
##$NTH_PI= 0
##$NZP= 0
##$OFFSET= 15.70392
##$PC= 1
##$PHC0= -15873.76
##$PHC1= 13.80079
##$PH_mod= 1
##$PKNL= yes
##$PPARMOD= 0
##$PSCAL= 0
##$PSIGN= 0
##$REVERSE= no
##$SF= 200.130013532006
##$SI= 16384
##$SIGF1= 3
##$SIGF2= 2
##$SINO= 400
##$SIOLD= 16384
##$SREGLST= <1H.CDCl3>
##$SSB= 0
##$STSI= 0
##$STSR= 0
##$SW_p= 3612.71676300578
##$SYMM= 0
##$S_DEV= 0
##$TDeff= 0
##$TDoff= 0
##$TI= <>
##$TILT= no
##$TM1= 0
##$TM2= 0
##$TOPLEV= 0
##$USERP1= <user>
##$USERP2= <user>
##$USERP3= <user>
##$USERP4= <user>
##$USERP5= <user>
##$WDW= 1
##$XDIM= 8192
##$YMAX_p= 0
##$YMIN_p= 0
$$ End of Bruker specific parameters
$$ ---------------------------------
##NTUPLES= NMR FID
##VAR_NAME=  TIME,          FID/REAL,        FID/IMAG
##SYMBOL=    X,             R,               I
##VAR_TYPE=  INDEPENDENT,   DEPENDENT,       DEPENDENT
##VAR_FORM=  AFFN,          ASDF,            ASDF
##VAR_DIM=   8192,          8192,            8192
##UNITS=     SECONDS,       ARBITRARY UNITS, ARBITRARY UNITS
##FACTOR=    0.0002768,     1,               1
##FIRST=     0,             0,               0
##LAST=      2.2672688,     0,               0
##MIN=       0,             -182274,         0
##MAX=       2.2672688,     187005,          0
$$ Real data points
##PAGE= N=1
##DATA TABLE= (X++(R..R)), XYDATA
$$ [...]
1666A544j759r01K429p49j939J875P67k128K83J546j051r57J492L48j990R47J272
1683A029j885K2J535n67p02O61Q79j389j28J458q50j018J638q8j218O04Q17r14
1701a16l40R86j3j228N58Q92j432J34J215r30l12O12L04p61j43J002m54o77J180
1720D77k62r99J038L46p20j59O64R2r53O38N05j124J88J040r87j43N80l54k10
1739c43J35O09o17n36J099l89o38R26k76m02L28K36j31k48M88k7o49O65K61p78
1759b87L33L45n90K36J07J06k98q5M87l57m28O80l40k75N44j40j48K9m0J33l72
1780c60K11J81m10M18K94o28M08J05k87K95k69K58j92j84M60l46p5M88n03m0L34
1801A58k08k4k01K02J39k34Q3L39q23M73J63l01K62j17K40l5j48K76l17M7L50
$$ plain form
1666 1544 -215 -1116 1313 564 -1375 500 1267 -861 -578 968 -83 -1040 452 800 -1190 -243 1029
1683 1029 -856 -834 701 134 -568 93 972 -417 -545 913 63 -955 683 595 -623 -19 798 -116
1701 -116 -456 530 517 -711 -153 739 -693 -559 656 -274 -586 26 330 -431 -574 428 -26 -703 477
1720 477 215 -784 254 600 -120 -279 385 477 -476 162 667 -457 -269 771 -216 -359 221 -133 -343
1739 -343 -208 401 -216 -752 347 -42 -680 246 -30 -432 -104 132 1 -247 241 214 -435 230 491 -287
1759 -287 46 391 -199 37 144 250 -48 -133 354 -3 -431 249 -91 -366 178 38 -110 -81 -121 12 -360
1780 -360 -149 32 -378 40 334 -294 114 219 -68 227 -42 216 24 -160 300 -46 -121 367 -136 -176 158
1801 158 -50 -74 -275 -73 66 -168 -85 254 -569 -96 67 -234 28 -89 151 116 -32 244 -73 -26 324
1822C24m39p8N99l69r9L6rK67n41L99O1q06O95O9n87N14P1l41J0K49J31l11M3
1845a12N20o69j9R17o18k73L94R8l95q8N83k42n50Q88J71j240P14J99n18%K16
1866b4L6m71L29O40j048J76R05q57l44R52q0q03M22O85o26m74J247k74j213J377
1886E55J17j122M21O06n41n18P43K75j201N25P27j047j94J340q57o84J084J82
1904D11j004J10J087o23j076J778r3j594J159N19j204K13J098m68j039R73O43
1921H90j698N13J387j499m78J632m98j239R78R66j686k43K062r73j376J802L40
1938H80j980Q70J254j386n61J681p2j735J093J256k074L7K099j418r28J674J17
1955H07j934P99J445j494r28K406o62j867J818P58k184L48J785j084j239J742
$$ plain form
1822 324 -115 -193 406 37 -62 -26 -35 232 -309 90 151 -655 40 109 -478 36 107 -234 -224 25 156 -155 -112
1845 -112 408 -261 -280 637 19 -254 140 238 -157 -245 338 96 -454 434 605 -635 79 278 -240 -240 -24
1866 -24 12 -459 -130 510 -538 -362 543 -314 -658 294 214 -589 -167 518 -108 -582 665 391 -822 555
1886 555 672 -450 -29 577 36 -482 261 536 -665 -140 587 -460 -654 686 -171 -855 229 411
1904 411 -593 -483 604 -19 -1095 683 590 -1004 155 674 -530 -317 781 313 -726 247 890
1921 890 -808 -295 1092 -407 -885 747 249 -990 -12 954 -732 -975 1087 114 -1262 540 880
1938 880 -1100 -230 1024 -362 -923 758 686 -1049 44 1300 -774 -737 1362 -56 -984 690 807
1955 807 -1127 -328 1117 -377 -1305 1101 439 -1428 390 1148 -1036 -688 1097 13 -1226 516
1971E16O47k271R85J789k197m71K314r01j439J294R90k052k1K309j549j465K421
1988H99j45k082J033J570j817o18K215p69j893J688J195k525M17K307j582j167
2004a274J986K21j909O19J952k007q86K786j003j982J992Q42k421L90K129j503
2020f8j453K391O0k482J409J746k525j86K521j162j915K110Q42k451M11K287j758
2037b23j244K650k54k241J398J234j930l27K228r34j876K157O36k481O78J853
2053A324j840o88J999j40k166J257J535k205k39K542j085j586J953L75j991O80
2069b75J455j401j011K151K0k363J558J160k009M5J729j028j183J655M53j831
2085h75M00J672j461j005K105m68j635J245R16j560MJ812p63j576J670M45j860
$$ plain form
1971 516 1163 -1108 -123 1666 -531 -1002 1312 411 -1028 266 1256 -796 -817 1492 -57 -1522 899
1988 899 754 -1328 -295 1275 -542 -1160 1055 286 -1607 81 1276 -1249 -832 1475 -107 -1274
2004 -1274 712 933 -976 -357 1595 -412 -1298 1488 485 -1497 495 1337 -1084 -694 1435 -68
2020 -68 -1521 870 930 -1552 -143 1603 -922 -1108 1413 251 -1664 446 1288 -1163 -752 1535 -223
2037 -223 -1467 1183 929 -1312 86 1320 -610 -937 1291 357 -1519 638 1274 -1207 -529 1324
2053 1324 -516 -1204 795 655 -1511 -254 1281 -924 -1163 1379 294 -1292 661 1036 -955 -275
2069 -275 1180 -221 -1232 919 939 -1424 134 1294 -715 -670 1059 31 -1152 503 956 -875
2085 -875 -475 1197 -264 -1269 836 368 -1267 -22 894 -666 -662 1150 387 -1189 481 926 -934
2102i34P35J388j390n65J558k92j368Q42J196j707r0J724j006j194J548J39j271
2119f87K44J401j158q37J705j43j711J239R66j712J26J430q26q15J289L30j446
2136f05L43J312j167n97J692n84j258J059N42j229j22J250n22j105J420K51j645
2153i65Q86Q39j154j24R60j94r80P90P49j266K23R92r23l42J018k79n18K23M82
2172D17n27l95J154n37o67O73K37q32M07M13l73m61N92L02p76J09Q23p96j5P72
2192E20m89k67L36K41n03J08L41j95m33O52m6p08M51K47l59l37L87R9l47P7N37
2213C12o43l1O46k49k52L67o0k64J02M16k95m77O90r9m39M25J40l38J80J74j55
2234A50n32K34M25m90l7O09m99j24M28k15l6R7l2p6j95M22r5m48O56j20m02M94
$$ plain form
2102 -934 -199 1189 -201 -766 792 500 -868 -26 1170 -537 -627 1097 91 -1103 445 584 -687
2119 -687 -443 958 -200 -1037 668 525 -1186 53 1019 -693 -567 863 37 -778 511 841 -605
2136 -605 -262 1050 -117 -714 978 394 -864 195 737 -492 -614 636 114 -991 429 680 -965
2153 -965 -79 760 -394 -518 442 248 -732 58 807 -459 -236 756 -167 -509 509 230 -288 -65 417
2172 417 -110 -505 649 112 -555 118 355 -477 -70 343 -30 -491 101 403 -373 -264 559 -237 -252 520
2192 520 31 -236 100 341 -162 -54 287 92 -341 311 265 -443 8 255 -104 -441 -54 45 -302 -225 312
2213 312 -331 -362 284 35 -217 150 90 -174 -72 344 49 -428 262 163 -276 149 289 -49 131 305 150
2234 150 -382 -148 277 -213 -250 359 -140 -264 164 -51 -87 10 -22 -98 -293 129 34 -414 242 122 -280 214
2256B14j21j74Q2J22O0k89K36L07n78J79N7j70k1J86k89O1M5R0l8r8K44k25q0
2279b00K26P3m39N77k92KJ90n0p0j77J22J99j90J63k8j09J65j18L9q7r6J22r2
2302g0n7J00j0nN7j54J00M9l05K82p1N4J66j99n0Q2l9L9P8L1P9j31R6o9k32K58
2328G9Rl18L47l10l5M47k13j01m8Q9J28l75K61J69l34J69K34l33k7K52l4n5j33
2351a32N33k54l46N80k27l37N42k28l76K17J98j17l33N36j16o47K75N52q45K68
2371b57M35j51k63L49J75o16J14P75o23p7M31j26k76J41L57m56J7M47k50o71Q42
2392C17J92j045M98M36o66j20O33j60p25M88N67o65j14R11p79m47R91p3n12J64
2412a09N80m71n09R31j00q92P17L53r09L51N65m02p84R39Q8r28N13N85r55r6J017
$$ plain form
2256 214 93 -81 1 123 183 -106 130 437 -141 38 95 -75 -96 90 -199 -138 -93 -3 -41 -139 105 -120 -200
2279 -200 26 99 -340 237 -55 -53 137 87 17 -160 -38 161 -29 134 106 -3 162 44 83 -4 -100 22 -70
2302 -70 -127 -27 -37 -42 15 -139 -39 10 -295 -13 -84 -30 136 -63 -113 -31 -70 -31 47 78 157 26 122 53 -179 79
2328 79 88 -230 117 -193 -228 219 6 -95 -143 -54 74 -301 -40 129 -205 -36 198 -135 -162 90 56 1 -132
2351 -132 401 147 -199 381 154 -183 359 131 -245 -28 170 53 -280 256 140 -507 -232 320 -525 -257
2371 -257 178 27 -236 113 288 -328 -214 561 -62 -139 292 166 -110 31 388 -68 -51 396 146 -525 317
2392 317 509 -536 -38 398 -268 -388 245 85 -640 -152 415 -250 -364 547 -232 -679 312 239 -273 -109
2412 -109 471 0 -509 422 322 -570 147 500 -409 -58 507 105 -679 260 348 -580 -67 518 -437 -533 484
2433D84l87o02P39J94p93N8P97l27o63R84j57j027N95O33o30k56R21l68q64P88
2453A19L64j055J98R88p31n47J063k75o84N28L98q01k49J157m55q02J188n2r13
2472e61L94R01q33n06R58J41j114N87Q04j244J57J140p57o63R41K23j042Q7J000
2491F13o75o41J237k23j109Q45M25j001J04R85m98q18Q43N05j197M70J120j098
2509a13k81Q92j06r14N73P96j018m18J463p25q98J029L18j215N73P47q85m13R04
2528C09J7j203R93O44j326J40J255q52m80P67K39j068K24J118r11l41J229l86
2546C68r75P24O18j218K19R11p23p92J193K56j313N93Q12j070j5R35l52o99P40
2565B12M52j062m6J158p16n25R62o5p90M09N47p75j25Q19k42q24O24N29j151L17
$$ plain form
2433 484 97 -505 234 428 -365 -307 490 163 -500 484 327 -700 -105 528 -102 -358 563 195 -669 119
2453 119 483 -572 -374 614 -117 -664 399 124 -560 -32 366 -435 -684 473 18 -784 404 352 -561
2472 -561 -167 734 -99 -605 353 494 -620 -33 771 -473 -316 824 67 -596 345 568 -474 -387 613
2491 613 -62 -703 534 311 -798 47 472 -529 -425 560 62 -756 87 592 -605 -135 985 -113
2509 -113 -394 498 392 -522 51 847 -171 -589 874 149 -749 280 598 -617 -44 703 -182 -595 309
2528 309 326 -877 116 760 -566 -426 829 -23 -503 264 503 -565 -341 777 -134 -475 754 368
2546 368 -607 117 735 -483 -264 647 -76 -868 325 581 -732 -139 673 -397 -412 523 171 -528 212
2565 212 664 -398 -444 714 -2 -527 435 370 -420 -11 536 -239 -364 455 213 -611 13 542 -609 -292
2585b92R70q17m32Q89o6p54K92Q52r88j58R32k12o30P64L9o99K66O08n79m29Q31
2606C87k3q77M26P54r28K0P33l19o78O44L02p10k18R22m62o28R41n1n61K95L73
2627C42o14j41O02K0q27R22K34r26K96N08m93k53P58l05m90K03P07p81j4P13m78
2648a7l98N49j98k63J76L76l54l18Q05j34o53N06M41p72J16L80j76l91M32J75
2668B82m11Q8M05n23j32N12j51j58P4J15j15k92L50M8m51N16K8m97M59k4m09J56
2690a30J12K3k71K97K33k84LJ55j35j08K91L3l64R4K11K0m24L51K5l98K68K63
2712B65n04J16J71O0j90o7L28l16o7L57l03J34K62k22j11J15O1r6k14L33K6l92
2734b54K81J46l14J87J02l85J76O7k4j65l5K71k89Q7J84k21M8J73j20J08q9J66
$$ plain form
2585 -292 678 -139 -571 318 252 -502 -210 642 -346 -504 428 216 -414 350 389 -310 -44 564 -15 -444 387
2606 387 364 -513 -87 667 -261 -241 492 173 -505 139 441 -269 -487 435 -27 -655 286 235 -326 -31 342
2627 342 -272 -413 189 209 -618 304 538 -388 -92 416 -77 -330 428 123 -367 -164 543 -238 -252 461 -17
2648 -17 -415 134 -64 -327 -151 225 -129 -447 358 224 -429 77 518 -254 -138 242 66 -325 107 282
2668 282 -129 -41 364 -159 -291 221 70 -88 -14 101 -14 -306 44 92 -359 157 185 -312 147 123 -286 -130
2690 -130 -18 5 -266 31 264 -20 -17 138 3 -105 186 219 -145 -51 160 180 -244 107 132 -266 2 265
2712 265 -239 -123 48 108 -82 -149 179 -137 -204 153 -150 -16 246 24 -87 28 89 -7 -221 112 138 -254
2734 -254 27 173 -141 46 148 -237 -61 6 -18 -183 -218 53 -236 -149 35 -186 -138 35 -85 23 -66 100
2756A00r6%J6Q8o7Q7q9q9rPJ78j23M1Op0L8O6j26J1J38j72j04O6J81l6q8P5K1
2784E0k28K69j94n4L30k40J25l1K4J11j41j84L19j72j0L06l69K9J41k0l3j15P6
2807a1r6q2L14l0k35K14k2k00J35j24Q5P1r4K71j70j9K23l22J87Q8k66ML8Q3j54
2832a12J37J76k05k02L33o5j24K60k15j14n3J53K40l86J70J15k26K11J13j07j35
2853c6K42j40k90J24K72k92j00M83m37j50O05j0n25Q0K38j51q8K33J16m56L23
2874D1L53p04K55M97n34n6K45J57m13N0L72k94K3L29l02l48N22n8l13J05L67n34
2896b40j72N62k6m80J31L77k93pM49l42k77L04J99l19K5P09o25l66O95j91l50
2917b37K26K97l82k4M66k54m24O04J03p06K99M83o98qN67j33o57N83K08m62j07
$$ plain form
2756 100 4 4 20 108 41 128 39 -50 -59 -52 126 3 44 50 -20 18 84 -42 -31 107 -65 -169 -103 78 42 -46 29 50
2784 50 -178 91 -103 -157 173 -67 58 27 51 162 21 -163 156 -16 -26 280 -89 -60 81 61 28 -87 -11
2807 -11 -107 -189 125 95 -140 74 52 -148 -13 -137 -52 19 -75 196 26 7 230 -92 95 183 -83 -79 -41 42 -112
2832 -112 25 201 -4 -206 127 62 -62 198 -17 -131 -184 -31 209 -177 -7 108 -118 93 206 99 -36
2853 -36 206 66 -224 -100 172 -120 -220 263 -174 -324 281 271 -254 -174 64 -87 -175 58 174 -282 41
2874 41 394 -310 -55 442 -92 -148 97 254 -159 -109 263 -31 -8 321 19 -329 193 135 -178 -73 294 -240
2896 -240 -412 150 124 -356 -225 152 -141 -148 301 -41 -318 -14 185 -134 -109 600 -25 -391 304 113 -237
2917 -237 -11 286 -96 -120 346 92 -332 272 375 -331 -32 451 -247 -255 312 179 -478 105 313 -149 -256
2938b56N86k72m19O34j23l44K78L55l03m86N96O7p24O79K21o97J05M04m41l13
2958d53O18R9p13L72N13n88k34Q12m07m16K98M14m32m5P80m62n24Q19j62o73N63
2979A79K16m93k88P61k07o03M04O18r42L7P08m54n53R44rq49M37N29n07m98J079
3000E09l33n74M77L38o97P8N45m77k15N52m1o50M33Q15j053L3Q80n00m85O42R6
3021C73p66J27O44l99n41Q92k8q69O95L38o65q3N50j82q59Q50M60q24J93O55n10
3042E1l23P10j12p53K75N91n68m61R60k20p34P85K14j177O25N50o00j03N37K00
3062D47r30M93O32q44k11R01n20l94O53O2l95j22N46l85l16O98q8p36N44L50o42
3083b57N2M93k56n36P60P4o94J40P18o04l71P63k51m91O81J92m88j79P68l79l58
$$ plain form
2938 -256 330 58 -361 273 150 -194 84 439 136 -350 246 313 -411 268 489 -208 -103 301 -140 -453
2958 -453 165 264 -449 -77 436 -152 -386 426 19 -397 -99 315 -117 -162 618 156 -368 451 289 -384 179
2979 179 395 -98 -386 375 168 -435 -31 587 -355 -318 390 -64 -617 327 318 -531 -94 435 -72 -570 509
3000 509 176 -398 79 417 -280 -202 343 -134 -349 203 162 -488 -55 760 -293 -260 620 120 -365 277 373
3021 373 -393 -266 378 -21 -562 330 302 -567 128 466 -199 -282 268 86 -773 77 537 -287 -94 561 51
3042 51 -272 438 326 -427 -152 439 -129 -590 370 150 -584 201 415 -762 -137 413 -187 -290 247 447
3062 447 -483 10 642 -202 -413 488 -32 -426 227 289 -106 -228 318 -67 -383 315 227 -509 35 385 -257
3083 -257 -205 288 32 -504 256 330 -364 -224 494 -110 -481 282 31 -460 221 413 -75 -254 514 135 -223
3104b23L95J36o16L06L77m21l02N93Q0o33J91M16q99L18N05k86j32M15N9l50j61
3125b32O67m59k89N72n7m57M35J43m50J71L24j45n93N69O0l44K2L76m07J9K42
3146A67j20j76J18M00n78j41N32n9l47L39j7k86L75q6j03l54M64j54j55K99J70
3167B88m47O5J80N0k08O4K33k35j54M24l26k86N22j20k87K60j8o9k6m7J08l00
3189c29M90K5l35J59J44l83K65k2J57j95M1J26j77j4L41k15m83M38r4QKJ45J9
3212A13j51J65R4m97M60J13m54K09m2k1N5J48k87J82N1m6j31j16L30Qk84J94N3
3235A46j51j6j71J64q3l0K69k82J37J71l16R7k0K13j27j11J26j52R2K11M5k02
3257A0P1Q4j96J60j21Q1j06K6J54k20L2J38k06j1J64k67K30r9M7N3k12K06K1j48
$$ plain form
3104 -223 172 308 -308 -2 375 -46 -348 245 325 -308 -117 299 -600 -282 223 -63 -195 220 279 -71 -232
3125 -232 435 -24 -313 259 202 -255 180 323 -127 44 368 223 -370 199 259 -85 -63 313 -94 -75 167
3146 167 47 -129 -11 389 -189 -330 202 143 -204 135 118 -168 207 121 18 -336 128 -26 -181 118 288
3167 288 -159 -94 86 136 -72 -8 225 -10 -164 260 -66 -352 170 50 -237 23 5 -64 -90 -137 -29 -329
3189 -329 161 186 -149 10 154 -229 36 14 171 -24 17 143 -34 -48 293 78 -405 33 -61 -53 -51 94 113
3212 113 -38 127 221 -276 184 297 -157 52 10 -11 44 192 -95 87 138 92 -39 -155 175 183 -101 93 146
3235 146 -5 -21 -192 -28 -111 -141 128 -154 -17 154 -162 -65 -85 128 1 -110 16 -136 -44 167 212 10
3257 10 81 165 -31 129 8 89 -17 9 163 -57 -25 113 -93 -104 60 -207 23 -76 -29 24 -188 18 39 -109
3281a09J51l4k1K11k07J2J78j3k1k07K03j1k48J85J40j52j41J77n8j03N0K14k15
3304a9o3K68l55m6L83k32j23K10N5L2k20J52O3k42R3P3j39K46jo8n1N7M4j51L6
3329BJ74l09P8K82l23p9J68Mj14J44N4q5j01K26J26m35J97o4j45K52N4j60M7K07
3353B00r2l30R7L62l24N4J88j73n1J93j14Qj46K50l9m36M45N3m01K73J52k60m1
3376a32J52J80m10Q6M59n11K18L18m72L3K10N5m27J74K44j53k44M51j55m59N46
3397A63K7m55J38J66l4k65L14J65n85L76L02o30K3N46k53k95K41L88m57QM37l49
3419b9l10N85q7m13L20K01m91R0N02l01l03L21K01m60l6N60m26j99M11j31r4N0
3441c9K58k48k31M88l22l35O94m2m56J81K67k83k16L76Q4m88L14K42o65K09M17
$$ plain form
3281 -109 42 8 -13 198 -9 3 181 168 147 -60 143 132 -116 69 209 57 -84 93 35 -68 -18 196 -19
3304 -19 -82 186 -169 -215 168 -64 -187 23 78 110 -110 42 105 -137 -44 29 -110 136 135 67 16 73 117 -34 2
3329 2 176 -133 -55 227 -96 -175 -7 -3 -117 27 81 -4 -105 121 247 -188 9 -55 -200 52 106 -54 -7 200
3353 200 108 -222 -125 237 -87 -33 155 -18 -69 124 10 18 -128 122 83 -353 92 145 -256 17 169 -91 -132
3376 -132 20 200 -210 -124 335 -176 42 360 -112 -79 131 186 -241 -67 177 24 -220 231 76 -383 163
3397 163 190 -265 -127 39 5 -260 54 219 -366 10 312 -318 -295 251 -2 -297 -56 332 -125 -117 320 -29
3419 -29 -339 246 159 -254 66 267 -224 -134 368 67 -236 85 286 -174 -210 350 -76 -275 136 5 -89 -39
3441 -39 219 -29 -260 228 -94 -429 265 223 -233 -52 215 -68 -284 92 176 -312 2 244 -421 -212 205
3462B05k27k93M75j1l09j4M78l52l76P46q0o46M26L14m72j68N98q4m54M48J65
3483C69q13N40K69m43k36O95k51m45L00L27n18k33R01m78k13L87J24q21M64L79
3503C04k90k70N17J9p15N31K71o58L51K32l42k13M29J61n04J95M83o14j54M50
3523A83o7n22M18M60q41K46M22l78m27O62K75p03J70M33n55J6L43Jm67L29K85
3544B83n30J41N59l40n66P21j40m87K88K55k72k18O25k34n53N52K59p37L29M35
3564C70m32j41J87K92l97O6L98l93j11N28k64n41N50L00o81J65K48j76l65O25
3584B28j46m57K85L36l45k33N80k16k14K92J54l87m9L78l08j68M54J26l34J43
3604A19J73l4m64L60R2n19L18K58m96J34K12k97r5K70J67l04nM28m30r8M42j93
$$ plain form
3462 205 -22 -315 160 149 -160 -174 304 -48 -424 322 242 -404 22 336 -136 -304 294 210 -244 204 369
3483 369 -444 96 365 -78 -314 381 130 -315 -15 312 -206 -439 462 -16 -229 158 282 -539 -75 304
3503 304 14 -256 261 280 -435 96 367 -291 60 292 -50 -263 166 327 -177 18 501 -113 -267 183
3523 183 116 -406 12 472 -369 -123 299 -79 -506 156 431 -272 -102 331 -224 -208 135 136 -331 -2 283
3544 283 -247 -106 453 113 -453 268 128 -359 -71 184 -88 -306 319 85 -468 84 343 -394 -65 370
3564 370 -62 -203 -16 276 -121 -55 343 -50 -161 367 103 -438 112 412 -269 -104 144 -32 -397 228
3584 228 82 -375 -90 246 -99 -332 248 32 -182 110 264 -123 -172 206 -102 -270 184 310 -24 119
3604 119 292 258 -206 154 246 -273 45 303 -193 -59 153 -144 -239 31 198 -106 -111 317 -113 -211 231 38
3626C8k69L72o3j81P4K11j83k03K27J17m07K35L44l52r1L17k30k74K17L15l11
3647i7P0J67j37k27L52j68o3Q4J77k21o6M17j30l78K80J78l63R0K06O5m05K04
3669C5J06j03j03J75j51j45L03j17j38K09K3k69m1J86L7k37K60J44l50K50j35
3690f1j9o4J41J32j94n4L05j82m6J57j57l5K47j01n5l4J17j62o8K97j57j66kK47
3714H6j05p5J50j40%Q6L5p2l3K00j1j76J31p9N2l3J27k75K3J58j2r6J65k9j74
3739i7J02r0k5J60p5R3ok8N5j79K3m0J04L1N5j45pl0K36k03l8J16M9k17K73j16
3765ALO7nO0j47j64K34k90L41m6J0l1j9l8j65K43O0j79J99k78J39j21J21J28j44
3790b1J16n2R1jk33K26k04n8K65k34k5J73q2j2J36q0L3j26J19J36k50L3J14k09
$$ plain form
3626 38 -231 141 78 -103 -29 182 -1 -204 23 140 -267 -32 312 -40 -131 186 -44 -318 -101 214 -97
3647 -97 -27 140 3 -224 128 -40 -103 -19 158 -63 -129 288 158 -220 60 238 -125 -35 171 236 -169 35
3669 35 141 38 -65 110 -41 -186 117 0 -138 71 94 -175 -216 -30 7 -230 30 174 -176 74 -61
3690 -61 -80 -144 -3 129 -65 -119 186 4 -42 115 -42 -77 170 69 14 -20 97 -65 -133 164 7 -159 -161 86
3714 86 -19 -94 56 -84 -84 2 37 -35 -68 132 121 -55 76 -3 49 16 143 -132 -109 49 37 -59 106 77 -97
3739 -97 5 -85 -110 50 -25 68 62 34 89 -90 -67 -107 -3 28 83 -62 -69 -99 137 -66 -104 12 61 -156 117 1
3765 1 4 71 66 126 -21 -185 49 -241 100 54 64 33 14 -24 -189 54 114 -65 134 -144 -5 -126 -5 123 -21
3790 -21 95 43 134 133 -100 126 -78 -136 129 -105 -130 43 -39 -51 85 5 38 -88 31 167 -83 -50 64 -145
3814a45K68j05r7R8P0j68O4K3J71l23J49J99k69j35N38l63oJ64j91ro4O6q0k1
3838a66K10J2k64L12j64r8Q0J54J88l57K16J71l79L6J78j83P2R5j76K2N8K37l24
3861g0o6L46k74l2K67j61j44N3K06k25o8K60j14j59K24J66l49k7M26k51nO1M1
3884A05j44m7M96l73j51K59l7l40J76K32l41J58R1m5k75K59J59m79J61M39m47
3905a44K45q2N9l11K10K91k13j78M26k95p7J89P0m35K32K57m29R0K19K9l11Q1
3927g7M49n63J89L05m03MJ65k8k57J61J84j97j92N89k92l29M80o8k30J12J88j02
3949H8r8P0J75m15J87J88k94kL82k46l27J83L15n27L00K89k75k68O33k79l94L68
3971E3o1Pj78L28ol23J64K54n25L02J29k51rL38r1m43L84J76m22k9M42l08l84
$$ plain form
3814 -145 123 18 -79 19 89 -79 -15 8 179 -144 5 204 -65 -200 338 -25 -31 133 -58 -67 -131 -65 -145 -166
3838 -166 44 56 -208 104 -60 -158 -78 76 264 -93 123 294 -85 -49 129 -54 18 113 -63 -41 17 254 -70
3861 -70 -136 210 -64 -96 171 10 -134 -81 125 -100 -168 92 -22 -181 43 209 -140 -167 259 8 3 64 105
3884 105 -39 -86 410 37 -114 145 108 -232 -56 176 -165 -7 84 39 -236 23 182 -297 -136 303 -144
3905 -144 101 19 78 -233 -23 268 55 -123 303 8 -69 120 190 -245 -13 244 -185 -95 124 153 -158 -77
3927 -77 372 -191 -2 303 -100 -96 69 41 -216 -55 129 -68 -260 329 37 -292 188 120 -110 2 190 88
3949 88 -10 60 235 -180 7 195 -99 -101 281 35 -292 -109 206 -321 -21 268 -7 -275 358 79 -315 53
3971 53 -8 -1 -179 149 143 -180 -16 238 -287 15 144 -107 -116 222 131 -312 72 248 -174 -203 239 -69 -453
3994d53N41p0k57K18nkk67M51r7k47L33j07k35J71J63j61p1Q7K49l58O8L21l34
4017f2p5L03j61k69L31J07l27m4L78k44j65L11J0m97K70L46k47K4J44j53k60M9
4039b31N56l34l4K91k93l1K34P2l43K05M4l04rK21J21m10J98K62m99J50L22k64
4061g6o2J38K13m02J36K29l57O8L82k26k5K1l4j60j17N75l50j47M57j64k70P2
4083i9J55j13j00L04Rk48j20K71k26nM80j86j78J47n5j96J05K53j30j03K98j93
4105G0j67K19J9k88K5L89l54J93j97K68k65k9K86j51r6K72j26k56K45J17l41k4
4127a91M54j98k16J99J56l16K12N5j56k4J32Nk02J19J7j89K9K44m4N0k25j2P5
4150b6M2J62j50j34L08j51j98K14n6M2o0J31j06k16J56P5k9j2Q1l9j29K01q0q4
$$ plain form
3994 -453 88 18 -239 -21 -26 -28 -295 156 59 -188 145 38 -197 -26 137 -24 -95 -8 241 -117 -49 272 -62
4017 -62 -137 166 5 -264 67 174 -153 -197 181 -63 -228 83 93 -404 -134 212 -35 -11 133 -20 -280 -231
4039 -231 325 -9 -43 248 -45 -76 158 230 -113 92 136 -168 -177 44 165 -245 -47 215 -284 -134 188 -76
4061 -76 -138 0 213 -189 -53 176 -181 -113 269 43 18 39 5 -155 -272 303 -47 -194 263 99 -171 -99
4083 -99 56 -57 -157 147 156 -92 -212 59 -167 -172 308 122 -56 91 36 -160 -55 198 68 -35 263 70
4105 70 -97 122 141 -147 -122 267 -87 106 -91 177 -88 -117 169 18 -78 194 68 -188 57 174 -167 -191
4127 -191 263 65 -151 48 204 -112 100 155 -1 -25 107 112 -90 29 46 -143 -114 130 86 136 -89 -101 -26
4150 -26 16 178 28 -106 202 51 -147 67 11 53 -7 124 18 -198 -42 33 4 -8 73 34 -95 106 26 -58
4174e8J99j9j55l9Q1mm4J14p5j20O2N7mK8j14J51j20o7K12j47N9R4j80R1k3L4
4200A3nl1R0n4k20L01j27RP9j3j71J12j52P4J55j25J53k63K02j06j8j5J25J3j6
4225A0M4J37j78q0J69O4j72Q1j77k2K06p4nR3j07J07j87M0J34K3j78ML3J23m2
4250D6k5K3k55L32k3j95J86n7p4K58j73K0m4j1P6q3p9J73n2n4J40j29o0N1l9j2
4276f0q8K88J9m49K04O1q1K22Q1k46J05LN5j81J21p6N0J44k6l29J04K03k15LK36
4301A48r3j38N0M6N9k13K71j68k60L76k37J39K1P9k83R8o4L34k69J15J16j52J18
4324I3m3J29k52k2J72j13N8R1m8j50K02j42l9K61j27j74Q5J69k07j15O6J61j43
4347h8R5J19k33J03q6K01j71P4M7k31J14K53k14q6J29kj69K91k06N3l4K8J40k40
$$ plain form
4174 -58 141 122 -33 -72 9 5 -39 75 0 -120 -58 -1 -5 23 -91 60 -60 -127 85 -62 -3 91 -89 2 -21 13
4200 13 8 -23 67 13 -207 94 -33 -24 55 42 -129 -17 -169 -95 60 -65 88 -175 27 -79 -97 -112 13 26 10
4225 10 54 191 13 -67 102 166 -6 75 -102 -124 82 8 3 96 -11 96 -91 -51 83 106 -72 -68 -35 88 46
4250 46 21 44 -211 121 98 -97 89 32 -42 216 43 63 19 8 84 1 -78 95 43 -11 129 0 -60 -9 -48 -60
4276 -60 -148 140 159 -290 -86 -25 -106 116 197 -49 56 59 114 -67 54 -22 28 172 146 -183 -79 124 -91 -88 148
4301 148 55 -83 -33 13 72 -141 130 -38 -298 78 -159 -20 1 80 -203 -105 -169 165 -104 11 127 -25 93
4324 93 50 179 -73 -95 77 -36 22 113 65 -85 117 -25 -64 197 70 -104 -19 150 -57 -172 -106 55 -88
4347 -88 7 126 -107 -4 -90 111 -60 14 61 -170 -56 197 -17 -103 26 24 -145 146 -60 -7 -41 -13 127 -113
4371a13K08j21j9j06K55k18J92k05J34J13k76K05j30L3J96j54m0rL02j20j46K34
4393B15j32j75K23j69n1J75k32l0J92j15j7PJ74o2j59J83K05m04J55J00L6j90
4415g1P4Q9m2j74K53N7l08J75J54l40k1K99j96lrO0j60K39J93m38J30K70k49j12
4439a30J03J18j44K7K20j29j26J20M5l15K68R1l02M0K24p8M6j1r4j11PN26k75
4462A20k48L41j59k22K44J00j63j51L26k64j05K06J80l75K38K87m73J30q2O6j45
4483a49NK74j52k04N24l05r3M9%j19K40R6j78q0K44r8j72J84m1j5j1J52j76P3
4507D8j8J58k70k0L05l12J71k3r5m6K04q4rl8J64j00j38L34j93j47j9K49k59J18
4531b0P9J6j57N4K42j36r6J85k84M0J21J41k59J23J37r5k04J54O4k12L05l4k16
$$ plain form
4371 -113 95 -26 -45 -151 104 -114 78 -127 7 120 -156 49 -81 -48 148 -6 -46 -55 247 127 -19 215
4393 215 83 -92 131 -38 -89 86 -146 -176 16 -99 -116 -109 65 3 -156 27 232 -172 -17 83 119 -71
4415 -71 3 92 50 -124 129 186 -122 53 207 -133 -154 145 -51 -54 -63 -3 -163 76 269 -169 -39 231 -18 -130
4439 -130 -27 91 -53 -26 194 65 -61 59 104 -211 57 148 -154 -114 110 32 78 67 -27 -138 -131 395 120
4462 120 -128 213 54 -168 76 176 13 -138 188 -76 -181 25 205 -170 68 355 -118 12 -70 -4 -149
4483 -149 -144 130 -22 -226 298 -7 -100 -51 -51 -170 70 166 -12 -92 152 54 -118 66 25 10 -1 151 -25 48
4507 48 30 188 -82 -102 203 -109 62 39 -56 -102 102 18 9 -29 135 35 -103 231 38 -109 -128 121 -138 -20
4531 -20 59 75 -82 -28 214 78 -18 167 -117 -77 44 185 -74 49 186 91 -113 41 105 -107 198 164 -52
4554e2j62J60j9r1L30j98p0n2J53q7N0Q6q6J3N9J08j8k60J99o0j72J31PP7j7J17
4580A46j62p4L08j53k37K12R5m10K62K46l70N5J01Pj67kK23k9k6K08k63o0R4Q
4604A2m7Q8j40j7J24M9k2j33j26M56l39P3K61k50j19Q8M7j60J77J93j66l9k8M2
4628B4j20L22r8j32P3k24L36k43J28K4j30Q5J31l82O0J83j26J0mK21j04j84J53
4651Cp7p0K84j49j60O8J41q2j8J20J05k42J43J59k85J40p7N2J77k32K02k92M0
4674e0J07k6PmL0j62K00p9j30N6J3qq0J24J20j44q0J51r1n0J88j25M6J31j04j20
4700h0J23N8m5k7p5J56o1m1M1j7Oq9J80j53J11k6j24k8M6J11L4j77K06q2j20J76
4726A03j21k0J22R9k46K8J4q6kK14p4o6J76j51L0O5r2k4n7J50j26Q4j6L2r2l2
$$ plain form
4554 -52 -214 -54 -73 -164 166 -32 -102 -154 -1 -88 -38 48 -38 -25 34 142 124 -136 63 3 -169 -38 -31 46 29 146
4580 146 -16 -90 218 65 -172 40 135 -275 -13 233 -137 -82 19 26 -141 -143 80 51 25 233 -30 -90 4 12
4604 12 -35 53 -87 -104 20 69 47 -86 -212 244 -95 -22 239 -11 -130 -42 5 -155 22 215 49 10 -18 24
4628 24 -96 226 128 -4 69 -155 181 -62 66 90 -40 45 176 -206 -146 37 -89 -79 -83 138 34 -150 3
4651 3 -74 -144 140 -9 -169 -101 40 -42 -60 60 165 -77 66 225 -60 80 3 55 232 0 202 -90 -50
4674 -50 57 31 38 34 64 -98 102 23 -107 -51 -38 -46 -126 -2 118 -26 -106 45 -46 -96 92 -33 13 144 40 -80
4700 -80 43 101 56 29 -46 110 49 8 49 32 38 -51 129 -24 87 61 -63 -91 -45 66 100 -77 129 47 -73 103
4726 103 -18 -38 84 183 -63 -35 -21 -107 -109 105 31 -35 141 -10 20 85 -7 -31 -88 62 -64 20 4 36 -56 -88
4752h8K73k21m8J75j54j1M9Q9mK5r3K15k80rJ22n9m8J96j73oJ5rp0J27O9q2j11
4779a11K49K7k45P9j51N6P9Qj5R1l5J6l3O6Om9m2J32q7J8p6J37lj77K48j49j82
4806a43L29k75J6P1P5L3k54Q3J43k15k1J13L6j30K22M1j71Q3j24K02r9J7r9M8
4830a9m2K16k24J43n0O3M6p0m6r1N1p5l5O5J91j83j2j08J96L8j00J36Km5L1q8
4856a0r6K25J5j96N7L5j4j09K6j13M6J99o9j06K6p9J71k7R6l20J76K7K83k34K6
4881C5j5J6n0P5L1k01j8K81j88J19m8J56k96KL04m25J64J03m8j43K64l0l44L01
4905D5K3q8j04J20n6J6O6Q3K1k66K05p4k0N0J62l17J38J12j75l7R1K0J4p6K50
4930B03j58j3P1k01n4K67K1j32j24L06j31k01K45k22n7K73P7l92J39J79K5L3k5
$$ plain form
4752 -88 185 -36 -84 91 -63 -74 -25 64 60 85 -8 207 -73 -82 40 -19 -67 129 -44 -50 -35 -44 -114 13 82 0 -111
4779 -111 138 165 -80 -1 -152 -96 -17 -9 -24 67 32 48 15 81 87 38 -4 128 41 59 -17 120 117 -60 188 39 -143
4806 -143 186 -89 -73 -2 73 106 -148 -65 78 -137 -158 -45 -9 -139 83 124 -47 36 -88 114 15 32 -67 -19
4830 -19 -61 155 -69 74 24 87 133 63 17 -74 -23 -98 -133 -68 123 -60 -72 -180 16 54 -46 90 92 47 78 -10
4856 -10 -106 119 134 -62 -5 30 16 -93 -67 -180 -134 65 -4 -110 -84 -163 8 -19 77 -243 -67 -40 243 9 35
4881 35 20 36 -14 61 92 -109 -127 154 -34 85 37 193 -103 -101 203 -222 -58 45 -3 -146 118 88 -256 45
4905 45 68 -20 -124 -4 -60 -44 22 105 126 -140 65 -9 -29 21 183 -134 4 116 -59 -96 -5 15 29 -47 203
4930 203 45 32 103 -98 -152 115 136 4 -120 186 55 -146 99 -123 -180 93 170 -222 -83 96 121 154 129
4953A29n9j31ML3m5J36Q1p5j76J25P6j45N2K18k57l15N32j75q3K33j80J53j64
4976c3NR9r9P3K40l85J31O2k52j0K38Q4j82Q9K6l0l23L36K6m75N45l8p6j34K1
5001f2M8j3J71k46J95j03M9K9j87J61J5N7r9L9j10n5K29r1k08J27J36Kj01O0q2
5026c9kn8J83k19J05k2p1Q7P6l4N8N2K8p1q5M1rL8O1j52J8J50j7r0n3Q3q3n8Q6
5055CJ31j27q4L21l81m6M26k20k9L9J11nj74N1J73k79J57j36nK03p4p1j4J21j8
5080G3j05pJ60j82J60k0k00jK42j42p7L3K29j37j31L15k99pK73j11o0O9L2r5m1
5105b9k8K53j91K6R1j36N5j21K82k35Q6j3j07O9Q1p9q0P3j9n4M9L3j56q9K96L2
5131H9l44K29J95k68J92K5N2k61L13j91K6j77N9J02m9m2L5m7J28k08J67j21J2
$$ plain form
4953 129 70 -61 -57 -24 -69 67 148 73 -103 22 98 -47 5 223 -34 -349 183 8 -75 158 -22 131 -33
4976 -33 -28 71 -28 45 285 -100 31 93 -159 -169 69 153 -29 60 86 56 -267 69 95 -380 165 127 51 -83 -62
5001 -62 -14 -27 144 -102 93 -10 39 68 -119 42 57 114 15 54 -56 -111 118 27 -181 -54 82 84 -17 43 -39
5026 -39 -41 -99 84 -135 -30 -52 -123 -36 40 6 64 116 144 73 -12 29 20 58 119 -33 -15 135 118 28 -25 58 -25 -83 3
5055 3 134 7 -77 244 -137 -183 243 23 -6 33 144 139 -35 16 189 -90 67 -69 -74 129 55 -16 -30 91 73
5080 73 -32 -39 121 -61 99 79 -121 -122 120 -22 -99 -66 163 26 -105 210 -89 -96 177 66 6 75 107 12 -29
5105 -29 -57 196 5 31 122 -14 41 -80 202 -33 53 40 -67 2 83 4 -76 -3 -22 -76 -27 6 -150 -239 57 89
5131 89 -255 -26 169 -99 93 118 170 -91 222 31 57 -120 -61 41 -8 -50 -15 -62 66 -142 25 -96 -84
5154h4P4j34J85O6k75O7J30j86L59q4p8j12J39L8r3m7J54j34M8O7lj43J6R1p2
5179a1k9j02J59o9j0J80j29J4N7n7O2j38P0N6rJ6o6j02J77j52Q9l0l31L61j1K49
5205B44j21k43L03j98n2J75p7rn2M7j43J71J14m2l2q3L4j63O0K24r5q0J28j89
5229g9J01NP1K9r1j12J06j92J61j15K06q5j56J62n4K7J59j41k06K28n8l3J19o0
5253hP4p8k5K18j80J29p9j13M3n1R8k9rj5J86k41N0k0m5J87j14P6j24J63j7q9
5279a3j18L38k34mk2N7J91j74o8N5m9q9R8J66k00J20l5N6o6j88M01j10j24J25
5303A13j12K9j24J48rj75R3k5oJ00j54J51O4k1j85N7q9J54j51L5J96J8j30J40
5327A17Q2j75N3J32k06n1Q3j04J2J79j24J54j37j35J5k0J01m8L9j3r8J79O4j62
$$ plain form
5154 -84 -10 -144 41 107 -168 -101 29 -157 202 118 40 -72 67 105 12 -35 119 -15 33 100 97 -46 -30 61 -11
5179 -11 -40 -142 17 -52 -62 118 -11 3 60 3 65 -73 -3 53 44 60 -6 -108 69 -83 6 -24 -355 6 -5 244
5205 244 123 -120 183 -15 -67 108 31 22 -30 17 -126 45 159 117 85 2 36 -127 -67 157 62 -18 110 -79
5229 -79 22 27 98 127 36 -76 30 -162 -1 -116 90 5 -151 11 -43 -16 143 2 -204 24 -34 -67 52 -8
5253 -8 66 -12 -37 181 1 130 51 -62 -19 -70 28 -1 -10 -25 161 -80 -30 -50 -95 92 -22 54 -70 93 76 -13
5279 -13 -131 207 -27 -31 -53 4 195 21 -47 8 -41 -130 -32 134 -66 54 19 75 9 -179 222 112 -12 113
5303 113 1 30 -94 54 45 -130 -37 -62 -68 32 -122 29 93 72 -113 -56 -145 9 -142 -107 89 107 -23 117
5327 117 199 24 77 209 3 -48 35 -69 -57 122 -2 152 15 -120 -105 -125 -24 -72 -33 -46 -144 35 99 -63
5351f3J43M9r6N1o7j9L2Pp2J7R7j89k7K68k63R2N3Lj43l8J29k5Q3p5K9K14l23
5378a33J93l3KM9r7o2L3O6j63R6R6n8M8j34K7R2J19j99M4m4K60j69%k1m9N7J96
5405B16l09L5J69K6l03K00J4j87J30P8J3j13L9n8Q6N8k37K67r2l0j28P1L9j22
5429a38J69M2m7j77K51j52J60j24Q9r3P6k34J91j22J33j07%J02j13Q4J01l7o1
5452gK47k88J7J9j29J22R1J36j77M4j03K4j19K76Q8k73N8L9p0Q3k3k0OJ4M3j27
5478b9j23J13J41p3J7j08M9RQ2j20N3O3j68Q4l4J48l40L00m1Kr4O9p7P9L7P1l3
5505G7j14J71j01n3M2J2j66J56J12r6j63J98r6kJ17j11J69j12J01j16M0oj46r0
5529a77J97J1m0MJ15k14Q3J24r9j6p9K06j61J7J36j09k5N1O7r2j10R7l9J19j36
$$ plain form
5351 -63 80 129 33 84 17 -2 30 37 -35 -18 79 -110 -137 131 -132 -40 13 16 -127 -165 -36 -61 22 -53 -24 190 -133
5378 -133 60 27 29 78 -19 -81 -48 18 -145 -49 47 -11 37 -97 -70 22 141 -58 -14 -58 202 33 33 12 -37 20 216
5405 216 -93 -58 111 137 -166 34 48 -139 -9 69 82 -31 8 -50 36 94 -143 124 32 2 -126 -55 -16 -138
5429 -138 31 73 26 -151 100 -52 108 -16 73 -20 56 -178 13 -109 24 -83 -83 19 -94 -10 91 54 -7
5452 -7 240 -48 -31 -12 -141 -19 72 208 31 75 -28 -4 -123 153 241 -32 26 65 -5 78 55 35 41 55 98 -29
5478 -29 -152 -39 102 29 46 -62 -13 -4 78 -42 11 74 -94 -10 -44 104 -236 64 23 25 -69 0 -77 2 39 110 77
5505 77 -37 134 33 -20 22 34 -132 24 136 40 -123 75 -21 -23 94 -17 152 40 141 25 65 59 -87 -177
5529 -177 20 31 -9 -5 110 -104 -21 103 4 -12 -91 115 -46 -29 107 -2 -27 24 91 -1 -111 -14 -53 66 -70
5554g0J58j07L1J76k72J2p1J96m9M2K15k23j25J47N0j44J8J89j27J5O3q5J2pP8
5579A22k37J11P4q2l1J54o0nm3J8J66k48J57k21j25K98m9k3o0R5J00q5J84k74
5603f4PJ48o4k3Q3n1O2j53N0J86o6n9K2l5L8n8j11J81k24J39M0l1qM2q8K5l6n9
5631a07R6q7J54q6J12r3p8K45j6k54J62p7KJ02k0j5j00k0Q7j58K04o1k29J16J38
5656A7Ml9P9l33K27J44l7P6j17j3k5n3%k5J35O9Oq8r4L7k7j11L4K32Q4j77Q7K1
5684A13p6L6o3l4O6p3K14j51m5J35j6r3Pp0N9k64K66R5l05K69j56K10m2j48kk3
5710i1Q3j36J83K1rj17n5J70J1L3j21km3J27o6N2J8K5J16k20J70r6k14J84m8j1
5736c6J0Q5n3P5j50MJ15o5l1J47n3o6J99j48k0k23K22p7J58k03o8L81r8l5j08
$$ plain form
5554 -70 88 -19 12 188 -84 -72 -143 53 4 46 261 38 -87 60 110 -34 -16 173 46 61 124 39 51 44 122
5579 122 -115 -4 70 -12 -43 111 51 46 3 21 187 -61 96 -125 -250 48 -1 -24 -84 11 111 26 210 -64
5603 -64 -57 91 27 4 87 36 98 -55 -5 181 115 56 78 43 81 23 -88 93 -131 8 48 17 9 51 -37 -12 -48 -107
5631 -107 -11 -98 56 -30 82 -11 -89 156 140 -114 48 -29 -27 75 55 40 -60 -80 7 -151 53 -8 -237 -121 17
5656 17 21 -18 61 -272 -45 99 62 138 21 8 -17 -70 -70 -95 40 109 115 27 -67 -30 -57 -168 -134 98 182 5 92 113
5684 113 37 73 10 -24 42 -31 183 32 -13 122 106 13 20 -50 9 -255 11 106 -199 70 -86 124 82 -66 -68 -91
5710 -91 -8 -144 39 60 51 -66 -121 49 60 93 -28 -30 -73 54 -12 40 58 83 199 -21 149 53 -161 23 -25 -36
5736 -36 -26 59 6 81 -69 -65 50 -15 -46 101 48 -18 181 33 13 -210 12 -65 93 -110 -178 203 105 70 -38
5761c8P1K9j42J29Oj95J77p6j6k10K30l1K15j41N1k21P6j16R4O4k9N2K4n7J07
5786E3j08r7P4R4l5l4J91k6j75k2J91j89J61l0rr3N7L1j23N7Lp8K23j8j43jJ5
5813c1M5q8N7K9j69J65M2r4J52K8j11J38q8l1n4NQK5k11K20j8P8j37J1J3o9O3
5840b2n4J14n1K0JO1r7k0j1J50oK5j2j2j24OJ87j66O5P5j45O2L5l0M2j74M1L8
5868bj07o5L26j30l2ll8K03q6L5j09m3k4l6L5N7K3m8J6J2K1LL4rm8jj47J66j36
5897a33K32j24j03LQ1o0J61j05l4qN5J47k35M0K55j00n9J4o1O0l5J10j32P1p6
5922c6j10%K63r4J50q0j23o5J85j00Lr4R6o8j9p0R7m7L7L5M1j19K93n6j33J8J03
5949A07l2j36N6J50n6p4J7j0l3J55o8j14J35l1nK3r7m2KJ48J1r7L2M0o2l0O0o3
$$ plain form
5761 -38 33 62 -80 49 55 -140 37 -39 -55 -265 -35 -66 149 8 59 -162 -86 -202 -108 -44 -73 -21 3 -54 53
5786 53 -55 -152 -78 16 -19 -53 138 112 -63 -85 106 -83 78 48 39 -54 3 34 -89 -32 -29 -107 116 98 -45 -46 -31
5813 -31 14 -74 -17 12 -157 8 50 -44 108 136 25 163 75 44 -10 -5 3 28 -183 37 19 97 -40 -29 -16 -85 -22
5840 -22 -76 38 -13 7 8 69 -28 -48 -59 91 85 110 98 86 -38 -32 155 -11 54 129 -16 46 81 51 93 -81 -40 -2
5868 -2 -109 -174 152 22 -10 -13 -51 152 66 101 -8 -51 -75 -111 -76 -19 4 -44 -28 -16 5 8 42 33 -15 -16 -163 3 -133
5897 -133 99 -25 -128 -125 -44 -104 57 -48 -82 -90 -35 112 -123 -83 172 72 13 27 -34 26 -9 101 -31 40 -36
5922 -36 -146 -146 117 23 173 93 -30 -95 90 -10 -7 -101 -5 -73 -92 -162 -65 -112 -75 -40 1 -118 175 119 -14 4 107
5949 107 75 -61 -5 145 89 15 32 22 -11 144 76 -38 97 66 61 84 -13 -55 -53 95 106 9 41 81 19 -11 49 -14
5977a4K7M4J1j62Q4P0N1k32J72J6j76J29L2j19P4J27k16O5P2j11l3J40m4j24J91
6002G4j41R4o2O7K8R7n0l3M0k43J51K00l24J96L8r5m9J33j55j0O8j08R6j82J58
6027a2j23J54RK7j33o2K30j03MK7m2l1N0Q6k9j29K65k11J51q5N6j03J05q0K1Q0
6053A22k23j06L27r0n0Q0m9j4j63N3J69j36P9l1J31j04j3N1p1Q4J3j02j9Q9J9
6078D6J71j49J8j05o5J54P5k71J08J14j47n2J42K6lq9k5J47j46on3L14k21Q4K3
6103I0k65K71o5r8J05Q7k4o2K3j73K7J67M9j54o4R8j06J35j55K12m3M8q9n9M0
6128eKL9P8k70P1J66J4m0j61J95q6q8R8Rm3m7J74p8j28M4o5P9O2J58k88R0Q3j37
6156g4J69M1m0k10Q8L3J6m0P0RQ2m2J2j72J34j19J3J80k87J97N0k42m7M18l59
$$ plain form
5977 -14 13 57 68 -94 -10 60 111 -121 51 67 -109 20 52 -67 7 134 -82 -17 55 -56 -89 51 7 -117 74
6002 74 -67 27 -35 32 60 157 107 74 114 -129 22 222 -102 94 132 37 -12 121 -34 -44 24 -84 12 -170 -12
6027 -12 -135 19 28 55 -78 -140 90 -13 -9 18 -24 -55 -5 81 52 -77 188 -23 128 43 99 -4 101 21 42 122
6053 122 -101 -207 120 30 -20 60 11 -3 -166 -113 56 -80 -1 -32 99 -5 -18 33 -38 46 59 -43 -62 27 46
6078 46 217 68 86 -19 -84 70 145 -126 -18 96 -51 -103 39 65 62 -27 -52 95 -51 -57 -110 204 -17 67 90
6103 90 -175 96 31 -67 38 125 101 39 62 -111 -84 83 132 -22 -86 12 -94 41 -114 98 55 103 14 -45 -5
6128 -5 -3 36 114 -156 -85 81 95 55 -106 89 3 -85 13 22 -21 -68 106 28 -100 -56 -121 -42 20 178 -110 -20 63 -74
6156 -74 95 136 96 -114 -26 7 23 -17 53 62 144 102 114 -58 76 -43 -30 150 -137 60 110 -132 -179 239 -120
6181a20J34Q3j17q3K47o6k37J3k6J53jK9K3J00L2Pn6j91p9R7J08n6K8K00k09Q3
6207I6l5j09M7Q0j77K8nR4p6Q5n4RQ7J2nj10O9L7j70J62j27J60Lq6N3K6j94J16
6235A6o5%P2Q4j62K4m3N0K3j2j16O8J4Q4j1j67P8J00r0O4l5J96k35N0J1K8J11
6262A37j00r6J04r8N5J2O4kp2P1j13M4j27J14N2mk54J60k6N8Q0p0R1k4q1K2n2
6289e5m9J02k7J28L8j01L1j8j48J13Q3k4j26O5L5j5M0K2j14p0J21m9J28p0l5L5
6315D0q3r5J24J26k44o8J34J20L2q7m2J44m4j15R0j0K7ll6j59J72j24K22j87K39
6340A73j25Lq2j7p3K05m0o9P1j05J54m6j08PL1J52k28K81j61k6K02k72P2m6k1
6365f8N3o0K8K7l1J50k17R7O3qj99K02R1j58J69j08l9L9N4o5k8m7mJ33Nj83M1
$$ plain form
6181 -120 14 97 -20 -103 144 78 -159 -146 -172 -19 -20 9 32 132 164 171 115 -76 -155 -58 50 -6 22 222 13 96
6207 96 61 -48 -1 79 -98 -70 -75 19 -57 28 -26 -17 70 82 77 -33 36 73 -97 65 -62 98 101 15 68 94 -100 16
6235 16 -49 -49 23 107 -55 -31 -74 -24 -1 -13 -129 -61 -47 37 26 -141 -63 37 -53 11 -24 172 -63 -13 -2 26 137
6262 137 37 -59 45 -53 2 14 78 76 4 75 -38 6 -121 -7 45 41 -213 -53 -79 -21 59 -11 80 56 -25 -3 -55
6289 -55 -104 -2 -29 99 137 36 67 49 -99 14 97 73 -53 12 47 32 72 94 -20 -90 31 -18 110 40 5 40
6315 40 -43 -138 -14 112 -132 -200 -66 54 86 -1 -43 101 57 -58 32 22 49 46 10 -149 23 -101 121 -66 173
6340 173 48 51 -31 -48 -121 84 44 -25 46 -59 95 49 -59 -52 -21 131 -97 184 23 -3 199 -73 -1 -47 -68
6365 -68 -15 -75 -47 -20 -51 99 -118 -21 42 34 -165 37 128 -30 139 31 -8 31 85 20 -8 -55 -59 74 79 -104 -63
6392f3J8K04o6j55M7K5J55k11m4m4J74n1L9j01Q4l9o0K44o8L3j14q0J20j5qJ12
6418A36p4q9o2q4J40j6Q8j15J73qk42K7J09MN%N6K5o4p6LQ6j4qO7j4k4P8l6j37
6448f6R1N2R3N2k33m6J17L8j0j2n1M7J17j73q0K8N1L4r7k9J40o8r8nJ59q8J20
6475H3q5j19J00L2r6J61j8j07p4K8J81l6Jp4Q1q1N7k3j9J6J80j61o1J43k22P8
6501c5J74j5m2l6k4N3q9K4q7Q6l9R9R2l30oL49j26o0l2r6P9J10q8J00m6p3P7j16
6529i7L0R4m0N9q1J55j37k22L28o4m8J15o9j3P6P7k18j5P6Np4J51j78K25j33k18
6555b16K14O0m6r6m0O6J10j22P1J4m8L3NJ09j7j20P9p4m4O9o8n4J22O5j17J53
6581A08k81J97j38J69J4J6J8j15k8J08m9N4J1o4k37P3lK43l3o0J46k09Q4N3j09
$$ plain form
6392 -63 -45 159 93 -62 -15 10 165 -46 -90 -134 40 -11 28 -73 11 -28 -88 156 88 121 7 -73 47 32 24 136
6418 136 62 -27 -89 -173 -33 -49 39 -76 97 89 -153 -126 -17 -13 -8 -8 48 73 9 -67 -64 22 8 0 67 53 29 107 71 -66
6448 -66 25 77 170 222 -11 -57 60 98 88 76 25 72 189 16 -64 -36 15 49 -48 -77 63 -5 -103 -108 51 -37 83
6475 83 -2 -121 -21 11 -85 76 58 -49 -123 -95 86 50 51 -23 58 -23 34 11 -8 8 188 27 -34 109 -113 -35
6501 -35 139 124 82 46 22 75 -14 10 -77 9 -30 69 161 -169 -175 174 48 -12 -44 -140 -61 49 -39 61 15 -58 19 -97
6529 -97 -67 27 -13 46 -35 120 -17 -239 89 25 -23 92 23 10 86 163 -55 -70 6 11 -63 88 -90 135 2 -216
6555 -216 -2 58 12 -84 -124 -58 52 -70 1 15 -33 0 5 114 97 -23 56 -18 -62 7 -61 -115 7 72 -45 108
6581 108 -173 24 -114 55 69 85 103 -12 -40 68 19 73 84 20 -217 -144 -147 96 63 3 149 -60 24 77 -32
6606c2J09O0r7o4R5P6j37m7j27L20k36oP9O7j58O1J7qQ8O3j60K3m2j0R2mn2J20
6634I0oO2p3j24J19K0k05J18J63l4n9k20L58j02o2K5j92J78P9k04Q3o9kN1K01
6659A95l32N6J91k3p4r6NQ7J35j72qk37L97j64J7OM1J64j50j41J96j44q8J72R
6684D2j09j20K49R0j03l4p2j01J26N3j01O9N0j48J18L9j56K19l6J6j99rJ48k5
6708Fj59J74j5R7j69J36J00j82L4M8j17o4O9O9l8K0K5kn3j2L8m7NJ83j60J9P2
6735G7o1l0q6J09n6PL3j00L7k3J34j0n6Q1J1p3j03J79rj08Q2Q0N6k08K1j49K93
6762A28J22k99p3K03q6K0k8J7n5R0l04K66l7J5N5J9r4ml8L6J2J10n2j85l1J16
6788g7K09j03M6r9r3J28nN4k16J58J19k65L16j94qn0R1M4o9J51k29J1J03j08J00
$$ plain form
6606 -32 77 137 40 -24 71 147 10 -37 -164 156 -80 -86 -7 60 -98 -37 -20 -28 60 123 -37 -14 -56 -66 26 22 -30 90
6634 90 84 146 73 -51 68 88 -117 1 164 130 71 -149 209 107 45 70 -122 56 135 -69 14 -55 -57 -6 195
6659 195 -137 -81 110 87 13 -83 -78 9 144 -28 -36 -273 124 -40 -23 -17 24 188 38 -103 93 -51 -139 33 42
6684 42 -67 -187 62 152 49 15 -57 -158 -32 21 -80 -11 39 -109 9 48 -108 111 75 91 -108 -117 31 6
6708 6 -153 21 6 103 -66 70 170 -12 22 70 -47 -111 -42 27 -11 9 34 32 -21 -33 5 -42 -37 146 -14 5 77
6735 77 16 -14 -100 9 -47 -40 -7 -107 -70 -93 41 31 -25 56 67 -6 -109 70 61 -47 35 115 171 -37 -16 -165 128
6762 128 250 -49 -122 81 -5 15 -13 4 -51 39 -265 1 -36 -21 34 53 -41 -45 -83 -47 -35 75 23 -162 -193 -77
6788 -77 132 29 75 -24 -117 11 6 60 -156 2 121 -144 172 -22 -30 -80 11 55 -14 137 -92 -81 22 -86 14
6813A4P8o2l0J9L5n3Nq0M0N3l6J1L3j6NK0j13P0J17j61J1Rj9L7N0J23o4P0j42
6842B4RL0k07K82j56j97L23p7l3jJ47l04K08j45J73J4j36R9k5Q8j06j89R8J33
6866E2J02K6l8j81ql5J46j5r3M1r1PjK1l3J02KJ04J47q1k23L7l8K74k90J20j09
6893e5k1K92j94J6M7j33n2J70k00J75m7R1q9j58K03j51l1J68P4j23N4l2j16K62
6917A50o5p7J85j27j94J55j15J96n4l9J11j76J36j7j35J51j33J37l4l97M94j27
6939B5j43J82J7j83K8J10NO4j15l1L1j6oK5PJ36j15l5n5OK5k2O4J90k83J01j21
6966a09K89j40N5r7N3nN1o9j3l8N0j35J58q9K7J01j1p8j9J52k76K06J0j14J53
6991A12q9m3O4k1J00K6p6M8j5j29J17j41J69j52qn9P5Q6p9J17L4j78K46m19K58
$$ plain form
6813 14 92 30 0 19 54 1 6 -74 -34 19 -17 -6 27 11 16 36 -77 -7 110 -51 -40 -31 -50 -13 37 160 96 166 24
6842 24 33 63 -144 138 -18 -215 108 31 -2 -3 144 -160 48 -97 76 90 -46 53 28 116 10 -179 -81 52
6866 52 154 180 142 -39 -47 -82 64 49 -44 -3 -94 -87 -88 -67 -100 2 4 108 255 174 -49 -12 -50 224 -66 54 -55
6893 -55 -76 216 22 38 85 -48 -100 70 -130 45 -2 89 0 -158 45 -106 -137 31 105 -18 36 4 -112 150
6917 150 85 8 193 66 -128 27 -88 108 54 15 126 -50 86 69 -66 85 -48 89 55 -342 152 25
6939 25 -118 64 81 -102 -74 36 41 105 -10 -41 -10 -26 -32 -7 0 136 21 -14 -69 -63 -38 -60 4 194 -89 12 -109
6966 -109 180 40 95 -2 51 46 97 28 15 -23 27 -108 50 -39 -12 89 78 0 -19 133 -143 63 73 -41 112
6991 112 23 -20 44 23 123 149 73 121 106 -23 94 -47 122 -30 -38 -97 -22 64 -15 102 136 -42 204 -215 43
7016D3j35J29J18j97R2j03M3K6K4Q5j33j6k7M1K9o7N6J9P2o1j12l7J89j21N0j06
7042i9K36j54q4J41Q8o1j78n8P2J44j00L6K47m27J22K28j68l7J4J10k24J46P5
7065F9m0J26j54q6J59n5k3r4J36p4J10k53L32n0m1j6M9j08j28J83J5j2k5Ok4P8
7091H0l1j3o7l0K20k60P2K1j17J04J36k03J03m5k6Q9j35J41p2o2J72j58J67K3
7115A09j65J49o8P4j25Q2n1P8m8R0R5j76q2O9j51M4q7J69N9j48K06p5m1P7j99
7140a15J85j12j36J70J50j44Q0j68K36j46j72K31L2k54J51J33j33r6J70j02Q7
7161D7pJ00o3o5P0o1m0j0J76j0j38kj29J55Q9K0j60J18q4j56K12q4L7m6P5p5N3
7188B2jM2j02m5N3J06N3m0j51J32k5r2L16m50K02m2P4l1J12j37j09O4p9J87n4
$$ plain form
7016 43 -92 37 155 -42 50 -53 -10 16 40 125 -8 -24 -51 -10 19 -48 8 27 99 38 -74 -111 78 -43 7 -99
7042 -99 137 -17 -101 40 128 67 -111 -169 -97 47 -53 -17 230 -197 -75 153 -15 -52 -38 72 -152 -6 69
7065 69 29 155 1 -85 74 19 -4 -98 38 -36 74 -179 153 103 62 46 95 -13 -141 42 57 45 20 26 2 80
7091 80 49 36 -31 -61 159 -101 -29 -8 -125 -21 115 -88 15 -30 -56 33 -102 39 -33 -95 77 -81 86 109
7115 109 -56 93 25 99 -26 56 5 83 35 125 220 44 -38 31 -120 -76 -163 6 65 -83 123 48 7 84 -115
7140 -115 70 -42 -178 -8 142 -2 78 -90 146 0 -172 59 91 -163 -12 121 -12 -108 62 -40 47
7161 47 40 140 77 12 82 21 -19 -29 147 137 -1 -3 -132 23 112 132 -28 90 6 -150 62 -22 15 -31 44 -31 22
7188 22 21 63 -39 -84 -31 75 128 88 -63 69 44 -48 268 -182 20 -22 52 21 133 -4 -113 -49 -128 59 5
7213EQJ2l9k6J55l17K03m8j01J31k8N4j59J04J4o6K14j47o2J60j02J38j16j47
7237a60K82J6k21J59m9J41M6j75r8r4P2l7J80k91J33J64o3Q1j80J88j68L02r7
7260A31j95K4P1p2o2kJ15o1J28O9j35j32K12j51J19Mk57J65J22o6k1R4j41J47
7284A06j57P4L1m6J1L8KN6q6j1P8k45J16j6j22K49j64J18j01J93j46k0P3L0m1
7309B0j0j56J85m8n6J01pK5j74LK03m8k6r1P7P5j38R0J34k61K15k65J77o7J7J28
7335A03k51J69Q8k52K94j33rJ46j00p4QM2q2JJ54k15M7j06K39n3K50j38j30Mk5
7360b3o8J08J89n2j30j13J88q9n9p7K35j98J27O3j33J55m5j49n4J49M7j41J11
7383D1o0M7N0n5j89K57k4j43OJ4j46K51k18K87j25o0J11PJ8n3K1j7j14J22j1l2
$$ plain form
7213 5 13 25 -14 -40 115 -202 1 -47 -148 -17 -45 9 -150 -46 -32 -98 116 -31 -93 67 -35 103 -13 -160
7237 -160 122 138 -83 76 27 168 214 39 -59 -153 -81 -118 62 -229 -96 68 5 86 -94 94 -74 228 131
7260 131 -64 -40 31 -41 -103 -105 10 -51 77 146 11 -121 91 -60 59 63 -194 -29 93 27 6 100 -41 106
7284 106 -51 23 54 8 19 57 59 115 29 18 96 -149 -33 -49 -171 78 -86 32 -69 124 -22 -42 31 61 20
7309 20 10 -146 39 -9 -65 36 29 54 -120 -117 86 38 12 -79 -2 73 -65 25 159 -102 113 -152 25 -42 -25 103
7335 103 -148 21 109 -143 151 18 9 155 55 -19 -11 31 -51 -50 104 -111 -64 -170 69 16 266 128 -2 2 -23
7360 -23 -91 17 206 154 24 -89 99 10 -49 -126 109 -89 38 101 -32 123 78 -71 -125 24 71 -70 41
7383 41 -19 28 78 23 -166 91 67 -76 -70 -56 -202 49 -169 118 -7 -67 44 51 69 16 37 20 -94 28 17 -15
7409a5J32j62J57j89Q4p6Q3m7L1N6j41J13P2l5Kk9k61J41O6M7o9Jk4R9L1k1j51
7436a05m3J50m9J71p6j29j9J42k1n0J5L5pJ1J55j42K5r2m2o9J93j28Q4O7p8M4
7462D2r8J77j51p9Q8M4Q0j16o1J06j9pj16j0K07k4J1k56J57R0j60K53k7k7l9J4
7488G9j3n3K7M7j49J38mj56J93O1k42J20Lj7j8m0pO6j84J22M5L7o0j65K36m6j5
7515E%k1o7Q7mJ22l5j49O8P5j03Q1m5m2o4P0Q1K02k82J07rj04m2J58j78K6Q3o0
7543d0J42m0k5j16K15j21O4n3Jm3j39K08m6J81j27j79l7R0L6O3l1M5Qk9O7j97
7569a03J08R5j41l2O3R9q8l0J22j14l6L8Q9j79N8J45J15j68k8nK3j64J80p1J0
7594a4R2k3k22J85R1k83K00n7Q5p6J51j15j61J42j30J64Q7p5q8J83j31p3K9J00
$$ plain form
7409 -15 117 -45 112 -77 7 -69 14 -33 -2 54 -87 26 98 63 65 36 -225 -84 -18 29 -40 -39 -63 36 67 46 -105
7436 -105 -148 2 -47 124 48 -81 -100 42 21 -29 -14 21 14 25 180 38 63 -29 -71 -140 53 -75 9 76 -2 42
7462 42 -56 121 -30 -109 -21 23 103 -13 -74 32 13 6 -110 -120 87 63 74 -182 -25 65 -95 158 131 104 65 79
7488 79 66 13 40 87 -62 76 72 -84 109 170 -72 48 51 34 16 -24 -31 35 -149 -27 18 55 -5 -170 66 20 5
7515 5 5 -16 -83 4 0 122 87 -62 6 81 -22 59 14 -28 -92 -22 59 261 -21 86 77 -27 -69 89 -89 -63 20 -40
7543 -40 102 62 37 -79 136 15 79 26 27 -16 -155 53 7 188 61 -118 -155 -65 -29 34 3 48 56 27 94 -103
7569 -103 5 100 -41 -73 -10 89 1 -29 93 -21 -57 -19 70 -109 -51 94 209 41 13 8 31 -133 47 -24 -14
7594 -14 78 55 -167 18 109 -174 26 -31 54 -22 129 14 -147 -5 -135 29 116 41 -47 136 5 -68 -39 61
7618F1j18J09J75j57j38R4q0n9k1K19j29m7Q4J06j03Rj49K02m0pn0J15Q5k09p4
7643a22K7O7O6q2j2J3J1J65l1j60J44r3Q9j78Q9K2L6o8j0K01j44L9o5l1M0J8P4
7670A05r5l3K3J7P5k11L20k61J47j06k6n0k7J3K27k85J25P7j19M9J45j23LLk1
7695b8J12j63J22j4R1k02J16l4J9j25L1N9J28j15k0K4m3J13k12K38o9j80K31P
7719H6p5Nl3l7m2O6Q5j33J21p9J28p5o4J7r3L23j46j0k1Qm8k3j50K89j43P2j43
7746a15K28k11K04q5j20J42J22k68L7m7K20r5Q0P1j54k21J09O2jJ32j34o5J17
7769Hp9Q5O5M0k7j57J16n5J61j60j17J41k0o9J09j44J90P1j09q4K07k61P5j17
7793a31K93j06j60K17j13J57j55R5j46kP9o9N1Q7n4q1j8L0O0l2P1N6p6j23J9O0
$$ plain form
7618 61 -57 52 227 70 -68 26 -54 -113 -134 85 -44 -91 -7 99 -4 5 -144 58 18 11 -39 76 161 -48 -122
7643 -122 -95 -28 38 -44 -56 -43 -32 133 102 -58 86 -7 82 -96 -7 15 51 -17 -27 174 30 69 4 -27 13 31 105
7670 105 10 -23 0 17 92 -119 201 -60 87 -19 -45 -95 -122 -109 118 -167 -42 35 -84 -35 110 -13 -10 -7 -28
7695 -28 84 -79 43 29 120 -82 34 0 19 -106 -75 -16 112 -3 -23 1 -42 71 -141 97 28 -152 79 86
7719 86 11 16 -17 -54 -96 -30 55 -78 43 -36 92 17 -47 -30 -123 200 54 44 23 31 -17 -40 -190 99 -44 28 -115
7746 -115 113 -98 106 21 -99 43 165 -103 -66 -113 107 12 92 163 9 -212 -103 -41 -42 90 -44 -109 8
7769 8 -71 14 79 119 92 -65 51 -4 157 -3 -120 21 1 -68 41 -103 87 158 49 -35 172 -89 -14 -131
7793 -131 162 56 -104 113 0 157 2 97 -49 -51 28 -41 10 97 43 -38 -56 -26 34 2 73 129 53 -70 -51 9
7819Ij1j2j1m5O3K5n5m3N5k9J27j1N4r4N6k6j37j21L16j27O6J60j60Q9j34r2R1
7846Cl1k0l0J25j07l6J33J6j45J44j56J25J2o5m9L0J08q7j6L3Q1j69J25M6m5n
7872B0q0l6J76k20RpJ01M1O7o9mN3Lj66rN0J25J03j87O4Pq2MM8P8p0K8j42J20
7901B5j14J33lO8q3r9K85m8k12R0j77l2L21r0Kj17M5j15J56L3L3l8K4p8lp5j9
7928h8k7K13j65MJ23n1NM5j85Q0J85L6j16JQ8r9j19J64j27J64r9N3m7j05L0N4
7954A7pj6J9q9K07k09O8O9r1q7J34l1J8p3R7j23K59j55L7kM7j06k7Q5r1PL8J52
7982A47j92j4O6m1J62j47L2j8l7j0qL6k4N5K9j33N4J43j27j03J82J22l14J80M0
8007H0j44K33j02j17l7Q8k4j25N4%J36rlJ45j41j42J9J11M1n8P1q7K9Pj05L6l6
$$ plain form
7819 9 -2 -14 -25 -70 -7 18 -37 -80 -25 -54 73 62 116 22 78 52 -85 -206 110 -17 49 209 49 138 4 -88 3
7846 3 -28 -48 -78 47 -60 -96 37 53 -92 52 -104 21 33 -32 -81 -51 57 -30 -46 -13 68 -101 24 70 25 20
7872 20 -60 -96 80 -140 -131 -138 -37 4 71 2 -2 51 54 -112 -121 -71 54 157 -30 34 41 -41 -37 11 89 19 47 -95 25
7901 25 -89 44 41 109 26 -73 212 164 -48 42 -135 -167 154 64 66 -51 -6 -121 35 68 101 63 87 9 6 -69 -88
7928 -88 -115 98 -67 -63 60 9 14 59 -126 -46 139 175 59 60 148 49 -70 94 -33 131 32 85 38 -67 -37 17
7954 17 10 -6 13 -76 131 -78 -10 59 -32 -119 15 -16 2 -71 26 -97 162 7 44 42 89 -17 -44 41 -50 -43 -5 147
7982 147 -45 -59 7 -34 128 -19 13 -5 -42 -52 -60 -24 -48 7 36 -97 -43 100 -27 -130 52 174 -140 40 80
8007 80 -64 169 67 -50 -87 1 -23 -148 -94 -94 42 33 30 175 34 -108 -89 22 63 5 76 -11 18 25 -80 -44 -80
8034h0J13J69j69k17K57r9M7p0K25j20j91J20J6K4j56J79j96J51N0j90j1K46k00
8057a02J07k1o5J08j9l53K77J2J55Q0j88J15r5r6m9J55j98J33M5J41k22J17j64
8080a27J88nOL3j07Q2p2o%J58l7o1j24J36k19K05l0Lk12J11J82j01NN8Q0j44r9
8107i7K5P3Oj64J75r2J08J12r9q6J45p0P0MJ7p3p7J49k61O7K3N6j05l3R6O6j17
8134h2J7J14j68Q5j23K00M3K3q1j89K44np8J29j3j15j40J10J22J1q4q2mN0K03
8159A87j67j52J32M8Oj21J27r4R6k91L43q8P6l4j29R0M2J96k97n0J71%k40K37
8183H8j80J58j44M1o2O6J5j5
$$ plain form
8034 -80 33 202 33 -184 73 -26 21 -49 176 56 -135 -15 1 25 -131 48 -148 3 53 -137 -148 98 -102
8057 -102 5 -16 -81 27 8 -345 -68 -56 99 179 -9 106 11 -85 -134 21 -177 -44 1 142 -80 37 -127
8080 -127 61 56 62 95 -12 70 -2 -8 -8 150 113 52 -72 64 -155 50 20 23 -189 -78 104 3 8 66 146 2 -97
8107 -97 -72 1 7 -157 18 -74 34 146 47 -39 106 36 106 110 127 54 -23 126 -135 -68 -45 11 -94 -127 -31 35 -82
8134 -82 -65 49 -119 -34 -157 43 86 109 28 -161 83 78 0 129 116 1 -139 -29 93 104 20 -62 -66 -16 187
8159 187 20 -132 0 48 54 -67 60 -34 62 -229 114 26 102 68 -61 29 71 267 -30 -80 91 91 -149 88
8183 88 -92 66 -78 -37 -99 -33 -18 -33
8191c3
$$ Imaginary data points
##PAGE= N=2
##DATA TABLE= (X++(I..I)), XYDATA
0@%%%%%%%%%%%%%%%qJ6j6J6j6J7k5L2l2M0m8N6o4P2q7R8j08J22j38J57j79K02
37A07k24K49k79L11l45L80m20M65n14N66o24O88p58Q36r21J015j120J239j373
56g22J525j701J909k155K452k820L288l906M762o029Q082j1934K1457q4378j12104
71a82274K63508J7140j51765N5655K2628j22445J06960J59108j94450j55334K34603
82E3334P8901j81972K2732O5884j12183N9405J59169j42653j74861J80548J35378
93A43682j73278m0799J09373p4714n365J52990q3881j79360J28301J61027j30161
104G815r7311J09033r056n4857J19964j8404j79830P4644J75771r1644j27298
115i1173Q3534M6514o8451N6316L7432j49760Q529J83332m6095j49972N6042P9871
$$ plain form
0 0 0 0 0 0 0 0 0 0 0 0 0 0 0 0 0 -8 8 -8 8 -8 9 -16 16 -16 24 -24 32 -32 40 -47 51 -57 65 -73 84 -95 107
37 107 -117 132 -147 164 -181 199 -221 244 -270 296 -328 360 -398 438 -483 532 -588 651 -722
56 -722 803 -898 1011 -1144 1308 -1512 1776 -2130 2632 -3397 4685 -7249 14208 -70170 -182274
71 -182274 81234 98374 -53391 2264 24892 -97553 9407 168515 -25935 -181269 53334
82 53334 132235 -49737 -27005 38879 -73304 -13899 145270 2617 -172244 8304 143682
93 143682 -29596 -70395 38978 -35736 -41101 111889 28008 -151352 -23051 137976 7815
104 7815 -89496 19537 10481 -44376 75588 57184 -122646 -48002 127769 36125 -91173
115 -91173 -7639 38875 -29576 26740 64172 -85588 -77059 106273 60178 -89794 -33752 46119
127D6119n3575L684N2875r0684m0209J55616P320j59704K8345J05555m4962k7102
139a6722N1458m6141n8228J08150N1111j42739j7477J24089k5509n9406N0781
150A9367j5271o1349P0861O5041j07115n2018J16685J1655q5817L7741K0882o6219
162d5557M2189P1855p7658o3537R0821L9767q3768O808M9341n5594P887P7585
174F0139n5203o9722P2033M7013o7354j5934N1902k8556k1805O7226k2565p6119
186e8945N4290N3676n7746k2820M4197p409k8359M1396O723o5712K4140O2633
198D6064m4094l2309M1305J053k5464K2303J3445m2035j079N4306j8941m4500
210b9946L2237J4038k8226J2385J4074k6340p283L4459J223l9227J2579K7687
$$ plain form
127 46119 -7456 -3772 49103 -41581 -81790 73826 81146 -78558 -50213 55342 10380 -16722
139 -16722 34736 -11405 -69633 38517 89628 -53111 -70588 53501 27992 -31414 19367
150 19367 4096 -57253 13608 78649 -28466 -80484 36201 47856 -37961 -220 20662 -45557
162 -45557 -3368 68487 -9171 -72708 18113 57880 -25888 -19080 30261 -25333 -17446 60139
174 60139 4936 -64786 7247 54260 -13094 -29028 22874 -5682 -27487 39739 17174 -58945
186 -58945 -4655 49021 -8725 -31545 12652 5243 -23116 18280 25003 -40709 -16569 46064
198 46064 1970 -30339 10966 12019 -13445 8858 22303 -19732 -20811 33495 14554 -29946
210 -29946 2291 16329 -11897 488 14562 -11778 -19061 15398 16621 -22606 -10027 17660
222A7660k4680j281K1662j8876j0229K4760N463k4967k027K6173q825j6391K1003
235I445m423j9072J9682Q256k0182l350J6560J063j6730P665J0329j8756N314
248d199J6881j6916o130J4847J31r365O60R771o894o287J5835n009j3763J4432
262C994K747j0676L407M258k305m461N337L739j1758M324R300j1827Q26P343o007
277a759r11K696O73k685k668P504k957n949R179k815m776O923j958j600J835m18
293C14K339l533J127M063n929K561K784n575L719l65k733L211l131R19J038l563
309b754L703j840j862M272m172J134K770m223L050j18j854L629k969J123K440
324B329m034L632%l264M055k305j03K037l544L032j146k909M756l470j527M217
$$ plain form
222 17660 -7020 -8301 13361 -5515 -15744 9016 14479 -10488 -12515 13658 4833 -11558 9445
235 9445 5022 -14050 5632 13888 -6294 -9644 6916 7979 -8751 -1086 9243 -9513 -4199
248 -4199 12682 -4234 -10364 4483 4614 -4751 -4091 5680 -1214 -7501 8334 3325 -10438 3994
262 3994 6741 -3935 -528 3730 1425 -3036 2301 6040 -5718 -1394 7906 -3921 -3095 4248 -1759
277 -1759 -2670 26 699 -1986 -4654 2850 -107 -6056 3123 308 -4468 2455 497 -1103 732 314
293 314 2653 -880 247 4310 -1619 942 3726 -1849 1870 1505 -1228 1983 -1148 -229 809 -2754
309 -2754 949 -891 -2753 1519 -2653 -1519 1251 -2972 78 -40 -1894 1735 -1234 -111 2329
324 2329 -1705 1927 1927 -1337 2718 413 310 2347 -1197 1835 689 -2220 2536 -934 -2461 1756
340A756l314K23Q33r97J922l149K069K516o313M122L277o332L180J893k368O35
356d7L54K697l792j487Q439n909m154Q700l496m081N073k90l559j173O219q21
372B673r893P790M443j1314N349N453q798P03P209o45q435K644J0415r501l244
387e151J2674p918o713J3627j099j1640L184J0361n328r266J1296K65j4355J2583
401B520P494j8692J310J5540n584j0934Q017O489j3882M205J6929j8044r043K3913
415A0238k061j7852Q553R425j1682j765J7625r802j9602K3109J0303k7153M024
428f640J8011j3557n769J7591m430k2473J5425K1707k6955r304K8011r006j5893
441a3282K1412J44k5595J1492K7174k1035k1195K9325M105k7081J8284J2363l1763
$$ plain form
340 1756 -1558 -1335 -502 -1499 423 -2726 -657 1859 -4454 -332 2945 -3387 -207 1686 -682 -47
356 -47 307 3004 -788 -2275 6164 255 -3899 4801 1305 -2776 2297 2007 -1552 -2725 3494 2673
372 2673 -7220 570 5013 -6301 -952 4501 -4297 -3594 3615 2970 -5465 -2821 7594 -1907 -5151
387 -5151 7523 -395 -7108 6519 5420 -6220 -3036 7325 1997 -7269 4027 4292 -10063 2520
401 2520 10014 -8678 -7368 8172 2588 -8346 -329 6160 -7722 -3517 13412 -4632 -13675 10238
415 10238 8177 -9675 -1122 8303 -3379 -5144 12481 2679 -16923 6186 16489 -10664 -6640
428 -6640 11371 -2186 -7955 9636 5206 -17267 -1842 19865 -7090 -16394 11617 2611 -13282
441 -13282 8130 8274 -17321 -5829 21345 310 -20885 8440 12545 -14536 3748 16111 -15652
454a5652N965L3027j7905k7801K4739J6143k9610M933K4524k9282p617M0774j1444
467A0794l6861K2167K4116k6605o285K7355j6694k0640L9177L188m5708J5733
479a0263L4954k4997j4904K6944n900k5661K8053J8008m5328n28M5725j8375k8239
492b0511K7461L330k8208J8237K4994l6864j6075M7456k412m1674K2455J8301
504A6490l2067R224L1290k9372k5099M2046J3658m5601P116L3737k7880p222L7417
517B3737j9853l4104L6661K3759m2826q186L9448j4279k3842L5210l036m3289
529c0600K7825L5258l9488j9517L9377j76l1310K3087J4715m2140J0199M6281
541C3511l1710l1977L8683J0877l3837J1706K3167l3403o663M7762j5410m5201
$$ plain form
454 -15652 -9687 23340 5435 -22366 2373 18516 -11094 -6161 18363 -10919 -18536 22238 10794
467 10794 -26067 -3900 20216 -6389 -12674 14681 -2013 -22653 16524 19712 -25996 -10263
479 -10263 24691 -306 -15210 11734 5834 -19827 8226 26234 -19094 -19622 26103 7728 -20511
492 -20511 6950 10280 -17928 309 25303 -11561 -27636 19820 17408 -24266 -1811 16490
504 16490 -15577 -6353 24937 -4435 -29534 12512 26170 -19431 -12315 21422 -6458 -13680 23737
517 23737 3884 -30220 6441 30200 -12626 -20812 18636 4357 -19485 15725 12689 -30600
529 -30600 -2775 32483 -7005 -26522 12855 12679 -18631 4456 19171 -22969 -12770 33511
541 33511 1801 -30176 8507 19384 -14453 -2747 20420 -12983 -19646 28116 12706 -32495
553c2495L3149K4596l7266J460K8837k4168j6657M1276O50m9013J8933L9054l3803
566e447j2878L4731j5052k4356L5174J1075m4901M225M4140k0846k8103L3179
578A0941J24l2098K6107K0379m0231o463M2138p679l4591K2168J5513l2364J0581
591e475K9776l2155j6964L9634J926l4967J0961K3471k3508m941L2104j7511k7949
604b5598L3873J3438l5327K423K6698j5006j3580K5732k631l1471K0873K5048
616B4472l2734q873L0723q182j9450J9811O036k7758P662K9377k2001k0364K9942
629H661K753k5566J4455J2989k3795j47K7639j0689k5387K1344J4072k6095M235
642e531K0252j9260p915K5160l611k4444J1884J8763j9266p053K2233r779j6100
$$ plain form
553 -32495 654 25250 -12016 -10556 18281 -5887 -22544 18732 19382 -29631 -10698 28356 -5447
566 -5447 -18325 16406 1354 -23002 12172 23247 -21654 -17429 26711 5865 -22238 10941
578 10941 11065 -21033 5074 25453 -14778 -21241 20897 13218 -21373 795 16308 -16056 -5475
591 -5475 24301 -7854 -24818 14816 16742 -18225 -7264 16207 -7301 -12242 19862 2351 -25598
604 -25598 8275 21713 -13614 -11191 15507 501 -13079 12653 10022 -21449 -576 24472
616 24472 -8262 -17135 13588 5406 -14044 5767 11803 -15955 -8293 21084 -917 -21281 8661
629 8661 11414 -14152 303 13292 -10503 -10650 16989 6300 -19087 2257 16329 -9766 -5531
642 -5531 14721 -4539 -12454 12706 9095 -15349 -3465 15298 -3968 -11021 11212 1433 -14667
655a4667K1920L839k4026O170J9568j2498j2036J7491R62j8829J3394J2272k2162
668h602n55K1317q427j3675J2589N432j5489M109J5450j4430r347K0529k504j6872
682a0475J0066P940j2670k69J3119o684j2196J4102O134j7450M186J2616j0827
695b408l521J1876k923j0134P398Q557j1667l174J3536n788q218J0775L63j0418
709e746M901P415p322n283R156P64j0070N995N326j0091J869Q000n552m452N983
724H93K417o551R78P102o214k846Q743k885n989N933J780m649k07M348j728m477
740c352N194J343o817L214L855n097OL006r93k059R49K638l432p88M754k848k023
757b450M047j373j372J297M74k75j375K033Q35l320J952J280k827J586M00j427
$$ plain form
655 -14667 7253 11092 -12934 -6764 12804 306 -11730 5761 6723 -12106 1288 13560 -8602
668 -8602 -9157 12160 3733 -9942 2647 8079 -7410 -3301 12149 -2281 -11628 8901 6397 -10475
682 -10475 -409 7531 -5139 -5408 7711 1027 -11169 2933 9067 -8383 -4197 8419 -2408
695 -2408 -5929 5947 3024 -7110 288 8845 -2822 -5996 7540 1752 -6466 4309 4672 -5746
709 -5746 -845 6570 -752 -6035 3121 3885 -6185 -190 5136 -4955 -3086 4914 -638 -5090 893
724 893 3310 -3241 -2263 4839 -1375 -4221 4522 1637 -4352 1581 3361 -1288 -1495 2853 1125 -3352
740 -3352 1842 3185 -3632 -418 3437 -1660 -1654 1352 359 -1700 -751 1887 -1545 -2333 2421 -427 -2450
757 -2450 1597 224 -1148 149 623 348 -1027 1006 1841 -1479 473 1753 -1074 512 912 -515
773e15N08j24M77m53j241K188j220q27J897j311k4P97q38J042p46j42J587j872
791h17P45J281j743Q91K31p22R02q97N66L65j618J500l18j489J723p42o00J229
809D87j316O47k04n03J424j555N23J298j930J215P50j579J422l81m23O36o53R48
827H06l15p87J855j542m86K031j600m29J086p81J94n42M99K23j957K008K66k631
845b102K227L63j964J227N27m30p12P03J743k520K19L072k828l96K778j401j462
862i56J675O90j601r48K950q65l341L680K00l985K382J827k795n64K438M44l497
879b266J473L533m865L88N111l786k016M008K14l545J006L764l138k836N962j056
895A951n826N107K066n791J066M122k790l341M804J445o986K605O058o608j435
$$ plain form
773 -515 -7 -131 346 -107 -1348 840 -380 -1207 690 -621 -645 152 -686 356 -390 -532 1055 -817
791 -817 -72 1209 -534 357 588 -134 768 -129 437 802 -816 684 366 -1123 600 -142 -742 487
809 487 -829 -182 -386 -889 535 -1020 -497 801 -1129 86 836 -743 679 298 -125 511 -142 806
827 806 491 -296 1559 17 -469 1562 -38 -467 619 -162 32 -510 -11 212 -1745 263 529 -2102
845 -2102 125 488 -1476 -249 278 -152 -864 -161 1582 -938 -719 2353 -475 -871 1907 506 -956
862 -956 719 1409 -192 -1140 1810 945 -2396 1284 1484 -2501 -119 1708 -1087 -1651 787 1231 -2266
879 -2266 -793 2740 -2125 -1737 3374 -412 -2428 1580 1794 -1751 -745 3019 -119 -2955 3007 1951
895 1951 -3875 1232 3298 -2493 -1427 2695 -95 -3436 1368 2813 -4173 -1568 4490 -2118 -3553
910c553O935k833m356M500K772o119k06P663m073n544P858L44p596M505M513o928
926b118j264P349j297p804N563M896r312J207Q160o697m008Q575k25q105L188
941a892P274p066l356R925l058q387Q807L173r901J896Q223n173n951Q804J143
956D461j0569N722Q137j1103j890J1161m181p912P376L973j0160J162J1100q009
970g32p455J2620K3j1781O870O707r718j309J0847l589j0650J0081N738j3285
984e633K546J0895r062n038J1841j228j1521O374R118j1256l629J3457n328r906
998h370J1697K497j2995L919J1048q905o783J2214K86j2659Q191Q029j3536l5
1012e402J3465o530r366J0684L612j2210K804J1475j0469n775J4673k677j2736
$$ plain form
910 -3553 3382 549 -3807 693 3465 -2654 -2860 4803 730 -4814 3044 3388 -4208 297 4810 -2118
926 -2118 -3382 3967 2670 -5134 429 5325 -3987 -2780 5380 -1317 -5325 3250 3025 -5080 -1892
941 -1892 5382 -1684 -5040 4885 1827 -6560 2247 5420 -4481 -2585 5638 465 -5486 3318 4461
956 4461 -6108 -386 7751 -3352 -5242 5919 1738 -6174 1202 5175 -4985 -3823 7277 -732
970 -732 -8187 4433 4456 -7325 -455 6252 -3466 -4775 6072 2483 -8167 1914 7652 -5633
984 -5633 -3087 7808 -1254 -6292 5549 4321 -7200 -826 8292 -2964 -6593 6864 1536 -8370
998 -8370 3327 5824 -7171 -3252 7796 -1109 -7892 4322 4608 -8051 140 8169 -5367 -5402
1012 -5402 8063 1533 -7833 2851 6463 -5747 -2943 8532 -1937 -7712 6961 4284 -8452
1025h452Q826O938j1628n57J1630o002r438J1940L588j4456M626J1201j0504l854
1039f142J1593k287j0449P835P702j2584j392J3585o502q943J1448J483j1788
1052f441M927R220r484n399J2386r57j2028Q092O786j2502R04J1826p484p501
1066g655J0323K857j1617L232J0282r686m166J3034l480j0747Q929N719j0943
1079c918k75J0746n373q300J1064J893j2974N532R292j0277l255J0647k417q817
1093f432P003N681j1165L19J1645p044p133J0664N93r700M684O906q012l255J0622
1108E376k129r949Q014M884j0598J855Q441o377m809Q429J127r556L678P828q454
1123b240k582R698l794o953P495K701q464J133P966m859n314Q287K70q586N396
$$ plain form
1025 -8452 374 7312 -4316 -4873 6757 755 -8683 3257 6845 -7611 -2985 8216 -2288 -6142
1039 -6142 5451 3164 -7285 550 8252 -4332 -5724 7861 1359 -7584 3864 5347 -6441
1052 -6441 -1514 7706 -1778 -7177 5209 4252 -7776 316 7102 -5400 -4496 7330 -154 -7655
1066 -7655 2668 5525 -6092 -2860 7422 -2264 -6430 6604 3124 -7623 1306 7025 -3918
1079 -3918 -4193 6553 1180 -7120 3944 5837 -7137 -1605 7687 -2590 -5845 4802 2385 -6432
1093 -6432 571 6252 -4913 -4594 7051 7 -7126 3538 4131 -5569 -885 6021 -1991 -5246 5376
1108 5376 3247 -6702 1312 6196 -4402 -2547 5894 -483 -5292 3137 4264 -5292 -1614 6214 -2240
1123 -2240 -4822 4876 1082 -5871 1624 4325 -4139 -3006 4960 101 -5213 3074 3344 -5242 154
1138A54N263q036o15P516k667n875N414L076p791J565P240o069l622P609r74o046
1154c858L622L794n367j402O596k377n727O120J979o797K225M565m051k067M850
1169B105k5n295K916M157n464o67N640k906l368M241P24m241Q40M066k970k924
1185c171M855j61m829L358K275m072J54L512j628k583K714J855m036P37L685l144
1201d79j455L974j176k317J738J764k494j056L430j246k829L194K33l036J264
1216d91J597j558r41J804M62k679J410J986k840K09K467j606q28J516R8j183J99
1233c78J648j081j184K095l16j942J746J49j230M34N60m04p50M66R56j797M46
1250e82J323j372k6J214p47k29K34L59j69n34J099l09j009J311k32o46O62j10
$$ plain form
1138 154 5417 -2619 -3234 4282 1615 -4260 1154 4230 -3561 -1996 5244 -825 -4447 3162 2188 -3858
1154 -3858 -236 3558 -1809 -3211 3385 1008 -4719 1401 3380 -3417 -1192 3373 -678 -2745 2105
1169 2105 2080 -3215 -299 3858 -1606 -2273 3367 461 -2907 1334 2058 -2183 -1343 2723 -247 -3171
1185 -3171 1684 1523 -3306 52 2327 -1745 -1591 1921 293 -2290 424 2279 -1757 -1020 2665 -479
1201 -479 -1934 2040 864 -1453 285 2049 -445 -1501 1929 683 -2146 1048 1281 -1755 -491
1216 -491 1106 -452 -1393 411 873 -1806 -396 1590 -1250 -1041 1426 -180 -1008 508 606 -577 -378
1233 -378 1270 189 -995 1100 784 -1158 588 737 -493 -59 501 97 -653 -187 769 -1028 -582
1250 -582 741 -631 -657 557 -190 -419 -185 174 5 -529 570 261 -748 563 331 -315 347 237
1268B37K3j93oM13n11j05O84r25J66M25n28K26p9k4K90o09M43J47o80O12l0k31
1290b55K60j9k9J32l28P52n05k95J012q43M5P48p33J92jk94K62m74N00n8o39P02
1312A32j86o47P97k69k02O23l46J49k48K16N39r38M58P29j093M04N76o70O1M23
1332E08k01k61l28Q68p29m58J371r12q37J229l48n40N19K23k27n65P58K83j366
1351a013J100O49j400N13Q34p87p6O31J73r68J91J452j504n23J924j271q34J573
1369F64k14j007J23J051n12j386J884J65k130J308Q58j782L06J392n77j061R21
1386CJ085j747q8K372j719j007K254m64j626J095J051j607o82K263n73k559K432
1403D83Q22k868R87J980j989q64K187J38k587J259K363k848m70L285j773j841
$$ plain form
1268 237 260 67 61 474 -37 -142 542 -383 -217 208 -320 -94 -173 -197 93 -516 -73 74 -606 6 -24 -255
1290 -255 5 -14 -43 89 -239 513 8 -287 725 -118 -73 675 -58 134 133 -161 101 -373 127 69 -570 132
1312 132 -54 -701 96 -173 -375 248 -98 51 -197 19 558 -380 78 807 -286 118 694 24 85 508
1332 508 307 46 -282 586 -143 -601 770 -142 -979 250 -98 -638 -119 104 -123 -688 70 353 -1013
1351 -1013 87 736 -664 -151 683 -104 -180 451 624 -344 -153 1299 -205 -728 1196 -75 -909 664
1369 664 450 -557 -434 617 105 -1281 603 768 -1362 -54 804 -978 -672 720 143 -918 3
1386 3 1088 -659 -747 1625 -94 -1101 1153 689 -937 158 1209 -398 -1080 1183 610 -1949 483
1403 483 1305 -1563 -576 1404 -585 -1449 738 876 -1711 -452 1911 -937 -1407 1878 105 -1736
1419a736K777K94k424L61K568j834j811L374j37l521K409J657l239J28K871j350
1435C87k538K496J362l738J055L501l376j358L673o04k907K274J959l143n87L695
1451B151j464l357M138P63m341J743K909l162j395L783m69l872K452K765m243
1466a599k22M403k773k693L962O21m095J521L610l323k244N158j044m364L852
1481G70K122m770N43M123k244l057M030J022n026J816L893m464j095N019j729
1496I53l856L155K313m310j93M815k747l493N062L00m975K464L555m174j117M636
1512B388j222m355L726K667n496Q50M865l612k488M610r7m541K295L450m328j380
1528b668N290j687m385M228J647n021J268M195l291k582M526M78n010K788L529
$$ plain form
1419 -1736 1041 1335 -1089 -728 1840 6 -1805 1569 1432 -2089 320 1977 -1262 -1134 1737 387
1435 387 -2151 345 1707 -2031 -976 2525 -851 -2209 1464 860 -2047 227 2186 -957 -1544 2151
1451 2151 687 -2670 1468 2231 -2110 -367 2542 -620 -2015 1768 1299 -2573 -121 2644 -1599
1466 -1599 -1821 2582 -191 -2884 1078 1699 -2396 -875 2735 -588 -2832 2326 1282 -3082 770
1481 770 2892 -1878 -1335 2788 544 -2513 1517 2539 -2487 -671 3222 -1242 -2337 2682 953
1496 953 -2903 252 2565 -1745 -1938 2877 130 -3363 1699 1999 -2976 -512 3043 -1131 -2248 2388
1512 2388 1166 -3189 537 3204 -2292 -1442 3423 -189 -2677 1933 1836 -2705 -410 3040 -1288 -2668
1528 -2668 2622 935 -3450 778 2425 -2596 -1328 2867 -424 -3006 1520 1998 -3012 -224 3305
1543C305m938n33N085k162l597L746J774m641N47M503l419k559M909k38m726L062
1559A18K450m070o84M427j419l885L730J820n033J324M154l652j798M244k97l895
1575b466K401K916m312n29M875k263l485M240Q56m326J311L262k879k161M260
1590A700j67m331K658K783m399o3M072k016k829L279J213l837P13L841l100j776
1606b259M299q54l421K790J649l336l56L506j225l099L229J127m093J473K907
1621B337l056j181L380o38l073K115K171l381l55L777k128k315L425K03k996J212
1637e03K386k292j317L162n66k784K469J401l240N60K604j978j477K339L40k500
1653a396R68K291k675q04L039j250j793K208N13j987O6K082j093j743K446K09
$$ plain form
1543 3305 -1633 -2166 2919 757 -2840 906 2680 -1961 -1414 3089 -330 -2889 2020 1782 -2944 118
1559 118 2568 -1502 -2186 2241 822 -3063 667 2487 -2546 -1222 2932 -720 -2518 1726 1429 -2466
1575 -2466 -65 2851 -1461 -1990 2885 622 -2863 1377 2233 -2093 -782 2480 -399 -2560 1700
1590 1700 1533 -2798 -140 2643 -1756 -1819 2253 237 -2592 687 1900 -1937 -1224 2617 -483 -2259
1606 -2259 2040 1186 -2235 555 2204 -1132 -1488 2018 793 -2306 923 2050 -2043 -570 2337
1621 2337 -719 -1900 1480 842 -2231 -116 2055 -1326 -1681 2096 -32 -2347 1078 1281 -1715 -503
1637 -503 1883 -409 -1726 1436 870 -1914 555 1956 -1284 -724 1880 -98 -1575 764 1104 -1396
1653 -1396 -428 1863 -812 -1616 1423 173 -1620 588 1101 -886 -820 1262 169 -1574 872 1081
1669A081k360J400J142j856k6J641n90j457J290P26j658L6J803j434q31J723l21
1686C09j166O72Q10r52o07J585l68j387J301N15j454N61R00p55m87R00J69j004
1704d58K91J231j284k87J347n20r45P90K42p22j93Q48j30j001R06L00j150N45
1722a90M92p04L2M48J87q81O22O36p07l55J183o14m41P21j21l68J15N59m68o04
1742d58J010k41q27O79J47q25L31L99l76k76K97O25q94K14P14o73r7M21l66K8
1762a68L55l2j67n0M46k81n18O96O1o18O40j51l76K74R4j08k30M3J62l23J48K92
1784A89m88J46L50l30Q1k8K21j01j95L29m5l68N00k06p7K80j07lj48p7K35l12
1806a54r7M18l95M1K74l43N6J17k4l3j30L17j65j98M24L3l23L00J50m25K44J00
$$ plain form
1669 1081 -1279 121 1263 -593 -619 1022 432 -1025 265 991 -667 -631 1172 -262 -1093 630 309
1686 309 -857 -185 625 -327 -934 651 283 -1104 197 712 -742 -181 719 -36 -523 377 546 -458
1704 -458 -167 1064 -220 -507 840 320 -625 165 407 -315 -508 340 210 -791 115 415 -735 -190
1722 -190 302 -402 -370 78 265 -616 6 642 -65 -420 763 149 -292 429 308 -60 55 614 146 -458
1742 -458 552 311 -516 163 310 -515 -184 215 -161 -437 -140 485 -409 -195 519 -154 -251 170 -196 -168
1762 -168 187 155 -12 -62 384 103 -415 281 342 -276 364 213 -163 111 205 97 -133 -90 72 -251 -103 189
1784 189 -299 -153 197 -133 -52 -80 141 40 -155 174 129 -239 261 55 -22 258 151 148 0 -77 158 -154
1806 -154 -251 167 -228 -187 87 -256 -200 -83 -107 -140 -270 47 -118 -316 108 141 -182 118 268 -157 87 187
1828A87p6j33P0M17n91PN73o59Q7M69l58j16R0K01l03l46Q16m58l32P75l81k67
1850c28K74K46l73p8N04j3o05O21K73j022O35N10r79O5O73j86m69K0P46p90k67
1871e43J005m35p10R63j32n89L25N37n28m55O58K34j010O28P81j163J39R95l92
1890C08q29Q61K72r59J41J101r97p07J607n11j144J140L20j003j62J212n52j169
1908a071J143N93j715R17R30j322j5J043k44j038P23R02j503l6J849j186j067
1925a097J897j35j447N67J200j187p62J672k38j790J377Q93j868M41J453j309
1941c33o58J476L60j852N81J881j945m37K033p58j708J959N50j884J37J796j138
1958F0j440K204J95k423J430J303j944l16J952p52j668J499J132k398K70K384
$$ plain form
1828 187 111 -22 48 465 -126 -119 454 -205 -118 351 -7 -123 -33 168 -135 -481 335 -123 -455 320 -61 -328
1850 -328 -54 192 -181 -259 245 232 -373 248 521 -501 134 644 -335 -270 403 217 -252 -232 514 -276 -543
1871 -543 462 27 -683 280 148 -441 -116 421 -107 -562 96 330 -680 -52 729 -434 -295 700 308
1890 308 -521 340 612 -347 -206 895 -102 -809 798 287 -857 283 603 -400 -562 650 98 -1071
1908 -1071 72 665 -1050 -133 797 -525 -540 503 259 -779 -56 846 -657 -693 1156 -30 -1097
1925 -1097 800 665 -782 -215 985 -202 -964 708 470 -1320 57 950 -918 -477 976 -333
1941 -333 -991 485 845 -1007 -426 1455 -490 -927 1106 348 -1360 599 1149 -735 -598 1198 60
1958 60 -1380 824 1019 -1404 26 1329 -615 -931 1021 269 -1399 100 1232 -1166 -896 1488
1974A488j955r40K464m13j760J103J340j874n18K432p85k215K275P50k514Q13
1990c09J661j449r11J941Q6k413J049J813k073n84K619j344j535J930M38k009
2006a090K28K192j599j394K625j12k344J617J490k287k25K238q65j753J767R01
2022A389k621P53K118k149q18K414n38j994J401J301k145k20K483j180j939K385
2038F40N22k679J201J753j727q63K135j34k362J706J391k476J46K198j359j459
2054a367J927M33k066O89J835j873r17K444n55k108J917P31k296M06J917j176
2070e9j215J969K90k000O98J731j919l77K025n79j742J420Q55j785p2K173j223
2087A90j471J909J24j870Q94J309j515l87J451j06j879J436J147k098K67J828
$$ plain form
1974 1488 -467 -1407 1057 644 -1116 -13 1327 -547 -1065 1367 582 -1633 642 1392 -1122 -309
1990 -309 1352 -97 -1008 933 1019 -1394 -345 1468 -605 -1189 1430 86 -1449 481 919 -1090
2006 -1090 -862 1330 -269 -1663 962 850 -1494 123 1613 -674 -899 1339 474 -1279 488 1389
2022 1389 -1232 -479 1639 -510 -1328 1086 548 -1446 -45 1256 -889 -1109 1374 194 -1745 640
2038 640 1162 -1517 -316 1437 -290 -1153 982 848 -1514 192 1583 -893 -747 1451 92 -1367
2054 -1367 560 993 -1073 -384 1451 -422 -1339 1105 550 -1558 359 1090 -1206 -800 1117 -59
2070 -59 -1274 695 985 -1015 -317 1414 -505 -882 1143 564 -1178 242 1097 -688 -760 1413 190
2087 190 -1281 628 752 -1118 -224 1085 -430 -817 634 528 -1351 85 1232 -866 -599 1229
2103A229j448p61J422K39j497L88J482j386m05J611k08j601J387M77j497O9J244
2120G45n38j213J406L57j710O59J373j473l18J355m14j168J015P08j348j8J625
2137A043j158r02J728o6j481R60O84j060k90J089r2j212R56P38j708N57Q98r82
2155b98l47J204m30p80M72P29q79m11J444p18p75J188Q6r51L43P06m94n90R20
2174D19j0q94O91M63j009l6Q10m32l40K55M45p22n2P43l80n34O69N3p41N11L64
2195B73l96j94O03j07l80J38M23m85J57L74m27k57N93j10l14N0K98l29j43N42
2215C09k62n03O45O1m19J15R1j50l80M37J81n92L92L32m85K20K38j30j95J10M12
2236D27n07j16N36k99m39O44r8k94K54L1j5m14L13J37l47J96K04n83K66L47l95
$$ plain form
2103 1229 -219 -980 442 681 -816 -428 1054 -332 -737 874 666 -935 452 929 -568 -499 745
2120 745 207 -1006 400 757 -953 -294 1079 -394 -712 643 229 -939 76 784 -564 -582 1043
2137 1043 -115 -1017 711 645 -836 124 808 -252 -542 547 455 -757 199 937 -771 -214 684 -298
2155 -298 -645 559 129 -651 -179 550 -329 -740 704 -14 -789 399 485 -466 -123 583 89 -501 419
2174 419 409 -485 206 669 -340 -376 434 2 -338 -83 362 -360 -412 331 -49 -583 86 139 -602 -91 273
2195 273 -123 -317 286 179 -201 -63 360 -125 32 406 -21 -278 315 205 -109 -59 239 -90 -233 309
2215 309 47 -456 189 250 -169 -54 37 -113 -493 -56 125 -467 -75 257 -228 -8 230 100 -95 15 427
2236 427 -80 -196 340 41 -398 246 148 -146 108 139 124 -290 23 160 -187 9 213 -370 -104 243 -152
2257a52J59j5K65k13j11L19l16m7L95k51r5L52k84n7q1J90N8j00J11j7l30J96
2279b4L1k09K19L3j86n0Q5R8l9m6L02k58M0K25q0j76J76k27K68k60J56R9k62K23
2303A38m9j19J17j2k22Q0J05Jq4m2M0Q1k60M20k84j07K80j68j27J33M0K26l87
2326b00L84P8m33J85K39l18J11K50j36j94LK65l57r3L63k68j88N24l15j71L76
2347A05n8j40j02L90l05p3M66j88j89K83J30l95O5L42o3m05L73J42n76J59M59
2368D20m49r1M86l21l02K44L01m78j26N58k37m15M74Pn92N30K46m18q7N08N0o47
2390c39M30M37q76J50O13m29k84P25j4o30J53M42l86n22Q62l11p15P84J03n45
2410c52Q6M43p3n93O96J55r98O54N25q27j48Q54k60n59O57K39q09J23R46p51n70
$$ plain form
2257 -152 7 -8 257 44 -67 252 -64 -111 284 33 -62 290 6 -51 -132 58 116 16 127 110 -220 -24
2279 -24 7 -202 17 50 -136 -186 -101 -3 -42 -88 214 -44 -4 221 141 -35 141 -86 182 -78 78 177 -85 138
2303 138 89 -30 87 75 -147 -67 38 39 -45 -87 -47 34 -226 194 -90 -197 83 -85 -212 -79 -39 187 -200
2326 -200 184 262 -171 14 253 -65 46 296 160 -34 -31 234 -123 -216 147 -121 -309 215 -100 -271 105
2347 105 47 -93 -195 195 -110 -183 283 95 -94 189 319 -76 -11 331 268 -137 236 378 -198 -39 420
2368 420 -29 -120 366 45 -257 -13 288 -190 -316 242 5 -410 64 71 -521 9 255 -163 -250 258 308 -339
2390 -339 91 528 -348 -198 415 -14 -298 427 413 -217 -64 378 -8 -530 332 21 -694 90 193 -352
2410 -352 -266 177 104 -489 207 362 -636 18 543 -284 -432 422 162 -397 260 499 -310 -187 759 8 -562
2431e62J091j90r33P20M41q28j72P79j43r13Q36L68j237N99Q82j088j80J180l05
2450C45q00M48O13q53j40J013n86o45R68K59j110L77O92o08p34J191j5j242R18
2469I1N82j237J29Q16l88l61O37J55r75M51Q14q81m32J316l57j075Q74M17r77
2488d01K04Q81n38q03J075J53j151K10J094j194j1Q47n4r34N64O45j037o2J204
2507F92p05r81J349O8r95M34R05r40m98J291l58j020J159K33j114K44R57q43m25
2526e47P50K66j231N28R34j045m37J355m76p93Q48K94q48J46Q86o05p28J076K59
2545F32j396P67Q25j124Q9P47l54q75P96N01q74jJ021q61n73J095j02q77L94O72
2565E02q30l54J169k43q99R08K31q91K07P84o11n30Q80J37j141P08N51r72n7J036
$$ plain form
2431 -562 529 339 -594 126 567 -261 -433 346 203 -710 126 494 -743 -144 738 -350 -530 650 345
2450 345 -455 -7 606 -247 -387 626 40 -605 363 622 -488 -111 581 -27 -761 430 415 -827 91
2469 91 673 -564 -435 381 -7 -368 269 424 -551 -100 714 -167 -599 717 360 -715 159 576 -401
2488 -401 -197 684 146 -657 418 571 -580 -370 724 -470 -481 366 312 -622 -58 587 -450 -512 692
2507 692 -13 -994 355 423 -572 -138 767 -173 -671 620 262 -758 401 634 -480 -236 721 -122 -547
2526 -547 203 469 -762 -234 700 -345 -782 573 97 -696 152 446 -402 -256 630 25 -703 373 632
2545 632 -764 3 828 -296 -207 540 186 -689 107 608 -266 -267 754 -107 -680 415 313 -564 -170 502
2565 502 -328 -682 487 244 -655 253 484 -407 -200 584 -27 -557 323 460 -681 27 578 -394 -451 585
2585E85n60m74N46K73p67J32P14n18o05J087k92p77N09N97p20q2O95k60o69P54
2605A68M02j104L00Q27p87k15Q32k89o26M37N60o91k05J016o42o53R22P3q20K97
2625a98O34p65k51O65L12q37K72P02q57J82N18k83m78N33L01o67J24M63l37m13
2645c80O76m7q16O67J40l02k00M11q0m64L87K85p90L37M56n30J3N95m71j77M76
2666A86R5m13j13N54l02l00N08j26k08K00K26m92J24K80n4l72J97J85l53J12L47
2687B81k40j39K46j20j58K4K94l79n5M23j49j38K50J3k12Q7J57o4l72L20J93l01
2709c9L3J91l00o0K26q4R3j77J30o8k65M24j92j80K92r3r7J04L20l26j05J46K30
2732B03l29K00K38l41m4L45j37k18L1R7m4k70K83j86j60M22j63j43K55p3j26J31
$$ plain form
2585 585 25 -449 97 370 -397 -265 449 -69 -674 413 121 -656 -147 450 -270 -352 343 83 -586 168
2605 168 570 -534 -234 593 -194 -409 423 134 -492 -55 505 -186 -391 625 -17 -670 252 325 -495 -198
2625 -198 436 -329 -580 85 397 -440 -168 534 -323 -141 377 94 -384 149 450 -217 -93 370 33 -380
2645 -380 296 249 -567 100 240 -62 -262 149 69 -395 -8 277 -513 -176 280 -250 -237 358 -113 -290 186
2666 186 281 -132 -245 309 7 -293 215 89 -119 81 307 -185 -61 219 165 -207 -10 175 -178 -66 281
2687 281 41 -98 148 28 -130 -106 188 -191 -246 177 28 -110 140 153 -59 28 185 121 -251 69 262 -39
2709 -39 -6 185 -115 -175 51 -33 60 -117 13 -55 -320 104 -88 -268 24 -69 -166 -62 258 -68 -173 -27 203
2732 203 -126 74 312 -29 -73 272 135 -83 -52 45 1 -269 14 -172 -332 90 -73 -216 39 -34 -160 -29
2754b9%k4q7O9P9j27M9K02l52L50J91k53j79K69j5r3n0J26k23M3J23j30L4P8p7
2779b6J06j23j4K6p8J45Q7l19J19J49k23J61j9n3r3RK13j08p7L20k29r3K32j23
2803a1M9q0R0j4j45J27P3l66K64J0j05P8m4j7J21p4J73k04J9J92q5r4K42j35k21
2828a57K48r6O5j43K65o8j40N0J57k87L71j46m24J20J36R6l56L12L9k37J9K99
2850A23j85p8J66L6o0R9J00l42k04O19l1m88L13K32l11p3K91j88j72J14L05l69
2872a03j0L01k26q2J68k01j36M26j26j95J86J28k40j29M53J1n17M58L1l45J25
2893b3K74k30k18L17J06m38M0M90m99N0K44k03j77K05L62m95L4M76k45l63N23
2914B30j39m11L97K33m53L5L46r0n57N01K56o95K55N81m75k44L53M9n37K69K58
$$ plain form
2754 -29 -29 -53 -140 -71 8 -119 -70 132 -220 130 321 68 -111 158 143 50 0 126 -97 -54 69 -61 -27 51 -26
2779 -26 80 -43 -57 -31 -109 36 123 -196 -77 72 -151 10 -9 -62 -155 -146 67 -41 -118 202 -27 -120 112 -11
2803 -11 38 -42 48 34 -111 16 89 -277 -13 -3 -108 -30 -74 -91 30 -44 129 -75 -56 136 51 -43 199 64 -157
2828 -157 91 -5 60 -83 182 114 -26 24 181 -106 265 119 -305 -185 -49 47 -309 3 42 -195 -176 123
2850 123 -62 -140 26 62 2 101 201 -141 -345 274 243 -245 68 300 -11 -84 207 19 -153 -39 266 -103
2872 -103 -113 188 -38 -120 48 -153 -289 137 11 -184 2 130 -110 -239 214 225 -292 166 197 -148 -23
2893 -23 251 21 -197 120 226 -212 -172 318 -181 -131 113 -90 -267 -62 300 -195 -161 315 70 -293 230
2914 230 91 -320 77 310 -143 -108 238 148 -409 92 348 -347 -92 489 14 -230 123 172 -365 -96 162
2935A62m42p8O31l40m05N85m6j93o2L78o2n20N46K04p49L57N42p07K8O03k99m04
2957b71K93L39o21p1O75l38m97Q50q7o67L19N76o71k67P35j01p46P56J95q78K81
2978a96N81m51k33L69K86o30K43M49o34p0P79k13q01O88K83r14J56Q30o11m52
2998e41Q28K1q15M03M47p90M4P92l06n50N61M25q02L3Q29n05n55J053l03q38P28
3019A59K18n35l6O39k52o70P39J62r28K24P39o22k26O42m9o73J91P11q62R7P48
3040D16l26m83O84j45o24K45O97m98k31P54q4r14O26L36q19J36P66m91m96O33
3060A82J79o35j2R34q51j98P07k32n09M95M94p94o4O12k33m49P45m5q48M70N09
3081D57n85j96P91k00n26L03L86o16k81P52l85l85P54j05p21N05K39j75l34O91
$$ plain form
2935 162 -280 -358 273 -67 -472 113 67 -126 -188 190 128 -392 154 358 -391 -34 508 -199 -171 432 133 -271
2957 -271 22 361 -260 -331 344 6 -491 359 272 -395 -76 500 -171 -438 297 196 -550 206 401 -477 -196
2978 -196 385 -66 -299 70 356 -274 -31 418 -216 -286 493 280 -521 167 450 -464 -308 522 -89 -541
2998 -541 287 308 -507 -104 343 -447 -403 389 83 -467 94 519 -283 -250 579 74 -481 572 269 -569 159
3019 159 377 -158 -194 445 193 -477 262 424 -504 -280 459 -163 -389 253 204 -469 -278 433 -429 -332 416
3040 416 90 -393 291 146 -478 -233 464 -34 -265 489 405 -509 117 453 -366 -230 536 45 -451 182
3060 182 361 -274 -286 648 -203 -401 306 74 -435 60 554 -240 -304 308 75 -374 371 326 -522 -52 457
3081 457 -128 -324 467 267 -259 44 430 -186 -467 285 -100 -485 269 164 -557 -52 187 12 -322 369
3101C69j35p62P59K68r10L89L84k18m18M99J38p84L07O05p85o4P08j86n41M93
3121A16J51m37n5L22o9l56M71k6o12L91L64l70j75L45J45n06L47L77n51J6L97
3142B85m78O8L95j24k96M8J75k4l50L28J82n52N59j35k95J11K04j49j87K90M5
3163A00l25K1L68k41j70M04o7j27L2J33j40KL55l01l42N08K5n87L51K38l32l7
3185a32K69l2k07J48J43l87L8M06m32K9K28l2k28N3J14N4k72L72pm29L60J23k11
3208c2N7pJ19k65R0Q2k58J57K91l39n0K47k33P1J11o8j27kL16n1j92J41O9n5J4
3233H6n5j00J65r1K64k26k6J71k47q1L03k47Q8M2j25M4j46L04k51j62K18J26l37
3256b83M56j08j08O0M2j42J06L8L2n3j74J82j43o4K27j30J09q7J29L8j61M9j59
$$ plain form
3101 369 234 -528 231 499 -411 -22 362 144 -274 225 363 -421 -114 491 -294 -358 350 164 -377 116
3121 116 267 -170 -225 97 28 -328 143 117 -495 -104 260 -110 -285 60 205 -301 46 423 -128 -112 285
3142 285 -193 -125 270 146 -150 -102 73 49 -301 27 209 -343 216 81 -214 -103 101 -48 -235 55 100
3163 100 -225 -204 164 -77 -247 157 90 -37 -5 128 -12 -10 345 44 -298 210 235 -352 -1 237 -95 -132
3185 -132 137 105 -102 46 189 -198 -160 246 -186 -157 71 39 -189 -136 -22 32 -240 132 125 -304 56 179 -32
3208 -32 25 18 137 -128 -38 44 -214 -57 234 -105 -155 92 -141 -70 41 -27 -154 -156 160 109 -83 58 127 72 86
3233 86 31 -69 96 5 269 43 17 188 -59 -140 163 -84 4 46 -79 -35 -181 123 -128 -290 -72 54 -283
3256 -283 173 65 -43 17 59 -83 23 61 93 40 -134 48 -95 -159 68 -62 47 -40 89 127 -34 15 -144
3279a44M9K57n9k79K29j53o2p4K55L1k19J55J76j78j56L15l07K32L2l5r5J35L7
3302A42j5l13K36j4k88K40J0j6Q8j79J56l62J72O3j00K62rk54K27J6j16J6N7J03
3326A22l9j82L81j78k03J68O7l57K44L0p6L4J89k14k17K17J90m15J70J97l76K17
3348c1L3n9L2J00P4j20k44L39j15p1J34l1j36J59O4k60M5J44J85k69J16J44l89
3371a56Q1K30n9j82K37K8l43L3K38k32j79M50k46q5K31M3n6O4J81l44j27M14O2
3394B83o32L34M01m03N6J63k33j90J90J10m44J20M83l44k31M31J2k49K70q0m8
3415aj86M16j59m37N67K8m57Q4O35o00PL54j97m07K84K99l29j37N71m87j12N47
3437B83k59j94J67K37k64l21M92O2n88L79K71n48J83L55k49l36M82J21m42n6O40
$$ plain form
3279 -144 -95 162 103 -176 53 -100 -162 -236 19 50 -169 -14 162 -16 -172 143 -164 68 100 65 -30 105 142
3302 142 127 -186 50 36 -252 -12 -2 -18 70 -109 47 -315 -143 -80 -180 82 73 -181 46 62 -54 -38 19 122
3326 122 83 -99 282 104 -99 69 136 -221 23 53 -23 11 200 -14 -231 -14 176 -239 -69 128 -248 -31
3348 -31 2 -57 -25 75 149 29 -215 124 9 -62 72 41 -95 64 128 -132 -87 57 242 -27 89 233 -156
3371 -156 -75 155 96 -86 151 179 -164 -131 107 -125 -304 146 -100 -185 46 89 33 97 278 -66 -193 221 283
3394 283 -349 -15 386 -17 39 202 -31 -221 -31 79 -365 -245 238 -106 -337 94 106 -143 127 47 -1
3415 -1 -187 229 70 -367 200 228 -229 -145 490 -110 -103 251 54 -353 -69 230 -99 -236 335 -152 -264 283
3437 283 24 -170 -3 234 -30 -351 141 203 -385 -6 265 -283 -100 255 6 -330 152 273 -169 -225 415
3458D15o47o7O01j93m12L62K03m18j02N01j37m70N48J35q12M45L18k95m53M99
3478B1J78n40L88M58p85O5O84m69l76O48o3n35K01M47j85n36N56m8o61N55L03
3499C06o68J31N65l10l93M26K97o85J81O18o35j68N68k24k83N25nl54j71P05k18
3520B08o24O29J40o80L01K91o32K10K52p2l71M17K22p13J32O15l88k92O70k77
3540C8m21L64K95k86k65O25j68o77O98J92q13J87M99k62j75L79j3l93J09L99m44
3561a32k29O29m79j92M44P3k60p1M48k78k97O45k18m84M00L24m31oK80l2k21J52
3583F5J79l78j12N61l76j83L11J57l66M9N27m29k61L76J63o63L44M01n99J37L83
3604B86k22k12J72O3l73K47L82l96j16M09k65j51K85Oj79q9K68j65k54M79Np33
$$ plain form
3458 415 -232 -299 302 109 -303 59 262 -156 -258 243 106 -364 184 319 -493 -48 270 -25 -478 21
3478 21 199 -341 47 505 -280 -215 469 0 -376 272 209 -326 -125 322 137 -399 157 109 -552 3 306
3499 306 -362 -231 334 24 -369 57 354 -331 -150 468 -167 -335 233 9 -274 251 246 -108 -279 426 208
3520 208 -416 213 353 -327 -26 265 -367 -157 95 23 -348 69 291 -422 -290 325 -63 -355 315 38
3540 38 -383 -19 276 -10 -275 350 182 -495 203 395 -418 -231 268 6 -169 210 197 -196 -87 312 -132
3561 -132 -361 268 -211 -403 41 114 -146 -217 231 -47 -344 301 83 -401 -1 323 -108 -114 166 134 -87 65
3583 65 244 -134 -246 315 -61 -244 67 224 -142 -93 434 5 -256 120 283 -380 -36 365 -234 -97 286
3604 286 64 -148 24 87 -286 -39 343 -53 -169 240 -25 -176 109 115 -64 -153 115 -50 -304 175 180 -553
3626e53N02K33k94K3J75N3k71K79J24n72M10J34l47l3K65j05%j01L77k69j89M25
3648B66r9m36M71k9l97K16J76q8k24J27P5l53K01K35j96j36K49k7l0Mk1k2k39
3671b77L49R4l09L80J3m05K05J49l52oO4J89k74K12O5j80r8L56k24j90K02L4k06
3694b09Q7M97m49MJ25m0j36K0K24r7J14k80L30l54K52O9j17j03J03r9J18J39j89
3717Im5o9km4J05K09j33j96K21n8M3l7J16j16j07N5J71j73M5J46o7n0KK7jn9k2
3744c0Q9j73R0J08k93J58K7j20J53k11J80m2j85J75q7J21Q7m7L8O8Kr2kM5L2r4
3770cP3p0p5K67k05j83L45j25p8N4qK5p4OM8q9O5K54l22L4J53j64J19oj01P2j39
3797a27L54k71N2J31l0j55l4J46L3j18m6J95j83J04K3l67L61l8j25L5R4j17K9
$$ plain form
3626 -553 -51 182 -112 -89 86 139 -132 147 271 -301 109 243 -104 -137 128 23 23 -78 299 30 -159 266
3648 266 167 -269 202 173 -224 -8 168 80 -144 -17 58 -295 -94 141 -55 -191 58 31 1 5 -16 -38 -277
3671 -277 72 166 -143 237 250 -155 50 199 -153 -159 -95 94 -180 32 97 -83 -181 175 -49 -239 -37 -3 -209
3694 -209 -122 375 -74 -70 55 15 -121 -101 123 26 140 -140 190 -164 88 157 40 -63 40 -59 59 198 9
3717 9 -36 -105 -107 -151 -46 163 30 -166 55 -3 40 3 119 3 -104 -49 122 -51 -6 140 73 23 25 52 51 -8 -30
3744 -30 59 -114 -24 84 -209 -51 -24 -144 9 -202 -22 -64 -249 -74 -161 -40 47 0 38 106 108 16 14 59 91 -3
3770 -3 70 0 -75 192 -13 -196 149 24 -54 0 -8 17 -57 -51 -3 -92 -27 227 -95 -61 92 -72 47 41 -60 12 -127
3797 -127 227 -44 8 139 109 -46 -80 66 99 -19 -65 130 -53 51 74 -293 68 30 -95 -60 34 -83 -54
3820e4J15O0j7k61L60k78o8N05j97j63P7q4J01p2J89k3l45K21J19k99P8J93j65
3843hr9K66j12j98J30Q3k45N0K18j99M7K43l24k2J52J43j27l6R9j19p0K77L2l13
3867a32J76R6k5k36J21O0j48j16M01k47k40L66l6k2L6J11k66N2K52k27j71L58
3889A63p4l15J65J78q3Q2J13m8k44K8L75l39j83L57l14k05N85k03o2j3J57k15
3911i5m1L07j61j60J70K10n23K18K34l40o5N05p0o1m2L51m69k97O42l49k21K58
3933AJ56k91QL53k54k40M66o0l57K18K38m46O7J35j11o0K34J48m81K44K18l79
3955a93M1M77j72l36K07J66k76m4K41l2k75M08q7m76L53P5k44j31M88j55k10J81
3977FJ72k66j0K64k94j20K98M5k41K5L78k05k05N13l61k19L18L0k88K14K4J1k26
$$ plain form
3820 -54 61 121 104 -157 203 -75 -143 362 165 2 79 -5 96 24 213 190 -155 66 185 -114 -36 157 -8
3843 -8 -107 159 47 -151 -21 62 -183 -133 85 -114 -67 176 -148 -170 -18 125 -2 -38 61 -58 -128 149 181 -132
3867 -132 44 140 115 -121 0 60 -88 -204 197 -50 -290 76 40 18 54 165 -101 -49 203 -24 -195 163
3889 163 89 -226 -61 117 34 116 229 181 -63 -35 340 1 -182 175 -139 -344 241 38 -24 -37 120 -95
3911 -95 -136 171 10 -150 20 230 -293 -75 159 -181 -246 259 189 128 86 437 -32 -329 313 -36 -257 1
3933 1 157 -134 -126 227 -27 -267 199 139 -218 0 238 -208 -141 -6 -117 -177 57 205 -276 -32 186 -193
3955 -193 -152 325 153 -183 24 190 -86 -130 111 79 -196 212 125 -351 2 77 -167 -298 190 35 -175 6
3977 6 178 -88 -98 166 -128 -248 50 95 -146 -121 257 52 -153 360 -1 -220 98 128 -160 54 78 89 -137
4000a37K21J89o94M07K47m49j2L88j94k62K99R8k27m4N10k62l81N00o7m12K56
4021b6L46k02j11J98p4k86J97K76m86M0M29m11N4J45o7j94P6K49j69k1K85j44
4043A04l62L10Nj79Q2K63j28j56N8J10j54P5J73l85%L56k59O0oJ26k74J21J93
4066A33k70q9M57j18m13M73n2r9j70L71j39j27J52J19l03K4L24l77J1J66Q9l39
4088a77K82m2j45o2L67k44p3K19Q4k25j20K63m8l16M41j55k07J94J57l19o9L19
4110A24j21j06K98j5j91p3K10k27J3K85r3j46J25l0j28L7M9l2q7J76K8r8o4K65
4134A99m39J54K15j68J6J82J1k26k7K86k77J24O7j01O3N8m6j01j31K71j2k56J33
4157e%j12P5L9k3rn9J74m9k9l0o0J6Q8O3p6J13j20j6J10pp9q2P4R2l01J28MJ23
$$ plain form
4000 -137 84 273 -421 -14 233 -216 -228 160 -34 -296 3 101 -126 -170 340 78 -303 197 130 -282 -26
4021 -26 320 118 7 205 131 -155 42 318 -168 -128 301 -110 -56 89 22 -172 -96 153 -16 -37 248 104
4043 104 -258 52 57 -122 -40 223 95 -61 -3 107 -47 28 201 -184 -184 172 -87 -27 -33 93 -181 -60 133
4066 133 -137 -226 231 113 -300 173 121 22 -148 223 84 -43 109 228 -75 -51 273 -104 -93 73 162 -177
4088 -177 105 63 -82 -144 223 -21 -94 125 209 -16 -136 127 79 -237 204 49 -158 36 193 -126 -195 124
4110 124 3 -103 195 180 -11 -84 126 -101 -88 197 104 -42 83 53 -75 -38 11 -21 -108 68 96 -2 -66 199
4134 199 -240 -86 129 -39 -23 159 170 -56 -83 203 -74 50 117 16 79 137 91 -10 -141 130 118 -138 -5
4157 -5 -5 -117 -42 -3 -26 -35 -94 80 31 2 -28 -88 -72 16 79 3 116 -4 -20 90 83 4 -78 -4 88 -213 -85 -81 42
4186D2K9j00jq3O8L0k6M7K1j00p1J20j10P6r2N3J09j72K77J2j58o0M8j02J10J81
4212A48j29Lp8J77k11K59j6k29n8J90m2k01J53K0j7J29k53R0m5K12J37k68J47
4235A18Pj96o0J95J7j2j96O5J94r2O0k25M3J50m3K5o0rN0j94K87j15n2j46J43
4260d6m3J46k7O8P3j85N7k64J24L3R8J3k6L3k2o5J69j9j75j7L7j44Q1J16k0J20
4286A15j94j19K43j89O4P3lJ42j73O2R9j90JL6R4n9k8LJ75k90J66J26j43r2K9
4311e2J19j52J30nq5j54K08m0l8M0n3j37K79J31j17K2q1J87k62R5J50j55R2j35
4335a3j91L34j78n6J31j51J71k04L0L11j55l4K48m25J25Q3N8k31J56jo6J03K21
4358B66k00k65K43j13RJ16K1n9j30K63p0l2j14J53m05J54K07m9o1O2J59j86j15
$$ plain form
4186 42 71 -29 -30 -113 -45 -15 -41 6 27 -73 -144 -24 -134 -58 -150 -97 12 -160 117 129 -29 -89 -41 -143 -33 148
4212 148 19 22 -56 121 -90 169 153 -76 -134 56 14 -187 -34 -14 -31 98 -155 -65 -110 102 239 -29 118
4235 118 125 -71 -131 64 81 69 -127 -62 132 40 100 -125 -82 68 25 50 -10 -19 31 -163 124 9 -43 -189 -46
4260 -46 -89 57 30 98 171 -14 43 -221 -97 -64 34 47 21 54 32 -33 136 117 -58 -75 -38 -182 -101 15 -5 115
4286 115 -79 -198 45 -144 -80 -7 -10 132 -41 21 120 -70 -69 -33 61 2 -26 -23 152 -138 28 154 11 -81 -52
4311 -52 67 -85 45 40 -45 -199 9 -31 -69 -29 -82 -219 60 191 74 96 15 202 -60 35 185 30 122 -13
4335 -13 -204 130 -48 -104 27 -124 47 -157 -127 184 29 -5 243 -182 -57 26 84 -147 9 8 -58 45 266
4358 266 66 -199 44 -69 -60 56 77 18 -112 151 81 49 -65 88 -317 -163 44 -5 -66 -4 155 -31 -146
4381a46K92j78k17L90o2j09J53mk09J32P0r2j1l0J44l18K5K00k7l3Q8J23l89J53
4405e5J20j22j24L78k09j10K65j24j40K80N0j90k17J97J29k27J46K00m08J24K67
4426B30l94j1K91j7k08qK56k2k88M01k90j92L32M7j59m5K09o1l9m6L7l63L28K69
4450B57m13J20K16j32j41J30K0q8jJ15j41o6J31J08k40K41J20k70j01J92j55m3
4472a41K19J3k05J93M9k45O7J00n6k2J33J20k92J0J69j14kL1M5k15K54j46N6j84
4496a63K43K2r3j22J15j62N0R6R7j47R0m0j04K3K32J2k58K75l07Q2O6K32l37j30
4520b28J84R9j66J81j0r0l9O9J9j70J57Q0j44J31J18j56j04J47j80O3K88j79j88
4543a18J14K45l51O2R5j1p0M9J27j40mJ05O6j82%J49j71J8P7j13J01Q5j56o6J25
$$ plain form
4381 -146 146 -32 -249 141 79 -30 123 119 -90 42 112 20 9 -21 123 -195 -170 30 3 -30 58 181 -208 -55
4405 -55 65 -57 -181 197 -12 -122 143 19 -121 159 209 19 -198 -1 128 -99 47 247 -161 -37 230
4426 230 -164 -175 116 99 -109 -117 139 117 -171 230 -60 -252 80 127 -32 -77 132 71 32 -14 23 -340 -12 257
4450 257 -156 -36 180 48 -93 37 57 -31 -32 83 -58 -124 7 115 -125 116 236 -34 -135 57 -98 -141
4472 -141 78 91 -114 79 128 -117 -50 50 -6 -28 105 225 -67 -57 112 -2 -4 27 72 -143 111 -35 21 -163
4496 -163 80 102 9 -113 2 -160 -110 -14 83 -64 26 -14 -118 -95 137 149 -109 166 -141 -59 7 239 -98 -228
4520 -228 -44 55 -111 70 60 -30 -69 0 19 -151 6 86 -58 73 191 35 -69 78 -102 -39 249 70 -118
4543 -118 -4 241 -110 -48 47 36 -34 15 142 2 -2 103 169 -13 -13 136 -35 -17 60 -53 48 133 -23 -89 36
4568C6Oq7n3K25n0k69J23J28j52L09j6m20J70QJ45j95J19J77l37L0J79j18n8J48
4592D8N6k43J20J42j45j96J66K04l24L23r7l33K17J9L1j23P2J04K7j41K69k05
4614iM9K4j13m0K75j06K9k75J27P5r2J00M6j86M9m2J05K9n0m1J4JJ40J2p8l1j47
4641a35R8Q8J2j94J93N8N1k18J50oj52q5K31l5j59L3J09j79R2L1m3O8N7M9j07
4666GJ77k00K6M3P6j37q5J93J43l77K12j29kP6O9n2r6J58m7n3P2P7j67j46L21
4691A59j10p5J67j93q4J46M2L4j72L09r0k36K21k54J12J56j89K70j31r7L8Q6o3
4714D6j1J10k28M0R2p1j7lo1n2L5P3m4J33M2q1k7J49k31N3n5N7J41M6o9PJK8j24
4743b1%J73k94J6O6p5M4L9QP6j16K7j33K43j17M5M3l1J39j71P1K6J06j11K1j01
$$ plain form
4568 36 42 -45 -98 127 77 -192 -69 59 -93 216 200 -220 -50 -42 103 -92 27 204 -133 -103 76 -42 -100 48
4592 48 104 -139 -19 123 -22 -218 -52 152 -172 151 54 -279 -62 -43 -12 -135 -63 41 68 -73 196 -9
4614 -9 40 64 -49 -89 186 80 109 -166 -39 36 -56 44 90 -96 -47 -89 16 45 -5 -46 -32 -31 109 121 43 12 -135
4641 -135 -37 51 63 -131 62 120 171 -47 103 97 -55 -140 91 56 -103 -70 39 -140 -48 -17 -60 8 65 114 7
4666 7 184 -16 10 53 129 -8 -93 100 243 -134 78 -51 -53 23 92 40 -56 102 55 2 74 151 -16 -162 159
4691 159 49 -26 141 -52 -136 10 52 86 -86 223 133 -103 118 -136 -24 132 -57 213 82 -15 23 109 46
4714 46 35 145 -83 -43 49 -22 -39 -42 -103 -155 -120 -47 -91 42 84 3 -24 125 -106 -53 -108 -51 90 136 67 74 75 103 -21
4743 -21 -21 152 -142 -126 -60 -135 -91 -52 -44 32 -84 -57 -190 53 -64 -19 24 -7 132 -39 32 58 164 53 74 -27
4769b7j01R7k3O0N9jLq0l8J15q4j33K03j1k0L4R3k05k4OR6%m4J26m9L1L6l9k79
4798a99Q0j4J46J3M1Qj15R1L1J1o0Q9M4l55Q6J77j89K39j22j46K12j66K3J37J6
4823G8N0n4o7J00o6q7K00k51J7K01Nj69K5L0P1j29m1Q6j71J30K38k52J7J68j16
4848A3N8lj16r6J77j56J07j37K29j2j14J14Nm5j26K48j4k38J77J42j42q6Q6J3
4872H4j60J71J6k48J19J31j79P9L7o9p3P2k5j3L6J1Pj30L10j48q9P8O5j19o7J41
4898C7J0j01Qm5J62l25L36j13j65L04j41l1P9m8L9k19K55m2j80K7L52l34L05j94
4922b4m9JK17J9l3OO3m18R2L77j82j28P3n7j01J67j07J16k3J50j21l03R9K36k72
4947b02K85j21L4m8L6J75k93P1l3n8N1K07R2l39K39r6J2o2R3L5k34P0J92k56J27
$$ plain form
4769 -27 -128 -31 -54 6 65 64 67 -13 -51 64 -20 -153 50 39 19 53 146 -59 -83 -77 19 19 -25 101 52 83 119 80 -199
4798 -199 -119 -133 13 26 67 75 -40 51 82 93 33 122 166 -189 -103 74 -115 124 2 -144 68 -98 -75 62 78
4823 78 128 74 7 107 41 -46 154 -97 -80 121 126 -43 -18 12 83 -46 -87 -1 -172 -42 196 -56 -39 129 13
4848 13 71 68 -48 -144 33 -123 -16 -153 76 64 -50 64 69 24 -102 146 132 -106 71 213 71 -15 71 84
4872 84 -76 95 111 -137 -18 113 -66 13 50 -19 -92 -20 -45 -58 -22 -11 -4 -134 176 28 -61 17 82 -37 -104 37
4898 37 47 -54 -46 -91 71 -254 82 -31 -196 108 -33 -64 15 -33 6 -213 42 0 -180 -153 199 -135 170 -24
4922 -24 -73 -72 145 164 131 137 200 -218 -126 251 69 -59 14 -43 -144 23 -84 32 9 159 38 -265 -166 70 -202
4947 -202 83 -38 -4 -52 -16 159 -134 -63 -96 -154 -103 104 196 -143 96 0 12 -50 43 78 -156 -86 106 -150 -23
4972b3J83l27Q7P4J21k38O4J38j20p8K04j83J24K3L8j12p0N5L6j03P8K07l29Q5
4996f6R2p0j19K27q0p1J72n6m6j43L00j29j49J73l5q9OJ97k20N6K55j79j10N2
5020c2K05k98J51l2R6q8P8Q5k22R5Q8k02J31j22N0q0J72j18o8O2J80k06o3K72
5044A34k05j49J96J35k66J34P7n2O3j48K4J5Q0K26m33j14M98l85J2L46p8k21K1
5067i0J66m3k88L12L3k17R4P3l1O3m1k5j32J64m8k4j33K43j6j25N9Qj32J14J07
5092I1j82M0l4L0j35J19J36j48M1K48%l38QJ61j2j09J51j12o6J24pq4k1R4N1j60
5118a14J43J03j41L2j08J08j53o4J93j52R4Q6o2l8J04q4P3N3o7l0L9j75Q2K3M4
5143a1KJ6J29o0j5j08or4K99l1o8j04J45j46N0n2J19j37m4M4o3J49N2m7r0j7J22
$$ plain form
4972 -23 160 -167 -80 -6 115 -123 -59 79 -41 -119 85 -98 26 49 87 -25 -95 -40 -4 -107 -29 178 -151 -66
4996 -66 26 -44 -163 64 -16 -87 85 29 -17 -160 140 11 -138 35 0 -89 -83 114 -106 -50 205 26 -84 -32
5020 -32 173 -125 26 -6 90 2 80 165 -57 38 126 -76 55 -67 -17 -97 75 -43 -111 -49 131 -75 -138 134
5044 134 -71 -220 -24 111 -155 -21 56 4 67 -81 -57 -42 38 264 -169 -283 215 -170 -158 188 110 -111 -90
5067 -90 76 33 -255 57 90 -127 -33 40 9 72 31 6 -126 38 -10 -34 -167 76 60 -65 -6 2 -130 -16 91
5092 91 -91 -51 -85 -55 -190 -71 65 -83 -42 206 206 -132 -124 37 25 -84 67 -45 -111 13 6 -78 -99 -5 46 -114
5118 -114 29 132 -9 23 -85 23 -130 -194 -1 -153 -59 27 -35 -73 31 -53 20 73 6 -24 15 -160 -78 -55 -11
5143 -11 -9 7 136 76 61 -47 -53 -147 152 121 53 -51 94 -52 -2 -54 65 -72 -116 -72 -135 14 66 19 -71 -88 34
5170C4J01n1o3m5o1K02k4M8l8j89J35q3o0m0J17O6J6Mk29J54j2P1j98K49k04M7
5196e3Q3j50J73q7L2R7Lk15J89L8j01P9j27J5k3j13K34r7%M5j19K37q7l8r3L2
5222d6j06J05O9m0lp6lK4K51k5l12J87Q8J4J12k25n4J51j28K1j42L7P7P6q9J76
5248A39j62K1O3j53ol1J93o5j71J6J50j00J86o3j27K16r5k8J88j63J55k49K37
5271A51j36P6Qr0%R0j24J9N0P3k20P8M7M6j31oP2j38N5K07j47n2J95k72J42n4
5297f1k6J26j31K66j14j56M1K8Pj12K55l8M4q6j41J06n9L4M5O3j6j03J31j35J6
5322a6k3R1K9j82N1R5p4rMK4Q7O4m6oj96J50J08q0j46K30k9k11J85q0J96k44P6
5349D8nl8p3J49j20J25m6oJ14j96O9k5K1J4M8j52K57k8K4k46q8K71j20L8J84k94
$$ plain form
5170 34 135 84 21 -24 -85 117 93 141 103 -86 49 -34 -94 -134 -17 49 65 69 -160 -6 -18 53 -145 104 -100 -53
5196 -53 30 -120 53 -34 -2 95 98 -117 72 110 9 88 -39 -24 -47 -160 74 -23 -23 22 -97 140 53 15 -78 -46
5222 -46 -152 -47 22 -18 -21 -97 -100 -76 175 150 -162 25 113 127 239 14 -40 111 -17 4 -138 -101 -24 52 -37 139
5248 139 -23 -2 61 -92 -98 -129 64 -1 -172 -156 -6 -106 80 17 -110 106 11 -17 171 8 163 -86 151
5271 151 15 91 99 9 9 99 -25 -6 44 117 -103 -25 22 68 -63 -69 3 -135 -80 127 -20 -72 123 -149 -7 -61
5297 -61 -87 39 -92 174 60 -96 -55 -27 -20 -132 123 85 129 43 -98 8 -51 -17 28 91 75 -28 103 -32 -16
5322 -16 -39 52 81 -101 -50 45 -29 -38 -34 -10 77 141 95 89 -107 43 151 71 -75 155 126 -85 100 20 216 -28 48
5349 48 43 5 -68 81 -39 86 40 34 148 -48 21 -4 17 31 79 -73 184 156 180 -66 -154 117 -3 35 219 -75
5375g5J13R6j33q9J24J8m3p8o4J62l4N7j36J7J13j00R8q6K8L6o7Q1Q8k52P8J20
5401G2q5j26p1K89k05J23R2k15NK05j31j81K00J44p8j29J35M1j51J42j69qL5J00
5425C4N9k7o7p7j34J58P6K3j85K66q4l7J05j32j2P2j23K43l08J55o5J5P9N9k80
5450a87oK39j5l0M7j49L3N5Ro4P6J16j68J45Mo5j50J62j10P7J3k9R5j68P9k0j53
5477a64Q7J46n3J01k6l7j29M1Q2J56l22PJ50j50K03q2k7J64l2o2j78OJ11k51L16
5502E7m4n4j17M7J22Ko4N2o7J39n4M9j62J9K49j69j37J98j46j0J86k09P2kM5j43
5528a41j7M7J44M1K7o4K7L0K6k36J28q6PK02j85Q4J3j4RM9j52j7K08j95R0J43
5554A68j56J25L5k38J3k6j4R1J03m1op8K83l17M8k6N1l5l2j6j9J5L6%j62J97K31
$$ plain form
5375 -75 38 134 1 -88 36 54 11 -67 -131 31 -3 54 -82 -65 48 -52 46 -40 -12 24 -43 38 126 -126 -48 72
5401 72 -13 -139 -210 79 -126 -3 89 -126 -121 84 -47 -228 -28 116 38 -91 44 85 -66 76 -93 -101 -66 34
5425 34 93 66 -1 -78 -212 -54 22 45 -140 126 42 5 110 -22 -34 38 -85 158 -150 5 -60 -45 34 93 -187
5450 -187 -193 46 31 1 48 -101 -68 -13 -4 -68 8 124 -44 101 105 40 -110 52 -58 19 32 3 98 -70 9 -11 -164
5477 -164 -77 69 16 117 91 54 -75 -34 48 204 -118 -111 39 -111 92 10 -17 147 115 53 -125 -119 -8 -259 57
5502 57 13 -41 -158 -111 11 13 -51 1 -66 73 19 68 -94 -75 174 5 -132 66 -80 -90 96 -113 -41 -43 2 -141
5528 -141 -158 -111 33 74 101 37 64 94 120 -116 12 -74 -67 135 -50 34 47 33 42 91 -61 -78 130 -65 25 168
5554 168 12 137 172 -66 -53 -79 -93 -2 101 60 54 -24 259 -58 -10 -36 15 -20 -52 -68 -87 -72 -36 -36 -198 -1 230
5581B30q7j10j5O3k09K09m4k51L03m0m1J08j13kL6k8j05J06j00RJ13O9j80K74
5605A95j51o8J2jk7M8Q2j45O1%P4j12j1P1j44J57J16k97J45K4J5j92K20J11k22
$$ plain form
5581 230 143 33 18 81 -128 81 37 -214 89 49 8 116 3 1 37 9 -96 10 -90 -81 32 101 -79 195
5605 195 44 -24 -12 -13 -40 8 90 -55 6 6 80 -32 -43 28 -116 41 157 -140 5 29 44 -148 72 183 -39
$$ [...]
8191F6
##END NTUPLES=NMR FID
##END=
