##TITLE=1H_Pr T-148
 CDCl3
 8 sc, 
 15.12.2021
##JCAMPDX= 6.0         $$ Bruker NMR JCAMP-DX V2.0
##DATA TYPE= NMR FID
##DATA CLASS= NTUPLES
##ORIGIN= UXNMR, Bruker Analytische Messtechnik GmbH
##OWNER= root
$$ XWIN-NMR		Version 3.5
$$ Wed Dec 15 11:32:47 2021 Russian Standard Time (UT+4h)  she@DPX200
##.OBSERVE FREQUENCY= 200.131346
##.OBSERVE NUCLEUS= ^1H
##.DELAY= (6, 6)
##.ACQUISITION MODE= SIMULTANEOUS
##.ACQUISITION SCHEME= undefined
##.AVERAGES= 8
##.DIGITISER RES= 18
##SPECTROMETER/DATA SYSTEM= spect
##.PULSE SEQUENCE= zg30
##.SOLVENT NAME= CDCl3
##.SHIFT REFERENCE= (INTERNAL, CDCl3, 0, 15.7039)
##AUDIT TRAIL= $$ (NUMBER, WHEN, WHO, WHERE, WHAT)
$$ ##TITLE= Audit trail, XWIN-NMR		Version 3.5
$$ ##JCAMPDX= 5.01
$$ ##ORIGIN= Bruker BioSpin GmbH
$$ ##OWNER= she
$$ F:/spectra/data/she/nmr/H-F/1/audita.txt
$$ ##AUDIT TRAIL=  $$ (NUMBER, WHEN, WHO, WHERE, WHAT)
(   1,<2021-12-15 11:30:45.28 +0400>,<she>,<DPX200>,
      <created by zg, POWCHK disabled, PULCHK disabled
       configuration hash MD5:
       00 E9 B6 7A A2 85 ED C7 34 08 36 98 17 FE 4E 26
       data hash MD5: 16K
       6D 01 F1 3F C1 84 85 E7 5E 7A 52 AF C8 8F 84 F1>)
$$ ##END=
$$ 
$$ hash MD5
$$ A5 EF 72 45 64 40 85 6A C3 17 5F 16 76 19 E0 3E
##$RELAX= 
##$RELAX= 
##$RELAX= 
##$RELAX= 
##$RELAX= 
##$RELAX= 
$$ Bruker specific parameters
$$ --------------------------
##$DU= <F:/spectra>
##$EXPNO= 1
##$NAME= <H-F>
##$PROCNO= 1
##$TYPE= <nmr>
##$USER= <she>
##$AMP= (0..31)
100 100 100 100 100 100 100 100 100 100 100 100 100 100 100 100 100 100 
100 100 100 100 100 100 100 100 100 100 100 100 100 100 
##$AQSEQ= 0
##$AQ_mod= 1
##$AUNM= <au_zg>
##$AUTOPOS= <>
##$BF1= 200.13
##$BF2= 200.13
##$BF3= 200.13
##$BF4= 200.13
##$BF5= 200.13
##$BF6= 200.13
##$BF7= 200.13
##$BF8= 200.13
##$BYTORDA= 1
##$CFDGTYP= 0
##$CFRGTYP= 5
##$CHEMSTR= <none>
##$CNST= (0..31)
1 1 145 1 1 1 1 1 1 1 1 1 1 1 1 1 1 1 1 1 1 1 1 1 1 1 1 1 1 1 1 1 
##$CPDPRG= <>
##$CPDPRG1= <>
##$CPDPRG2= <>
##$CPDPRG3= <>
##$CPDPRG4= <mlev>
##$CPDPRG5= <mlev>
##$CPDPRG6= <mlev>
##$CPDPRG7= <mlev>
##$CPDPRG8= <mlev>
##$CPDPRGB= <>
##$CPDPRGT= <>
##$D= (0..31)
0 1.2 0 0 0 0 0 0 0 0.06 0 0.03 0 0 0 0 0.0002 0 0 0 0 0 0 0 0 0 0 0 0 
0 0 0 
##$DATE= 1639553444
##$DBL= (0..7)
120 120 120 120 120 120 120 120 
##$DBP= (0..7)
150 150 150 150 150 150 150 150 
##$DBP07= 0
##$DBPNAM0= <>
##$DBPNAM1= <>
##$DBPNAM2= <>
##$DBPNAM3= <>
##$DBPNAM4= <>
##$DBPNAM5= <>
##$DBPNAM6= <>
##$DBPNAM7= <>
##$DBPOAL= (0..7)
0.5 0.5 0.5 0.5 0.5 0.5 0.5 0.5 
##$DBPOFFS= (0..7)
0 0 0 0 0 0 0 0 
##$DE= 6
##$DECBNUC= <off>
##$DECIM= 32
##$DECNUC= <off>
##$DECSTAT= 4
##$DIGMOD= 1
##$DIGTYP= 9
##$DL= (0..7)
0 120 120 120 120 120 120 120 
##$DP= (0..7)
150 150 150 150 150 150 150 150 
##$DP07= 0
##$DPNAME0= <>
##$DPNAME1= <>
##$DPNAME2= <>
##$DPNAME3= <>
##$DPNAME4= <>
##$DPNAME5= <>
##$DPNAME6= <>
##$DPNAME7= <>
##$DPOAL= (0..7)
0.5 0.5 0.5 0.5 0.5 0.5 0.5 0.5 
##$DPOFFS= (0..7)
0 0 0 0 0 0 0 0 
##$DQDMODE= 0
##$DR= 18
##$DS= 0
##$DSLIST= <SSSSSSSSSSSSSSS>
$$ [...]
##$SUBNAM2= <"">
##$SUBNAM3= <"">
##$SUBNAM4= <"">
##$SUBNAM5= <"">
##$SUBNAM6= <"">
##$SUBNAM7= <"">
##$SUBNAM8= <"">
##$SUBNAM9= <"">
##$SW= 18.0517287032376
##$SWIBOX= (0..15)
0 0 2 0 0 0 0 0 0 0 0 0 0 0 0 0 
##$SW_h= 3612.71676300578
##$TD= 16384
##$TD0= 1
##$TE= 0
##$TE2= 300
##$TE3= 300
##$TEG= 300
##$TL= (0..7)
0 120 120 120 120 120 120 120 
##$TP= (0..7)
150 150 150 150 150 150 150 150 
##$TP07= 0
##$TPNAME0= <>
##$TPNAME1= <>
##$TPNAME2= <>
##$TPNAME3= <>
##$TPNAME4= <>
##$TPNAME5= <>
##$TPNAME6= <>
##$TPNAME7= <>
##$TPOAL= (0..7)
0.5 0.5 0.5 0.5 0.5 0.5 0.5 0.5 
##$TPOFFS= (0..7)
0 0 0 0 0 0 0 0 
##$TUNHIN= 0
##$TUNHOUT= 0
##$TUNXOUT= 0
##$USERA1= <user>
##$USERA2= <user>
##$USERA3= <user>
##$USERA4= <user>
##$USERA5= <user>
##$V9= 5
##$VALIST= <valist>
##$VCLIST= <CCCCCCCCCCCCCCC>
##$VD= 0
##$VDLIST= <DDDDDDDDDDDDDDD>
##$VPLIST= <PPPPPPPPPPPPPPP>
##$VTLIST= <TTTTTTTTTTTTTTT>
##$WBST= 1024
##$WBSW= 4
##$XGAIN= (0..3)
0 0 0 0 
##$XL= 0
##$YL= 0
##$YMAX_a= 296698
##$YMIN_a= -311273
##$ZGOPTNS= <>
##$ZL1= 120
##$ZL2= 120
##$ZL3= 120
##$ZL4= 120
##$ABSF1= 10
##$ABSF2= 0
##$ABSG= 5
##$ABSL= 3
##$ALPHA= 0
##$AQORDER= 0
##$ASSFAC= 0
##$ASSFACI= 0
##$ASSFACX= 0
##$ASSWID= 0
##$AUNMP= <proc_1d>
##$AZFE= 0.1
##$AZFW= 0.1
##$BCFW= 1
##$BC_mod= 2
##$BYTORDP= 1
##$COROFFS= 0
##$CY= 11.3945322036743
##$DATMOD= 1
##$DC= 2
##$DFILT= <>
##$DTYPP= 0
##$F1P= 2.36226072786647
##$F2P= -0.459571619588291
##$FCOR= 0.5
##$FTSIZE= 0
##$FT_mod= 4
##$GAMMA= 1
##$GB= 0.15
##$INTBC= 1
##$INTSCL= 1
##$ISEN= 128
##$LB= 0.24
##$LEV0= 0
##$LPBIN= 0
##$MAXI= 10000
##$MC2= 0
##$MEAN= 0
##$ME_mod= 0
##$MI= 1.114404
##$NCOEF= 0
##$NC_proc= 0
##$NLEV= 6
##$NOISF1= 3.799351
##$NOISF2= 2.8
##$NSP= 1
##$NTH_PI= 0
##$NZP= 0
##$OFFSET= 15.70392
##$PC= 1
##$PHC0= -15868
##$PHC1= 6.600789
##$PH_mod= 1
##$PKNL= yes
##$PPARMOD= 0
##$PSCAL= 0
##$PSIGN= 0
##$REVERSE= no
##$SF= 200.130013532006
##$SI= 16384
##$SIGF1= 3
##$SIGF2= 2
##$SINO= 400
##$SIOLD= 16384
##$SREGLST= <1H.CDCl3>
##$SSB= 0
##$STSI= 0
##$STSR= 0
##$SW_p= 3612.71676300578
##$SYMM= 0
##$S_DEV= 0
##$TDeff= 0
##$TDoff= 0
##$TI= <>
##$TILT= no
##$TM1= 0
##$TM2= 0
##$TOPLEV= 0
##$USERP1= <user>
##$USERP2= <user>
##$USERP3= <user>
##$USERP4= <user>
##$USERP5= <user>
##$WDW= 1
##$XDIM= 8192
##$YMAX_p= 0
##$YMIN_p= 0
$$ End of Bruker specific parameters
$$ ---------------------------------
##NTUPLES= NMR FID
##VAR_NAME=  TIME,          FID/REAL,        FID/IMAG
##SYMBOL=    X,             R,               I
##VAR_TYPE=  INDEPENDENT,   DEPENDENT,       DEPENDENT
##VAR_FORM=  AFFN,          ASDF,            ASDF
##VAR_DIM=   8192,          8192,            8192
##UNITS=     SECONDS,       ARBITRARY UNITS, ARBITRARY UNITS
##FACTOR=    0.0002768,     1,               1
##FIRST=     0,             0,               0
##LAST=      2.2672688,     0,               0
##MIN=       0,             -311273,         0
##MAX=       2.2672688,     296698,          0
$$ Real data points
##PAGE= N=1
##DATA TABLE= (X++(R..R)), XYDATA
$$ [...]
1823D62p17J86M57k47l38j48N88m90m30J096o31n94J401n49p24O81L18m09n43
1842f31R73pj172J378K38j443O75Q78r16l43P64Q1r62N39P71j611O4J945j500
1861b79p50J437j67j117P18P92j304m30K038q25j538J794K68j811J130J242j579
1878c81m93J930k32k049J385J369k593O89J814j884p10K196j93k299J174J716
1894A439k132m02K664j717j570K773n0k557J156J967k120p98K746o63k655K961
1910A042Q56l664J366K350k225r57K519n23k648K046J957l689M10L342k467j747
1926b032L085r2l075J880K335l155q25M002j532k971L526O77l798J531K759k845
1942e30j377L894q63l440K862K115m426P61L528k884j790L563j13l851K494K711
$$ y = [462, -255, -69, 388, 141, -197, -345, 243, -247, -677, 419, -212, -806, 595, 46, -678, 3, 321, -88, -631, 342, 335, -837, 541, 779, -664, 11, 889, -27, -370, 394, 475, -487, 52, 823, -788, -724, 1221, -279, -1029, 408, 241, -876, -158, 634, -670, -1100, 938, 113, -1425, 369, 637, -1174, -44, 1198, -381, -874, 1056, 824, -1225, 160, 1529, -1064, -375, 1439, -445, -1155, 1041, 848, -1451, -277, 1439, -693, -1095, 1569, -148, -1718, 1055, 1005, -1552, -396, 1571, -549, -1347, 1399, 736, -1919, 1042, 1898, -1766, -400, 1950, -275, -1232, 1287, 764, -1884, 162, 2119, -1570, -1160, 2182, -285, -2032, 1053, 961, -2114, -234, 2101, -1054, -1879, 2123, 591, -2380, 1146, 1823, -1975, -444, 2315, -530, -1907, 1987, 1124, -2316, 546, 2661, -1765, -1004, 2524, -360, -2150, 1413, 1300, -2551, -57, 2654]
1958B654m291n99M590k061l025L916L43l994J973L302l816j418M831j151l988
1973b734L552J673m653J600L768l864k076M636J21m677K521K608m413L32M586
1988B980l441k869M833P10m744J436L505l582p44M681k307l962M722J790n181
2003b173Q98L826k812j701M353j256m627M147L016n542l31M824k486k207L762
2018A691n59m472L185L962n279j718N465j303l462L939n0m356K416M323m602k670
2034c490N567k18m240L008J332m574J950M620m146l353M707J135m366J764K497
2049B193m340Q20M860l636l741M634J756m157M50K989l229l98N042k552m536M568
2065G23K620m437m31L392k229j233M097j193n005L591L711m661j015L468j689
$$ y = [2654, -1637, -2236, 2354, 293, -2732, 1184, 1527, -2467, -494, 2808, -1008, -2426, 2405, 1254, -2734, 818, 2491, -2162, -562, 3206, -658, -2734, 1902, 2023, -2654, -133, 2475, -1938, -1606, 2980, -461, -3330, 1503, 2213, -2531, -1095, 2410, -1172, -1916, 2765, 458, -3504, 1218, 3008, -2173, -1275, 2551, -261, -1962, 2391, 1135, -3492, 655, 3671, -1871, -2202, 2622, 136, -2071, 1691, 1132, -3340, -155, 3807, -1472, -3190, 2275, 972, -2490, 1449, 1399, -2957, -541, 3782, -820, -3490, 2077, 1859, -2381, 627, 1959, -2615, -665, 3955, -191, -3544, 1163, 2298, -2068, -304, 2193, -2147, -1327, 3533, -103, -3844, 790, 2546, -1611, -1161, 1828, -1401, -1799, 3243, 691, -3845, 723, 3343, -1094, -1525, 1867, -362, -1595, 2502, 1309, -3696, -105, 3606, -1055, -2070, 1398, -291]
2080b91j312L550o69m643K538M361m127k107L966q28k111L372l96l877J867M065
2096C358l003l147L746M12k900K300P70l662J050L876k192l416L000J709l033
2111a132R83J814l789M96M314k045l393K523K079k289j58J903k374n47M188j663
2127I10l463K417K250k431l46J609j235j143L243l41l907J876K611k324r57K063
2143H32j192q42K156M33l364O76L308j995j446J980m34j087J784L00k425J00K970
2160A754r87k249J756N11j629J509O08k402K57K112n43j881J032R23j645Q59R91
2177I76j958j15K195n79j713P61J085q73k3J079j309n61K106l09j798R17R64p55
2195I0k85Q01n71p82J376M42k000N41R76p00l63P50m99n06P69O39j257o9J524
$$ y = [-291, -1603, 1947, 1278, -3365, -827, 3534, -593, -2700, 1266, 438, -1673, 1699, 1303, -2574, -707, 3358, 355, -2792, 954, 1366, -1534, 766, 1536, -2126, -1076, 2800, 608, -2808, 192, 1901, -1132, -149, 1665, -2124, -1628, 2686, 641, -2752, -229, 1850, -439, -597, 1306, -1068, -1615, 2573, 910, -2553, -136, 2114, -317, -663, 946, -289, -1432, 1811, 1470, -2437, -561, 2050, -274, -1231, 832, -360, -1202, 954, 1387, -1977, -1301, 2007, 12, -1434, 546, 112, -975, 809, 1109, -1316, -1216, 1754, 767, -1482, 274, 785, -844, 665, 1273, -1129, -872, 1240, 697, -1184, -152, 771, -874, -15, 976, -982, -1097, 1098, 519, -1194, -433, 652, -221, -244, 835, -474, -1035, 1071, 762, -1036, -119, 845, 90, -195, 606, 35, -747, 629, 1071, -929, -388, 588, -112, -475, 275, -224, -730, 39, 678, -579, -648, 876]
2214H76p20n98O28j65l82O26K76o76n52J120K19j041N73J39q06O09K35p46J13
2233b72O73j00p19J70N07n01o0O99p08j39N55rl99J14L81k30k28O81m16m02P57
2254C54j44l85L83J04k0m23J72J52n05L37K42o61L57L11m33n3M7J00j64n6N43
2275B58l41l35O55k86j51N08l70L0P1N4N1l54M24Km14K64L58o05L03l1k00N3j73
2298b29M57m00m5L87l27KK12k06k6K18P6j67j64K93j49j86M19L7l38M50l05q6
2320g7J55J84j74l13K78L08p64K56L07n65L68K34l45k53L39K45m98J15O40p49
2340c09J51O80o93j80N78M0k22j0L32m70j02Q47m37r31Q85J84n01p5L52k89o4
2361b34N71k06r01O92P19r79K4O69p58J62P31l79p14L94J090r54n13J146o80k40
$$ y = [876, 156, -442, 186, 21, -361, 265, 541, -135, -687, 433, 652, -389, 184, 323, -483, 126, 361, -385, -272, 401, 301, -418, -248, 259, -242, -302, 397, -311, -450, 105, 96, -303, -189, 192, -38, -266, 415, -1, -403, 354, 210, -175, 208, 312, 292, -131, 41, 193, -312, 25, 267, -394, -37, 274, -159, -212, -165, -65, -229, -285, 258, -83, -418, 237, -49, -200, 308, -62, -32, 39, 93, 144, -210, 214, 216, -198, 66, 424, -181, 122, 91, -109, -56, -229, 228, -172, -217, 170, -157, -155, 57, -149, -175, 43, 119, -48, -212, 81, -68, -254, 165, 202, -136, 314, 9, -77, 78, 262, 88, -225, 53, 361, -403, -147, 160, -405, -37, 197, -148, -401, -62, 183, -315, -200, 440, -309, -158, 522, -171, -351, 227, 267, 45, 35, 367, -103, -205, 642, 205, -726, 159, 343, -158, -233, 119, -170, -234, 337, 131, -770, -78, 641, -338, -314, 355, -403, -241, 490, 111, -603, -209, 881, -73, -586, 560, -120, -360]
2381c60J091l00j198P15J008q94q89J179p4q20R83qj424P65J324j197j058J122
2399c5M62q93M52P34j729M23J955j218j348J459L92j017N45O30j290k32K082j015
2417C57j712J510P01j254L82O16j483J47J861o15j967J170J566j715O9R98j318
2434f87j25K033k53k382R98J834j421o69J529r85p12K240k30k597Q01K032j088
2451C18j142J424l76j374K075J63k771N97K426j093j378J166J79j100J426Q68
2467A408k697R7L058j306j886J656K31j276J066R33k278n15L183o97k575J599
2483AQ86j474N78J102k042p01L039j35k919J267J582j677K05J499j825p73K668
2500A281J66k710M04K203j309p28K027j454j353K728K29k684m8K481j073j106
$$ y = [-360, 731, 431, -767, -52, 956, 62, -827, 352, 278, -542, 441, 433, -991, -226, 1098, -99, -1157, -35, 427, -466, -14, 720, -1009, -586, 1369, 151, -1197, 262, 654, -363, 182, 812, -478, -710, 1372, 357, -1355, 155, 856, -398, -16, 600, -883, -736, 1125, 510, -1457, -287, 1279, -436, -367, 631, -687, -812, 1221, 968, -1414, -416, 1418, -3, -672, 857, -128, -840, 1400, 1170, -1427, -626, 1406, 318, -824, 600, 224, -1150, 925, 1088, -1683, -1086, 1340, 247, -1131, 35, 214, -886, 540, 1408, -1289, -1192, 1866, 560, -1326, 330, 561, -715, 351, 1284, -994, -1509, 1674, 977, -1598, 1, 887, -587, -9, 1093, -949, -1650, 1389, 1254, -1665, -398, 1184, -493, -288, 1211, -614, -1387, 1281, 1447, -1263, -859, 1344, 35, -693, 1334, -120, -1473, 1255, 1484, -1200, -1248, 1233, 160, -946]
2516i46J587l90j919K341J060l090M6K477p20j445J366J92j899J617J557k884
2532a050k41K632n92j781J379L47j678J148J452k274j136L072l6k459J206O69
2548F58j632P56J516j691j358K643N10k550P31J434j811K50J913j438j390K081
2564F22O06k057J26J797j191p07K119j057j783K186O81k177j04J828r11r10J643
2581G11k34j955J528J299k333j23J936o71j113J509J23j615P34J672j915m37J792
2598I08m83j087Q98L53j355N63J388j149j289J938q2j662J335K51j219J25J380
2615H13o42j283J472M20j633N64J284j569o1J435n75j104J056P05j495J21J513
2632A021j163o61J475l46j167R13P47j048l66J308o09r26J168K14j363R08N05
$$ y = [-946, 641, 251, -1668, 673, 1733, -1357, -1311, 1166, 446, -999, 367, 559, -1340, 277, 1834, -1050, -1291, 1341, 749, -1032, 347, 694, -984, 164, 1616, -658, -1794, 1278, 1242, -1217, -11, 658, -974, -218, 1298, -393, -1751, 892, 1402, -1148, -417, 1017, -794, -544, 1369, -69, -1459, 622, 1228, -829, -703, 1094, -97, -804, 1315, 258, -1525, 661, 1342, -835, -939, 889, -22, -932, 711, 477, -1478, 50, 1349, -984, -1107, 829, 158, -955, 554, 677, -938, -204, 1468, -447, -884, 908, 425, -662, 236, 589, -766, -203, 1185, 36, -1253, 685, 603, -1059, 276, 527, -692, -567, 813, 171, -1112, 360, 780, -853, -289, 995, -574, -635, 800, 225, -879, 177, 882, -613, -492, 1021, -142, -803, 672, 326, -841, 72, 819, -229, -595, 713, 104, -822, 346, 560, -803, 105, 610]
2649F10r67n3R23m29m93N84L11r45J76J126j144j88R69j58q57P02L68q37J9R08
2669F25p03o42J127j83r63O21N98q30l3O35k14o66N86M60j040L79O29n34l4N24
2689C42jo15M15L18n63k51P90n20l64O97r2n32J32M15k85k20N82Q7p39L99J02
2710I7n99M12K98m91P9M39o7l98K47L92o04Q2N50l80k46M96k78j36j9L28q2m18
2732b98L07m8k91L96m3k18N3K49K0m53K03L35m24K09K80l85q1M30l00M5l5J72
2754A23j14Q1J72j02k00L29l52r3L57k49N1n1J13q7l16L40K70n42L71J8k53L3
2776a01mj6K3J70J01k07j10M67l07j26M33l58J77Kn9J8o8R4j07k78L18j14k04
2799b56L99rk77j00K61j50j38K87j8k02K10J78k89K42Kj21L4J7J23l05l4M38l66
$$ y = [610, -357, -410, 513, 84, -409, 175, 486, -459, -283, 843, -301, -489, 480, 322, -535, 167, 535, -302, -283, 625, -78, -720, 407, 224, -739, -118, 480, -350, -383, 252, 38, -628, -42, 418, -622, -243, 386, -148, -182, 342, 341, -274, 141, 459, -104, -355, 435, -85, -449, 248, 156, -376, -244, 171, -114, -334, 248, 335, -404, -5, 97, -502, -90, 208, -283, -204, 235, 168, -230, 17, 409, -195, -113, 437, 57, -189, 307, 29, -107, -126, 202, 120, -298, 9, -39, -330, 66, 23, -195, -142, 107, 127, -326, -123, 212, -212, -3, 277, -108, -189, 241, -59, -14, -49, 123, 9, 90, 262, 160, -40, 289, -63, -156, 201, -48, 3, -48, 65, -22, -338, 2, 272, -270, 101, 119, -134, -101, -105, -121, -98, 72, 173, -34, -144, 323, 16, -110, 323, -35, 142, 144, 85, 103, 35, 129, 22, -256, 62, -52, -256, 143, 134, -143, -243, 18, -132, -270, 17, -1, -203, 7, 185, -104, 138, 140, 19, 53, 70, 193, -112, -146, 292, -74]
2822g4j41N97l95k09M67k16k54P0J46K1k45K97J3k92M62J5n49J45L38k21k02M12
2844A85l7k45Q5L23n91lM95j03k87L39j50k96L01K25l13k92P03l69m18O24j95
2865a9l68L61M15n17k33N91J47p46N91K10q92N40N06o89l02N68J36n52K6M47m90
2886b70N5O63n82m69R16l8m70j80O48k61m66P49k85o90R12M12j170K72M69l14
2906i9n6M47P4j111R31N93j115j78R51l45l66P99k87q96M66R81j020l73J050j48
2926B98p65Q60j47j003O01R87j014n53R55K74q93P28N2j188Q32R99j065p34Q69
2945I3P04j104K65N51j112L62J276r84j167J159O01q45j3M19o28q0J378o01j460
2964a186J226R93j413M1O62n33k43J231k91j492P71J293j248l66R19m46l33J047
$$ y = [-74, -215, 382, -13, -222, 245, 29, -225, -155, -9, 12, -233, 64, 77, -215, 247, 262, -287, -142, 196, -25, -227, 185, 148, -97, -12, 311, -280, -283, 212, 109, -178, 161, 11, -285, 16, 241, -72, -364, 339, -30, -448, 176, -19, -387, -26, 389, -128, -361, 230, 377, -369, 222, 432, -460, 80, 586, -103, -405, 163, 299, -253, -227, 220, -270, -215, 448, -134, -603, 313, 275, -195, -375, 273, 12, -454, 295, 10, -680, 232, 644, -526, -254, 215, -99, -155, 292, 366, -745, 186, 779, -336, -514, 437, 92, -274, 525, 238, -658, -192, 789, -231, -604, 446, 298, -467, 393, 246, -757, -156, 831, -183, -736, 219, 493, -400, 328, 380, -808, 24, 1023, -42, -776, 93, 797, -307, -42, 509, -603, -241, 1035, 51, -1116, 43, 644, -201, -214, 205, -423, -503, 875, 274, -1186, 40, 1033, -380, -339, 323, -210, -453, 778, 487, -1005, -234, 1059, -189, -555, 364, -82, -415, 632]
2982F32k14j536O72J550r62j060J207j64q01J188j99j265N57J548r17j240J144
2999A40M30q70P26K92j615L87J685p74j288P54N73n68K36N35j427n3J778n04j485
3018a048R52O22n58p5N25q57k91J796n28j672R02J089q94k32P50q03l40J437l9
3037G36j707O40J210q89m41Q72n68m68J272k2j685K21J752o47q81R30l05o64J215
3056E71J42j453K5J516l67j064Q15R5p29O52N24j417J76J313l41r80M45L72q05
3075e10O07N86j187j90J493k29j309N31M56n48K18N78r21k72J273pj323N44N63
3094C53m03j4M73n59o62J240K09j319K54R62o48k6M79l98o17R21L39j049j42J083
3114D76m31l85N22m4o39R06J78r99j66Q76N9p52M50J60q32Q20M12r95j5P39K44
$$ y = [632, 418, -1118, -446, 1104, 142, -918, 289, 125, -676, 512, 313, -952, -395, 1153, 236, -1004, 140, 570, -300, 426, 718, -897, -510, 1175, 401, -887, -133, 440, -128, 108, 643, -784, -837, 941, 437, -1048, -96, 526, -32, -107, 418, -439, -730, 1066, 538, -1134, -232, 857, -37, -269, 481, -322, -662, 775, 736, -971, -331, 879, -10, -451, 421, -147, -615, 657, 635, -1050, -829, 923, 276, -605, 325, 20, -644, 571, 713, -740, -715, 801, 434, -630, 185, 280, -449, 203, 727, -690, -514, 799, 458, -522, -77, 295, -510, 97, 683, -504, -694, 799, 570, -739, -208, 248, -300, -82, 496, -425, -697, 576, 569, -754, -210, 353, -50, -64, 409, -150, -812, 428, 637, -682, -428, 534, -114, -140, 339, -59, -676, 245, 584, -465, -607, 476, 45, -340, 182, 138, -501, 405, 583, -416, -582, 294, 353, -399, 51, 211, -621, 199, 611, -384, -399, 340, 584]
3135E84r82M05J77m59l5R45p35l79Q53j49n74J73L16l09mM46k86n73Q54J82o81
3156b31J29L85l97P7K82j56m22M36N52r99J05M72l37r6K84j06l45L39L20l32l17
3177c57N56k69j63L67j13k99K51K51j87k83M40J16n18M53lm83K70J72j49m28M49
3198G3J28k85j07L93l78L3K31k21k42M76Qj08j28K22m7k40K80m8m20M56L5k27
3220a16J47J10m3n2j8J52m29K01L64n65K03rL9k00J75J35k58p0L98j80j30J78
3242C2r8k44K95j7m4J10p9P2p3J37J93m15J63L7n0l2N5m4q9K5P0P2k61N04l47
3267b8k79M70j62or2J13p2k24M49J9m49L93n0l19L56j47k7j44L39l4k22J81P7
3290A42k32j07K41k18J83O7j99l8oJ64j67j58M44j39j01K33j62P9K7N9M0k95J84
$$ y = [584, -398, 7, 184, -275, -310, 635, -100, -479, 374, 225, -349, -176, 140, -169, -173, 273, -13, -586, 268, 450, -231, -102, 283, -114, -37, 245, 89, -333, 103, 655, -344, -239, 233, -104, -200, 84, -22, -367, -28, 292, -40, -357, 199, -70, -233, 134, 21, -278, -27, 224, 37, -246, 194, 310, -208, 245, 242, -241, 29, 201, 52, -376, 73, 201, -84, -191, 202, -176, -143, 88, -133, -375, 101, 109, 1, -127, 95, 48, -192, 88, 40, -380, 76, 111, -116, 31, 141, 98, 46, 28, 180, -249, -48, 316, -249, -46, -55, -16, -216, -41, 94, -164, -234, 164, -16, -146, 32, -66, -310, -15, -32, -76, 34, -45, 27, -46, 91, 284, -131, 32, 69, 19, -13, 42, -2, -91, -66, 4, 76, -185, 319, -28, -307, 163, 1, -5, -97, 16, -56, -280, 169, 188, -261, 132, 82, -237, 119, -28, -55, -199, 140, 106, -116, 65, 142, -90, -197, 44, -174, 9, 76, -123, -161, -167, -3, -170, -328, 116, -23, -124, 109, -53, 26, 53, 112, 152, -143, 41]
3313D1J06k26J70K67o64N79o2k12j12J64k8j61J05L31m61K39K97l91j80K14O8
3334H4j77J58r4k3K6K10j37o6J70j63k20M23j75j19J90R0j70j76K34Q9k92J19
3356a9K01l80o3M46j58r9K1J70m13J41N76o07j0N08k36m12M74L9l00J72Q6L4n52
3379c81O39Q5n99L70J19n73J06N39l28k68L08K44o66K94L70n16J15N05l42k64
3399b43L95N7l59K8N56n18k32Q20l83l85L96J40n50J97M30k82l11N57J03r56M82
3420e8N88p98j08P16n04j93L89K14n81J44O42n51j98Q09l53o01O42K75o87l4O48
3441D01l33m57Q74k95q11O09L83o53O2O30l84l89O32M5q73M13O67r17P5P23m03
3462am80N83K31o55R2P60n35m74J033j48r85P06L1m83L01L45k11o22O78J78q60
$$ y = [41, 147, -79, 91, 358, -306, 273, 211, -1, -113, 51, 23, -138, -33, 298, -163, 76, 373, -18, -198, 16, 84, -93, 65, -29, -52, -26, 184, 47, -19, 151, -12, -232, 191, 16, -103, 87, 177, 7, -169, 65, 154, -138, -19, 182, -198, -261, 185, 27, -72, -51, 119, -294, -153, 423, -184, -194, 314, 78, -334, 140, 179, -121, 51, 137, 171, -381, 258, 343, -256, 114, 233, -340, -234, 305, -23, -291, 17, 261, -405, -111, 259, -257, -142, 363, 21, -243, 152, 209, -150, -122, 434, -84, -316, 504, 121, -264, 132, 272, -278, -81, 349, 67, -244, 313, 416, -540, -58, 530, -268, -376, 340, -164, -357, 32, 246, -335, -191, 451, -100, -298, 511, 158, -443, 199, 474, -213, -247, 401, 68, -389, 485, 190, -621, -12, 371, -282, -220, 410, 26, -363, 269, 314, -559, -146, 521, -396, -321, 402, -1, -481, 102, 333, -322, -230, 530, -5, -479, 554, 406, -579, 127, 158, -325, -24, 321, 110, -512, 166, 344, -516]
3483e16N25M62q21R0N68l34l51M10K53o01J20O79n47k63Q57m89m64L92N42o47
3503a35j99O31k38n41Q99o2j133P49N96q26j69P08k49l51M76L12j250O41P90o81
3523c2l84O55l8n68N42K8n00O8P87n21n58R36r3q15P59l6n69K38N00l22o04P02
3545A75L00p67K18M97q80J14P91l84m60L11N82o95j00P80n59j21O46j85o36K69
3565a04O04n64p6M92k71m74O54k7p36L78O57n88k62N07k07j96M14J30p09K52N75
3586D49m84k86M04L0m60N92O3n31k6O68k38p44P14J98n65K47J63m87N1N44q2m83
3608b63L45K45o41K98K20m67M1M29K6m91J32N41m88j15L08j73k53N84j4n47J78
3629a05K80k02j19L12q4l58N53k7o23K32L20k43l56L52P1j82K14J37m95K76M17
$$ y = [-516, 9, 471, -350, -260, 308, -26, -377, 33, 286, -315, -195, 484, -63, -326, 531, 42, -422, -30, 512, -135, -334, 297, 59, -482, 417, 355, -778, -29, 567, -259, -428, 280, 31, -320, 156, 468, -782, -141, 649, -32, -416, 239, 201, -367, 175, 203, -297, -229, 558, 37, -521, 415, 322, -493, 266, 230, -339, -101, 399, 77, -527, 175, 475, -292, -74, 423, -457, -343, 448, 64, -396, -85, 497, -198, -298, 482, -77, -198, 448, 263, -373, -104, 500, -64, -140, 352, 81, -393, 261, 234, -502, -124, 533, -55, -317, 190, -17, -213, 201, 331, -378, -126, 449, -35, -321, 83, 113, -347, 245, 308, -223, -249, 419, 181, -563, 151, 349, -216, 31, 194, -293, -242, 302, 220, -263, 82, 327, -314, -16, 204, -263, -222, 207, 233, -258, -126, 415, -73, -188, 120, -53, -306, 278, 264, -283, -105, 175, -27, -146, 166, 82, -276, 277, 250, -373, -141, 179, -64, -420, -68, 3, -179, 35, 172, -323, -47, 370]
3650C70l69k41L67o9k09N3L88k51l38N43k09l06L89Pk12K54K7j53k36L72l7l95
3672b55J38J79j28J27Q1l51J56R7J19k47R8K20l24P3J66k12j26K14Q8q4j5J55
3694A69j28j11RK48k86K07j15m3n1K51j78j58N2K31k71J57J95l79R5J19O0k49
3716a76K74j96J44j64J24Rk7rJ57k53L04m5k82J78p5J45k25o3K63j59K5J23j80
3739a08J07K9J5o8M7p3J88l59K96j36M7L03l01J8L6m6O3j02K16p9k11L24k18k0
3763c2J97k21j2Q0J64k25J34j87L25m04O9K21k57J48O1k12J82q0K32l8k10J92
3785A27m7r7J80l94L4K75j46M8Q6nL1Nj17l3k03Q2K34j85L3J69Lm0N6J48j10k21
3811h7K43r5j98L37k17J0K5K53l60Q9K00j3m34K45L12n31L13L2l32O3K61j01l48
$$ y = [370, 1, -240, 127, 58, -151, -98, 290, 39, -299, 244, 35, -271, 118, 125, -87, 167, 194, 41, -195, 177, 140, -255, -117, 62, -66, 61, 142, -209, -53, 44, 163, -84, 14, 234, -90, -17, 149, -63, -189, 25, 113, 29, 14, 169, 41, -70, -61, 187, -99, 108, -7, -50, -101, 150, -28, -186, -134, 97, -174, -17, 178, -201, -106, 13, 73, -176, 98, -98, 46, -118, 6, 15, -12, -21, 136, -117, 187, 142, -140, 38, -37, 108, -117, -180, 83, -76, -51, 72, -108, -1, 28, 43, -25, 22, -51, 137, -222, 74, -62, -15, 288, -13, 5, 41, -5, 58, -44, 172, 93, -118, 206, -12, -32, 165, -56, -68, 12, 176, -49, 85, -102, 223, -181, -112, 109, -148, 0, 61, -151, 31, -49, 183, 145, -65, 127, 80, -17, 163, -231, -197, 78, -68, -20, 66, 61, 92, 97, -20, -53, -256, -174, 60, -125, -92, 77, 80, 40, 96, 244, 134, -87, 156, 61, -137, 200, -17, -7, 18, 271, -89, 0, 200, 187, -247, -2, 310, -221, 92, 124, -208, -145, 116, 15, -333]
3834c33K90J87k29p2L92k55m7L5n7M4K09k21O8j73L20%l96N86j30m52K73J1L5
3857H5k14K86o7l07L04O6l61K94K00l44j71K78q5o1J40J54l55J28K14j64j80L14
3879A54j68k12L68Qk33j96O00k56m33M74jl89J79K46m47J61L70l0n48L86J95m66
3901b38J63L49l03j20L85j7l48J46PL6k92L19j27j67N20l0n32K08K37k96O6J94
3923A60k72j84M57Q5m89J30L08k19k0j6Jj32L54K40p03J67M98k18k76J32j55j93
3945c45N40K4k41k54M30n4l86L33j4k22K66J22m68m4N08l5m04M2L73l81K19K91
3967C00l71q6N00M5m95J18J08j66m3M54m73m29Q16p3m43Q8J62q7l8M28k91j84
3989a60K83K52o99J96L77k80q3L57j31l47J68N49p69J9N95j14l54K95o3m48L68
$$ y = [-333, -43, 144, -85, -157, 235, -20, -67, -32, -89, -45, 164, -57, 11, -162, 158, 158, -238, 348, 218, -234, 39, 50, 85, -129, 157, 90, -217, 87, 153, -208, 86, 286, -58, -229, 49, -36, -97, 43, 197, -158, -30, 184, 20, -160, 154, -14, -226, 142, 150, -83, -279, 321, 65, -368, 106, 105, -284, -105, 141, -306, -145, 225, 195, -353, 33, 228, -238, -75, 274, -29, -149, 236, 219, -129, 17, 24, 60, -232, 87, -40, -207, 313, 283, -249, -41, 196, -100, -34, 160, -112, -296, 161, 246, -243, -113, 195, -24, -44, -60, -59, -191, 163, 403, -300, -133, 365, 147, -129, 3, -152, -345, 195, 219, -22, -276, 154, 100, -286, 47, 33, -189, 77, 199, -269, -313, 195, 160, -244, -202, 171, -210, 9, 300, -71, -157, 343, 388, -107, 11, 119, -47, -90, 364, -109, -538, 278, 205, -238, -150, 12, -75, -113, 315, 24, -160, 123, 375, -324, -128, 249, -31, -114, 243, 112, -235, -67, 482, -287, -268, 327, 213, -141, 154, 91, -357, 11]
4010A1L13k40n11O01j38l10K45O4l61K51L79n04j29M95P9m10J50L13m46J51L87
4031C90n53k10M97J27k69K0J05l07J20L67k88n35O22m9j58j03L69k28j73N08j63
4052H9m18L58L52p25K65K34k26q3L40j1k78N0M31l42r2M40k39k42K25j39j46J38
4074a9L58n60j29M03jk44K11K24m86K74K57m94J1K26J06m36K65J88l57J08L74
4095B79k16q4J83j59j6l4J57j10k59M11m9l47M24j55j81J98o3q8m4L40j98k20
4117b31K37J60m06K16N7j61J27j09J71j71j3K63k31%L45m43K46K08l14N8o6K04
4139A47k90nJ82P5j59P1pj5k17L03J6o7l4J20j00o3L81m84o9K80O0j07n9J42j39
4164c8p0L62l09j27K98j85q7Q9J55j42J6j19J83j49K11J12k63K29lj28k19J55
$$ y = [11, 324, 84, -427, 174, 36, -274, -29, 35, -326, -75, 304, -200, -329, 166, 245, -165, -15, 298, -148, 3, 390, -163, -373, 124, 251, -18, 2, 107, -200, -80, 287, -1, -536, 86, 37, -121, -224, 145, -83, -256, 252, 89, -329, 29, 381, -344, -79, 155, -71, -154, 186, 175, -103, -53, 378, 36, -56, 384, 145, -97, 128, -11, -157, -19, 339, -221, -350, 53, 52, -192, 19, 243, -243, 31, 288, -206, -195, 31, 137, -299, -34, 154, -203, -95, 279, 63, -21, 162, 3, -13, -47, 110, 0, -259, 152, 103, -244, 180, 25, -156, 42, -21, -109, -153, 187, -11, -231, 6, 166, -240, -24, 33, -128, -1, -110, 61, -110, -123, 140, -91, -91, 254, -189, 57, 265, -49, 9, -57, 147, -143, -148, 34, 109, -50, 21, 14, -1, -218, 85, 101, 34, 0, 120, 20, -43, 338, -146, -215, 65, 125, 18, -41, 101, -38, -108, 254, -55, -182, 116, -69, -156, -67, 88, -54, -38, -157, 26, -123, 88, 200, -63, 166, 163, 35, -184, -29]
4186b9kO7l4j0k3k19L25j21l8J39j29R3O4Q9j05j95J44L0l21K93j9j03m3J42j01
4211a06l0J12J75j68m5J99j15j24K55k25r1J70M8o4K6r1P1j69K08n7j09L3L7j3
4235g3K48k77lJ4QR3r7J55j44k06L89L7k52K93j47j8J01l48L79j18m5j9L5j13
4259a08P8J11j87J18J1j20j02J87K4j47K60j58o3J60Q8l2R0j05j10P2j08K51j50
4282F0r3oJ98j41J05j98J23j74J69j08j52K54P5k76K31q3l1j56K53o2p4pK18k61
4306a36K28J04k58m9K56j73K05j24r4R6oJ47j52j87K04J05j17K5j25lQ1L6%j58
4330i5M7K75l61K50k5j57l2K94k19M7k8J25j26JK63l31R0J25k46J52r5J6J24l62
4354b68L77j34MK08k91k67L79P9k12N0P3m0J3K03N6l59J91J24l05P4M03l79j63
$$ y = [-29, -31, 36, 2, -8, -31, -250, 75, -46, -84, 55, -74, 19, 83, 172, 67, -128, 16, 46, -275, 18, -1, -104, -147, -5, -106, -136, -24, 151, -17, -62, 137, 22, -102, 153, -72, -163, 7, 55, -9, 17, -74, -3, -172, 36, -21, -130, -97, -60, -73, 175, -102, -105, -91, -83, 10, -87, 68, -76, -282, 107, 144, -108, 185, 38, 20, 121, -227, 152, 34, -11, -30, 5, -108, -30, 81, -106, 12, 23, -97, -199, -12, 12, -135, 125, -33, -96, 64, 152, 120, 210, 105, -5, 67, -41, 210, 60, -33, -39, 159, 18, 123, -75, 48, -126, 43, -65, -217, 37, 112, -164, 67, -16, -47, -203, 50, -12, -86, -93, 125, -136, 92, 196, -62, -111, 145, -28, 177, 53, -41, 55, 49, 196, 44, -143, 61, 166, 49, 74, -51, -54, 27, 63, 63, -95, -48, 227, -134, 116, 91, -66, -98, 196, -23, 24, -4, 121, -5, -4, 259, -72, 18, 143, -103, 49, -46, -30, 94, -268, 109, -25, -21, 187, -104, -371, 8, 87, -125, -75, -2, -42, -29, 174, 230, -129, 62, 186, -119, -45, 358, -21, -184]
4377a84J54P4rj5J29j26p9K55k21j43J32k5q5J21J32j18p8J77q8j11L34j71k38
4400a83J86R2j01J03p7M4p3J73Q5m33Q4J03m1j03J47k8J47j70J09q6k91L95L2
4423A14l09K14nj96J77p2J20k12L53l7k51J61N8l3o6N7l3l3J57m0j26k48O46k57
4447A39l47L68j21m3K58k73R9l05L30r5k6N3k7j31L39j10k72J88M8J05j29k6J33
4470A55l46Q3K81k71N3J62o3k00R4j55J77MK61l87j00N00j68l12K61Jj05M5K09
4493A79j56k29L01kk52K71o4j66J51O0k23J32N3J26k48L0Q9o7R9J77l61q4K43
4516E9J42r2j46J45J1k19K78q5j57J78j4r3j43K28q9k7N0K5j68Q5L34l85m9L17
4540A85j57m9j0l5J10k06N15l59k08K55O1o7j08M4j95K51J27j91k26K31K59k73
$$ y = [-184, -30, 44, 35, 20, 149, 23, -56, 199, -22, -165, -33, -58, -143, -22, 110, -8, -86, 91, 3, -108, 226, 55, -183, 3, 95, -6, 97, 20, 64, -9, 164, 249, -184, -100, 3, -38, -141, 6, -22, 125, -45, 64, -22, -313, 82, 114, -195, 19, 14, -182, -5, -77, 43, -169, 184, 147, -104, 57, 115, 82, 16, 73, 40, 7, 164, 124, -2, -250, 396, 139, -208, 160, 39, -4, 254, -19, 80, -225, 105, 10, -16, 37, 10, -121, 218, 108, -164, 24, 72, 177, 48, 22, 155, -191, -108, 173, -98, -45, 117, 54, -146, -52, -207, -30, -26, 235, -152, -252, 248, 80, -232, 29, 30, -75, -30, 179, 23, -206, 95, 93, -159, 112, 48, -118, 33, 93, -130, 2, 55, 181, -67, -37, 52, -15, 84, 261, -100, -184, 59, 201, 109, -37, 108, 119, -100, 178, 93, -64, 114, 100, 7, -136, 92, 3, -24, 26, 51, -117, -32, 302, -83, -132, 185, 28, -21, -31, -66, 44, -162, 353, -6, -214, 41, 102, 35, -73, -29, -224, 27, 154, -37, -263, -32, 227, -46]
4562d6K6J23j88P6J29k0k46K05O7p5r0P3j52J42J76r0j94M8K54k08j56o7K55j11
4586f9K70j48k68K53J57k42k26L18rm7Q6L2k70K48J14j66j93J93j42R0k6j1L6
4609b0RJ29j03k55L15j25O5O9m9j7m1J8J42j41m6K60r7k25K36j9k51K20j5q3r
4634c3J99j58j79K09j38m6L29j44j17J05L0n6j89J44P3j41J76l6K6R3L1j85n7
4657f4N1m9JJ24M1L1l22K42j91J94p3kn2P4l9R9j11J19j86J22j38Q2N0O0k0l1
4683A2m2j5L5P7j92K45k2j86J23o0j3qJ99p9j39J69j25j23J20N4m1n4K06j76O6
4708C1Q1J63k56J0j4L9l6j1q2K75m4n6K8Jj01j18j18J73J03j77J12j3ML5R9o9
4734E9k24J65M8m15K55O9J3R2n2N8l1J32l6j60J03J11j65N5j0mr3r8R8k0Q2j03
$$ y = [-46, -20, 103, -85, -9, 120, 100, -146, 59, 126, 51, -39, 34, -118, 24, 200, 110, -84, -36, 218, 10, -146, -213, 42, -69, 201, 53, -215, 38, 195, -47, -273, 45, 36, -11, 75, 107, -163, 85, 199, 33, -160, 33, -109, -19, -45, -56, -20, -11, 118, 15, -240, 75, -50, 15, 84, 35, 18, -23, -5, 137, -4, -50, 210, 113, -112, 124, 105, -146, 74, 59, -24, -33, 166, 8, -171, 38, -100, -146, 183, 39, -78, 27, 57, 1, -188, -44, 29, -112, 64, 28, 54, 147, 178, -7, -64, -13, -62, -61, 63, 104, 135, -187, 55, -136, 58, -15, -17, -69, 5, -34, 65, -46, 73, -113, 9, -129, -47, 3, 63, 43, 12, -30, -45, -10, 67, -125, 120, 98, -88, 35, -25, -38, -46, 153, 74, -65, 104, -21, -144, -24, 30, -11, -65, 141, -35, 31, 112, 275, 19, 29, 15, 54, 18, 7, -75, 200, 156, 100, 128, 129, 28, -90, -208, -35, 68, -109, 3, -10, -6, 29, 128, 59, -165, 0, 48, -367, -112, -43, -30, 62, 10, 68, 37, 169, 133, -27, 76, 187, 22, 77, 67, 63, -30, -128, -30, -50, 32, -71]
4760g1l2L8J54j98N6J38r0J5j0M4j12k8rJ37J9o2L0j34q9M10j52j67J89o8j03
4785i5J38n4J9Q4j34N8Q8ml12L00j19r6L19j70J6o0M7O9Ml27K45J19k6o9m9r8
4811a07J10k1n3M1l1J31j76J15KO3j35r8M5J39r2J70r7M3J3j87K05q9N6k4m3K1
4837Al8j22O9jJm0K84q9J09j64qj8R1M3k56k3J96l4l9J30k37J72j65J81j69l7
4863a63K36o2jN7j64o5J47R4m5J2n9K04j32p0K53j53j65K10l27J0K14l5q7K44
4887A53r6q4K7J66r7k15K4R9lp6J40kj42L06j27j51J41J4j70J37K65l94j39L48
4911A24m1j24J06p1j09L0J93o3j2q0k0q4L4K19r5k48L05m7j15J04P5n2O0m8J7
4936E8n8q4J56j20k6J62j80R8L2p0j31K58n0j12kJ59j42k37L15ono9P9j50J72
$$ y = [-71, -103, -65, 89, -109, -53, 85, -5, 10, 0, 44, -68, -96, -105, 32, 51, -11, 19, -115, -204, 206, 54, -113, 76, 8, -95, 43, -11, 8, 92, -42, 16, 104, 100, -212, 88, -31, -127, 192, 22, 38, -22, 25, 94, 98, -229, 16, 135, 109, 40, -9, -107, 3, -18, -71, -30, -61, 70, -106, 9, 11, 74, -61, -159, -114, 25, -67, 103, 6, 49, 62, -125, 80, -9, 47, 23, -20, 1, -37, -159, -90, -91, -90, -130, 154, 65, 174, 10, 2, -16, 75, 118, -138, -161, 35, 1, -38, 92, -145, 27, -138, 43, -126, -163, 73, 11, 10, 67, -97, -162, -15, 79, 34, 46, -13, 191, 59, -11, 242, 89, -76, 134, -193, -183, 31, -4, -91, 153, 57, -27, 0, 166, 69, -146, -122, -23, -26, -102, 38, 36, -106, 200, 73, -78, 63, 77, -93, 44, 309, -85, -224, 124, 83, -41, 65, -6, -115, -85, 108, 45, 33, -47, -67, -151, -117, 102, 7, -241, 64, 17, -98, 6, 81, 29, 89, 41, 58, 0, -84, 72, -48, -74, 88, -92, 6, 38, -32, -163, 95, 45, -67, -69, 90, -52, -289, 26, 20, 15, -54, 25, -125, 47]
4961D7Kj27r9J56P5J9p0O4j89J83N1n8pK0J3j93J43p0j17N1K50k35l5R2M1j70
4987a63J33M2j40K12q4O0k12J74J22j94K94m9k47j47J79O1j34j12K49j2k0J00
5009A12j50m0J19j9j6j22J82p1J9k8L5j47J42L0l0J15j14r3P3M8R9k53QK17k46
5034a30J73O2MN1j14p5R4n8rM1k21M28k82r7K54k64P9J98m6j00n8J26m7R7L2j19
5060A9p8n6J90n0n7J56J6r3j44J80q1j32J36j56K39j81K5mk0O0M3J2M3j40J8J62
5086A07L7q9j49Q8Q3r8J40J57m76L11r1j13J17J4%n8PO4qj35K01l4p2Op2P3j40
5113a30Q5Q5L8K9P3l17O9J80o2j60J03J23jQ4j38j48j45L05K0J11k79P3K7m8J91
5138A68j34q2R8q8k1J90j32r4jJ21j23J07oj09R8o7J35p6J61j27O5k03K06j61
$$ y = [47, 49, -78, -177, -21, 54, 73, 3, 67, -122, 61, 112, 54, 47, 67, 80, -113, 30, -40, -157, -106, 144, -91, -126, -34, 7, -163, -30, 12, -128, 84, 0, 60, -152, 22, 144, -50, 244, 195, -52, -199, -20, 41, -93, -205, 44, 32, 12, 112, -38, -78, 41, 22, 6, -116, 66, -5, 14, -14, 21, -126, 16, 46, 16, 131, 17, -76, -3, 45, 144, -109, -101, 116, -130, 43, 105, 109, 160, 46, -29, 65, 7, -2, 39, -182, 246, -36, -133, 121, -143, -64, 134, 88, -12, -70, 56, 9, 106, 138, 19, -59, -115, 75, 25, -32, 124, 140, 47, -97, 83, 2, -130, 6, -150, 89, -92, -67, -71, -91, -31, 12, 24, 67, -73, -55, 107, 144, 55, -94, -6, 77, -21, 119, 276, -200, 111, 20, -93, 24, 38, 38, -20, -13, 51, 43, -92, 109, 75, 3, 9, -63, 10, -130, -45, 40, 78, 107, 180, -137, -68, 112, 50, -110, -7, 116, 115, 199, 61, -87, -232, 73, 93, 204, -75, -2, 25, -23, 168, 34, -48, 50, -38, -59, 131, -1, -95, -96, 25, -98, 9, 3, -106, -8, -75, 60, -16, 145, 18, 83, -120, 86, -75]
5162g5J81j2m0j4j93J09P0k27J90k6r4Q3r0Q9k5Rl6J15M5j80K6J29Q6j17J53p3
5188H3o2J87j93K61j97p4j3J12j41O2O6k20L0Rm3J25K33k49l8K2O5j82K64k7J31
5213B11k30j75L45j87l3J66o5J9jj59N2J77m2l5p1J96k23K3M1O1l9j96L5J71q3
5238d2L3J06k61K19P7k38K50j28j40J66L4m0k8J3r2L0p5J02J29j05j34Lr9K24
5262DJ1l2o5K60q8k98J92j06J60k2J42k00K5K08k23k4J91l7j20Q2p0m7K34j79
5286bk00J80r0J90j67J8l4J6N7j33L82l20j5K0J30O9j30J31o9n3N0K09j65n0J8
5311D2j7P4q8n1l3R8jn3P7j75K06N1k22R5j15o9J4K4J26j24K5J59k0j93J85M2
5337E7O9j85L8KL5r5K38j91N5J04j79R9p7l4n0J33R2l5j35J24nj19R9o0o1J80
$$ y = [-75, 106, 94, 54, 40, -153, -44, 26, -201, -11, -37, -131, -48, -138, -49, -74, -65, -101, 14, 59, -121, -95, 34, 120, 3, 156, 83, 21, 208, 15, 276, 79, 5, -8, 104, -37, 25, 91, -129, -99, -90, -133, -8, 225, -24, -62, -40, 25, -157, 107, 80, 211, -19, -194, 151, -36, -69, 97, 32, 51, 50, -109, -57, 120, 78, 43, -28, 168, -55, -32, 9, 70, 31, -165, -130, 41, -42, -9, 97, -164, 55, 132, -106, 144, 16, -124, 42, 76, 36, 8, 21, -71, -41, -116, -14, 115, 10, -124, -121, -220, 4, 15, -17, -82, 178, 90, -208, -16, -122, 38, 16, 158, -42, -17, 191, -32, -56, 135, 98, -22, 60, -10, -57, 177, -2, -202, -22, -112, 78, -89, -71, -105, -89, -32, -165, 217, -103, -118, -98, 32, 101, -29, 102, 33, -20, 30, 239, 74, 24, 42, 25, 99, 11, -40, -73, 25, 24, -29, 48, -127, 79, 130, -92, 3, -112, -181, -167, -143, -17, -141, -116, 43, 23, -170, 15, 57, 126, -59, -21, -19, 16, -79, 159, -32, 23, 127, -52, 47, -30, -64, -114, 19, 111, 76, -59, 65, 60, -59, 40, -20, -81, 99]
5363I9r9K3m4Q5N1j07j67K44o7o4J80j68j65L05j68m9L4J04%k45L55j95k5J08
5387B5K9j45K09l04J77J15j46J2j11P1k5L8K3O4o2J46oO8l05J36P7j41J9J60k33
5412a09o7K90k79J35NJ12k04L1Q9L0j34Q1p2Q1Q6o0j3j32K77j59K2J15j55j53
5436a83K62J40l07J21L2K2j24Jn8n9M8K61j11k00J78JL0j01k9l5L5J33l1l9j0
5461b3Nn7L8P7j6J39Qk33k6m7M56j87k78K91j07j82L5R4j74J62QJ05l06K17k9
5486c0l9J18l4k19K94o3l2j19K02j00n3K45j24j84l9L09j98M4k4K9o7J95j32J00
5510G9n3j69R9q2J13N2Q3l2m4j30J94j10R3j57J5J46q3L0K7j63O9J8q7l3N0K10
5536A35p7j07J56j97N0J80k01l9N5m7J88p4K2n5p8R6n4l9K13o2k37L05n4k00J56
$$ y = [99, 0, 23, -21, 64, 115, 8, -159, 85, 18, -46, 134, -34, -199, 106, -62, -111, -77, 27, 27, -218, 137, -58, -83, 25, 54, -91, 118, -186, -9, 106, -40, -28, -139, -68, -93, -55, -32, 32, -30, 116, 110, 178, -127, 9, 86, -55, -36, 124, -109, -176, 114, -165, -30, -25, 87, -117, -86, 3, 33, -101, -20, -92, -11, 75, 15, 2, -130, 147, -12, 10, 125, -30, -183, 79, 219, -88, 33, 65, 87, -37, -36, -94, -153, -105, 156, 45, -155, 23, 24, 54, -47, -76, -111, -76, 57, 26, -13, -23, -18, -75, -37, 40, 24, 163, 171, -62, -88, -135, 321, 134, -144, 147, 40, -142, -107, -13, -187, -25, -17, 88, -218, -1, -30, -69, 49, 15, -204, 90, 27, -5, -124, 78, -22, -75, 170, 46, -138, -177, 132, -66, -22, -46, -17, -84, 111, -21, 79, 26, -143, -44, -126, -13, 39, 122, 90, 46, -84, 110, 0, 93, -64, -49, 97, 14, 44, 71, -92, -23, -5, -92, -125, -75, 135, 58, -49, 107, -90, -40, 140, -61, -100, -45, -92, 96, 22, 44, -11, -89, 7, -47, -86, 127, 65, -172, 133, 79, -121, 35]
5561C5N9oL2l6nj54J36p2O2q9J17j01M6M3j9m5o9L2LL6P7p4j8j04jQ2qO0N2K0
5591I1k88L18j55N1J37k66J6j32L56j90nJ05k10J84K7j83Q8nJ06m9r7l4J04j4
5615d5J85l8k98J59J28n8j8p4K2R2o6R1j1r7K08k26m4M9Q9m8j34J81k33J05J41
5640F0j10J88l6j50m5J1K26j35o6J10J9j10J67k1j13k9K8qJ98k02Q2r4J63j02
5664C1m8p2J7J42j53J90k26l7l3J58k6k04K48J1J9K53j20j76R1o6O3j98P6J98
5688A38j95J8J52p7Q3k04K46p6J6j04J8j83K21L5p2j7Q6pj19O6M9l3R1k32K24
5713A24o0j69K56j17rl0n5l7J27p0N5K2q6L8Q7j01k4k9K08j99J21n8J56j80p3
5738a03J35N6j26N5j36K89j47j62J88j98J61o6j69J06J13J7J9k7m4J6k6q2L4J06
$$ y = [35, 94, 88, 120, 84, 79, -75, 61, -11, 51, -38, 79, -22, 24, 67, 48, 3, -66, -34, -31, 5, 82, 8, -10, -114, -115, -33, -41, 19, 71, 91, -197, 121, -34, 17, 154, -112, -96, -228, 128, -62, -67, 38, -172, 12, 39, -144, -56, -61, 45, -4, -101, -135, -31, -45, 140, 102, -196, -37, 91, 33, 15, -59, -37, 55, -11, 80, 69, -28, 180, -46, -90, -41, 48, 0, -134, 47, -186, -81, 60, -50, 138, 102, -48, -93, -82, 144, 9, -57, 53, 72, -38, 129, 108, -5, -34, -6, -14, 184, -18, 64, -30, 133, 31, -17, -89, -72, 70, -83, 107, -119, -156, -189, -31, -57, -261, -13, -2, 17, 270, 150, -26, 65, -1, 62, -136, -60, 138, -57, -39, 113, 36, 119, -85, 161, 85, 101, -3, 15, -168, 53, 88, 16, -1, 85, 78, -41, 25, 74, 41, 132, -100, 124, 64, -105, 151, 34, 25, -5, -60, -97, 30, -40, 15, 37, -49, -11, 76, -25, -49, -78, 130, -69, 52, -6, 150, -30, -103, 32, 88, -38, 17, -119, 170, 23, -139, 49, -149, 12, -54, -223, -117, -4, 13, 32, 5, -39, -23, -49, -131, -97, 9]
5762IJ5r3K06r2K1L3j8j89Q2l1l0n0N6J09M0J9P4j87nk5M5j29K11o0P7lj28O1
5790A8q6N9J0Rm8n6M1J80k43J47p2RL9L4j40J03m2R1n8J45j63J70k04P9nj8L8
5817C7J46q7J1k10Q1J48k1p7l7jm4P5n3p6K56k38O4K0P1L2q8K5j46M1R2J09j64
5844c4J27j85P6K0jk6J09j83J52m4N5n0p1J11m3m0Q6N3k58J06J13o1NJ8j9P4j64
5871g4J8M9J10j34J69Oj49K4K4j7Q7n9j1j88J32J65k76J04J28j24n4J8Mr1J60
5896B1p2k0n0O5J5Qj12K57j82J40o2n2K08o5r0L0j9J32l21O0P8n3k0K62q4j64
5922i0P7J84k00m8J00k4j50K99j52Q6p9N9j53J22j83K03j4o2o5K41j69J67j17
5945C2j74J60m7K5r1M6o2P4J81m5j83R8O8N9J6j52j26J38J28K7q1J07k53l0j5
$$ y = [9, 24, -69, 137, 45, 66, 99, 81, -108, -26, -57, -87, -137, -81, 28, 68, 87, 161, -26, -31, -56, -11, -140, 71, 11, 88, 85, -43, 18, -68, -9, 1, 10, -38, -94, -53, 127, -116, 31, -41, -32, 7, 41, -99, 4, -38, 53, -5, 140, -23, 147, -57, 22, 17, -1, 37, 183, 96, 107, -103, -22, 126, 105, 28, -9, -10, -54, 21, -32, -108, 148, -90, -26, -6, 65, 97, 9, 34, -112, -71, 21, 130, -34, 93, -92, -16, 4, 3, -23, 86, -97, 55, 11, 66, 16, -55, 56, 13, -27, 59, 112, -146, -40, 73, 12, 17, 35, 16, 90, -74, -56, -7, 103, -31, 138, 144, -5, 19, 43, 26, 113, 54, 43, -145, -13, 152, -124, -20, 108, -16, -70, -52, -48, -139, 21, -51, -71, -121, -56, -41, -33, -145, 112, -70, 70, 8, -44, 164, 99, 9, 39, 20, 152, -169, -109, -31, -84, -104, 158, 74, -90, -13, 171, -29, -77, 23, -1, -151, 148, -4, 82, 3, 62, -91, 31, -152, 51, 37, -25, -90, 151, -18, 149, 32, -142, 18, -29, -4, -95, -49, -111, -37, 144, 99, -84, 14, 82, 141, 157, 5, -121, 17, 145, 172, 91, 198, -55, -85, -100]
5970a00J74j07R9J2K5j83L8L9j5N7J27j77p3J59nj72J20P5o1l5l2Q6l0N7rk20
5996a51J22p1K11q6j12J50M2j11R8j47m8O6r0J04P0o6M7j06O6j0J46L7k81K8L09
6021B17k31J7P7o2j39J95J4j11R9j41K20l28M3L0J41j11K29o7k10L4M9j7Q8o0
6045b4qJ42R1k94J87lM7r0n7Q4j75n8J05K0O6KJ13j07m6r4J92j24J29p3l6n3J43
6072G9l2q5l7J05L8l3o2m1J33M3j31j12J66J02l63J85J43q4M0j18K46j08j31J98
6096A41k24J24lK2j33J30l8r1K8j84L59k18J71j2p2m2m8k6J37j31J55j19J46r4
6120b2M6q3J68o8r8J28j49J37J1o8k1O4k8J0j13J18r4K5J23j26P3Oj18J17j11
6145g3J73M7k28P8K39l26P8J89o5m1j72O6M2j49M7N7l2K21k21K07n0j06oq2K33
$$ y = [-100, 74, -33, 66, 78, 103, -80, -42, -3, -18, 39, 166, -11, -84, 75, 70, -102, 18, 93, 32, -3, -35, 51, 21, 78, 69, -151, -29, -100, 111, 25, -87, 63, 105, -6, 92, -55, -103, -37, -127, -23, 47, -19, 28, -78, -12, -22, 124, 161, -120, -92, 217, -14, 3, 80, 18, -121, 74, 88, -23, 76, -65, 155, -173, -130, -100, 41, -70, 159, 92, -118, -84, -35, -52, 36, -24, -32, 110, 201, -93, 94, 91, 138, 48, -9, 75, -100, -158, -53, -33, 33, 35, 148, 41, -5, -99, 93, -31, 98, 25, -11, -64, 79, 47, -38, -75, 30, 68, 35, -27, -68, 65, 108, -23, -135, 31, 133, -230, -45, 98, 14, 54, -64, 182, 74, -57, 141, -83, 41, 38, 60, -73, 57, 19, -72, -44, -228, 131, -87, 84, 72, 0, -42, -90, -116, 21, -110, 45, -74, 72, -22, 24, -59, 109, 41, -57, 71, -78, 59, 70, 2, -19, 45, 17, 27, -86, 32, -62, -37, 86, -40, 33, 39, -79, 38, -73, 100, 147, -81, -3, 236, -90, -12, 177, 112, 71, -101, -35, 7, -142, -95, -38, -70, 151, -70, 137, 87, -19, -25, -107, 126]
6170A26p3j27J16K5J0O8o2k20L3R8K23k57M6n9Q4j15K85k37O0mN0k6L4K2j91n0
6196a41J70p3k06L13Mj0j26K17k12q8j3J97j29K5O5K4R2k82K55o3rO1j47J27K9
6221H0j63O5N5l7J33j71j44J41o3M4M4PO4j82m0J81p7J4J06j75RJ38J37q5r0L5
6247B6J1N7j63LJ35n1K2k3l0Q7Q4j52PN0k8p7m4p1J81M6l0Ql4K3k5j40J35j14
6275a07Q2J47p8OO0j73J11K4J4R9j54J5J7j60J53p5O2m8J98j86m3Q6P7k13M1M5
6301@K3N5j10j1M6q8R2j22J4R7j38J23J02m2j06R5j33J20K4r3J9n9L2Q4j2J4m
6328B2Qk33O2K31k32K05l3M5j10J35n7Jr8J05j13K48q1J6j27j07J05m9J00K2j1
6353E4k3k2k20J66LJ21K1r1J13L2k47J5m8M6J55P3q5Mj63J41r7k5K1J30r9o0P1
$$ y = [126, 53, -74, 42, 67, 77, 145, 83, -137, -104, -6, 217, -40, 6, -53, 31, -84, 201, -36, 24, 20, 70, 44, 78, 100, -91, -141, 29, -44, -250, 63, 67, 57, -69, 148, -64, -152, -165, 32, -97, -72, -7, 17, 109, -173, 82, 19, 10, 71, -76, 51, 80, -83, -18, 37, 0, 133, -38, -182, -41, -104, -60, -16, -9, 55, -127, -167, 14, -63, -49, 57, -118, -109, 29, 166, 81, -9, 26, 37, 94, -69, -66, 69, 18, 40, 17, -13, 74, 158, 6, 13, 63, 35, -42, -86, -157, 24, 70, 40, 48, 14, 37, 12, -128, 7, -107, -25, 122, 44, 50, 110, -63, 48, 72, 86, 185, 31, 46, 63, -97, 56, -19, 43, -5, 193, 7, -36, 50, 127, -86, -45, 0, 23, 78, -32, -43, 3, -85, 7, -115, -101, -4, -142, -19, 83, 41, -65, 30, -103, 17, 41, -52, -33, -92, -60, 24, 12, 26, 22, 30, -203, -141, 90, -142, 63, 30, 75, -35, 100, 43, 44, -54, 51, -62, 186, 105, 121, -6, -113, -8, -57, 43, 65, 54, 31, 9, -211, -45, -42, 79, 100, 9, 122, 154, -93, -78, -126, -80, 75, 148, 63, 67, -96, 45, -52, -77, -56, 74, -25, -85, -14]
6380a4q8J15J28l0ORj58j25K03j55L4Nj19J15K6N2n4J33p2r0J7O3l7Q0p2J60q0
6407E2kn1kJ47p7Q0k20m7Q8M6R8j15o0O9K4k13J05J24o5j5L8r6K19o8M8M5j88
6434c6JL8q3R9k3J18j05k3J27o7o9M1O8Mk13o7K11j68K70j09q6K02j82P6M4j14
6460d6n7J18M4k9p3O3P6j29k14P5R8J41K4j39J33j39Q4K8j31P7ln5J02o8M7j4
6486A3L4J6j02R3P3L9j99o0k4P3p7J16j20K40o9q0j0J95k25K00p7o5J26k03O9
6511b4P6n1Q1M1n7k1k3j26K28k5k54J81J24n6j26J13K2J58k88L8m3O9k4m5O9j36
6537i9K6K7J48j18kM6q1J06j77R9K30l72J84O3p0q2L1L9L2RN2k1j17J6l5J45j24
6564d5R0k32J33P0L4M3o1Lj5j3M1j73K32N9j50j89K40k93K43j26P9n8J1p0J99
$$ y = [-14, -102, 13, 141, 111, 117, 126, -32, -157, 46, -109, -75, -70, -189, -74, -48, 4, -50, 83, 11, -79, -62, 1, -36, 44, -28, 132, 52, 50, -1, -3, 144, 67, 147, -73, -120, -32, 14, 112, -3, -63, 6, 30, -183, -78, 46, -19, -34, 4, -92, 127, 59, 107, 152, -36, -35, 3, -80, 19, -4, 114, 9, -14, 113, 46, -23, 18, 86, 90, -123, -190, 21, -147, 123, 14, -72, 130, -52, 24, 68, -46, -103, 15, 59, 30, -43, 20, 96, -33, -247, -172, -74, 67, 91, -48, 85, -54, 30, 58, -73, 4, 1, -54, 48, -20, 27, 13, 47, 63, -39, 54, 127, 166, -33, -93, -117, -44, -121, -5, -125, 115, 46, -34, -44, 151, -74, 126, 49, -16, 110, -93, -24, 52, 1, 82, 123, 66, 45, 22, -104, 124, 99, -155, 26, 150, 94, -32, 81, 103, 261, -27, 11, -32, 37, 13, -32, 37, -99, -73, -46, 102, -16, -18, 28, -53, 53, -124, -25, 205, -167, 17, 80, 10, -72, -41, -2, 30, 39, 91, 70, -47, -31, -66, 79, -45, 45, -187, -54, 16, 50, 93, 32, 35, 20, 7, 48, -125, 107, 166, 16, -173, 67, -226, 17, -109, -30, -88, -77, -147, 52]
6589E2q3p1L7K8R0p3J50l1j39J43K1k47J20j84J02J11r8j32L43j05O3o5J2L4q1
6614cL1K8j91J99l0k85K66O0q5K6r2K8nJ28R8j88k6Rm7J57q6k2K6J15k8j48J4
6641e1J19l4j29J51j51Q5M6m1R4k3j06J88j98k9J58j54N9j3Q3p0j93L58k62J92
6665G9j23j3j13N9MNJ21m3N1q4m9P4M7P8j01n8J30j75J53lk7l8j8p4Q4K5J7J47
6693A55l34J75j28lK24j10J02j41J5r0O7M2m8N3J05Mk49J27n9K55j99J13LP5j61
6718gj94K66j04p8M4QJ43j47K26j31J06m5k46j6K97j57O0k13J69P9n3K7N7k06
6742a15J52L0kq6J19n6M3k05J04j71J72N4l2N4N5j03o2J21K3k26J49k1j26J72
6766D3k67J61j24J06O2p7L4J21m1k5m1J36o0K9k7o8qQ5j6l0o1O0j3K6p5R0oR5
$$ y = [52, -31, -102, -65, -37, 53, -20, 130, 99, -40, 103, 124, -123, -3, -187, -85, 26, -72, -204, 139, 34, 97, 32, 44, 78, -3, 28, 56, -135, 64, 34, -251, 15, 75, -10, 16, -76, -48, -53, 75, 173, -15, -41, -32, -79, 78, -8, -30, -4, 111, 83, -65, -51, 68, 34, -95, 56, -95, -10, 36, -5, 89, 66, -40, 148, -50, -79, 79, -75, -16, -29, 54, -16, -209, 149, -113, 79, -44, -57, -170, -111, -107, -102, 19, -24, 27, -57, -106, -32, 15, 93, -8, -66, 64, -111, 42, 39, 12, -26, -44, -118, -34, -9, 8, 155, -179, -4, -132, -135, 89, -21, 81, -60, -45, -135, -68, -26, -74, -21, 84, 88, -161, -34, -93, 162, -37, 76, 79, 154, -7, -201, 65, -39, -117, -73, -65, 78, -69, 157, 26, 132, 87, -159, -175, 122, -35, 25, -188, -19, 60, 7, 34, 91, -115, 37, 67, 65, -21, 98, 42, 85, -120, -16, -187, -15, 39, 7, 61, 116, 13, -49, 72, 95, -131, 18, -3, -129, 43, -224, -63, -187, -81, -19, -96, -62, 59, 18, -7, -48, 88, 28, 57, 30, -38, -46, 39, 23, -7, -68, -8, -21, 5, -70, 20, 14, 109]
6794A09j07k4J49l04PK12p2K52j11k07J24J07kj8j36K2Q0j00n6K15j0j51Q9j02
6818c4Q5o7M0j30J53j5k16J94j41K37lk21P6l9P8j28L00j32n5O2m8P0k9k5n3J
6844d0L1N4r1R4m9N0m2l2J15j98J05l1J29j57P4n3J73k78J03rj8J06L4j24K3N5
6870B4j31M6J17J02j82N7j24O2Q4lj04P3J6k03K21m4p9K0J80k44qP9K0n1J93j38
6896a7q1N7p8J10J6m8J30p6l8R7p5J12l8j51J30j48O3Nj2J65r2j55K06j88R4j18
6922a30oJ19L9j46K3K31j28R9j99J3K26j89N4r5J13O0j19Oj37L17N3j74l8J30
6946A22j27p8J35K9j71J12L7q3M1M5l2m9J53j18r3J30J2q1q6O1M2r6J4Q7k05J95
6972do6m1J50n8J89l9j05KOp0L7M4j19J63k08K81j06kp9Q1j89K47j16K4r1q0J54
$$ y = [109, 2, -22, 127, -177, -170, 42, -30, 222, 111, -96, 28, 135, 133, 115, -21, 1, 81, -19, -75, 140, 130, -21, 68, -34, 51, -16, 24, -106, 47, 32, -184, 10, -131, 106, 103, -118, -42, -81, -3, -131, 169, 37, -18, 44, -4, 66, 37, 12, -41, -40, -9, 45, -46, 48, -1, 49, 7, -25, 90, -108, -3, -34, 95, -62, 12, -41, 132, -146, -43, -52, -70, 36, 70, -54, -31, 24, -107, -61, 56, 158, -24, 33, -91, -29, 55, 52, -52, 21, 37, -166, 55, 11, -68, -48, 132, -112, -120, -41, -21, -72, 121, -17, -98, -41, -119, -9, 7, -41, 89, 13, -25, 72, -3, 109, 71, -80, 50, -98, -35, -30, -42, 123, 31, -124, 82, -106, -12, -130, -136, -17, 22, -124, -101, 130, 2, 101, -98, -85, 141, -48, 6, -89, 24, 84, -35, -29, -166, 151, 204, 30, -8, 122, -5, -83, 52, 81, -90, 22, 59, -24, 17, 62, 30, -19, 134, 16, -77, 53, 65, -16, -102, -41, 1, -95, -81, 6, -199, -4, -70, -111, 39, -19, 170, 131, 26, 28, 34, -36, 1, 45, -74, 89, -119, 162, 56, 54, -25, 56, -133, 114, -2, 22, -69, -149, 5]
6999EM2j96J32j5j48J47Rp4J13j4Q0O3j80J34j99J69q6L3r2K32j58l5L1L4l2J78
7025A73j66M8j41Q6j08K41l44K49m5j09m5N0P9k0P5L1j9n1J24l5M8k52K10j83
7049a04J54K5QM5k04J35o9J59j51P4J22j33mk6P9J05j98j7J00j47J96p2n5M2m2
7074B2n1P9l3k00K63m6j72Q1O8J88r8m3Q5j99j0op5K31k1Q8j0j37K0P9j89O7m8
7101f7k6J69nk3j92J23lQj8M2j41O0P3J3R5p0r9J48k04P4LP7M3k15J36L1p9R9
7129E2m3K3L3q7m6j0J77L1j22j62k3K40M3m3l5lj22M3M2J10j83J64k29J56q8R
7155g3R0l2J24l6J9O8k60J6K41j29k9Q7n6K2P9n6j27N8k3J8l0P3j92J43k0P6J03
7182A54j31J46mk20j07J90J1m2J33j84J57o2L9n8m4J15j39J95k39Q5j10p1L40
$$ y = [5, 47, -149, -17, -32, -180, -33, -24, -98, 15, 1, 81, 144, -36, 98, -101, 68, -18, 15, -77, 155, -3, -38, -7, 27, -5, 173, 7, 55, -86, 0, -108, 133, -211, 38, -7, -116, -161, -111, -32, -52, 23, 54, 35, -16, 108, 73, 121, -131, 79, -104, 50, 75, 83, 128, -76, 59, -10, 149, -2, 72, 194, 61, 57, 31, 110, 215, 17, 0, 100, -47, 149, 77, 22, 64, 22, -29, 50, 17, -183, 80, 34, -138, -57, 11, 199, 101, 58, 143, -56, -66, -72, -147, 84, 63, 151, 141, 4, 24, 103, -86, -19, -67, -93, 76, 71, 48, -144, -21, -24, -16, -34, 8, -133, -73, 0, 13, 108, 38, -61, 87, -117, -43, -40, 37, 80, -135, 1, 32, -47, 52, 9, 32, 65, -22, -68, -78, 99, 130, 8, -154, -177, 63, 106, 63, 28, 25, -97, -54, -12, 98, -85, 79, -150, 6, -82, -73, 17, -15, 109, 73, 92, 160, -100, -84, 157, 28, -1, 86, 30, 52, 131, 75, -52, 6, -17, 1, -29, 44, -148, -5, -25, 51, 154, 23, 169, 165, -55, -162, 28, 39, -3, 130, -54, 103, 41, 80, 22, -22, 93, -46, 149, -90, -5, -115, -186, 154]
7205A54k04O0j82J50N4J57j76m4j9J34l9r4J06k7O0r3j12J44J50j65j5M1P4j6
7229I8j30q4P9m0M9P3J17q3k97K90j66J83j98mK38k14L6Lj1r5rK25Q3o4k39J05
7255e5R7j40Q9J11k0j56J55R5k29k2R7j62J18J00Pq5l9nP7QJ67j83j44K89k39
7280f9j3R8j43J64qo6l4J6P8J00j12q2M5J58o9k0r9N3k5Jp6R9n2MLJ25k64K8Q7
7309g3K7J65l76M05j32No1J08k4m8M1R7j49q6L11l37J02J85j92J2M7o5J29l7j57
7334a03J52j8k19K11o5O8o9M6o2QJ66j27j0K7k00J20l7O1O7Rk7J44o1j6m8j56
7360a39K20j40J9Q3r8O2J0k54L57r0q1J45q9J7K9j2n6O7j95Q7J17m4M1k1LPp8
7387c3J16M0j83J19j84J51j8j40P2o8Q0K4n8J94k19J65K2j2j10J19p8o3m9j6K01
$$ y = [154, -50, 10, -172, -22, 32, 189, 13, -31, -50, 84, 45, -49, 57, 30, 90, -3, -115, 29, 179, 14, -1, 40, 114, 98, -32, -116, -37, -77, -28, 45, 162, 79, -218, 72, -94, 89, -109, -113, 125, -89, -53, -50, -61, -156, -165, 60, 143, 79, -160, -55, 42, -98, -9, 102, 82, -74, 81, 176, -53, -75, 22, -140, -22, 78, 85, 0, -39, -44, 33, 41, 208, 25, -119, 170, -69, -82, 16, -127, 37, 29, -37, -71, -55, 23, 123, 11, -71, -26, 132, 63, 43, -56, -3, -28, -27, -103, -4, -56, -52, -49, 76, -188, -160, -73, -46, 119, -257, 148, 16, 21, -40, 68, 44, -4, 37, 134, -15, -101, 210, -127, -25, 160, -32, -20, 27, -38, 91, 54, -103, 49, 31, -188, 23, -42, 26, -43, 3, -59, -51, 115, -12, -22, 5, -195, -75, -112, -51, 16, 25, -2, 142, 81, 65, 17, -139, 81, -59, -40, 43, -55, 7, 17, -237, 120, 30, -51, 94, 5, 22, 51, 39, -17, 50, -145, -58, 59, 15, 56, 35, 38, 45, -33, 83, 123, -60, 59, -125, 26, 8, -132, -60, -128, -48, -24, -82, 112, -107, 58, 80, 68, -42, 77, -1, -64, -113, -129, 72]
7412G2q3k9o3J22M2j6M4j39J65j09j22L1K9o7N2K31j63n8P2j52K49q9m5J26j00
7437@J50r6l4J28q6j36J14n2l5k0J0O8r4J21L9k77K46J09r5P5k61K56o3J32j71
7462B8O5k4j88Q6N4o9M1k8Jr5K17q9k4Q3p7mm3j3K8K70p8l02K60N9m8p8J49%k75
7491i4J75j18N6J28k37O3K9J02l0m1k26J87j25J87K7n7j41J61r4K4K8j24J32L2
7515D4j17PK10r3o5j71L95j40N5j04o2q6N7J91q9n7R9l37K39J81j52L3J94k63
7539c1o3J55o4J70k09J17q2pRj17R2l9R6m8J68k33J14j66L46k86O9J05o8j13Q3
7564b%J15N0j89O9o0K8j45J37m1J06k6Lo5J16Q0k56J41j08k7J25J3j13K3q1J62
7590E5O7j80J49j24Jn0O3J5l7R1n1l7n0J81j95O5J2o8J1K8J03o9p6K15j10J31
$$ y = [72, -11, -40, -103, 19, 61, 45, 89, -50, 115, 6, -116, -85, -56, -123, -71, 160, -3, -61, 11, -141, 108, 19, -26, 100, 0, 150, 54, 20, 148, 62, -74, 40, -12, -47, -67, -57, 11, -83, 38, 77, -200, 46, 155, 60, 135, -126, 130, 67, 199, 28, 93, 69, -119, -33, 21, -48, -7, -35, -34, -129, 88, -1, -25, 58, -19, -23, -66, -79, -51, 219, 141, -161, 99, 158, 110, 32, 181, 181, -94, 81, -37, 19, 147, -90, -27, 2, 104, 74, 33, -193, -6, -131, 56, 83, 26, -115, 46, -48, -24, 4, -120, 12, 44, -73, -66, 144, 51, -14, -185, 210, 70, 125, 21, -41, -127, -70, 121, 32, -25, 74, -263, -24, 157, 5, 38, 232, -31, -94, 61, -3, 167, -42, 75, -7, -14, -5, -122, -30, -69, 27, -21, 147, -86, 28, -138, 208, -78, -9, 96, 28, -85, -2, -2, 113, 163, -26, 43, -17, 11, -134, 3, -38, 68, 42, 45, -20, 96, 176, -80, 61, -47, -74, 51, 64, -49, -26, -107, 55, 122, -58, 91, -33, -32, -82, -19, -4, -41, 50, -1, -38, -88, 93, -102, -37, -25, -93, -82, -54, 49, -20, -96, 119, 9, 140]
7616A40k28MJ19k9L5j97O1K8mJ59J1P2k71K4P6r7J66K1j50Q0r8Mp2J34R4j85O4
7643c9k4J6M8O9KN0k05J99j83R7J50k96K61l4k24J53j01Q6m2Kn8k7K24o0J28j81
7669A1N3k7l3J11k22J59K4j1p2M1j99N9K3J24m4NM5K10l97J54lj06qR2n5J47j64
7696h3O6L1qj05J31j04J08j16J32k44K13oo5R6j52J78j45L6K35l23N4J56j99J43
7720B9j16Q7o8n5J48m2R3l7j3J7l2K1k3k2L8J5K8j34O4Mj13K02o8o6M6J6Q5j77
7748g3J52j19M8QJ7J49j26L0j40J62kL3l40J55j74J87Q1o5M9j08O9l8R1o4n8Q3
7774Gnp4n6J69J37m9j91J57j2k15K18j85qm3k0K43n2J06j56n7J53j54p0K18j02
7799d1J49j54K4J1j08P0n9J87j12QnNJ50q3J0m1j24K57k25j8N1j13J36M0n0JJ04
$$ y = [140, -88, -84, 35, 6, 41, -156, -95, -67, -71, 88, 99, 171, -100, -76, 0, -97, 69, 90, -60, 20, -78, -74, -146, -12, 82, -103, -39, -63, -47, 1, 70, 72, 122, -83, 116, -67, 30, 180, -116, 145, 111, -113, 40, -61, 25, -17, -15, -73, -100, 124, 64, 192, 11, 64, 37, 4, 115, -107, 52, 76, 65, -7, 34, -165, -106, -83, 41, -3, 2, 47, 257, -140, 14, 11, -95, -103, -11, -66, 81, -83, -17, 14, 6, -99, 32, -72, 36, -80, 52, -192, 21, 15, -50, 46, -106, 72, -73, -37, 198, -125, -71, 85, -114, 29, -87, 0, -68, -123, 25, -17, 76, 39, 26, 43, 11, 32, 9, -13, 25, 40, 68, -66, -2, 2, -111, 91, 23, -43, 3, 19, 104, -73, 79, -40, 8, 16, 33, 182, 56, 86, -54, 108, 106, 139, -201, -46, -220, -33, 48, -17, 32, -76, -7, -45, 46, -18, -76, 7, 2, -72, -128, 41, 178, 129, -62, 95, 83, -132, 86, -99, -107, -150, -170, 73, 21, 127, -29, -86, 67, -87, -157, 61, -41, 108, -46, -22, -11, -119, -49, -108, 79, -33, -25, -30, -25, 125, 42, 52, 11, -113, 144, -81, -99, -48, -161, -25, 15, -35, -34, 70]
7826G0J8m9q1J11j15K5o5J30m5jM9l1J13j18j65K2K66n7n9R2J3lk4q5L8r3l1m8
7854a23J25L4r2n5j5J15R0K5k37J55P5q6J31j96M5q7K48Qj56J41k76L0j1K02k62
7879a72K34k6q9M2O5q5PJ27j24N2L0p5Q6j62N6k7J40o4j21R0j3Q6j33O1N7p3K9
7906bJ61q1p4J11q9J0j05rj9k6J09n5K4J7k9R7m1M7k2k6J53k00Q0o2J02j87LQ7
7934b6P9l1J33j91L9n0O2J19k39J99M8j92M1O2k0J04j18j1k1r1J45q3R0L9j20
7959c3P2o7l5J04j21J50q4L5J07j42Q9O7j18N4lj14O6P3j41K1l4N8pJ5j22L19
7985B09j35j75J11o8K37J5k19j1j2K5j49J3K69l7j25L4m1R0l4P0j22J2J77j81
8009d7J29j89K10q2Q1j50L0j96L81l9j03j1J0J01k40J80q5M3n4Q2j20J72p4K9
$$ y = [70, 88, 39, -42, 69, -46, -21, -86, 44, -1, -2, 47, 16, 129, 11, -154, -132, 134, 77, 18, 110, 123, 120, 96, 11, 49, -44, -75, -123, 2, 36, -56, -111, -126, -11, 79, 104, -133, 22, 97, 11, 142, -54, -9, -96, 152, 160, 4, 145, -131, -101, -112, 90, -172, 62, 36, -53, -11, 54, -31, -24, 103, -21, 31, 61, -14, 72, -90, -34, -61, 79, 15, -106, -16, -29, 57, -76, -15, 42, -31, -2, 159, 78, 4, 115, 26, 36, -69, -78, -97, -123, -14, -69, -45, -28, -57, 40, -1, 46, 24, -2, 151, -49, 31, -31, 71, -116, -113, -26, 53, 22, 155, -36, 3, -47, 15, 134, -105, 94, 142, -50, -9, 53, 33, 137, 19, 8, -13, -104, 41, -42, 48, 87, -33, 39, -28, -63, 41, -80, 70, -14, 21, 128, -14, 75, 142, 24, 78, 75, -39, 27, 100, -41, -20, -54, 4, -3, 12, -110, 209, 74, -101, 10, -58, 179, 194, -25, -36, -48, -23, -172, -159, 110, 73, -52, -18, -59, 31, -3, 67, -55, -43, 134, -47, 82, -107, 103, 21, 102, -48, -18, -214, 167, 128, 25, 14, 24, 125, -115, 65, -20, 23, -31, 51, -69, 103, 29, 58]
8033E8q4j52K82j98O8M5J4j03p7K81j71O9K9k51j01K32P4r6J21o7q6J11L4j28
8057i6N0Q9N3ko8n4Q9p3J0qJ36j05Q3q7R4k12j9J98j09j01J67Mm2J42k8j43l3
8084f5J07M4r3O5jj90J93k03O8J75l8p4J48j96N2j9J2J84j09j28L3m2K26j50j05
8109a06N4Q3PP2o0k3l1J28m3j3M5j37M3J9k3j65K24j14Q2j94J85J41j66j63P5
8134h0P0jP9j45J32j89O0J62n1Q2j58NJ48k0ln0R9j72lj1LrP6m0K12j54L9r2L5
8163B4pm8J49m7L5L2j59N2m9P0j63j3M6K5k2J49k8N8j02NL6j07k1j0R2r3K57k12
$$ y = [58, -26, -178, 104, -94, -26, 19, 33, -70, -147, 134, -37, 32, 61, -190, -291, -59, 15, -81, 40, -27, -113, -2, 32, -96, -46, 43, 96, 94, 26, -28, 61, -12, -2, -10, 126, 21, 104, 17, 111, -101, -120, 78, -31, -132, 35, 39, -3, 139, 111, -32, -65, 42, 86, -7, 58, 57, -133, 60, -143, -75, 100, 62, -12, 136, -60, -8, -27, -15, 169, 60, -68, -35, -77, 149, -1, -106, -52, 31, 38, 110, 50, 27, -4, 124, 81, 68, 113, -24, 19, 38, 15, -150, 74, -40, 42, -152, 33, 174, 8, -155, -80, -10, -11, 68, -77, 55, -134, -74, 88, 37, 119, -39, -34, 114, 94, 91, 41, 140, -32, -35, -46, -43, -52, 24, -16, 196, 42, 81, -11, 24, 17, -31, 118, 71, 106, 138, -21, 31, -18, 52, -111, -124, -78, -53, -75, 74, 46, 104, 2, 7, 43, -64, -85, -95, -3, -96, 161, -51]
8191e1
$$ Imaginary data points
##PAGE= N=2
##DATA TABLE= (X++(I..I)), XYDATA
0@%%%%%%%%%%%%Oj4J6j6J6j6K2l0L2m0M8n6O4p2Q8j04J20j36J54j76K00k24K51
35A33k83L20l59M00m45M95n51O10o73P42q20R05r96J098j209J332j470J621j788
54i38J977k191K436k718L047l441L917m504N254o243P614r646J2938j9128L4462
69B2836j35620j84497M31503L2567k52627R2288K5670k05786K16586K50279l78848
80h5649k24742M35177R1447l30704O7748J14386k02339J24086K70270k98900k72053
91c11273L83113J85146l45458k9932J93861j35757K4555K37812k11568k60719
101b70220L08073K10847l05490r2416K12837o8111m2913K02862j38847k53320
111b36698K56303K17780k72313j21679K02172j4941p7760J56126p9461k42497
$$ y = [0, 0, 0, 0, 0, 0, 0, 0, 0, 0, 0, 0, 0, 6, -8, 8, -8, 8, -8, 14, -16, 16, -24, 24, -32, 32, -40, 48, -56, 64, -72, 82, -94, 106, -118, 133, -150, 170, -189, 211, -234, 261, -290, 320, -353, 389, -431, 474, -522, 576, -633, 699, -771, 850, -938, 1039, -1152, 1284, -1434, 1613, -1828, 2089, -2415, 2839, -3404, 4210, -5436, 7502, -11626, 22836, -112784, -297281, 134222, 166789, -85838, 6450, 32120, -173666, 42920, 293199, -85649, -310391, 124786, 216233, -114471, -46723, 67663, -134676, -10590, 259680, -39220, -311273, 71840, 256986, -88472, -118404, 75457, -60300, -35745, 202067, -9501, -270220, 37853, 248700, -56790, -149206, 63631, -4480, -47393, 155469, 16622, -236698, 19605, 237385, -34928, -156607, 45565, 30624, -47136, 108990, 29529, -212968]
121b12968K12793K30279k61625j39721K15332J5465j09640J14438j7566k13890
131a67103J41362K38462k21260j70278K16803M5081j35400Q0354K4184j76632
141a24427P9877K25720j60440j96274J93468R4165j53945L4391O1978j35530L3456
152d7561J87301j06291j86827J45690J21106j44936p981Q9274j03250j779J65380
163A10126p0456j70089J10951J29720j19307m4889R6212n9572l5443J38216l9262
174D6207j56633Q9530J20923j02459n7116R0017k5593n7015J05213k22j45243
185i2391N8616J24636q7556o6345Q1185j490n7420O5630K3821j13643K4168J20296
197G9507o5314p6737P7437J4235n8708M0445L1768p8930k954R7471l2479q1983
$$ y = [-212968, -175, 230104, -31521, -171242, 44090, 59555, -50085, 64353, 46787, -167103, -25741, 212721, -8539, -178817, 37986, 83067, -52333, 28021, 52205, -124427, -44550, 181170, 20730, -175544, 17924, 112089, -41856, -7465, 54513, -81017, -47561, 139740, 33449, -153378, -7688, 113418, -31518, -39499, 49775, -53475, -55254, 110126, 39670, -130419, -19468, 110252, -9055, -53944, 42268, -17304, -52747, 85469, 46207, -110426, -20896, 100027, -2432, -59548, 30469, 4876, -52139, 53074, 52852, -92391, -33775, 90861, 3305, -63040, 18145, 16655, -40765, 24865, 48686, -64957, -40789, 79507, 14193, -62544, 14893, 29128, -29580, 10865, 42633, -36297, -39251, 58220, 25741, -56242]
209e6242N8474L0848n7985K3569L3309n8403p743P3154j3987p1039L7177M5005
221C6137n1697K158M2328m2151j5786N7120o533n3117K0810M0078l4614j2344
233a7611M0882k4256k7104M9096J192m7048J5256L2770k1533j7927K6963l461
245G219k8081K7851J2351l9343R135K8281j8967j1916J8387J305j8750J0694J8139
258A6305k4489m660K7396j0997j3477J4823j34r147M627Q016r221p578J6773j697
272F540j6855J2807M094j2732N306M372m588l566M157M433r065J725Q463r680
286d589J766P345p157P11L755l57j113k862O001q29o089O839j231l695M361l114
302b58L74J524l074K914k689l83L709n357K351K200m777L754j213j161L600m071
$$ y = [-56242, 2232, 33080, -24905, -1336, 31973, -26430, -34173, 38981, 24994, -46045, -8868, 36137, -15560, -13402, 28926, -13225, -29011, 28109, 21576, -31541, -10731, 29347, -5267, -17611, 23271, -985, -28089, 21007, 22199, -24849, -9593, 23177, 1644, -16283, 10680, 7219, -20862, 6989, 19340, -20003, -10868, 17413, -1554, -13470, 4917, 6222, -12528, -1834, 16305, -8184, -12844, 14552, 3555, -9922, 4901, 4767, -4380, 247, 8263, -958, -8536, 8237, 6540, -10315, 2492, 6586, -6146, -840, 3532, -1056, -4622, -465, 3968, -5097, -3372, 5091, -4589, -2823, 4522, -2635, -1924, 1831, 1474, 361, -2501, 3500, 2671, -3418, 3421, 2190, -1505, 2856, -258, 116, 1640, -1434, 1480, -1209, -1592, 2117, -3240, -889, 1311, -3466, 288, -925, -2086, 1514, -2557]
318b557K430J576l642M018k325m83M599n322J572K984l468K028j145J43K225m562
334a929L883K2n389N885j412m099M013j175j373k20Q59K704o963L228O900r668
350d734J629P633o077l85M764l95m319R38Q405p705n437J3878n901r454J2102
365D942o71j0482M276Q474p037r267J3527K311j7205J1445Q518j8407M951J5158
379A0533j2054r222J4877N358j9125N670J8496k0519m555K6305j2397j8299K0850
392E918P102k2091K879K1158j6778j4235L0324n022l1610K4466J6239l1520K005
405a1165K7129j5907j9338K9337N795l8285J7579L0746l6082p310L8067j6304
417D262k6246L1065J0917m0213Q747M0346l2030k3175M6795p197m0352L2798J9490
$$ y = [-2557, -127, 1449, -2193, 1825, -500, -983, 3616, -1706, -134, 2850, -618, 1410, 265, 408, 2633, -1929, 1954, 1976, -3413, 2472, 1060, -3039, 974, -201, -1574, -1794, -935, 1769, -5194, -1966, 4934, -4734, -3105, 4528, -1549, -1934, 2830, 2435, -1884, -946, 7459, -246, -5683, 8195, 2294, -7160, 4942, 4271, -6211, -1935, 6539, -498, -9765, 3762, 6073, -11132, 313, 8831, -9576, -4625, 10533, -1521, -10743, 4134, 9492, -9633, -3963, 14533, -5986, -10541, 15764, 3367, -14932, 5918, 13020, -9071, -6192, 14966, -1812, -16047, 14277, 9255, -22355, 2111, 18350, -13170, -11165, 15964, 57, -19281, 10056, 15851, -22434, -4855, 25891, -10191, -17501, 20566, 4262, -21984, 9081, 19998, -20215, -11468, 28878, -3152, -26327, 20468, 13271, -27081, 5717, 25207]
430B5207m3710K702M3727k5237l3618M5527P065n2670K6806L6057m9705o652N2563
443B8062k0882m0647M3091J9152n5897J3852N2030m6881k4000O1837j3603n1709
455c5595M2697K7272n8860K825O0766l7165m2770O2941L974o5198L7318M0988
467C9193o2367o392O6693k7152n4597N6049K3322o9694K1859N7370o0405k1271
479c7392P5344j7464o4704M8030L7581o5782L003O5574m9206m0132P8939k862
491C0929p8946M0601N1661o2546j1978O7389l3504n3341P3656J8250q9344K7135
503b0038P0672n9563k7171O9533k1351o0016O4377L3737r1382P399Q7627m9190
515D634m9413P1394n884o6736N5041M3946q6473r988R3732l0977o9032O4143J5613
$$ y = [25207, -18503, -15801, 27926, 2689, -30929, 14598, 21663, -31007, -4201, 31856, -17849, -24501, 28062, 7180, -33467, 9624, 28776, -27121, -13269, 38761, -8120, -32120, 29717, 16114, -35595, 7102, 34374, -24486, -21661, 39105, 1940, -40830, 22111, 26085, -39113, -1795, 39193, -23174, -29566, 37127, 9975, -44622, 11427, 34749, -34945, -13086, 44284, -16121, -37392, 37952, 20488, -44216, 3814, 41395, -24387, -21384, 44190, -5016, -45148, 33791, 30929, -48017, -7416, 44245, -18301, -30279, 37110, 3606, -49735, 23921, 42171, -47173, -20038, 50634, -8929, -36100, 33433, 12082, -47934, 16443, 50180, -41202, -33803, 53824, 4634, -44779, 26615, 20731, -46005, 9036, 52982, -33491, -43479, 50253, 19276, -49756, 14387, 30000]
528C0000p3231M2666N4955q2456k3246R5337j3199q0261M8757L8069p0661K1714
540a1556O6596p3180l7845R5842Q95q6433L3313N2464o0581M79P0337n7167n3925
553f0761R4015J7282r4846K0977O3938n0301j6211O6485l8383o3827Q3177L6715
565E8260r9521M735P7743m0610l0190O1382k2395o4969O8550N0622r4535j5550
577d6478Q8283k6525m7808N5896p281o5082N3768N6300q3181l2183Q7527o363
589B6873o1913M4278J1785o3758L9431O0763p2457m1004Q1411J0649o6776K7066
601c652K9327n7040K0851O5149o1226m9634P6745K1544o6867J1348L9025m3823
613a8253J567O3766m5147n8993P0524L2541o8131K16M4005l1107j0180N5053k7256
$$ y = [30000, -43231, -565, 54390, -28066, -51312, 44025, 30826, -49435, -678, 37391, -33270, -11556, 55040, -18140, -55985, 39857, 40752, -45681, -12368, 40096, -20485, -20006, 50331, -6836, -60761, 33254, 50536, -44310, -23333, 40605, -9696, -25907, 40578, 2195, -61632, 21545, 58260, -41261, -36526, 41217, 607, -29583, 31799, 9404, -55565, 12985, 63607, -30928, -46478, 41805, 15280, -32528, 23368, 16087, -48995, 4773, 61073, -22108, -54291, 33236, 26873, -35040, 9238, 21023, -42735, -3304, 57459, -14998, -56002, 25409, 36058, -30718, -3652, 25675, -31365, -10514, 54635, -6591, -56225, 20520, 42064, -24803, -13455, 25570, -18253, -16686, 47080, 1933, -57060, 13464, 46005, -22126, -21910, 22095, -9012, -19192, 35861, 8605]
626H605o2335N8242M5307o7035j1743N0385k1316j8698M5270j3989n6868M1478
638b697N1461n7764k5351N2840r477k7775L7520m195n0832K9438N0018m5073l4883
651c6770M8701M740l5254K7001P335m5683J9931M7015l5517l6536M0490J5502
663B0955l5054J3613J7846l7943P957M6291k7904l7634L5137J9803l1413K305
675f041K1078k6552l552M1685j7405l9881L0250K2720k9191k931K0300j5934q998
688a4452L2003o141l7658K1378K7443k7222p172K1182j0366j0179K3025J45l0189
701a8203J0920K8449k0507j4275K1611m931j2850J7528K133k3183N306K3462j2590
714B870j6938J7266K660j5170J2315N766j9322L318J8344p449j4523J0990P126
$$ y = [8605, -53730, 4512, 49819, -17216, -28959, 21426, 110, -18588, 26682, 12693, -44175, -2697, 48764, -9000, -34351, 18489, 9012, -18763, 18757, 14562, -36270, -6832, 43186, -1887, -36770, 11931, 16671, -18583, 8418, 15753, -29930, -9999, 37016, 1499, -35037, 5453, 20955, -14099, -486, 17360, -20583, -12626, 33665, 5761, -31873, 3264, 23067, -8346, -6041, 15037, -11515, -15067, 26618, 9213, -30668, -418, 22302, -6889, -9820, 10480, -5454, -14452, 17551, 11410, -26248, -4870, 22573, -4649, -11821, 9361, -1005, -11184, 11841, 11986, -18203, -7283, 21166, 659, -13616, 7995, 3064, -9786, 7742, 9875, -13308, -8002, 15460, 2870, -14068, 3198, 5858, -9312, 3003, 8769, -10553, -7235, 11109, 3660, -10863, 127, 7253]
727G253j2742M901R497j5057l13J6857o663j1704P966O309q549j48Q703q295m843
742f828J3672k930j1719P236M848o300o73N151k526n277P553K147j0114L851O582
757D673o129l63M002j819k345K972K641n281o51O627l973k672M920k094k145K434
773G97M09j762j443K843Q2m010L251Q91l625K890K66j673O82M31J030j526k59
790g26K599k426J75K473k558M93J089j031N36p58N95M91k107J999j27k195K431
807I53j099q85J471j169M88k00l63J595j989O39J454k245J623P83j913J279l6
824C86l8K52j159J883j128j098L189k686r49L075j587q50R68L5j67j336K391q36
842C45l596M129O64m319K519J263k653R10J921o54l403L221L628o400R96N181
$$ y = [7253, -5489, -588, 8909, -6148, -6461, 10396, 3733, -7971, -5, 6304, -2245, -2393, 6310, -1985, -6828, 6844, 3914, -7805, -569, 4279, -2021, -2694, 2457, -69, -5346, 2207, 4354, -5760, -1909, 4673, -1456, -1819, 2183, 364, -1981, 991, 3632, -1649, -2300, 4327, 354, -2318, 2602, 508, -1637, 797, 1206, -556, -1999, 844, 926, -3084, 167, 1058, -2567, 323, 589, -1084, -402, 29, 1059, -467, -726, 1873, -553, -378, 2095, -463, 30, 1119, 88, 624, -134, 461, 952, -1155, 844, 717, -1478, 953, -146, -1031, 440, -729, -241, -441, -804, 791, -1198, -559, 895, -1350, 273, 1056, -857, 422, 386, 348, 600, -559, 1324, 196, -902, 2287, -399, -1348, 1727, 140, -710, 258, 293, 126, -1210, 1181, 345, -3251, 878, 1542, -2777, -258, 1005, -1648, -738, 1183, 529, -2874, 347, 3975, -2425, -1429, 3752]
858C752m579L1M391l112l283L705L509n840k264O962k973m197P216k815o563O588
874E28M093o691l034P531n2o575O245J365j0098O675Q196j0265l979R592L77p290
890c382M164L922j0346L442J2831j1705q468J3655J314j0149M279M642r558Q70
904d489J4493r092j4185J5813O368j4649L600P600j0194M28J4966p324j7133J4342
918E44J2704j7611j500J3023j0368k478J6915p175j8869J3612J6477j7638p789
931a0153J6713o178q628J8556m665k2478J3755J9766j7398j2675J7630k63j2800
944h818J6153J444k5839J1749K5317j8890j6245J8929L845j4866J1522O764k5913
957a4848N870L0764j7996k3276K1806P888j7467P967R644k3134Q13L2698j3428
$$ y = [3752, -827, -796, 3595, 483, -2800, 905, 4414, -1426, -3690, 3272, 299, -3898, 3318, 503, -6060, 528, 4621, -2070, -5104, 2427, 2375, -4200, 2045, 3410, -6688, -13, 8183, -2082, -6061, 3531, 3908, -3382, 782, 4704, -5642, -2200, 10631, -1074, -9542, 4113, 5427, -4722, -443, 4199, -5359, -4489, 10004, 912, -13273, 2540, 8908, -5741, -2141, 5459, -4735, -4307, 10659, 3335, -13798, 544, 13248, -4363, -5863, 7160, -3208, -5686, 11229, 4054, -14815, -1203, 15274, -2364, -10153, 6560, 382, -8246, 10310, 5645, -16833, -3078, 16688, -710, -13385, 4245, 3982, -8818, 7335, 8779, -17060, -5311, 20006, 1116, -15129, 3800, 7645, -7221, 4301, 11065, -14848, -8978, 21786, 3790, -19486, 2320, 10208, -7259, 708, 10352, -12782, -11969, 20729, 7301]
970G301l0162K2174J5559k1456L973J3021k0583k224L1702q079l4219J8379K4320
983A9706k3007l681J8151j7730o407L0939n018l5198J3718K9341k0859j2550K1303
996H708j0946j3239K9996J19l7065J1046L2758j7994j8563K1238k546j8110K5466
1009A0868P142l8606P110L6724j6853k3383K0594L619j9808J8371J3045l6137
1021a7314K5M0566j3760k9537K0809R403k0734J1896J5964l0419o884M0425o679
1034A3761l5605J8733J6782k2005O249J7954k4821j0376L6666P7l7489J2871K4650
1047A7447k2202j741K1584j9903j4159L2822M280l6263O963K8822j8406j0401
1059a1157K3632j2925j9367L0185Q266l5471L553K9949j3687j6204K1821l833
$$ y = [7301, -22861, -687, 14872, -6584, -2611, 10410, -10173, -12397, 19305, 11226, -22993, -4614, 19706, -3301, -6982, 11169, -6561, -12968, 17971, 12953, -22245, -8527, 20814, -45, -12595, 8708, -2238, -15477, 14519, 14638, -22427, -11381, 21377, 3383, -15180, 6058, 3512, -14598, 10868, 18010, -20596, -13486, 23238, 6385, -16998, 3596, 7215, -12593, 5778, 18823, -17314, -17289, 23277, 9517, -20020, 789, 10192, -10542, 1354, 17318, -13101, -19985, 20440, 13761, -21844, -3111, 13671, -8334, -2085, 15869, -8952, -19328, 17338, 17415, -20074, -7203, 17447, -4755, -6496, 15088, -4815, -18974, 13848, 18128, -18135, -11172, 17650, -756, -11157, 12475, -450, -19817, 10368, 18634, -16837, -13284, 16665, 2978, -13226, 8595, 4762]
1071D762k2875K4111J4529l4767n18L1771j0933j9508J8795K525k2372J5964J8605
1084B0089l0321p156L2862p162k3305J6966P124k1030R315J9935k3184j2806L0913
1097A2240o49k6629J4054J2482k0405M362J9806j7167j4911K5594N043k6534Q278
1110d436J7534j8760j594K0449j2343j6288K1162P774k3719K710J9706j4309q197
1123a0311K0599o910j8357J8098R745k1445J04J9053r564j1529J7668m94j9348
1136a2691J3264J3053j9684k580J8281o469j2612J3479L929j7525O580J5383j5976
1149c568o572J8129m171j3235J1062N761j4249J909J4548j0231r782J5947L13
1162E861j4548Q772P783j2605j70J2474n771r982J1398M010j3743M557J0433j1459
$$ y = [4762, -18113, 5998, 20527, -14240, -14758, 17013, 6080, -13428, 5367, 7892, -14480, 1484, 20089, -10232, -17388, 15474, 8312, -14993, 1973, 9097, -11933, -2618, 17317, -5867, -18673, 12240, 11591, -15038, -984, 11498, -8907, -4545, 15261, -1906, -16817, 8777, 13820, -12714, -4436, 13098, -5662, -7256, 13193, 850, -15438, 5724, 13498, -10221, -7511, 12195, -2114, -10311, 10288, 3378, -14979, 3119, 12864, -8581, -8477, 10576, 1012, -10517, 7151, 6657, -12691, 573, 13626, -6058, -8638, 9643, 3174, -9438, 4041, 7970, -9555, -2975, 12408, -3568, -10140, 7989, 3818, -9417, 1645, 7406, -6843, -4934, 9614, -617, -10399, 5548, 5861, -8687, 85, 7868, -4737, -4907, 7567, 1796, -8186, 3212, 7222, -6521, -1964, 8469, -2990]
1176b990k648J1975m154r162Q151M852j0820O98J0894p822n940J1395j605r293
1190f469O746M946q325o68Q913l757p245Q429K059r471M293O028p368j251P213
1205D073k378o020M881L954p552O14P021n661k764O915j589n299L553L345m613
1220a520j426N757k187m608N761M55n675L299L088l857q28L717m61l774K896K245
1236B882n002J257M002l679j173L179p09k214J148K015k935n93L725k044k362
1251b503L526k69k329J511Q87j149q27K032Qk391J914J230k593J154J034j291
1267e6j23O95K35j021j72J787j718m60J851j461l92J102q12OM8L43L15j229J363
1286C01Q1j308J602k40q22R12k10j04j47K1P74j092K0J115j382N06O14r07J19
$$ y = [-2990, -5638, 6337, 2183, -6979, 1172, 6024, -4796, -4098, 6796, -1026, -6966, 4429, 2824, -6469, 277, 5223, -3102, -3770, 5143, 1386, -5859, 2570, 4629, -4842, -549, 5479, -1889, -3140, 4073, 1695, -4325, 556, 4510, -3042, -2428, 4593, -1068, -3832, 3083, 1494, -3805, -252, 3093, -1520, -2946, 2811, 624, -3984, 1777, 2232, -3443, -144, 2944, -913, -1741, 1976, 1515, -2259, 637, 2882, -2120, -863, 3139, -540, -1713, 1466, 757, -1457, -309, 1706, -1229, -1822, 1903, -141, -2503, 1023, 754, -1575, -64, 823, -326, -1153, 879, 887, -1504, 410, 1640, -953, 201, 1235, -56, -179, 516, 751, -270, -442, 1345, -373, -833, 1018, -443, -835, 267, -545, -539, -491, -148, 167, -1062, 301, 382, -926, 676, 436, -386, 526, 316, 212, 65, 86, 860, -232, -212, 903, -479, 27, 641, -266, -147]
1305a47L18k87n1n59J015l64r36J466p94p70J428m79l11L87K32M76r87M62M63
1324E62j250J125P04j886J043N25p93j21J82K90q58K55J474k147J16J902j452
1341c29o26J439n63o30L83J208j407r95K808o96k508K510J76k214J843R48j755
1358d08p29K451K50l237J833K010l551J168K498l238j103L440r7l140P99K521
1374A467k622o07M262l121k611N093K98m426J177L164k178j244L750j770m202
1389c570N382K016o290R64M128k436j756L482j083m676M486L950p248j013O746
1404C082k649k998M260r08m775M172M868o835l181Q409r37n788M920L43o070M521
1420D34N610p422m022Q207J409p675L272K994o881L346P055p687n371R168K726
$$ y = [-147, 171, -116, -167, -726, 289, -75, -1011, 455, -339, -1109, 319, -160, -471, -84, 148, 624, -363, 99, 562, -688, 437, 1141, -745, 298, 823, 30, -91, 91, 381, -477, -222, 1252, -895, -779, 1123, -329, -955, 484, -79, -709, -326, 882, -525, -1520, 1288, 592, -1916, 594, 770, -1444, 399, 1347, -408, -1137, 1314, 1564, -1673, 160, 2170, -1381, -213, 2285, -953, -2056, 1384, 1287, -1853, -1054, 1467, -1155, -1762, 2500, -621, -3232, 1861, 2159, -2267, -1090, 2074, -104, -1348, 2402, 632, -3570, 1812, 3828, -2462, -1498, 2630, 194, -1562, 1920, 837, -3839, 647, 4597, -2651, -3664, 3082, 433, -2565, 1695, 787, -3988, 184, 5052, -1783, -4964, 3445, 2508, -3280, 1640, 1983, -4087, 434, 6044, -1378, -5400, 2807, 4216, -3459, -187, 2807, -4074, -728, 6327, -1360, -6731, 2437, 5163]
1435E163q209J084M854n841R52Q584p139p926J0629M304r155m36O049m032j119
1450b238Q533n123r892J0109P073j0984j875P583l252k357P565l593j0438Q743
1464a46R759j1775m820R859k034l927P246k321j0493P368J1577j0979p846J1122
1478B590J032o911O725o74j0864O728J2248j0225j0288J1005M438q561L819K244
1492C306j0666M743J3305r506j1894J0574O964q798L74M823q994J868J4351q074
1506B376j3812J0833Q995r309j906N718o306o31J3641n607j5551R999J1545j0422
1520d37l975O753m434j614J1419l312j5893P784J4376j0231o881Q218k442l004
1534c673J0069j876j4864N954J5525q657j0317Q956P61n171Q378j85j4043M476
$$ y = [5163, -3046, -1962, 2892, -2949, -1997, 6587, -552, -8478, 2151, 6455, -2700, -3136, 2913, -1119, -2238, 6295, 1172, -8720, 1389, 8462, -2522, -4397, 3186, -66, -2423, 5142, 1549, -8889, -146, 9613, -2162, -6982, 2877, 843, -3084, 4162, 1841, -8652, -1284, 10293, -686, -8532, 2590, 3622, -3289, 3436, 2762, -8102, -1374, 10874, 649, -9639, 1366, 5804, -2757, 1062, 3306, -7360, -2617, 10688, 1182, -10712, -138, 6826, -1972, -1598, 3225, -5769, -3901, 10450, 2376, -11436, -603, 8392, -917, -2823, 2895, -3411, -4042, 9599, 3992, -11559, -1560, 9985, -437, -4412, 2341, -2093, -3707, 7712, 4400, -11493, -3709, 10667, 436, -6445, 1773, -669, -3673, 6396, 4520, -10344, -4390, 11135, 2478, -7839, 1117, 1878, -3293, 5085, 4900, -9143, -4667]
1548d667J5329o866j2463P988M718o867N477K310j3204K734J5531n798j3368O897
1562b249O927o310K023M266j1202L05J5857m408j4115O220Q415n845o05M558p733
1577c896k160J4350k116j5085N332J0322o271k555M936n688k763J2022l5j4815
1591h422L416J1902n620m854N529l414l381R764J116j2923J194J2611l826p396
1605d304N442o86m486P910K020j1541L6J1803k162q642M257K092n344N540L516
1620E451j0303q16J1161j631q410L136L753m542K554M627q429k218J0614o77q622
1635d352K649M361l697P85M039n418l639R135J002r116K052N274l333o86L627
1650B683l693l383O674K215q191L75O165k628j943L630k238l114N106K446o451
$$ y = [-4667, 10662, 3796, -8667, -679, 4039, -2828, 2649, 4959, -8245, -5511, 10020, 4222, -9146, -2249, 4678, -1632, 391, 4657, -6545, -6240, 9617, 5209, -8906, -2686, 5729, -116, -721, 3837, -3896, -6056, 8294, 6178, -8907, -3575, 6747, 476, -2079, 2857, -2831, -5594, 6428, 6393, -8422, -5006, 6896, 1276, -3578, 1951, -1463, -4844, 4920, 6036, -6887, -5693, 6918, 3092, -4304, 1138, 452, -4034, 3876, 5896, -5645, -5609, 6194, 4032, -4610, -353, 1739, -3605, 1935, 5451, -4852, -5668, 5493, 3862, -4548, -1412, 2341, -2201, 353, 4980, -3449, -5667, 4947, 4270, -4352, -1703, 2658, -1039, -254, 3785, -1633, -5272, 3863, 4865, -4251, -2199, 3075, -258, -944, 2683, -1010, -4393, 2281, 4496, -3695, -3320, 2845, 217, -1726, 1904, -334, -3448, 1658, 4104, -2347]
1665b347r48O188j367l575L650r13l552M137K261n060j326N053k98l920K184J041
1681A208l672K580K932m596j363M312K82l514J262J751k620P75L285l239k058
1696b675M342K22l138R82J632j547l89K530j725k639L508Q55l420O35J931j433
1712c29m55J525m53k080J801J770k721j97K235j220n92J592n98j379Q69J554j584
1729b62q82K048m62j301J633j50j441R91R16j087p51J210K39j576Q09O33j486
1746i19O56R17j017k58N78L05p59K12Q34r49K9J066p85m04Q80l3l02j26L38n2
1766B11n21Q57j01r18O95K60p70J69J94j02j37p9L84o93R7Q51o83n2L56j75j09
1787b66K55J77N2l01N50k56l38O31k98o22P36j45k47K96K4k94k09J90K50o75L70
$$ y = [-2347, -3295, 2893, 1526, -2049, 1601, 688, -2864, 1273, 3534, -1526, -2852, 2201, 1903, -2017, 167, 1208, -2464, 116, 3048, -1548, -2911, 1401, 1683, -1831, -569, 1182, -1438, -663, 2622, -617, -2675, 1667, 1889, -1249, -267, 1365, -182, -571, 1959, 234, -2405, 1103, 1958, -1462, -827, 1104, -329, -784, 741, 288, -1792, 9, 1779, -942, -1139, 1096, -124, -716, 876, 278, -1101, -232, 1322, -262, -1144, 904, 442, -859, 774, 624, -817, 174, 1090, 3, -748, 462, 701, -875, -66, 567, -919, -263, 654, -363, -621, -43, 262, -497, -285, 549, -400, -371, 695, -90, -494, 386, 353, 51, -75, 263, 211, -310, 547, 446, -472, 223, 483, -287, -118, 76, -26, -163, -242, 142, -551, -454, 397, -286, -338, 18, -157, -266, -11, 166, 218, -83, 467, 211, -127, 504, 206, -416, 320, 175, -72, 224, 248, -46, -255, -65, 185, -490, -120]
1808a20K99o79M09J30j14k06J37M38n81R2P55o23m12R50p05P1N75k32k63K0M93
1829D34j34p53Q49R2j074Q98p6q71L59P24m99n96N96M78j049O91N88j211p4J420
1849G92q80n14Q81J33p38J62J022j146m82J843o56j351J502O9j178L91J070j118
1867a98p81J753k26j951J606P60j918L96J418j211q93J714K49k001R63J732j888
1884d76l92K402j586j199K193P9k089O61J995j840j126K644q66k118K443N52k774
1901a497P41K160j573j361K117J66k719K054J710l177J91L291k018j849K556M73
1917A265k546J061K449l065o56L871j681k879L057P33l305J098K660k516j664
1932b118L553l86l535K590K012l931Q15L274k409k009L085N55l664J768K998l784
$$ y = [-120, 179, -500, -91, 39, -75, -281, -144, 294, -287, -195, 560, -63, -475, 475, -230, -159, 416, 184, -79, -59, 434, 300, -453, 396, 488, -586, 312, 236, -635, -276, 448, -51, -647, -51, 427, -622, 69, 657, -554, -628, 792, -88, -602, 279, 412, -326, -164, 858, -288, -770, 1073, 417, -934, 568, 637, -541, -150, 920, -198, -979, 774, 548, -1403, 203, 963, -955, -559, 859, -352, -1245, 469, 718, -1283, -320, 1412, -476, -868, 1534, -52, -1251, 942, 1021, -1068, -407, 1588, -252, -1378, 1266, 400, -1718, 725, 1277, -1497, -756, 1404, -169, -1530, 587, 753, -1966, 88, 1798, -1379, -1188, 2103, 85, -1764, 792, 1265, -1281, -220, 2229, -836, -1492, 2379, 698, -2181, 876, 1609, -1696, -598, 2062, -454, -2118, 1435, 1049, -2486, 104, 2116, -1815, -1000, 2274, -135, -2144, 941, 1496, -2168, -400, 2598, -1186]
1948a186p45M452k021k745L326R18l811J064L553l300j977M739j021m105L346
1963D87J671m174P24L862l075k298M249N72m800K476K939m260j8M456k924k768
1979b881M196J318m687R89M036l609j496M900k222l918M456J910n017L94M130
1994B499k495k598M479p29m922M054L182n375m75M725j804k797L707K27m765K767
2010c20M327n241j721N358j156l635L278J054m506J833M512m381l192N746K0m534
2026b558K912J487m332J478M233l322l667M900J555m884J402L014m000N45M528
2041C291l091l700M362K305m611j0L803l317p80M986k545m626M458K805m725q36
2057b231L913j821j981M184p28n205L586M030m931j286L777q31k226L381N2m887
$$ y = [-1186, -1931, 2521, 500, -2245, 1081, 1999, -1812, -748, 2805, -495, -2472, 2267, 1246, -2859, 487, 2158, -2016, -1292, 2570, -505, -2803, 1446, 2018, -2782, -306, 2633, -1627, -1645, 2811, -113, -2881, 1315, 2633, -2054, -1065, 2971, -638, -2134, 2766, 544, -3374, 1082, 2992, -2025, -1631, 2499, 4, -2594, 1885, 1156, -3766, 288, 3470, -1905, -2380, 2345, 541, -2256, 1451, 1678, -3087, -320, 4007, -1234, -2955, 2403, 1247, -2388, 890, 1944, -2562, -729, 3783, -598, -3790, 1956, 1976, -2558, 354, 1841, -2491, -1013, 3220, -102, -3769, 1131, 2686, -2198, -796, 2218, -1782, -1237, 3291, 200, -3500, 862, 3167, -1444, -1454, 2349, -968, -1748, 3238, 693, -3933, 525, 3330, -1395, -2231, 1682, -139, -2120, 2064, 1336, -3869, -283, 3747, -1184, -2470, 1307, 476, -1750, 1631, 1683, -3204]
2073c204K612M578m324k456M237l53k623K627M91m067J415M643l473l415M350
2088A038N43l162K029Q69l727J176M263k459l922L665J941l507J166J890l408
2103a605L51M191j948l787K619K662l091k72K452k416p91M197j523l890K463K731
2119B343k744r48K298j454j200L525n28m047K165K990k467j279K181o36j491K529
2135A237L94l773J033L502k092j959K261j06j366J683M97k746K29L366j529k694
2151b063K318L43j550J281N25k187K5K738o76k578J613J342j883P68J111k128
2167a001K07K198m87k072R14J587j541k13J298j382o46K351l66k143P93J434j037
2184a06n92J193o39j114J872L11k169O23J413p01o05O96j5n66P49N31j521J08
$$ y = [-3204, -592, 3986, -338, -2794, 1443, 1090, -1533, 1094, 1585, -2482, -1067, 3576, 103, -3312, 1038, 1581, -1581, 448, 1317, -2410, -1234, 3029, 570, -3352, 313, 2254, -1253, -87, 1803, -1605, -1254, 2937, 989, -2798, -179, 2483, -608, -880, 1572, -844, -1635, 2562, 1039, -2851, -388, 2343, -401, -1349, 949, -505, -1705, 1820, 1292, -2755, -590, 2400, -67, -1346, 835, 199, -1292, 1237, 1631, -2142, -1109, 2393, 301, -1658, 603, 497, -869, 814, 1311, -1435, -1206, 2160, 631, -2063, 255, 598, -952, 329, 854, -1333, -1308, 1430, 754, -1824, -211, 1131, -752, 16, 1127, -1001, -794, 1404, 917, -1155, -241, 1346, -195, -408, 890, -492, -1138, 1213, 847, -1296, -503, 931, -106, -698, 495, -144, -1258, 614, 925, -1244, -621, 792, 91, -514, 182, 167, -399, 350, 881, -640, -532]
2202e32J689q61q88R68j75n94L33O85j021l51J395k10j389J022J63o47M29L53
2220C69n56m48R23K43j059M13O93r10K34N30p01R0K24L61n64j34Q02o48k14Q93
2240E41n30l19O75o6n66N6K86p7n06N54R5o10M32L03m90J08M40m23L4j2L52m35
2262a58J65M98m96Q7K98l93N6N1J47k72j42M70l36k73N08n8m41L29p6j49K61j53
2284g7N2k93J77L01l57K29K22m73K63K75k77J11J37o0k38o7M68l39l06O75n17
2305i4j22L73j88j74J09j7J88o16N41J63m61L97m3k80M78ok21j17P5M17m08K3
2327A7M07n88J44N18o10mJ82J71k96l20N07j45m80Q41l87o18P98M9l93K2L01J19
2349B35m97N39k6q77P44P65j095M1N47n20J15L75j07q27L62R99r32n73J287o66
$$ y = [-532, 1157, 296, -592, 376, 201, -393, -60, 625, -396, -747, 648, 438, -951, 71, 234, -413, 16, 369, -187, -635, 288, 531, -528, -115, 578, -332, -98, 432, -269, -179, 45, 406, -158, -292, 510, -138, -352, 541, 11, -308, 367, 301, -265, -209, 77, 0, -506, 48, 143, -467, -35, 268, -222, -114, 326, -97, -63, -75, 277, -158, 7, 505, 9, 96, 394, 1, 57, 108, 255, -17, -159, 311, -25, -298, 210, 152, -289, 40, -36, -185, 76, -77, -25, -318, -141, 160, -197, 32, 254, -219, 44, 319, 42, 153, 290, 230, -8, -75, 393, 54, -252, 423, -94, -216, 157, -31, -205, -96, -113, 75, -541, 0, 163, -298, 99, 56, -224, 254, 248, 27, -90, -15, 402, -6, 17, 424, -164, -20, 498, -112, -116, 66, 237, -59, -379, 128, -17, -497, 344, -43, -661, 137, 186, -207, -185, 116, 235, -262, 277, 251, -626, 118, 883, -212, -171, 376, -144, -29, 346, 239, -588, -226, 773, -159, -732, 555, -111]
2369a11k83P48k11o09K06J143r51o47J086P1r47Q06Pj053N09J229q95q70R45M78
2389F51j004M09M72j482N90J542j053j210J110N35q46n9P78j140k2J869p40j855
2407a455J371Q85j100N0R36j000j24J507k52k199J356J336j377j52R35r96m26
2424g05J749m35k033R51J959j537p69J354p84o15J556p2k048O60K123j125j283
2441a054J486j24j264J808K01k286N17K254r34j777J301N61j380J290P10k665
2457a356K95K792j160k009J298J032j362M53J243k394l31L022o18k616J368J276
2473I33j290K15J047j553q77K973jl098J153J791j490jJ231j407r00K442L21k925
2491a436M21K462j442p78J640j142j230K299O68k858J2K686q11j611J887n04j560
$$ y = [-111, -394, 354, 143, -466, -260, 883, -68, -715, 371, 442, -505, 301, 308, -745, -236, 993, 98, -772, 173, 651, -353, 56, 528, -954, -364, 1178, 125, -1085, 25, 560, -286, -345, 433, -707, -729, 1140, 400, -1455, -84, 801, -299, -249, 687, -313, -437, 1070, 818, -1381, -25, 1311, -66, -218, 717, -279, -705, 1044, 609, -1424, -473, 1486, -51, -820, 534, -250, -865, 691, 619, -1429, -769, 1354, 229, -1054, 432, 308, -956, 852, 1053, -1233, -716, 1538, 604, -1173, 128, 689, -691, 599, 1309, -1356, -1061, 1731, 571, -1438, -140, 892, -470, -17, 1226, -1168, -1499, 1523, 905, -1711, -343, 933, -357, -142, 905, -648, -1525, 1448, 1447, -1651, -498, 1293, -197, -198, 1033, -374, -1274, 1168, 1489, -1436, -1015, 1447, 5, -773, 867, -275, -1505, 794, 1462, -1396, -1384, 1302, 491, -1120, 767, 263, -1297]
2508a297K030Q88k885m6K782o54j852J320M24k043J622J389k746n02K811n22j910
2525a191J039R37j686O05J940k337j191L260l02k388J071J139j677N59J699j811
2541c34j326K611M95k730J019J461j748N1J749j402j410K213P97k592J55K039
2557A048j285o96J863r39j509J851J301k556l71K253p17j141J604k53j830J666
2573B89J188k041m90J931k76j458J248M22k061J196J499j897q04K045l44j381
2589i34Q14Q01j530M45J745j525j234K182n3j684Q36J016j570J78J612r47j373
2606a221J576O11j916N92J388j326k75J429p30j136J175Q21j691OJ408j031l07
2623f27J356l91j202P51R22j248k26J227k32j084J292J2j402Q86P29j027k58J193
$$ y = [-1297, 733, 1621, -1264, -1310, 1472, 818, -1034, 286, 710, -1333, 289, 1678, -1068, -1570, 1241, 719, -1191, -152, 785, -901, -296, 1644, -693, -1884, 1376, 1074, -1314, -243, 896, -781, -222, 1477, -334, -1660, 951, 1446, -1284, -265, 1196, -552, -501, 1248, -154, -1564, 649, 1446, -1146, -991, 1048, -237, -933, 930, -9, -1518, 333, 1634, -922, -1293, 960, 243, -898, 706, 453, -1377, 289, 1477, -564, -1054, 877, 601, -857, 391, 813, -1248, -52, 1447, -450, -1254, 791, 447, -934, -120, 681, -849, -404, 1341, -184, -1418, 764, 711, -973, -137, 879, -691, -513, 1099, 152, -1221, 355, 966, -950, -358, 1030, -296, -571, 858, 128, -1008, 167, 988, -703, -697, 711, -320, -627, 729, 338, -864, -113, 809, -439, -665, 562, 330, -754, 538, 550, -852, 34, 763, -264, -522, 671]
2641F71l87r17Q73M87j441M13J036r97l53Q67n9r02O19O89j053r9J265p86m96
2660e70Q97p9q15N34M91n71m14J017n5j095J006L66j127M71M10n02j86N35rp27
2680d23L21O49r08JQ20m59n54Q29j20o02K85N08l99l77P32k9n64M70Q6n68L42
2701D0L71l81k15M64j40n18L73J74m09l7M51k60r1L58j77j65k6L83m13j95O55
2722B42k15l14N08k47N3K5P7J37m22L94J05n67K70L48n37K6K86j36k52J43L76
2743C00n70K18L70m83j63N06j09l86M30KJ7j62K13j04k62L39p2k14L08m9k66J77
2765D0P7o8k57Q4L02k55lL06m44J57J04k40M2R2J24p1k50M11k47j51M83j57l33
2788b54L74n0j68j4K98n1j68K29m7l60J53K63j09j61J46M3j70R2J19k85k8L72
$$ y = [671, 284, -633, 240, 727, -714, -301, 735, -262, -615, 252, 193, -709, -90, 599, -454, -553, 712, -74, -570, 327, 248, -567, -33, 458, -113, -527, 490, 435, -660, 346, 712, -415, 56, 466, -36, -222, 313, 304, -423, -102, 547, -361, -360, 460, 1, -553, 276, 156, -446, -161, 347, -52, -429, 303, 274, -290, 180, 266, -302, 40, 411, 30, -185, 279, 139, -379, -6, 168, -241, -278, 173, -87, -178, 180, 3, -162, -188, 195, -218, -413, 242, 27, -287, 221, -26, 27, 52, 129, 266, -156, 238, 343, -224, 46, 394, -143, -117, 169, 33, -219, -76, 300, -270, -52, 318, -165, -328, 178, 69, -317, 113, 115, 132, -30, 183, 79, -183, 156, 84, -130, 178, 129, -137, 40, 117, 49, -208, -124, 178, -77, -80, 226, -218, -61, 43, -197, -155, -63, 61, -10, -260, 151, -96, -247, 236, 79, -254, 120, 70, -98, -112, 186, 135, -33, 196, 149, -211, -58, 205, 96, -65, 81, 124, -46, 46, 165, -120, -148, 224]
2810B24l61q8L74j93j94K62J25k14q9J39P7j75K68l5m70N36O1k13LJ58n5k17K07
2833A30J45l63L1L25n54J27L20l55P2O1K76m54J35N06m43k93O59k58k54K87p7
2854B3j58M0M59k68m54N50J96n69J55K72n35L44K06m11k75L55M81n70j69O37l99
2875i0j00P01q14k83Q20L29p30k6N17k76l92O92j68p73O48M55q63J36M98jp42
2896d62Q66k38q36Q57M78j006O3O81l42n31N60J62q12M07J089j180m93J300l70
2915A93l76M03J55p01J58R51p58p54J037Q2p97N45J21p47M14P82o60j079J000
2934c1O93j175K89N81j012K81J227p84r32Q57O38o93m57R40o59j44J214o00j304
2953a071J156P40j151l6O52m02l60J176l72j383R45J050j111o02R35j93m65Q82
$$ y = [224, -137, -225, 149, -44, -238, 24, 149, -65, -154, -15, 62, -113, 155, 120, -350, 186, 247, 34, 37, 195, 140, -77, 130, 275, -88, -57, 268, -286, -159, 161, -194, -122, -61, 215, -239, -104, 402, -41, -334, 325, 67, -187, 100, 23, -135, -95, 364, 96, -358, 192, 388, -181, -26, 246, -289, 55, 261, -150, -425, -70, 411, -159, -328, 309, -90, -190, 511, -303, -586, 234, 563, -167, -193, 324, 48, -344, 348, 180, -593, 55, 510, -353, -217, 281, 280, -462, 404, 166, -670, 187, 665, -341, -278, 403, 61, -470, 90, 252, -560, -153, 936, -244, -737, 563, 193, -183, 220, 375, -326, -168, 783, 25, -729, 308, 390, -407, 138, 259, -488, -74, 708, 48, -1031, -31, 662, -513, -224, 357, -655, -374, 853, 69, -863, -6, 632, -61, -518, 422, -237, -381, 833, 233, -1071, 85, 825, -326, -362, 290, -112, -472, 704, 332, -1051, -106, 944, -167, -769, 166, -27, -492, 390]
2971C90J09j390M84J606j196q08J123q4o53R62J0j335M25J540r06j266J237K52
2989E00r61O88K45j232K11J466o05j417Q05R59j152N38M62j196K46J377n72j287
3007i25P32Q47o43j56P49q71l04J547m92j436M63J429q59l90Q39p20n65J472J01
3026H18k031O12J560r78n87R30m46m21R19L97j796L47J916r66r38J028l68l31
3044c35R12p5j213K4J709n75j295Q49L86p63O93L31j389pJ314l7j431N81Q54r53
3064d20M78O10j414Q9J533m42j121M09R15o34j76P48r08n32J712j92j444N37P51
3083D99n16j99N66m65o65J265K98j540K98R98n21k21M83l76m48P22L73j122K0
3102e51J320n02o45N48j08n52O71M70j030k67J101o0j049O97K06o76N28L87p58
$$ y = [390, 499, -891, -407, 1199, 3, -805, 318, 234, -419, 543, 553, -782, -357, 1183, 277, -989, 248, 500, -461, 227, 472, -760, -549, 917, 312, -1105, -300, 659, -493, 45, 507, -689, -443, 934, 362, -925, -193, 654, 11, -145, 604, -267, -571, 976, 484, -952, -489, 940, 81, -309, 530, -190, -755, 717, 818, -1213, -601, 959, -19, -606, 324, -122, -543, 376, 773, -1023, -676, 1240, 274, -664, 364, -4, -335, 577, 502, -711, -687, 1022, 447, -848, 1, 387, -376, 317, 648, -741, -748, 566, 529, -902, -321, 533, -420, 58, 668, -746, -657, 876, 434, -687, -278, 637, 3, -173, 575, -333, -865, 847, 655, -789, -252, 499, -17, -216, 350, -115, -780, 485, 783, -757, -459, 539, 18, -203, 280, -96, -544, 178, 551, -571, -551, 769, 267, -378, 170, 62, -490, 181, 651, -379, -646, 455, 395, -654, 43, 249, -427, 101, 488, -270]
3121b70k68P89J45p22j1N97n68M01N27p64n21J108N9p25J24M30l89j57P48o35
3141a02m80R36n5o39J94L91k72p8M19l21n43Q23J94q70R5M63k41k7K34N0m98K38
3163h9N56n57k60P36j27m15N46l24k81K05L77m41k92O98l6p19N17k4m17K99K72
3184B24l86j71K49K87l96J20K25k86J70K72l64j71L76J48l03j49N50l26k90N33
3204C12q4n23M12J75l58j22L24nl91L02K10m90L22J9j58J9K10k20Q4j29K78k32
3226d5j50M52l62%K73k80p4L41m6n4j79L03l4l50J89R9l80L59p0o9J48n3q5k1
3250h8N9Nj99K23K71k99k2O9j3J38k94K82q2j37K85r1k17K19j34r5J57J8j37p1
3274a53J96Q2k06K8J74l20K08j4j31J32n2O9j5r9K94j02r4J50l52N7L75k42nK
$$ y = [-270, -538, 251, 396, -326, -337, 260, -308, 93, 620, -144, -665, 443, 502, -223, -99, 331, -58, -215, 533, -102, -582, 354, 299, -340, -146, 245, -27, -105, 314, -7, -550, 273, 467, -403, -308, 155, -86, -113, 121, 171, -327, -89, 467, -90, -350, 386, 259, -156, 390, 66, -215, -10, 367, -74, -366, 332, 296, -423, 94, 70, -347, -48, 224, -162, -333, -84, 203, -193, -73, 152, -134, 36, 308, -56, -227, 149, 297, -6, -155, 395, 69, -221, 312, 228, -295, 117, 292, -66, -188, 136, 131, -260, 42, 252, -238, 84, 103, -55, -36, 174, -46, 38, -91, 187, -45, -195, 257, -105, -105, 168, -112, -186, 155, 109, 55, -124, 179, 145, -205, -16, 83, -297, 62, -8, -77, 71, 18, -67, -88, -29, -24, -223, 0, 271, -28, -50, 19, 6, 144, -150, 132, 50, -87, 198, 107, -110, 109, -25, -120, 37, 55, -82, -153, 43, 125, -81, -53, 121, -199, 9, -5, -136, -4, -56, 13, -2, -101, 193, 91, -3, 147, -205, -148, 227, -15, -20, -18]
3298a8J94l99M4K69R4l95K81R1n34L99k7j85L5Q6J78k26K97j9l43O3M54l55j7
3321c3J16j11m6K05j02n5r8L08r6k45K87q6r4K18ml60J98J01J0m14K88J65m21
3344b69L44J44k19r2K99K5l84J30L09m76O2L31l80j9N03m01M5L8P9lj97M21l12
3367b2l43O06r5m11L19O0l03l6L76k09k72L96K92p47N20K01m59k7N04j87l47K56
3389G2J62m52l6O87n48k29P32l57m48N89J22n59R2M69l30m77P81K34q22K82M38
3410D02n23p0M71j08n21N78P1p90L81P65p56j45L73Q3n51M23K70n05j32P81n11
3431a4m19P19l13n44O77L17p32P1P12k66o44O16J55p94N21K97o16m5P53l47n27
3452d23N95K15p48J89P59o13n89J007j98o94M87L27n43j84P69k21n53O20J94q39
$$ y = [-18, 176, -223, -179, 90, 184, -211, 70, 161, -373, 26, -1, -186, -151, -65, 113, -113, 184, 165, -178, -115, 339, -16, -33, 83, -28, -74, 131, 29, -26, -124, 184, 88, -157, 130, 44, -50, 168, 164, -196, 2, 103, 113, -301, -13, 152, -269, 75, 219, 0, -92, 207, 232, -152, -22, 287, -189, -127, 204, -176, -195, 308, -93, -48, -10, 69, 66, -131, 290, -22, -365, 241, 146, -265, 54, 114, -189, -225, 151, -58, -330, 66, 358, -389, 131, 332, -127, -154, 350, 163, -184, 72, 234, -218, -254, 433, -115, -344, 388, 31, -417, 172, 294, -265, -173, 296, -34, -511, 270, 504, -318, -36, 402, -121, -191, 280, 172, -349, 229, 300, -490, -109, 656, -100, -245, 128, 211, -340, 83, 353, -152, -284, 497, -14, -433, 286, -27, -571, 106, 423, -309, -238, 474, 208, -436, 180, 335, -459, 62, 359, -257, -302, 451, 104, -423, 172, 387, -361, -172, 587, -26, -615, 392, 194, -500, -13, 314, -229, -413, 356, 135, -418, 202, 396, -443]
3472d43N79L67p49N3N32k62n83O41L86q28qQ29p10j98O97l09m43M46M09o59j41
3493c94Q07m67m36O67j4p17N40N22o88j15N71j7o84O73K41j017M85O66p75l35
3513d87Q06j14n83K96M58p71J79P45o24n72Q89k3o57M40K39n48NO72o5p87P03
3534B01R9o89K00N11n32p9O76n8p07M52N21q13j86R31p57N5O21l06o40L79M82
3555C61o13j72Q00k43m72P70k22n75K74M76l48m23M65l3m49N52J55o93K96O27
3575E33n70j09L21l9l45K19K22n67o8R88n22n65N26K29m22K41K39n65o6O48M8
3596C76q89N63K88o62L83J21m44J69L61J03o90K81O07p22LL67m26o9N20q9n23
3617c72J37N97l25j94L37j48l42Q00l16n60L10M26k45l93K87K91l74Q3K87n05
$$ y = [-443, 136, 503, -246, -193, 339, 77, -506, 135, 521, -307, -315, 514, -196, -394, 303, -6, -449, -3, 406, -253, -394, 413, -54, -490, 177, 163, -554, -14, 508, -180, -295, 276, 259, -425, 248, 489, -528, -43, 623, -152, -487, 319, 205, -378, -82, 376, -395, -216, 529, -95, -667, 222, 199, -458, -18, 221, -327, -322, 350, 285, -502, 201, 300, -389, -189, 322, -210, -289, 387, 329, -378, 74, 595, -218, -404, 527, -230, -175, 446, 140, -500, -121, 361, -252, -424, 376, 133, -339, 431, 209, -366, -92, 384, 36, -387, 78, 45, -404, 148, 303, -390, -94, 533, -37, -146, 175, 136, -209, 10, 232, -335, -403, 585, 63, -502, 24, 253, -169, 72, 311, -254, -320, 328, 376, -513, 50, 338, -324, 59, 180, -264, -95, 266, 369, -321, -40, 567, -155, -152, 215, -211, -280, 240, 151, -372, -235, 362, 37, -157, 180, 32, -310, 490, 174, -386, -76, 350, 105, -288, -1, 290, -84, -1, 286, -219]
3637b19J07N50m08l45L44R3j71n8M46m51k43O69k72k65L11p5k33J91J69l03j67
3658c30M25J7k79J99R7j93R8kL4j74K21J06n16J0M06p8k58N07k67j69J89J3j42
3681h6j57N15k83k0K34l68n2K51N9k84K54L6l6j03J09N9k16J23K02k98K6J61r6
3704C0j05p9J39j75n5J94p4R4K98k06k29M7M3O7k61K80L9k68K93P2j98J2O5N0
3728G3r5J0J21ml7j4p6q7J77k09J64J04k71J7J40nm0j85J10O2l4K64k28q8J67
3753C6JK8k04J31J24j81k4K61j75N2K6L9k52J63Rn0o7J49K46m21J04M4k36K36
3777C9J8j50N1R8j1q2K01J85l88M9J83l91J92O5J0j37N7J03j17L1L33n95J39L00
3801A83j77M2q9J23j41j39O3R1j73M34k11j69J32l3n5J02O2o4l5J12J05l94L65
$$ y = [-219, -112, 438, 30, -315, 29, 122, -49, -107, 339, -112, -355, 314, 42, -223, 88, 13, -220, -29, 140, -163, -330, 95, 112, -167, 32, 129, -64, 34, 32, 66, -108, 113, 219, -297, -287, 119, 41, -217, 290, 23, -146, 43, 56, -86, -243, 272, -11, -31, 203, -165, -217, 34, 93, -191, 63, 99, 63, -40, 69, 128, -88, 35, 237, -61, -35, 126, 30, -75, -154, -15, -190, -245, -51, -125, -31, 267, 61, -168, -121, -78, -11, -272, 8, 47, -221, 72, 144, -54, -42, 23, 73, -22, -12, 109, 105, 68, 54, -22, -109, 68, -141, 23, 127, -144, -127, 13, 8, -32, -217, -107, -45, -79, 185, -43, -131, 36, 37, 65, -139, -8, 116, -65, -89, 172, -3, 49, 75, 114, -138, 25, 34, -16, -83, 66, 312, -109, -5, 39, -197, 39, 57, -93, -42, 56, 45, -37, 164, 349, -39, 10, 193, -198, -6, 59, 69, -68, -11, 92, -25, 6, 339, -256, -117, 183, 6, 48, -41, 82, -59, -198, -135, -44, -217, 217, 6, -163, -31, -64, -119, -17, 45, -19, -54, 58, 163, -231, 134]
3824A34p5j32N4J31l69OL70j09p6q6M51o18J86L62k73J48j15p9J4J15J6j60J90
3847H5K9kj97M9O3k44K70K04l45k4Q5J34k46J53L9k30O9L02j15l47M44k88N1R2
3871C1j89J78k43M72j44k08L02J7k88J37N7j49Q7J11Ok62Q2K00j61M1O7l26L1
3894a51K80m2l88K04J34j06n1L06k42j25M90k59k02J86J23j03k74M58j54j44J86
3915A26K1n51N31J23j66Q1r3N4l70K14M51n74j36O04m12j23L69j59j22L23n6l64
3937b29j14O74j41n29M85j03m02N19N9j25l13M02J71o01L13Qm14L07M01n81PM67
3959B61j48l58J28L68m15NL80l52k78O50j46m66K78L28j37j69L31j94l63M10K77
3980C90n73J43K69l10m5L27q7m40L51K90n70o8M58j77j21K21M8l22J67L59m18
$$ y = [134, 59, -73, -19, 112, -257, -251, 119, 10, -66, -152, 299, -319, -133, 229, -44, 104, -11, -90, -76, 39, 55, -105, 85, 114, 112, -85, -36, 27, -217, 53, 257, -88, -112, -27, 107, -139, 14, 53, -177, -108, 194, 79, -268, 176, -112, -61, 31, -158, 20, -223, 249, 105, -103, 199, 216, -72, 65, 122, -27, 60, 171, 177, -85, -3, 197, 36, 77, 144, -182, -151, 129, 87, -301, -97, 37, -69, -120, 186, -56, -181, 309, 50, -152, 34, 157, 54, -220, 238, 84, -60, 126, 147, -404, 127, 250, 84, 165, 72, 126, -244, -30, 421, -153, -289, 315, -97, -220, 149, -10, -132, 191, 135, -229, -343, 331, 190, -339, 146, 43, -359, 160, 219, 94, -219, 183, 354, -247, 66, 74, -340, -33, 368, -213, -206, 261, 113, -245, -117, 251, -164, -159, 221, -131, -409, 241, 95, -371, -93, 235, 98, -71, 260, 66, -297, 113, 390, -183, -40, 229, -81, -126, 201, 114, -326, 25, 315, -255, -323, 135, -42, -163, 58, 106, -216, -49, 310, -108]
4001a08k86N70J36n31L21m5l30K86N21m63m82O07l5l26K32R9m86L31L10m67k07
4022c53M61Q2m75K27L76m25l34P52l90l47M26K33m94J88K62j88j09M40l19k59
4042b46L38K35m43R4J07j22k06N28j94l35J17M45m83r7M99j59j95J75J02l42k6
4063b08L71j07k79M64q4l88L54J58m51J64L84l14k56J41J54l55K31J89m01Q2L12
4084A61j06k76K81J80k68j49L83j96k17L28r1k35K20Q6p3j64M00j75j28J99l9
4105A21l23K94J35l63j6K71j32k72J27L80m30K73J78m30J3K25kk24J95L3k42J53
4127c6M47l48k46L63n3k09K00n9l6j4J29Q0l62K74n5j66J92o0j22l6J25K15k42
4150a9k2J75k94J20L07l49oJ80j0k30J15J19l4q8N1J39k34N7J17k40K9K26j74
$$ y = [-108, -394, 176, 312, -219, 102, 57, -273, 13, 534, 71, -411, 196, 161, -165, 67, 166, -320, 11, 321, -146, -353, 108, 190, -285, -58, 318, -107, -441, 311, -79, -426, 0, 233, -261, -73, 189, 1, -108, 332, 13, -246, 92, 327, -116, -22, 85, -37, -243, 285, 91, -244, -127, 318, -165, -262, 237, 78, -117, 58, 160, -182, -208, 163, 56, -223, 241, 157, -231, 123, 281, -170, -6, 378, 64, -192, -51, 103, -252, -21, 168, -233, -151, 161, 55, -221, 60, 240, -28, -177, 206, 10, -207, 121, 30, -205, 15, 101, 28, -136, 264, 89, -39, 160, 121, -202, 92, 227, -136, -152, 119, -13, -285, -158, 222, -208, 65, 243, -187, -174, 51, 49, -175, 20, 53, -189, -36, 411, 63, -183, 180, 127, -82, 118, 59, 23, 9, 138, 218, -144, 130, 75, -91, 101, 41, -81, -117, 8, 223, -19, -41, 134, -160, -40, 267, -82, -88, 92, 82, -148, -33, 86, 52, -36, 15, 154, -80, -23, 94, -146, -117, 109, -65]
4173f5K6k39N5J30R4m2q5Q1Nn3j26K08J49k48l2J77lj10K73k67k1M5k1R2l2Mj57
4200a62R6J20M2r1J48K5k25j06K79q8L1m7mr6q6L32j30n4R3j02m6J72r4JJ23j13
4226A8P3q7J14n2n7J08q9k19J67L3mMl8R5j42j2L00j88j74J96m8K1n9M6l7N6J78
4253B03k23j40L87j38j38P3L8r9l6L48j60k14J02k5j31K23P6m32K63n2q3N2rJ19
4277Dp8R6J61k46N6K57k53j50L66k27Q1j02j4J23lJ01j57j14R3M3Rp2l3J09Q9
4302A39k13p1K5J2K76k72j27M79j38j13k5J08j40K3Q9l6q9K13K5l82K97j54K2
4325e2K50j87l0J32k71L43j52j18J82j97K5J59j33j8l3J16O4k24P6L2n8K62k44
4348g6j09J98J2r2p0K55k0j19J55j61j44L06M5k31NO5P8j31j3K7j97O7L59k85
$$ y = [-65, -39, -278, -223, -93, 1, -41, -126, -45, -40, -93, -219, -11, 138, -110, -142, 35, 32, -78, 195, -72, -93, -48, -69, 23, -9, -5, -162, -66, 54, 96, 5, 153, 178, -47, -153, 126, 38, 69, 22, 18, -78, -164, 168, 38, -16, 77, -25, -71, 101, 7, 8, 131, 18, 91, 4, 118, 66, 9, 117, 28, -191, -24, 9, 5, 9, -29, 66, -76, -88, 212, 24, -150, 46, -2, 19, -40, 6, -31, 25, 203, -20, -160, 227, 89, -49, 24, 62, -37, -73, 275, 115, -99, 3, -22, -153, 70, 146, -286, -23, -75, -158, -106, -115, 4, -74, 22, 183, -63, -7, 250, -3, -153, 213, -14, 67, -35, -49, 74, 71, 172, 15, -99, -6, 37, 46, -26, -59, 50, 139, -74, -145, -120, -108, 168, -104, -231, 248, 110, -3, -28, 80, -60, -37, 52, 16, -73, 140, 165, -217, 80, -74, -52, 198, 11, -19, 113, -158, 185, 33, -85, 97, -100, -75, 84, -49, -67, -100, 16, 80, -144, -68, -36, -94, 168, -76, -185, 13, 25, -67, -137, 118, 98, -21, 134, -27, -171, 135, 180, -51, -46, 19, 97, -34, -47, -20, -217, -150, 209, -76]
4372g6p2J41j14J22J88j95j8Q8L4j71%J58Q5k66N9K36l82K52J59j91l27J55K39
4395A04j28K5j7j72K27O1q3k15Q6L23j60n5nJp3K27kl06J90J51k41Q1J49j44k16
4420a92K10J03k81J46R7j38N5p4J52k50J91P7k36l1M40k18l8Jn9K8N6J40l21K
4444a40K37j22lP8j71j64M49n2k30L9J43P2m37L10Nk29L14K1m86K29J72n9j17
4467a41R7J09k9j34L05k95j52M12p2q3K4J24j99o2L08k63j90N37k36k02k9K27
4489E6p7N0P0j75p9K07J90m48J10J99k06L4K15k44l7K19J18j60j50M24k28j73
4511h5J98r4j43J96J33l45J0K67k3l20K01k1o6q9M59l08j18J80J36k19J6J06m9
4534B2m8K04j76k33L68j1l20J63J2L6j5J82l93m2L15Q3l13O0K79k94L1J77J4j92
$$ y = [-76, -148, -7, -121, 1, 189, -6, -24, 64, 98, -73, -73, 85, 170, -96, -37, 199, -183, 69, 228, 37, -290, -135, 104, -24, 1, -16, -188, 39, 100, 17, -198, -112, 211, 51, -4, -9, -8, -81, 146, 144, -162, 28, 179, -62, 19, 168, 24, -192, 18, 121, -160, -14, 83, -55, 0, -74, 78, -172, 19, 96, -140, -171, 269, 51, 13, 14, -45, -17, 39, 179, -142, -140, 97, -25, -28, 50, -121, -285, 164, 112, -118, -79, 64, 136, -301, 9, 14, -215, 99, 120, -366, -137, 35, -24, -141, -44, 65, 36, -98, 207, -88, -240, 172, 100, 17, 41, 165, -34, -96, 212, -51, -241, 296, 60, -142, -171, 56, -21, 29, 99, -76, -155, 52, 242, -206, -96, 103, -103, -69, 146, -98, -135, 84, 202, 42, -108, 316, 88, -85, 113, 19, -124, 72, 205, -140, -130, 137, 114, -206, -5, -26, -92, -181, 278, -30, -148, 32, 168, -51, -35, 71, 22, -26, 178, 2, -231, 137, 126, -194, -31, -19, 17, 2, 184, -209, -251, 64, 147, -166, -106, 173, -121, -90, 87, 101, -91]
4558i1m9L46j49q0J06nj6k0p0m2q1K78r3j03P2J00j1Q6q6k36P1L28q7k65J36P
4584D6j57O9N2k45L1K38O1l30K38J38j53j8K36k20k4K02o2k56J35J11qj35M2j07
4608a16L5J86j87q7Q1J66j65m0J85o0m8J54q5p8n4K55j48r7K04k4q9J78j38k04
4632a76J88o5J87j63J06j48oJ31j9j65N9J75j90J1j2Q0K8n5O0j89J77R0j34M4
4656A4k7q1J12J17q5p3L0K03j04r3j39J74j9m6p3l7K42k1J50k35J08j16j62J78
4680A7N4K8k7p8l9P5k32K32j60J77j44k8J91j53K14j23j30J95J4j18L0Q6p9L3
4704C5j99J48K6J1o3J04k3K5k73K06J1j22L3K43j53K2q5L2P4q3P6Q6j76Q8j00
4729e7K7L1Q1O2k44J59Qpo4M9k6m3K7j17J69k6o0j15O1K48o9m4J6l6O2r5J02K9
$$ y = [-91, -140, 206, 57, -23, 83, 78, 62, 42, -28, -70, -151, 127, 34, -69, 3, 103, 92, 178, 92, -144, -73, 255, 168, -97, 39, 46, -111, -42, 10, -235, -204, 34, 95, -235, 3, 141, -12, -30, 206, -14, -38, 164, 102, -154, -19, 92, 84, -51, -9, -116, -81, 105, -82, -169, -88, 78, -87, -127, 58, -2, -50, 104, 19, -59, -113, 142, -6, -103, 101, 77, -12, 166, 28, -176, 12, -53, 134, -29, 77, -71, -77, 54, 35, -130, -71, 104, -86, -75, -87, -7, 21, -34, 26, -163, 14, 104, -30, 14, -13, -94, 18, 135, 50, -23, 7, 210, 106, 13, -126, 48, 29, -17, -90, -127, 115, 94, 244, 9, 117, 1, -161, 17, 71, 99, 72, -6, -45, 30, -202, 30, -130, 47, -97, -125, 66, -87, 127, 4, -126, 69, 83, -35, -5, 81, 2, 35, -164, -16, 10, 21, -42, 62, 39, 64, -209, -3, 8, -114, -81, 162, 9, 31, -54, -22, 52, -31, 45, 131, -45, 43, -57, -30, 1, 82, 144, -100, 59, 67, 60, -4, 45, 19, -24, 3, -114, 55, 29, -31, -146, -85, 163, 94, 50, 66, 30, 92, -3, 99, 128]
4757A28n0m3O7j47O1M9j10j4R6j24J02O2q8M2j23K20m9j32J11Qj01J64k16J66
4781G9j75O3K4P8O4k20J2J62l6j82K10o3N2r2J78q9O0J1j33K3j94L00j20l8nj7
4807d8N8l1K9r0j6J16M6k52K91pj39j4O0M8q0K84j88j2L6j48n0J43O4k08k5M0
4833i3J20rO0k8r9L2K05k11q6J37j34J14k0J29o3j65J24J65j55R0q7o1Q6n2N7
4858E6j30J77k9j38K00j22k28L57j89J5n9K37q6k33J96l8r7NK18j06p1J38n9k8
4882a4N1o8J34n3j4j46L17j82j3q0J40M0k12O7n1J38k51R6J22j45N8N4o6O8R5
4907H5p7j69J70Q4k30J96J02j93k82L62Q8k68K28j84m4O2J99j75Q6M4l8k57O9
4930a42K95k90n7L20j83l6J58j05k7M9R9k25J11J11l23J81o9J71j65L4K3J6k3
$$ y = [128, 78, 35, 102, -45, 16, 65, -45, -59, 37, -87, 15, 77, -11, 31, -92, 128, 79, -53, 58, 66, -35, 129, -87, 79, -96, -33, -9, 69, 133, -87, -75, 87, 51, -131, 79, 16, 68, -24, 154, 65, 125, 136, 3, 26, -168, 132, 12, -26, -31, -48, 10, -21, 8, -82, -98, 18, 64, -188, 103, 96, -43, -57, 3, 51, -29, 255, 67, 55, 91, -57, -107, 36, 100, -108, -133, -93, 27, 18, 78, 50, -49, -17, 188, -23, -109, 28, -106, 8, -12, 117, 54, -111, 13, 178, 23, 113, 26, -35, 51, -1, 56, -74, 103, 74, -64, 136, 14, -214, 143, -46, -31, -90, 147, 61, -172, 24, -14, -111, -106, 112, 6, -65, 73, 14, -14, 37, -31, 103, 50, 36, -110, 207, 25, 12, -68, 72, 112, -100, -33, -84, 54, -197, -101, 21, -124, -66, -12, -78, -10, 85, 8, -161, 9, 93, -137, 59, 161, -32, -314, 48, 136, -132, 96, -88, -132, -70, 129, -46, 40, 84, 46, -211, -142, 153, -137, -194, 126, -57, -93, 65, -40, -67, -18, 81, -144, -33, 78, -245, -64, -133, 38, -127, -93, -70, -54, -77]
4953g7J78%j93KJ3Q5k8J17o3j04nr2J31N7J45l28K6L24p3j18O0r1n3R4N6qj76
4980a21R5L9k5l9P9m1m7O7j49P5J37j40n7Q2J16j81m9J71k5j07J12J21k58K45
5004A00mk26J95J32k78LL5K49k63k0L9J50r3q5J5k1K93j80j84l8l8J53P9O1J05
5029A79k99J42j25N4pK29p3j81J32pm1RN4K2q8r3K96k81J16%J1K0J11l24J35P5
5055F6j48l4J56M8j79K67j67r1J13o7R0j48K18j3k74J17O0M7l5j77J30M5qj1k4
5080a9O3L4o7o3MR6p7Q6j03q8J04j04K30j64j5K01p0p0l0J07j06J3K13j57L3q8
5106c7n8O5N2lj36J77k21J13o6J47K9r5Rm6M8qM8q6J58j55RM5N9j2j4j05J29q8
5134d2p3K58q8k8j68Q9jP7j36pk6J84n9L6p8M7kN4o8K7K9q8Q9o9j1j21J72J5Q1
$$ y = [-77, 101, 101, -92, -90, -77, 8, -20, 97, 34, -70, -75, -167, -36, 21, 166, -162, -136, 188, 115, -3, 57, -34, -87, 7, 63, 55, -121, -26, 13, -12, -51, 28, -13, -60, 7, -142, -67, 70, -70, -127, -45, 71, -110, -159, 12, -13, -120, -8, 113, -145, 100, 96, -130, 65, 197, -81, -78, -43, 206, -57, -77, -38, 112, 19, -66, -51, -72, 221, 41, -143, -181, -219, -66, 13, 74, 179, -120, 22, -103, -49, -56, 173, 100, -81, 51, 44, 3, 12, 66, 88, 0, -93, 203, -78, 38, 38, 49, 69, 180, -144, -9, 66, -82, -116, 40, 88, -91, 176, 9, -82, 31, -36, 54, -94, 124, 111, -163, -46, 14, 61, 26, -151, -21, 24, 16, 5, -19, 44, 78, 11, -52, -48, 48, -29, 57, -46, -134, -30, -134, 96, -68, -83, 118, 48, -22, -52, 55, -51, -38, 175, 18, 51, -37, -95, -30, 22, 19, -117, 60, -161, -48, -114, 33, 62, -33, -24, -70, -22, -30, 18, -68, 90, -65, -56, -11, 48, 36, 22, -83, 46, -42, -115, 143, 55, 27, -141, -52, -53, 24, -112, -119, -145, 39, -20, 16, -62, -15, -17, 37, -31, -4, 25, -63, 26, -43, -54, -175, -3, 12, 93]
5163I3P5j60k7Oj5j9K11j93r4K28j28o2L1l1J39k8M7l8k8j66P4J41k04J63K1k3
5189A3j62J77j29O5QN6k41L15p5J0J3p1o4P0j02J74j31J76J7k24L0P9o0M8j05
5214a13J60M5k36J57m8N2LQp6J43M2j04j81K46J5r5k8J78k29m1J93k00J22p5M2
5239b0q5J19j92J83j27R4q8r3L74j23j25J58k73K33j20J18J09k64K98r8k58K85
5261A05J37k88J51p6p0K5J37L7r4K7r3J4Qk71K46o4o1J81j71l5J95j70K09M2k07
$$ y = [93, 168, 8, -19, -13, -28, -47, 164, -29, -123, 105, -23, -85, -54, -85, 54, 26, 73, 35, 7, -159, -85, 56, -148, 15, 36, 13, -149, 28, -101, -36, -28, 28, -213, 102, 27, 37, 50, -21, -85, -15, -117, 57, -74, 102, 119, -105, -75, 4, -56, -8, -113, 47, 92, -144, 13, -35, 17, 20, 28, -48, 95, 137, 33, -148, 98, 113, 18, -10, 168, -61, -102, 91, -109, 13, -62, -20, -105, 14, -178, 5, -122, -28, -116, -209, 165, 42, -83, 75, -198, 35, -85, 33, 142, -122, 176, 78, -180, 105, 242, -46, 105, 29, -41, -16, 121, 158, 64, 91, -2, 12, 20, -251, -5, -69, -130, 51, -120, -155, 40, -130, 79, 121, -86]
$$ [...]
8191F7
##END NTUPLES=NMR FID
##END=
