##TITLE=1H_Pr T-147
 CDCl3
 8 sc, 
 9.12.2021
##JCAMPDX= 6.0         $$ Bruker NMR JCAMP-DX V2.0
##DATA TYPE= NMR FID
##DATA CLASS= NTUPLES
##ORIGIN= UXNMR, Bruker Analytische Messtechnik GmbH
##OWNER= root
$$ XWIN-NMR		Version 3.5
$$ Thu Dec  9 13:49:20 2021 Russian Standard Time (UT+4h)  she@DPX200
##.OBSERVE FREQUENCY= 200.131346
##.OBSERVE NUCLEUS= ^1H
##.DELAY= (6, 6)
##.ACQUISITION MODE= SIMULTANEOUS
##.ACQUISITION SCHEME= undefined
##.AVERAGES= 8
##.DIGITISER RES= 18
##SPECTROMETER/DATA SYSTEM= spect
##.PULSE SEQUENCE= zg30
##.SOLVENT NAME= CDCl3
##.SHIFT REFERENCE= (INTERNAL, CDCl3, 0, 15.7039)
##AUDIT TRAIL= $$ (NUMBER, WHEN, WHO, WHERE, WHAT)
$$ ##TITLE= Audit trail, XWIN-NMR		Version 3.5
$$ ##JCAMPDX= 5.01
$$ ##ORIGIN= Bruker BioSpin GmbH
$$ ##OWNER= she
$$ F:/spectra/data/she/nmr/H-F/1/audita.txt
$$ ##AUDIT TRAIL=  $$ (NUMBER, WHEN, WHO, WHERE, WHAT)
(   1,<2021-12-09 13:48:32.07 +0400>,<she>,<DPX200>,
      <created by zg, POWCHK disabled, PULCHK disabled
       configuration hash MD5:
       00 E9 B6 7A A2 85 ED C7 34 08 36 98 17 FE 4E 26
       data hash MD5: 16K
       76 C4 23 2D 03 26 15 73 C1 52 07 FB 0A 76 D9 00>)
$$ ##END=
$$ 
$$ hash MD5
$$ 13 BB F3 E0 F2 C2 0C 4D 67 BB 27 8D 1B 26 18 2F
##$RELAX= 
##$RELAX= 
##$RELAX= 
##$RELAX= 
##$RELAX= 
##$RELAX= 
$$ Bruker specific parameters
$$ --------------------------
##$DU= <F:/spectra>
##$EXPNO= 1
##$NAME= <H-F>
##$PROCNO= 1
##$TYPE= <nmr>
##$USER= <she>
##$AMP= (0..31)
100 100 100 100 100 100 100 100 100 100 100 100 100 100 100 100 100 100 
100 100 100 100 100 100 100 100 100 100 100 100 100 100 
##$AQSEQ= 0
##$AQ_mod= 1
##$AUNM= <au_zg>
##$AUTOPOS= <>
##$BF1= 200.13
##$BF2= 200.13
##$BF3= 200.13
##$BF4= 200.13
##$BF5= 200.13
##$BF6= 200.13
##$BF7= 200.13
##$BF8= 200.13
##$BYTORDA= 1
##$CFDGTYP= 0
##$CFRGTYP= 5
##$CHEMSTR= <none>
##$CNST= (0..31)
1 1 145 1 1 1 1 1 1 1 1 1 1 1 1 1 1 1 1 1 1 1 1 1 1 1 1 1 1 1 1 1 
##$CPDPRG= <>
##$CPDPRG1= <>
##$CPDPRG2= <>
##$CPDPRG3= <>
##$CPDPRG4= <mlev>
##$CPDPRG5= <mlev>
##$CPDPRG6= <mlev>
##$CPDPRG7= <mlev>
##$CPDPRG8= <mlev>
##$CPDPRGB= <>
##$CPDPRGT= <>
##$D= (0..31)
0 1.2 0 0 0 0 0 0 0 0.06 0 0.03 0 0 0 0 0.0002 0 0 0 0 0 0 0 0 0 0 0 0 
0 0 0 
##$DATE= 1639043311
##$DBL= (0..7)
120 120 120 120 120 120 120 120 
##$DBP= (0..7)
150 150 150 150 150 150 150 150 
##$DBP07= 0
##$DBPNAM0= <>
##$DBPNAM1= <>
##$DBPNAM2= <>
##$DBPNAM3= <>
##$DBPNAM4= <>
##$DBPNAM5= <>
##$DBPNAM6= <>
##$DBPNAM7= <>
##$DBPOAL= (0..7)
0.5 0.5 0.5 0.5 0.5 0.5 0.5 0.5 
##$DBPOFFS= (0..7)
0 0 0 0 0 0 0 0 
##$DE= 6
##$DECBNUC= <off>
##$DECIM= 32
##$DECNUC= <off>
##$DECSTAT= 4
##$DIGMOD= 1
##$DIGTYP= 9
##$DL= (0..7)
0 120 120 120 120 120 120 120 
##$DP= (0..7)
150 150 150 150 150 150 150 150 
##$DP07= 0
##$DPNAME0= <>
##$DPNAME1= <>
##$DPNAME2= <>
##$DPNAME3= <>
##$DPNAME4= <>
##$DPNAME5= <>
##$DPNAME6= <>
##$DPNAME7= <>
##$DPOAL= (0..7)
0.5 0.5 0.5 0.5 0.5 0.5 0.5 0.5 
##$DPOFFS= (0..7)
0 0 0 0 0 0 0 0 
##$DQDMODE= 0
##$DR= 18
##$DS= 0
##$DSLIST= <SSSSSSSSSSSSSSS>
$$ [...]
##$SUBNAM2= <"">
##$SUBNAM3= <"">
##$SUBNAM4= <"">
##$SUBNAM5= <"">
##$SUBNAM6= <"">
##$SUBNAM7= <"">
##$SUBNAM8= <"">
##$SUBNAM9= <"">
##$SW= 18.0517287032376
##$SWIBOX= (0..15)
0 0 2 0 0 0 0 0 0 0 0 0 0 0 0 0 
##$SW_h= 3612.71676300578
##$TD= 16384
##$TD0= 1
##$TE= 0
##$TE2= 300
##$TE3= 300
##$TEG= 300
##$TL= (0..7)
0 120 120 120 120 120 120 120 
##$TP= (0..7)
150 150 150 150 150 150 150 150 
##$TP07= 0
##$TPNAME0= <>
##$TPNAME1= <>
##$TPNAME2= <>
##$TPNAME3= <>
##$TPNAME4= <>
##$TPNAME5= <>
##$TPNAME6= <>
##$TPNAME7= <>
##$TPOAL= (0..7)
0.5 0.5 0.5 0.5 0.5 0.5 0.5 0.5 
##$TPOFFS= (0..7)
0 0 0 0 0 0 0 0 
##$TUNHIN= 0
##$TUNHOUT= 0
##$TUNXOUT= 0
##$USERA1= <user>
##$USERA2= <user>
##$USERA3= <user>
##$USERA4= <user>
##$USERA5= <user>
##$V9= 5
##$VALIST= <valist>
##$VCLIST= <CCCCCCCCCCCCCCC>
##$VD= 0
##$VDLIST= <DDDDDDDDDDDDDDD>
##$VPLIST= <PPPPPPPPPPPPPPP>
##$VTLIST= <TTTTTTTTTTTTTTT>
##$WBST= 1024
##$WBSW= 4
##$XGAIN= (0..3)
0 0 0 0 
##$XL= 0
##$YL= 0
##$YMAX_a= 166752
##$YMIN_a= -210759
##$ZGOPTNS= <>
##$ZL1= 120
##$ZL2= 120
##$ZL3= 120
##$ZL4= 120
##$ABSF1= 10
##$ABSF2= 0
##$ABSG= 5
##$ABSL= 3
##$ALPHA= 0
##$AQORDER= 0
##$ASSFAC= 0
##$ASSFACI= 0
##$ASSFACX= 0
##$ASSWID= 0
##$AUNMP= <proc_1d>
##$AZFE= 0.1
##$AZFW= 0.1
##$BCFW= 1
##$BC_mod= 2
##$BYTORDP= 1
##$COROFFS= 0
##$CY= 11.3945322036743
##$DATMOD= 1
##$DC= 2
##$DFILT= <>
##$DTYPP= 0
##$F1P= 2.36226072786647
##$F2P= -0.459571619588291
##$FCOR= 0.5
##$FTSIZE= 0
##$FT_mod= 4
##$GAMMA= 1
##$GB= 0.15
##$INTBC= 1
##$INTSCL= 1
##$ISEN= 128
##$LB= 0.24
##$LEV0= 0
##$LPBIN= 0
##$MAXI= 10000
##$MC2= 0
##$MEAN= 0
##$ME_mod= 0
##$MI= 1.114404
##$NCOEF= 0
##$NC_proc= 0
##$NLEV= 6
##$NOISF1= 3.799351
##$NOISF2= 2.8
##$NSP= 1
##$NTH_PI= 0
##$NZP= 0
##$OFFSET= 15.70392
##$PC= 1
##$PHC0= -15516.94
##$PHC1= 17.2008
##$PH_mod= 1
##$PKNL= yes
##$PPARMOD= 0
##$PSCAL= 0
##$PSIGN= 0
##$REVERSE= no
##$SF= 200.130013532006
##$SI= 16384
##$SIGF1= 3
##$SIGF2= 2
##$SINO= 400
##$SIOLD= 16384
##$SREGLST= <1H.CDCl3>
##$SSB= 0
##$STSI= 0
##$STSR= 0
##$SW_p= 3612.71676300578
##$SYMM= 0
##$S_DEV= 0
##$TDeff= 0
##$TDoff= 0
##$TI= <>
##$TILT= no
##$TM1= 0
##$TM2= 0
##$TOPLEV= 0
##$USERP1= <user>
##$USERP2= <user>
##$USERP3= <user>
##$USERP4= <user>
##$USERP5= <user>
##$WDW= 1
##$XDIM= 8192
##$YMAX_p= 0
##$YMIN_p= 0
$$ End of Bruker specific parameters
$$ ---------------------------------
##NTUPLES= NMR FID
##VAR_NAME=  TIME,          FID/REAL,        FID/IMAG
##SYMBOL=    X,             R,               I
##VAR_TYPE=  INDEPENDENT,   DEPENDENT,       DEPENDENT
##VAR_FORM=  AFFN,          ASDF,            ASDF
##VAR_DIM=   8192,          8192,            8192
##UNITS=     SECONDS,       ARBITRARY UNITS, ARBITRARY UNITS
##FACTOR=    0.0002768,     1,               1
##FIRST=     0,             0,               0
##LAST=      2.2672688,     0,               0
##MIN=       0,             -210759,         0
##MAX=       2.2672688,     166752,          0
$$ Real data points
##PAGE= N=1
##DATA TABLE= (X++(R..R)), XYDATA
$$ [...]
$$ plain form
1652 97 -53 -143 33 289 -137 -49 -77 -205 -276 68 -65 127 70 -180 -46 -91 174 -93 101 -12 -36 47 150
1675 150 16 -243 -94 60 90 85 161 56 -123 -138 82 -60 267 -35 15 11 -243 135 -276 300 -111 78 146
1698 146 -67 -100 27 -49 97 -70 104 155 -81 177 -129 -183 33 -41 -51 57 41 32 38 -138 254 3 56 34
1722 34 313 117 -100 1 -54 -108 91 42 89 24 84 -62 39 -41 191 185 22 -218 -26 209 -79 13 177 90
1746 90 123 163 -116 -108 112 150 20 -8 43 -119 -91 59 190 71 109 -255 -36 45 -103 -173 -211 31 7 -89 -164
1771 -164 90 29 16 -115 -134 -252 16 -120 101 324 -27 -65 -29 22 -70 -76 -166 -143 105 30 119 -7 -173 58
1795 58 -3 -26 46 -42 -193 26 14 1 -228 -71 3 -112 -25 -209 81 -89 -56 -38 -4 103 123 -15 -144 -40
1819 -40 -18 127 -22 -125 143 43 142 83 -70 172 295 113 242 11 37 -71 48 201 243 70 -14 243
$$ packed form
1652I7j50r0J76K56m26Q8k8j28p1L44j33J92n7k50J34m5K65k67J94j13k4Q3J03
1675A50j34k59J49J54L0nP6j05j79j5K20j42L27l02N0mk54L78m11N76m11J89O8
1698A46k13l3J27p6J46j67J74N1k36K58l06n4K16p4j0J08j6rOj76L92k51N3k2
1722C4K79j96k17J01n5n4J99m9M7o5O0j46J01q0K32oj63k40J92K35k88R2J64q7
1746I0L3M0k79QK20L8j30k8N1j62K8J50J31j19L8l64K19Q1j48p0l8K42k4r6p5
1771a64K54o1j3j31j9j18K68j36K21K23l51l8L6N1r2or0K3K48p5Q9j26j66K31
1795E8o1k3P2q8j51K19j2j3k29J57P4j15Q7j84K90j70L3J8L4J07K0j38j29J04
1819d0K2J45j49j03K68j00R9n9j53K42J23j82J29k31K6j08J19J53M2j73q4K57
$$ plain form
1841 243 12 -113 -138 -67 175 -217 -61 -129 -78 173 189 34 39 -13 -123 24 173 -283 -51 -49 -27 -11 -37 32 -36
1866 -36 -107 150 33 -18 -35 36 -130 -102 -116 -123 269 251 109 -5 -57 -328 -104 -281 -153 -89 232 87 -111 127
1890 127 108 15 157 -170 140 42 79 72 -326 -87 125 -74 -234 -147 170 200 -108 -203 -171 31 77 136 142 1 158
1915 158 112 48 141 205 -145 -57 94 -108 -104 -137 -87 -57 -67 101 18 -81 39 19 -184 -117 159 -240 257 -10 120
1940 120 -90 -1 -172 -114 -95 116 258 -40 101 -27 -196 22 -73 -109 -87 -27 32 199 1 51 48 -68 -69 -167 25
1965 25 -91 -44 -172 8 179 89 27 -27 -67 -1 -76 -74 -4 -97 -64 -76 -93 332 67 -76 60 -155 263 134 -91
1990 -91 67 92 -225 15 -249 38 -278 150 115 -6 -44 -98 71 -15 160 -12 80 19 -156 111 6 -135 33
2013 33 -60 10 -68 -55 2 -191 51 -152 86 82 -2 -261 90 -54 -10 52 21 -58 136 64 -90 13 135 -107 144
$$ packed form
1841B43k31j25k5P1K42l92J56o8N1K51J6j55Nn2j10J47J49m56K32KK2J6k6O9o8
1866c6p1K57j17n1j7P1j66K8j4pL92j8j42j14n2k71K24j77J28O4L21j45j98K38
1890A27j9r3J42l27L10r8L7pl98K39K12j99j60Q7L17L0l08r5L2K02M6N9Oj41J57
1915A58m6o4R3O4l50Q8J51k02Ml3N0L0j0J68q3r9J20k0k03O7K76l99M97k67J30
1940A20k10Q9j71N8J9K11J42k98J41j28j69K18r5l6K2O0N9J67j98N0lj16jr8J92
1965B5j16M7j28J80J71r0o2n4m0O6p5KP0r3L3j2j7M25k65j43J36k15M18j29k25
1990i1J58K5l17K40k64K87l16M28l5j21l8n4J69q6J75j72R2o1j75K67j05j41J68
2013C3r3P0p8J3N7j93K42k03K38mq4k59L51j44M4O2l1p9J94p2j54J03J22k42K51
$$ plain form
2038 144 81 334 -215 -16 186 -35 6 9 -98 56 -82 -160 -85 -57 -64 35 173 33 110 -168 -32 -57 -80 -25 -203
2063 -203 -66 -102 5 -81 65 -21 -192 -107 -44 256 143 79 209 34 107 -176 90 -137 132 198 -181 -134 141
2086 141 -2 -38 34 150 32 -229 68 -356 126 99 31 -36 70 51 82 372 244 -133 58 -48 245 56
2108 56 163 79 -125 0 -104 19 21 -150 68 -204 -224 99 253 -45 54 20 -67 -42 -132 1 201 104 -72 81
2132 81 93 28 -27 -49 105 -218 -130 12 38 -314 -268 -36 -16 -153 -78 38 -187 -42 -21 56 -150 92 74 118 -2
2157 -2 -100 42 140 190 -25 101 28 -76 -70 75 -32 83 -11 24 -60 107 72 147 -36 -82 -32 -194 38 -246 -191
2182 -191 -108 160 56 -24 71 145 -109 -13 76 56 -42 102 -236 -141 -49 -132 19 251 -60 -130 -5 -147 -228 -181 38
2207 38 28 -22 103 -154 36 -161 -33 -246 100 -73 -122 169 64 112 -92 180 51 47 102 -96 -167 -70 -172
$$ packed form
2038A44o3K53n49J99K02k21M1Lj07J54j38p8P5K8pR9J38j40P7k78J36k5k3N5j78
2063b03J37l6J07q6J46q6j71Q5O3L00j13o4J30j75P3k83K66k27K69O6l79M7K75
2086A41j43l6P2J16j18k61K97m24M82k7o8o7J06j9L1K90j28l77J91j06K93j89
2108E6J07q4k04J25j04J23Kj71K18k72k0L23J54k98R9l4q7K5r0J33K00r7j76J53
2132H1J2o5n5k2J54l23Q8J42K6l52M6K32K0j37P5J16k25J45K1P7k06K42j8M4j20
2157br8J42R8N0k15J26p3j04OJ45j07J15r4L5q4J67l5P5j83m6N0j62K32k84N5
2182a91Q3K68j04q0R5P4k54R6Q9k0r8J44l38R5R2q3J51K32l11p0J25j42q1M7K19
2207C8j0n0J25k57J90j97J28k13L46j73m9K91j05M8k04K72j29mN5j98p1R7j02
$$ plain form
2230 -172 208 148 -35 186 -94 195 115 -182 -95 -14 -67 138 -197 -130 234 -117 138 104 12 -48 -109 -4 -7 -77
2254 -77 103 -87 259 104 8 18 36 37 21 73 -128 20 -38 -135 76 10 -94 -82 -248 11 2 -116 -81 -325 25
2279 25 130 -213 -110 -4 27 130 -136 53 -257 -31 -110 -186 45 66 208 120 136 96 -80 -87 -53 97 44 236
2303 236 204 12 71 -23 10 -263 -9 122 -45 43 -69 -27 -2 -43 25 -1 -185 -198 -267 20 91 46 140 77 -228
2328 -228 -174 -98 4 152 144 -46 129 341 -5 2 -34 4 -82 4 23 11 -12 -10 -168 -204 131 124 -204 -71 -62 89 -145
2355 -145 56 106 -67 -131 98 13 -170 2 -195 111 -2 50 -97 -174 -102 116 -217 -48 195 64 121 -93
2377 -93 110 69 234 86 -50 -115 -139 156 103 -36 -6 -85 -104 190 29 -213 94 -33 113 -61 74 -133 -27
2400 -27 173 -44 65 -118 -3 -40 147 -140 -178 51 -30 -49 122 280 252 -198 -125 -34 79 -237 56 -46 165
$$ packed form
2230a72L80o0j83K21k80K89q0k97Q7Q1n3K05l35O7L64l51K55l4r2o0o1J05lp0
2254g7J80j90L46j55r6J0J8Jj6N2k01J48n8r7K11o6j04J2j66K59rj18L5k44L50
2279B5J05l43J03J06L1J03k66J89l10K26p9p6K31K1J42q8J6m0j76pL4J50n3J92
2303B36l2j92N9r4L3k73K54J31j67Q8j12M2K5m1O8k6j84j3o9K87P1m5R4o3l05
2328b28N4P6J02J48qj90J75K12l46Pl6L8q6Q6J9j2k3Kj58l6L35pl28J33RJ51k34
2355a45K01N0j73o4K29q5j83J72j97L06j13N2j47p7P2K18l33J69K43j31N7k14
2377i3K03m1J65j48j36o5k4K95n3j39L0p9j9K94j61k42L07j27J46j74J35k07J06
2400b7K00k17J09j83J15l7J87k87l8K29q1j9J71J58k8m50P3R1J13l16K93j02K11
$$ plain form
2423 165 192 117 120 -12 168 -62 -22 -71 35 -115 -122 77 52 -29 289 100 57 -75 50 119 87 83 58 -36 -11 84
2449 84 31 -148 15 9 -195 144 -2 -19 203 -130 -16 -146 -26 186 -22 -175 -214 274 18 81 11 240 -81
2472 -81 -60 190 131 -44 97 -179 -44 -331 90 -169 -25 121 -96 141 -34 104 217 34 225 169 -106
2493 -106 113 183 7 -193 -81 77 125 -156 197 -4 106 -85 -113 33 93 100 4 39 29 -31 -107 -50 -15 -69 -30
2518 -30 -34 -22 143 -112 -11 60 -8 -51 -100 309 22 206 140 97 74 145 4 -86 66 -73 -63 90 -87 -157 -12
2543 -12 267 -20 -6 -174 -41 -42 81 -4 -16 -74 174 -122 -78 -124 193 -171 84 27 93 72 59 -40 -101 -229 -163
2568 -163 -82 -269 -36 -90 -5 36 -46 16 -59 -268 -50 -65 96 -175 78 -19 101 -166 -84 -139 -179 -47 -9 34 -118
2593 -118 -179 117 126 -121 -89 47 116 -20 7 158 -84 165 -32 -134 -14 -232 -93 149 -100 -167 190 -36
$$ packed form
2423A65K7p5Lj32J80k30M0m9J06j50pJ99k5q1L18j89m3j32J25O9l2mk5r4K5R5
2449H4n3j79J63ok04L39j46j7K22l33J14j30J20K12k08j53l9M88k56O3p0K29l21
2472h1K1K50n9j75J41k76J35k87M21k59J44J46k17K37j75J38J13j83J91n6k75
2493a06K19P0j76k00J12J58M8k81L53k01J10j91k8J46O0Pr6L5j0o0p6N7L5n4L9
2518c0mJ2J65k55J01P1o8m3m9M09k87J84o6m3k3P1j41r0J52j39J0J53j77p0J45
2543a2K79k87J4j68J33jJ23q5j2n8K48k96M4m6L17l64K55n7O6k1j3r9o1j28O6
2568a63Q1j87K33n4Q5M1q2O2p5k09K18j5J61k71K53r7J20k67Q2n5m0J32L8M3j52
2593a18o1K96Rk47L2J36O9j36K7J51k42K49j97j02J20k18J39K42k49o7L57k26
$$ plain form
2615 -36 80 147 -71 158 -74 -308 -24 -113 31 11 2 -6 -135 -85 -71 -112 -2 -43 93 105 -2 114 -24 -38 -21
2640 -21 204 101 97 -130 -68 -138 -100 -2 84 -6 46 -139 -154 -17 -13 84 -182 -40 148 127 -71 -77 -107 -147 154 71 79
2667 79 1 -107 -42 73 -39 98 -19 -11 133 32 52 -237 124 54 -57 -164 -125 -179 -6 -232 108 -36 267
2690 267 -29 -155 -142 -11 -210 -9 134 -118 13 -132 -50 7 -129 56 56 -99 35 -250 -17 17 32 181
2712 181 199 88 -35 76 -17 -77 -8 -157 166 -231 -96 91 -109 -242 -57 -122 -77 23 10 -9 82 131 -193
2735 -193 -111 -81 9 59 -26 132 98 -20 62 71 119 61 -48 -71 -240 -110 -187 5 -64 -12 101 62 -8 -80 -52 -122 -47
2762 -47 -9 -8 24 97 -265 1 60 -153 -43 -186 -106 -62 6 163 16 197 16 -47 42 -10 119 -94 -242 31
2786 31 48 -26 -302 122 7 -33 -111 -117 132 -7 80 218 37 -63 120 -122 -53 119 -71 -118 43 62 282 65
$$ packed form
2615c6J16O7k18K29k32k34K84q9J44k0rqj29N0J4m1J10m1J36J2j07J16j38j4J7
2640b1K25j03mk27O2p0L8R8Q6r0N2j85j5J37MR7k66J42J88k1j98ol0m0L01q3Q
2667G9p8j08O5J15j12J37j17QJ44j01K0k89L61p0j11j07L9n4J73k26L40j44L03
2690B67k96j26J3J31j99K01J43k52J31j45Q2N7j36J85%j55J34k85K33L4J5J49
2712A81J8j11j23J11r3o0O9j49L23l97J35J87k00j33J85o5M5J00j3j9R1M9l24
2735a93Q2L0R0N0q5J58l4j18Q2RM8n8j09k3j69J30p7J92o9N2J13l9p0p2K8p0P5
2762d7L8JL2P3l62K66N9k13J10j43Q0M4O8J57j47J81j81o3Q9n2J29k13j48K73
2786C1J7p4k76M24j15m0p8oK49j39Q7J38j81j00J83k42O9J72j90m7J61J9K20k17
$$ plain form
2810 65 91 -276 -18 -56 267 172 95 -84 363 94 187 -267 44 -13 235 156 -79 21 50 -46 -68 42 -56 -146
2834 -146 -1 -1 164 -253 -72 157 -175 250 -21 -90 22 35 -122 -181 32 -121 36 112 -184 118 -170 -160
2856 -160 -335 -88 222 -22 -40 -107 85 17 242 111 106 67 -62 -322 -166 -25 6 48 23 31 116 80 -18 -101 -142
2881 -142 -43 121 110 -118 -31 -121 -13 -99 -19 62 25 104 -214 21 270 162 -16 -149 102 -26 -54 -133 57 37
2905 37 -69 6 102 60 98 21 190 -99 8 -67 -55 30 -125 4 99 -216 -33 156 -42 -133 -126 -261 107 124 205
2930 205 -93 182 103 56 -144 -103 227 51 -9 71 -138 19 154 42 22 -92 -14 186 150 154 -24 -37 -115 79
2954 79 72 6 -48 -209 83 118 -51 88 -190 11 -60 52 -87 73 121 -176 75 146 -13 55 17 255 -22 88
2978 88 319 -142 61 58 3 41 -70 220 91 -102 111 -20 107 82 -216 73 -67 189 -87 96 -257 -22
$$ packed form
2810F5K6l67K58l8L23r5p7j79M47k69R3m54L11n7K48p9k35J00K9r6k2J10r8r0
2834a46J45%J65m17J81K29l32M25k71o9J12J3j57n9K13j53J57P6k96L02k88J0
2856a60j75K47L10k44j8o7J92o8K25j31nl9j29k60J56J41L1M2k5QQ5l6r8q3m1
2881a42R9J64j1k28Q7r0J08q6Q0Q1l7P9l18K35K49j08j78j33K51j28k8p9J90k0
2905C7j06P5R6m2L8p7J69k89J07p5J2Q5j55J29R5l15J83J89j98r1Pj35L68J7Q1
2930B05k98K75p9m7k00M1L30j76o0Q0k09J57J35j12k0j14P8K00l6Mj78j3p8J94
2954G9po6n4j61K92L5j69J39k78K01p1J12j39J60M8k97K51P1j59O8l8K38k77J10
2978H8K31m61K03ln5L8j11K90j29j93K13j31J27k5k98K89j40K56k76J83l53K35
$$ plain form
3000 -22 -105 53 90 -67 -17 -6 56 73 142 23 163 15 -216 296 20 -74 264 -266 37 118 -166 -86 122 204
3024 204 30 77 184 38 98 45 174 -26 72 42 93 -121 -85 195 -21 -14 -126 245 -49 -196 180 -85 12
3047 12 -316 -138 -163 -67 -24 -135 -160 39 -173 -147 -227 88 358 -88 -178 161 365 74 -54 -44 65 -102 138
3070 138 -133 -167 -157 44 18 9 81 -43 25 -28 120 -5 300 -7 -371 -35 90 -232 -23 12 110 113 -211 -66
3094 -66 106 137 25 -60 62 -181 265 -9 22 18 -175 -32 -18 104 -102 39 262 57 59 70 70 -130 -93 20
3118 20 127 -168 -9 279 76 -126 -59 179 70 -201 71 -3 -43 32 -164 0 -302 76 -180 -58 -61 -170
3140 -170 -91 -21 50 -158 82 -34 -210 24 -56 -114 -145 157 10 2 -4 -110 -143 -158 -81 -27 -169 64 -55 -142 -137 159
3166 159 -71 177 134 -169 76 -111 1 -14 -2 -200 124 155 -100 44 -150 106 -75 143 11 242 48
$$ packed form
3000b2q3J58L7j57N0J1O2J7O9j19J40j48k31N12k76r4L38n30L03Q1k84Q0K08Q2
3024B04j74M7J07j46O0n3J29k00R8l0N1k14L6K80k16Pj12L71k94j47L76k65R7
3047A2l28J78k5R6M3j11k5J99k12K6q0L15K70m46r0L39K04k91j28J0J09j67K40
3070A38k71l4J0K01k6rP2j24O8n3J48j25L05l07l64L36J25l22K09L5R8Ll24J45
3094f6J72L1j12q5J22k43M46k74L1mj93J43J4J22k06J41K23k05KJ1%k00L7J13
3118B0J07k95J59K88k03k02O7K38j09k71K72p4m0P5j96J64l02L78k56J22lj09
3140a70P9P0P1k08K40j16j76K34q0n8l1L02j47qoj06l3j5P7N4j42K33j19q7NK96
3166A59k30K48m3l03K45j87J12j5J2j98L24L1k55J44j94K56j81K18j32K31j94
$$ plain form
3187 48 -38 -59 38 -125 -92 82 -127 -67 -67 -58 34 171 211 207 -81 -131 -43 42 52 -80 19 -69 247 73 -37 206 -127
3214 -127 348 157 -95 17 -47 167 -128 32 106 56 6 118 226 -81 36 -5 -46 63 -3 -184 93 -55
3236 -55 76 -147 48 100 187 8 -182 -35 -75 49 75 39 30 75 56 272 204 -78 -34 56 99 0 -25 -166 11
3261 11 -77 154 226 196 -58 -74 233 -278 -84 -53 157 238 231 62 -179 -205 79 71 171 -212 -23 134 -116 -36
3285 -36 -100 -239 -438 95 119 162 179 -56 -198 167 63 108 -164 -74 -69 12 38 -7 -124 108 -190 64 -4 264
3309 264 70 100 160 -66 -106 -96 -127 200 46 271 -294 -320 -14 -76 32 96 -52 -6 82 -72 -38 -5 233 -17
3333 -17 0 -4 199 59 169 107 -145 194 0 -41 6 -54 -42 28 -55 -40 -42 58 -13 30 -210 50 -338 90 -22
3358 -22 165 275 -16 53 -111 229 126 113 -22 97 47 -354 201 142 213 -121 97 -127 -145 -24 -96 -24 -20 70
$$ packed form
3187D8q6k1R7j63L3J74k09O0%RR2J37M0mk88n0Q8Q5J0j32R9q8L16j74j10K43l33
3214a27M75j91k52J12o4K14k95J60P4n0n0J12J08l07J17m1m1J09o6j81K77j48
3236e5J31k23J95N2Q7j79j90J47m0J24K6l6rM5j9K16o8k82M4R0M3r9k5j41J77
3261A1q8K31P2l0k54j6L07n11J94L1K10Q1pj69k41k6K84qJ00l83J89J57k50Q0
3285c6o4j39j99N33K4M3J7k35j42L65j04M5k72R0NQ1K6m5j17K32k98K54o8K68
3309B64j94L0O0k26m0J0l1L27j54K25n65k6L06o2J08O4j48M6Q8j54L4L3K38k50
3333a7J7mK03j40J10o2k52L39j94m1M7o0J2P0q3J5kJ00p1M3k40K60l88M28j12
3358b2J87J10k91O9j64L40j03j3j35J19n0m01N55n9P1l34K18k24j8J21p2P2MR0
$$ plain form
3382 70 -18 59 87 62 -84 -95 14 116 88 45 116 -105 -52 -74 -98 36 -281 -95 -130 -180 68 -99 229 -1 116
3407 116 116 -131 -148 69 -169 64 -244 -81 -64 -162 -44 -32 121 57 -53 -164 15 109 -8 8 -133 41 25
3430 25 -194 37 69 9 83 -192 -62 89 77 85 -17 85 -60 -23 66 -88 -39 79 -170 -188 198 24 -220 20
3454 20 126 -106 -4 -165 -95 -67 -131 27 78 44 73 -150 -31 60 -94 -3 142 -92 237 36 159 188 193 16
3478 16 -188 107 37 -91 -179 153 43 -67 194 -4 297 242 72 91 44 -159 -76 -206 -104 41 22 70 -65
3501 -65 -29 -167 -73 -109 -252 149 -158 -63 287 230 -55 -143 -6 108 30 67 24 -116 135 149 -63 -15 -134 64
3525 64 -94 -125 111 172 178 -163 75 16 103 137 -113 33 59 2 -129 -224 27 43 -38 55 -162 -232 -164 -74 -161 105
3551 105 -56 -106 3 -25 21 -10 -47 -254 158 -138 -56 262 73 -35 17 129 54 -57 -122 131 102 -103 -78 226
$$ packed form
3382G0q8P7K8k5j46j1J09J02k8m3P1k21N3k2k4J34l17J86l5n0K48j67L28k30J17
3407A16%k47j7K17k38K33l08J63J7r8J18J2J53o4j10j11J79R4j17J6j41J74j6
3430B5k19K31L2o0P4k75J30J51j2Qj02J02j45L7Q9j54M9J18k49j8L86j74k44K40
3454B0J06k32J02j61P0K8o4J58N1l4K9k23J19R1j54R1J45k34L29k01J23K9Nj77
3478A6k04K95p0j28q8L32j10j10K61j98L01n5j70J9m7k03Q3j30J02J45j9M8j35
3501f5L6j38R4l6j43M01l07R5L50n7k85q8J37J14p8L7m3j40K51J4k12M8j19J98
3525F4j58l1K36O1Ol41K38n9Q7L4k50J46K6n7j31r5K51J6q1R3k17p0O8R0q7K66
3551A05j61n0J09k8M6l1l7k07M12k96Q2L18j89j08N2J12p5j11o5K53k9k05K5L04
$$ plain form
3575 226 -115 156 222 -23 137 56 198 -20 -196 -154 2 128 -31 16 -132 94 142 -130 41 96 -157 -132
3597 -132 -126 44 -13 -165 105 -135 6 -54 47 10 -18 20 -165 58 -129 -45 -218 56 -64 -48 52 72 173
3620 173 -67 -216 -228 -11 47 -254 148 -134 19 128 169 231 193 58 2 -34 -73 -39 190 71 -99 16 35
3643 35 78 -97 310 59 -105 128 -275 -181 -33 121 252 -89 -101 -108 114 -156 23 83 -26 78 58 -152 -21
3666 -21 99 270 154 69 -31 -75 -34 -21 135 50 92 65 -34 -62 28 146 -291 -132 20 12 -77 -105 -120 -5 24 15
3692 15 -40 -112 -40 49 128 20 -206 80 71 -58 72 -246 -104 129 61 -15 3 24 -269 -121 151 -61 175 -15
3716 -15 -82 -47 64 72 37 -129 72 -17 -171 -64 47 167 1 -7 -288 4 29 4 -172 50 137 1 -152 30
3740 30 -28 -122 -221 69 -77 45 178 -23 179 81 60 52 13 -55 -57 -118 -142 -38 5 -153 -11 -98 -51 -34 -7 -56 263
$$ packed form
3575B26l41K71O6k45J60q1J42k18j76M2J56J26j59M7j48K26M8k72J71N5k53K5
3597a32OJ70n7j52K70k40J41o0J01l7k8L8j85K23j87Q4j73K74j20J6J00K0J01
3620A73k40j49j2K17N8l01M02k82J53J09M1O2l8j35n6l6l9L4K29j19j70J15J9
3643C5M3j75M07k51j64K33m03R4J48J54J31l41j2pK22k70J79O0j09J04k0k10J31
3666b1J20J71j16q5j00m4M1J3J56q5M2k7r9k8R0J18m37J59J52qq9k8j5J15K9r
3692A5n5p2P2Q9P9j08k26K86rj29J30l18J42K33o8p6J8K1k93J48K72k12K36j90
3716a5o7L5J11Ql5j66K01q9j54J07J11J20j66qk81K92K5k5j76K22Q7j36j53J82
3740C0n8r4r9K90j46J22J33k01K02r8k1ql9o8ko1k4J04M3j58J42q7M7J7K7m9L19
$$ plain form
3767 263 130 -275 -12 53 168 18 35 76 104 -83 -76 216 51 -68 290 0 -233 -37 1 -269 -269 117 176
3790 176 -123 -163 -1 149 -45 -179 -155 -162 -20 55 -64 -10 -48 -214 111 -93 -19 41 -110 128 -29 -105 -91 88
3814 88 49 124 101 81 65 -42 107 132 36 80 99 -118 -71 -57 -76 -73 70 91 -175 -16 -162 -155 -178 14 119 17
3840 17 -88 28 -60 140 80 -63 -194 -240 21 91 -54 -149 62 -12 65 -67 144 -29 325 28 110 -74 218
3863 218 65 158 57 -8 100 112 -26 -20 -65 -64 -108 86 120 -196 -74 -158 158 -66 -2 102 8 -140 179 152 -58
3888 -58 -162 228 -226 165 223 -135 -59 -62 -81 250 56 -20 89 -1 -74 90 58 -27 126 -108 8 -30 154 -261
3912 -261 -33 -45 -89 -34 99 51 19 67 -54 -55 3 77 -82 193 171 89 -54 125 -94 -35 -69 16 51 -24 19 116
3938 116 -313 178 197 122 55 -175 -91 95 -158 -104 113 117 -56 -198 43 -104 35 -79 -26 127 -63 219 107
$$ packed form
3767B63j33m05K63O5J15j50J7M1K8j87PK92j65j19L58k90k33J96L8k70%L86N9
3790A76k99m0J62J50j94j34K4pJ42P5j19N4l8j66L25k04P4O0j51K38j57p6J4J79
3814H8l9P5k3k0j6j07J49K5r6M4J9k17M7J4j9LJ43K1k66J59j46Pk3J92J05j02
3840A7j05J16q8K00o0j43j31m6K61P0j45r5K11p4P7j32K11j73L54k97Q2j84K92
3863B18j53R3j01o5J08J2j38Om5Jm4J94L4l16J22q4L16k24O4J04r4j48L19k7k10
3888e8j04L90m54L91N8l58P6lj9L31j94p6J09r0p3J64l2q5J53k34J16l8J84m15
3912b61K28j2m4N5J33m8l2M8j21jN8P4j59K75k2q2j43J79k19N9l4Q5L5p5M3R7
3938A16m29M91J9p5o7k30Q4J86k53N4K17Mj73j42K41j47J39j14N3J53j90K82j12
$$ plain form
3961 107 -97 -102 -108 382 -10 -71 49 87 -142 46 -159 126 27 -64 -145 145 63 -16 33 -103 -108 -262 -187 137 90
3986 90 -71 113 -41 -82 -60 321 -42 11 103 58 44 117 -73 187 -7 -183 158 -141 -188 -66 80 85 134 34
4010 34 -79 35 -247 -34 -266 512 180 -62 241 -145 64 -29 221 55 -195 -48 3 46 -197 -83 90
4031 90 84 66 -154 -128 -82 -55 26 -61 -65 -197 58 82 88 93 181 185 22 101 -188 -82 255 100 -193 98 101 -119 48
4058 48 -133 -69 -191 -101 -35 144 -54 -61 -75 375 14 65 -105 133 0 -68 -20 -57 47 -179 67 21 -102 93
4082 93 47 -141 -70 -90 -85 196 34 148 192 -26 159 -75 -264 -61 5 117 85 -21 16 -262 -139 63 -9 117
4106 117 -72 -203 52 260 -18 184 10 29 91 -238 -64 13 181 60 116 -43 -212 -48 56 26 -132 -64
4128 -64 268 -80 -53 -54 -82 -116 158 -4 10 -38 -238 -104 -319 -100 -24 -9 -55 -72 -127 -238 325 103 -146 27
$$ packed form
3961A07k04noM90l92o1J20L8k29J88k05K85r9r1q1K90q2p9M9j36nj54P5L24m7
3986I0j61J84j54m1K2L81l63N3R2m5j4P3j90K60j94j76L41k99m7J22J46NM9j00
4010C4j13J14k82K13k32P78l32k42L03l86K09r3K50j66k50J47N1M3k43J14J73
4031I0oj8k20K6M6K7Q1q7mj32K55K4ONQ8Mj63P9k89J06L37j55k93K91Lk20J67
4058D8j81O4j22R0O6J79j98pj4M50l61N1j70K38j33o8M8l7J04k26K46m6j23J95
4082I3m6j88P1k0NK81j62J14M4k18J85k34j89K03O6J12l2j06L7k78J23K02p2J26
4106A17j89j31K55K08k78K02j74J9O2l29J74P7J68j21N6j59j69J64J04l0j58O8
4128f4L32l48K7jk8l4K74j62J4m8k00J34k15K19P6J5m6j7n5j11N63k22k49J73
$$ plain form
4152 27 108 104 -177 -141 -61 -6 2 132 194 -26 -14 14 14 45 -101 71 25 132 -18 -41 -35 146 -110 -66 -153 -58 -48 9
4180 9 53 54 173 175 -44 232 -1 -104 114 91 292 152 -135 82 200 -105 10 63 -112 -54 60 60 -32 39 130
4205 130 -42 24 123 -32 -5 -172 275 -112 47 -214 251 158 -6 -226 -19 -11 -33 -95 -86 3 -16 263 94 -165
4229 -165 126 36 0 -6 8 -10 44 47 -116 -35 -90 28 -70 -247 8 -61 -47 -45 -223 77 -88 -193 120 -161 -158 157
4255 157 -214 91 -39 -350 -171 186 -102 143 61 -49 83 103 78 116 166 -83 -242 -32 169 -26 102 -47
4277 -47 73 -17 -141 93 0 -293 -114 -64 -7 -189 75 -9 -29 -203 -145 -70 -67 -79 97 -102 -65 -69 46 92 167 93
4303 93 -298 264 138 -25 15 -46 -11 69 -163 -292 -115 -206 97 -170 -135 31 -17 46 64 -5 89 64 -99 -38 111
4328 111 180 -77 -137 -89 -14 -143 55 -189 -337 -101 -71 -154 59 -99 -116 6 -63 -48 -111 123 -60 276 -218
$$ packed form
4152B7Q1mk81L6Q0N5QJ30O2k20J2K8%L1j46J72m6J07j50k3OJ81k56M4q7R5J0N7
4180IM4JJ19Kk19K76k33j03K18k3K01j40k87K17J18l05J15N3j75N8J14%r2P1R1
4205A30j72O6R9j55K7j67M47l87J59k61M65r3j64k20K07Qk2o2RQ9j9K79j69k59
4229a65K91r0l6oJ4j8N4Lj63Q1n5J18r8j77K55o9J4Kj78L00j65j05L13k81LL15
4255A57l71L05j30l11J79L57k88K45q2j10J32K0k5L8N0k49j59K10K01j95J28j49
4277d7J20r0j24K34r3k93J79N0N7j82K64q4k0j74N8P5Lj2J76j99L7mJ15M6P5p4
4303I3l91N62j26j63M0o1L5Q0k32j29J77r1L03k67L5J66m8O3J8o9R4k5j63O1J49
4328A11O9k57o0M8P5j29J98k44j48K36L0q3K13j58j7J22o9J5o3K34j83L36m94
$$ plain form
4351 -218 75 45 -14 72 24 -113 156 32 -49 -171 113 198 -85 47 -93 -25 6 -131 92 -4 161 -65 -99
4374 -99 -77 -91 49 2 -7 195 -33 10 -17 -33 117 86 157 18 146 158 -90 -112 -122 22 29 -27 42 -157 -54 90
4400 90 68 81 40 -100 54 -48 31 -311 151 -346 -3 14 66 34 -189 83 132 -172 -65 -111 86 -83 42
4423 42 10 387 -27 112 -7 19 -165 -282 127 322 165 1 91 33 -150 -115 -129 -129 -26 71 26 -180 40 -138
4447 -138 227 174 97 89 166 82 15 116 -130 -11 -154 140 -49 -406 -68 58 -176 102 -124 25 48 173 192
4470 192 -16 -58 -9 135 124 34 -190 -55 51 21 -85 131 66 239 51 22 21 -45 -221 252 -192 4 -70 -242
4494 -242 88 1 33 119 -27 -122 -60 -142 218 -95 37 -33 176 -79 -119 -103 9 -246 182 79 -108 143 -143
4517 -143 54 235 160 254 -76 7 162 -110 -8 50 168 226 109 -252 138 -190 -130 -139 -115 -102 -178 280 70 37
$$ packed form
4351b18K93l0n9Q6m8j37K69j24q1j22K84Q5k83J32j40O8L1j37K23r6J65k26l4
4374i9K2j4J40m7rK02k28M3k7j6J50l1P1j39J28J2k48k2j0J44Pn6O9j99J03J44
4400I0k2J3m1j40J54j02P9l42M62m97L43J7N2l2k23K72M9l04J07m6J97j69J25
4423D2l2L77m14J39j19K6j84j17M09J95j57j64R0n8j83L5j4%J03R7m5k06K20j78
4447a38L65n3p7qP7q4o7J01k46J19j43K94j89l57L38J26k34K78k26J49K3J25J9
4470A92k08m2M9J44j1r0k24J35J06l0j06K16o5J73j88k9jo6j76M73m44J96p4j72
4494b42L30q7L2Q6j46r5O2q2L60l13J32p0K09k55m0J6J12k55M28j03j87K51k86
4517a43J97J81p5R4l30Q3J55k72J02N8J18N8j17l61L90l28O0rK4J3p6M58k10l3
$$ plain form
4541 37 -37 -100 68 -64 174 -106 38 145 140 38 -92 40 194 144 202 -140 115 -213 -154 89 18 -20 -2 112
4565 112 -154 -18 -59 13 14 -29 -32 -82 16 -26 31 173 1 26 134 74 172 214 4 -26 -115 -97 32 -93 106 38
4591 38 105 -28 -120 -6 -34 -35 37 46 11 140 -67 -236 120 107 -38 111 19 52 -32 60 49 -19 -23 37 -114 25 17
4618 17 -137 -113 -167 139 77 307 135 49 137 220 -138 9 75 -114 45 119 -173 -175 -122 -220 35 -377 57 -62
4642 -62 -50 -8 340 8 -196 72 108 313 -134 216 -154 -39 -11 29 102 64 168 -51 -96 -19 -8 -146 149 183
4666 183 -158 33 115 -192 41 4 -126 54 -119 56 -175 330 62 -9 96 -225 34 117 -102 -53 -13 -94
4688 -94 -24 -108 -128 -28 -30 102 -210 -169 -134 11 250 -101 -25 128 17 -47 120 46 216 31 139 14 102 -22
4712 -22 47 126 -31 -63 -40 -45 46 4 144 -110 62 16 -202 -107 40 158 78 34 24 176 -59 102 122 114 -99 -3
$$ packed form
4541C7p4o3J68j32K38k80J44J07nj02j30J32J54n0N8l42K55l28N9K43p1l8J8J14
4565A12k66J36m1P2Jm3ln0R8m2N7J42j72K5J08o0R8M2k10l0q9J8J29j25J99o8
4591C8O7j33r2J14k8jP2Rl5J29k07j69L56j3j45J49r2L3q4R2j1o8mO0j51J39q
4618A7j54K4n4L06o2K30j72q6Q8Q3l58J47O6j89J59P4k92kN3r8K55m12M34j19
4642f2J2M2L48l32k04K68L6K05m47L50l70J15K8M0P3l8J04k19m5P7J1j38K95L4
4666A83l41J91Q2l07K33l7j30J80j73J75k31N05k68p1J05l21K59Q3k19M9M0q1
4688i4P0q4k0J00kJ32l12M1L5J45K39l51P6J53j11o4J67p4J70j85J08j25Q8j24
4712b2O9P9j57l2K3nR1m2J40k54J72m6k18R5J47J18q0m4j0J52k35J61K0qk13R6
$$ plain form
4738 -3 -14 -27 -207 -19 -172 105 -119 216 16 -202 -43 73 -51 -225 79 116 207 225 151 -137 -92 -49 157
4761 157 143 159 -117 -90 196 -173 218 24 180 -19 -103 -128 170 19 85 -274 34 41 155 126 -45 48 -71
4784 -71 28 5 -48 60 -22 -202 20 123 -78 -50 144 -18 -56 118 -135 20 -50 -48 15 -50 143 14 -112 -220
4808 -220 186 39 -91 -31 -8 159 347 -150 -75 5 103 -225 86 -15 55 -77 30 156 -2 137 -168 23
4830 23 -271 26 103 -84 -32 -24 64 -71 137 95 49 -35 -344 -242 50 27 206 -7 -131 -160 20 141 -35 -63
4854 -63 -158 75 -219 -17 -188 -33 -22 -40 83 -222 -87 57 -107 5 -92 51 70 -45 -92 -169 -53 -192 36
4877 36 -67 -120 16 0 22 190 -317 -59 40 -71 -2 -20 227 63 -21 -28 130 -26 -182 -226 -13 -19 166 -104
4901 -104 62 -188 -238 -95 -269 108 21 -78 118 60 -43 54 -84 -306 105 -144 -70 -28 -64 121 -186 197 -212
$$ packed form
4738cj1j3j80J88j53K77k24L35k00k18J59J16j24j74L04L7R1J8p4k88M5M3K06
4761A57j4J6k76K7K86l69L91j94J56j99q4k5K98j51O6l59L08PJ14k9j71R3j19
4784g1R9k3n3J08q2j80K22J03k01K8J94j62l8J74k53J55p0KO3o5J93j29j26j08
4808b20M06j47j30O0K3J67J88m97P5Q0R8l28L11j01P0j32J07J26j58J39l05J91
4830B3k94K97P7j87N2QQ8j35K08m2m6q4l09J02K92k3J79k13j24k9J80J21j76k8
4854f3r5K33k94K02j71J55J1j8J23l05J35J44j64J12r7J43J9j15m7p7J16j39K28
4877C6j03n3J36j6K2J68n07K58R9j11O9j8K47j64q4pJ58j56j56m4K13oJ85k70
4901a04J66k50n0J43j74L77q7r9J96n8j03R7j38k22M11k49P4M2l6J85l07L83m09
$$ plain form
4924 -212 -113 -18 -89 -76 176 -151 117 57 -179 119 145 -142 -50 147 94 31 -95 -76 292 -2 -107 102 -1
4947 -1 18 58 -55 103 -188 91 126 102 67 -207 48 22 200 137 -209 149 6 113 36 -148 4 -5 -74 -181
4971 -181 81 24 87 46 136 126 179 -56 13 30 -129 359 -81 -254 88 223 -39 26 -11 -140 226 -139 -39
4994 -39 125 -34 -19 77 -22 42 70 -31 -142 85 -60 -189 -121 81 33 -90 210 -57 105 38 207 14 25
5017 25 94 -62 79 -30 114 51 118 -44 188 91 -102 46 -32 128 -243 269 -51 197 115 348 -60 -74 236
5040 236 -88 -48 -143 -158 191 27 -116 202 -167 80 -179 100 -59 252 40 65 -181 -143 -50 -88 32 -11 88
5063 88 320 -20 -77 -82 -147 -165 -63 -211 153 -166 -147 -131 -274 26 367 125 -28 -96 35 -123 -271 -23 -7
5086 -7 -11 95 42 -102 48 44 8 170 196 -61 134 -22 311 -56 -169 -68 117 -157 229 152 -127 99 -37
$$ packed form
4924b12R9R5p1J3K52l27K68o0k36K98K6k87R2J97n3o3j26J9L68k94j05K09j03
4947aJ9M0j13J58k91K79L5k4l5k74K55k6J78o3l46L58j43J07p7j84J52ro9j07
4971a81K62n7O3m1R0j0N3k35O9J7j59M88m40j73L42J35k62O5l7j29L66l65J00
4994c9J64j59J5R6r9O4K8j01j11K27j45j29O8K02m8j23L00k67J62o7J69j93J1
5017B5O9j56J41j09J44o3O7j62K32r7j93J48p8J60l71N12l20K48q2K33m08j4L10
5040B36l24M0r5j5L49j64j43L18l69K47k59K79j59L11k12K5k46L8R3l8J20m3R9
5063H8K32l40n7no5j8J02j48L64l19J9J6j43L00L41k42j53o8J31j58j48K48J6
5086gmJ06n3j44J50ml6J62K6k57J95j56L33l67j13J01J85k74L86p7k79K26j36
$$ plain form
5109 -37 10 88 -24 163 50 24 43 -242 179 -172 -21 30 112 76 248 5 -41 201 172 9 23 187 150 -172
5133 -172 -298 56 -120 -148 -198 -99 -156 3 -202 -126 -19 -179 -109 194 -4 -77 -32 79 19 -240 23 19 -45 -39 215
5158 215 -38 -116 122 74 -86 -45 65 123 -8 83 -78 127 68 131 -13 21 -63 -27 113 87 111 -16 -107 54
5182 54 62 -115 -91 -24 23 168 -69 97 -29 47 19 -38 -72 105 49 19 -53 129 -28 183 117 11 -25 108 32
5207 32 -242 16 -84 -75 259 25 -84 -27 -50 -127 -96 231 18 22 -200 -65 -5 -39 65 68 -2 -99 9 126 261
5232 261 -19 -106 86 23 134 -90 -60 5 -13 -241 75 315 41 11 30 24 81 -161 -186 -83 -64 -193 -304 -76
5256 -76 130 173 -244 38 117 13 -22 -170 -50 -50 -41 -102 252 359 -109 -121 -63 13 -170 -33 -110 -77 301 -120 -199
5281 -199 5 31 -133 159 -1 -29 141 -52 104 181 -300 -23 -177 -54 -51 -205 -23 -64 -63 29 253 -50 -92
$$ packed form
5109c7M7P8j12J87j13k6J9k85M21l51J51N1Q2l6J72k43m6K42k9j63J4J64l7l22
5133a72j26L54j76k8n0R9n7J59k05P6J07j60P0L03j98p3M5J11o0k59K63mo4OK54
5158B15k53p8K38m8j60M1J10N8j31R1j61K05n9O3j44L4q4L6J40k6K4j27r1J61
5182E4Qj77K4O7M7J45k37J66j26P6k8n7l4J77n6l0p2J82j57K11o6j06l6J33p6
5207C2k74K58j00RL34k34j09N7k3p7L1L27k13Mk22J35O0l4J04Lp0r7J08J17J35
5232B61k80q7J92o3J11k24L0O5j8k28L16K40k74l0J9oN7k42k5J03J9j29j11K28
5256g6K06M3m17K82P9j04l5j48J20%Ro1L54J07m68j2N8P6j83J37p7L3L78m21p9
5281a99K04K6j64K92j60k8J70j93J56P7m81K77j54J23Lj54J82m1JR2K24l03m2
$$ plain form
5304 -92 140 -39 -4 62 112 -102 126 115 311 -1 -85 9 45 -196 -92 98 -171 -20 -22 -247 131 87 5 -4 161
5329 161 -169 -235 -71 185 -92 64 232 54 76 64 -89 -230 -161 39 84 49 137 168 -125 -165 63 -69 131
5352 131 -35 124 -153 40 -102 128 -168 20 104 -52 327 -40 -14 99 -302 -159 -44 207 -16 150 -148
5373 -148 -122 160 39 78 1 72 -59 204 -62 175 -12 -164 -27 102 -133 -49 190 25 -249 223 -163 36
5395 36 -64 -182 -115 -77 -7 24 -155 52 16 -64 -118 101 23 371 167 -22 -58 124 115 60 71 83 -8 -95 -105 -1
5421 -1 -26 9 -65 -233 99 -81 -69 -29 30 -182 269 -5 -92 39 64 -41 -153 -213 158 -42 -123 -82 -40 42 59
5446 59 -68 208 -51 87 -123 124 -100 -142 -99 76 26 43 -70 -67 -28 54 -84 -5 -62 2 102 -174 76 -245
5470 -245 -146 57 -112 41 -20 110 -95 171 -18 -104 78 67 -48 72 201 181 -14 -84 49 136 52 -192 76
$$ packed form
5304i2K32j79L5O6N0k14K28j1J96l12q4R4L6k41J04J90k69J51kk25L78m4q2rJ65
5329A61l30o6J64K56k77J56J68j78K2j2j53j41O9K00M5l5Q8L1k93m0K28j32K00
5352A31j66J59k77J93j42K30k96J88Q4j56L79l67K6J13m01J43J15K51k23J66k98
5373a48K6K82j21L9p7P1j31K63k66K37j87j52J37J29k35Q4K39j65k74M72l86J99
5395C6j00j18O7L8P0L1j79K07l6q0n4K19p8L48k04j89l6J82rn5J1J2r1q7j0J04
5421ak5L5p4j68L32j80J2M0N9k12M51k74q7J31K5j05j12o0L71k00q1M1M2Q2J7
5446E9j27K76k59J38k10K47k24m2M3J75n0J7j13LL9Q2j38P9n7O4J00k76K50l21
5470b45R9K03j69J53o1J30k05K66j89q6J82j1j15J20J29k0j95p0J33Q7q4k44K68
$$ plain form
5493 76 -79 50 -123 -192 -86 -87 63 131 72 -201 -83 -3 54 -94 93 -195 -81 -144 -6 -308 46 101 21 -31
5517 -31 65 -107 34 97 94 -22 234 -25 68 -25 261 -167 134 64 29 60 70 122 -218 -183 -124 -81 -78 45 -4 155
5543 155 -13 -132 -256 -103 -3 -4 97 -71 100 250 42 -173 -86 133 77 158 69 73 -221 -131 -34 93 -260
5566 -260 54 -4 163 -40 -175 18 66 32 62 47 -161 -96 294 81 -87 -111 191 91 -15 70 -158 187 53
5589 53 101 -4 77 -23 -129 -116 116 35 -36 -71 -148 76 -56 -169 -182 77 -69 -17 203 4 15 158 62 -161
5613 -161 -96 41 51 -73 -33 262 111 -19 120 14 -50 49 47 4 -211 142 -160 -39 -40 30 107 84 -10 -87 8
5638 8 47 -64 43 83 312 86 110 -226 -54 110 -171 -63 60 -58 156 17 -48 -93 -180 90 -341 -214 45
5661 45 -105 205 250 129 235 146 -15 -129 100 -19 -37 -125 -105 140 -322 -82 -94 -172 96 255 71 -91 52
$$ packed form
5493G6j55J29j73o9J06jJ50O8n9k73J18Q0N7j48J87k88J14o3J38l02L54N5q0n2
5517c1R6j72J41O3lj16K56k59R3r3K86m28L01p0l5L1J0N2l40L5N9M3LJ23m9J59
5543A55j68j19j24J53J00jJ01j68J71J50k08k15Q7K19n6Q1q9Mk94R0R7J27l53
5566b60L14n8J67k03j35J93M8l4L0j5k08O5L90k13j68k4L02j00j06Q5k28L45j34
5589E3M8j05Q1j00j06J3K32q1p1l5p7K24j32j13j3K59j46N2K20j99J1J43r6k23
5613a61O5J37J0j24M0K95j51j30J39j06o4R9km3k15L53l02J21jP0P7k3r4p7R5
5638HL9j11J07M0K29k26K4l36J72J64k81J08J23j18K14j39o5m5q7K70m31J27K59
5661D5j50L10M5j21J06q9j61j14K29j19j8q8K0K45m62K40j2p8K68J59j84j62J43
$$ plain form
5684 52 47 179 -62 -101 163 -16 64 55 -41 -25 91 180 25 11 -76 11 -124 -105 -140 94 206 82 -213 -33 -88
5709 -88 -137 297 -66 74 12 177 9 -4 -161 134 52 92 7 -7 153 134 -138 -62 362 -188 18 35 24 30 -9
5734 -9 -31 -29 -41 -144 261 -26 3 -15 16 -11 40 27 -203 -157 74 92 148 -57 138 -19 -233 -80 -167 -329 60
5759 60 205 -70 -216 47 15 135 77 -58 -112 30 -199 86 -41 -268 -42 206 23 237 115 189 -95 -5
5781 -5 -8 -70 -29 -172 33 305 89 129 -57 196 225 -165 -165 33 147 160 107 -77 95 -102 -168 -132 89 -157 76
5806 76 -52 -28 72 154 -42 -49 -137 184 44 147 57 -37 -22 -79 111 228 -34 109 -27 -84 109 141 -66 3
5830 3 102 -5 -13 -69 39 56 126 -1 -478 -139 152 156 -88 38 38 158 -95 370 171 113 319 -64 -78 -202 225
5855 225 -28 -88 -8 81 -110 -134 99 44 -49 -134 238 169 98 -213 -181 12 -102 66 -75 -81 -6 -20 -181 13 -20
$$ packed form
5684E2nJ32k41l9K64j79Q0rr6J6J16Q9j55j4q7Q7j35J9l5K34J12j24k95J80n5
5709h8m9M34l63J40o2J65j68j3j57K95q2M0q5j4J60j9k72P6M24n50K06J7j1Ol9
5734ik2Kj2j03M05k87K9j8L1k7N1j3k30M6K31J8N6k05J95j57k14J53q7j62L89
5759F0J45k75j46K63l2J20n8j35n4J42k29K85j27k27K26K48j83K14j22P4k84R0
5781elo2M1j43K05K72k16M0j86K53K9l90%J98J14J3n3j84J72j97o6L6K21k46K33
5806G6j28K4J00Q2j96pq8L21j40J03r0r4J5n7J90J17k62J43j36n7J93L2k07O9
5830CR9j07qn6J08J7P0j27m77L39K91Mk44J26%J20k53M65j99n8K06l83j4j24M27
5855B25k53o0Q0Q9j91k4K33n5r3q5L72o9p1l11L2J93j14J68j41oP5j4j61J94l3
$$ plain form
5880 -20 -51 38 -210 33 87 55 -158 -241 -170 63 -27 -51 8 -18 5 -252 -92 -33 -133 -82 39 110 -133 -54 -129 -119
5906 -119 -32 80 -226 -98 -100 18 -54 27 -122 -307 9 -118 -85 -81 -192 152 127 -34 -189 -41 -153 66 152
5929 152 10 34 154 -87 -133 59 41 60 162 258 226 -64 -75 93 -51 131 -121 -47 -88 -265 -27 -143 79
5952 79 -183 -66 150 227 247 -38 23 -185 -54 20 42 -12 -13 -78 96 -74 15 -98 32 177 -20 47 -89 41
5976 41 -158 -4 59 70 -179 -157 69 99 293 81 -136 -185 57 182 127 -12 -140 -28 114 -89 115 46 -278
5999 -278 90 127 157 -130 -218 20 254 -46 -54 173 -199 59 75 40 -123 -14 42 -148 96 -21 37 33 -129 3
6023 3 236 -51 -159 37 -166 22 23 44 206 -156 -168 -42 24 224 -31 43 213 142 24 171 -47 122 -12
6046 -12 282 132 89 61 88 90 -102 100 137 37 63 41 61 -100 24 33 -7 96 -16 3 184 -29 70 175 -79
$$ packed form
5880b0l1Q9k48K43N4l2k13q3P1K33r0k4N9k6K3k57J60N9j00N1J21P1k43P9p5J0
5906a19Q7J12l06J28kJ18p2Q1j49j85L16j27L3Mj11L44k5j61j55J48j12K19Q6
5929A52j42K4J20k41m6J92j8J9J02R6l2k90j1J68j44J82k52P4m1j77K38j16K22
5952G9k62J17K16P7K0k85O1k08J31P4K2n4jo5J74j70Q9j13J30J45j97O7j36J30
5976D1j99J54O3J1k49K2K26L0J94k12k17m9K42J25n5j39j28J12J42k03K04o9l24
5999b78L68L7L0k87q8K38K34l00qK27l72K58J6l5j63J09N6j90K44j17N8mj62J32
6023CK33k87j08J96k03J88JK1J62l62j2J26O6K00k55P4J70p1j18J47k18J69j34
6046a2K94j50m3k8K7Kj92K02L7j00K6k2K0j61J24Rm0J03j12J9J81k13R9J05k54
$$ plain form
6071 -79 21 42 -87 138 -40 4 -126 -70 75 145 24 -54 225 -121 184 -179 2 21 10 -200 36 5 -22
6094 -22 -163 19 152 135 347 -86 -73 -163 -35 14 4 -25 -146 153 60 47 93 -1 147 97 80 139 54 -251 -112
6119 -112 183 65 87 31 78 108 -12 -27 -242 100 78 52 -147 -88 208 -5 -76 64 -87 150 -147 104 102 18
6143 18 21 -104 -86 -79 89 -49 -107 -28 24 -67 128 -100 81 -29 -15 47 199 -192 -35 -281 31 -228 -76 -242
6167 -242 6 -91 -87 46 -22 205 -53 -255 105 84 -36 150 -360 102 -106 25 -159 68 -128 29 -288 -18
6189 -18 23 10 -83 -27 -216 -99 -7 107 132 -87 -35 -74 -97 -225 -110 1 28 8 -24 42 5 -41 -53 192 -230 -82
6215 -82 -251 -132 -3 -69 177 132 246 -1 47 -70 39 -305 -37 -1 8 149 42 -1 -58 -13 158 -171 64
6238 64 -159 154 20 -141 171 -210 76 -235 -48 -166 16 -40 -63 271 28 89 -94 -167 27 106 -195 154
$$ packed form
6071g9J00K1j29K25j78M4j30N6J45P0j21p8K79l46L05l63J81J9j1k10K36l1k7
6094b2j41J82J33j7K12m33J3r0J28M9j0k9j21K99r3j3M6r4J48n0j7N9q5l05J39
6119a12K95j18K2n6M7L0j20j5k15L42k2k6j99N9K96k13p1J40j51K37k97K51kq4
6143A8Lj25J8PJ68j38n8P9N2r1J95k28J81j10J4O2J52l91J57k46L12k59J52j66
6167b42K48r7MJ33o8K27k58k02L60k1j20J86n10M62k08J31j84K27j96J57l17K70
6189a8M1j3r3N6j89J17R2J14K5k19N2l9k3j28J15J11K7k0l2O6l7m6j2K45m22J48
6215h2j69J19J29o6K46m5J14k47M8j17J09l44K68L6RJ41j07m3n7M5J71l29K35
6238F4k23L13j34j61L12l81K86l11J87j18J82n6k3L34k43O1j83p3J94P9l01L49
$$ plain form
6260 154 -39 -31 -66 117 217 12 161 -191 -81 -146 -51 -210 65 46 24 14 -220 119 -119 -182 -128 108 -6
6283 -6 -149 -156 -14 26 -57 -62 -108 -249 -133 -207 23 142 -256 118 -20 149 42 -115 120 -79 -117 59 -82 310
6307 310 -48 -150 -64 -121 234 133 -189 -352 62 26 -5 -43 171 -9 -141 -171 -1 82 -239 106 184 -65 8
6330 8 133 -27 -167 31 -57 62 -51 -119 -25 78 -126 -30 123 186 -116 -225 172 -203 22 79 -134 80 -104
6353 -104 143 -259 -25 182 -61 -40 173 31 -239 144 -201 129 -56 -122 7 37 -188 72 -152 -29 28
6374 28 -103 53 -8 -57 -130 8 -25 3 119 216 96 71 27 -261 3 -104 42 -281 85 45 -257 -130 -163 -126
6398 -126 92 -64 40 92 72 129 -27 71 -39 -9 -73 -236 46 221 -80 -60 90 222 -54 -21 16 -20 -43 -36
6422 -36 -134 -172 7 85 23 142 77 -223 -76 -87 31 -121 43 36 84 -53 26 -105 9 114 40 -100 45 -163
$$ packed form
6260A54j93Ql5J83J00k05J49l52J10o5R5j59K75j9k2j0k34L39k38o3N4K36j14
6283fj43pJ42M0q3nm6j41J16p4K30J19l98L74j38J69j07j57K35j99l8J76j41L92
6307C10l58j02Q6n7L55j01l22j63M14l6l1l8K14j80j32l0J70Q3l21L45P8k49P3
6330HJ25j60j40J98q8J19j13o8R4J03k04R6J53O3l02j09L97l75K25N7k13K14j84
6353a04K47m02K34K07k43K1K13j42k70L83l45L30j85o6J29L0k25K60k24J23N7
6374B8j31J56o1m9p3J38l3K8J16R7j20k5m4k88K64j07J46l23L66m0l02J27l3L7
6398a26K18j56J04N2k0N7j56R8j10L0o4j63K82J75l01K0J50J32k76L3L7l6k3P
6422c6r8l8J79P8o2J19o5l00J47j1J18j52J64pM8j37P9j31J14J05p4j40J45k08
$$ plain form
6446 -163 105 -71 -101 157 -174 81 -60 5 150 -104 -129 -21 -56 119 -17 -38 19 -23 -70 131 148 -34 -39 43
6470 43 -25 76 71 -157 -2 166 -161 199 123 28 -72 -72 -155 127 19 -81 -227 154 36 114 67 88 -15 133
6494 133 -136 -62 -108 -29 59 28 202 8 -136 105 94 36 -10 35 -115 -66 -73 -35 -204 -262 -79 -88 210 140 -39 -136
6520 -136 75 -23 -59 129 229 59 -7 -50 -4 -142 -139 33 2 -117 -25 -105 -258 50 204 26 -124 -15 -8 -179
6544 -179 -118 -37 -111 -76 -48 102 -45 -186 -46 -166 155 -157 -153 55 -247 111 -16 169 219 64 -4 -233 -95
6567 -95 -4 217 -54 -219 17 184 206 -270 -188 123 -229 351 -93 379 59 -21 174 29 -13 -204 311 3
6589 3 70 -102 -173 79 12 -92 -99 -117 -54 138 82 261 201 -15 -34 -15 76 128 203 -66 84 197 12 37 -124 -63
6615 -63 10 139 167 120 20 129 25 -2 -179 120 -90 -145 278 -192 -11 -158 233 -56 -160 -60 -116 -97 -119
$$ packed form
6446a63K68j76l0K58l31K55j41O5J45k54k5J08l5J75j36k1N7m2m7K01J7j82nQ2
6470D3o8J01nk28J55J68l27L60p6r5j00%q3K82j08j00j46L81j18P8m7K1j03J48
6494A33k69P4m6P9Q8l1J74j94j44K41j1n8m6M5j50M9pL8j69n8J83rK98p0j79r7
6520a36K11r8l6J88J00j70o6m3M6j38LJ72l1j19R2q0j53L08J54j78j50J09Pj71
6544a79O1Q1p4L5K8J50j47j41J40j20L21l12MK08l02L58j27J85N0j55o8k29J38
6567i5R1K21k71j65K36J67K2m76Q2L11l52N80m44M72l20q0J95j45m2j91N15l08
6589CO7j72p1K52o7j04pj8O3J92n6J79o0k16j9J9R1N2P5k69J50J13j85K5j61O1
6615f3P3J29K8m7j00J09j04k7j77K99k10n5M23m70J81j47L91k89j04J00n6J9k2
$$ plain form
6638 -119 -226 1 66 -105 74 121 -4 -116 215 -175 -11 -55 37 -105 -41 -35 -206 -53 -48 190 -79 -40 -23 25
6662 25 -116 78 -63 144 76 -156 71 -209 226 89 -152 65 -108 -125 105 -47 -156 -98 -112 -148 88 71
6684 71 -167 2 -131 146 2 -288 72 -118 76 7 -135 121 191 139 223 121 -90 -71 112 73 -12 87 54
6707 54 -177 -127 218 133 68 -96 57 -10 -51 -120 -21 26 -222 68 0 -176 196 1 -4 -1 -128 1 96 -65 22
6732 22 -51 -90 100 -52 125 65 94 118 -313 53 73 -101 -134 239 87 -24 25 17 74 -230 99 50 268 101
6756 101 -43 52 3 323 -102 0 34 77 169 32 256 19 -140 148 28 179 17 111 159 -98 -43 -37 162
6779 162 28 85 -92 128 79 137 -82 -154 72 -29 -25 211 134 -104 -78 -34 101 -90 38 -53 51 45 -126 35
6803 35 -62 153 -76 -4 -569 14 -34 -242 -143 323 -22 -316 128 214 199 -71 -23 -123 38 -88 -226 -214 102
$$ packed form
6638a19j07K27O5j71J79M7j25j12L31l90J64m4R2j42O4Oj71J53NK38k69L9J7M8
6662B5j41J94j41K07o8k32K27k80M35j37k41K17j73j7K30j52j09N8j4l6K36j7
6684G1k38J69j33K77j44k90L60j90J94o9j42K56P0n2Q4j02k11J9J83l9q5R9l3
6707E4k31N0L45q5o5j64J53o7m1o9R9M7k48K90o8j76L72j95nLj27J29R5j61Q7
6732B2p3l9J90j52J77o0K9K4m31L66K0j74l3L73j52j11M9qN7l04L29m9K18j67
6756A01j44R5m9L20m25J02L4M3R2j37K24k37j59K88j20J51j62R4M8k57N5OJ99
6779A62j34N7j77K20m9N8k19p2K26j01MK36p7k38K6M4J35j91J28r1J04oj71J61
6803C5r7K15k29P2n65N83m8k08R9M66l45k94M44Q6j5k70M8j00J61j26j38J2L16
$$ plain form
6826 102 3 198 1 -12 117 115 49 222 -44 81 -11 -4 -174 -139 -52 -33 12 83 102 59 -185 -118 6 93 -101 -248
6852 -248 -35 3 -187 -241 9 -54 69 242 149 -81 24 -85 166 48 2 -25 -59 274 122 -41 -124 -22 -85
6875 -85 -30 -166 -105 295 26 85 -240 -101 41 122 -190 105 -179 -130 57 -189 258 240 -266 -4 -155 -50
6897 -50 142 -93 -56 92 58 64 59 -120 15 -59 -120 46 -40 119 -46 4 2 -185 -174 -103 60 11 -56 -11 125 69
6923 69 -186 -168 122 112 -132 23 -87 64 114 55 38 -96 -30 -84 14 103 -56 48 -121 -15 208 -186 -63
6946 -63 16 -52 -144 20 57 -65 18 -139 142 -48 21 -34 -65 -139 4 -119 -65 112 -82 -14 61 30 133 77 -87
6971 -87 123 42 -155 -6 -182 9 18 259 23 -42 175 -9 150 -4 62 185 4 31 208 -76 -72 -74 -47 183
6995 183 124 42 275 38 75 57 96 -116 -22 4 13 -14 -32 65 7 -269 -288 -251 -71 -64 -111 30 0 -185 39 -52 -52
$$ packed form
6826A02r9J95j97j3J29ko6J73k66J25r2Pj70L5Q7J9M5P1J9m3k44O7J24Q7j94j47
6852b48K13L8j90n4K50o3J23J73r3k30J05j09K51j18m6k7l4L33j52j63q3J02o3
6875h5N5j36O1M00k69N9l25J39J42Q1l12K95k84M9J87k46M47j8n06K62j51J05
6897e0J92k35L7J48l4Onj79J35p4o1J66q6J59j65N0kj87J1P1J63m9o7M5J36n6
6923F9k55J8K90j0k44J55j10J51N0n9j7j34O6n4R8Q9j59J04j69J06K23l94J23
6946f3P9o8r2J64L7j22Q3j57K81j90O9n5l1p4J43j23N4J77j94O8P5l1J03n6j64
6971h7K10q1j97J49j76J91RK41k36o5K17j84J59j54O6J23j81K7J77k84MkK7K30
6995A83n9q2K33k37L7j8L9k12R4K6Rk7j8R7n8k76j9L7J80Pm7J41l0j85K24r1%
$$ plain form
7022 -52 -91 -64 -89 101 -55 5 88 -4 -142 -189 -18 -118 42 -56 84 262 2 -5 -91 32 73 -5 76 -21 -41 38
7048 38 152 99 -65 -55 119 53 -44 -272 52 -195 111 -62 -55 170 60 -71 -38 -93 75 -42 77 -194 -19
7071 -19 -124 -117 -10 -229 127 97 196 48 -308 8 241 -175 38 -66 201 99 371 78 84 -75 315 -25
7093 -25 -57 28 -266 140 -164 -164 -81 -16 -142 -147 -59 26 -146 -50 7 -8 107 -80 -138 133 -32 10 23 218 123 131 7
7120 7 -109 56 -6 -81 -87 -130 163 30 140 53 -32 64 48 104 -100 -108 -23 -67 73 -20 -46 40 -171 -32 -64 1 104
7147 104 -14 -11 35 231 26 60 -79 -176 42 -141 23 -111 -287 68 57 -65 216 -42 -20 208 44 -201
7169 -201 -252 -162 220 226 31 -19 14 145 -58 180 -93 203 -194 -128 94 75 -27 -31 -7 74 107 20 39 66 -220
7194 -220 132 143 -105 -158 72 -20 -40 25 -173 105 93 -42 -124 -2 -107 278 -96 92 -172 -202 -118 -10 -70
$$ packed form
7022e2l9K7k5J90j56O0Q3r2j38m7J71j00J60r8J40J78k60pq6J23M1p8Q1r7k0P9
7048C8J14n3j64J0J74o6r7k28L24k47L06j73PK25j10j31L3n5J68j17J19k71J75
7071a9j05PJ07k19L56l0R9j48l56L16K33m16K13j04K67j02K72k93Oj59L90l40
7093b5l2Q5k94M06l04%Q3O5j26nQ8Q5j72R6N7j5J15j87n8K71j65M2J3J95r5Qj24
7120Gj16J65o2p5om3K93j33J10q7q5R6j6N6k04qQ5m4J40r3k6Q6k11J39l2O5J03
7147A04j18LM6J96k05L4j39r7K18j83J64j34j76L55j1j22K81k58K2K28j64k45
7169b01n1R0L82Oj95n0L3J31k03K38k73K96l97O6K22j9j02mK4Q1L3q7J9K7k86
7194b20L52J1k48n3K30r2k0O5j98K78j2j35q2J22j05L85l74J88k64l0Q4J08o0
$$ plain form
7217 -70 129 9 -125 -55 -162 103 -152 -20 98 -122 4 189 -76 -238 -19 -75 24 39 44 92 45 -141 72
7240 72 -41 76 -155 88 90 -98 28 246 -17 13 -13 -130 97 41 51 13 0 -321 -128 34 -80 5 13 -108
7264 -108 48 -269 31 164 29 -90 51 54 -170 11 -106 -110 -50 159 -47 -5 -5 -42 -229 25 19 208 135 -63
7288 -63 46 155 116 11 -157 -204 -325 -45 -12 -14 37 104 1 -15 -142 106 -15 149 129 -111 -42 -67 241 104
7312 104 24 -30 -138 86 -69 -52 14 -87 -407 115 142 -70 76 43 -216 -166 -29 2 -52 -169 198 -116 41
7335 41 -27 -145 -79 -54 -7 -156 29 -95 117 -254 5 -60 36 -87 -244 -64 212 163 -29 46 -145 -274 -3
7358 -3 -146 -5 188 13 -154 -78 104 142 -215 -52 -169 -68 43 -167 197 57 220 -17 58 -24 -222 123
7380 123 -117 -30 -123 -52 207 -154 71 -37 85 -126 -132 162 8 -25 34 -233 -79 -57 -6 166 -245 18 -158
$$ packed form
7217g0J99j20j34P0j07K65k55J32J18k20J26J85k65j62K19n6R9J5NM8m7j86K13
7240G2j13J17k31K43Kj88J26K18k63L0k6j17K27n6J0l8j3l21J93J62j14Q5Qj21
7264a08J56l17L00J33j35j19J41Lk24J81j17mO0K09k06M2%l7j87K54oJ89p3j98
7288f3J09J09l9j05j68m7j21K80L3kN1O7j03j6j27K48j21J64k0k40O9k5L08j37
7312A04q0n4j08K24j55J7O6j01l20N22K7k12J46l3k59N0J37L1n4j17L67l14J57
7335D1o8j18O6K5M7j49J85j24K12l71K59o5R6j23j57J80K76m9j92P5j91j29K71
7358cj43J41J93j75j67P6J82L8l57J63j17J01J11k10L64j40J63k37P5q2j98L45
7380A23k40Q7r3P1K59l61K25j08J22k11oK94j54l3N9k67J54K2N1J72m11K63j76
$$ plain form
7403 -158 -8 47 -1 124 58 104 -105 -134 106 -59 199 72 11 291 20 29 -93 84 -203 77 92 -94 3
7426 3 182 -85 64 -145 -86 151 -112 -37 -78 344 164 116 -11 -59 86 -17 -62 165 169 62 -65 20 -283 -80
7450 -80 46 -170 -59 157 21 -24 234 -305 176 33 147 9 27 -66 148 137 -105 128 3 -213 -16 -213
7472 -213 -87 -41 169 -4 40 -198 -366 -52 -180 95 33 79 98 -44 -14 55 152 -110 -141 -87 175 66 180
7495 180 -133 17 100 83 100 -264 66 -55 -29 -95 -119 -44 -29 0 123 36 -92 179 -12 -80 8 -49 105 89 -68
7520 -68 -27 38 -85 48 51 -71 -37 -34 80 -83 -233 187 -21 -36 -78 -170 -8 -125 53 239 27 34 152 16
7544 16 24 94 -2 155 71 -47 -8 220 331 22 47 -75 -43 5 -22 -145 -23 160 -151 -148 60 114 145 -236 -6
7569 -6 -148 -86 -201 -140 -316 46 395 34 213 195 89 -58 -46 171 9 -129 -98 158 -68 87 13 322 -10
$$ packed form
7403a58J50N5m8J25o6M6k09k9K40j65K58j27o1K80k71Rj22J77k87K80J5j86R7
7426CJ79k67J49k09N9K37k63P5m1M22j80m8j27m8J45j03m5K27Mj07j27Q5l03K03
7450h0J26k16J11K16j36m5K58n39M81j43J14j38J8r3K14j1k42K33j25k16J97j97
7472b13J26M6K10j73M4k38j68L14j28K75o2M6J9j42L0O9R7k62l1N4K62j09J14
7495A80l13J50Q3j7J7l64L30j21K6o6k4P5J5K9J23q7j28K71j91o8Q8n7J54j6j57
7520f8M1O5j23J33Lj22L4LJ14j63j50M20k08j5m2r2J62j17J78J86k12PJ18j36
7544A6QP0r6J57q4j18L9K28J11l09K5j22L2M8k7j23J22J83l11LK08N4L1l81K30
7569fj42O2j15O1j76L62L49l61J79j8j06j47J2K17j62j38L1K56k26J55p4L09l32
$$ plain form
7592 -10 16 183 53 -58 17 -37 137 13 -255 -73 -35 -238 71 -158 -124 -70 6 -126 77 180 -100 162 77
7615 77 83 -204 -94 172 106 -121 -115 -173 36 -134 -129 144 24 -9 -142 116 40 -46 21 -268 116 157 -107 96 -170
7640 -170 -93 -116 -24 -20 165 -7 -54 -71 139 40 188 69 66 -109 25 -23 -3 148 -164 14 219 -101 138 288
7664 288 102 131 -2 92 -9 -46 55 -64 -38 -110 74 -88 107 85 176 -154 -105 -30 132 122 -21 -68 133 201
7688 201 -13 175 129 -347 -329 -76 -24 -23 29 -74 -81 250 -100 129 -129 -99 -62 -115 -266 43 34 118 44 -316 -33
7713 -33 141 118 -209 70 73 299 -7 -106 -129 -134 123 -131 297 183 138 -84 -138 54 138 -55 114 -244 -79 -50
7737 -50 54 -39 -137 -61 -11 -114 156 230 -19 -151 -124 -99 -67 199 -51 164 -270 -25 325 160 80 -63 48
7760 48 -145 -62 189 -3 -150 20 -89 -30 82 133 41 -34 199 13 31 -155 5 78 -101 -60 -160 38 171
$$ packed form
7592a0K6J67j30j11P5n4J74j24k68J82L8k03L09k29L4N4P6j32K03J03k80K62q5
7615G7Ok87J10K66o6k27On8K09j70NK73j20l3j33K58p6q6O7k89L84M1k64K03k66
7640a70P7k3R2MJ85j72m7j7K10r9J48j19lj75J34m8K0J51l12J78K05l20K39J50
7664B88j86K9j33R4j01l7J01j19K6p2J84j62J95k2R1l30M9P5J62j0j43m7K01O8
7688B01k14J88m6m76J8K53N2JN2j03pL31l50K29k58L0L7n3j51L09rQ4p4l60K83
7713c3J74k3l27K79LK26l06r9k3nK57k54M28j14m5k22n4J92Q4j93J69l58J65K9
7737e0J04r3r8P6N0j03K70P4k49j32K7K5L2K66k50K15m34K45L50j65q0j43J11
7760D8j93Q3K51j92j47J70j09N9J12N1r2p5K33j86J8j86J60P3j79M1j00J98J33
$$ plain form
7783 171 -124 105 58 342 -21 -32 -109 -93 -84 -76 207 -6 -164 -110 24 36 -186 -199 15 73 -187 -245 -160 240 115
7808 115 -38 -315 -136 -44 56 -42 144 139 -76 -93 -117 200 -59 -17 0 10 184 -152 -8 -24 -32 39 14 -92 134
7833 134 39 -208 -81 -123 51 11 -34 63 -145 -92 89 56 -123 -53 124 -240 34 118 -156 -124 96 37 -5 9
7857 9 -38 -64 -194 -138 -225 61 -45 -53 -15 -8 59 -179 -16 104 -22 -44 215 -40 -111 92 242 256 48 135 45 277
7883 277 1 129 -286 -177 -233 -42 52 121 -1 -76 29 -146 50 99 -81 -152 5 -167 11 -15 356 -173
7905 -173 -106 62 -154 43 155 191 -168 77 -217 -81 139 -111 -107 -142 90 198 57 -198 -64 -84 15 -52 20
7928 20 9 -131 26 96 92 -84 -143 -37 -74 149 -34 222 126 19 15 228 -15 195 -39 -80 100 0 -151 250
7952 250 133 67 -24 -20 119 215 72 -2 163 4 -105 -155 151 197 68 -115 -3 -140 -338 -110 125 135 -19
$$ packed form
7783A71k95K29m7K84l63j1p7J6RQK83k13j58N4J34J2k22j3K14N8k60n8Q5M00j25
7808A15j53k77J79R2J00r8J86nk15j7k4L17k59M2J7J0J74l36J44j6qP1k5j06K26
7833A34r5k47J27m2J74m0m5R7k08N3J81l3j79P0J77l64K74Q4k74L2K20n9m2J4
7857Im7k6j30N6q7K86j06qL8PO7k38J63J20j26k2K59k55p1K03J50J4k08Q7r0K32
7883B77k76J28m15J09n6J91R4O9j22p5J05j75J96M9j80p1J57j72J78k6L71n29
7905a73O7J68k16J97J12L6l59K45k94J36K20k50Ml5K32J08j41k55J34k0R9o7P2
7928B0j1j40J57P0mj76n9J06l7K23j83K56r6j07mK13k43K10k34m1J80j00j51M01
7952B50j17o6r1MJ39R6j43p4J65j59j09n0L06M6j29j83J12j37j98K28K35J0j54
$$ plain form
7975 -19 -3 -98 40 79 47 -109 -172 225 -21 -97 -256 -133 -55 266 -74 152 -5 156 72 104 -60 8 178 -57
7999 -57 -160 -47 79 -165 -122 305 216 73 29 38 104 8 26 -28 -76 -48 206 197 -138 -116 -66 71 -154 -9 -28 -36
8025 -36 -193 129 107 -73 174 -64 -2 -21 -18 30 -205 166 -20 70 -64 -67 6 -76 181 -141 116 57 5 14 -51 100
8051 100 -124 -45 21 -172 105 -129 -35 -216 5 126 35 42 43 -247 -34 -43 -67 56 -12 222 96 -311 135 262
8075 262 -45 63 120 -186 33 82 -28 12 116 44 55 190 73 21 54 144 -253 56 126 -131 160 55 -36
8098 -36 88 -175 -163 -174 2 -46 -194 -109 27 -136 61 -44 45 -72 -164 153 -88 -21 -195 -175 -26 -180 -181 109
8122 109 25 335 -18 52 53 41 100 101 28 262 62 108 -53 39 129 -151 43 153 52 92 156 -186 58 -62 -45
8147 -45 -77 146 94 151 -150 -35 6 -16 -49 -49 -158 -42 138 -149 49 125 293 -172 89 -147 -61 -105 -66 5 132
$$ packed form
7975a9J6r5J38L9l2j56o3L97k46p6j59J23P8L21l40K26j57J61q4L2j64O8J70k35
7999e7j03J13J26k44M3M27q9j43m4RO6r6J8n4m8K8K54rl35K2N0J37k25J45j9q
8025c6j57L22k2j80K47k38O2j9LM8k35L71j86R0j34lP3q2K57l22K57n9n2Ro5J51
8051A00k24P9O6j93K77k34R4j81K21J21r1PJk90K13rk4J23o8K34j26m07M46J27
8075B62l07J08N7l06K19M9j10M0J04p2J1J35j17n2L3R0l97L09P0k57K91j05r1
8098c6J24k63J2j1J76m8j48Q5J36j63J97j05Q9j17r2L17k41O7j74K0J49j54jK90
8122A09q4L10l53P0Jj2N9Jp3K34k00M6j61R2R0k80J94J10j01M0O4l42K44j20J7
8147d5l2K23n2N7l01J15M1k2l3%j09J16J80k87J98P6J68m65K61k36Q6m4L9P1J27
$$ plain form
8172 132 -104 65 -128 92 133 -201 -143 186 99 111 92 -74 -75 -20 -123 21 -20 143 4
$$ packed form
8172A32k36J69j93K20M1l34N8L29q7J2j9j66jN5j03J44m1J63j39
8191D
$$ Imaginary data points
##PAGE= N=2
##DATA TABLE= (X++(I..I)), XYDATA
$$ plain form
0 0 0 0 0 0 0 0 0 0 0 0 0 0 0 0 0 -3 8 -8 8 -8 8 -14 16 -16 22 -24 25 -32 35 -40 48 -54 61 -69 78 -86 97
37 97 -109 122 -135 151 -167 184 -203 226 -250 274 -303 333 -367 404 -445 491 -543 601 -667 740
57 740 -827 932 -1053 1200 -1389 1627 -1948 2403 -3093 4264 -6607 13100 -67992 -210759
71 -210759 20754 166752 15183 -111834 -1699 77769 1203 -53559 -1454 28581 22436
82 22436 26209 -3628 -67096 -31994 76428 69665 -51099 -71866 20668 42545 -21026 -24505
94 -24505 19625 11032 -20409 -10537 -6117 -17696 15688 50603 -6297 -69920 -16389 62603 30497
107 30497 -34493 -15678 23191 3669 -15270 6650 16367 3025 5919 1733 -27559 -17292 38138
120 38138 33814 -35044 -39832 23775 21120 -33549 -10931 44770 3025 -59748 -9973 54645 5244
$$ packed form
0@%%%%%%%%%%%%%%%lJ1j6J6j6J6k2L0l2L8m6M9n7O7p5Q8j02J15j30J47j64J83
37I7k06K31k57K86l18L51l87M29m76N24n77O36p00P71q49R36j034J144j268J407
57G40j567J759j985K253k589L016l575M351n496P357j0871J9707q1092j42767
71b10759K31513J45998j51569j27017J10135P9468p6566n4762N2105L0035o145
82B2436L773k9837o3468L5102J08422o763j20764k0767R2534K1877o3571l479
94b4505M4130q593l1441R872M420j1579L3384L4915n6900o3623N3531P8992l2106
107C0497o4990J8815L8869j9522j8939K1920R717j3342K894m186k9292J0267N5430
120C8138m324o8858m788O3607k655n4669K2618N5701m1745o2773M9775O4618m9401
$$ plain form
133 5244 -48861 6035 48356 -14607 -52213 15201 56321 246 -37579 -1946 20636 1164
145 1164 -1534 10889 -1885 -12001 5854 7104 -16135 -6348 26069 8608 -35082 -19863 25982
158 25982 16108 -21058 -10396 14638 -2540 -18701 4727 19110 -2750 -11118 4907 4592 -7908
171 -7908 3320 17111 1856 -13117 -418 9180 -976 -1542 9542 2064 -13494 -3932 9719
184 9719 -308 -7965 5354 4709 -16579 -11145 16744 10674 -18874 -9986 18212 4906 -22808
197 -22808 -4094 26580 9212 -21841 -10186 16464 11385 -5708 -3386 4052 2285 686 665 -3776
211 -3776 -1257 9960 5101 -15093 -12827 12257 14335 -10865 -15788 5272 8694 -7522 -7167 6558
225 6558 4196 -5961 -2335 3178 -1930 -880 8998 5071 -8890 -5477 9577 8564 -3708 -3818
$$ packed form
133E244n4105N4896M2321o2963l7606O7414M1120n6075l7825L5633K2582j9472
145A164k698J2423j2774j0116J7855J250k3239R787L2417j7461m3690J5219M5845
158B5982r874l7166J0662K5034j7178j6161K3428J4383k1860q368J6025l15j2500
171g908J1228J3791j5255j4973J2699R598j0156n66J1084p478j5558R562J3651
184I719j0027p657J3319o45k1288N434K7889o070k9548Q888K8198j3306k7714
197b2808J8714L0674j7368l1053J1655K6650n079j7093K322P438j767j599k1m441
211c776K519J1217m859k0194K266K5084K078k5200m923K1060L422j6216L55J3725
225F558k362j0157L626N513n108J050R878l927j3961L413J5054j013j2272j10
$$ plain form
239 -3818 3711 2463 -2652 -307 1818 -593 670 1895 -5134 -7926 3377 9604 -3797 -12473 31
254 31 9034 -1662 -8244 2162 6829 -2495 -5995 2227 4895 405 414 2582 -963 -2390 3464 4987
270 4987 -639 -2905 1659 1457 -2663 -670 2964 9 -3968 -760 1009 -3201 -2442 3347 1525 -6403
286 -6403 -4262 4692 3396 -4134 -2302 4374 1903 -3604 -827 4439 2656 -717 -476 335 493 1839
302 1839 2307 -1032 -2597 731 1860 -1983 -2650 1806 2096 -3406 -4254 910 1947 -2013 -1590 797
318 797 -701 -2267 372 2322 -205 -1016 1574 1359 -967 -47 2873 1856 -845 -800 1144 787 39
335 39 815 269 -1447 -1179 699 -148 -1696 -578 434 -1286 -2835 -397 1682 -586 -2061 -173 913
352 913 -323 -334 1089 1238 34 -113 860 554 585 1503 832 -392 -350 829 768 -462 -639 86 -416 -1321
$$ packed form
239c818P529j248n115K345K125k411J263J225p029k792J1303O227j3401q676J2504
254C1R003j0696o582J0406M667r324l500Q222K668m490RK168l545j427N854J523
270D987n626k266M564k02m120J993L634k955l977L208J769m210P59N789j822p928
286f403K141Q954j296p530J832O676k471n507K777N266j783l373K41Q11J58J346
302A839M68l339j565L328J129l843o67M456K90n502q48N164J037l960M23K387
318G97j498j566K639J950k527q11K590k15k326R20K920j017k701M5J944l57p48
335C9P76n46j716K68J878q47j548J118J012j720j549K438K079k268j475J888J086
352I13j236j1J423J49j204j47R73l06L1R18o71j224M2J179o1j230j77P25n02r05
$$ plain form
372 -1321 -787 -10 -372 -994 -553 -900 -1218 -345 892 -188 -1562 -307 1211 671 -465 215 1359 1096
390 1096 109 -330 170 1834 1684 -444 -1595 -129 1836 1026 -1759 -1668 898 1176 -1380 -2262 -484
407 -484 1484 -98 -1803 -1572 232 981 273 -971 -958 670 1656 432 -667 64 1558 1565 -261 -908
425 -908 623 1870 728 -1185 -716 477 788 -447 -610 -711 -364 -64 -406 -355 -769 -501 233 67 -1071
444 -1071 -1066 375 1276 -7 -1101 -429 1062 1142 145 -125 44 565 1134 806 -611 -1090 796 2018 -391
463 -391 -2999 -980 2639 1395 -3153 -3164 1374 2904 -1139 -3521 -299 2645 865 -2124 -1523 1307
479 1307 1924 894 -888 -1161 726 2526 1106 -2000 -1603 1932 2957 -1111 -3026 4 3217 763
495 763 -2923 -1736 1693 1281 -1326 -2386 -154 998 -68 -724 -662 -326 322 778 69 -923 -100 1595
$$ packed form
372a321N34P77l62o22M41l47l18Q73J237j080j374J255J518n40j136O80J144k63
390A096r87m39N00J664j50k128j151J466J965q10k785R1K566K78k556q82J778
407d84J968j582j705K31J804P49p08j244J3J628R86j224j099P31J494Pj826o47
425i08J531J247j142j913M69J193L11j235j63j01L47L00l42N1m14K68P34j66j138
444a071NJ441R01j283j094O72J491Q0r97k70J69N21N69l28j417m79J886J222k409
463c91k608K019L619j244m548j1M538J530m043k382L222K944j780k989O01K830
479A307O17j030j782k73J887J800j420l106L97L535J025m068j915L030L213k454
495G63l686J187L429m12k607j060K232J152j066o56O2L36O48M56p09r92Q23J695
$$ plain form
513 1595 1641 -973 -1158 1257 1990 -604 -1328 790 1583 -916 -1202 718 975 -1443 -1434 1183 1324 -1946
531 -1946 -2236 1566 2005 -1589 -2677 877 2501 -466 -2180 25 1992 707 -253 -176 161 488 1061
548 1061 782 -1209 -829 1693 1809 -1390 -2558 615 2759 -331 -2967 -969 1764 997 -1924 -1704
564 -1704 354 1202 -257 -1074 -649 834 853 389 -660 -648 560 1417 604 -1159 -753 1700 1515 -803
582 -803 -1382 623 2034 -403 -2087 -166 1165 242 -1676 -327 1101 -378 -1281 81 644 -674
598 -674 -1073 407 959 -236 -1008 510 1035 29 -663 278 632 -24 188 90 -124 94 683 290 -878
617 -878 -886 773 915 -687 -1539 -50 1072 -29 -1055 -775 499 604 -194 -878 -525 400 728 -33 -683
636 -683 99 904 557 -288 -830 366 1139 689 -500 -759 797 1027 -341 -1198 -414 980 246 -1222
$$ packed form
513A595M6k614j85K415P33k594p24K118P93k499k86J920K57k418RK617J41l270
531a946k90L802M39l594j088L554J624k967j714K205J967j285r60P7L37L27N73
548A061k79j991L80K522J16l199j168L173K144l090k636J998K733p67k921K20
564a704K058Q48j459q17M25J483J9m64j049J2J208Q57q13j763M06K453j85k318
582h03n79K005J411k437j684J921J331r23j918J349J428j479r03J362N63j318
598f74l99J480N52j195p72J518N25j006o92R41L54o56K12r8k14K18N89l93j168
617h78qJ659J42j602q52J489J122j101j026K80J274J05p98o84L53R25L28p61o50
636f83P82Q05l47q45n42J196P73m50j189k59J556K30j368q57P84J394p34j468
$$ plain form
654 -1222 -844 465 774 -494 -713 180 400 -189 -518 -283 -78 275 316 107 -343 143 536 177 -245 -6
674 -6 503 293 11 -49 157 171 -259 102 -138 -120 -126 171 -188 -439 -155 -29 -154 -218 56 245 -86 -230 137
697 137 199 360 255 127 458 161 196 298 41 236 168 48 -93 212 -176 -185 -323 20 -51 -149 -409 -28 -58
720 -58 -279 -421 -75 -35 -176 -56 184 311 167 -223 198 293 243 180 107 75 72 201 -58 188 -3 13 -350 -79
744 -79 -52 240 -366 -258 30 -110 -292 -291 -206 38 -179 29 35 -224 219 200 17 -165 177 98 276 160 -23
767 -23 232 247 -119 35 73 -121 -148 17 5 -294 -252 3 99 -391 -295 76 -119 128 -76 -17 -8 148 -150 -75
791 -75 47 -53 -13 99 -67 -66 366 143 199 223 341 237 -214 -156 117 -63 117 73 -38 -120 -114 -47 -230 -296 -214
816 -214 374 -3 -71 156 63 145 -164 348 177 119 138 240 68 231 309 82 -19 -27 -198 -3 -127 -287 118
$$ packed form
654a222L78J309L09j268k19Q93K20n89l29K35K05L53M1k09m50M86L93l59m22K39
674fN09k10k82o0K06J4m30L61k40J8oK97l59k51K84J26j25o4K74J89l31j44L67
697A37O2J61j05j28L31k97L5J02k57J95o8j20j41L05l88rj38L43p1r8k60L81l0
720e8k21j42L46M0j41J20K40J27j44l90M21R5n0o3p3l2lJ29k59K46j91J6l63K71
744g9K7K92o06J08K88j40j82JQ5K44k17K08Ok59M43j9j83j82L42p9J78j16j83
767b3K55J5l66J54L8j94k7J65j2k99M2K55R6m90R6L71j95K47k04N9RJ56k98P5
791g5J22j00M0J12j66JM32k23N6K4J18j04m51N8K73j80J80m4j11q2OO7j83o6Q2
816b14N88l77o8K27r3Q2l09N12j71n8J9J02j72J63P8k27j01qj71J95j24j60M05
$$ plain form
839 118 -116 -98 -77 -249 -17 -280 24 -59 37 114 92 41 -185 -146 215 -30 143 69 106 94 79 -6 351 -81 205
864 205 -52 4 153 48 -72 14 -27 -21 77 -148 -68 -129 -40 -126 -114 125 -252 -1 191 110 210 97 48 24 93
889 93 86 57 230 169 -83 -339 179 -20 221 -83 -25 -101 -116 -38 -140 -73 163 -252 -292 -279 290 -33 -98 -256 -82
914 -82 2 -26 -8 -100 70 72 287 204 191 40 -2 -229 -91 53 272 0 147 -117 -446 -218 249 38 -488 -171
938 -171 186 76 -289 -133 324 172 117 86 175 14 7 145 231 -216 212 314 253 -367 -164 371 178 -7 -52
961 -52 209 -35 170 -12 -51 -117 -37 180 -42 -274 253 351 -129 -318 -242 76 -63 86 -42 -194 40 463
983 463 -189 -308 56 233 -32 -280 -19 67 47 -131 39 -123 21 -197 141 -259 -164 -145 274 -215 -253 -128
1005 -128 156 -56 -351 -24 174 324 -159 198 106 -149 -90 265 399 -252 73 342 177 -238 -61 128 123
$$ packed form
839A18k34J8K1j72K32k63L04q3R6P7k2n1k26L9L61k45J73p4L7j2j5q5L57m32K86
864B05k57N6J49j05j20Q6m1OR8k25Q0o1Q9q6J2K39l77K51J92q1J00j13m9k4O9
889I3pk9J73o1k52k56N18j99K41l04N8p6j5P8j02O7K36m15m0J3N69l23o5j58J74
914h2Q4k8J8r2J70KK15q3j3j51m2k27J38J44K19k72J47k64l29K28M67k11n26L17
938a71L57j10l65J56M57j52n5l1Q9j61pJ38Q6m47M28J02o1o20K03N35j93j85m5
961e2K61k44K05j82l9o6Q0K17k22k32N27R8m80j89P6L18j39J49j28j52K34M23
983D63o52j19L64J77k65k48K61Q6k0j78J70j62J44k18L38m00R5J9M19m89l8J25
1005a28K84k12k95L27J98J50m83L57r2k55N9L55J34o51L25K69j65m15J77J89n
$$ plain form
1026 123 -359 -155 99 -16 -40 27 -29 -114 130 213 -99 -38 65 14 94 111 -131 -9 220 84 169 -131 -32 281
1050 281 -51 -160 -91 225 -37 -316 18 111 -3 -263 47 305 -204 -196 86 -203 -341 -85 240 -97 -423
1071 -423 53 301 -38 -66 -47 208 39 26 134 -5 -225 206 241 205 48 -29 -75 -146 -59 78 67 9 -328 19
1095 19 249 -30 12 -55 -77 -4 98 85 7 187 44 81 126 -101 -20 341 -52 151 164 122 170 114 61 -193 12
1120 12 -11 197 -164 -124 -64 21 -97 -85 -192 13 94 -101 250 -126 50 230 339 -15 155 335 53 -108
1142 -108 105 1 191 -149 79 -53 -247 -152 325 -146 -45 -105 -224 57 -107 129 137 -231 -321 109 -63 20
1164 20 24 80 -331 -372 -77 161 -4 -165 181 -69 -346 -74 133 67 -47 -25 246 15 -239 -13 -71 -275 -224
1187 -224 50 -44 -164 -175 -12 155 -179 34 211 -193 -84 -77 251 -21 -29 3 -24 -199 -64 331 -220 -202 225
$$ packed form
1026A23m82K04K54j15k4O7n6q5K44Q3l12O1J03n1Q0J7k42J22K29j36Q5l00R9L13
1050B81l32j09O9L16k62k79L34R3j14k60L10K58n09QK82k89j38K56L25l37l26
1071d23M76K48l39k8J9K55j69j3J08j39k20M31L5l6j57p7m6p1Q7J37j1n8l37L47
1095A9K30k79M2o7k2P3J02j3p8J80j43L7M5k27Q1L61l93K03J3m2M8n6n3k54K05
1120A2k3K08l61M0O0Q5j18J2j07K05Q1j95L51l76J76J80J09l54J70J80k82j61
1142a08K13j04J90l40K28j32j94R5M77m71J01o0j19K81j64K36Ql68r0M30j72Q3
1164B0MN6m11m1K95K38j65j61L46k50k77K72K07o6j14K2K71k31k54K26n8k04N1
1187b24K74r4j20j1J63J67l34K13J77m04J09PL28k72qL2k7j75J35L95n51J8M27
$$ plain form
1210 225 212 -86 -248 76 89 -21 121 214 14 -193 -179 -23 -4 -97 -70 411 -65 54 100 -39 65 -176 112
1233 112 119 -113 6 73 -125 48 170 157 18 33 -1 33 -250 -6 101 65 11 34 -200 -194 -60 -127 111 -34
1257 -34 46 -119 -111 3 139 102 -25 72 -14 280 71 239 215 68 -188 15 326 -199 -98 21 -205 115 120
1280 120 -69 -235 -19 61 -63 -17 -121 84 -165 289 -208 30 132 93 -71 -67 99 -116 162 114 140 -176
1302 -176 73 88 -137 -10 171 -29 187 -23 255 -156 -7 129 48 -238 29 -30 -16 -265 74 152 -104 -30
1324 -30 -132 119 -119 -104 270 43 99 178 216 -139 -101 4 90 -23 -80 -75 12 28 -7 -132 -21 -145 152 -26
1348 -26 62 140 -196 -52 42 80 -23 -48 -20 12 255 -101 92 -101 105 132 131 29 -25 103 79 -38 289 -247
1372 -247 20 -38 -66 57 -40 8 141 -276 -213 116 -198 11 -29 58 64 185 -174 61 -277 -390 87 -25 25
$$ packed form
1210B25j3k98j62L24J3j10J42R3k00k07J4J56J9r3K7M81m76J19M6j39J04k41K88
1233A12Pk32J19O7j98J73J22j3j39J5l4L4k83K44J07l6n4K3k34OJ34o7K38j45
1257c4Q0j65QJ14J36l7j27R7q6K94k09J68k4j47k56K03L11n25J01J19k26L20N
1280A20j89j66K16Q0j24M6j04K05k49M54m97K38J02l9j64MJ66k15K78m8K6l16
1302a76K49J5k25J27J81k00K16k10K78m11J49J36q1k86K67n9J4k49L39P8k56P4
1324c0j02K51k38J5L74k27N6P9L8l55L8J05Q6j13n7NQ7J6l5j25J11j24K97j78
1348b6Q8P8l36J44R4L8j03k5K8L2K43l56J93j93K06K7jj02n4J28k4j17L27n36
1372b47K67n8k8J23r7M8J33m17O3L29l14K09m0Q7OJ21l59K35l38j13M77j12N0
$$ plain form
1395 25 -129 75 96 121 280 -226 -192 206 -154 -11 -44 -32 115 145 96 -92 -207 -226 -1 3 -84 29 -164 61
1419 61 49 -10 -4 -154 -10 120 -12 72 148 -16 -81 246 105 -58 4 -155 66 -163 -38 58 -37 66 -100 -126
1443 -126 33 180 -20 4 -12 30 93 -131 107 88 60 43 -151 40 172 -76 86 -76 24 58 -14 88 152
1466 152 55 -50 206 -19 -179 12 29 132 -82 33 39 22 -137 115 48 22 -38 -333 -56 -53 364 -137 134
1489 134 4 -56 219 6 164 116 118 -141 -85 -17 -138 49 -153 127 -97 -22 58 25 -194 82 228 -95 -124
1512 -124 -287 -38 77 49 149 70 -66 40 -164 177 -40 46 217 -21 47 72 -283 -76 170 -52 83 67
1534 67 93 53 118 -13 -50 -43 -91 154 -128 171 -137 -81 -59 -89 33 -194 -2 52 154 125 60 -192 -329 -37 72
1559 72 62 -54 -9 -122 -205 -8 134 -246 -67 -67 194 46 30 141 227 -91 -71 77 -97 13 -274 -162 133
$$ packed form
1395B5j54K04K1K5J59n06L4L98l60J43l3J2J47L0m9j88j15j9K25Mq7J13j93K25
1419F1j2n9Oj50J44J30j32Q4P6j64o5L27j41j63O2j59K21k29J25R6r5J03j66k6
1443a26J59J47k00K4j6M2O3k24K38j9k8j7j94J91J32k48J62j62J00L4p2J02O4
1466A52r7j05K56k25j60J91J7J03k14J15Oj7j59K52o7k6o0k95K77LM17n01K71
1489A34j30o0K75k13J58m8Kk59N6O8j21J87k02K80k24P5Q0l3k19K76J46l23k9
1512a24j63K49J15k8J00p9j36J06k04L41k17Q6J71k38O8K5l55K07K46k22J35j6
1534F7K6m0O5j31l7Pm8K45k82K99l08N6K2l0J22k27J92N4J02k9o5k52j37K92J09
1559G2j0j16M5j13q3J97J42l80J79%K61j48j6J11Q6l18K0J48j74J10k87J12K95
$$ plain form
1582 133 -43 26 54 39 -202 161 -174 -110 -22 -96 24 -46 -95 41 -184 -41 52 55 78 14 -176 -107 17 34 -190
1607 -190 215 -121 -133 -16 51 -148 124 20 74 43 -112 -218 32 24 -75 -159 16 -55 -34 77 -65 129 -69
1630 -69 -6 78 106 -140 231 50 199 -176 17 144 -95 -63 -199 -82 79 -69 28 -57 87 -221 102 119 114
1653 114 228 41 -53 -32 15 52 -87 -97 78 -8 -4 -137 95 74 130 0 -125 22 -29 102 -20 29 30 -92 -139
1678 -139 128 185 13 -92 -85 49 51 -40 -27 131 155 110 -237 104 -180 -72 52 63 152 -258 127 28 -110 96
1702 96 221 75 11 -65 -144 33 -9 59 132 134 -42 -31 193 193 -65 -259 57 153 -197 316 -126 117 219 85
1726 85 -23 34 -86 -11 41 120 -84 28 204 161 192 -36 249 -7 -72 -129 -250 -129 123 107 -76 -31 -138 -76
1750 -76 111 -306 82 -86 114 81 -13 -160 21 138 -247 -29 125 -55 -44 -157 -36 -91 -181 -94 -135 80 -62
$$ packed form
1582A33j76O9K8j5k41L63l35O4Q8p4J20p0m9J36k25J43R3LK3o4j90O9J24J7k24
1607a90M05l36j2J17O7j99K72j04N4l1j55j06K50qr9q4J75p1K1J11j42J94j98
1630f9O3Q4K8k46L71j81J49l75J93J27k39L2j36J17J61j48R7q5J44l08L23J7n
1653A14J14j87r4K1M7L7j39j0J75q6Mj33K32k1N6j30j25J47n1J31j22M9Jj22m7
1678a39K67N7j72j05PJ34Kr1J3J58K4m5l47L41k84J08J24J1Q9m10L85r9j38K06
1702I6J25j46o4p6p9J77m2O8P3Kj76J1K24%k58j94L16R6l50N13m42K43J02j34
1726H5j08N7j20P5N2P9k04J12J76m3L1k28K85k56o5n7j21J21K52j6j83M5j07O2
1750g6J87m17L88j68K00l3r4j47J81J17l85K18J54j80J1j13J21n5r0Q7m1K15j42
$$ plain form
1773 -62 -240 -184 -8 56 -230 256 152 -222 108 18 -163 49 242 93 -45 -131 -117 -206 -158 67 -1 -95 -56 89
1797 89 -9 -99 -177 45 -40 35 -129 307 -323 -131 -185 -138 -58 -27 -68 -23 -79 -90 -23 63 79 -4 93 -205 130 -30
1823 -30 77 27 16 168 27 -188 -50 -133 246 252 38 -8 201 166 170 40 100 201 125 59 -186 -23 -199 -50
1847 -50 34 -37 121 -84 -82 329 -202 -88 -18 -170 68 62 -88 168 -132 51 -193 165 252 191 72 -60 316
1870 316 -273 143 -52 135 -146 44 -16 -32 48 -8 214 41 -40 56 20 -86 -177 -125 -102 188 -90 -32 -127 -45
1894 -45 61 121 -76 -226 -4 48 -435 111 16 206 25 -36 -306 -70 -37 107 -99 67 215 190 -134 -17
1916 -17 31 75 -77 -202 120 327 -35 -210 130 -114 27 -145 -14 -69 21 73 4 -1 -252 19 -92 -200 102
1939 102 162 217 -92 -48 -174 -59 70 13 122 130 91 -41 -26 96 -52 155 -112 -116 32 71 -186 70 19 -99
$$ packed form
1773f2j78N6J76O4k86M86j04l74L30r0j81K12J93j49j38q6J4q9M8K25o8r4L9J45
1797H9r8r0p8K22q5P5j64M36o30J92n4M7Q0L1m1M5n6j1O7Q6J6q3R7k98L35j60
1823c0J07n0j1J52j41k15J38q3L79Ok14m6K09l5Mj30O0J01p6o6k45J63j76J49
1847e0Q4p1J58k05KM11n31J14P0j52K38oj50K56l00J83k44L58Q7o1j19j32L76
1870C16n89M16j95J87k81J90o0j6Q0n6K22j73q1R6l6j06r1N2K3K90k78N8r5Q2
1894d5J06O0j97j50K22N2m83N46r5J90j81o1k70K36L3J44k06J66J48k5l24J17
1916a7M8M4j52j25L22K07l62j75L40k44J41j72J31n5R0N2o9nk51K71j11j08L02
1939A02O0N5l09M4j26J15J29n7J09Ql9j32J5J22j48K07k67mJ48L9k57K56n1j18
$$ plain form
1963 -99 -107 161 204 -66 -70 -92 -159 14 -63 -63 -105 89 215 -83 234 -146 24 -50 -125 -33 -70 -18 -73 46 45 -99 108
1990 108 91 -116 -74 -142 -36 -157 -118 2 111 164 111 -61 13 -115 -80 -84 -202 21 173 -49 -61 0 -121 6
2014 6 32 49 -17 -59 39 78 -67 -49 -134 -40 -88 -3 -174 -183 -115 -141 -6 19 179 175 -300 196 19 159 2 -110 -78
2041 -78 121 -19 -141 43 59 -12 50 -50 -10 -52 39 93 3 -79 -14 -24 13 -58 157 76 26 123 -131 -148 103 -306
2067 -306 -184 110 87 -205 -79 159 -183 -125 86 175 -78 18 -43 144 26 -43 80 14 58 7 -118 21 3
2090 3 84 70 125 55 104 24 4 349 -98 -212 65 26 59 82 96 66 289 -187 -11 -315 203 167 127 4 250
2115 250 -140 105 -84 214 -144 58 63 -103 110 64 -82 -92 -197 41 -106 -58 -9 -42 -19 239 61 48 1
2138 1 64 -238 -40 -148 55 82 -174 177 119 76 -149 21 179 56 69 67 -87 -144 -75 75 11 21 -136 -55 75
$$ packed form
1963i9qK68M3k70mk2o7J73p7%m2J94J26k98L17l80J70p4p5R2l7N2n5J19jj44K07
1990A08j7k07M2o8J06j21L9J20J09N3n3j72P4j28L5mj18K23J52k22j2O1j21J27
2014FK6J7o6m2R8L9j45J8q5R4m8Q5j71rO8k6J35K5J60mm75M96j77J40j57j12L2
2041g8J99j40j22J84J6p1O2j00M0m2R1N4r0q2O5j0L7p1K15q1n0R7k54j7K51m09
2067c06J22K94k3k92J26K38l42N8K11Q9k53R6o1J87j18o9J23o6M4n1j25J39j8
2090CQ1j4N5p0M9q0k0L45m47j14K77l9L3K3J4l0K23m76J76l04N18l6m0j23K46
2115B50l90K45j89K98l58K02Nj66K13m6j46j0j05K38j47M8M9l3K3K58j78j3m7
2138AO3l02J98j08K03K7k56L51n8m3k25J70J58j23J3kj54n7O9J50o4J0j57Q1J30
$$ plain form
2163 75 126 0 -62 35 -6 -127 -209 61 -94 -113 39 -132 -232 -17 -3 -174 21 30 268 -327 127 -179 220
2186 220 49 162 50 95 -49 -45 64 112 27 141 78 39 -30 65 -113 -267 -103 -148 108 18 -46 25 129 -28
2210 -28 -39 27 -251 -136 -87 -213 -32 102 137 9 16 -3 -156 -156 -99 -41 103 -271 -217 117 -11 -45 -4 38 -34 -225
2236 -225 1 42 229 -251 0 72 -212 119 -28 153 -13 25 12 -75 20 181 -97 155 81 -59 -102 -280 30
2259 30 36 -93 49 -110 -28 119 111 70 -39 -3 31 -61 71 -142 -137 -195 49 -105 177 -83 -108 10 58 24 65 205
2285 205 -41 27 4 -205 -248 -99 61 46 201 -29 15 201 -90 169 39 -111 -66 80 -256 124 2 -21
2307 -21 72 -97 -42 32 373 -22 -82 -37 -119 -40 198 97 43 -14 49 -98 -107 53 126 281 137 44 161 132 -24
2332 -24 96 -89 37 -17 -40 -170 51 -11 75 0 -150 25 -43 -55 73 -180 -161 139 150 -104 -140 -39 55 -105
$$ packed form
2163G5N1j26o2R7m1j21q2K70j55j9J52j71j00K15J4j71J95RK38n95M54l06L99
2186B20j71J13j12M5j44MJ09M8q5J14o3l9o9R5j78j54J64m5K56r0o4P1J04j57
2210b8j1O6k78J15M9j26J81J34L5j28Pj9j53%N7N8J44l74N4L34j28l4M1M2p2j91
2236b25K26M1J87m80K51P2k84L31j47J81j66L8j3q7R5J61k78K52p4j40m3j78L10
2259C0Oj29J42j59Q2J47qm1j09L6L4r2J32k13Nn8K44j54K82k60k5J18M8l4M1J40
2285B05k46O8k3k09m3J49J60j5J55k30M4J86k91K59j30j50M5J46l36L80j22k3
2307b1R3j69N5P4L41l95o0M5q2P9K38j01n4n7O3j47rJ60P3J55j44r3J17k9j56
2332b4J20j85J26n4k3j30K21o2Q6p5j50J75o8j2J28k53J9L00J1k54l6J01R4j60
$$ plain form
2356 -105 150 44 -219 168 -8 150 -77 98 161 65 -114 153 -27 75 159 -21 39 167 -49 -17 62 46
2378 46 -47 -38 -177 -53 -49 75 -129 -157 71 134 -114 -29 1 -17 119 128 143 -179 -91 -70 34 -45 -256 65 -50 241
2404 241 25 -100 160 -104 109 -69 91 68 147 -124 15 -94 -2 72 109 91 89 22 161 -131 89 219 -94
2427 -94 -22 96 -70 98 5 -143 284 62 -120 167 -127 8 127 80 74 -40 101 -27 -176 -133 -32 186
2449 186 -20 -154 62 23 -36 324 71 -160 -167 59 30 -147 -23 12 -96 132 -173 20 -43 -199 -24 -61 315
2472 315 54 3 -45 -83 -118 3 -117 99 106 113 136 -207 96 -99 97 -128 -190 126 -72 35 -12 -125 -131 91
2496 91 209 -103 71 108 31 11 24 -52 -34 -43 -11 -194 37 -50 120 57 24 -106 105 72 54 31 111 39 -18 16 95
2523 95 243 51 207 84 159 -118 -3 17 41 -171 -70 151 -246 96 -71 -100 -9 -81 97 121 -174 -86 87
$$ packed form
2356a05K55j06k63L87j76J58k27J75O3r6j79K67j80J02Q4j80O0J28k16L2P9j6
2378D6r3Rj39J24MJ24k04k8K28O3k48Q5L0j8J36RJ5l22Q8K1J04p9k11L21j15K91
2404B41k16j25K60k64K13j78J60k3P9k71J39j09R2P4L7j8ko7J39k92K20J30l13
2427i4P2J18j66J68r3j48M27k22j82K87k94J35J19m7oj14J41j28j49M3J01K18
2449A86k06j34K16l9n9L60k53k31pK26k9j77J24L5j08K28l05J93o3j56J75l7L76
2472C15k61n1m8l8l5J21j20K16PPK3l43L03j95J96k25o2L16j98J07m7j13oK22
2496I1J18l12J74L7p7k0J3p6J8rL2j83K31q7J70o3l3j30K11l3j8k3Q0p2n7L4P9
2523I5J48j92J56j23P5k77J15K0K4k12J01K21l97L42j67k9R1p2J78K4k95Q8J73
$$ plain form
2546 87 -126 280 38 -16 -7 86 33 -145 -26 104 301 4 -162 -172 166 3 20 -131 80 -63 108 -117 -148
2569 -148 20 55 63 164 53 -62 -47 14 248 33 77 -39 262 95 11 88 -119 31 136 195 -196 11 78
2592 78 9 -104 4 -16 107 103 -10 35 239 -78 156 207 25 -19 -35 -54 77 54 189 -114 -66 113 -79 -133
2616 -133 -138 236 -179 -71 245 14 -130 -11 169 4 -108 27 86 80 -308 90 -33 -241 100 191 29 -150
2638 -150 -148 -111 -175 -39 37 215 -6 98 -108 -34 -238 139 59 -2 -183 -179 92 -18 -165 96 -114 162 -64
2661 -64 -151 139 -55 152 -16 117 -44 14 -101 -171 110 119 -31 195 73 -220 -50 -71 -74 -5 -41 -11 -145 -65
2685 -65 1 104 172 84 -154 -77 -18 6 -219 -70 54 94 -40 176 -119 -182 25 -16 -87 -90 -105 -9 86 59 58 -113
2711 -113 -102 -136 -33 90 145 49 -34 208 -50 -41 -153 191 -30 41 -24 -132 260 12 111 346 123 -185 -15
$$ packed form
2546H7k13M06k42n4RR3n3j78J19J30J97k97j66j0L38j63J7j51K11j43J71k25l1
2569a48J68L5QJ01j11j15J5O1K34k15M4j16L01j67q4P7k07J50J05N9l91K07O7
2592G8o9j13J08k0J23mj13M5K04l17K34N1j82m4j6j9J31k3J35l03M8J79j92n4
2616a33nL74m15J08L16k31j44J19J80j65j12J35N9ol88L98j23k08L41R1j62j79
2638a50KL7o4J36P6J78k21J04k06P4k04L77q0o1j81MK71j10j47K61k10K76k26
2661f4q7K90j94K07j68J33j61N8j15p0K81Rj50K26j22k93J70k1lO9l6L0j34Q0
2685f5O6J03O8q8k38P7N9K4k25J49J24M0j34K16k95o3K07m1p1lj5R6R5k7jj71
2711a13J1l4J03J23N5r6q3K42k58Rj12L44k21P1o5j08L92k48R9K35k23l08J70
$$ plain form
2734 -15 -69 -40 -96 252 111 -126 165 -34 179 56 -112 -28 114 -96 -54 94 -208 -131 -21 -36 3 -41 -38 -46 -263
2759 -263 71 -3 -93 -54 -106 102 63 -313 131 50 77 -28 95 -41 -35 -202 -92 102 37 -131 -48 86 205 30
2783 30 -190 -15 -38 -76 19 -34 23 27 107 -27 213 106 -71 -121 -137 74 -6 -66 -67 136 -171 -112 -154 100 140 -21
2809 -21 233 -82 16 -67 -73 210 78 171 -145 184 56 56 -217 22 -18 -78 -159 92 -85 -14 -103 43 15 79 42
2834 42 -173 147 -87 -63 49 96 92 76 -35 34 29 -212 -149 -74 126 110 150 -118 38 57 63 -17 32 28 105 231 -166
2861 -166 -95 45 39 3 168 -65 247 205 -227 -148 -63 127 -67 -98 36 -111 -121 72 -142 -169 136 2 63 142
2885 142 -9 -291 99 89 -113 49 -30 -44 1 -153 -124 160 111 -94 28 -226 121 60 -94 108 3 223
2907 223 6 -45 -45 -38 108 -140 61 -57 68 172 178 100 53 51 -175 -79 -164 73 26 -80 9 83 202 -89 32
$$ packed form
2734a5n4K9n6L48j41k37K91j99K13j23j68Q4J42k10M2J48l02P7J10j5L9m4Lqk17
2759b63L34p4r0L9n2K08l9l76M44q1K7j05J23j36Oj67J10J94o5j68Q3J34J19j75
2783C0k20J75k3l8R5n3N7MQ0j34K40j07j77n0j6K11q0o0jK03l07N9m2K54M0j61
2809b1K54l15R8q3oK83j32R3l16L29j28%k73K39m0o0q1K51j77P1q9J46k8O4l7
2834D2k15L20k34K4J12M7mj6j11O9nk41O3P5K00j6M0k68J56J9Oq0M9mP7J26l97
2861a66P1J40ol6J65k33L12m2m32P9Q5J90j94l1J34j47j0J93k14k7L05j34O1P9
2885A42j51k82L90j0k02J62p9j4M5j54K9K84m9k05J22k54L47o1j54K02j05K20
2907B23k17n1%PJ46k48K01j18J25J04Op8m7kk26R6q5K37m7j06Q9P4J19k91J21
$$ plain form
2932 32 234 -142 205 230 14 -321 73 96 -21 6 -54 169 114 -197 40 161 172 -88 -150 146 244 35 77
2955 77 36 -107 -139 -214 40 34 174 -56 -20 -26 -108 89 -67 -80 -66 -18 93 2 -140 351 -139 -223 103 48 50 -156
2981 -156 -142 76 49 5 155 100 22 -133 5 94 219 -19 78 -80 -55 -235 -33 55 -139 -58 181 -92 -41 67
3005 67 40 -229 54 138 15 -86 -25 25 18 94 -16 -97 3 -230 -85 -39 178 -41 5 -161 262 91 -298 94
3029 94 -25 108 -4 24 246 -169 7 -18 161 -60 -54 -114 181 13 62 58 -49 98 31 -82 20 -9 46 5
3053 5 -147 44 2 -89 -49 -71 217 10 102 -181 -109 123 -206 156 98 -183 -124 -18 182 -89 -218 -124 31 -17
3077 -17 87 -160 74 -3 -138 29 -73 -196 -309 -56 -50 54 -267 43 40 -4 -316 -149 63 -51 -49 241 109
3100 109 -16 95 157 75 -41 0 -86 53 171 -108 32 -126 -8 157 -190 254 -10 10 118 -123 19 16
$$ packed form
2932C2K02l76L47K5k16l35L94K3j17K7o0K23n5l11K37J21J1k60o2K96R8k09M2
2955G7m1j43l2p5K54oJ40k30L6oq2J97j56j3J4M8J11r1j42M91m90q4L26n5Kk06
2981a56J4K18k7m4J50n5p8j55J38Q9J25k38R7j58K5j80K02Q8j94Q1K39k73N1J08
3005F7k7k69K83Q4j23j01O1N0pP6j10q1J00k33J45M6K17k19M6j66M23j71l89L92
3029I4j19J33j12K8K22m15J76k5J79k21Oo0K95j68M9mj07J47o7j13J02k9N5m1
3053Ej52J91m2r1M0k2K88k07R2k83P2K32l29L62n8k81N9J06K00k71j29R4J55m8
3077a7J04k47K34p7j35J67j02j23j13K53OJ04l21L10lm4l12J67K12j14KK90j32
3100A09j25J11O2q2j16M1q6J39J18k79J40j58J18J65l47M44k64K0J08k41J42l
$$ plain form
3122 16 8 132 -28 14 508 156 14 -40 -141 -13 89 -60 125 -3 -27 -134 61 17 108 106 -95 -23 37 90
3146 90 45 -62 122 -15 -159 -122 32 -137 -59 -128 -29 25 -161 -100 14 178 -61 -97 308 62 -43 -20 -4 102
3170 102 130 -151 17 -41 114 -85 191 169 72 -244 -209 -131 86 -47 115 -23 262 18 26 -175 -17 209 -94
3193 -94 9 182 -140 162 264 0 -43 118 57 -196 23 -69 194 46 147 60 32 -85 73 -6 -10 19 136
3216 136 66 86 -53 62 -202 -93 29 146 -167 -59 58 222 -102 204 -78 -132 49 -59 -17 0 223 194
3238 194 97 -75 -68 238 -139 1 151 -2 -58 -36 62 131 152 -132 75 -166 -6 197 14 -199 -55 -150 -89
3261 -89 -119 29 -51 7 65 -6 174 -55 -116 144 77 125 128 -51 -161 57 -294 42 124 -347 -127 -18 35 -90
3285 -90 -41 132 71 94 41 27 300 -55 168 192 -204 -40 153 -98 -174 -163 -61 -129 6 -2 -87 -12 -104 -223 -117
$$ packed form
3122A6qJ24j60M2M94l52j42n4j01J28J02j49J85j28k4j07J95m4R1kk01P2O0N3
3146I0m5j07J84j37j44L7J54j69P8o9R9N4j86O1J14J64k39l6M05k46j05K3J6J06
3170A02K8k81J68n8J55j99K76k2r7l16L5P8K17j33J62j38K85k44Qk01J58K26l03
3193i4J03J73l22L02J02k64m3J61o1k53K19r2K63j48J01q7k8j17J58p9mK9J17
3216A36p0K0j39J15k64J09J22J17l13J08J17J64l24L06k82n4J81j08M2J7K23k9
3238A94r7j72PL06l77J40J50j53n6K2R8O9K1k84K07k41J60K03j83k13J44r5O1
3261h9l0J48q0N8N8p1J80k29o1K60o7M8Lj79j10K18l51L36Q2m71K20J09N3j25
3285i0M9J73o1K3n3j4K73l55K23K4l96J64J93k51p6J1J02o8J35qq5P5r2j19J06
$$ plain form
3310 -117 -65 75 31 223 -115 -74 212 67 -160 178 -63 110 -108 -139 187 -27 -75 -142 -50 129 -50 68
3332 68 102 -2 -27 -150 62 47 296 161 -51 80 15 70 64 149 218 73 216 -60 2 -16 83 -43 -67 105 164
3357 164 54 -74 -106 -61 -138 -21 35 -219 -117 37 -68 139 -50 -6 83 203 149 56 -202 34 41 -111 -98 33
3381 33 11 38 14 -62 -38 138 -127 85 -17 136 111 -116 -84 9 15 -121 30 -14 196 -221 0 -51 93 54 78
3406 78 71 -88 -134 75 -98 142 -12 -122 -183 86 52 13 115 -12 -12 51 -63 -77 -87 32 252 324 -36 94
3430 94 171 57 -116 -80 -179 43 200 94 -196 -91 426 120 123 -13 1 57 -91 14 -92 207 -131 -49 168
3453 168 -13 303 137 50 -80 167 84 82 -90 -18 -165 11 194 -170 175 -78 217 28 -48 58 -66 -147
3475 -147 48 -39 -200 109 -151 97 -110 12 43 -91 -312 47 -64 -176 -48 -79 95 32 -23 -178 -16 107
$$ packed form
3310a17N2J40m4J92l38M1K86j45k27L38k41J73k18l1L26k14m8o7R2J79j79J18
3332F8L4j04k5j23K12j5K49j35k12J31o5N5oQ5O9j45J43k76O2j8R9j26k4J72N9
3357A64j10j28l2M5p7J17N6k54J02J54j05K07j89M4Q9J20n4r3k58K36Pj52J3J31
3381C3k2K7k4p6K4J76k65K12j02J53k5k27L2R3Oj36J51m4K10m17K21n1J44l9K4
3406G8pj59m6K09j73K40j54j10o1K69l4l9J02j27%O3j14j4j0J19K20P2l60J30
3430I4P7j14j73L6r9K22J57j06k90J05N17l06Lj36J4N6j48J05j06K99l38Q2K17
3453A68j81L16j66q7j30K47q3kj72P2j47J76J83l64L45k53K95j89p6J06j24q1
3475a47J95q7j61L09k60K48k07J22L1j34k21L59j11j12J28l1J74o3n5j55J62J23
$$ plain form
3497 107 -112 28 -80 186 -35 -159 -83 183 79 267 16 -6 1 117 124 57 26 106 -168 9 241 111 -144
3520 -144 -60 -197 30 -8 -50 -93 -97 -146 -101 -4 193 -30 62 48 -138 100 -122 91 74 95 -103 -75 -74 -126 -65 101
3546 101 -49 -181 -46 -204 -29 32 144 -71 -195 -15 -31 72 -85 279 114 12 -184 -78 291 -24 67
3567 67 49 97 160 276 58 -120 61 -74 43 60 17 121 61 -241 102 -14 124 197 161 -181 -41 -134 47
3590 47 -95 -282 -31 -28 -74 158 50 -97 -56 33 28 -2 12 -62 126 -124 -159 -92 314 174 49 24 -66 69 -106
3615 -106 126 -173 -144 -72 139 -33 -53 -168 -214 214 117 114 -46 91 -57 -80 125 104 -278 -14 8 -113 62
3638 62 -236 91 -56 -61 -42 -51 -96 -151 248 149 146 181 -111 -326 -12 14 -225 69 -240 -353 -70 134 41 -112 -144
3663 -144 -270 46 26 -78 -19 7 -179 146 91 -203 -114 -44 55 48 135 40 -9 -119 47 -346 -16 80 29 -137 -62
$$ packed form
3497A07k19J40j08K66k21j24P6K66j04J88k51k2PJ16Po7l1Q0k74J77K32j30k55
3520a44Q4j37K27l8m2m3mm9M5R7J97k23R2j4j86K38k22K13j7K1j98K8Jn2O1J66
3546A01j50j32J35j58J75O1J12k15j24J80j6J03j57L64j65j02j96J06L69l15R1
3567F7j8M8O3J16k18j78J81j35J17J7m3J04o0l02L43j16J38P3l6l42J40r3J81
3590D7j42j87K51Lm6K32j08j47M1Q9nl0J4p4J88k50l5O7M06j40j25k5r0J35j75
3615a06K32k99K9P2K11j72k0j15m6M28r7lj60J37j48k3K05k1l82K64K2j21J75
3638F2k98L27j47nJ9rm5n5L99r9lL5k92k15L14K6k39K94l09j13K83K04r3j53l2
3663a44j26L16k0j04N9K6j86L25n5k94Q9P0R9pQ7r5m9j10J66l93L30R6n1j66P5
$$ plain form
3688 -62 -41 -46 69 34 43 -71 -19 -121 92 187 77 -56 -153 -70 186 -58 54 126 -120 118 168 -36 -9 218 -228
3713 -228 69 1 154 43 -104 -204 -54 -71 65 35 160 -67 -2 -33 -144 163 79 53 -142 2 -174 139
3735 139 -295 -66 -95 158 -146 133 151 -46 -89 97 -92 -107 168 168 -84 164 86 -109 225 54 71 163 315
3758 315 126 13 -227 -71 13 -12 -93 182 -16 -22 117 -25 -16 -13 102 -34 -63 155 -111 87 105 54 -210 -4
3782 -4 -116 20 133 -282 172 137 28 -103 49 -51 -155 -35 -103 27 48 -89 -3 -54 41 266 257 220 231 5
3806 5 5 -143 -84 18 -90 -256 30 74 52 133 116 -34 -204 -9 61 94 170 96 48 -112 169 -31 -150 -152 67
3831 67 -70 -121 -128 161 89 73 -116 142 -42 -52 4 75 -191 28 -56 -177 -75 -168 24 -87 117 -7 77 195
3855 195 -37 294 -116 -94 -7 -76 37 258 -120 -31 -67 153 54 -43 -119 88 55 92 63 -153 111 110 -14 94
$$ packed form
3688f2K1nJ15l5Rj14N2j02K13R5j10j33r7Q3K56k44J12P2k46K38N0k04K7K27m46
3713b28K97o8J53j11j47j00J50j7J36l0J25k27O5l1j11L07q4k6j95J44j76L13
3735A39m34K29k9K53l04K79J8j97m3J86j89j5K75%k52K48p8j95L34j71J7R2J52
3758C15j89j13k40J56Q4k5q1K75j98oJ39j42RLJ15j36k9K18k66J98J8n1k64K06
3782dj12J36J13m15M54l5j09j31J52j00j04J20o8J30K1j37Q6n1R5K25rl7J1k26
3806E%j48N9J02j08j66K86M4k2Q1j7j50j70J95P0L3P6p4m8j60K81k00j19kK19
3831F7j37n1pK89p2j6j89K58j84j0N6P1k66K19q4j21J02r3J92j11K04j24Q4J18
3855A95k32L31m10K2Q7o9J13K21l78Q9l6K20r9r7p6K07l3L7k9k16K64jj24J08
$$ plain form
3879 94 243 -42 205 -33 172 17 434 89 -99 -73 173 -23 183 -7 19 84 -103 37 263 -150 -182 74
3901 74 -9 152 73 65 -120 -112 -39 -76 -124 -50 173 141 -62 -128 197 96 80 20 -188 79 -222 16 -28 178 102 -26
3927 -26 78 279 -32 -95 -59 113 -211 -72 17 136 46 113 -11 -186 -28 -162 66 -14 -68 83 106 23 22 -187
3951 -187 -13 -32 -22 -3 -73 -324 158 19 133 30 138 61 -110 6 84 242 90 -74 111 -29 -47 -60 -194
3974 -194 -260 -44 246 133 122 222 -170 22 -37 57 62 5 -82 20 -82 -143 -92 143 -148 63 9 122 -71 -237
3998 -237 -226 95 -6 -98 163 158 66 -99 272 -250 -13 -232 -24 -61 -13 -80 127 44 -15 119 -26 -107 -47 205
4022 205 -34 -68 259 175 150 127 36 107 30 -89 87 -52 129 33 172 337 -43 -107 -83 -52 102 251 -218 -115
4046 -115 -126 99 -55 30 -59 148 -117 111 -47 -51 135 -12 62 -64 -34 46 -61 169 -140 104 244 187 118
$$ packed form
3879I4J49k85K47k38K05j55M17l45j88K6K46j96K06j90K6O5j87J40K26m13l2K56
3901G4q3J61p9qj85QP3l7m8P4K23l2k03o6L25j01j6o0k08K67l01K38m4K06p6j28
3927b6J04K01l11o3L6J72l24J39Q9J19r0O7j24j75J58j34K28q0n4J51K3q3jk09
3951a87J74j9J0J9p0k51M82j39J14j03J08p7j71J16P8J58j52j64J85j40j8j3j34
3974a94o6K16K90j13j1J00l92J92n9R4Nn7q7J02j02o1N1K35k91K11n4J13j93j66
3998b37J1L21j01r2K61nr2j65L71n22K37k19K08l7M8o7K07q3n9J34j45q1O0K52
4022B05k39l4L27q4k5k3r1P1p7j19J76j39J81r6J39J65l80o4K4L1J54J49m69J03
4046a15j1K25j54Q5q9K07k65K28j58mJ86j47P4j26L0Q0j07K30l09K44J40n7o9
$$ plain form
4069 118 -29 45 -90 -161 33 -6 49 -36 118 8 -75 193 -312 22 -197 64 -144 -34 -85 136 -268 -156
4091 -156 -88 295 165 79 -36 -241 -16 136 -120 196 11 -315 122 -137 320 134 -225 -109 -13 -30 -13 -130
4113 -130 60 -162 125 -99 268 11 -39 -125 -90 66 66 -84 128 217 109 -104 58 -7 -63 -8 191 -32 -46
4136 -46 -38 -136 -9 88 1 125 -37 -199 -154 -14 198 354 3 -73 -122 -180 -10 80 91 157 72 54 -26 -33 53 -39 -32
4163 -32 121 43 128 1 -42 131 -142 -110 193 252 106 -57 30 142 226 -63 144 -173 125 -128 172 98 71
4186 71 165 -65 52 -71 -228 -244 -116 -98 191 84 213 -26 -37 108 1 -2 95 -206 100 -241 -190 51 155
4209 155 168 33 104 68 202 -46 -23 -167 -101 182 166 -36 -10 -15 -20 25 -75 31 137 5 -131 50 97 129 65
4234 65 2 -185 -96 54 209 -158 91 48 -93 297 288 71 -102 -20 30 53 -108 235 -25 -67 -163 -78 -52 -62 -1
$$ packed form
4069A18j47P4j35p1J94l9N5q5J54j10q3K68n05L34k19K61k08J10n1K21m04J12
4091a56O8L83j30q6j15k05K25J52k56L16j85l26M37k59M57j86l59J16R6j7J7j17
4113a30J90k22K87k24L67k57n0q6L5J56%j50K12Q9j08k13J62o5n6N5J99k23j4
4136d6Qr8J27R7q7J24j62j62M5J40K12J56l51p6m9n8J70R0J1O6q5j8q0pQ6r2P
4163c2J53p8Q5j27m3J73k73L2L03N9j46j63Q7J12Q4k89K07l17K98k53L00p4k7
4186G1R4k30J17j23j57j6J28J8K89j07J29k39j1J45j07lR7l01L06l41N1K41J04
4209A55J3j35P1l6J34k48K3j44O6K83j6k02K6nnM5j00J06J06j32j36J81M7L2o4
4234F5o3j87Q9J50J55l67K49m3j41L90rk17j73Q2N0K3j61L43k60m2r6Q5K6j0O1
$$ plain form
4259 -1 83 2 -269 121 223 112 57 155 -168 -150 -92 89 148 -87 22 -5 171 -208 -72 -86 31 -50 -20 -10 144
4284 144 -476 274 65 -192 -111 162 -22 97 -204 126 -104 116 -233 -85 31 -8 38 -132 -31 -91 -129 102
4306 102 158 -100 127 -82 -93 -41 -172 71 16 -16 -68 -181 36 -51 -85 -22 -231 88 50 -114 125 85 120 -121
4330 -121 19 0 -28 25 -176 -293 -107 -226 -80 28 32 74 109 -216 16 -67 -39 -5 -1 62 -59 69 39 -390 70
4355 70 51 -242 138 -35 82 -55 32 88 74 -175 101 -55 121 -369 -80 -112 -32 -234 -77 165 72 83 182
4378 182 7 99 102 194 -39 -145 -18 -248 -10 127 -76 0 1 161 80 50 127 87 1 12 -7 259 -6 41 -132
4403 -132 -171 188 75 -87 -178 78 -16 -117 -135 -146 -226 23 51 -272 117 -148 152 -6 108 -57 -4 187 -106
4426 -106 24 201 -22 -15 -41 -275 -115 209 136 160 45 254 -64 -237 56 -65 7 -7 -167 152 -128 -53 159
$$ packed form
4259aQ4q1k71L90J02j11n5R8l23J8N8J81N9k35J09k7J76l79J36j4J17q1L0J0J54
4284A44o20P50k09k57Q1K73j84J19l01L30k30K20l49J48J16l9M6j70J01o0l8K31
4306A02N6k58K27k09j1N2j31K43n5l2n2j13K17q7l4O3k09L19l8j64K39m0L5k41
4330a21J40j9k8N3k01j17J86j19J46J08MM2L5l25K32q3K8L4MO3j21J28l0m29M60
4355G0j9k93L80j73J17j37Q7N6j4k49K76j56J76m90K89l2Q0k02J57K42r3J1R9
4378A82j75R2LR2k33j06J27k30K38J37k03P6JJ60q1l0P7m0q6J1j9K66k65M7j73
4403a32l9L59j13j62r1K56r4j01j8j1q0K49K8l23L89k65L00j58J14j65N3J91k93
4426a06J30J77k23Pk6k34J60L24p3K4j15K09l18j73K93j21P2j4j60L19k80P5K12
$$ plain form
4449 159 154 -203 -3 -210 0 -72 -19 54 31 1 63 -11 109 -179 -3 -77 -150 -46 -79 163 -60 78 133 51 37
4474 37 -216 -30 -121 71 63 -250 19 299 -145 -85 150 -50 5 -93 -32 -25 -276 -32 142 -147 -197 -139 128 -32
4498 -32 -120 150 -149 113 87 -88 217 255 -103 -168 17 31 -88 -8 -14 -57 98 83 14 140 -157 -56 62 96
4522 96 93 -87 -155 153 260 -122 143 75 -172 -35 -101 75 -18 -18 134 -28 -80 -25 35 17 88 -147 -80 -72 -51 196
4548 196 11 137 -92 -77 -96 -115 -89 25 -82 -94 -7 100 119 3 137 -138 104 -11 -237 145 162 -256 -108
4571 -108 21 -310 -122 -163 59 128 -47 35 -77 -162 -158 -172 -100 -139 -20 34 -12 -9 -128 -208 48 88 22 89 -4 -191
4597 -191 -255 81 -32 -58 -245 -172 47 283 206 -35 131 -143 -96 -65 -43 70 -173 128 197 -174 227 122 119
4620 119 38 86 78 21 16 70 195 -150 -53 -113 134 106 -48 16 -99 -266 97 97 18 -57 88 126 -83 -18 116 -129
$$ packed form
4449A59nl57K00k07K10p2N3P3k3l0O2p4J20k88J76p4p3J04l3K42k23J38N5q2j4
4474C7k53J86r1J92ql13K69K80m44O0K35k00N5r8O1Pk51K44J74k89n0N8K67j60
4498c2q8K70k99K62k6j75L05L8l58o5J85J4j19Q0om3J55j5o9J26k97J01J18L4
4522I6lj80o8L08J07l82K65o8k47J37o6J76r3%J52j62n2N5O0j8P1k35O7QK1K47
4548A96j85J26k29J5j9j9K6J14j07j2Q7J07J9j16J34k75K42j15k26L82J7m18J48
4571a08J29l31J88m1K22O9j75Q2j12q5Mj4P2l9J19N4m6Lj19q0K56M0o6O7r3j87
4597a91o4L36j13k6j87P3K19K36p7k41J66k74M7L1K2J13k43L01O9l71M01j05l
4620A19q1M8qn7nN4J25l45R7o0K47k8j54O4j15j67L63%p9p5J45L8k09O5J34k45
$$ plain form
4646 -129 71 -106 113 -194 141 73 182 -132 -42 -99 -21 29 -23 -14 -248 -164 126 48 215 208 -209 39 -226 -10
4670 -10 34 156 136 -41 133 109 -16 122 -72 369 -109 90 -61 47 11 82 -238 -48 -66 -79 25 -181 -123
4693 -123 78 102 -168 -297 -291 -91 -133 -218 2 -69 -397 30 -121 -103 25 0 33 36 76 62 -40 -65 16 -23 -77 90
4719 90 82 -10 68 -93 -152 72 69 102 -36 139 -22 -103 195 216 -226 109 -44 193 -180 188 6 -16 73 9 -96
4744 -96 5 243 -29 -27 -135 24 139 186 34 -59 58 89 57 -277 -22 103 139 392 6 154 -70 148 -5
4767 -5 -48 -158 140 -130 66 10 154 114 -40 -67 -57 98 -124 5 -200 39 -217 -49 168 0 -20 -18 39 28
4791 28 -98 -86 -110 -5 112 -216 -54 -205 -119 59 -61 -10 -22 -29 -96 119 -185 135 37 81 -199 296 126 -228
4815 -228 -37 -119 63 329 175 93 71 -53 177 194 -143 -168 14 153 -105 -65 -187 73 -18 -16 -2 -23 263 -52
$$ packed form
4646a29K00j77K19l07L35o8J09l14R0n7P8N0n2Rk34Q4K90p8J67pm17K48k65K16
4670a0M4J22k0j77J74k4j25J38j94M41m78J99j51J08l6P1l20J90j8j3J04k06N8
4693a23K01K4k70j29OK00m2q5K20p1l28M27j51J8J28k5L3LM0j4j02k5Q1l9n4J67
4719I0qr2P8j61n9K24lL3j38J75j61q1K98K1m42L35j53K37l73L68j82k2Q9o4j05
4744i6J01K38k72Kj08J59J15M7j52r3J17L1l2l34K55J25L6K53l86J48k24K18j53
4767em3j10K98k70J96n6J44m0j54k7J0J55k22J29k05K39k56J68K17j68k0KN7j1
4791B8j26J2k4J05J17l28J62j51Q6J78j20N1j2po7K15l04L20r8M4k80M95j70l54
4815b28J91q2J82K66j54q2k2j24K30J7l37k5J82J39k58M0j22K60r1KJ4k1K86l15
$$ plain form
4839 -52 -146 40 -72 138 -22 -290 -172 -106 221 -82 -149 -20 -104 -100 55 270 -43 -147 6 -108 -28 -71 -216
4862 -216 1 -49 14 -188 -176 -111 -66 22 141 -13 25 -26 12 -161 -89 52 -91 82 35 93 -38 -189 -88 -171
4886 -171 -3 -59 16 -10 -121 -44 -59 -39 76 -21 -105 40 -64 -85 -284 58 -214 242 141 131 77 -13 -147 -120
4910 -120 129 -30 -21 -52 117 -181 67 202 -134 30 -194 135 -61 232 -182 -10 -138 6 147 -15 -172
4931 -172 -84 115 -46 231 33 -48 -173 262 77 54 149 -18 -86 74 72 87 -13 -28 243 100 100 -3 -267 66
4955 66 -196 87 -59 -81 -121 -10 -48 44 287 108 39 -71 -118 125 43 -26 -23 20 125 -200 -60 81 -257 208
4979 208 -187 48 102 13 276 -185 -67 -75 -83 182 330 -25 34 130 -95 -25 28 -51 -41 142 -73 -147 151 -222
5003 -222 51 -128 155 -18 -108 -152 0 -76 78 82 -97 -132 -126 19 124 132 222 -39 71 43 -10 180 26 -41 -32
$$ packed form
4839e2r4J86j12K10j60k68J18O6L27l03o7J29q4MJ55K15l13j04J53j14Q0m3j45
4862b16K17n0O3k02J2O5M5Q8J19j54L8n1L8j73P2J41j43J73m7N8j31j51J01q3
4886a71J68n6P5k6j11P7j5K0J15r7q4J45j04k1j99L42k72M56j01j0n4r0j34K7
4910a20K49j59Rl1J69k98K48J35l36J64k24L29j96K93m14J72j28J44J41j62j57
4931a72Q8J99j61K77j98q1j25M35j85k3R5j67o8J60kJ5j00j5K71j43%j03k64L33
4955F6k62K83j46k2m0J11l8R2K43j79o9j10m7K43q2o9LM3J05l25J40J41l38M65
4979B08l95K35N4q9K63m61J18qqK65J48l55N9R6k25P0N3p9J0J83k15p4K98l73
5003b22K73j79K83j73r0m4J52p6J54Mj79l5OJ45J05QR0k61J10k8n3J90j54o7R
$$ plain form
5028 -32 220 -90 -100 -140 71 27 124 123 159 14 37 173 3 -30 74 259 72 48 -75 -56 -24 36 218 -72 4
5053 4 -107 128 -88 -41 77 81 -48 57 113 72 97 -18 96 117 -27 94 -76 -85 -194 -1 -10 -87 94 270 80
5078 80 81 -2 115 -4 12 137 -292 42 -13 7 -101 54 17 34 59 -114 -5 1 48 -3 -136 -244 102 51 -163
5103 -163 199 -56 80 -64 -1 -173 21 -261 -133 -256 -77 84 15 50 228 270 26 5 -65 -30 -122 -34 -96
5126 -96 -154 45 -181 44 -77 38 -210 29 -310 -168 111 -96 -220 76 -82 -46 -15 -111 200 54 -96 -92
5148 -92 91 180 90 148 -77 8 82 -43 45 67 411 73 -176 159 74 67 46 -30 129 -11 28 -162 -116 170 111
5173 111 214 34 13 78 336 -120 -26 143 -41 33 -19 -46 103 236 -156 82 43 186 -111 16 -168 -202 50
5196 50 150 283 -126 114 43 -78 -202 -122 85 -101 34 77 48 -165 -93 181 -73 89 227 131 165 49 -86
$$ packed form
5028c2K52l10j0m0K11m4R7jL6j45K3J36j70l3J04J85j87k4j23J9L2O0J82k90P6
5053Dj11K35k16M7J18Mj29J05N6m1K5j15J14K1j44J21j70rj09J93rp7J81J76j90
5078H0Jq3J17j19J6J25m29L34n5K0j08J55l7J7K5j73J09OM7n1j33j08L46n1k14
5103a63L62k55J36j44O3j72J94k82J28j23J79J61o9L5J78M2k44k1p0L5r2Q8o2
5126i6n8J99k26K25j21J15k48K39l39J42K79k07j24K96j58L6L1r6L11j46j50M
5148i2J83Q9r0N8k25Q5P4j25Q8K2L44l38k49L35q5pk1p6J59j40L9j90M6K86n9
5173A11J03j80k1O5K58m56R4J69j84P4n2k7J49J33l92K38l9J43k97J27j84l4K52
5196E0J00J33m09K40p1j21j24Q0K07j86J35M3k9k13P2K74k54J62J38r6L4j16j35
$$ plain form
5219 -86 122 -163 279 -81 80 -12 -82 -129 -141 -28 5 -37 -197 56 11 0 -58 -27 -77 -186 -6 39 -166 -62
5243 -62 85 -140 -17 56 -162 143 -6 108 43 -45 9 -153 83 3 74 103 -157 104 145 18 -66 -121 172 -39
5267 -39 10 -59 17 -110 -105 -120 50 144 -130 14 -89 85 -114 66 114 34 51 115 163 0 103 -80 -163 118 33
5292 33 299 -116 67 -24 113 145 74 110 -179 68 51 283 -55 58 -39 139 113 19 -202 -24 96 82 -212
5315 -212 109 -98 29 175 5 -69 115 164 233 -67 -75 278 -385 -22 -39 -235 -40 114 3 -32 -171 -94 -109
5338 -109 321 -6 115 188 85 -42 63 154 45 260 -38 206 46 -35 -91 153 183 -291 68 -24 90 130
5360 130 13 -46 35 -85 -134 37 -61 159 -16 -76 45 -13 100 -69 134 -83 -194 178 8 251 63 -166
5382 -166 -78 182 5 -109 173 164 -106 142 133 201 75 -24 167 -30 52 -40 -88 168 -293 33 -59 -36 189 92
$$ packed form
5219h6K08k85M42l60J61r2p0m7j2J13L3m2j60K53m5j1n8L1n0j09J80M5k05J04
5243f2J47k25J23P3k18L05j49J14o5q8N4j62K36q0P1K9k60K61M1j27q4n5K93k11
5267c9M9o9P6j27Nj5J70R4k74J44j03J74j99J80M8q0J7O4M8j63J03j83q3K81q5
5292C3K66m15J83r1J37L2p1L6k89K47j7K32l38J13r7J78k6r4k21J78J20j4k94
5315b12L21k07J27J46j70p4J84M9O9l00qL53o63L63j7j96J95J54j11l5j39P7j5
5338a09M30l27J21P3j03j27J05R1j09K15k98K44j60q1n6K44L0m74L59r2J14M0
5360A30j17n9Q1j20m9J71r8K20j75o0J21n8J13j69K03k17j11L72j70K43j88k29
5382a66Q8K60j77j14K82rk70K48rO8j26r9J91j97Q2r2m8K56m61L26r2K3K25r7
$$ plain form
5406 92 -102 87 361 149 -32 74 250 215 159 0 42 -44 138 -173 56 -44 -79 75 89 194 67 196
5428 196 -145 -121 163 97 -179 -9 121 49 -111 43 39 -66 217 -6 -14 42 -24 54 -55 142 -15 39 63 67 -24
5453 -24 -95 77 -224 -38 -145 87 19 -224 -195 72 31 -139 270 -157 154 -74 107 -64 -176 101 -34 29
5475 29 -129 55 110 -332 -108 -200 11 -128 116 42 -73 -276 -105 -49 -101 -35 288 71 48 -77 48 178 -33
5498 -33 -179 35 96 6 220 -5 -33 145 -185 -18 68 62 -4 45 -168 -25 130 38 -43 -49 -122 101 -112 63 121
5523 121 193 134 -25 2 70 -3 96 -20 253 151 -96 -83 -87 -93 55 -85 -149 194 -198 84 -97 -77 159 -173
5547 -173 -123 -35 -106 136 -62 31 -36 153 -38 10 -274 33 -81 84 -17 88 -234 -107 -112 -7 -7 379 193
5570 193 -133 39 1 -45 -61 -290 176 -40 -56 -37 34 221 -87 -231 -82 34 -187 -174 -48 53 -19 107 83
$$ packed form
5406I2j94J89K74k12j81J06J76l5n6j59M2q6J82l11K29j00l5J54J4J05j27J29
5428A96l41K4K84o6k76J70J30p2j60J54mj05K83k23qN6o6P8j09J97j57N4K4Mr1
5453b4p1J72l01J86j07K32o8k43K9K67m1j70M09m27L11k28J81j71j12K77j35O3
5475B9j58J84N5m42K24r2K11j39K44p4j15k03J71N6n2O6L23k17k3j25J25J30k11
5498c3j46K14O1r0K14k25k8J78l30J67Q6oo6M9k13J43J55r2q1op3K23k13J75N8
5523A21P2n9j59K7O8p3R9j16K73j02k47J3moJ48j40o4L43l92K82j81K0K36l32
5547a73N0Q8p1K42j98R3o7J89j91M8k84L07j14J65j01J05l22J27nJ05%L86j86
5570A93l26J72l8m6j6k29M66k16j6J9P1J87l08j44J49J16k21J3J26J01p2J26k4
$$ plain form
5593 83 89 33 31 3 197 111 54 23 -24 64 219 206 -5 51 -124 -60 93 -105 14 11 151 126 166 110 -248 101 -47
5620 -47 -4 -126 -157 -191 24 -116 37 87 -93 180 -90 1 6 -3 -49 61 -43 134 -63 112 0 -81 -131 114
5644 114 -158 -112 17 22 108 188 -27 117 -166 -145 128 -166 -135 -94 111 -97 45 104 -37 50 -147 14 -18 -114
5668 -114 117 -103 115 -101 33 23 -51 -31 -107 -200 30 5 101 223 -46 152 193 145 -74 -5 16 -53 102 324
5692 324 149 -365 -1 -7 -136 -148 25 6 -20 -170 168 99 -50 103 230 -97 -200 264 41 -193 -111 21
5714 21 80 140 -208 7 222 58 86 -115 70 172 -113 44 -45 -41 -139 -211 31 60 -26 -189 -110 -115 -127 42 207
5739 207 -84 17 -145 18 416 124 36 -178 15 73 -130 44 196 -238 114 -67 -104 10 272 59 -232
5760 -232 58 -121 112 -117 -6 120 184 -29 -58 63 -31 54 -19 -83 51 -40 72 96 80 16 65 -21 124 115 -107
$$ packed form
5593H3On6kk8J94q6n7l1m7Q8J55j3k11N6j75O4J53j98J19lJ40k5M0n6l58L49j48
5620d7M3j22l1l4K15j40J53N0j80K73k70R1Nrm6J10j04J77j97J75j12q1n0K45
5644A14k72M6J29NQ6Q0k15J44k83K1K73k94L1M1K05k08J42N9j41Q7j97J61l2r6
5668a14K31k20K18k16J34j0p4K0p6r3K30k5R6J22k69J98M1m8k19O9K1o9J55K22
5692C24j75n14L64oj29j2J73j9k6j50L38o9j49J53J27l27j03M64k23k34Q2J32
5714B1N9O0l48K15K15j64K8k01J85J02k85J57q9Mr8p2K42K9q6j63P9nj2J69J65
5739B07k91J01j62J63L98k92q8k14J93N8k03J74J52m34L52j81l7J14K62k13k91
5760b32K90j79K33k29J11J26O4k13k9J21r4Q5p3o4J34r1J12K4j6o4M9q6J45rk22
$$ plain form
5785 -107 145 88 -85 -22 42 -116 -61 52 65 114 206 116 -28 -25 -160 -128 70 -252 83 136 -62 -107 -22 -174 -130
5810 -130 -132 16 63 -65 23 -50 0 42 143 23 -60 99 -59 -51 -200 -57 4 -77 122 -97 40 88 -66 108
5834 108 -125 -86 200 25 -215 106 119 102 -10 -313 -142 76 90 49 37 6 -30 8 37 116 -54 79 -39 -8
5858 -8 209 102 150 -5 -30 1 -96 99 57 122 56 -150 -23 232 -194 146 64 52 120 -102 113 109 -233 43 55
5883 55 -80 -129 -48 194 -70 123 -41 60 -75 -257 -225 17 64 -2 124 -4 97 -151 112 201 126 -32 61
5906 61 -104 74 -137 -14 113 -238 70 206 -68 -205 44 -59 -18 -233 -27 150 -290 49 -76 198 -149
5927 -149 -66 -143 88 -190 25 97 24 -136 88 -7 -43 13 247 14 56 114 -172 -141 133 -74 31 -31 -54 -328
5951 -328 -120 183 91 293 31 -153 -16 125 -89 -146 67 240 120 -2 11 -44 -59 -84 -65 -14 -38 -94 -44 301
$$ packed form
5785a07K52n7j73O3O4j58N5J13J3M9R2r0j44Lj35L2J98l22L35N3j98m5Q5j52M4
5810a30kJ48M7j28Q8p3N0M2J01j20q3J59j58Qj49J43O1q1J99k19J37M8j54J74
5834A08k33L9K86j75k40L21J3j7j12l03J71K18J4m1j2l1l6L8K9P9j70J33j18L1
5858hK17j07M8j55k5L1r7J95m2O5o6k06J27K55m26L40q2j2O8k22K15ml42K76J2
5883E5j35m9Q1K42k64J93j64J01j35j82L2K42M7o6J26j28J01k48K63Q9p5j58R3
5906F1j65J78k11J23J27l51L08J36k74j37K49j03M1k15K06J77m40L39j25K74l47
5927a49Q3p7K31k78K15P2p3j60K24r5l6N6K34k33M2N8k86L1K74k07J05o2k3k74
5951c28K08L03r2K02k62j84J37J41k14n7K13J73j20j22J3n5j5k5J9N1k4n6N0L45
$$ plain form
5975 301 35 -114 19 -269 -22 123 -196 0 20 156 -221 -1 -74 -93 91 66 279 224 112 -15 -164 -347
5997 -347 -78 -179 -135 -65 -20 -13 -184 -133 22 118 -95 119 211 34 -211 160 172 96 88 -77 -200 46 369 -60
6021 -60 140 51 284 -171 -2 103 -48 370 -121 -229 135 93 -194 51 -27 149 45 -275 76 -126 -252
6042 -252 68 -137 -180 -149 40 -13 -305 -9 -1 123 94 -206 50 147 340 -163 -234 -46 53 -150 75 103 156 62
6066 62 -50 -173 -229 58 244 41 42 -166 122 -61 -3 182 215 80 -88 35 221 -13 163 9 58 -95
6088 -95 110 -121 -13 -54 197 108 33 180 64 48 44 -174 16 27 67 -176 89 208 97 -41 68 -71 -61
6111 -61 101 -95 107 -119 -65 -246 -236 18 134 -82 23 54 39 -111 41 -39 171 -111 -241 -20 47 183
6133 183 35 57 193 -123 34 -109 -212 -101 -107 -121 128 214 -114 79 -58 89 135 -27 -6 -117 99 -55
$$ packed form
5975C01k66j49J33k88K47J45l19J96K0J36l77K20p3j9J84k5K13n5j12j27j49j83
5997c47K69j01M4P0M5Pj71N1J55R6k13K14R2j77k45L71J2p6qj65j23K46L23m29
6021f0K00q9K33m55J69J05j51M18m91j08L64m2k87K45p8J76j04l20L51k02j26
6042b52L20k05m3L1J89n3k92K96QJ24k9l00K56R7J93n03p1J88R9k03K25K8N3r4
6066F2j12j23n6K87J86k03Jk08K88j83N8J85L3j35j68J23J86k34J76j54M9j53
6088i5K05k31J08m1K51q9p5J47j16j6mk18J90J1M0k43K65J19j11j38J09j39J0
6111f1J62j96K02k26N4j81J0K54J16k16J05L1j5j50J52q0K10k82j30K21O7J36
6133A83j48K2J36l16J57j43j03J11oj4K49Q6l28J93j37J47M6j62K1j11K16j54
$$ plain form
6155 -55 -14 129 -65 222 101 225 -286 178 -230 143 -179 -201 186 -62 -148 -277 -45 -43 -6 -159 110 -132
6177 -132 -155 57 32 50 98 109 15 235 91 -93 179 126 -175 -2 -131 35 -29 10 30 20 -59 126 98 188 20
6202 20 -51 -11 -123 137 207 -190 39 200 57 285 4 210 -78 26 -7 -73 -148 -92 28 24 68 104 -41 -23
6226 -23 -229 24 58 -218 52 40 175 -143 229 50 62 94 -68 41 127 0 66 34 -3 105 -171 190 -24
6249 -24 -81 24 -136 44 6 110 88 37 88 106 -261 -8 -77 -13 -11 -15 -114 149 48 -51 82 3 155 187 85 -130
6275 -130 -82 -197 -66 27 33 246 129 -63 42 -22 91 81 -209 4 94 276 -1 94 153 -176 134 128 -123 -66
6299 -66 -119 77 9 88 -11 -43 -66 -127 12 138 118 -48 -31 132 63 -27 124 -114 -67 -77 22 10 149 -5 16 61
6325 61 -38 -129 16 -68 19 -18 -91 2 10 115 -91 82 -141 82 -172 125 121 -63 22 -109 110 189 146 137 -75 11
$$ packed form
6155e5M1J43j94K87j21J24n11M64m08L73l22k2L87k48q6j29K32KL7j53K69k42
6177a32k3K12k5J8M8J1r4K20j44j84K72n3l01J73j29J66o4L9K0j0p9J85k8R0j68
6202B0p1M0j12K60P0l97K29J61j43K28k81K06k88J04l3o6p5N6J20mM4L6j45J8
6226b3k06K53L4k76K70j2J35l18L72j79J2L2j62J09Q6j27O6l2l7J08k76L61k14
6249b4n7J05j60J80l8J04k2n1N1J8l67K53o9O4Kmr9K63j01r9J33p9J52L2j02k15
6275a30M8j15J31R3OK13j17j92J05o4J13j0k90K13R0J82k77R5N9l29L10ok51N7
6299f6n3J96o8P9r9l2k3o1J39J26k0j66J7J63o9r0J51k38M7j0R9j2J39j54K1M5
6325F1r9r1J45q4Q7l7p3R3QJ05k06J73k23K23k54K97mj84Q5j31K19P9m3rk12Q6
$$ plain form
6351 11 -173 58 -27 159 123 63 -178 -52 -63 -124 -32 181 -242 34 -165 155 33 130 158 143 -54 -170 116
6374 116 83 129 76 -152 -53 146 43 1 234 74 141 -147 110 163 6 194 -8 -95 -65 36 86 11 -109 194
6398 194 -88 61 157 -26 452 93 -141 -140 147 -65 131 171 -10 -78 215 135 15 12 -47 45 -6 164 -74 65
6422 65 -139 22 -30 -46 25 101 129 -4 -106 271 -85 -71 -80 254 -65 81 -7 299 137 -155 289 185 75
6445 75 88 136 -88 -10 -90 27 -79 -149 -28 -31 199 64 -59 -192 85 67 79 -247 16 -185 120 -199 -89
$$ packed form
6351A1j84K31q5J86l6o0k41J26j1o1R2K13m23K76j99L20j22R7K8j5j97j16K86
6374A16l3M6n3k28R9J99j03m2K33j60O7k88K57N3j57J88k02q7L0J01N0p5j20L03
6398A94k82J49R6j83M78l59k34JK87k12J96M0j81o8K93q0j20ln9R2n1J70k38J39
6422F5k04J61n2j6P1P6K8j33j02L77l56J4rL34l19J46q8L06j62k92M44j04j10
6445G5J3M8k24P8q0J17j06p0J21lK30j35j23j33K77j8J2l26K63k01L05l19J10
$$ [...]
8191a48
##END NTUPLES=NMR FID
##END=
