##TITLE=1H_Pr T-146
 CDCl3
 8 sc, 
 9.12.2021
##JCAMPDX= 6.0         $$ Bruker NMR JCAMP-DX V2.0
##DATA TYPE= NMR FID
##DATA CLASS= NTUPLES
##ORIGIN= UXNMR, Bruker Analytische Messtechnik GmbH
##OWNER= root
$$ XWIN-NMR		Version 3.5
$$ Thu Dec  9 13:42:21 2021 Russian Standard Time (UT+4h)  she@DPX200
##.OBSERVE FREQUENCY= 200.131346
##.OBSERVE NUCLEUS= ^1H
##.DELAY= (6, 6)
##.ACQUISITION MODE= SIMULTANEOUS
##.ACQUISITION SCHEME= undefined
##.AVERAGES= 8
##.DIGITISER RES= 18
##SPECTROMETER/DATA SYSTEM= spect
##.PULSE SEQUENCE= zg30
##.SOLVENT NAME= CDCl3
##.SHIFT REFERENCE= (INTERNAL, CDCl3, 0, 15.7039)
##AUDIT TRAIL= $$ (NUMBER, WHEN, WHO, WHERE, WHAT)
$$ ##TITLE= Audit trail, XWIN-NMR		Version 3.5
$$ ##JCAMPDX= 5.01
$$ ##ORIGIN= Bruker BioSpin GmbH
$$ ##OWNER= she
$$ F:/spectra/data/she/nmr/H-F/1/audita.txt
$$ ##AUDIT TRAIL=  $$ (NUMBER, WHEN, WHO, WHERE, WHAT)
(   1,<2021-12-09 13:41:22.40 +0400>,<she>,<DPX200>,
      <created by zg, POWCHK disabled, PULCHK disabled
       configuration hash MD5:
       00 E9 B6 7A A2 85 ED C7 34 08 36 98 17 FE 4E 26
       data hash MD5: 16K
       E4 EA 65 60 02 91 16 1E E9 E6 98 0D 4C 1D AD 61>)
$$ ##END=
$$ 
$$ hash MD5
$$ F1 E5 07 22 8D AD 83 7C 28 A3 B8 59 D1 FF 7D 2F
##$RELAX= 
##$RELAX= 
##$RELAX= 
##$RELAX= 
##$RELAX= 
##$RELAX= 
$$ Bruker specific parameters
$$ --------------------------
##$DU= <F:/spectra>
##$EXPNO= 1
##$NAME= <H-F>
##$PROCNO= 1
##$TYPE= <nmr>
##$USER= <she>
##$AMP= (0..31)
100 100 100 100 100 100 100 100 100 100 100 100 100 100 100 100 100 100 
100 100 100 100 100 100 100 100 100 100 100 100 100 100 
##$AQSEQ= 0
##$AQ_mod= 1
##$AUNM= <au_zg>
##$AUTOPOS= <>
##$BF1= 200.13
##$BF2= 200.13
##$BF3= 200.13
##$BF4= 200.13
##$BF5= 200.13
##$BF6= 200.13
##$BF7= 200.13
##$BF8= 200.13
##$BYTORDA= 1
##$CFDGTYP= 0
##$CFRGTYP= 5
##$CHEMSTR= <none>
##$CNST= (0..31)
1 1 145 1 1 1 1 1 1 1 1 1 1 1 1 1 1 1 1 1 1 1 1 1 1 1 1 1 1 1 1 1 
##$CPDPRG= <>
##$CPDPRG1= <>
##$CPDPRG2= <>
##$CPDPRG3= <>
##$CPDPRG4= <mlev>
##$CPDPRG5= <mlev>
##$CPDPRG6= <mlev>
##$CPDPRG7= <mlev>
##$CPDPRG8= <mlev>
##$CPDPRGB= <>
##$CPDPRGT= <>
##$D= (0..31)
0 1.2 0 0 0 0 0 0 0 0.06 0 0.03 0 0 0 0 0.0002 0 0 0 0 0 0 0 0 0 0 0 0 
0 0 0 
##$DATE= 1639042881
##$DBL= (0..7)
120 120 120 120 120 120 120 120 
##$DBP= (0..7)
150 150 150 150 150 150 150 150 
##$DBP07= 0
##$DBPNAM0= <>
##$DBPNAM1= <>
##$DBPNAM2= <>
##$DBPNAM3= <>
##$DBPNAM4= <>
##$DBPNAM5= <>
##$DBPNAM6= <>
##$DBPNAM7= <>
##$DBPOAL= (0..7)
0.5 0.5 0.5 0.5 0.5 0.5 0.5 0.5 
##$DBPOFFS= (0..7)
0 0 0 0 0 0 0 0 
##$DE= 6
##$DECBNUC= <off>
##$DECIM= 32
##$DECNUC= <off>
##$DECSTAT= 4
##$DIGMOD= 1
##$DIGTYP= 9
##$DL= (0..7)
0 120 120 120 120 120 120 120 
##$DP= (0..7)
150 150 150 150 150 150 150 150 
##$DP07= 0
##$DPNAME0= <>
##$DPNAME1= <>
##$DPNAME2= <>
##$DPNAME3= <>
##$DPNAME4= <>
##$DPNAME5= <>
##$DPNAME6= <>
##$DPNAME7= <>
##$DPOAL= (0..7)
0.5 0.5 0.5 0.5 0.5 0.5 0.5 0.5 
##$DPOFFS= (0..7)
0 0 0 0 0 0 0 0 
##$DQDMODE= 0
##$DR= 18
##$DS= 0
##$DSLIST= <SSSSSSSSSSSSSSS>
$$ [...]
##$SUBNAM2= <"">
##$SUBNAM3= <"">
##$SUBNAM4= <"">
##$SUBNAM5= <"">
##$SUBNAM6= <"">
##$SUBNAM7= <"">
##$SUBNAM8= <"">
##$SUBNAM9= <"">
##$SW= 18.0517287032376
##$SWIBOX= (0..15)
0 0 2 0 0 0 0 0 0 0 0 0 0 0 0 0 
##$SW_h= 3612.71676300578
##$TD= 16384
##$TD0= 1
##$TE= 0
##$TE2= 300
##$TE3= 300
##$TEG= 300
##$TL= (0..7)
0 120 120 120 120 120 120 120 
##$TP= (0..7)
150 150 150 150 150 150 150 150 
##$TP07= 0
##$TPNAME0= <>
##$TPNAME1= <>
##$TPNAME2= <>
##$TPNAME3= <>
##$TPNAME4= <>
##$TPNAME5= <>
##$TPNAME6= <>
##$TPNAME7= <>
##$TPOAL= (0..7)
0.5 0.5 0.5 0.5 0.5 0.5 0.5 0.5 
##$TPOFFS= (0..7)
0 0 0 0 0 0 0 0 
##$TUNHIN= 0
##$TUNHOUT= 0
##$TUNXOUT= 0
##$USERA1= <user>
##$USERA2= <user>
##$USERA3= <user>
##$USERA4= <user>
##$USERA5= <user>
##$V9= 5
##$VALIST= <valist>
##$VCLIST= <CCCCCCCCCCCCCCC>
##$VD= 0
##$VDLIST= <DDDDDDDDDDDDDDD>
##$VPLIST= <PPPPPPPPPPPPPPP>
##$VTLIST= <TTTTTTTTTTTTTTT>
##$WBST= 1024
##$WBSW= 4
##$XGAIN= (0..3)
0 0 0 0 
##$XL= 0
##$YL= 0
##$YMAX_a= 101090
##$YMIN_a= -141699
##$ZGOPTNS= <>
##$ZL1= 120
##$ZL2= 120
##$ZL3= 120
##$ZL4= 120
##$ABSF1= 10
##$ABSF2= 0
##$ABSG= 5
##$ABSL= 3
##$ALPHA= 0
##$AQORDER= 0
##$ASSFAC= 0
##$ASSFACI= 0
##$ASSFACX= 0
##$ASSWID= 0
##$AUNMP= <proc_1d>
##$AZFE= 0.1
##$AZFW= 0.1
##$BCFW= 1
##$BC_mod= 2
##$BYTORDP= 1
##$COROFFS= 0
##$CY= 11.3945322036743
##$DATMOD= 1
##$DC= 2
##$DFILT= <>
##$DTYPP= 0
##$F1P= 2.36226072786647
##$F2P= -0.459571619588291
##$FCOR= 0.5
##$FTSIZE= 0
##$FT_mod= 4
##$GAMMA= 1
##$GB= 0.15
##$INTBC= 1
##$INTSCL= 1
##$ISEN= 128
##$LB= 0.24
##$LEV0= 0
##$LPBIN= 0
##$MAXI= 10000
##$MC2= 0
##$MEAN= 0
##$ME_mod= 0
##$MI= 1.114404
##$NCOEF= 0
##$NC_proc= 0
##$NLEV= 6
##$NOISF1= 3.799351
##$NOISF2= 2.8
##$NSP= 1
##$NTH_PI= 0
##$NZP= 0
##$OFFSET= 15.70392
##$PC= 1
##$PHC0= -15516.63
##$PHC1= 17.2008
##$PH_mod= 1
##$PKNL= yes
##$PPARMOD= 0
##$PSCAL= 0
##$PSIGN= 0
##$REVERSE= no
##$SF= 200.130013532006
##$SI= 16384
##$SIGF1= 3
##$SIGF2= 2
##$SINO= 400
##$SIOLD= 16384
##$SREGLST= <1H.CDCl3>
##$SSB= 0
##$STSI= 0
##$STSR= 0
##$SW_p= 3612.71676300578
##$SYMM= 0
##$S_DEV= 0
##$TDeff= 0
##$TDoff= 0
##$TI= <>
##$TILT= no
##$TM1= 0
##$TM2= 0
##$TOPLEV= 0
##$USERP1= <user>
##$USERP2= <user>
##$USERP3= <user>
##$USERP4= <user>
##$USERP5= <user>
##$WDW= 1
##$XDIM= 8192
##$YMAX_p= 0
##$YMIN_p= 0
$$ End of Bruker specific parameters
$$ ---------------------------------
##NTUPLES= NMR FID
##VAR_NAME=  TIME,          FID/REAL,        FID/IMAG
##SYMBOL=    X,             R,               I
##VAR_TYPE=  INDEPENDENT,   DEPENDENT,       DEPENDENT
##VAR_FORM=  AFFN,          ASDF,            ASDF
##VAR_DIM=   8192,          8192,            8192
##UNITS=     SECONDS,       ARBITRARY UNITS, ARBITRARY UNITS
##FACTOR=    0.0002768,     1,               1
##FIRST=     0,             0,               0
##LAST=      2.2672688,     0,               0
##MIN=       0,             -141699,         0
##MAX=       2.2672688,     101090,          0
$$ Real data points
##PAGE= N=1
##DATA TABLE= (X++(R..R)), XYDATA
$$ [...]
$$ plain form
1912 433 -826 394 627 -415 -254 863 85 -572 683 249 -608 552 426 -793 -349 793 -73
1929 -73 -888 495 249 -1079 -37 424 -662 -320 415 22 -562 223 236 -685 96 672 -214 60 815
1948 815 -68 -597 502 701 -671 263 598 -223 -293 399 29 -688 114 -32 -514 -263 399 -427 -478 206
1968 206 -160 -731 204 300 -830 -204 522 -116 -450 823 404 -409 536 476 -32 157 560 -5 -353 130
1988 130 -307 -527 110 272 -454 -496 465 -244 -600 318 76 -537 -224 253 -340 -318 296 11 -182 411 361
2009 361 -187 534 550 -51 -13 742 51 -103 256 481 -290 -379 202 -367 -155 212 -392 -311 72 155 -377 -114
2031 -114 206 -280 -312 240 -175 -215 370 330 177 42 362 93 69 253 -95 -307 357 51 -330 205 133 -261
2053 -261 -244 146 28 -181 -127 102 -75 -245 139 -203 -231 15 -22 72 127 266 235 95 201 363 132 287
$$ packed form
1912D33j259J220K33j042J61J117p78o57J255m34q57J160j26j219M44J142q66
1929g3q15J383k46j328J042M61j086L42P35l93n84P85J3r21P81N76q86K74P55
1948H15q83n29J099J99j372R34L35q21p0O92l70p17Q02j46m82K51O62q26n1O84
1968B06l66n71R35R6j130O26P26o38l34J273m19q13R45o0n08J89M03n65l48M83
1988A30m37k20O37J62p26m2R61p09l56R18k42o13L13M77n93K2O14k85j93N93n0
2009C61n48P21J6o01L8P55o91j54L59K25p71q9N81n69K12L67o04Q1L83Q3n32K63
2031a14L20m86l2N52m15m0N85m0j53j35L20k69k4J84l48k12O64l06l81N35p2l94
2053b61J7L90j18k09N4K29j77j70L84l42k8K46l7R4N5J39l1j40J06J62k31J55
$$ plain form
2075 287 -227 -146 27 172 -73 277 267 49 -27 -91 157 46 -130 -340 -343 -263 -371 -142 -112 -38 124 -52 276
2098 276 314 82 227 120 83 257 -295 -229 351 32 -161 208 327 229 24 52 125 -349 -116 -334 -273 -489
2120 -489 -156 -271 -278 -226 -208 124 237 185 25 335 308 247 390 197 -292 -25 382 278 112 598 382 276
2142 276 265 525 -121 -194 29 -455 -619 -147 -256 -487 -404 108 -439 -178 341 5 -145 137 242 -327 -44
2163 -44 285 -82 116 403 158 -14 270 697 131 251 559 257 -226 -77 -14 -569 -257 2 -519 -174 241
2184 241 -270 -323 -9 -179 -420 -94 186 -382 -409 242 -110 -187 412 286 -322 506 805 95 32 974 143
2205 143 -608 207 89 -313 -92 326 -406 -186 149 -162 -316 227 -213 -531 -4 -16 -660 -260 235 -112
2225 -112 -567 712 392 -205 308 663 -19 -279 662 146 -373 403 505 -449 159 340 -310 -378 519 139
$$ packed form
2075B87n14Q1J73J45k45L50j0k18p6o4K48j11j76k10lQ0j08K29L0P4J62j76L28
2098B76L8k32J45j07l7J74n52O6N80l19j93L69J19r8k05K8P3m74K33k18O1k16
2120d89L33j15pN2J8L32J13n2j60L10k7o1J43j93m89K67M07j04j66M86k16j06
2142B76j1K60o46p3K23m84j64M72j09k31Q3N12n47K61N19l36j50K82J05n69K83
2163d4L29l67J98K87k45j72K84M27n66J20L08l02m83J49O3n55L12K59n21L45M15
2184B41n11n3L14j70k41L26K80n68k7O51l52p7N99j26o08Q28K99p10o3R42q31
2205A43p51Q15j18m02K21M18p32K20L35l11j54N43m40l18N27j2o44M00M95l47
2225a12m55J279l20n97N13L55o82k60R41n16n19P76J02r54O08J81o50o8Q97l80
$$ plain form
2245 139 -292 -178 11 -425 -234 23 -620 -488 276 27 -352 511 402 -562 -80 730 -287 -197 680 43
2265 43 -332 79 493 -338 52 534 -162 -308 611 99 -626 121 -125 -555 -310 281 -235 -489 491 99
2285 99 -544 360 392 -389 58 836 -138 -320 485 243 -230 220 594 -350 -133 832 -261 -392 432 370 -569
2306 -569 202 268 -582 -459 182 -93 -619 140 200 -411 176 251 -310 -118 885 -95 -220 653 509 -573
2326 -573 130 812 -211 -12 849 255 -320 481 279 -517 -102 231 -500 -594 478 -3 -408 289 220 -761
2346 -761 -227 322 -82 -375 375 72 -109 302 127 -587 128 643 -177 -154 928 124 -747 281 428 -570
2366 -570 -220 739 -254 -605 514 136 -941 130 332 -701 -242 586 -122 -394 445 234 -420 153 755
2385 755 -260 -55 638 166 -269 403 156 -491 73 519 -249 112 575 -172 -614 280 -58 -1082 -296
$$ packed form
2245A39m31J14J89m36J91K57o43J32P64k49l79Q63j09r64M82Q10j017R0Q77o37
2265D3l75M11M14q31L90M82o96j46R19n12p25P47k46m30K45N91n16k54R80l92
2285I9o43R04L2p81M47P78r74j82Q05k42m73M50L74r44K17R65j093j31Q24o2r39
2306e69P71O6q50J23O41k75n26P59O0o11N87P5n61J92J003r80j25Q73j44j082
2326e73P03O82j023J99Q61n94n75Q01k02p96M15L33p31r4J072m81m05O97o9r81
2346g61N34N49m04k93P50l03j81M11j75p14P15N15q20K3J082q04q71J028J47r98
2366e70L50R59r93l51J119l78j077J071K02j033M59Q28p08k72Q39k11o54N73O02
2385G55j015K05O93m72m35O72k47o47N64M46p68L61M63p47m42Q94l38j024P86
$$ plain form
2404 -296 386 -267 -243 562 -17 -349 274 310 -454 106 556 67 -300 764 -11 -421 622 417 -390 85
2424 85 656 -327 -137 677 -180 -828 250 -4 -768 -52 291 -288 -361 273 -34 -746 391 118 -656 129
2444 129 763 5 -215 358 -86 -384 534 684 -171 -65 413 -240 -273 166 75 -346 35 271 -211 -98 396
2465 396 -218 -299 410 -151 -443 226 433 -569 -360 655 -94 -327 351 88 -437 266 576 -415 -310 335
2485 335 -32 -114 483 108 -548 258 384 -241 -58 280 -197 -504 133 137 -571 -49 340 -293 -214 502 -244
2506 -244 -318 304 432 -30 -31 359 -322 -21 340 182 -499 251 409 -143 45 465 -392 -152 484 -6 -479
2527 -479 -17 49 -264 -129 446 -282 -187 147 309 -459 283 207 -133 93 366 144 143 511 44 0 -13 83 -317
2550 -317 -197 133 -95 -243 212 -71 -372 -304 -50 -408 40 292 -324 -60 204 159 -164 37 75 59 29 246
$$ packed form
2404b96O82o53K4Q05n79l32O23L6p64N60M50m89l67J064p75m10J043k05q07M75
2424H5N71r83J90Q14q57o48J078k54p64P16L43n79p3O34l07p12J137k73p74P85
2444A29O34p58k20N73m44k98R18J50q55J06M78o53l3M39r1m21L81K36m82J13M94
2465C96o14q1P09n61k92O69K07j002K09J015p49k33O78k63n25P03L10r91J05O45
2485C35l67q2N97l75o56Q06J26o25J83L38m77l07O37Mp08N22L89o33P9P16p46
2506b44p4O22J28m62jL90o81L01L61j58o81P50J58n52J88M20q57K40O36m90m73
2527d79M62O6l13J35N75p28R5L34J62p68P42p6l40K26K73k22jL68m67m4j3R6m00
2550c17J20L30k28j48M55k83l01O8K54l58M48K52o16K64K64m5l23K01L8j6l0K17
$$ plain form
2572 246 -38 4 51 311 19 26 150 -208 -25 83 54 39 94 -212 -267 1 107 -436 -222 -23 -196 -304 162
2595 162 42 -557 136 106 -18 -34 -184 33 161 103 -60 63 208 187 -96 -226 -12 -43 154 99 -43 -214
2617 -214 -219 1 -286 -55 -109 -40 150 -104 15 -157 -115 14 -122 33 -6 -62 -66 56 84 111 123 252 -102 -117
2641 -117 99 105 -249 150 87 36 3 -168 -104 -200 37 -145 -47 196 -114 -281 -11 112 93 -60 39 -131 76
2664 76 50 -16 -56 1 63 196 167 70 20 -150 -58 -63 17 -7 -97 -220 -151 -386 60 -88 176 80 91 -146 40 140
2690 140 157 36 -77 84 107 -128 -74 225 50 47 210 47 -151 174 -156 -86 2 226 -186 -117 170 -53 -7
2713 -7 -37 -307 -107 -136 42 -122 -107 -47 -91 -135 196 -154 75 175 207 -51 51 325 33 -18 182 32 10 236
2737 236 72 -84 -158 87 -239 -103 50 11 -63 -171 -1 -241 -107 -40 -335 -29 274 -204 -193 99 92 79 180
$$ packed form
2572B46k84M2M7K60k92PJ24l58J83J08k9j5N5l06n5K68J06n43K14J99j73j08M66
2595A62j20n99O93l0j24j6j50K17J28n8j63J23J45k1k83j30K14l1J97n5j42j71
2617b14nK20k87K31n4O9J90k54J19j72M2J29j36J55l9n6mJ22K8K7J2J29l54j5
2641a17K16Ol54L99o3n1l3j71O4r6K37j82R8K43l10j67K70J23j9j53R9j70K07
2664G6k6o6m0N7O2J33k9r7n0j70R2nQ0k4r0j23O9k35M46j48K64r6J1k37J86J00
2690A40J7j21j13J61K3k35N4K99j75lJ63j63j98L25l30P0Q8K24m12O9K87k23M6
2713gl0k70K00k9J78j64J5O0m4m4L31l50K29J00L2k58J02K74k92n1K00j50k2K26
2737B36j64j56p4K45l26J36J53l9p4j08J70k40J34O7k95L06L03m78J1K92pj3J01
$$ plain form
2760 180 120 18 13 310 144 143 189 244 -232 148 370 -120 -30 -135 159 -243 -180 127 -310 -424 131 -225 -241
2783 -241 289 276 -86 117 461 -8 30 220 64 -158 408 207 19 138 118 141 -170 240 108 -327 68
2804 68 -60 -215 -128 -56 -363 -83 271 -325 -70 215 290 -195 160 247 -51 -175 296 -92 -331 139 222 -134
2826 -134 231 307 120 -110 284 173 -161 194 122 -393 -50 195 -377 -312 248 8 -483 188 96 -226 -409
2847 -409 252 -371 -119 294 98 -39 239 219 0 -54 337 -181 -244 525 3 -423 142 191 -124 23 302
2868 302 -191 -245 387 171 -250 160 259 -169 -63 372 -261 -327 331 -202 -455 38 351 -145 4 503 -219
2889 -219 -192 462 52 -239 -132 319 -168 -259 305 -281 -395 -41 -28 -437 -169 271 -294 -125 158 -266 -298
2910 -298 134 205 -408 -6 229 1 279 593 -23 -192 324 337 -350 223 102 -266 18 281 -27 -371 63
$$ packed form
2760A80o0j02nK97j66jM6N5m76L80K22m90R0j05K94m02O3L07m37j14N55l56j6
2783b41N30j3l62K03L44m69L8J90j56k22N66k01j88J19k0K3l11M10j32m35L95
2804F8j28j55Q7P2l07K80L54n96K55K85P5m85L55Q7k98j24M71l88k39M70Q3l56
2826a34L65P6j87k30L94j11l34L55p2n15L43K45n72O5N60k40m91O71r2l22j83
2847d09O61o23K52M13j96j37K78k0k19n4L91n18o3P69n22m26N65M9l15J47K79
2868C02m93n4O32k16m21M10R9m28J06M35o33o6O58n33k53M93L13m96J49M99p22
2889b19K7O54m10k91J07M51m87r1N64n86j14L54J3m09K68M40n65J69K83m24l2
2910b98M32P1o13M02K35k28K78L14o16j69N16J3o87N73j21l68K84K63l08l44M34
$$ plain form
2931 63 91 -241 -218 136 -1 -289 152 68 -344 3 59 -96 -16 397 157 6 197 128 -598 267 257 -178 -161
2954 -161 307 -146 -231 284 219 -524 89 229 -440 -241 359 -326 -212 222 -124 -215 131 16 -216 14 167
2975 167 -33 -265 196 240 -44 29 326 -145 -208 532 -51 -136 96 220 -232 259 419 -337 -60 44 -238
2996 -238 -370 71 -64 -353 -49 170 -237 -335 520 -38 40 102 -17 -271 117 477 -278 -26 399 107 -358
3017 -358 295 134 -227 -97 34 -159 -448 178 316 -424 -61 295 -193 -110 189 -21 -24 48 61 -46 175 373
3039 373 -11 8 171 -194 -337 325 296 -401 237 146 -156 89 239 -17 -200 110 106 -46 -9 -31 -295 -58
3061 -58 40 -313 -283 147 -48 -225 309 346 67 71 154 48 -108 107 363 -45 43 360 159 -66 -57 137 -104
3084 -104 73 102 -205 106 20 -136 -162 -94 23 -243 -40 40 -36 -20 195 -74 -5 -55 -75 -202 228 319 -14 48
$$ packed form
2931F3K8l32K3L54j37k88M41q4m12L47N6j55Q0M13k40j51J91o9p26Q65j0m35J7
2954a61M68m53q5N15o5p43O13J40o69J99O00o85J14M34l46r1L46j15k32K30J53
2975A67k00k32M61M4k84P3K97m71o3P40n83q5K32J24m52M91J60p56K77J04k82
2996b38j32M41j35k89L04K19m07r8Q55n58P8O2j19k54L88L60p55K52M25k92m65
3017c58O53j61l61J30J31j93k89O26J38p40L63L56m88Q3K99k10lP2J3j07K21J98
3039C73l84J9J63l65j43O62k9o97O38r1l02K45J50k56j83L10mj52L7k2k64K37
3061e8R8l53L0M30j95j77N34L7k79MQ3j06j56K15K56m08Q8L17k01k25RJ94k41
3084a04J77K9l07L11q6j56k6O8J17k66K03Q0p6J6K15k69O9n0k0j27M30R1l33O2
$$ plain form
3108 48 201 -53 -112 58 55 158 271 43 -118 -195 -99 -107 -102 -206 227 -69 -230 425 -147 -169 400 -275 24 183
3132 183 57 36 247 99 5 32 94 42 -122 195 90 98 57 291 -117 -36 111 -39 -53 -17 96 -148 95 -82
3156 -82 -306 -154 -115 -220 -16 117 181 -229 135 166 -5 -258 10 138 27 52 169 -7 -9 91 13 52 57 -173
3180 -173 -11 -118 -35 -213 -273 15 -247 -317 242 -106 -263 24 -13 7 -38 10 258 62 240 -39 206 88
3202 88 199 -9 100 29 20 -44 -2 68 -168 73 230 -219 -191 -33 -177 -229 -283 -173 -168 -4 -97 24 -20 49 57 63
3228 63 -53 5 205 81 -144 229 -80 77 -204 36 85 -5 200 -122 81 12 34 -143 -16 -153 -237 -381
3250 -381 -123 142 -293 -118 13 78 -259 -94 -54 -9 176 -159 -150 253 156 114 -137 -11 388 157 -250 77
3272 77 174 57 42 -77 -55 88 244 -87 -221 -360 -47 19 32 -149 383 232 139 71 322 -82 81 170 -22
$$ packed form
3108D8J53k54n9J70lJ03J13k28j61p7R6qNj04M33k96j61O55n72k2N69o75K99J59
3132A83j26k1K11j48r4K7O2n2j64L17j05Qm1K34m08Q1J47j50j4L6J13k44K43j77
3156h2k24J52L9j05K04J33O4m10L64L1j71k53K68J28j11K5J17j76kJ00p8L9Nk30
3180a73J62j07Q3j78o0K88k62p0N59l48j57K87l7K0m5M8K48j96J78k79K45j18
3202H8J11k08J09p1ro4M2P0k36K41J57m49K8J58j44n2n4J10NJ64r3J21m4O9QO
3228F3j16N8K00j24k25L73l09J57k81K40M9r0K05l22K03o9K2j77J27j37q4j44
3250c81K58K65m35J75J31O5l37J65M0M5J85l35RM03r7m2k51J26L99k31m07L27
3272G7R7j17j5j19K2J43J56l31j34j39L13O6J3j81N32j51r3o8K51m04J63Q9j92
$$ plain form
3295 -22 -91 -200 385 137 -52 135 50 -1 37 9 73 -38 128 -134 -9 34 -115 -246 49 -34 27 -39 71 38
3319 38 -78 -125 135 34 171 -12 179 101 294 62 -218 209 0 -347 -186 0 -186 -28 94 64 -84
3340 -84 58 -71 -46 -50 -22 -46 -67 -70 -94 -6 148 17 -88 -98 -133 61 103 189 -75 2 8 -11 -96 121 53 -206 -284
3367 -284 306 -168 -377 11 71 -158 3 -10 -111 13 45 163 -27 -116 65 -59 72 97 44 54 336 -27
3389 -27 -246 -46 -143 -112 -76 111 -208 17 13 -169 -228 203 -49 -295 -135 125 -77 48 -16 -6 -184 88 346
3412 346 -110 48 154 -95 41 160 80 28 145 233 20 -150 212 -130 66 99 -35 -301 199 -45 -264
3433 -264 -61 46 -49 -417 -205 -92 -231 121 57 -170 -217 -68 -173 -102 304 -50 -157 50 100 -42 68 245
3455 245 -98 -151 269 -229 -265 10 298 -134 -260 132 -61 -54 -278 51 -106 -43 19 -54 -288 -169 -186 -123 215
$$ packed form
3295b2o9j09N85k48j89J87q5n1L8k8O4j11J66k62J25M3j49j31K95q3O1o6J10l3
3319C8j16m7K60j01J37j83J91p8J93k32k80M27k09l47J61J86j86J58J22l0j48
3340h4J42j29K5mK8k4k1lk4Q8J54j31j05j0l5J94M2Q6k64P7Oj9q5K17o8k59p8
3367b84N90m74k09L88O0k29J61j3j01J24L2J18j90q9J81j24J31K5n3J0K82l63
3389b7k19K00r7L1L6J87l19K25mj82n9M31k52k46J60K60k02J25o4J0j78K72K58
3412C46m56J58J06k49J36J19q0n2J17Q8k13j70L62l42J96L3j34k66N00k44k19
3433b64K03J07r5l68K12J13j39L52o4k27m7J49j05P1M06l54j07K07N0j42J10J77
3455B45l43n3M20m98l6K75K88m32j26L92j93Pk24L29j57O3O2p3k34J19j7O3L38
$$ plain form
3478 215 79 35 98 275 29 -427 90 -171 124 170 18 -219 -167 45 -89 -126 111 113 -73 -4 65 -63 -151
3501 -151 457 -102 -57 -6 -28 -392 -85 146 -122 17 195 -214 15 239 199 -215 73 61 -116 -90 175 10
3523 10 -303 -57 103 -52 -243 119 125 -74 -57 -42 -169 117 -125 220 -10 103 9 -173 86 -331 -206 115
3545 115 -90 264 -150 70 7 89 182 7 -15 41 153 -16 185 92 113 -23 136 -335 -226 48 188 -149
3567 -149 1 153 -189 -206 223 -16 86 134 29 32 -106 203 140 -28 -55 -76 -51 95 68 -155 -243 137 -48
3590 -48 80 23 -132 -85 -197 -100 84 52 265 -288 35 -128 -43 126 197 63 -255 -110 -19 -9 -262 64 136
3613 136 -76 -71 243 13 -166 -159 -13 -150 79 174 -7 79 11 48 18 15 -90 -39 301 88 -98 -190 264 161
3637 161 102 252 100 -16 141 144 -98 63 142 119 -125 275 68 -101 252 -42 -428 89 -111 -120 56 268
$$ packed form
3478B15j36m4O3J77k46m56N17k61K95M6j52k37N2K12j34l7K37Kj86O9O9j28q8
3501a51O08n59M5N1k2l64L07K31k68J39J78m09K29K24m0m14K88j2j77K6K65j65
3523A0l13K46J60j55j91L62Oj99J7J5j27K86k42L45k30J13r4j82K59m17J25L21
3545A15k05L54m14K20o3Q2R3j75k2N6J12j69K01r3K1j36J59m71J09K74J40l37
3567a49J50J52l42j7M29k39J02M8j05Lj38L09o3j68k7k1K5J46k7k23q8L80j85
3590d8J28n7j55M7j12R7J84l2K13n53L23j63Q5J69P1j34l18J45R1J0k53L26P2
3613A36k12NL14k30j79PJ46j37K29R5j81Q6o8L7l0lj05N1L40k13j86r2M54j03
3637A61n9J50j52j16J57Lk42J61P9k3k44M00k07j69L53k94l86N17k00rJ76K12
$$ plain form
3659 268 -38 -360 130 -4 -185 -202 115 191 26 276 -160 -99 285 -78 -161 -191 88 -9 233 114 39 -196
3681 -196 8 -134 -399 -112 168 -114 -87 96 -51 -71 11 0 -58 -103 -59 412 129 177 -90 -76 107 -203 -47
3704 -47 57 103 62 122 256 213 -88 -70 89 -86 -155 -112 -8 -73 5 -27 -149 -43 -177 97 -199 115 58 -338
3728 -338 -126 -1 -15 148 245 162 216 240 130 120 143 238 -79 10 107 70 -215 142 -4 -213 159 -92 -97 -12 -118
3753 -118 12 -203 -165 52 -226 -63 -69 130 -64 103 41 111 14 -34 -156 -157 -7 -96 100 -196 -109 20 288 90
3777 90 109 -174 157 -40 -150 -139 -14 56 77 -73 -10 -24 -244 63 224 67 115 40 109 297 -80 6 -82 -37
3801 -37 114 -31 53 43 26 -105 66 -92 -50 -244 -42 8 -232 -38 -42 44 -111 86 -202 90 93 -73 63 244
3825 244 44 -56 -12 -137 133 -76 2 -126 2 88 48 -127 -101 -95 -238 -40 41 102 -9 -30 -82 -22 -133 -314
$$ packed form
3659B68l06l22M90j34j81j7L17P6j65K50m36O1L84l63q3l0K79r7K42j19p5k35
3681a96K04j42k65K87K80k82K7J83j47k0Q2j1n8m5M4M71k83M8k67J4J83l10J56
3704d7J04M6m1O0J34m3l01J8J59j75o9M3J04o5P8l2j22J06j34K74k96L14n7l96
3728c38K12J25j4J63R7q3N4K4j10j0K3R5l17Q9R7l7k85L57j46k09L72k51nQ5j06
3753a18J30k15L8K17k78J63oJ99j94J67o2P0r7m8j22jJ50q9J96k96Q7J29K68j98
3777I0J9k83L31j97j10J1J25P0K1j50O3j4k20L07J61j57M8p5O9J88l77Q6q8M5
3801c7J51j45Q4j0j7j31J71j58M2j94K02N0k40J94mQ6j55J97k88K92Lj66J36J81
3825B44k00j00M4j25K70k09P8j28J28Q6m0j75K6Oj43J98Q1O1j11k1n2O0j11j81
$$ plain form
3849 -314 9 -165 53 255 112 -123 -208 -13 99 -127 -39 -104 167 -74 -62 99 -137 81 60 -68 -230 -156
3871 -156 99 -59 -27 11 134 -190 -234 -197 43 134 -22 -36 146 174 -65 -103 272 -255 10 50 92 -63 69
3894 69 90 65 -283 -67 -20 79 58 -41 131 35 -132 -55 51 77 70 -59 162 351 -75 80 68 70 -156 98 93 94
3920 94 155 167 270 151 216 -98 173 197 35 127 195 -116 -63 -31 61 -312 -123 168 262 -78 25 1 -50 -3 230
3945 230 134 -61 -69 93 -104 -18 -6 -156 177 52 12 44 -101 -41 -17 -11 193 -36 95 54 -16 -66 333 178 -98
3970 -98 20 -91 -172 -5 9 -55 -223 -127 166 -236 14 -39 7 249 -18 8 -34 38 2 52 134 38 2 -109 51
3995 51 -134 -159 -14 130 20 71 178 -230 -51 77 187 -143 259 188 -175 205 163 -61 -172 56 -75 138
4017 138 2 -82 -51 173 360 -54 -73 57 -10 -273 28 11 -18 -297 67 -131 159 7 2 -102 288 83 13
$$ packed form
3849c14L23j74K18K02j43k35q5J95J12k26Q8o5K71k41J2J61k36K18k1j28j62P4
3871a56K55j58L2L8J23l24m4L7K40R1j56j4J82K8k39l8L75n27K65M0M2j55J32
3894F9K1k5l48K16M7R9k1r9J72r6j67P7J06K6pj29K21J89m26J55j2Kk26K54nJ
3920I4O1J2J03j19O5l14K71K4j62R2O8l11N3L2R2l73J89K91R4l40J03k4n1M7K33
3945B30r6j95qJ62j97Q6J2j50L33j25m0L2j45O0K4OK04k29J31m1p0n0L99j55k76
3970i8J18j11q1J67J4o4j68R6K93m02K50n3M6K42k67K6m2P2l6N0Q2r6l6j11J60
3995E1j85k5J45J44j10N1J07m08J79J28J10l30M02p1l63L80m2k24j11K28j31K13
4017A38j36q4L1K24J87m14j9J30o7k63L01j7k9k79L64j98K90j52nj04L90k05p0
$$ plain form
4040 13 45 -78 -51 44 133 134 130 163 242 -60 -84 278 157 70 116 30 7 -16 145 -21 -32 -10 -37 -378 157 124 -190
4067 -190 101 57 -75 -207 199 16 9 109 -9 61 85 172 125 -53 103 -16 -135 -2 79 -244 -54 30 -212
4090 -212 -170 171 310 7 112 65 -19 -79 -43 73 -220 134 -53 -155 213 53 -272 57 169 -27 -239 182
4112 182 238 -10 -151 234 7 -10 20 215 -208 105 132 13 250 106 25 -148 76 -126 -52 97 155 -120
4134 -120 60 424 110 -65 72 -21 71 278 189 -140 -39 -42 2 233 324 77 -27 -93 38 -37 111 68 55 -205
4158 -205 -114 99 -67 -21 -1 -174 204 -234 -147 -14 95 -150 -128 129 -140 -65 -53 205 -13 0 11 214 27
4181 27 24 -34 -151 112 138 -208 -101 161 -72 -257 -41 -154 78 32 18 219 -167 163 -185 -33 145 83 166
4204 166 -151 -54 -60 -125 77 217 -53 80 108 -11 10 -83 114 -200 134 88 -188 131 -19 225 17 146 91
$$ packed form
4040A3L2j23K7R5Q9JmL3P9l02k4L62j21q7M6q6k3k3J61j66j1K2k7l41N35l3l14
4067a90K91m4j32j32M06j83pJ00j18P0K4Q7m7j78J56j19j19J33Q1l23J90Q4k42
4090b12M2L41J39l03J05m7q4o0L6J16k93L54j87j02L68j60l25L29J12j96k12M21
4112A82N6k48j41L85k27j7L0J95m23L13K7j19K37j44q1j73K24k02P4J49N8k75
4134a20J80L64l14j75J37r3R2K07q9l29J01lM4K31R1k47j04o6J31p5J48m3j3k60
4158b05R1K13j66M6K0j73L78m38Q7J33J09k45K2K57k69P5J2K58k18J3J1K03j87
4181B7ln8j17K63K6l46J07K62k33j85K16j13K32m6j4K01l86L30l48J52J78o2Q3
4204A66l17R7oo5K02J40k70J33K8j19K1r3J97l14L34m6k76L19j50K44k08J29n5
$$ plain form
4227 91 -249 151 -20 43 9 139 -166 2 61 16 -285 2 9 10 341 119 -52 28 372 -31 -170 25 -302
4250 -302 -35 -77 -94 106 -55 209 -140 58 -98 79 106 257 -22 92 128 56 49 179 41 -169 -100 12 -138
4273 -138 -285 -90 46 317 46 -52 -123 -29 168 142 -141 -66 -346 -37 -20 -62 135 -241 139 -25 -23 35 -57 -56
4297 -56 22 -38 255 64 -40 -141 11 -30 44 76 -162 176 75 -141 -55 74 -396 43 -134 -18 -106 21 -40
4320 -40 32 -27 -187 27 -10 182 -166 -24 267 174 140 109 -86 -1 -37 75 -3 172 42 34 32 79 279 7 -186
4345 -186 -191 52 45 -107 56 -53 -48 162 -47 89 14 119 -33 40 -166 19 44 -36 -94 -74 240 -62 91 -3
4369 -3 18 19 -145 -6 -47 -273 11 -11 -37 133 26 -125 -123 -114 73 76 -105 64 -37 -50 -13 34 -136 185 212 46
4395 46 -25 -29 -91 71 187 134 -145 168 231 167 -119 -11 -61 39 -158 -55 165 24 153 -26 -53 91 -7 294
$$ packed form
4227I1l40M00j71O3l4J30l05J68N9m5l01K87PJL31k22j71Q0L44m03j39J95l27
4250c02K67m2j7K00j61K64l49J98j56J77K7J51k79J14L6p2pJ30j38k10O9J12j50
4273a38j47J95J36K71k71r8p1R4J97k6k83P5k80L09J7m2J97l76L80j64KN8r2J
4297e6P8o0K93j91j04j01J52m1P4L2k38L38j01k16Q6J29m70M39j77J16q8J27o1
4320d0P2n9j60K14l7J92l48J42K91r3l4l1j95Q5l6J12p8J75j30qkM7K00k72j93
4345a86nK43pj52J63j09NK10k09J36p5J05j52P3k06J85K5q0n8K0L14l02J53r4
4369cK1Jj64J39m1k26K84k2k6J70j07j51KRJ87Lj81J69j01j3L7M7j70L21K7j66
4395D6p1mo2J62J16n3k79L13O3o4k86J08n0J00j97J03K20j41J29j79k7J44r8L01
$$ plain form
4419 294 230 248 71 -117 130 405 39 4 -176 -34 88 -31 113 40 10 87 -7 -92 131 53 -247 70 138
4442 138 -98 -143 69 79 198 -198 130 -383 -155 65 -25 60 -6 210 -70 -67 36 194 32 189 -110 150
4464 150 175 -50 2 58 -185 106 33 100 -174 -19 162 373 56 43 207 127 -101 -99 80 -5 112 -299 131
4487 131 54 -54 31 31 42 -179 -300 -25 14 -161 150 183 115 -1 -89 -200 -232 -234 146 -280 -139 -130 29 115 -5
4512 -5 -231 61 -125 -138 40 287 164 80 111 110 383 -150 -124 61 -60 -204 18 -69 -29 102 40 -49 15 12 -277
4537 -277 -10 421 102 -154 37 84 -17 37 268 -28 -87 85 28 49 19 79 198 166 -14 -69 69 127 -64
4560 -64 -338 50 64 -145 76 -27 179 118 -52 -180 -166 70 -111 -48 -40 15 -150 -36 41 -118 82 79 -41 -51
4584 -51 -211 -74 114 -31 169 -14 -209 -30 -143 -194 103 63 -306 -290 -37 29 -226 13 -36 -156 -208 212
$$ packed form
4419B94o4J8j77j88K47K75l66l5j80J42J22j19J44p3l0P7r4q5K23p8l00L17O8
4442A38k36m5K12J0J19l96L28n13K28K20r0Q5o6K16k80LJ03J58j62J57k99K60
4464A50K5k25N2N6k43K91p3O7k74J55J81K11l17j3J64q0k28KJ79q5J17m11M30
4487A31p7j08Q5%J1k21j21K75L9j75L11L3o8j16q8j11l2kL80m26J41RJ59Q6j20
4512ek26K92j86j3J78K47j23q4L1jK73n33K6J85j21j44K22q7M0J31o2q9O4lk89
4537b77K67M31l19k56J91M7j01N4K31k96n9J72n7K1l0O0J19l2j80n5J38N8j91
4560f4k74L88J4k09K21j03K06o1j70j28J4K36j81O3QN5j65J14P7j59K00lj20j0
4584e1j60J37J88j45K00j83j95J79j13n1K97m0l69J6K53O6k55K39m9j20n2M20
$$ plain form
4606 212 -330 -52 90 -46 -78 304 -49 -102 -86 251 173 -48 -27 130 2 110 -12 -174 58 -184 -114 -35
4628 -35 186 1 -27 -195 150 -250 -164 -14 -108 -255 -47 -170 -27 117 148 -44 11 -17 -103 -6 257 -95 29
4651 29 158 83 -232 31 -129 -77 -15 175 44 -372 -40 -4 -113 128 112 151 -137 -62 58 -154 7 101 75
4674 75 210 192 51 -178 104 -40 60 -205 20 -251 -104 228 -171 129 -21 -12 -177 168 -24 -258 -96
4695 -96 51 -150 -229 63 -34 -122 -7 70 -74 -90 263 136 50 149 -112 -93 -115 212 34 -299 -64 -20 -232 -90
4719 -90 -36 -230 183 187 -22 21 183 57 -228 -163 -130 59 312 146 -234 272 75 -71 -205 -261 -52 -30 266
4742 266 100 58 -106 255 -44 -208 -24 22 64 37 59 -321 67 -120 143 -58 54 -1 -95 -8 -10 9 49 99
4766 99 84 -36 44 141 60 -144 188 38 -45 -54 -17 -183 -151 58 213 -234 6 -79 -339 38 -2 16 -8 168 -189
$$ packed form
4606B12n42K78J42j36l2L82l53n3J6L37p8k21K1J57j28J08j22j62K32k42P0P9
4628c5K21j85k8j68L45m00Q6J50r4j47K08j23J43J44L1j92N5k8q6R7K63l52J24
4651B9J29p5l15K63j60N2O2J90j31m16L32L6j09K41j6L9k88P5J20k12J61R4k6
4674G5J35j8j41k29K82j44J00k65K25k71J47L32l99L00j50Rj65L45j92k34J62
4695i6J47k01p9K92r7q8J15P7j44j6L53j27q6R9k61J9k2L27j78l33K35M4k12J42
4719i0N4j94M13Mk09M3J62j26k85O5L3J89K53j66l80N06j97j46j34n6K09K2K96
4742B66j66m2j64L61k99j64J84M6M2k7K2l80L88j87K63k01J12n5r4Q7kJ9M0N0
4766I9j5j20Q0R7q1k04L32j50q3rL7j66L2K09J55m47K40q5k60L77m0J8k4J76l57
$$ plain form
4791 -189 -86 35 -60 -206 18 368 -185 23 -74 106 -26 253 31 39 -70 149 -121 -95 -52 153 -47 51
4813 51 -76 -120 73 -91 167 -162 226 -117 113 -232 157 -191 -53 135 -79 55 306 78 -92 112 57
4834 57 -84 86 322 30 -47 -127 55 71 210 23 13 -137 -92 -35 -161 -73 -35 142 45 -150 -152 22 125 49
4858 49 -56 196 60 -106 131 -146 4 42 58 101 -74 334 -30 10 7 -1 18 -337 64 -28 -103 -112 15 61 55 89
4884 89 148 70 161 -150 122 -15 -115 85 -147 0 232 136 -13 -88 2 -114 27 170 -48 -1 -46 -97 -154 51
4908 51 -50 142 -10 -79 189 101 93 138 -10 136 -15 170 -13 74 -126 83 -15 61 151 -84 28 116 252 230
4932 230 -12 -92 -6 110 -120 241 -5 -16 -103 221 -25 -31 -101 78 -368 135 22 67 284 -77 -63 -173 -30
4955 -30 -83 -79 213 -94 146 163 -34 214 58 -8 -204 -83 -290 81 -152 266 -167 -200 128 -84 153 70 -11
$$ packed form
4791a89J03J21r5j46K24L50n53K08r7J80j32K79k22Qj09K19k70K6M3K05k00R8
4813E1j27m4J93j64K58l29L88l43K30l45L89l48J38J88k14J34K51k28j70K04n5
4834E7j41J70K36k92p7q0J82J6J39j87j0j50M5N7j26Q8L8J77r7j95kJ74J03p6
4858D9j05K52j36j66K37k77J50L8J6M3j75M08l64M0lqJ9l55M01r2p5rJ27M6oL4
4884H9N9p8R1l11K72j37j00K00k32J47K32r6j49p5R0j16J41J43k18M7m5n1n7K05
4908E1j01J92j52o9K68q8qM5j48J46j51J85j83Q7k00K09r8P6R0k35J12Q8J36k2
4932B30k42q0Q6J16k30L61k46j1q7L24k46op0J79m46N03j13M5K17l61J4j10J43
4955c0n3MK92l07K40J7j97K48j56o6j96J21k07L71k33M18m33l3L28k12K37q3q1
$$ plain form
4978 -11 51 -232 85 51 -18 4 150 -133 -267 -152 -187 104 43 -68 -142 -153 -54 -128 221 44 25 -43 387 -239
5002 -239 -137 6 -73 -18 19 284 107 -95 -124 183 25 -50 -188 -55 49 94 -22 259 -135 127 312 -108
5024 -108 -41 -251 -170 162 -146 45 67 -139 -158 -90 -185 80 13 141 82 -157 61 166 -125 -22 184 183 -77
5047 -77 120 13 -21 109 258 342 -137 61 -108 -198 16 -251 -105 -142 -115 -30 19 27 -99 -159 99 210 -5 139
5071 139 171 88 -15 -144 -11 261 -199 234 -54 -381 86 -193 -152 -3 33 85 -165 45 -144 95 -71 74
5093 74 -1 31 109 39 57 -16 94 -48 15 143 199 52 38 -55 81 -29 -31 -109 213 120 49 302 119 -194 18
5118 18 296 202 -87 -58 0 -203 -92 -39 -218 -33 8 2 193 -157 -86 -8 23 0 -110 -118 163 -77 101 -60 -28
5143 -28 -47 -176 285 36 191 88 -54 -162 12 -14 -41 264 102 -67 -390 109 28 -262 -65 -77 112 224
$$ packed form
4978a1O2k83L17l4o9K2J46k83j34J15l5K91o1j11p4j1R9p4L49j77j9o8M30o26
5002b39J02J43p9N5L7K65j77k02k9L07j58p5j38J33J04M5j16K81l94K62J85m20
5024a08O7k10Q1L32l08J91K2k06j9O8r5K65o7J28n9k39K18J05k91J03K06jk60
5047g7J97j07l4J30J49Q4m79J98j69r0K14k67J46l7K7Q5M9Qj26o0K58J11k15J44
5071A39L2q3j03j29J33K72m60M33k88l27M67k79M1J49L6N2k50K10j89K39j66J45
5093G4p5L2P8p0J8p3J10j42O3J28N6j47j4r3J36j10kp8L22r3p1K53j83l13K12
5118A8K78r4k89K9N8k03J11N3j79J85M1oJ91l50P1P8L1k3j10qK81k40J78j61L2
5143b8j9j29M61k49J55j03j42j08J74k6k7L05j62j69l23M99q1k90J97j2J89J12
$$ plain form
5165 224 -9 -89 13 139 -149 71 -86 212 38 206 -69 -90 31 249 -114 -46 246 59 78 -68 -51 -55
5187 -55 -128 -136 11 70 242 -35 -37 -123 3 -8 -33 -152 68 -31 6 65 -92 162 13 57 136 49 137 -27 100 129
5213 129 159 -134 -44 83 -92 32 -119 -34 201 71 166 -215 106 -87 -91 50 179 217 125 4 -202 84 -93
5236 -93 -29 3 -7 157 -135 -36 201 -168 7 164 198 25 139 150 61 182 60 39 -5 140 2 127 -133
5259 -133 11 36 -136 155 -1 -195 124 277 -67 -111 -23 -191 -182 -83 216 -168 -45 -213 -327 192 204 -156
5281 -156 -106 -49 -169 -248 292 118 -4 -263 34 -1 -62 179 -75 -164 29 101 43 120 3 -228 28 37 -15 -224
5305 -224 -15 199 -191 140 -89 -189 6 -299 96 84 237 -133 -119 165 -58 -1 21 177 134 -23 10 41
5327 41 -106 65 70 11 4 105 146 -288 -36 224 84 -119 91 77 -109 85 174 -62 207 78 8 -136 20
$$ packed form
5165B24k33q0J02J26k88K20j57K98j74J68k75k1J21K18l63O8K92j87J9j46J7m
5187e5p3qJ47N9J72k77kq6J26j1k5j19K20r9L7N9j57K54j49M4P9q7Q8j64J27K9
5213A29L0k93R0J27j75J24j51Q5K35j30R5l81L21j93mJ41J29L8r2j21k06K86j77
5236i3O4L2j0J64k92R9K37l69J75J57L4j73J14J1q9J21j22k1m4J45j38J25k60
5259a33J44K5j72K91j56j94L19J53l44m4Q8j68RR9K99l84J23j68j14N19J2l60
5281a56N0N7j20p9N40j74j22k59K97l5o1K41k54q9J93P2n8P7j17k31K56Rn2k09
5305b24K09K14l90L31k29j00J95l05L95j2J53l70J4K84k23N7K2J56m3j57L3L1
5327D1j47J71Nn9pJ01M1m34K52K60j40k03K10j4j86J94Q9k36K69j29p0j44J56
$$ plain form
5350 20 -124 -232 -1 -7 -51 -31 207 -141 -223 20 139 -131 -10 21 -35 283 95 -65 -52 44 -286 77 115 250
5374 250 -72 156 -68 -2 136 -68 161 -8 -1 168 133 -28 103 45 220 83 78 85 -5 125 -64 188 -63
5397 -63 16 -255 -144 291 -93 316 36 -140 188 78 204 13 62 -112 -170 -93 -190 -28 92 39 -66 -4 -82
5420 -82 131 130 -232 22 91 123 -92 99 89 -53 -9 -166 87 -160 -166 -240 -143 -95 -150 136 -257 -149 79 148 3
5445 3 86 116 -340 57 55 8 155 96 170 90 -200 106 -26 107 -49 -132 110 69 -80 73 -2 35 238 303 77
5470 77 -3 7 -76 -33 104 31 -12 48 10 160 97 -52 46 -38 -186 -60 19 -8 -16 120 39 26 -47 69 136 137 -37
5497 -37 -173 -85 -48 73 -44 4 -193 240 187 134 -68 202 -33 -197 13 -155 -261 -157 109 163 -147 20
5519 20 124 124 195 -7 -32 31 -32 114 195 -47 62 -37 152 -30 186 -4 -81 161 172 -125 -169 157 16 -92
$$ packed form
5350B0j44j08K31om4K0K38l48q2K43J19k70J21L1n6L18j88j60J3R6l30L63L8J35
5374B50l22K28k24O6J38k04K29j69PJ69l5j61J31n8J75j37nPr0J30j89K52k51
5397f3P9k71J11M35l84M09k80j76L28j10J26j91M9j74n8P7r7J62J20n3j05O2p8
5420h2K13jl62K54O9L2k15J91j0j42M4j57K53k47op4R7M8n5K86l93J08K28O9j45
5445CQ3L0m56L97km7J47n9P4q0k90L06j32J33j56q3K42m1j49J53p5L7K03O5k26
5470G7q0J0q3M3J37p3m3O0l8J50o3j49R8q4j48J26P9k7qJ36q1j3p3J16O7Jj74
5497c7j36Q8L7J21j17M8j97M33n3n3k02K70k35j64K10j68j06J04K66N4l10J67
5519B0J04%P1k02k5O3o3J46Q1k42J09r9J89j82K16j90p7K42J1k97m4L26j41j08
$$ plain form
5543 -92 -121 109 124 20 -67 -95 31 97 106 -7 -143 47 239 57 -64 34 -40 -14 -46 116 -41 15 -213 -262 -47
5568 -47 101 -21 -213 -103 43 -189 -106 264 4 -107 -9 91 -52 79 254 81 90 54 33 174 -175 51
5590 51 41 27 -71 -99 67 -216 -103 244 -183 -21 -75 -36 -34 144 -168 122 191 -84 172 139 -92 68 -171 -146
5614 -146 -98 -128 5 11 -38 -65 -44 59 -114 -56 -66 102 91 -123 -118 -326 47 -9 -58 131 52 55 -32 97 -17 79
5640 79 83 -205 56 -126 -181 41 282 250 138 -217 76 90 -221 53 21 -24 64 108 28 -51 -101 -85 -70 -46 20 -23
5666 -23 63 7 -36 7 -12 44 -193 -1 -188 25 -58 -133 -134 2 -28 -306 277 193 -196 -15 -255 -88 63 -4 28
5691 28 29 19 -302 48 86 -55 -313 -24 10 -362 -36 -70 107 10 -22 -467 -4 -69 -86 -35 193 -101 5 -182
5715 -182 -36 65 -30 -1 66 -70 -101 101 -242 230 305 91 -135 6 31 -242 -99 -6 -163 -118 129 43 5
$$ packed form
5543i2k9K30J5j04q7k8J26O6Rj13j36J90J92j82j21R8p4K6l2J62j57N6k28m9K15
5568d7J48j22j92J10J46k32Q3L70k60j11R8J00j43J31J75j73Rl6k1J41l49K26
5590E1j0j4r8k8J66k83J13L47m27J62n4L9KJ78l12K90O9k75K56l3k31J60k39K5
5614a46M8l0J33Om9k7K1J03j73N8j0J68j1k14Nk08L73n6m9J89p9Lq7J29j14R6
5640G9Mk88K61j82n5K22K41l2j12l55K93J4l11K74l2m5Q8M4q0p9n0J6J5K4O6m3
5666b3Q6n6m3M3j9N6k37J92j87K13q3p5jJ36l0k78N83q4l89J81k40J67J51o7L2
5691B8Jj0l21L50L8j41k58K89L4l72L26l4J77r7l2m45M63o5j7N1K28k94J06j87
5715a82J46J01r5K9O7j36l1K02l43M72P5k14k26J41K5k73J43R3j57M5K47q6l8
$$ plain form
5738 5 83 -136 53 -89 -77 -97 221 -123 20 58 -154 -186 -5 -62 29 -155 -253 122 39 102 -129 -74 20 -153 9
5763 9 59 -141 214 42 -80 26 -174 22 40 -55 8 112 126 -108 33 -147 152 192 -69 -28 -43 46 69 130
5787 130 -97 121 -135 122 200 -288 -129 -5 31 -103 -79 -213 -76 120 -116 264 8 -64 62 84 85 22 169
5810 169 179 -73 58 -3 -196 -85 237 112 81 -209 -163 -60 -49 48 -86 -17 -41 134 -74 200 197 -40 -69 10
5834 10 -270 2 -42 -95 -15 217 2 -81 24 -323 -63 -24 -209 18 36 81 155 -6 -45 90 -73 -19 167 -156
5858 -156 -19 -104 74 -3 174 50 -43 19 245 -179 -271 190 89 196 -60 -56 -187 -107 -225 -121 148 36 69
5881 69 212 201 84 -30 -270 24 -195 -140 28 36 -50 123 -4 -170 -56 169 -161 47 113 -33 -292 -162
5903 -162 247 -98 -66 136 143 98 -98 146 -84 -118 151 -8 221 4 -19 300 32 168 278 -187 -61 -11
$$ packed form
5738EP8k19J89j42J2k0L18l44J43L8k12l2J81n7R1j84r8L75q3O3k31N5R4j73J62
5763IN0k00L55j72j22J06k00J96J8r5O3J04J4k34J41j80K99M0k61M1j5Q9K3O1
5787A30k27K18k56K57P8m88J59J24L6j34K4j34J37J96k36L80k56p2J26K2Jo3J47
5810A69J0k52J31o1j93J11L22j25l1k90M6J03J1R7j34O9k4J75k08K74lk37k9P9
5834A0k80K72m4n3Q0K32k15q3J05l47K60L9j85K27J8M5P4j61l9J35j63N4J86l23
5858a56J37q5J78p7J77j24r3O2K26m24r2M61j01J07k56Mj31Q0j18J04K69j12L3
5881F9J43j1j17j14k40K94k19N5J68Qq6J73j27j66J14K25l30K08O6j46k59J30
5903a62M09l45L2K02Pm5j96K44k30l4K69j59K29k17k3L19k68J36J10m65J26N0
$$ plain form
5925 -11 -66 -24 -78 36 -77 -75 -72 255 289 -157 35 3 -107 20 124 1 -157 -114 36 -109 -22 72 229 -31
5949 -31 -168 -9 -32 -134 -177 -12 -39 48 182 32 -48 101 -140 150 23 -60 -6 79 -21 -61 -145 160 -365 -63
5973 -63 -60 177 -243 16 -166 -86 -243 215 74 65 193 -38 110 9 -116 -4 96 41 -115 -114 -157 -215 -18 -7
5997 -7 -139 -227 -8 -32 -290 -137 -58 33 -50 149 -117 -4 4 44 31 122 -157 -109 -68 107 -78 -168 74 4 -236
6022 -236 66 83 -183 125 -48 74 27 -64 -79 85 -60 89 -50 88 15 -117 168 -157 -20 94 -89 205
6044 205 -96 238 -189 185 149 124 -140 -106 -116 136 -10 -224 131 82 -64 -12 -89 -62 -76 167 -146 44 53 -238
6068 -238 66 51 153 -75 44 56 -25 115 -37 14 -75 133 24 154 -221 -212 -82 -47 -118 -72 -189 -12 -165
6091 -165 67 -16 -36 -64 -186 197 44 86 -64 -306 99 -26 -37 -201 45 50 106 -145 71 49 -161 -41 -140
$$ packed form
5925a1n5M2n4J14j13KLL27L4m46J92l2j10J27J04j23j58M3J50j45Q7R4J57k60
5949c1j37J59k3j02m3J65k7Q7J34j50q0J49k41K90j27q3N4Q5j00m0q4L05n25L02
5973f3LK37m20K59j82Q0j57M58j41rJ28k31J48j01j25J12J00n5j56Jm3n8J97J1
5997gj32q8K19k4k58J53P9R1q3J99k66J13QM0j3R1k79M8M1J75j85r0K42p0k40
6022b36L02J7k66L08j73J22m7r1j5J64j45J49j39J38p3j32K85l25J37J14j83K94
6044B05l01L34m27L74l6k5k64L4j0K52j46k14L55m9j46N2p7K7j4K43l13J90Rk91
6068b38L04j5J02k28J19J2q1J40j52N1q9K08j09J30l75RJ30L5p1M6j17J77j53
6091a65K32q3k0k8j22L83j53M2j50k42M05j25j1j64K46NN6k51K16k2k10J20r9
$$ plain form
6114 -140 -95 -150 -107 103 52 -156 249 45 261 -34 -84 52 20 -85 -18 7 -82 -46 21 -37 -113 -86 -93 -187 -27 9
6140 9 -56 -228 -328 72 26 -82 106 172 74 54 10 50 -38 69 -5 -52 63 197 2 -14 68 34 -195 -115 29
6165 29 -52 -76 69 -121 99 146 -125 -49 -34 136 56 -1 48 101 107 317 35 29 -61 5 237 130 -242 -39 10 -35
6191 -35 21 34 261 41 236 -173 174 232 30 -24 -112 -129 -94 -22 80 137 -36 118 150 -84 174 -89 -65 -96
6215 -96 8 134 -249 209 -226 -124 -44 -110 132 8 -181 152 -146 26 -3 58 -99 -51 -41 -143 109 107 -41
6238 -41 -142 214 -106 -35 157 -278 -66 -267 -86 128 133 -103 -103 -96 -138 -28 -51 138 173 6 44 -236 -50 71
6262 71 64 109 -158 -34 -87 -80 -8 37 -253 -12 34 75 38 -63 -71 -128 96 -35 5 180 49 8 -99 23 147 23
6288 23 117 154 -55 -10 72 -152 -101 143 -296 79 72 -290 92 88 98 -16 -134 0 154 -124 112 70 166 144 -13
$$ packed form
6114a40M5n5M3K10n1k08M05k04K16k95n0J36l2j05O7K5q9L6O7n8p6K7pr4J60L6
6140Io5j72j00M00m6j08J88O6r8k0m4M0q8J07p4m7J15J34j95j6Q2l4k29Q0J44
6165B9q1k4J45j90K20M7k71P6J5J70q0n7M9N3OK10k82or0O6K32j07l72K03M9m5
6191c5N6J3K27k20J95m09L47N8k02n4q8j7L5P2J02N7j73J54L2k34K58k63K4l1
6215i6J04J26l83M58m35J02Q0o6K42j24j89L33k98J72k9O1j57M8J0j02K52kj48
6238d1j01L56l20P1J92m35K12k01J81K14Nk36%Pm2J10k3J89L5j67L8k80J86J21
6262G1pM5k67J24n3PP2M5k90K41M6M1l7j01qn7K24j31M0J75j31m1j07J22J24j24
6288B3R4L7k09M5Q2k24N1K44m39L75pl62L82mJ0j14j18J34J54k78K36m2R6k2j57
$$ plain form
6313 -13 -250 -62 84 190 -12 -107 -61 109 29 -26 407 -29 115 -313 -78 62 -192 -219 208 34 30 -116 -270
6336 -270 0 -202 3 208 82 219 50 -45 121 145 125 20 81 70 -16 57 96 116 -153 65 79 -134 -132 -130 -273
6361 -273 151 24 -4 -88 17 138 44 -15 -24 -19 86 73 -120 -155 -261 67 -32 124 -192 -322 -266 -222 54 -25 -146
6386 -146 8 -106 -103 123 -67 228 -49 -74 16 97 -30 1 -42 147 81 196 -61 -19 -229 10 11 109 1 135
6410 135 -218 -86 -36 214 143 -166 30 -153 48 0 -92 -12 -1 -36 76 10 102 31 -157 260 179 -59 -180 -50
6434 -50 46 -98 366 -65 -81 62 -208 -72 85 -21 21 -167 -173 -242 -40 -64 -107 50 166 219 178 -187 -50 -55
6458 -55 91 -53 96 -22 77 97 105 3 166 -44 -154 -93 -111 -10 259 -36 -92 92 29 -72 -265 -106 127
6481 127 -22 14 32 -14 41 90 94 -111 291 -24 -182 -32 -126 131 -116 123 -31 -184 24 -141 -67 -60 43 -13
$$ packed form
6313a3k37J88J46J06k02r5M6J70q0n5M33m36J44m28K35J40k54k7M27j74mj46j54
6336b70K70k02K05K05j26J37j69r5J66K4k0j05O1j1q6P3L9K0k69K18J4k13KKj43
6361b73M24j27k8q4J05J21r4n9rNJ05j3j93l5j06L28r9J56l16j30N6M4K76p9j21
6386a46J54j14LK26j90K95k77k5R0Q1j27L1m3J89o6J15k57M2k10K39JR8j08J34
6410A35l53J32N0K50p1l09J96j83K01m8r2Q0J1l5J12o6R2p1j88M17q1k38j21J30
6434e0R6j44M64m31j6J43k70J36J57j06M2j88oo9K02k4m3J57J16N3m1l65J37n
6458e5J46j44J49j18R9K0Qj02J63k10j10O1j8J01K69k95n6J84o3j01j93J59K33
6481A27j49L6J8m6N5M9Mk05M02l15j58J50r4K57k47K39j54j53K08j65P4PJ03n6
$$ plain form
6505 -13 -159 161 32 177 -152 8 59 69 -35 123 -202 -85 -100 -340 -29 44 84 75 82 69 -97 82 53 -197
6529 -197 1 -115 -117 214 19 76 49 20 -8 44 -275 -14 -53 -81 -90 226 -135 165 165 95 6 127 72 102 211 27
6555 27 128 68 -127 23 170 -38 -83 -15 124 27 144 -115 -58 7 187 -204 -66 -7 -101 -216 -152 130 -3
6578 -3 98 115 54 -124 107 141 -251 165 -270 -54 22 -219 14 167 26 -21 13 264 -206 -161 -43 154 -63
6601 -63 208 -136 -243 66 -158 -73 -5 -153 74 43 95 66 -110 -59 78 203 -48 91 -142 -54 3 58 -32 76
6625 76 44 73 50 72 -68 -62 97 -4 22 -6 216 72 131 16 -263 81 40 112 126 134 135 -98 198 -28 141 122
6651 122 166 49 -87 81 -8 -234 108 -168 -36 -239 -54 63 12 -65 80 120 -107 145 -54 -174 117 119
6673 119 -174 191 -201 47 138 -259 44 87 -165 255 -73 114 -43 -5 -77 91 93 106 -71 -302 169 71 -176
$$ packed form
6505a3j46L20j29J45l29J60N1J0j04J58l25J17j5k40L11P3M0rPj3j66J79k9k50
6529a97J98j16kL31j95N7k7k9k8N2l19K61l9k8rL16l61L00%p0q9J21n5L0J09j84
6555B7J01o0j95J50J47k08m5O8J39r7J17k59N7O5J80l91J38N9r4j15O4K82j33
6578cJ01J7o1j78K31L4l92M16m35K16P6k41K33J53j41m7L4K51m70M5J18J97k17
6601f3K71l44j07L09k24Q5O8j48K27l1N2k9j76N1J37J25k51J39k33Q8N7N5r0J08
6625G6l2K9k3K2j40OJ59j01K6k8K22j44N9j15k79L44m1P2J4QJk33K96k26J69j9
6651A22M4j17j36J68q9k26L42k76J32k03J85J17n1p7J45M0k27K52j99j20K91K
6673A19k93L65l92K48R1l97L03M3k52M20l28J87j57L8p2J68KJ3j77k31M71r8k47
$$ plain form
6696 -176 51 -86 95 -50 -57 -81 23 -25 -19 129 -89 149 85 -107 185 52 91 -110 -45 -105 90 -243 -234 108
6720 108 70 -124 188 -27 49 88 -1 95 41 57 266 -29 -205 -95 -75 -90 -160 298 79 45 67 4 -65 -303 140
6745 140 60 -110 -62 -103 59 -218 19 102 -278 28 175 -239 -47 -82 53 -15 35 218 32 87 -193 -102 -43
6768 -43 -78 184 -182 73 32 71 117 36 -28 -177 61 -183 -201 93 86 -59 184 182 -232 137 -117 48 -246 220
6792 220 89 -121 -23 321 -65 -19 78 -102 68 -240 306 17 6 -216 -164 53 -226 -55 -24 -75 -50 -150 57
6815 57 167 -185 117 120 173 21 -352 62 187 -139 -92 66 -118 -32 228 84 250 145 279 46 220 -37
6837 -37 -33 -86 136 44 -75 100 214 -19 -159 -21 -157 169 71 -7 -88 165 121 121 132 193 166 -303 362 5 29
6862 29 -139 235 78 95 -42 -152 83 157 -44 -104 51 -30 53 79 80 -115 -125 45 61 142 197 -7 -80 -5 -94
$$ packed form
6696a76K27j37J81j45pk4J04m8OJ48k18K38o4j92K92j33L9k01O5o0J95l33RL42
6720A08l8j94L12k15P6L9q9R6n4J6K09k95j76J10K0j5p0M58k19l4K2o3o9k38M43
6745A40q0j70M8m1J62k77K37Q3l80L06J47m14J92l5J35o8N0J83j86N5k80R1N9
6768d3l5K62l66K55m1L9M6q1o4j49K38k44j8K94pj45K43km14L69k54J65k94M66
6792B20j31k10R8L44l86M6R7j80J70l08N46k89j1k22N2K17k79J71L1n1K5j00K07
6815E7J10l52L02LN3j52l73M14J25l26M7J58j84Q6K60j44J66j05J34k33J74k57
6837c7Mn3K22r2j19J75J14k33j40J38j36L26r8p8q1K53m4%J1O1k7m69O65l57K4
6862B9j68L74j57J7j37j10K35P4k01o0J55q1Q3K6Jj95j0J70J6Q1N5k04p3P5q9
$$ plain form
6887 -94 -317 11 -132 -76 92 136 64 -82 -7 -136 72 46 38 27 -134 78 96 -173 -5 -17 -65 71 -171 58
6911 58 -9 94 71 -200 165 8 28 -136 2 129 -14 129 164 21 -96 107 -71 8 80 70 -37 153 33
6934 33 -57 -51 15 -77 -15 97 -22 87 31 103 -133 144 -179 3 -89 75 128 153 -168 -20 -132 -15 134 -157
6958 -157 83 159 -56 -185 -38 155 84 -57 100 -120 -34 165 43 14 -22 -83 -313 21 -151 131 -76 -21
6980 -21 52 68 4 202 146 -122 4 58 -174 -139 -22 147 -144 21 25 -220 -7 0 -66 -101 94 209 -76 18 -26
7005 -26 65 208 49 -134 -28 23 -139 -128 89 121 -140 3 125 16 -111 -65 -222 -31 13 -31 -21 -28 131 19
7029 19 126 71 114 81 33 -110 -174 -116 62 -14 12 -118 -29 89 56 -58 -72 -37 124 -251 69 378 141 -128
7053 -128 -88 255 61 -120 -6 75 127 225 259 55 -31 140 -57 55 86 234 -43 -77 -168 0 -85 102 89 -69
$$ packed form
6887i4k23L28j43N6J68M4p2j46P5j29K08k6qj1j61K12J8k69J68j2m8J36k42K29
6911E8o7J03k3k71L65j57K0j64J38J27j43J43L5j43j17K03j78P9P2j0j07J90j20
6934C3r0OO6r2O2J12j19J09n6P2k36K77l23J82r2J64N3K5l21J48j12J17J49k91
6958a57K40P6k15j29J47J93p1j41J57k20Q6J99j22k9l6o1k30L34j72K82k07N5
6980b1P3J6o4J98n6k68J26N4k32L5J17J69k91J65Mk45K13Po6l5J95J15k85R4m4
7005b6R1J43j59j83J06N1j62J1K17L2k61J43J22j09j27M6j57J91M4m4J0pJ59j12
7029A9J07n5M3l3m8j43o4N8J78p6K6j30Q9J18l3j14j4L5J61l75L20L09k37k69
7053a28M0L43j94j81J14Q1N2R8L4k04q6J71j97J12L1J48k77l4r1J68q5J87j3j58
$$ plain form
7077 -69 -114 -68 -38 -78 -20 -175 159 16 59 17 -118 139 -243 131 140 197 -112 92 -25 24 91 -115 207 -83
7101 -83 -11 162 40 96 98 -11 -136 60 66 -27 6 -109 -74 206 72 -19 -29 38 -60 -66 -42 -109 18 -154 -162 47 -23
7128 -23 125 92 26 119 207 19 -306 -122 -161 118 -148 145 -15 24 -192 185 45 -266 93 125 -37 -95 48
7151 48 -65 -21 202 -55 296 -203 -66 -14 18 35 -195 22 -113 9 -142 161 53 -172 -145 -16 105 203
7173 203 21 10 -43 21 80 -102 -2 45 95 215 38 -173 69 171 -11 76 -124 124 92 247 259 -244 -58
7196 -58 27 -7 -157 -102 95 64 -175 207 294 -2 72 31 52 -158 93 -1 102 -47 -26 78 -146 -102 205 -154
7220 -154 73 -47 106 -127 25 -95 -147 51 37 -206 0 -68 -166 -86 -112 102 10 -66 27 351 -42 299 94
7243 94 -341 -167 -2 40 -90 294 49 57 219 -33 271 93 126 42 -25 92 0 -37 51 -221 82 63 -33 43
$$ packed form
7077f9m5M6L0m0N8j55L34j43M3m2j35K57l82L74RN7l09K04j17M9O7k06L22k90
7101h3P2J73j22N6Kj09j25J96Or3L3j15L5K80j34r1j0O7r8oK4o7J27j72qK09p0
7128b3J48l3o6R3Q8j88l25J84l9K79k66K93j60L9k16L77j40l11L59L2j62n8J43
7151D8j13M4K23k57L51m99J37N2L2J7k30K17j35J22j51L03j08k25K7J29J21R8
7173B03j82j1n3O4N9j82J00M7N0J20j77k11K42J02j82Q7k00K48l2J55J2n03J86
7196e8Q5l4j50N5J97l1k39L82Q7k96P4m1K1k10K51r4J03j49K1J04k24M4L07l59
7220a54K27j20J53k33J52j20n2J98j4k43K06o8r8Q0k6K14r2p6R3L24l93L41k05
7243I4m35J74J65M2j30L84k45QJ62k52L04j78L3q4o7J17r2l7Q8k72L03j9r6P6
$$ plain form
7267 43 3 78 54 191 -53 198 -40 -52 74 -156 35 -12 121 -163 38 212 -127 113 -31 31 110 -17 -151
7290 -151 -116 -295 93 207 -163 131 -184 18 -160 18 5 -91 -260 -120 108 51 -162 142 -28 5 -75 -124
7312 -124 -33 -81 -190 78 68 117 211 44 -106 -67 -133 -209 -55 -242 -70 -146 1 21 254 3 -60 64 157 140
7336 140 -146 -49 62 94 280 28 261 30 -248 94 157 -92 -219 -10 265 -140 94 -28 -167 65 -57
7357 -57 170 -62 -96 189 86 -57 59 -115 6 110 87 165 -73 -148 -89 -65 125 41 14 5 164 104 43 -55 -124
7382 -124 -97 87 217 54 191 174 -156 131 -107 159 52 7 -33 22 -86 80 112 -24 98 79 0 -112 4
7405 4 176 135 26 -65 138 -277 -56 156 183 27 -2 -205 207 -215 -49 72 -15 113 -93 136 78 -80 -8
7428 -8 -58 106 -56 -182 76 -39 -73 230 -8 -73 34 -14 -208 72 48 -139 287 -113 8 -174 36 5 107
$$ packed form
7267D3m0P5k4J37k44K51k38j2J26k30J91m7J33k84K01J74l39K40j44O2P9j27j34
7290a51L5j79L88J14l70K94l15K02j78J78j3r6j69J40K28n7k13L04j70L3q0m9
7312a24R1m8j09K68j0M9R4j67j50L9o6p6J54j87J72p6J47K0K33k51o3J24R3j7
7336A40k86R7J11L2J86k52K33k31k78L42O3k49j27K09K75m05K34j22j39K32j22
7357e7K27k32l4K85j03j43J16j74J21J04k3P8k38p5N9K4J90q4k7rJ59o0o1r8o9
7382a24K7J84J30j63J37j7l30K87k38K66j07m5m0N5j08J66L2j36J22j9p9j12J16
7405DJ72m1j09r1K03m15K21K12K7j56k9k03M12m22J66J21q7J28k06K29n8j58P2
7428hn0J64j62j26K58j15l4L03k38o5J07m8j94K80k4j87M26m00J21j82K10l1J02
$$ plain form
7451 107 -157 -211 6 -101 -81 -10 -15 58 -63 -21 -52 -159 224 184 22 207 -164 -116 14 -190 -58 134 153 17
7475 17 161 186 -189 16 31 -66 -42 -2 19 0 -101 76 102 105 -126 226 85 -220 310 -165 -58 -37 -176 33
7499 33 -236 9 -89 -85 85 64 108 -118 -152 -16 40 109 -180 -30 -6 84 -54 79 -33 -44 -40 -243 -3 -202 -25
7524 -25 -76 -106 14 -182 -160 -70 146 4 -229 181 -18 412 135 -119 181 -2 -290 140 27 -148 98 -18
7546 -18 -212 37 -16 -145 533 55 64 67 -264 -55 -76 -92 369 12 -15 79 245 -87 79 -53 46 187 -202 -225
7570 -225 16 29 192 86 102 175 -110 24 -43 -102 144 -44 -27 -56 -221 120 138 -28 -95 42 155 72 68 -6
7594 -6 -1 74 168 223 103 -5 143 -122 19 -40 36 -109 -34 125 -169 133 -63 -131 226 170 168 49 28 175 -187
7619 -187 -38 -55 -81 104 -21 -290 -265 -213 15 -56 -100 -19 69 -48 131 111 -210 63 36 98 -33 115 -213 -16
$$ packed form
7451A07k64n4K17j07K0P1nP3j21M2l1j07L83m0j62J85l71M8J30k04J32J92J9j36
7475A7J44K5l75K05J5r7K4M0K1j9j01J77K6Lk31L52j41l05N30m75J07K1j39K09
7499C3k69K45r8MJ70k1M4k26l4J36N6O9k89J50K4R0j38J33j12j1Mk03K40j99J77
7524b5n1l0J20j96K2R0K16j42k33M10j99M30k77k54L00j83k88M30j13j75K46j16
7546a8j94K49n3j29O78m78RLl31K09k1j6M61l57k7R4J66l32J66j32R9J41l89k3
7570b25K41J3J63j06J6P3k85J34o7n9K46j88J7k9j65L41J8j66o7J37J13q3mp4
7594fNP5R4N5j20j08J48k65J41n9P6j45P5J59k94L02j96o8L57n6kj19k1J47l62
7619a87J49j7k6J85j25k69K5N2K28p1m4Q1Q8j17J79k0l21K73k7O2j31J48l28J97
$$ plain form
7643 -16 -5 -48 1 3 89 38 20 186 -21 272 -215 238 25 52 81 176 5 109 -47 94 2 49 -29 71 158
7668 158 -48 -169 158 83 145 9 -21 -51 -69 -87 -102 167 -134 4 99 -18 -50 183 -1 54 -187 -148 144 1
7692 1 -95 -36 -287 -92 -96 153 -177 -7 148 84 37 174 157 -63 82 -47 -199 15 30 206 75 73 -29 -204
7716 -204 128 328 -140 -5 88 46 -91 -59 131 -14 127 55 146 18 10 13 -157 -69 159 -96 31 -29 -7 -8 133
7741 133 86 46 -172 -17 -14 36 25 120 -214 -103 144 -113 -16 117 14 40 56 19 -222 194 -144 14 110 115 25
7766 25 -65 80 -140 -101 257 -110 -100 -1 28 168 -23 -91 46 78 -107 246 63 -127 122 -220 11 15 -9 116
7790 116 -62 -114 1 -20 -31 48 -61 81 -113 -87 81 84 -216 -94 -42 188 13 146 76 68 -36 267 -219 -41
7814 -41 -307 -18 8 -52 -19 33 13 -97 108 207 2 -128 -170 -195 127 -48 83 -6 203 -85 255 -194 -200 -175
$$ packed form
7643a6J1m3M9KQ6n1j8J66k07K93m87M53k13K7K9R5j71J04j56J41r2M7p8J00Q7
7668A58k06j21L27p5O2j36l0l0j8j8j5K69l01J38R5j17l2K33j84N5k41L9K92j43
7692Ar6N9k51J95mK49l30J70J55o4m7J37j7k20J45j29j52K14J5J76j31kj02j75
7716b04L32K00m68J35R3m2j37L2J90j45J41p2R1j28qLj70Q8K28k55J27o0K2jJ41
7741A33m7m0k18J55LN0j1R5l34J11K47k57R7J33j03K6J6l7k41M16l38J58R6Nr0
7766B5r0J45k20L9L58l67J0R9K9J40j91o8J37L2j85L53j83j90K49l42K31Mk4J25
7790A16j78n2J15k1j1P9j09J42j94K6J68Ll00J22N2K30j75J33p0qj04L03m86J78
7814d1k66K89K6o0L3N2k0j10K05R9k05j30m2k5L22j75J31q9K09k88L40m49oK5
$$ plain form
7838 -175 -258 75 106 -63 -10 5 -183 135 82 112 49 -34 77 -148 -143 169 181 76 79 63 -12 162 -90 27 -83
7863 -83 73 79 114 191 -105 93 -426 -57 118 42 -92 55 54 -3 -209 -114 -7 -130 196 114 -225 41 -90 58
7887 58 -254 122 50 47 -47 -187 -78 -172 83 164 122 76 321 -18 -335 -125 -9 263 37 -83 -122 -122 -188 -62
7911 -62 -83 -13 -89 -125 -169 -172 348 -66 -118 42 106 51 69 -100 1 93 -97 -26 -57 -200 -152 -43 21 -228 114 51
7937 51 162 -74 164 -61 84 39 -209 -121 -56 253 42 -78 180 55 -205 0 -33 -105 115 167 122 34 121
7960 121 188 -156 -5 4 -32 -215 -94 -63 95 101 91 119 -107 -111 132 88 -21 -38 -67 178 113 -42 -27 -24 -155 107
7986 107 10 -59 157 19 -71 192 76 -169 286 -83 112 -4 145 -158 -15 62 56 -180 8 -184 -75 39
8008 39 -73 44 -174 -106 136 -4 -220 181 -123 217 55 136 -42 313 101 14 20 -87 100 80 -66 8 63
$$ packed form
7838a75q3L33L1j69N3J5j88L18n3L0o3q3J11k25NL12J2j05Lj6p5J74k52J17j10
7863h3J56OL5P7k96J98n19L69J75p6j34J47jn7k06R5J07j23L26q2l39K66j31J48
7887E8l12L76p2lr4j40J09r4K55Q1m2m6K45l39l17K10J16K72k26j20l9%o6J26
7911f2k1P0p6l6m4lN20m14n2J60O4n5J8j69J01R2j90P1l1j43M8J09O4k49L42o3
7937E1J11k36K38k25J45m5k48Q8O5L09k11j20K58j25k60K05l3p2K20N2m5q8Q7
7960A21O7l44J51Rl6j83J21L1J58Oj0K8k26mK43m4j09j7k9K45o5j55J5Lj31K62
7986A07r7o9K16j38r0K63j16k45M55l69J95j16J49l03J43P7ok36J88j92J09J14
8008C9j12J17k18O8K42j40k16M01l04L40j62Q1j78L55k12q7Oj07J87k0j46P4N5
$$ plain form
8031 63 16 99 -77 -86 -71 -98 33 281 17 -162 37 -156 106 66 -128 58 -118 -80 275 -39 171 120 -34
8054 -34 -42 106 55 170 50 -93 79 13 62 131 35 -11 6 16 -123 -6 179 -35 -92 -39 -49 -115 77 440 23
8079 23 71 43 209 72 -26 91 -29 4 199 32 -76 7 96 137 -41 151 6 -180 -302 104 116 42 6 196
8103 196 13 -308 -22 72 -16 165 -31 -11 122 49 84 -119 -117 -12 -123 127 -119 62 -419 86 -27 30 3
8126 3 -38 15 -74 -186 -80 -20 -93 20 -58 193 -64 54 -45 18 33 131 -31 11 -2 -136 37 -111 182 168 180
8151 180 -15 -60 85 162 143 71 101 95 15 -17 -95 -97 -233 46 18 -63 178 -140 -200 -110 230 160 -20 21 -364 341
8177 341 -42 -117 119 49 92 -76 127 193 -3 -13 205 141 -103 -155
$$ packed form
8031F3m7Q3j76rJ5k7J31K48k64j79J99j93K62m0j94J86j76L8L55l14K10n1j54
8054c4qJ48n1J15j20j43J72o6M9O9r6m6J7J0j39J17J85k14n7N3j0o6J92L63m17
8079B3M8k8J66j37r8J17j20L3J95j67j08Q3Q9M1j78J92j45j86j22M06J2p4l6J90
8103A96j83l21K86R4q8J81j96K0J33p3L5k03KJ05j11K50k46J81m81N05j13N7k7
8126Cm1N3q9j12J06O0p3J13p8K51k57J18r9O3J5R8j62M2j3j34J73j48K93j4J2
8151A80j95m5J45P7j9p2L0oq0l2p8kj36K79k8q1K41l18o0R0L40p0j80M1l85P05
8177C41l83p5K36p0M3j68K03O6j96j0K18o4k44n2
8191a55
$$ Imaginary data points
##PAGE= N=2
##DATA TABLE= (X++(I..I)), XYDATA
$$ plain form
0 0 0 0 0 0 0 0 0 0 0 0 0 0 0 0 0 0 3 -8 8 -8 8 -8 8 -16 16 -16 24 -24 28 -32 37 -40 48 -54 60 -68 76 -85
38 -85 94 -107 117 -131 145 -160 176 -194 216 -237 261 -287 316 -349 385 -426 470 -519 581 -648
58 -648 729 -822 938 -1085 1270 -1522 1875 -2407 3313 -5111 10022 -50496 -141699 34472
72 34472 101090 -8821 -34051 41485 34830 3502 6557 -5634 -9527 29842 22854 -23243 -19802
85 -19802 15462 31181 36919 5078 -40861 -12781 35025 -8899 -46026 4166 14425 -42668
97 -42668 -32371 5065 -23399 -17378 42137 11041 -52155 2188 60682 4829 -30045 10657
109 10657 8727 -19986 5777 21078 -1883 13784 36015 421 -20249 14408 28177 4693
121 4693 -8801 -13316 -8855 3224 -11292 -26970 4408 12180 -38038 -26828 41948 18534 -43427
$$ packed form
0@%%%%%%%%%%%%%%%%Lj1J6j6J6j6J6k4L2l2M0m8N2o0O9p7Q8j02J14j28J44j61
38h5J79k01K24k48K76l05L36l70M10m53M98n48O03o65P34q11Q96r89J100j229
58f48J377j551J760k023K355k792L397m282N720q424J5133o0518r1203J76171
72C4472O6618j09911k5230P5536o655l1328L055j2191l893L9369o988m6097L441
85a9802L5264J5719N738l1841m5939K8080M7806m3924l7127N0192J0259n7093
97d2668J0297L7436k8464O021N9515l1096o3196N4343N8494n5853l4874M0702
109A0657j930k8713K5763J5301k2961J5667K2231l5594k0670L4657J3769k3484
121D693j3494m515M461J2079j4516j5678L1378P772n0218J1210O8776k3414o1961
$$ plain form
134 -43427 -290 44379 -20215 -51429 16322 34057 -15475 -12897 15732 3753 3573 23811 9334
147 9334 -5904 12452 13216 -8348 -3551 8153 1124 -3378 -10843 -21718 -308 21052 -6405
160 -6405 -19214 14790 10493 -26552 -7541 21408 -10934 -25054 10117 5271 -21807 5223 26945
173 26945 -4593 -10402 17247 7977 -8680 12468 16104 -9412 -7169 7248 -4275 -8047 6447
186 6447 3430 -5652 -493 -863 -85 9547 -1738 -17095 3235 11544 -21359 -18881 23262 13019
200 13019 -26133 -7957 21881 3350 -7468 10294 5581 -6339 7513 6659 -13506 -2863 16839
213 16839 -822 -17264 -1452 10014 3921 -688 -4065 -4013 5351 1970 -11623 -3212 9775 -4292
227 -4292 -11909 4515 3325 -8627 6055 14211 -8530 -9832 14696 9497 -9982 363 9182
$$ packed form
134d3427M3137M4669o4594l1214O7751J7735m9532K578K8629j1979j80K0238j4477
147I334j5238J8356P64k1564M797J1704p029m502p465j0875K1410K1360k7457
160f405j2809L4004m297l7045J9011K8949l2342j4120L5171m846k7078K7030K1722
173B6945l1538n809K7649r270j6657K1148L636k5516K243J4417j1523l772J4494
186F447l017r082N159l70P78R632j1285j5357K0330Q309l2903K478M2143j0243
200A3019l9152J8176K9838j8531j0818J7762m713j1920J3852q54k0165J0643J9702
213A6839j7661j6442J5812J1466o093m609l377N2R364l381j3593Q411J2987j4067
227d292p617J6424j190j1952J4682Q156k2741j302K4528n199j9479J0345Q819
$$ plain form
240 9182 -4951 -4784 6559 -1605 -5891 7533 5197 -10664 -5112 7645 2134 -4356 -3727 -3505 -76
255 -76 2800 -4916 -5475 7236 3743 -9305 -789 10230 170 -3532 7608 2657 -7169 3461
269 3461 9392 -3771 -4031 7050 752 -7256 2180 4781 -4704 -2727 3188 -3239 -5958 1453 2259
284 2259 -2851 -2649 -2131 -1261 2649 460 -4319 1751 6133 -2698 -4383 6030 5985 -2322 409 4186
300 4186 -1145 -197 5480 163 -5069 2258 3222 -5162 -3521 4189 960 -5022 -2001 337 -1416 -877
316 -877 -56 -1611 -1669 -398 -1073 167 1838 -77 7 2721 1104 -849 3037 4321 -162 -1495 1821
333 1821 663 -1580 701 1175 -2239 -1651 983 -704 -2511 149 1126 -2072 -3556 -709 690 -969
349 -969 -1452 -299 592 -199 218 1785 2372 1435 949 1284 795 1068 1137 737 -654 -599 -26 -301 -465 -742
$$ packed form
240I182j4133J67J1343q164m286J3424k336j5861N552J2757n511o490O29K22L429
255g6K876p716n59J2711l493j3048Q516J1019j0060l702J1140m951r826J0630
269C461N931j3163k60J1081o298q008R436K601r485J977N915o427k719P411Q06
284B259n110K02N18Q70L910k189m779O070M382q831j685J0413m5q307K731L777
300D186n331R48N677n317n232P327R64q384J641P710l229n982L021K338j753N39
316h77Q21j555n8J271o75J240J671j915Q4K714j617j953L886J284m483j333L316
333A821j158k243K281M74l414N88K634j687j807K660R77l198j484K847J399j659
349i69m83J153Q91p91M17J567N87r37m86L35m89K73O9m00j391N5N73k75j64k77
$$ plain form
369 -742 -381 -186 -1323 -2381 -1011 -25 -1596 -2003 -843 -1650 -1710 1185 1575 -1215 142 3964 2047
386 2047 -709 2232 3502 1379 1193 1149 -828 767 3638 -188 -3544 -13 2350 -1530 -3031 -1456
402 -1456 -1630 -1169 -958 -4234 -4055 1489 1265 -4382 -2501 2109 440 -446 2366 930 -620 4191 4229
419 4229 -1246 630 6084 2491 -1137 1953 1647 -38 1992 991 -4396 -1735 2380 -2455 -4903
434 -4903 -33 -1361 -5512 -1178 624 -5116 -3412 2855 -805 -4129 903 2341 -763 2656 3672
449 3672 -1447 1647 7377 2553 -1279 4353 3837 -1068 2953 3522 -4041 -1503 6507 -545 -8492 -712
465 -712 3880 -3182 -5100 -2958 -4259 -607 1557 -6381 -6965 4579 3643 -6535 -2073 5402 1199
480 1199 555 5332 -218 -2113 7605 6984 -4708 -1622 7687 3675 -1687 733 80 220 4645 -753
$$ packed form
369g42L61J95j137j058J370R86j571m07J160q07o0K895L90k790J357L822j917
386B047k756K941J270k123j86m4j977J595K871l826l356L531K363l880j501J575
402a456j74M61K11l276J79N544k24n647J881M610j669q86K812j436j550M811L8
419D229n475J876N454l593l628L090l06j685K030j001n387K661M115m835k448
434d903M870j328m151M334J802n740J704O267l660l324N032J438l104L419J016
449C672n119L094N730m824l832N632n16m905M021N69p563K538Q010p052p947P780
465g12M592p062j918K142j301L652K164p938n84J1544r36j0178M462P475m203
480A199o44M777n550j895R718o21j1692L086R309m012n362K420o53J40M425n398
$$ plain form
496 -753 -8492 -827 5316 -5156 -8299 989 -811 -6684 -411 918 -5951 -1600 5555 -703 -4075
511 -4075 3298 3459 -1363 2062 2740 -1696 2971 6491 -1130 -934 8378 2592 -5517 3490 6504 -5344
527 -5344 -5120 5245 77 -8393 -2086 1353 -3533 -2555 -1310 -4158 902 4832 -4484 -6231 4793
542 4793 2901 -6219 -353 4550 -2202 968 8655 -132 -5346 7318 8693 -4473 -2811 5721 2089
557 2089 -1250 643 -3815 -3807 4281 503 -9414 -1133 7270 -2347 -5116 2591 -957 -5626 2263 1253
573 1253 -7889 -932 8042 -971 -4298 4198 3421 -1227 3255 2076 -3115 4447 7563 -4970 -4583
588 -4583 7231 874 -8658 906 5526 -4181 -2407 5788 -423 -4998 1202 -110 -4835 -14 961
603 961 -4565 652 5480 -2929 -4300 5246 2172 -3981 3231 4968 -3571 629 7389 -2570 -6993
$$ packed form
496g53p739P665O143j0472l143R288j800n873O273J329o869M351P155o258l372
511d075P373J61m822L425O78m436M667L520p621J96R312n786q109R007L014j1848
527e344K24J0365n168q470O307L439m886R78J245k848N060L930r316j747J1024
542D793j892r120N866M903o752L170P687q787n214J2664J375j3166J662Q532l632
557B089l339J893m458QQ088l778r917Q281Q403r617k769P707l548m669P889j010
573A253r142O957Q974r013l327Q496p77m648M482j179n191P562L116j2533L87
588d583J1814o357r532R564M620r707J774Q195o211m575O200j312m725M821R75
603I61n526N217M828q409j371R546l074o153P212J737q539M200O760r959m423
$$ plain form
618 -6993 3728 4090 -5244 -891 4598 -744 -230 3479 -3539 -5605 3788 1318 -6931 -526 4824
633 4824 -2231 -2261 3409 -1856 -3664 4993 2910 -5166 1391 7648 -1040 -3554 2409 -257 -2809 3172
649 3172 769 -4835 3289 6995 -4302 -5415 4687 1003 -6351 347 2655 -3702 -184 4176 -3517
664 -3517 -4334 3755 965 -4222 2463 4051 -2157 650 4579 -3016 -3114 4546 279 -4843 2969 4221
680 4221 -3595 -117 4660 -2907 -4806 3645 615 -5684 1353 3684 -4115 -2113 3437 -2234 -3878
695 -3878 3559 1286 -3562 2588 4284 -3288 -1105 4636 -1208 -2991 3904 2116 -3071 2070 3641
710 3641 -3115 -1373 3547 -1888 -3475 3174 1185 -4318 1073 3120 -4271 -2915 3320 -1308 -4030
725 -4030 2495 2167 -3243 909 3301 -2298 -1119 4403 -51 -2548 3495 2959 -3251 294 3216 -2044
$$ packed form
618f993J0721L62r334M353N489n342N14L709p018k066R393k470q249O405N350
633D824p055l0N670n265j808Q657k083q076O557O257q688k514N963k666k552N981
649C172k403n604Q124L706j1297j113J0102l684p354O698K308o357L518M360p693
664c517q17Q089k790n187O685J588o208K807L929p595r8P660m267n122P812J252
680D221p816L478M777p567j899Q451l030o299P037K331p799K002N550n671j644
695c878P437k273m848O150J696p572K183N741n844j783O895j788n187N141J571
710C641o756J742M920n435j587O649j989n503N391K047p391J356O235m628k722
725d030O525l28n410M152K392n599J179N522m454k497O043n36o210L545K922n260
$$ plain form
741 -2044 -1522 2989 -639 -2943 2815 1679 -4133 -128 3062 -3104 -3332 2289 -413 -3564 1440 1765
757 1765 -3452 -235 3185 -1512 -1328 3604 1099 -1984 2593 2373 -2939 -213 3157 -1434 -1955 2811
773 2811 776 -2514 1519 1822 -2850 -544 2629 -2269 -3047 1940 -71 -3590 393 1847 -2481 -500
789 -500 3101 -382 -1263 2925 1384 -1972 1146 2442 -1944 -522 2642 -382 -1751 2552 1292 -1961
805 -1961 751 1960 -1815 -1140 1598 -1619 -2768 943 -329 -3294 37 1948 -1832 -916 2595 472
821 472 -1219 1891 1355 -1551 360 1794 -1237 -708 2562 814 -1194 1779 1923 -925 396 1078
837 1078 -1635 -1082 618 -1542 -2912 36 -159 -2669 -457 1338 -1232 -848 1752 -79 -1489 1110
853 1110 1167 -1344 34 2063 -146 -34 1952 1366 20 2082 2328 -411 399 1332 -774 -1315 -225
$$ packed form
741b044N22M511l628k304N758j136n812M005L190o166k28N621k702l151N004L25
757A765n217L217L420m697J84M932k505l083M577k20n312K726L370m591n21M766
773B811k035l290M033L03m672K306L173m898p78M987k011l519L983J454m328J981
789e00L601l483q81M188j541l356L118J296m386J422L164l024j369M303j260l253
805a961K712J209l775O75K738l217j149L711j272k965L331J911l780R16L511k123
821D72j691L110n36k906J911J434l031N29L270j748k008K973J44k848J321O82
837A078k713N53J700k160j370K948j95k510K212J795k570L84K600j831j410K599
853A110N7k511J378K029k209J12J986n86j346K062K46k739Q10R33k106n41J090
$$ plain form
870 -225 -1007 -1917 -433 -355 -1645 -621 631 -1000 -939 526 -496 -1262 145 274 -1388 -595 1393 527
888 527 -186 1674 1719 981 1515 1965 542 447 1136 448 -707 -473 -385 -633 -695 -722 -1041 -297 -89 -954 -1229
909 -1229 -183 -604 -1259 -863 -712 -1025 -294 314 -168 225 1473 1663 433 1039 1722 986 467 901 512
928 512 -452 -267 587 89 -223 -370 395 380 -694 -1068 -122 -476 -1500 -1156 -932 -1308 -1137 165 -247 -648
948 -648 294 1441 1026 161 330 1095 1698 414 -516 836 1489 363 -202 868 586 203 705 131 -977
967 -977 -423 724 -1112 -1947 -449 -516 -1043 -686 -632 -1321 121 1328 -534 -1139 1107 1783 -157 -480
985 -480 608 630 488 578 -97 644 1495 208 -245 1093 612 -1093 406 726 -1806 -1902 1181 -38 -2823
1004 -2823 -734 1482 -601 -1561 625 614 -983 -269 462 -220 54 431 199 818 670 -622 247 2109
$$ packed form
870b25p82r10J484P8j290J024J252j631O1J465j022p66J407J29j662P93J988q66
888E27p13J860M5p38N34M50j423r5O89o88j155K34Q8k48o2k7l19P44K08q65k75
909a229J046m21o55L96J51l13P31O08m82L93J248J90j230O06O83p36n19M34l89
928E12r64J85Q54m98l12j47P65j5j074l74R46l54j024L44K24l76J71J302m12m01
948f48R42J147m15q65J69P65O03j284r30J352O53j126n65J070k82l83N02n74j108
967i77N54J147j836q35J498o7n27L57N4o89J442J207j862o05K246O76j940l23
985d80J088K2j42R0o75P41Q51j287m53J338m81j705J499L20k532r6L083j219k785
1004b823K089K216k083r60K186j1j597P14P31o82K74L77k32O19j48j292Q69J862
$$ plain form
1022 2109 415 -1399 802 1645 -772 -946 953 -475 -1644 690 213 -2028 -562 1365 -786 -1396
1038 -1396 761 -192 -1273 864 477 -1722 363 2475 -353 -1613 1410 1619 -553 272 1164 -282
1054 -282 347 774 -998 -462 1566 -602 -1818 858 246 -2325 103 1770 -2136 -1921 2343 443
1070 443 -3302 485 2620 -1315 -1308 1503 764 -880 965 920 -779 641 1064 -730 241 1460 -990
1087 -990 -703 1587 -168 -2176 939 1252 -2534 -671 1888 -1232 -2181 1371 251 -2595 273 1702
1103 1702 -1505 -663 2131 -329 -1501 1833 1046 -1703 301 2566 -226 -771 1513 425 -1023 859
1119 859 420 -1450 405 1196 -1602 -910 1433 -1346 -2109 1159 275 -2503 548 2069 -2081 -1434 2517
1136 2517 -66 -2707 1157 2393 -1413 -321 2691 -11 -1135 1516 575 -1604 721 1194 -1059
$$ packed form
1022B109j694j814K201Q43k417j74J899j428j169K334m77k241J466J927k151o10
1038a396K157r53j081K137l87k199K085K112k828j260L023K09k172Q25Q92j446
1054b82O29M27j772N36K028k168j216K676o12k571K428J667l906K15M264j900
1070D43l745L787K135l935PK811p39j644J845m5j699J420M23j794R71J219k450
1087i90K87K290j755k008L115L13l786J863K559l120r49L552j120k846K868J429
1103A702l207Q42K794k460j172L334p87k749K004K265k792n45K284j088j448J882
1119H59m39j870J855P91k798O92K343k779p63L268q84k778L051J521m150O47L951
1136B517k583k641L864J236l806J092L012k702j124K651r41k179K325M73k253
$$ plain form
1151 -1059 -29 1379 -1301 -1042 1141 -540 -2289 938 952 -2341 -13 2046 -1657 -1892 1900 471
1167 471 -2422 1385 2456 -1531 -403 2547 -292 -1988 1928 1079 -1726 610 2058 -1013 -444 1301
1183 1301 -814 -1732 949 164 -2144 556 1254 -1992 -811 1375 -1315 -1931 1957 768 -2051 1340
1199 1340 2493 -1685 -1229 2340 -347 -2109 1746 1983 -1707 353 2491 -864 -1383 1300 -357 -1904
1215 -1904 740 855 -1900 -144 1088 -1905 -1288 1222 -515 -1567 1963 1160 -1693 487 2141 -1441
1231 -1441 -1183 2464 236 -1879 1957 2110 -1517 -33 2593 -1053 -1670 1703 457 -1972 522 970
1247 970 -1852 -1049 909 -1487 -1617 1391 165 -1525 1159 1020 -1771 132 1630 -1127 -1259 2631
1263 2631 807 -1628 1682 2061 -1443 -244 2718 -406 -1335 1935 1053 -2229 -79 1107 -1828 -1516
$$ packed form
1151a059J030J408k680K59K183j681j749L227J4l293K328K059l703k35L792j429
1167D71k893L807J071l987J128K950k839j696L916q49k805K336J448l071N69J745
1183A301k115r18K681p85k308K700O98l246J181K186k690o16L888j189k819L391
1199A340J153m178M56L569k687j762L855K37l690K060K138l355n19K683j657j547
1215a904K644J15k755J756J232k993O17K510j737j052L530q03k853K180J654l582
1231a441K58L647k228k115L836J53l627J484K626l646o17L373j246k429K494M48
1247I70k822Q03J958k396j30L008j226j690K684j39k791J903J498k757j32L890
1263B631j824k435L310L79l504J199K962l124r29L270q82l282K150J186k935L12
$$ plain form
1279 -1516 1173 -770 -1352 929 503 -2063 196 992 -1637 -895 1133 -613 -1226 1807 661 -1268
1295 -1268 1280 2155 -1125 -69 2713 272 -1289 2031 1114 -2181 -276 1172 -1625 -1393 1458 -135
1311 -135 -1758 486 420 -1991 -660 416 -1552 -1225 673 -787 -1381 815 778 -1267 663 2091 -723
1328 -723 -46 2375 614 -921 1417 1228 -1396 -126 2067 -693 -1007 1515 82 -1673 360 723
1344 723 -1616 -999 553 -1264 -1507 394 -465 -1538 201 527 -1107 370 1793 -232 -389 1667
1360 1667 629 -914 1167 1271 -1005 230 1799 18 -724 1382 737 -1354 177 684 -1221 -1065
1376 -1065 513 -852 -1333 98 -268 -1315 -204 890 -904 -179 841 -287 -880 1161 368 -788
1392 -788 487 1173 -306 21 1244 240 -228 1245 768 -1063 366 741 -868 -843 322 -332 -1484
$$ packed form
1279a516K689j943n82K281m26k566K259P96k629P42K028j746o13L033j146j929
1295a268K548Q75l280J056K782k441j561L320r17l295J905J448k797K32K851j593
1311a35j623K244o6k411J331J076j968L27J898j460n94K196l7k045J930J428k814
1328g23O77K421j761j535K338j89k624J270K193k760l14K522j433j755K033L63
1344G23k339O17J552j817k43J901q59j073J739L26j634J477J423k025j57K056
1360A667j038j543K081J04k276J235J569j781p42K106o45k091J531N07j905J56
1376a065J578j365m81J431l66j047J111J094j794P25J020j128n93K041p93j156
1392g88J275O86j479L27J223j004m68J473m77j831J429L75j609K5J165o54j152
$$ plain form
1409 -1484 138 148 -1222 -289 561 -647 -405 507 -310 -633 576 386 -714 542 1072 -192 -260 1053
1427 1053 403 -612 608 693 -882 138 707 -461 -677 256 -117 -864 -191 204 -870 -125 77 -908
1445 -908 -432 587 382 -688 138 621 -397 -79 826 -24 -65 699 133 -36 469 379 53 57 363 -353
1465 -353 -362 139 -406 -907 -193 360 -668 -591 100 70 -256 154 120 -175 -83 215 39 71 221 145 163 728 465
1488 465 49 476 646 -195 89 392 330 -461 -296 108 -260 -726 -393 -264 -555 -326 -400 -161 -4 -429 9
1509 9 396 110 -83 -81 283 129 118 293 610 585 344 382 868 460 381 152 200 -18 -335 -168 -435 -498 -520 -239
1533 -239 -390 -88 -261 -201 52 129 -128 -316 188 53 -569 -74 142 86 15 769 614 106 505 924 183
1554 183 13 346 62 -170 -83 -252 -433 66 -87 -603 -169 409 -288 -774 214 -5 -887 -251 106 -647
$$ packed form
1409a484J622J0j370R33Q50j208K42R12q17l23J209j90j100J256N30j264o8J313
1427A053o50j015J220Q5j575J020N69j168k16R33l73p47O73L95j074P45K02r85
1445i08M76J019k05j070Q26M83j018L18R05q50m1P64n66j69N05r0l26ML06p16
1465c53rN01n45n01P14N53j028P7O91l0l26M10l4k95R2K98j76L2J50p6J8N65k63
1488D65m16M27J70q41K84L03o2p91J65M04l68m66L33J29k91K29p4K39J57m25M38
1509IL87k86j93KL64j54j1J75L17k5k41L8M86m08p9k29M8k18l17J67k67o3k2K81
1533b39j51L02j73O0K53P7k57j88N04j35o22M95K16n6p1P54j55n08L99M19p41
1554A83j70L33k84k32Q7j69j81M99j53n16M34N78o97m86R88k19q82O36L57p53
$$ plain form
1574 -647 -570 410 109 39 406 494 196 704 812 -138 -40 501 -302 -439 378 -96 -1103 154 731 -403
1594 -403 -391 694 -216 -747 551 -26 -1146 -167 432 -808 -261 679 -129 -242 985 814 -511 539
1612 539 923 -503 -454 730 -328 -868 123 318 -808 74 788 -244 -291 588 -120 -971 272 -214 -1306
1631 -1306 -511 523 -786 -535 868 415 -508 780 1065 -560 -8 871 -285 -880 593 -12 -990
1648 -990 321 497 -813 -41 864 -297 -528 847 -201 -1536 -16 225 -1287 -608 733 -324 -595
1665 -595 1099 701 -604 714 1186 -545 207 1146 -223 -738 919 632 -869 402 1213 -540 -353
1682 -353 1274 -209 -1189 184 -35 -1371 -318 536 -1394 -748 701 -519 -866 1034 870 -669 583
1699 583 1404 -683 -404 1307 134 -1010 932 1027 -645 471 1316 -575 -419 1057 -120 -1222 562
$$ packed form
1574f47P7R80l01p0L67Q8k98N08J08r50R8N41q03j37Q17m74j007J257N77j134
1594d03J2J085r10n31J298n77j120R79N99j240N47R40q08j13J227j71j325J050
1612E39L84j426M9J184j058n40R91J95j126Q82P14j032m7Q79p08q51J243m86j092
1631a306P95J034j309K51J403m53r23J288K85j625N52Q79j156n95J473o05r78
1648i90J311J76j310P72R05j161k31J375j048j335J520K41j512O79J341j057k71
1665e95J694l98j305J318M72j731P52R39j369n15J657k87j501J271Q11j753J87
1682c53J627j483r80J373k19j336J053Q54j930O46J449j220l47J900j64j539J252
1699E83Q21k087K79J711j173j144J942R5j672J116Q45j891J56J476j177j102J784
$$ plain form
1716 562 234 -1593 -406 418 -1310 -1111 834 -74 -1181 796 733 -926 -249 1068 -700 -732 1146
1733 1146 505 -789 1134 1277 -444 42 1731 -22 -483 1357 583 -1083 239 732 -1190 -916 507
1750 507 -930 -1386 508 80 -1320 303 668 -1306 -774 793 -663 -1229 995 848 -933 397 1196
1767 1196 -531 -88 1660 229 -451 1241 592 -776 252 982 -1073 -791 827 -567 -1035 699
1783 699 309 -1467 -200 537 -1316 -1032 738 -287 -1011 859 741 -1173 146 1162 -633 -351 1369
1800 1369 521 -608 892 1045 -659 97 1311 -509 -506 1294 75 -931 492 86 -1261 -243 570
1817 570 -895 -775 903 -151 -1073 280 424 -1342 -225 1087 -516 -588 1200 674 -991 634 992
1834 992 -553 -162 1220 -200 -494 1133 384 -1036 569 479 -1161 -686 907 -346 -1072 499 -2
$$ packed form
1716E62l28j827J187Q24j728J99J945r08j107J977o3j659O77J317j768l2J878
1733A146o41j294J923J43j721M86J689j753m61J840p74j666J322M93j922K74J423
1750E07j437m56J894m28j400J623L65j974N32J567j456n66K224j47j781J330P99
1767A196j727M43J748j431o80J692o49j368J028P30k055K82J618j394m68J734
1783F99l90j776J267P37j853K84J770j025p24J870j18j914J319J016j795K82J720
1800A369q48j129J500J53j704P56J214j820LJ800j219j006J423m06j347J018Q13
1817E70j465J20J678j054r22J353J44j766J117J312j603p2J788n26j665J625L58
1834I92j545L91J382j420k94J627p49j420J605r0j640M75J593j253p26J571n01
$$ plain form
1851 -2 -874 -25 432 -1102 -486 989 -63 -602 790 266 -1115 412 1008 -476 -76 1174 -76 -639
1869 -639 844 398 -674 142 578 -689 -456 966 -334 -913 472 95 -1318 -58 614 -801 -539
1886 -539 1093 21 -1020 576 498 -928 43 1051 -383 -542 1134 199 -493 705 324 -899 103
1903 103 694 -402 -418 666 -66 -895 104 285 -893 -266 960 -374 -668 646 110 -767 338 447
1921 447 -415 39 1045 -259 -459 1019 255 -880 408 781 -573 -256 515 -251 -608 511 -111 -1045
1939 -1045 137 193 -867 148 453 -447 -615 331 -23 -823 234 453 -520 -57 843 161 -281 567 344
1958 344 -302 214 871 -246 -151 525 -189 -569 356 213 -729 -41 489 -718 -240 662 -237 -456 81 129
1978 129 -402 -149 114 -257 -219 602 187 -229 476 301 -285 381 562 -15 -120 439 65 -427 126 252
$$ packed form
1851bq72Q49M57j534O16J475j052n39J392n24j381J527N96j484M00J250j250n63
1869f39J483m46j072Q16M36j267K33J422j300n79J385l77j413J260O72j415K62
1886e39J632j072j041J596p8j426R71J008j434j59J676r35o92J198l81j223J002
1903A03N91j096j6J084p32q29R99J81j178O27J226j334k94J314n36q77J105J09
1921D47q62M54J006j304k00J478p64j135J288L73j354L17P71p66l57J119o22r34
1939a045J182N6j060J015L05r00j68R46l54q00J057K19r73M63R00o82m42Q48k23
1958C44o46N16O57j117R5O76p14l80R25j43r42O88N30j207M78R02q99k19N37M8
1978A29n31K53K63l71L8Q21m15m16P05j75n86O66J81n77j05N59l74m92N53J26
$$ plain form
1998 252 -507 -411 443 -451 -358 333 -240 -353 -148 48 -579 -199 161 -270 -210 546 155 -248 304 548 -216
2019 -216 75 499 157 -52 -86 159 -44 100 369 -287 77 167 -399 -518 -13 -188 -465 -79 -99 -192 -195 376
2041 376 64 -143 341 -40 -78 416 303 -62 -35 337 42 -285 189 158 -141 136 261 -233 121 29 -153
2062 -153 -230 -98 -164 -97 -166 -243 -143 -82 -10 -55 145 399 128 -47 32 -121 -127 81 111 310 -211 44 180 123
2086 123 48 -5 2 -29 90 -6 -114 -675 -305 -214 -293 -390 -23 189 -16 -225 50 127 -216 5 -77 3 41 176
2110 176 -94 33 148 99 158 299 337 -133 63 -55 -380 -145 -122 -178 -98 -135 -164 -493 156 197 -247 138 39
2133 39 -273 -177 39 -213 -494 -107 37 28 164 396 194 207 608 269 117 258 120 -253 21 -152 -391 -337
2155 -337 24 106 -505 12 241 -254 -454 134 -187 -367 -21 19 -336 -269 88 -197 146 648 302 -46 587
$$ packed form
1998B52p59R6Q54q94R3O91n73j13K05J96o27L80L60m31O0P56l91m03N52K44p64
2019b16K91M24l42k09l4K45k03J44K69o56L64R0n66j19N05j75k77L86k0r3lN71
2041C76l12k07M84l81l8M94j13l65K7L72k95l27M74l1k99K77J25m94L54r2j82
2062a53p7J32o6O7o9p7J00O1P2m5K00K54k71j75P9j53oK08L0J99n21K55J36n7
2086A23p5n3Pl1J19r6j08n61L70R1p9r7L67K12k05k09K75P7l43K21q2Q0L8J35
2110A76k70J27J15m9N9J41L8m70J96j18l25K35K3n6Q0l7k9l29O49M1m44L85r9
2133C9l12R6K16k52k81L87J44rJ36K32k02J3M01l39j52J41j38l73K74j73k39N4
2155c37L61Q2o11N17K29m95k00N88l21j80L46M0l55O7L57k85L43N02l46l48O33
$$ plain form
2176 587 631 -23 153 491 -43 -357 174 -138 -367 184 117 -438 15 393 -409 -235 39 -531 -646 6 -169
2197 -169 -569 -109 358 -254 104 786 360 -251 401 656 -286 87 346 109 -255 103 131 -417 408 433 -527
2218 -527 125 307 -444 -616 -78 -232 -960 -173 -41 -558 -455 618 -291 -209 611 222 -238 239 454 -56
2238 -56 -133 447 90 -126 452 234 -434 431 633 -102 118 605 -189 -487 85 -115 -794 -202 153 -756 -298
2259 -298 452 -267 -684 501 221 -593 178 267 -439 -176 639 5 -468 409 571 -371 54 618 -175 -216
2279 -216 364 26 -355 264 41 -473 -31 406 -555 -389 416 -38 -390 374 306 -538 105 383 -325 -318 643
2300 643 121 -296 371 629 -296 -118 592 -118 -538 477 50 -471 148 111 -650 -348 427 -366 -295 427
2320 427 88 -484 89 317 -546 -129 772 -141 -453 702 175 -669 296 424 -202 6 658 -139 -305 463
$$ packed form
2176E87M4o54J76L38n34l14N31l12k29N51o7n55M53L78q02J74K74n70j15O52j75
2197a69m00M60M67o12L58O82m26o11O52K55r42L73K59k37l64L58K8n48Q25K5r60
2218e27O52J82p51j72N38j54p28P87J32n17J03J073r09Q2Q20l89m60M77K15n10
2238e6p7N80l57k16N78k18o68Q65K02p35K20M87p94k98N72k00o79N92L55r09M58
2259b98P50p19m17J185k80q14P71Q9p06K63Q15o34m73Q77J62r42M25N64p93m1
2279b16N80l38l81O19k23n14M42M37r61J66Q05m54l52P64o8q44O43K78p08PR61
2300F43n22m17O67K58r25J78P10p10m20J015m27n21O19l7p61L02P75p93P1P22
2320D27l39n72N73K28q63M17R01r13l12J155n27q44R65J28o26K08O52p97j66P68
$$ plain form
2340 463 117 -717 142 448 -549 -311 279 -76 -531 237 91 -711 -136 400 -406 -127 436 -114 -415 466
2360 466 382 -601 263 745 -378 -134 1039 -50 -262 416 206 -566 -68 491 -281 -404 361 -334 -695
2379 -695 260 151 -798 -234 379 -137 -477 397 -137 -630 400 303 -597 96 753 -237 94 708 195 -349
2399 -349 297 213 -479 77 734 -393 -487 322 -221 -761 125 27 -541 -83 370 -263 -494 427 132 -624 211
2420 211 218 -478 125 837 -38 -245 625 105 -354 635 340 -501 19 627 148 -432 409 250 -671 -68 420
2441 420 -313 -255 170 -91 -504 308 -66 -611 219 130 -388 -116 491 124 -449 546 603 -350 126 348 -343
2462 -343 60 656 36 -438 131 166 -603 85 415 -535 -425 425 -216 -451 264 34 -550 -160 356 -199
2482 -199 139 577 293 -423 279 483 -280 56 339 -263 -288 548 -132 -546 24 214 -376 -59 504 -439
$$ packed form
2340D63l46q34Q59L06r97K38N90l55m55P68j46q02N75N36q06K79N63n50l01Q81
2360D66q4r83Q64M82j123K44J173j089k12O78k10p72M98N59p72j23P65o95l61
2379f95R55j09r49N64O13n16l40Q74n34m93J030r7r00O93O57r90L31O14n13n44
2399c49O46q4o92N56O57j127r4Q09n43n40Q86r8n68M58M53o33k31R21k95p56Q35
2420B11Po96O03P12q75k07Q70n20m59R89k95q41N20O08m79n80Q41j59r21O03M88
2441D20p33N8M25k61m13Q12l74n45Q30q9n18K72O07l67n73R95N7r53M76K22o91
2462c43M03N96o20m74N69L5p69O88L30r50J10Q50o41k35P15k30n84L90N16n55
2482a99L38M38k84p16P02K04p63L36K83o02k5Q36o80m14N70J90n90L17N63r43
$$ plain form
2502 -439 -366 87 25 -684 133 206 -522 -287 360 -52 -410 282 206 -292 144 478 34 72 143 -110 -150 630
2524 630 126 -407 -78 130 -403 58 148 -319 -291 106 -97 -439 156 128 -156 -284 361 -77 -212 286 165
2545 165 -270 77 157 -13 -169 276 6 -50 342 197 -22 152 263 -202 -124 286 -305 -486 239 -124 -293
2566 -293 -306 7 -320 -375 80 -185 -332 244 263 -225 146 197 41 -30 301 98 31 304 310 87 300 378 -15
2589 -15 -198 187 19 -336 20 -299 -361 -157 210 -192 -201 150 162 -347 11 -2 -97 -110 231 97 -11 68 265
2612 265 -168 192 306 -34 41 101 225 -62 217 118 -190 96 267 -284 -241 25 -132 -518 -42 -298 -352 -287
2634 -287 -161 -288 120 145 -218 -16 -63 -5 79 4 310 33 53 4 -109 74 70 0 -41 57 -148 -235 48 -32 -133
2659 -133 -270 37 -256 -210 -61 -16 -184 -122 -9 -26 46 171 -167 -11 -211 -19 221 66 256 181 153 127 -120
$$ packed form
2502d39P3M53o2p09Q17P3p28K35O47m12l58O92p6m98M36L34m44L8P1k53m0P80
2524F30n04n33L29K08n33M61R0m67K8L97k03l42N95k8k84j28O45m38j35M98j21
2545A65m35L47Q0j70j56M45k70n6L92j45k19J74J11m65P8M10n91j81P25l63j69
2566b93j3L13l27n5M55k65j47N76J9m88L71N1j56p1L31k03o7K73Ok23K13P8l93
2589a5j83L85j68l55L56l19o2K04L67m02rL51J2n09L58j3r5j3L41j34j08P9J97
2612B65m33L60J14l40P5O0J24k87K79r9l08K86J71n51M3K66j57l86M76k56n4O5
2634b87J26j27M08K5l63K02m7N8Q4p5L06k77K0m9j13J83mp0m1R8k05q7K83q0j01
2659a33j37L07k93M6J49M5j68O2J13j7P2J25l38J56k00J92K40j55J90p5k8k6k47
$$ plain form
2682 -120 31 -176 66 40 -119 -214 186 78 -243 -162 -112 -120 -142 -44 -147 -186 -97 199 -144 -155 102 70 -27 196
2706 196 231 130 39 268 -293 -5 95 -81 -81 173 162 -149 -230 -72 -193 -240 80 -84 -98 104 29 -257 -63
2729 -63 99 12 -70 529 167 -99 113 222 216 210 236 204 -101 568 404 5 186 193 -162 -223 78 -161 -34 -42 -264
2754 -264 -228 71 105 -157 -186 113 -156 -64 -33 258 -141 -168 333 -111 45 319 88 -299 215 209 0 88 320
2777 320 6 -235 -3 -18 -456 198 -164 -470 -9 64 -212 -236 72 -125 -164 38 174 -206 154 248 -32 -150
2799 -150 170 123 43 381 352 81 180 324 54 -154 38 7 -419 241 79 -293 -328 163 -194 -335 182 143
2821 143 -323 -13 182 -669 -162 213 174 -209 149 313 -157 33 307 -151 86 470 108 -261 47 134 -230
2842 -230 34 425 -198 58 338 -26 -418 277 68 -271 163 96 -229 -143 280 -171 -297 131 53 -133 102
$$ packed form
2682a20J51k07K42k6j59r5M00j08l21Q1N0qk2R8j03l9Q9K96l43j1K57l2r7K23
2706A96L5j01r1K29n61K88J00j76%K54j1l11q1J58j21m7L20j64j4K02p5k86J94
2729f3J62q7q2N99l62k66K12J09ooK6l2l05O69j64l99J81Pl55o1L01k39J27qk22
2754b64L6K99L4k62k9K99k69R2L1K91l99k7N01m44J56K74k31l87N14ok09Q8K32
2777C20l14k41K32j5m38O54l62l06M61P3k76k4L08j97l9K02J36l80L60R4k80j18
2799a50L20m7q0L38k9k71R9J44k70k08J92l1m26O60j62l72l5M91l57j41N17l9
2821A43m66L10J95q51N07L75l9l83L58J64m70J90K74m58K37L84l62l69L08Q7l64
2842b30K64L91o23K56K80l64l92O95k09l39M34o7l25Q6M23m51j26M28p8j86K35
$$ plain form
2863 102 561 -93 70 479 132 -133 280 51 -342 280 360 -160 -12 190 4 -255 -42 -120 -517 -226 311
2884 311 -348 -355 117 -1 -446 231 506 -295 149 421 141 -163 422 53 -447 114 195 -170 -4 116 4
2905 4 -423 320 161 -442 -91 240 -368 -314 394 -169 -372 197 -8 -448 95 336 -364 163 194 77 -297
2926 -297 191 45 -449 135 519 -291 -40 442 8 -303 -12 150 -394 87 411 -353 -376 213 -222 -253 109
2947 109 204 -157 189 161 -193 -66 253 -11 -48 89 396 -325 293 367 -73 -191 387 -3 -398 64 84 -393
2969 -393 268 2 -306 -338 280 -350 -620 358 -160 -81 -115 143 -126 -382 164 -35 -152 204 55 -116 190
2990 190 235 -232 -435 397 90 -128 141 73 -110 141 48 -156 -136 100 -60 -127 -25 26 -212 -114 121 -177
3012 -177 -338 113 -13 -210 226 148 -168 -1 -20 94 -131 -21 158 -181 283 240 18 -425 196 -95 -339
$$ packed form
2863A02M59o54J63M09l47k65M13k29l93O22Q0n20J48K02j86k59K13p8l97K91N37
2884C11o59pM72j18m45O77K75q01M44K72k80l04N85l69n00N61Q1l65J66J20j12
2905Dm27P43j59o03L51L31o08N4P08n63k03N69k05m40N43K41p00N27L1j17l74
2926b97M88j46m94N84L84q10K51M82m34l11K91J62n44M81L24p64k3N89m35l1L62
2947A09R5l61L46k8l54J27L19k64l7J37L07p21O18P4m40j18N78l90l95M62K0m77
2969c93O61k66l08l2O18o30k70R78n18P9l4K58k69k56N46j99j17L56j49j71L06
2990A90M5m67k03Q32l07k18K69o8j83K51r3k04K0K36j60o7J02N1k38R8K35k98
3012a77j61M51j26j97M36p8l16J67j9J14k25J10J79l39M64m3k22m43O21k91k44
$$ plain form
3033 -339 -85 -182 -318 -120 77 -230 -539 277 -263 -41 150 -35 11 71 372 20 -155 345 -115 -139 90
3054 90 124 -44 -7 196 -109 -90 134 231 -220 162 47 -218 -36 220 -493 -61 148 -105 -295 148 163 -222
3076 -222 92 539 -155 -322 268 130 -51 43 370 -192 124 485 -237 -221 166 166 -179 -100 -11 -111 16 226
3098 226 -94 -347 53 132 -176 59 331 -80 -48 242 323 -250 167 163 -278 -12 29 125 -133 31 70 -65 116
3121 116 34 -257 -37 34 -341 77 122 -247 -183 140 167 -246 -5 4 -114 77 175 -147 -49 86 168 -137 17
3144 17 58 -8 -21 288 88 -106 2 -205 -27 -111 95 -16 -66 41 117 -303 -71 -163 -201 -129 -120 -133 -191 16 45
3169 45 -428 26 193 -63 76 -34 40 11 -81 236 -42 105 99 -184 -100 189 -101 211 197 -145 22 -160 35
3192 35 25 -83 -53 -225 34 -232 168 44 70 -233 61 297 163 -45 99 175 9 0 151 110 38 -120 63
$$ packed form
3033c39K54r7j36J98J97l07l09Q16n40K22J91j85M6O0L01l52j75N00m60k4K29
3054I0L4j68L7K03l05J9K24R7m51L82j15k65J82K56p13M32K09k53j90M43J5l85
3076b22L14M47o94j67N90j38j81R4L27n62L16L61p22J6L87%l45P9Q9j00J27K10
3098B26l20k53M00P9l08K35K72m11L2K90Q1n73M17mm41K66M1R6k58J64L9j35J81
3121A16q2k91K20P1l75M18M5l69O4L23K7m13K41Rj18J91R8l22R8J35Q2l05J54
3144A7M1o6j3L09k00j94J08k07J78q4K06j11n0J07P6m20K32r2l8P2Rj3n8K07K9
3169D5m73M54J67k56J39j10P4k9r2L17k78J47ok83Q4K89k90L12j4l42J67j82J95
3192C5j0j08L0j72K59k66M00j24K6l03K94K36j34k08J44P6j66rJ51m1p2j58J83
$$ plain form
3215 63 -16 -84 215 -11 -86 -83 -180 54 -141 -96 -136 -274 -27 18 -219 2 49 -26 271 54 98 57 269 -20 52
3240 52 27 111 36 30 -151 32 259 113 -89 6 72 -125 31 -82 -290 82 4 164 -216 -83 53 -291 111
3263 111 -105 15 176 42 -16 143 -49 94 -4 -70 -68 68 82 127 35 -114 105 -112 -96 65 -194 -239 56
3286 56 -281 -201 -302 69 -101 -245 114 182 -139 -110 169 -152 10 169 18 -113 148 142 46 260 189 2 -52
3309 -52 34 54 91 60 -134 -81 78 106 -251 43 7 57 -83 -116 -69 -211 52 15 -125 -104 -74 -90 -503 -121 174
3334 174 -165 24 59 60 -23 113 19 59 154 171 -147 -122 106 -59 -305 -76 47 -75 -32 51 -38 -105 134 -203
3358 -203 -284 147 68 -199 208 238 124 -138 188 -117 -1 9 134 -15 -206 191 -89 -293 82 6 4 20 239
3381 239 -132 42 385 -40 -71 15 84 -51 7 27 -126 -42 82 -256 127 90 53 -136 267 265 30 -226 242
$$ packed form
3215F3p9o8K99k26p5Lr7K34j95M5m0j38K47M5k37K21M7p5K97k17M4m1K12k89P2
3240E2k5Q4p5oj81J83K27j46k02R5O6j97J56j13k08L72p8J60l80J33J36l44M02
3263A11k16J20J61j34n8J59j92J43r8o6KJ36J4M5r2j49K19k17J6J61k59m5K95
3286E6l37Q0j01L71j70j44L59O8l21K9K79l21J62J59j51j31K61or6K14p1j87n4
3309e2Q6K0L7l1j94N3J59K8l57K94l6N0j40l3M7j42K63l7j40K1L0j6m13L82K95
3334A74l39J89L5Jq3J36r4M0R5J7l18K5K28j65k46K29J23j22M3Q3q9o7K39l37
3358b03q1M31p9k67M07L0j14k62L26l05J16J0J25j49j91L97k80k04L75p6kJ6K19
3381B39l71J74L43m25l1Q6O9j35N8K0j53Q4J24l38L83l7l7j89M03kk35k56M68
$$ plain form
3404 242 -118 -276 65 -58 -332 -37 403 -227 -84 163 100 -99 -272 -170 -181 -191 108 -257 -222 44 104 -107
3426 -107 117 83 -81 161 159 -73 115 50 95 5 -82 154 -126 104 -12 -37 -179 104 192 -404 254 -140 -213
3449 -213 -105 273 147 -71 235 -44 -310 -61 207 -164 -204 257 117 -218 -69 72 -149 53 109 -332 -110
3470 -110 35 -239 -250 110 -260 -250 47 144 -133 32 149 -81 -350 -18 114 12 85 256 -225 12 349
3491 349 -244 -111 126 118 -362 204 175 97 58 -160 -224 -179 179 54 -37 25 109 -196 -390 103 -389 -270 213
3514 213 107 -232 137 217 16 -5 101 198 -167 97 25 -179 9 198 -312 -127 139 -50 -284 -120 -166 -97
3536 -97 24 -88 -231 -443 42 37 -160 -36 -6 -31 115 124 5 -95 180 82 -80 123 211 38 -65 269 53
3559 53 -243 85 -42 -25 362 145 -239 -324 -11 -193 -166 180 -142 -199 -147 126 23 -38 71 -52 -8 7 92
$$ packed form
3404B42l60j58L41j23k74K95M40o30J43K47o3j99j73J02j1j0K99l65L5K66O0k11
3426a07K24l4j64K42kk32J88o5M5r0q7K36k80K30j16k5j42K83Q8n96O58l94p3
3449b13J08L78j26k18L06k79k66K49K68l71m0M61j40l35J49J41k21K02N6m41K22
3470a10J45k74j1L60l70J0K97R7k77J65J17k30k69L32J32j02P3J71m81K37L37
3491C49n93J33K37qm80N66k9p8l9k18o4M5L58j25r1O2Q4l05j94M93m92J19M83
3514B13j06l39L69Q0k01k1J06R7l65K64p2k04J88J89n10J85K66j89k34J64m6O9
3536i7J21j12j43k12M85nj97J24L0k5J46Rj19j00K75r8j62K03Q8j73j03L34k16
3559E3k96L28j27J7L87k17l84q5L13j82K7L46l22n7N2K73j03o1J09j23M4J5Q5
$$ plain form
3582 92 -246 125 178 -99 -26 -86 36 -125 -124 -17 -286 -233 55 -128 -60 97 -148 -46 -63 -54 115 37 41 -178 17
3607 17 227 82 -20 70 331 -40 -113 170 -25 -119 343 -79 80 223 75 -157 202 -3 -252 -180 12 25
3629 25 -306 407 97 -167 -170 -33 -106 -293 331 206 -143 27 269 7 -139 90 -77 -80 158 -54 -20 167
3651 167 213 -99 -61 112 -168 -136 106 -252 -40 -199 -105 -60 -10 174 -125 3 2 151 -149 115 137 -62 -204
3674 -204 105 -194 -176 281 154 -95 259 105 43 138 197 -36 70 -147 -24 -176 16 -85 15 31 -170 -194
3696 -194 26 255 208 95 -113 13 -224 107 67 235 41 -178 0 -191 176 -231 -70 -209 68 191 -20
3717 -20 8 135 -99 30 130 -202 14 -136 -267 -52 20 -183 -58 -176 80 -93 19 -63 -96 50 235 218
3739 218 20 64 192 68 -48 26 -154 -131 78 -61 -144 184 159 -26 -16 -98 -145 -176 -157 -141 50 -139 -151 -187
$$ packed form
3582I2l38L71N3k77P3o0J22j61JJ07k69N3K88j83O8J57k45J02j7RJ69p8Mk19J95
3607A7K10j45j02R0K61l71p3K83j95r4M62m22J59J43j48k32L59k05k49P2J92J3
3629B5l31P13l10k64lJ37p3j87O24j25l49J70K42k62j46K29j67lK38k12L4J87
3651A67M6l12L8J73k80L2K42l58K12j59R4M5N0J84k99J28jJ49l00K64K2j99j42
3674b04L09k99J8M57j27k49L54j54o2R5N9k33J06k17J23j52J92j01J00J6k01k4
3696a94K20K29m7j13k08J26k37L31m0J68j94k19J78j91L67m07J61j39K77J23k11
3717b0K8J27k34J29J00l32K16j50j31K15P2k03J25j18K56j73J12q2l3J46J85j7
3739B18j98M4J28j24j16P4j80K3K09j39q3L28k5j85J0q2m7l1J9J6J91j89j2l6
$$ plain form
3763 -187 -116 -18 0 -1 66 63 -119 -42 -130 26 -30 135 197 -26 97 99 76 -47 185 9 -39 154 194 -26 -54 -88
3789 -88 166 57 -91 38 -90 55 -11 -18 130 206 41 -12 -166 19 -43 -65 167 64 88 -39 -332 29 197
3812 197 75 -12 21 -151 -18 -192 5 -61 -1 83 -17 96 61 335 65 47 -45 -56 328 171 -66 -157 -64 5
3836 5 -233 -4 73 167 82 -48 -31 -217 -119 -146 -230 2 -92 38 -145 -291 -239 -52 -25 -116 -23 165 9 -26 -102
3861 -102 -170 287 52 -180 75 -222 377 70 127 -101 47 132 39 -160 357 -33 177 126 -162 -57 -249 53
3883 53 51 -152 -97 177 92 -173 81 -184 -81 135 36 67 140 118 -19 176 78 131 -162 -15 54 199 -252 -172
3907 -172 -92 -191 51 -91 79 -144 -4 -102 -17 -229 204 149 147 382 234 16 112 -302 -38 183 256 112 42
3930 42 165 86 -194 211 -49 -88 159 -40 221 36 109 -2 -169 102 -174 -19 -66 209 -171 184 107 -239
$$ packed form
3763a87P1R8J8jO7lj82P7q8J56n6J65O2k23J23Kk3j23K32j76m8J93M0k20k8l4
3789h8K54j09j48J29j28J45o6pJ48P6j65n3j54J85o2k2K32j03K4j27k93L61J68
3812A97j22q7L3j72J33j74J97o6O0Q4j00J13l5K74k70j8r2j1L84j57k37r1R3O9
3836Ek38K29P7R4q5j30J7j86R8k7q4K32r4J30j83j46N2J87K7r1R3J88j56l5p6
3861a02o8M57k35k32K55k97N99l07N7k28J48Q5r3j99N17l90K10n1k88J05j92L02
3883E3kk03N5K74q5k65K54k65J03K16r9L1P3k2j37J95r8N3k93J47O9J45m51Q0
3907a72Q0r9K42j42J70k23J40r8Q5k12M33n5kK35j48k18R6m14K64K21P3j44p0
3930D2J23p9k80M05k60l9K47j99K61j85P3j11j67K71k76J55m7K75l80L55p7l46
$$ plain form
3952 -239 -43 -95 -189 -245 79 133 23 -4 70 137 -47 68 168 48 29 96 -127 -193 305 -33 -61 -116 43 32
3976 32 53 -202 -60 5 55 2 -114 -8 62 -163 42 177 -138 24 183 227 -41 378 239 -258 36 267
3998 267 -104 123 63 -218 102 194 145 -80 20 72 -179 72 -102 -77 -101 -72 52 -58 55 194 -268 -109
4020 -109 177 -45 100 233 102 3 -53 -50 -225 -228 106 8 -156 -9 101 63 -177 247 -171 210 45 22 -20
4043 -20 -180 -49 -19 0 62 -15 -7 104 119 199 208 399 42 -150 281 210 47 -26 -94 -87 191 126 48 131 -164 -132 -18
4070 -18 104 -99 -82 26 -78 -302 -50 55 191 59 -44 -29 -18 -21 154 -83 143 218 49 -108 228 -124
4092 -124 -90 -167 58 -35 -107 3 -289 -10 61 -24 -172 227 83 -101 21 278 57 55 374 -59 342 59 -152
4115 -152 131 102 40 146 2 19 70 -36 59 167 -64 -382 9 0 -232 -25 72 -36 -103 19 -70 25 -18 -40
$$ packed form
3952b39J96n2r4n6L24N4j10k7P4O7j84J15J00j20j9O7k23o6M98l38k8n5J59j1
3976C2K1k55J42O5N0n3j16J06P0k25K05J35l15J62J59M4k68M19j39m97K94K31
3998B67l71K27o0k81L20R2m9k25J00N2k51K51j74K5k4K9J24j10J13J39m62J59
4020a09K86k22J45J33j31r9n6Lj75lL34r8j64J47J10l8k40M24m18L81j65k3m2
4043b0j60J31L0J9O2p7QJ11J5Q0RJ91l57j92M31p1j63p3o8PK78o5p8Q3k95L2J14
4070a8J22k03J7J08j04k24K52J05J36j32j03J5J1lJ75k37K26P5j69j57L36l52
4092a24L4p7K25r3p2J10k92K79P1q5j48L99j44j84J22K57k21kL19m33M01k83k11
4115a52K83k9o2J06j44J7N1j06R5J08k31l18L91rk32K07R7j08o7J22q9R5m3k2
$$ plain form
4139 -40 29 -59 127 -42 245 -84 89 -31 204 -110 -126 76 -140 1 -203 226 -133 -69 88 -62 -225 198
4161 198 59 -136 134 117 -59 27 96 76 134 91 18 93 -25 126 7 -9 20 4 29 154 149 24 -268 106 73
4186 73 -72 166 -25 126 91 88 39 -94 10 -23 -294 16 -33 -37 -178 48 -28 -60 -30 -2 -231 79 193 -85
4210 -85 -92 72 4 116 36 -113 -192 186 30 25 2 151 90 29 -12 -237 -124 9 158 -291 80 99 -133 -216 100
4235 100 -168 74 -54 -175 -150 121 -156 143 43 49 -41 -86 94 26 81 -144 155 30 -99 233 113 -168
4257 -168 118 157 3 -41 -92 -83 -167 102 69 -147 153 11 -57 -228 248 113 -15 8 123 24 64 73 114 20 -146
4282 -146 29 85 -100 224 107 85 145 -202 61 219 -64 -20 74 24 -198 135 18 -51 310 23 65 -146 36
4305 36 59 -76 -100 12 42 76 -190 19 -38 -88 -13 -167 -278 202 -139 -230 -132 -276 168 53 144 -215 -224 -53
$$ packed form
4139d0O9q8J86j69K87l29J73j20K35l14j6K02k16J41k04M29l59O4J57j50j63M23
4161A98j39j95K70j7j76Q6O9k0N8m3p3P5j18J51j19j6K9j6K5J25nj25k92L74l3
4186G3j45K38j91J51l5lm9j33J04l3k71L10m9mj41K26p6l2L0K8k29L10J14k78
4210h5pJ64o8J12q0j49p9L78j56nk3J49o1o1m1k25J13J33J49m49L71J9k32q3L16
4235A00k68K42j28j21K5K71k77K99j00Or0m5J80o8N5k25K99j25j29L32j20k81
4257a68K86L9j54m4n1Rq4K69l3k16L00j42o8j71M76j35j28K3J15r9M0RM1r4j66
4282a46J75N6j85L24j17k2O0l47K63J58k83M4R4n0k22L33j17o9L61k87M2k11J82
4305C6K3j35k4J12L0L4k66K09n7n0P5j54j11M80l41r1R8j44M44j15R1l59rJ71
$$ plain form
4329 -53 55 -202 59 79 -81 16 80 217 -2 79 17 -96 41 100 -15 -19 243 -149 143 -126 -86 -294 -410
4352 -410 212 -262 -18 -133 -82 -8 -280 -134 -153 3 -138 -57 -60 -124 -180 93 -200 132 -132 135 69 -59 -25
4375 -25 -150 87 -118 -215 -140 -65 -90 -252 -217 51 -158 25 -25 -77 -201 -182 -25 217 -445 -7 83 -106 40
4398 40 -56 189 16 8 -86 -23 -1 -7 57 40 -153 75 -71 -93 10 -60 -69 -50 -87 24 77 -89 74 33 -32 4 -94
4425 -94 12 2 186 -190 77 -7 -50 -201 246 99 89 65 239 -97 75 -289 192 -203 138 108 98 -16 -23
4448 -23 -16 116 89 75 -106 -184 231 3 -212 -62 -148 8 -38 -182 56 135 141 -160 273 -174 -54 -88 215 -141
4472 -141 -70 -208 139 -44 -73 -45 -196 -185 195 -128 -225 143 -86 -76 244 78 14 -97 -19 19 157 -46 -28
4495 -28 -11 -72 -52 -135 -28 -46 -110 -102 -6 -10 57 -127 238 91 -32 -125 -54 -293 0 165 162 -302 -81 88 135 -7
$$ packed form
4329e3J08k57K61K0j60R7O4J37k19Q1o2j13J37N9j15mK62l92K92k69M0k08j16
4352d10O22m74K44j15N1P4k72J46j9J56j41Q1lo4n6K73k93L32k64K67o6j28L4
4375b5j25K37k05r7P5P5k5j62L5K68k09J83n0n2j24J9J57K42o62M38R0j89J46
4398D0r6K45j73qr4O3K2oO4j7j93K28j46k2J03p0rJ9l7J11N3j66J63m1o5L6r8
4425i4J06j0J84l76K67q4m3j51M47j47j0k4J74l36J72l64M81l95L41l0j0j14p
4448b3PJ32k7j4j81p8M15k28k15J50q6J56m6j44K38P9Ol01M33m47J20l4L03l56
4472a41P1j38L47j83k9K8j51J1L80l23r7L68k29J0L20j66o4j11P8L8J38k03J8
4495b8J7o1K0q3J07j8o4QR6mO7j84L65j47j23r3P1k39K93J65lm64K21J69M7j42
$$ plain form
4521 -7 109 11 256 -172 -35 -188 -86 66 120 -102 -254 -47 -306 -179 -55 -115 -39 -174 -165 114 148 -131 -51
4544 -51 306 26 -191 -30 40 -87 50 -207 149 -54 208 103 27 233 -2 264 -150 -93 -52 0 116 -211
4566 -211 -30 41 -56 23 311 115 -50 97 -133 -138 -14 355 -225 -106 -151 -71 -66 -230 171 -19 60 210 -175
4589 -175 175 163 128 -21 -56 172 111 -66 31 73 26 -117 11 -116 -117 -32 -188 33 142 125 109 -192 -9 -92
4613 -92 6 166 34 -57 197 -122 -36 123 -104 -135 -337 201 -5 20 79 16 -183 -63 -180 -91 5 234 54
4636 54 -156 -47 162 -247 -41 13 -208 -10 -55 -174 180 28 -199 180 -254 -118 -263 12 190 -67 -159
4657 -159 -56 -94 -157 -24 252 -112 29 57 50 -97 26 17 -136 184 13 117 -78 -157 96 4 -51 27 274 -209
4681 -209 150 -73 88 42 -90 188 -174 124 18 49 153 -27 -115 -103 177 -304 62 170 178 311 105 -107
$$ packed form
4521gJ16r8K45m28J37j53J02J52N4k22j52K07k59J27J24o0P6j35RK79L4k79Q0
4544e1L57k80k17J61P0j27J37k57L56k03K62j05p6K06k35K66m14N7M1N2J16l27
4566b11J81P1r7P9K88j96j65J47k30nJ24L69n80J19m5Q0Nj64M01j90P9J50l85
4589a75L50j2l5j49l5K28o1j77R7M2m7j43J28j27jQ5j56K21J09j7j6l01J83q3
4613i2R8J60j32r1K54l19Q6J59k27l1k02N38k06K5N9o3j99J20j17Q9R6K29j80
4636E4k10J09K09m09K06N4k21J98m5j19L54j52k27L79m34J36j45K75J78k57r2
4657a59J03l8o3J33K76l64J41K8pj47J23rj53L20j71J04j95p9K53r2n5P8K47m83
4681b09L59k23J61m6j32K78l62K98j06L1J04j80q8J2K80m81L66J08QJ33k06k12
$$ plain form
4703 -107 156 -105 -77 43 -36 181 62 -12 229 19 -14 -124 47 -214 -98 268 -325 -11 236 37 -106
4724 -106 27 -72 -131 -153 41 -33 -46 -186 164 20 237 29 -163 217 138 54 -173 27 70 8 -55 186 -214
4747 -214 -146 50 -150 69 267 93 -35 -54 35 198 90 76 142 -309 -79 51 -107 138 102 -18 -71 37
4769 37 -133 -88 -177 -179 35 276 0 7 -308 -90 63 -52 190 38 -159 -46 -58 -193 140 135 -158 -173 48 314
4793 314 -108 114 -71 -116 195 33 85 -47 195 240 -25 -69 78 -145 -103 146 41 -194 123 4 -40 23
4815 23 29 7 -136 -46 -139 -143 -162 4 25 111 -89 -92 216 131 -91 133 141 -82 -123 182 232 -134 -100 223 -35 40 90
4842 90 92 -156 -208 -40 -49 20 27 -39 -34 -43 91 -300 -39 178 -122 -131 178 -159 -215 22 2 -105 75 115 164 129 139
4869 139 176 29 280 -43 -85 -77 51 -153 -58 -29 -2 101 21 209 -89 -211 -263 45 247 -137 5 70 112 -312
$$ packed form
4703a07K63k61K8J20p9K17j19p4K41k10l3j10J71k61J16L66n93L14K47j99j43
4724a06J33r9n9k2J94p4j3j40L50j44K17k08j92L80p9q4k27K00M3o2o3K41m00
4747b14O8J96k00K19J98j74j28j9Q9J63j08j4O6m51K30J30j58K45l6j20n3J08
4769C7j70M5q9kK14K41k76Pl15K18J53j15K42j52j97J13j2j35L33nk93j5K21K66
4793C14m22K22j85m5L11j62N2j32K42M5k65m4J47k23M2K49j05k35L17j19m4O3
4815B3Ok2j43R0r3mj9J66K1Q6k00lL08q5k22K24Qk23m1L05N0l66L4L23k58P5N0
4842I0Kk48n2J68rO9Po6NrJ34l91K61K17l00rL09l37n6K37k0j07J80M0M9l5J0
4869A39L7j47K51l23m2QJ28k04R5K9K7J03q0J88k98j22n2L08K02l84J42O5M2m24
$$ plain form
4893 -312 41 185 75 -65 208 -89 -88 -19 -81 292 -50 36 68 -141 105 27 -19 -74 -125 -188 -189 110 53 43 27
4918 27 -176 -155 126 129 209 5 -22 -4 23 -19 -126 62 -174 24 55 -201 -13 -58 121 -156 53 -114 105 69
4942 69 -76 -230 -27 8 -346 -153 -248 161 -93 -50 -122 -67 26 112 -55 -131 -112 -50 -4 49 11 74 -26 -19 -19 -82 -167
4969 -167 -84 -101 -92 -77 148 -175 154 26 147 -147 167 -40 17 -171 138 27 -60 -221 -184 -331 -28 -129 -80
4992 -80 99 -52 -80 -74 95 -80 -18 99 -67 82 -88 -30 -155 65 105 113 -21 -25 -214 -116 -40 66 -47 143
5016 143 104 -120 -20 -178 -163 -120 213 70 -192 -55 -51 54 352 -192 131 91 274 59 -204 -142 -184 88 1
5039 1 -171 14 -30 104 229 229 -252 -241 -174 28 46 56 29 65 48 141 201 210 -33 -33 249 115 -25 -254 241 52
5065 52 306 88 51 57 152 -250 232 153 88 31 79 74 -10 3 218 -37 -255 -34 197 2 -234 45 224 14
$$ packed form
4893c12L53J44j10j40K73k97JO9o2L73l42Q6L2k09K46p8m6n5n1o3jK99n7j0j6
4918B7k03K1K81LQ0k04k7J8K7m2j07J88k36J98L1k56J88m5J79k77K09j67K19l6
4942F9j45j54K03L5l54J93r5M09k54M3p2N5R3Q6j67p6J9O2M6N3l8O3j00P%o3q5
4969a67Q3j7RJ5K25l23L29j28J21k94L14k07N7j88L09j11q7j61L7j47L03j01M9
4992h0J79j51k8OJ69j75O2J17j66J49j70N8j25K20M0Qj34mj89R8P6J06j13J90
5016A43l9k24J00j58J5M3L33j43k62J37MJ05K98n44L23m0J83k15k63O2m2K72q7
5039Aj72J85m4J34J25%m81J1O7K02J8J0k7L6j7R3O0Rk43%K82j34j40k29M95j89
5065E2K54k18l7OR5m02M82p9o5n7M8nq4J3K15k55k18K21K31j95k36K79J79k10
$$ plain form
5089 14 -36 -80 -27 96 -129 117 153 124 -65 -12 9 -11 -210 121 -16 -96 -182 -132 104 63 -22 21 112 144 -112 178
5115 178 -161 2 113 -66 -27 41 87 -79 39 80 190 -194 128 77 -134 -86 143 -18 32 -84 105 80 224
5138 224 53 -11 26 -35 -77 -130 173 265 -210 -150 -81 127 172 -26 3 222 17 -190 82 24 -82 -149 -118 193
5162 193 1 160 33 94 -124 -47 -39 28 -92 -200 87 -95 -40 91 -115 202 294 -203 16 -53 -159 -206 -175
5185 -175 25 -31 88 28 12 51 11 96 25 117 12 9 122 -12 -217 209 41 -128 52 -66 35 -115 149
5208 149 -11 -210 40 -35 -6 167 -225 -45 -55 83 73 77 35 96 30 -1 -61 19 -209 -93 108 -61 -268 37
5232 37 -122 -50 -95 127 -76 -38 105 103 74 81 85 -77 -60 -20 -77 132 -64 -12 -87 -145 -84 -77 204 102 45 110 294
5259 294 -184 -242 39 -127 145 -86 -198 -17 13 87 95 1 288 -62 -49 254 -224 -57 47 6 39 28 -84
$$ packed form
5089A4n0m4N3J23k25K46L6k9j89N3K1k0j99L31j37q0q6N0K36m1q5M3R1L2k56K90
5115A78l39J63J11j79L9O8M6j66J18M1J10l84L22n1k11M8K29j61N0j16J89k5J44
5138B24j71o4L7o1m2n3L03R2m75O0O9K08M5j98K9K19k05k07K72n8j06o7L1L11
5162A93j92J59j27O1k18P7QO7j20j08K87j82N5J31k06L17R2m97K19o9j06m7L1
5185a75K00n6J19o0j6L9m0Q5p1R2j05lJ13j34k05M26j68j69J80j18J01j50K64
5208A49j60j99K50p5K9J73l92J80j0J38j0Mm2O1o6l1o0Q0k28J16K01j69k07L05
5232C7j59P2m5K22k03L8J43kk9PMj62J7M0n7K09j96N2p5n8O1PK81j02n7O5J84
5259B94m78n8K81j66K72k31j12J81L0P4Qr4K87l50J3L03m78J67J04m1L3j1j12
$$ plain form
5282 -84 43 -288 -10 -78 -78 84 108 24 -22 203 -31 -234 0 93 61 -61 -118 187 -141 211 117 -114 115 71
5306 71 -164 -131 93 149 218 -4 74 -74 -161 -180 119 80 -103 -14 -160 -118 18 42 -185 -10 8 108 -37 15
5330 15 -71 191 16 -103 -60 -154 76 -150 123 -41 170 118 -100 137 -2 122 -114 134 137 -107 -208 42
5352 42 -32 -61 -40 124 -54 -25 -69 15 -196 29 52 -85 -4 -145 -52 -177 219 7 79 -139 96 98 -24 160
5376 160 -145 39 10 -54 -193 160 26 17 7 75 -270 69 -112 -80 -194 -2 -7 24 215 246 -56 66 -62 90
5400 90 87 111 -207 100 81 98 -183 31 118 -234 -236 -118 -83 45 74 113 -43 73 196 -77 205 236 -83 -53 173
5425 173 30 70 -41 -57 49 21 24 121 -134 93 -20 -40 89 160 131 54 -91 -53 -303 -203 28 -37 -21 38 -96
5450 -96 -81 248 -71 32 42 53 -30 116 -29 209 0 66 260 -199 111 -38 101 -35 72 -100 185 169
$$ packed form
5282h4J27l31K78o8%J62K4q4m6K25k34k03K34R3l2j22n7L05l28L52r4k31K29m4
5306G1k35L3K24N6O9k22P8j48q7j9K99l9j83Q9j46M2J36K4k27J75J8J00j45N2
5330A5q6K62j75j19M3r4K30k26K73j64K11n2k18K37j39J24k36K48Lk44j01K50
5352D2p4k9K1J64j78K9m4Q4k11K25K3j37Q1j41R3j25L96k12P2k18K35Kj22J84
5376A60l05J84k9o4j39L53j34rj0O8l45L39j81L2j14J92nL1J91L1l02J22j28J52
5400I0lK4l18L07j9J7k81K14Q7l52kJ18L5J28K9L9j56J16J23k73K82L1l19L0K26
5425A73j43M0j11j6J06k8LR7k55K27j13k0J29P1k9p7j45L8k50J00K31o5J6N9j34
5450i6J5L29l19J03J0J1q3J46j45K38k09O6J94m59L10j49J39j36J07j72K85j6
$$ plain form
5472 169 -91 226 1 30 103 -29 -129 65 -83 -17 -43 -148 -64 -21 122 -6 12 45 -76 150 -90 16 53
5495 53 67 -60 227 -260 -96 -62 -37 -28 34 48 123 -180 134 -176 -236 50 -140 -123 193 38 -82 -88 62 91 -111
5520 -111 -15 144 -180 -87 -106 -3 31 -82 -80 85 -63 -275 21 138 71 -177 66 -103 -76 -66 47 32 -98
5543 -98 67 83 -6 179 -210 -105 -62 -123 -254 -213 -21 -31 -64 -107 17 15 67 151 245 45 4 -102 211 137 401
5568 401 -219 13 -159 -18 -152 -65 12 -214 26 130 62 -179 -4 -9 6 -155 -17 -11 -60 -92 63 -237 -16
5591 -16 352 95 68 110 -162 82 -174 -131 40 -86 101 -289 24 49 -204 225 151 152 69 197 38 79 196
5614 196 43 -74 -16 15 -135 18 143 52 11 -107 32 -98 -41 111 -23 -86 54 76 60 -73 127 29 -280
5637 -280 102 119 19 -30 73 -36 68 -39 227 198 -169 76 47 96 82 -86 53 33 15 -132 -53 -28 -48 -68
$$ packed form
5472A69k60L17k25K9P3j32j00J94j48O6k6j05Q4M3J43j28J8L3j21K26k40J06L7
5495E3J4j27K87m87J64L4K5RO2J4P5l03L14l10o0K86j90J7L16j55j20oJ50K9k02
5520a11R6J59l24R3j9J03L4j13KJ65j48k12K96J17o7k48K43j69K7J0J13j5j30
5543i8J65J6q9J85l89J05M3o1j31M1J92j0l3m3J24kN2Q4R4k00m1j06L13p4K64
5568D01o20K32j72J41j34Q7P7k26K40J04o8k41J75nJ5j61J38Om9l2J55l00K21
5591a6L68k57k7M2k72K44k56M3J71j26J87l90L13K5k53M29p4Jq3J28j59M1J17
5614A96j53j17N8L1j50J53J25r1m1j18J39j30N7J52j34o3J40K2j6j33K00r8l09
5637b80L82J7j00m9J03j09J04j07K66k9l67K45k9M9j4j68J39k0j8j47P9K5k0k0
$$ plain form
5661 -68 -19 -182 -4 17 -81 22 -106 -99 74 -84 12 -142 -178 152 -72 194 294 67 -151 111 -76 -18 51
5684 51 7 105 147 -70 10 -255 37 140 -108 -50 49 23 238 -98 38 194 -55 -183 36 -220 -83 -198 -40
5707 -40 55 -183 -205 -130 120 -52 -40 -2 -13 93 -216 79 158 103 -70 -14 -59 -123 -90 -35 -149 -26 -210 -224 -47
5732 -47 -100 224 -2 25 -79 -21 -16 -48 85 -61 -40 40 166 -16 -7 -15 55 216 131 119 110 236 -72 52 -117 -188
5758 -188 -106 -93 -58 -30 -137 61 -42 -45 138 -51 -153 -71 -113 -44 -13 -216 -70 -59 -33 -207 -55 71 -77 201
5782 201 178 -106 -110 64 237 -192 -1 257 -137 8 60 130 -15 -94 125 129 -44 -78 9 -274 71 -49 -52 297
5806 297 65 269 3 -83 109 -58 37 -61 180 -139 221 150 198 -72 114 -185 -86 172 -110 -27 -140 7
5828 7 -99 -8 -145 -37 64 -161 2 -26 -51 102 183 -64 99 -123 166 -259 -64 202 -154 -51 172 150
$$ packed form
5661f8M9j63J78K1r8J03j28PJ73j58R6j54l6L30k24K66J00k27k18K62j87N8O9
5684E1m4R8M2k17Q0k65K92J03k48N8R9k6K15l36J36J56k49j28K19k56J37j15J58
5707d0R5k38k2P5K50j72J2L8j1J06l09K95P9n5j73N6m5o4L3N5j14J23j84j4J77
5732d7n3L24k26K7j04N8Nl2J33j46K1Q0J26j82RqP0J61q5j2rJ26l08J24j69p1
5758a88Q2J3L5K8j07J98j03lJ83j89j02Q2m2O9L1k03J46J1K6j74J52J26j48K78
5782B01k3k84mJ74J73m29J91K58l94J45N2P0j45p9K19Mj73l4Q7k83L45j20lL49
5806B97k32K04k66q6J92j67R5r8K41l19L60p1M8k70J86k99R9K58k82Q3j13J47
5828Gj06R1j37J08J01k25J63k8k5J53Q1k47J63k22K89m25J95K66l56J03K23k2
$$ plain form
5850 150 -33 -83 -174 71 60 50 72 -112 65 161 -222 67 -31 -82 208 44 -41 96 80 -171 10 -46 -59 104
5874 104 -64 206 56 49 124 -26 -234 188 -67 -113 -64 71 -48 23 122 19 -52 135 -178 11 -79 69 -109
5897 -109 24 146 159 207 231 -34 -54 -154 -18 73 -174 70 157 -146 -161 -29 38 -4 299 110 -171 -54 -7
5920 -7 -149 94 -85 -352 1 -7 14 130 41 29 79 -79 78 153 -27 -48 -77 -109 173 148 -43 -250 -112 -10
5944 -10 -275 -37 250 -33 28 -113 -38 -196 116 16 -261 -87 196 109 100 53 39 31 -110 120 -151 -66 132 -220
$$ packed form
5850A50j83n0r1K45j1j0K2j84J77R6l83K89r8n1K90j64q5J37j6k51J81n6j3J63
5874A04j68K70j50pP5j50k08M22k55m6M9J35j19P1R9j03p1J87l13J89r0J48j78
5897a09J33J22J3M8K4k65k0j00J36R1k47K44Q7l03j5J32O7m2L03j89k81J17M7
5920gj42K43j79k67L53qK1J16q9j2N0j58J57P5j80k1k9l2K82k5j91k07J38J02
5944a0k65K38K87k83O1j41P5j58L12j00k77J74K83q7rm7j4qj41K30k71Q5J98l52
$$ [...]
8191I2
##END NTUPLES=NMR FID
##END=
